##TITLE=1H_SR17
 D2O, 8 sc, 
 7.8.2020
##JCAMPDX= 6.0         $$ Bruker NMR JCAMP-DX V2.0
##DATA TYPE= NMR FID
##DATA CLASS= NTUPLES
##ORIGIN= UXNMR, Bruker Analytische Messtechnik GmbH
##OWNER= root
$$ XWIN-NMR		Version 3.5
$$ Fri Aug  7 10:28:11 2020 Russian Standard Time (UT+4h)  she@DPX200
##.OBSERVE FREQUENCY= 200.1314999998
##.OBSERVE NUCLEUS= ^1H
##.DELAY= (6, 6)
##.ACQUISITION MODE= SIMULTANEOUS
##.ACQUISITION SCHEME= undefined
##.AVERAGES= 9
##.DIGITISER RES= 18
##SPECTROMETER/DATA SYSTEM= spect
##.PULSE SEQUENCE= zg30
##.SOLVENT NAME= D2O
##.SHIFT REFERENCE= (INTERNAL, D2O, 0, 15.7039)
##AUDIT TRAIL= $$ (NUMBER, WHEN, WHO, WHERE, WHAT)
$$ ##TITLE= Audit trail, XWIN-NMR		Version 3.5
$$ ##JCAMPDX= 5.01
$$ ##ORIGIN= Bruker BioSpin GmbH
$$ ##OWNER= she
$$ F:/spectra/data/she/nmr/H-F/1/audita.txt
$$ ##AUDIT TRAIL=  $$ (NUMBER, WHEN, WHO, WHERE, WHAT)
(   1,<2020-08-07 10:26:43.03 +0400>,<she>,<DPX200>,
      <created by zg, POWCHK disabled, PULCHK disabled
       terminated by command 'halt'
       configuration hash MD5:
       00 E9 B6 7A A2 85 ED C7 34 08 36 98 17 FE 4E 26
       data hash MD5: 16K
       EA 55 5D DA BA 4A 58 30 6B 9C 9B 09 B4 BA 3A A9>)
$$ ##END=
$$ 
$$ hash MD5
$$ DF 9E E9 8D E3 EC 6F 40 80 CA 11 58 40 4A 32 60
##$RELAX= 
##$RELAX= 
##$RELAX= 
##$RELAX= 
##$RELAX= 
##$RELAX= 
$$ Bruker specific parameters
$$ --------------------------
##$DU= <F:/spectra>
##$EXPNO= 1
##$NAME= <H-F>
##$PROCNO= 1
##$TYPE= <nmr>
##$USER= <she>
##$AMP= (0..31)
100 100 100 100 100 100 100 100 100 100 100 100 100 100 100 100 100 100 
100 100 100 100 100 100 100 100 100 100 100 100 100 100 
##$AQSEQ= 0
##$AQ_mod= 1
##$AUNM= <au_zg>
##$AUTOPOS= <>
##$BF1= 200.13
##$BF2= 200.13
##$BF3= 200.13
##$BF4= 200.13
##$BF5= 200.13
##$BF6= 200.13
##$BF7= 200.13
##$BF8= 200.13
##$BYTORDA= 1
##$CFDGTYP= 0
##$CFRGTYP= 5
##$CHEMSTR= <none>
##$CNST= (0..31)
1 1 145 1 1 1 1 1 1 1 1 1 1 1 1 1 1 1 1 1 1 1 1 1 1 1 1 1 1 1 1 1 
##$CPDPRG= <>
##$CPDPRG1= <>
##$CPDPRG2= <>
##$CPDPRG3= <>
##$CPDPRG4= <mlev>
##$CPDPRG5= <mlev>
##$CPDPRG6= <mlev>
##$CPDPRG7= <mlev>
##$CPDPRG8= <mlev>
##$CPDPRGB= <>
##$CPDPRGT= <>
##$D= (0..31)
0 1.2 0 0 0 0 0 0 0 0.06 0 0.03 0 0 0 0 0.0002 0 0 0 0 0 0 0 0 0 0 0 0 
0 0 0 
##$DATE= 1596781602
##$DBL= (0..7)
120 120 120 120 120 120 120 120 
##$DBP= (0..7)
150 150 150 150 150 150 150 150 
##$DBP07= 0
##$DBPNAM0= <>
##$DBPNAM1= <>
##$DBPNAM2= <>
##$DBPNAM3= <>
##$DBPNAM4= <>
##$DBPNAM5= <>
##$DBPNAM6= <>
##$DBPNAM7= <>
##$DBPOAL= (0..7)
0.5 0.5 0.5 0.5 0.5 0.5 0.5 0.5 
##$DBPOFFS= (0..7)
0 0 0 0 0 0 0 0 
##$DE= 6
##$DECBNUC= <off>
##$DECIM= 24
##$DECNUC= <off>
##$DECSTAT= 4
##$DIGMOD= 1
##$DIGTYP= 9
##$DL= (0..7)
0 120 120 120 120 120 120 120 
##$DP= (0..7)
150 150 150 150 150 150 150 150 
##$DP07= 0
##$DPNAME0= <>
##$DPNAME1= <>
##$DPNAME2= <>
##$DPNAME3= <>
##$DPNAME4= <>
##$DPNAME5= <>
##$DPNAME6= <>
##$DPNAME7= <>
##$DPOAL= (0..7)
0.5 0.5 0.5 0.5 0.5 0.5 0.5 0.5 
##$DPOFFS= (0..7)
0 0 0 0 0 0 0 0 
##$DQDMODE= 0
##$DR= 18
##$DS= 0
$$ [...]
##$SUBNAM2= <"">
##$SUBNAM3= <"">
##$SUBNAM4= <"">
##$SUBNAM5= <"">
##$SUBNAM6= <"">
##$SUBNAM7= <"">
##$SUBNAM8= <"">
##$SUBNAM9= <"">
##$SW= 24.9337058888022
##$SWIBOX= (0..15)
0 0 2 0 0 0 0 0 0 0 0 0 0 0 0 0 
##$SW_h= 4990.01996007984
##$TD= 16384
##$TD0= 1
##$TE= 0
##$TE2= 300
##$TE3= 300
##$TEG= 300
##$TL= (0..7)
0 120 120 120 120 120 120 120 
##$TP= (0..7)
150 150 150 150 150 150 150 150 
##$TP07= 0
##$TPNAME0= <>
##$TPNAME1= <>
##$TPNAME2= <>
##$TPNAME3= <>
##$TPNAME4= <>
##$TPNAME5= <>
##$TPNAME6= <>
##$TPNAME7= <>
##$TPOAL= (0..7)
0.5 0.5 0.5 0.5 0.5 0.5 0.5 0.5 
##$TPOFFS= (0..7)
0 0 0 0 0 0 0 0 
##$TUNHIN= 0
##$TUNHOUT= 0
##$TUNXOUT= 0
##$USERA1= <user>
##$USERA2= <user>
##$USERA3= <user>
##$USERA4= <user>
##$USERA5= <user>
##$V9= 5
##$VALIST= <valist>
##$VCLIST= <CCCCCCCCCCCCCCC>
##$VD= 0
##$VDLIST= <DDDDDDDDDDDDDDD>
##$VPLIST= <PPPPPPPPPPPPPPP>
##$VTLIST= <TTTTTTTTTTTTTTT>
##$WBST= 1024
##$WBSW= 4
##$XGAIN= (0..3)
0 0 0 0 
##$XL= 0
##$YL= 0
##$YMAX_a= 840275
##$YMIN_a= -863629
##$ZGOPTNS= <>
##$ZL1= 120
##$ZL2= 120
##$ZL3= 120
##$ZL4= 120
##$ABSF1= 10
##$ABSF2= 0
##$ABSG= 5
##$ABSL= 3
##$ALPHA= 0
##$AQORDER= 0
##$ASSFAC= 0
##$ASSFACI= 0
##$ASSFACX= 0
##$ASSWID= 0
##$AUNMP= <proc_1d>
##$AZFE= 0.1
##$AZFW= 0.1
##$BCFW= 1
##$BC_mod= 2
##$BYTORDP= 1
##$COROFFS= 0
##$CY= 11.3945322036743
##$DATMOD= 1
##$DC= 2
##$DFILT= <>
##$DTYPP= 0
##$F1P= 16.9975609425685
##$F2P= -3.02152046262296
##$FCOR= 0.5
##$FTSIZE= 0
##$FT_mod= 4
##$GAMMA= 1
##$GB= 0.15
##$INTBC= 1
##$INTSCL= 1
##$ISEN= 128
##$LB= 0.24
##$LEV0= 0
##$LPBIN= 0
##$MAXI= 10000
##$MC2= 0
##$MEAN= 0
##$ME_mod= 0
##$MI= 1.114404
##$NCOEF= 0
##$NC_proc= 0
##$NLEV= 6
##$NOISF1= 3.799351
##$NOISF2= 2.8
##$NSP= 1
##$NTH_PI= 0
##$NZP= 0
##$OFFSET= 15.70392
##$PC= 1
##$PHC0= -9797.83
##$PHC1= 18.00092
##$PH_mod= 1
##$PKNL= yes
##$PPARMOD= 0
##$PSCAL= 0
##$PSIGN= 0
##$REVERSE= no
##$SF= 200.130013532006
##$SI= 16384
##$SIGF1= 3
##$SIGF2= 2
##$SINO= 400
##$SIOLD= 16384
##$SREGLST= <1H.CDCl3>
##$SSB= 0
##$STSI= 0
##$STSR= 0
##$SW_p= 3612.71676300578
##$SYMM= 0
##$S_DEV= 0
##$TDeff= 0
##$TDoff= 0
##$TI= <>
##$TILT= no
##$TM1= 0
##$TM2= 0
##$TOPLEV= 0
##$USERP1= <user>
##$USERP2= <user>
##$USERP3= <user>
##$USERP4= <user>
##$USERP5= <user>
##$WDW= 1
##$XDIM= 8192
##$YMAX_p= 0
##$YMIN_p= 0
$$ End of Bruker specific parameters
$$ ---------------------------------
##NTUPLES= NMR FID
##VAR_NAME=  TIME,          FID/REAL,        FID/IMAG
##SYMBOL=    X,             R,               I
##VAR_TYPE=  INDEPENDENT,   DEPENDENT,       DEPENDENT
##VAR_FORM=  AFFN,          ASDF,            ASDF
##VAR_DIM=   8192,          8192,            8192
##UNITS=     SECONDS,       ARBITRARY UNITS, ARBITRARY UNITS
##FACTOR=    0.0002004,     1,               1
##FIRST=     0,             0,               0
##LAST=      1.6414764,     0,               0
##MIN=       0,             -863629,         0
##MAX=       1.6414764,     840275,          0
$$ Real data points
##PAGE= N=1
##DATA TABLE= (X++(R..R)), XYDATA
$$ plain form
0 0 0 0 0 0 -1 9 -9 10 -9 18 -19 27 -38 44 -56 68 -80 99 -115 137 -165 187 -224 253 -294 340 -384 444
28 444 -500 566 -645 718 -815 910 -1015 1137 -1263 1408 -1562 1729 -1923 2125 -2352 2604
44 2604 -2878 3195 -3544 3934 -4387 4897 -5500 6204 -7050 8097 -9402 11118 -13462 16885
58 16885 -22424 33252 -99386 479268 529567 426887 590346 18196 -163362 -518495 -863629
69 -863629 -223181 204953 257233 718582 517416 71672 -131809 -618556 -632284 -221383
79 -221383 -115996 373547 749325 424329 163985 -132636 -538514 -529632 -430490 -120303 478734
90 478734 581240 386798 318819 -87540 -532070 -565054 -438471 -67519 364642 445444 524008
101 524008 417036 -174599 -486712 -471455 -475554 -122788 256446 436083 650003 326077
$$ packed form
0@%%%%jJ0j8J9j9K7l7M6o5Q2j00J24j48J79k14K52l02L52m11M77n47O34p24Q28
28D44r44J066j211J363j533J725j925K152k400K671k970L291l652M048m477M956
44B604n482O073o739P478q321R284j0397J1704j3254J5147j7499K0520k4580L0347
58A6885l9309N5676j32638N78654N0299j02680J63459n72150j81558l55133l45134
69h63629O40448M28134N2280M61349k01166m45744k03481m86747j3728M10901
79b21383J05387M89543L75778l24996k60344k96621m05878Q882R9142L10187N99037
90D78734J02506j94442o7979m06359m44530l2984J26583L70952M32161Q0802P8564
101E24008j06972n91635l12113J5257m099L52766L79234J79637K13920l23926
$$ plain form
111 326077 -204733 -271212 -489080 -566922 -112495 183732 485415 612855 186612 21935
121 21935 -182142 -668649 -467779 -99613 79351 501733 484179 266432 210140 -348369
131 -348369 -621684 -309636 -255195 47770 469362 430829 430547 130878 -397766 -379771 -399269
142 -399269 -394160 126188 396012 439353 462867 62442 -230629 -330033 -565204 -334979 136935
153 136935 283914 451326 453973 127980 -128635 -417284 -553077 -242745 16455 195907
163 195907 495291 465611 156298 -111170 -403261 -463660 -269848 -121556 212404 533235
173 533235 390044 171564 -31260 -363240 -437738 -339759 -158797 272293 444240 329284
183 329284 292091 -6895 -364498 -410319 -393852 -127533 243911 309162 422111 369668 -76718
$$ packed form
111C26077n30810o6479k17868p7842M54427K96227L01683J27440m26243j64677
121B1935k04077m86507K00870L68166J78964M22382j7554k17747n6292n58509
131c48369k73315L12048N4441L02965M21592l8533k82k99669n28644J7995j9498
142c99269N109N20348K69824M3341K3514m00425k93071r9404k35171K30225M71914
153A36935J46979J67412K647l25993k56615k88649j35793L10332K59200J79452
163A95907K99384k9680l09313k67468k92091o0399J93812J48292L33960L20831
173E33235j43191k18480k02824l31980p4498R7979J80962M31090J71947j14956
183C29284l7193k98986l57603m5821J6467K66319L71444O5251J12949n2443m46386
$$ plain form
194 -76718 -296954 -382018 -429443 -122044 132643 307270 517693 288524 -43105 -180088
204 -180088 -427341 -424872 -150947 56546 366526 466385 235526 99421 -166615 -466980
214 -466980 -374093 -194236 31388 346426 387861 307158 162684 -213349 -408330 -340659 -253332
225 -253332 8152 295136 380889 366487 139598 -192199 -317881 -370295 -310368 3447 264448
236 264448 372397 377394 146541 -122294 -283599 -423864 -318651 11 205574 357716
246 357716 394066 178249 -63532 -291450 -435850 -283491 -59692 140119 383144 390066
256 390066 194561 -15058 -291093 -398259 -281654 -142867 134784 384349 349685 231607
266 231607 20462 -265554 -357824 -326203 -170416 145302 318116 340471 285479 26868 -226786
$$ packed form
194g6718k20236q5064m7425L07399K54687J74627K10423k29169l31629j36983
204a80088k47253K469K73925K07493L09980R9859k30859j36105k66036l00365
214d66980R2887J79857K25624L15038M1435q0703j44474l76033j94981O7671Q7327
225b53332K61484K86984Q5753j4402k26889l31797j25682n2414N9927L13815K61001
236B64448J07949M997k30853k68835j61305j40265J05213L18662K05563J52142
246C57716L6350k15817k41781k27918j44400J52359K23799J99811K43025O922
256C90066j95505k09619k76035j07166J16605J38787K77651K49565l4664j18078
266B31607k11145k86016r2270L1621J55787L15718J72814K2355n4992k58611k53654
$$ plain form
277 -226786 -339325 -359982 -162878 107237 261695 375664 305007 33393 -183736 -336252
287 -336252 -365796 -178251 50682 258260 392705 292519 72172 -142593 -338822 -363371
297 -363371 -207544 10339 257290 375338 290789 124199 -116468 -335549 -353188 -227786
307 -227786 -19207 233350 351107 306909 156362 -103067 -306352 -339805 -253863 -41414
317 -41414 203346 329240 326947 169880 -83352 -263949 -341501 -280587 -55427 172326 312894
328 312894 339582 184286 -49769 -238967 -351200 -290015 -79367 139726 308309 343437
338 343437 204722 -11975 -229661 -349495 -291489 -115528 110103 303421 340357 225218
348 225218 20587 -211024 -336749 -299292 -145991 84609 283698 334731 243082 46681
$$ packed form
277b26786j12539k0657J97104K70115J54458J13969p0657k71614k17129j52516
287c36252k9544J87545K28933K07578J34445j00186k20347k14765j96229k4549
297c63371J55827K17883K46951J18048q4549j66590k40667k19081j7639J25402
307b27786K08579K52557J17757m4198j50547k59429k03285l3453Q5942K12449
317d1414K44760J25894k293j57067k53232j80597p7552O0914K25160K27753J40568
328C12894K6688j55296k34055j89198j12233O1185K10648K19093J68583L5128
338C43437j38715k16697k17686j19834N8006J75961K25631J93318L6936j15139
348B25218k04631k31611j25725L7457J53301K30600J99089N1033r1649j96401
$$ plain form
358 46681 -182085 -318818 -309576 -165632 61200 253466 328067 261345 66954 -153722 -297692
369 -297692 -317666 -184500 36390 226380 323799 276782 89482 -127050 -284248 -322627 -204556
380 -204556 6309 207921 321216 285841 118317 -100273 -276125 -323667 -224255 -25673
390 -25673 190063 315782 293800 145290 -72472 -260824 -322842 -239728 -51959 163830 304573
401 304573 301082 163915 -44782 -236688 -318955 -251150 -74746 135263 286644 303890 181991
412 181991 -19847 -212042 -307856 -264069 -97949 112724 266604 304092 202998 2669
422 2669 -191142 -298194 -276888 -121124 89147 252150 307071 220448 30110 -170690 -295452
433 -295452 -283955 -144438 60206 241794 308326 233600 59630 -148686 -288862 -288908 -166008
$$ packed form
358D6681k28766j36733R242J43944K26832J92266P4601o6722j94391k20676j43970
369b97692j9974J33166K20890J89990R7419m7017j87300k16532j57198l8379J18071
380b04556K10865K01612J13295l5375j67524k18590j75852m7542R9412J98582
390b5673K15736J25719k1982j48510k17762j88352o2018Q3114J87769K15789J40743
401C04573l491j37167k08697j91906q2267O7805J76404K10009J51381J7246j21899
412A81991k01838j92195r5814M3787J66120K10673J53880L7488j01094k00329
422B669j93811j07052K1306J55764K10271J63003N4921q6623j90338k00800j24762
433b95452J1497J39517K04644J81588O6532p4726j73970k08316j40176m6J22900
$$ plain form
444 -166008 33270 223384 303852 247366 83038 -123118 -270621 -293818 -184402 9840
454 9840 195142 294149 260572 102272 -95394 -247753 -295408 -201527 -15561 169237 282900
465 282900 268979 125459 -68588 -230874 -293220 -217209 -43064 148584 274507 273197 150038
476 150038 -42297 -220065 -290681 -229939 -71758 129073 268627 278003 171375 -17906 -205248
487 -205248 -286369 -243541 -95601 108360 254883 282147 188614 3181 -179591 -278505 -258407
498 -258407 -110142 84394 229809 285095 203797 23414 -151027 -268962 -265254 -123508 53533
509 53533 208517 285795 213406 48457 -126879 -259079 -263200 -148004 21775 200988 279522
520 279522 219274 81001 -107012 -251294 -262898 -175023 33 192325 265743 233178 112363
$$ packed form
444a66008J99278J90114Q0468n6486j64328k06156j47503k3197J09416J94242
454I840J85302R9007l3577j58300j97666j52359m7655R3881J85966J84798J13663
465B82900j3921j43520j94047j62286o2346P6011J74145J91648J25923j310j23159
476A50038j92335j77768p0616O0742J58181K00831J39554R376j06628j89281j87342
487b05248q1121M2828J47940K03961J46523K7264r3533j85433j82772r8914K0098
498b58407J48265J94536J45415N5286q1298j80383j74441j17935L708J41746J77041
509E3533J54984P7278p2389j64949j75336j32200m121J15196J69779J79213P8534
520B79522o0248j38273j88013j44282j1604Q7875J75056J92292P3418l2565j20815
$$ plain form
531 112363 -92061 -239144 -266443 -194769 -15208 165322 254589 258164 125823 -76109 -211359
542 -211359 -270858 -210100 -33680 130532 252236 270298 126164 -42829 -180803 -277827 -217467
553 -217467 -54961 105123 247323 258630 141824 -251 -175201 -276665 -213165 -83924
563 -83924 85421 234780 248461 175791 22160 -180523 -254114 -215377 -121579 71574 224412
574 224412 251632 198955 25944 -159005 -230363 -245360 -143114 67267 203726 255041 209417
585 209417 38466 -118413 -230762 -273183 -133589 48250 165423 262001 221370 58554
595 58554 -91061 -236738 -263286 -130001 -3215 145846 274519 217200 79846 -70624
605 -70624 -225371 -238716 -163112 -45368 163197 259772 199422 118314 -50521 -211890 -234412
$$ packed form
531A12363k04424j47083k7299P1674J79561J80530Q9267L575j32341k01932j35250
542b11359n9499O0758J76420J64212J21704J8062j44134j68993j37974r7024O0360
553b17467J62506J60084J42200J1307j16806j42075j74950j01464O3500J29241
563h3924J69345J49359J3681p2670j53631k02683p3591L8737R3798J93153J52838
574B24412K7220n2677j73011j84949p1358j4997J02246K10381J36459N1315m5624
585B09417j70951j56879j12349m2421J39594J81839J17173R6578m0631j62816
595E8554j49615j45677k6548J33285J26786J49061J28673n7319j37354j50470
605g0624j54747j3345P5604J17744K08565R6575o0350q1108j68835j61369k2522
$$ plain form
616 -234412 -200836 -44880 162944 214868 218364 159460 -50402 -197342 -240023 -212432 -39663
627 -39663 114321 198051 268852 154919 -50976 -157790 -243289 -218830 -61427 71151 220064
638 220064 275903 126197 -5737 -120687 -259669 -223018 -83763 58792 221678 236055
648 236055 144187 57021 -132035 -263175 -201639 -108035 40133 197175 218252 193892 69711
659 69711 -154916 -219528 -191369 -154429 24780 184805 226494 214530 51042 -121735 -173070
670 -173070 -238492 -179140 37519 159979 225194 215828 60368 -61214 -184094 -282483 -144848
681 -144848 22307 106615 234064 225635 87563 -36510 -210315 -251545 -124249 -52333 91387
692 91387 257206 211717 106050 -28025 -193710 -203767 -173022 -98483 132018 232372 179130
$$ packed form
616b34412L3576J55956K07824N1924L496n8904k09862j46940m2681K7591J72769
627c9663J53984Q3730P0801j13933k05895j06814q5499K4459J57403J32578J48913
638B20064N5839j49706j31934j14950j38982L6651J39255J42555J62886J4377
648B36055r1868q7166j89056j31140O1536R3604J48168J57042K1077k4360j24181
659F9711k24627o4612K8159L6940J79209J60025M1689j1964j63488j72777n1335
670a73070o5422N9352K16659J22460O5215r366j55460j21582j22880r8389J37635
681a44848J67155Q4308J27449q429j38072j24073j73805m1230J27296P1916J43720
692I1387J65819m5489j05667j34075j65685j0057L0745P4539K30501J00354n3242
$$ plain form
703 179130 142713 -9829 -166877 -204541 -218004 -72747 130850 165544 202284 184835 -12737
714 -12737 -152463 -215317 -214527 -57028 64384 148951 264037 170673 -21952 -112529 -212024
725 -212024 -213762 -85992 21556 185967 265005 126839 26294 -70867 -230306 -218802 -107450
736 -107450 19725 190526 209416 143746 99127 -91156 -237948 -188073 -126310 3539 158145
747 158145 185427 202194 104244 -124082 -181437 -171770 -172651 -9461 139855 198837 219446 67323
759 67323 -82784 -125274 -226232 -190818 6850 114622 199644 207722 75713 -13746 -146758
770 -146758 -267781 -145878 -9363 65899 204324 211725 110423 2107 -179368 -225315 -127367
781 -127367 -83804 56254 221992 199769 127565 2214 -155682 -175521 -177770 -124495 92418
$$ packed form
703A79130l6417j52542j57048l7664j3463J45257K03597L4694L6740j7449j97572
714a2737j39726o2854P90J57499J21412Q4567J15086r3364j92625r0577r9495
725b12024j738J27770J07548J64411P9038j38166j00545r7161j59439J1504J11352
736a07450J27175J70801J8890o5670m4619j90283j46792M9875O1763J29849J54606
747A58145K7282J6767r7950k28326n7355R667q81J63190J49316N8982K0609j52123
759F7323j50107m2490j00958L5414J97668J07772Q5022Q078j32009q9459j33012
770a46758j21023J21903J36515P5262J38425P401j01302j08316j81475m5947R7948
781a27367M3563J40058J65738k2223p2204j25351j57896j9839k249N3275K16913
$$ plain form
792 92418 195065 169736 155285 22782 -121660 -178037 -217494 -96178 87318 129665 186929
803 186929 190780 23871 -106409 -188026 -209317 -78897 22570 111448 241097 176593 15914
814 15914 -70105 -182675 -203600 -107034 -18727 145870 239255 136864 61134 -35393 -194235
825 -194235 -204227 -131518 -18898 150555 184317 152179 124345 -53454 -194593 -178933 -147322
836 -147322 -28038 116465 160670 202532 124204 -74594 -143256 -167790 -178186 -41342 91492
847 91492 172341 212754 92882 -34283 -98020 -206082 -187839 -36138 69011 172035 198749
858 198749 102127 21575 -110090 -231000 -158480 -53401 33484 169754 197907 132594 36622
869 36622 -130832 -198239 -146640 -107115 24348 175347 188450 148977 38209 -111704 -158266
$$ packed form
792I2418J02647k5329j4451j32503j44442n6377l9457J21316J83496M2347N7264
803A86929L851j66909j30280q1617k1291J30420J01467Q8878J29649o4504j60679
814A5914q6019j12570k0925R6566Q8307J64597R3385j02391p5730r6527j58842
825a94235r992P2709J12620J69453L3762l2138k7834j77799j41139J5660L1611
836a47322J19284J44503M4205M1862p8328j98798o8662k4534j0396J36844J32834
847I1492Q0849M0413j19872j27165o3737j08062J8243J51701J05149J03024K6714
858A98749r6622q0552j31665j20910P2520J05079Q6885J36270K8153o5313r5972
869C6622j67454o7407N1599L9525J31463J50999J3103l9473j10768j49913m6562
$$ plain form
880 -158266 -179612 -136957 43069 151532 167519 166828 52877 -80203 -154255 -205632 -119766
891 -119766 31823 102222 176550 186113 59537 -57715 -157540 -199380 -108817 -16610 84310
902 84310 205480 176603 63306 -30914 -151926 -191055 -130017 -48317 100675 199581 156207
913 156207 95241 -9289 -151207 -187312 -150791 -52784 99271 163668 165977 133249 -13469
924 -13469 -142431 -172704 -162804 -60767 73556 144455 190966 135830 -15981 -109315 -165613
935 -165613 -176079 -70859 49345 143997 195473 122135 11822 -79161 -179827 -178395 -75355
946 -75355 28393 140711 186526 127161 46050 -77939 -186560 -165275 -91104 8035 135247
957 135247 180792 146197 60128 -82823 -166443 -162802 -120283 -116 128852 173357 159918
$$ packed form
880a58266k1346M2655J80026J08463J5987o91j13951j33080p4052n1377Q5866
891a19766J51589P0399P4328R563j26576j17252r9825m1840R0563R2207J00920
902H4310J21170k8877j13297r4220j21012l9129O1038Q1700J48992R8906m3374
913A56207o0966j04530j41918l6105L6521R8007J52055O4397K309l2728j46718
924a3469j28962l0273R900J02037J34323P0899M6511n5136j51811r3334n6298
935a65613j0466J05220J20204R4652N1476p3338j10313r0983j00666J432J03040
946g5355J03748J12318M5815n9365q1111j23989j08621K1285P4171R9139J27212
957A35247M5545l4595q6069j42951q3620L641M2519J20167J28968M4505j3439
$$ plain form
968 159918 66348 -67469 -143309 -176768 -137109 -1619 109050 163527 168428 77380 -43536
979 -43536 -134142 -185318 -133217 -17074 81345 163795 172887 86409 -22927 -128911 -180877 -132045
991 -132045 -42841 66379 167609 169303 95225 -4788 -121271 -175197 -141940 -61584 64034
1002 64034 159822 165047 113121 7188 -114136 -169475 -155044 -70671 57227 142872 169700
1013 169700 130353 13406 -102301 -162237 -163402 -80246 39916 130076 174817 136167 25655
1024 25655 -81344 -156420 -166405 -91282 18659 120640 173329 136531 45609 -62711 -153230
1035 -153230 -165856 -101152 423 110645 167540 142243 62246 -51292 -146426 -164447 -112696
1046 -112696 -12326 100136 162606 151809 73897 -41910 -135468 -165895 -126038 -22976 89257
$$ packed form
968A59918r3570j33817p5840l3459L9659J35490J10669N4477M901r1048j20916
979d3536r0606n1176N2101J16143R8419Q2450R092q6478j09336j05984n1966M8832
991a32045Q9204J09220J01230J694p4078j00013j16483n3926L3257Q0356J25618
1002F4034R5788N225n1926j05933j21324n5339J4431Q4373J27898Q5645K6828
1013A69700l9347j16947j15707n9936j165Q3156J20162R0160M4741l8650j10512
1024B5655j06999p5076r985P5123J09941J01981N2689l6798r0922j08320r0519
1035a53230j2626O4704J01575J10222N6895k5297p9997j13538r5134j8021N1751
1046a12696J00370J12462O2470j0797p7912j15807r3558l0427L9857J03062J12233
$$ plain form
1057 89257 157194 159161 85342 -29837 -124489 -166664 -135639 -35926 74938 150226 162360 97200
1069 97200 -12659 -112964 -164281 -140120 -51308 58152 143255 161793 105809 5515 -100418
1080 -100418 -159747 -142888 -65402 42676 135035 160301 114960 19559 -88255 -154307 -148523
1091 -148523 -76648 30623 124633 161475 124544 29919 -76762 -149135 -155008 -87006 19790
1102 19790 115631 161361 133120 41774 -65725 -143615 -157561 -98152 5992 106421 158139
1113 158139 138344 56056 -52817 -136053 -156965 -107838 -9181 94376 153100 142340 68555
1124 68555 -37456 -126280 -155590 -114948 -23387 80497 147590 145023 78455 -23652 -116237
1135 -116237 -155235 -122294 -34945 68400 141347 149723 88665 -12076 -106338 -153837 -130544
$$ packed form
1057H9257O7937J967p3819j15179r4652m2175L1025R9713J10864P5288J2134o5160
1069I7200j09859j00305n1317K4161Q8812J09460Q5103J8538n5984j00294j05933
1080a00418n9329J6859P7486J08078R2359K5266m5341r5401j07814o6052N784
1091a48523P1875J07271R4010L6842l6931r4625j06681p2373n873O8002J06796
1102A9790R5841M5730k8241r1346j07499p7890j3946N9409J04144J00429N1718
1113A58139j9795q2288j08873q3236k0912M9127R8657J03557N8724j0760p3785
1124F8555j06011q8824k9310M0642R1561J03884O7093k567o6568j02107r2585
1135a16237l8998L2941Q7349J03345P2947Q376o1058j00741r4262m7499K3293
$$ plain form
1146 -130544 -45577 57959 134981 153193 98821 -870 -97574 -151518 -136799 -57868 46495
1157 46495 129062 153550 107478 12780 -87555 -147570 -139817 -69738 32552 121427 151435 114235
1169 114235 26834 -75112 -141700 -141528 -80743 18403 110274 148841 121134 39641 -62244 -134076
1181 -134076 -143971 -89811 6499 99068 146492 128849 49226 -51576 -125491 -147539 -99477 -3340
1193 -3340 89009 144507 135311 58708 -39895 -119452 -150402 -106990 -14529 79555 141856 138612
1205 138612 69875 -25738 -114179 -149323 -111936 -30645 67326 138042 138791 81970 -11231 -106000
1217 -106000 -143573 -117901 -46609 56274 130272 138135 92332 483 -93292 -137695 -127397 -56318
1229 -56318 46990 117828 140484 102378 9223 -80651 -135349 -134841 -60601 34536 107211 145884
$$ packed form
1146a30544Q4967J03536P7022J8212n4372r9691r6704n3944J4719P8931J04363
1157D6495Q2567K4488m6072r4698j00335o0015P753P0079J02290Q8875L0008l7200
1169A14235q7401j01946o6588J72O0785R9146R1871L8567k7707q1493j01885p1832
1181a34076r895N4160R6310R2569M7424j7643p9623j00802p3915k2048M8062R6137
1193c340R2349N5498r196p6603r8603p9557l0950M3412R2461R4084O2301l244
1205A38612o8737r5613q8441l5144L7387Q1291R7971P0716P49n6821r3201r4769
1217a06000l7573K5672P1292J02883P3998P863m5803r1849r3775m4403J0298P1079
1229e6318J03308P0838K2656l8106r3155q9874n4698N08P4240R5137P2675L8673
$$ plain form
1241 145884 109360 17392 -70409 -134059 -136751 -68475 19004 104462 148334 110183 30327 -58989
1253 -58989 -132322 -136001 -80964 4867 103044 141519 111623 49484 -48834 -127801 -133898 -92139
1265 -92139 -5116 91466 130543 122662 63616 -43154 -114517 -131864 -102886 -14141 74494 125892
1277 125892 134596 65219 -33268 -96502 -136402 -113068 -21768 61956 125425 137055 67606 -13299
1289 -13299 -88694 -145210 -113077 -30602 49862 124540 133408 79200 4566 -93509 -142511 -107090
1301 -107090 -49023 38121 123225 130896 92130 12233 -90702 -125681 -113175 -69956 35603
1312 35603 115101 126366 101533 17568 -72738 -115134 -131105 -72911 34346 93972 125562 112566
1324 112566 25107 -56212 -116835 -137880 -65967 15976 75817 137456 116969 30571 -44764 -117643
$$ packed form
1241A45884l6524r1968q7801o3650k692O8276Q7479Q5458M3872l8151p9856q9316
1253e8989p3333l679N5037Q5831R8177L8475k9896o2139r8318p8967o097M1759
1265i2139Q7023R6582L9077p881n9046j06770p1363j7347K8978Q8745Q8635N1398
1277A25892Q704o9377r8487o3234l9900K3334R1300Q3724O3469J1630o9449q0905
1289a3299p5395n6516L2133Q2475Q0464P4678Q868n4208p4634r8075m9002L5421
1301a07090N8067Q7144Q5104P671l8766p9897j02935l4979J2506M3219J05559
1312C5603P9498J1265k4833q3965r0306m2396j5971N8194J07257N9626L1590j2996
1324A12566q7459q1319o0623k1045P1913Q1943N9841O1639k0487q6398p5335p2879
$$ plain form
1336 -117643 -130796 -72769 -9740 80289 144521 106448 43014 -30849 -115726 -126567 -89698 -20391
1348 -20391 88926 127810 102480 68952 -24781 -113731 -123270 -99937 -21147 74832 107502 121650
1360 121650 83109 -29640 -96727 -117204 -108765 -28312 51740 105420 138609 73070 -21529 -68869
1372 -68869 -122961 -119297 -34311 38816 109756 132852 67855 9071 -61161 -138947 -112994 -40568
1384 -40568 26022 106835 122364 84537 31025 -76707 -133202 -97956 -63279 13126 105900 120745
1396 120745 101191 30120 -76028 -105206 -106911 -88918 17083 98628 114261 107442 30938 -50673
1408 -50673 -92399 -133462 -86299 21895 70488 110893 117291 40147 -31296 -99427 -136800 -69358
1420 -69358 -2486 47311 126269 119589 44255 -21070 -100675 -121243 -76324 -35903 57038 134763
$$ packed form
1336a17643j3153N8027O3029R0029O4232l8073o3434p3863q4877j0841L6869O9307
1348b0391J09317L8884k5330l3528r3733q8950r539K3333P8790R5979L2670J4148
1360A21650l8541j12749o7087k0477Q439Q0453Q0052N3680L3189o5539r4599m7340
1372f8869n4092L664Q4986P3127P0940K3096o4997n8784p0232p7786K5953P2426
1384d0568O6590Q0813J5529l7827n3512j07732n6495L5246L4677P6405R2774J4845
1396A20745j9554p1071j06148k9178j705J7993J06001Q1545J5633o819p6504q1611
1408e0673m1726m1063M7163J08194M8593M0405O398p7144p1443o8131l7373O7442
1420f9358O6872M9797P8958o680p5334o5325p9605k0568M4919M0421R2941P7725
$$ plain form
1432 134763 101937 55868 -7118 -96367 -115115 -97544 -42098 71813 111987 95476 84577
1443 84577 -2095 -94537 -112962 -106983 -36092 54860 85656 119578 97932 -12954 -76522 -105045
1455 -105045 -112471 -41954 27611 86908 137942 80237 -4546 -44829 -110079 -121150 -49430 15652
1467 15652 93992 125379 71535 30923 -38436 -126856 -110798 -53728 4904 88899 110344 90388
1479 90388 51806 -57600 -118045 -93159 -74912 -6288 85672 109125 106938 45090 -57173 -87456
1491 -87456 -103389 -98833 -500 78396 104370 110313 42315 -30632 -75175 -129627 -93299 5062
1503 5062 51313 100462 116068 51756 -10827 -83802 -129984 -74433 -19931 28953 112214 116187
1515 116187 57048 -1834 -83750 -110455 -81010 -51616 38476 117564 99199 67806 10064 -76398
$$ packed form
1432A34763l2826m6069o2986q9249j8748J7571N5446J13911M0174j6511j0899
1443H4577q6672r2442j8425N979P0891R0952L0796L3922k1646j10886o3568k8523
1455a05045p426P0517O9565N9297N1034n7705q4783m0283o5250j1071P1720O5082
1467A5652P8340L1387n3844m0612o9359q8420J6058N7070N8632Q3995K1445j9956
1479I0388l8582j09406o0445K4886J8247O8624R1960K3453k187o1848j02263l0283
1491h7456j5933M556R8333P8896K5974N943o7998p2947m4543n4452L6328R8361
1503E062M6251M9149J5606o4312o2583p2975m6182N5551N4502M8884Q3261L973
1515A16187n9139n8882q1916k6705K9445K9394R0092P9088j8365l1393n7742q6462
$$ plain form
1527 -76398 -103493 -101226 -55433 50605 94533 93389 91323 12699 -72861 -102812 -108941 -47080
1539 -47080 34849 71569 114453 99760 4296 -57042 -96139 -110620 -51433 10120 72161 127899
1551 127899 84784 13935 -30175 -98674 -114534 -59981 -1972 77231 114228 77701 44283 -24338
1563 -24338 -107966 -105287 -66673 -11016 71246 99333 92950 61417 -36030 -97883 -92659 -83036 -19487
1576 -19487 64337 97361 106421 56400 -34160 -73449 -100737 -98818 -16506 55499 94492 108630
1588 108630 53529 -12091 -63494 -118097 -93841 -16125 34879 90862 110864 61648 4855 -67175
1600 -67175 -115447 -82012 -36252 18957 95114 107988 68328 13025 -65010 -99859 -86508 -58715
1612 -58715 21876 94092 96456 77523 22644 -57180 -92500 -99896 -62996 25408 76760 94029
$$ packed form
1527g6398k7095K267M5793J06038M3928j144k066p8624q5560k9951o129O1861
1539d7080Q1929L6720M2884j4693r5464o1338l9097j4481N9187O1553O2041N5738
1551A27899m3115p0849m4110o8499j5860N4553N8009P9203L6997l6527l3418o8621
1563b4338q3628K679L8614N5657Q2262K8087o383l1533r7447o1853N224R623O3549
1576a9487Q3824L3024R060n0021r0560l9289k7288J919Q2312P2005L8993J4138
1588A08630n5101o5620n1403n4603K4256P7716N1004N5983K0002m9216n6793p2030
1600f7175m8272L3435M5760N5209P6157J2874l9660n5303p8035l4849J3351K7793
1612e8715Q0591P2216K364j8933n4879p9824l5320p396L6900Q8404N1352J7269
$$ plain form
1624 94029 92102 26166 -49491 -90215 -105477 -58683 12980 61233 105501 96785 24329 -36202
1636 -36202 -86791 -106568 -62081 -4810 58714 110787 88614 33610 -19453 -85661 -105566 -69212
1648 -69212 -16015 58177 100593 86016 53283 -13041 -85365 -98853 -76241 -24477 51083 89528
1660 89528 94068 64929 -14503 -75778 -92365 -86270 -30565 43079 85895 100848 64488 -8842
1672 -8842 -60950 -96680 -93458 -32424 34014 82810 103158 65024 4881 -53057 -102125 -92608
1684 -92608 -36530 20753 79369 102863 70524 16866 -50454 -98265 -88951 -49419 10164 76523
1696 76523 98588 76493 25700 -44757 -88308 -90367 -61840 6095 70842 92801 83128 33224
1708 33224 -37417 -82236 -95540 -66575 2077 60230 91240 89227 37370 -28962 -78451 -98256
$$ packed form
1624I4029j927o5936p5657m0724j5262M6794P1663M8253M4268q716p2456o0531
1636c6202n0589j9777M4487N7271O3524N2073k2173n5004n3063o6208j9905L6354
1648f9212N3197P4192M2416j4577l2733o6324p2324j3488K2612N1764P5560L8445
1660H9528M540k9139p9432o1275j6587O095N5705P3644M2816J4953l6360p3330
1672h842n2108l5730L222O1034O6438M8796K0348l8134o0143n7938m9068R517
1684i2608N6078N7283N8616K3494l2339n3658o7320m7811R314L9532N9583O6359
1696G6523K2065k2095n0793p0457m3551k059K8527O7935O4747K1959r673m9904
1708C3224p0641m4819j3304K8965O8652N8153L1010k013n1857o6332m9489j9805
$$ plain form
1720 -98256 -67782 -6854 50665 94379 91770 41190 -19173 -74731 -98456 -71018 -17261 45127
1732 45127 92958 90690 49238 -9063 -69866 -95951 -76439 -26664 39113 86496 90338 59345
1744 59345 -1146 -63874 -91602 -81765 -35057 31631 78666 92228 66978 5231 -55519 -88336
1756 -88336 -86030 -41848 23045 73862 93506 70335 12259 -47471 -87447 -88839 -46245 14874
1768 14874 69618 94512 72999 19913 -40749 -86338 -89884 -51223 7260 64757 93221 76789
1780 76789 27721 -34133 -82127 -89754 -58112 -640 58310 90214 80439 35720 -26702 -75834
1792 -75834 -89704 -65169 -8365 51571 86389 83572 42651 -19219 -70210 -89507 -69268 -15569
1804 -15569 44531 83195 85810 48004 -11825 -65431 -89752 -72333 -21814 37920 81359 86987
$$ packed form
1720i8256L0474O0928N7519M3714k609n0580o0363n5558k3725K7438N3757O2388
1732D5127M7831k268m1452n8301o0803k6085J9512M9775O5777M7383L842l0993
1744E9345o0491o2728k7728R837M6708O6688M7035J3562k5250o1747o0750l2817
1756h8336K306M4182O4893N0817J9644k3171n8076n9730l9976j392M2594O1119
1768A4874N4744K4894k1513n3086o0662m5589l546L8661N8483N7497K8464j6432
1780G6789m9068o1854m7994p627L1642N7472N8950L1904r775m4719o2422m9132
1792g5834j3870K4535N6804N9936L4818k817m0921o1870n0991j9297K0239N3699
1804a5569O0100L8664K615l7806n9829n3606k4321J7419N0519N9734M3439N628
$$ plain form
1816 86987 52533 -4600 -60536 -89515 -75599 -27895 31593 78113 88043 57688 1974 -54870
1828 -54870 -87001 -78958 -34987 24768 73348 88285 63544 9809 -48214 -83794 -81818 -42652
1840 -42652 16411 67401 86895 68429 18021 -40755 -79767 -83046 -48591 8569 61418 86325
1852 86325 72232 24524 -33783 -76637 -84406 -53178 2137 56463 85767 74406 29892 -27853
1864 -27853 -73961 -85554 -57167 -4496 51759 84282 77419 36293 -21687 -69928 -85442 -62577
1876 -62577 -11234 45475 80518 79992 43401 -14292 -63780 -84120 -68181 -19054 38093 76087
1888 76087 81697 49803 -6363 -57128 -82783 -71673 -26062 29728 72266 83138 53968 2056
1900 2056 -50841 -82098 -73892 -32236 22388 69066 83183 57729 9430 -45914 -81272 -75584
$$ packed form
1816H6987l4454n7133n5936k8979J3916M7704N9488M6520R930l0355n5714n6844
1828e4870l2131Q043M3971N9755M8580J4937k4741n3735n8023l5580J976L9166
1840d2652N9063N0990J9494j8466n0408n8776l9012l279L4455N7160N2849K4907
1852H6325j4093m7708n8307m2854p769L1228N5315N4326K9304j1361m4514n7745
1864b7853m6108j1593K8387N2671N6255L2523o863m1126n7980m8241j5514K2865
1876f2577N1343N6709L5043n26l6591n7693m9488k0340J5939M9127N7147L7994
1888G6087N610l1894n6166n0765k5655J1110M5611N5790M2538J0872k9170n1912
1900B056n2897l1257Q206M1656N4624M6678J4117k5454m8299n5344l5358N688
$$ plain form
1912 -75584 -38255 16426 65826 82523 62986 15337 -41728 -77337 -77739 -45313 10424 60278
1924 60278 81089 68256 21629 -34369 -71574 -80218 -51618 3936 53173 79455 71996 28289
1936 28289 -25307 -67191 -81957 -54915 -4529 44872 78788 74331 34892 -16745 -64406 -81499
1948 -81499 -57666 -14168 39509 77802 74465 40659 -9955 -61125 -78930 -62586 -21089 36895
1960 36895 74507 74801 47657 -5051 -56239 -77558 -68939 -25445 32144 66925 77388 55257
1972 55257 -812 -49750 -75317 -72678 -29861 22327 61249 81488 57876 5725 -40098 -73760
1984 -73760 -74511 -35982 11861 59585 81135 57232 16028 -32332 -74289 -74095 -41376 5292 57282
1997 57282 76800 60258 26151 -30202 -72506 -71967 -47714 130 52495 73653 67887 30652
$$ packed form
1912g5584L7329N4681M9400J6697j9537m7649n7065l5609m02L2426N5737M9854
1924F0278K0811j2833m6627n5998l7205q644K8600N5554M9237K6282p459m3707
1936B8289n3596m1884j4766K7042N0386M9401L3916m457l9439n1637m7661j7093
1948h1499K3833M3498N3677L8293l337l3806n0614n1170j7805J6344M1497N7984
1960C6895L7612K94k7144n2708n1188k1319Q619M3494N7589L4781J0463k2131
1972E5257n6069m8938k5567K639M2817N2188L8922K0239k3612n2151m5823l3662
1984g3760p51L8529M7843M7724K1550k3903m1204m8360m1957J94L2719M6668N1990
1997E7282J9518j6542l4107n6353m2304N39K4253M7844N2365K1158n766l7235
$$ plain form
2009 30652 -29604 -64503 -72334 -55925 -3546 47317 72102 72886 31526 -21680 -55566 -78001
2021 -78001 -60903 -6368 38121 69694 74286 35951 -9016 -53360 -81727 -57960 -14469 26850
2033 26850 69909 74443 42350 17 -53159 -76126 -57033 -28440 22322 70975 71312 47794
2045 47794 5031 -49352 -69335 -64805 -36545 25407 64636 68068 56037 8155 -43637 -67840
2057 -67840 -72550 -34500 22040 52190 72007 63192 8897 -37843 -67069 -73435 -34586 9590
2069 9590 47230 80250 61143 12157 -26082 -65238 -72968 -40921 -2141 49732 78056 55160
2081 55160 25344 -16643 -66823 -71774 -46730 -7080 47855 68129 59633 39384 -18562 -64857
2093 -64857 -66226 -52857 -10829 41347 63310 70472 39759 -22259 -52375 -65256 -61940 -12751
$$ packed form
2009C0652o0256l4899p831J6409N2379N0863K4785P84m1360n3206l3886k2435
2021g8001J7098N4535M4489L1573M592l8335m4967m4344k8367K3767M3491M1319
2033B6850M3059M534l2093m2333n3176k2967J9093K8593N0762M8653L37k3518
2045D7794m2763n4383j9983M530K8260O1952L9229L432j2031m7882n1792k4203
2057f7840m710L8050N6540L0150J9817q815n4295m6740k9226o366L8849M4176
2069I590L7640L3020j9107m8986l8239l9156p730L2047L8780N1873K8324k2896
2081E5160k9816m1987n0180m951K5044L9650N4935K0274q496k0249n7946m6295
2093f4857j369J3369M2028N2176K1963P162l0713o2018l0116j2881L316M9189
$$ plain form
2105 -12751 35709 63559 73944 35409 -12099 -41286 -74588 -64722 -12252 26759 61836 71965
2117 71965 38725 3710 -42894 -79701 -56906 -20505 13780 61551 70737 47229 11188 -45349
2129 -45349 -69614 -54080 -38215 10027 62722 66754 51918 14365 -38746 -58884 -65043 -46289
2141 -46289 16232 54155 60906 59905 17922 -31119 -57986 -73423 -40610 13048 39214 66217
2153 66217 66992 17442 -24966 -58433 -71861 -37996 -2581 34693 76204 61990 19104 -13976
2165 -13976 -56333 -69437 -45502 -13925 40173 72353 53410 33278 -4916 -57661 -67267 -51450
2177 -51450 -16757 38042 58628 58258 47806 -7948 -54840 -60907 -56681 -20666 28520 53021 70610
2190 70610 47246 -11300 -40345 -59136 -64766 -22477 21860 53988 72503 40096 51 -28569
$$ packed form
2105a2751M8460K7850J0385l8535m7508k9187l3302R866N2470L9011L5077J0129
2117G1965l3240l5015m6604l6807K2795L6401L4285M7771R186k3508l6041n6537
2129d5349k4265J5534J5865M8242N2695M032j4836l7553n3111k0138o159J8754
2141d6289O2521L7923O751j001m1983m9041k6867j5437L2813N3658K6166K7003
2153F6217P75m9550m2408l3467j3428L3865L5415L7274M1511j4214m2886l3080
2165a3976m2357j3104K3935L1577N4098L2180j8943k0132l8194n2745r606J5817
2177e1450L4693N4799K0586l70j0452n5754m6892o067M226L6015M9186K4501J7589
2190G0610k3364n8546k9045j8791n630M2289M4337L2128J8515l2407m0045k8620
$$ plain form
2202 -28569 -68133 -66132 -21547 14296 52462 68168 43795 15872 -31092 -72235 -56739 -29133
2214 -29133 2565 51278 65811 50978 21325 -34230 -60702 -53583 -45126 -669 51196 61526
2226 61526 55733 23025 -26838 -49568 -63573 -51891 4540 41595 56136 61821 26343 -17708
2238 -17708 -48436 -70783 -45657 877 27344 59899 66615 26655 -12281 -48816 -67667 -42930
2250 -42930 -13515 23744 67294 61258 28391 -3122 -46290 -64046 -48823 -23182 28287 62865
2262 62865 53683 40110 4544 -46026 -61077 -54675 -25272 25573 49911 57219 51589 3073 -40964
2275 -40964 -55309 -58444 -27772 16152 43665 66747 50589 1907 -28560 -54366 -63710 -30031
2287 -30031 9083 44783 67266 45095 11426 -20133 -59991 -63028 -30455 3327 43780 62797
$$ packed form
2202b8569l9564K001M4585L5843L8166J5706k4373k7923m6964m1143J5496K7606
2214b9133L1698M8713J4533j4833k9653n5555k6472P119Q457M4457N1865J0330
2226F1526n793l2708m9863k2730j4005J1682N6431L7055J4541N685l5478m4051
2238a7708l0728k2347K5126M6534K6467L2555O716l9960l8936l6535j8851K4737
2250d2930K9415L7259M3550o036l2867l1513m3168j7756J5223K5641N1469L4578
2262F2865r182j3573l5566n0570j5051O402K9403N0845K4338P308n630m8516m4037
2275d0964j4345l135L0672M3924K7513K3082j6158m8682l0467k5806r344L3679
2287c0031L9114L5700K2483k2171l3669l1559l9858l037L2573L3782M0453J9017
$$ plain form
2299 62797 47107 22687 -21451 -60961 -56248 -36661 -5059 41067 59756 53161 27841 -22185
2311 -22185 -51620 -54326 -47765 -8367 38500 55771 56751 29683 -14840 -42290 -60593 -51963 -6971
2324 -6971 29750 51624 60459 32443 -7002 -40016 -64453 -48972 -11282 19855 53263 62850
2336 62850 34158 -1323 -39216 -61472 -47851 -21500 16669 56031 58549 36623 5395 -36973
2348 -36973 -58082 -51149 -28241 16783 51638 54727 44380 10889 -33940 -55080 -55464 -31572 12984
2361 12984 42603 56506 50857 12244 -27913 -51110 -58080 -33965 5247 37055 60256 51076
2373 51076 14193 -19364 -49236 -59860 -35817 -1238 35801 59729 49184 21070 -13629 -50262
2385 -50262 -58708 -37994 -5800 33857 56547 50461 27860 -12069 -48866 -55507 -42421 -10841
$$ packed form
2299F2797j5690k4420m4138l9510M713J9587L1602M6126J8689o595k5320n0026
2311b2185k9435k706O561L9398M6867J7271R80k7068m4523k7450j8303Q630M4992
2324f971L6721K1874Q835k8016l9445l3014k4437J5481L7690L1137L3408R587
2336F2850k8692l5481l7893k2256J3621K6351L8169L9362K518k1926l1228m2368
2348c6973k1109O933K2908M5024L4855L089j0347l3491m4829k1140l84K3892M4556
2361A2984K9619J3903n649l8613m0157k3197o970K4115L9212L1808K3201r180
2373E1076l6883l3557k9872j0624K4043L4579L7039K3928j0545k8114l4699l6633
2385e0262q446K0714L2194L9657K2690o086k2601l9929l6797o641J3086L1580
$$ plain form
2397 -10841 30923 53887 53644 31765 -10031 -42835 -54418 -47899 -14521 26100 49858 55895 34790
2410 34790 -4223 -36046 -56303 -50920 -17256 18705 46882 57506 37908 3066 -31842 -56212
2422 -56212 -50752 -22126 12453 45551 57502 40084 7938 -29238 -53921 -50744 -27781 8337
2434 8337 44217 55369 42780 12706 -26763 -51215 -52263 -31727 5883 40654 54083 46159
2446 46159 16560 -22481 -48392 -54068 -35287 1733 35464 53637 49573 19675 -16911 -45326
2458 -45326 -55183 -38174 -4238 30442 53635 50817 23744 -11279 -42838 -55381 -40673 -9033
2470 -9033 26828 51685 51195 28472 -6482 -40489 -54119 -43129 -13220 23560 49369 51877 31954
2483 31954 -3334 -37417 -53072 -45362 -17196 20259 47150 52807 34976 30 -33850 -52074
$$ packed form
2397a0841M1764K2964k43k1879m1796l2804j1583O519L3378M0621K3758O037k1105
2410C4790l9013l1823k0257N383L3664L5961K8177J0624j9598l4842l4908k4370
2422e6212N460K8626L4579L3098J1951j7418l2146l7176k4683L177K2963L6118
2434H337L5880J1152j2589l0074l9469k4452j048K0536L7610L4771J3429p924
2446D6159k9599l9041k5911n676J8781L7020L3731J8173m064k9898l6586k8415
2458d5326r857J7009L3936L4680K3193k818k7073l5023l1559j2543J4708L1640
2470i033L5861K4857m90k2723l4954l4007j3630J0990K9909L6780K5809K508j9923
2483C1954l5288l4083j5655P710K8166L7455K6891N657j7831l4946l3880j8224
$$ plain form
2495 -52074 -47563 -20437 15792 44205 53515 37701 4858 -29491 -50919 -49270 -24551 10793
2507 10793 41170 53502 40631 9721 -24974 -49189 -50477 -28319 5713 37805 52892 43065
2519 43065 14478 -21281 -47250 -50672 -31734 1927 35225 51940 44900 17607 -18246 -45036
2531 -45036 -51163 -34347 -1334 32333 50804 46530 20575 -14142 -42756 -51562 -37022 -5354
2543 -5354 28608 49162 48119 24396 -9956 -39600 -51827 -39610 -9921 24023 47428 49288
2555 49288 28349 -4853 -35871 -51246 -41737 -14044 19854 45122 50190 31706 -585 -32731
2567 -32731 -50291 -44326 -18465 16341 43075 49995 34425 2998 -30154 -48748 -45412 -21227
2579 -21227 12962 40699 50127 36956 5842 -26566 -47345 -46668 -24443 9385 37796 50113
$$ packed form
2495e2074M511K7126L6229K8413R310j5814l2843l4349k1428J649K4719L5344
2507A0793L0377J2332j2871l0910l4695k4215j288K2158L4032L2092J5087r827
2519D3065k8587l5759k5969l422J8938L3661L3298J6715p040k7293l5853k6790
2531d5036o127J6816L3013L3667J8471m274k5955l4717k8614q806J4540L1668
2543e354L3962K0554j043k3723l4352k9644j2227J2217K9689L3944K3405J860
2555D9288k0939l3202l1018j5375R509K7693L3898K5268N068j8484l2291l2146
2567c2731j7560N965K5861L4806K6734O920j5570l1427l3152j8594L336K4185
2579b1227L4189K7737R428j3171l1114l2408k0779O77K2225L3828K8411J2317
$$ plain form
2591 50113 39040 9945 -22444 -45778 -47832 -27728 4243 34588 49690 41348 14974 -18007
2603 -18007 -43666 -48320 -31381 -406 31263 48634 42953 19293 -14224 -41164 -48511 -34386
2615 -34386 -4254 28132 46642 44648 22420 -11700 -38541 -48067 -36649 -6901 25430 45296
2627 45296 46074 24371 -8047 -35386 -48365 -38361 -9703 21753 44207 46714 26800 -3881
2639 -3881 -32681 -48066 -39624 -13879 17253 42241 46842 30084 1551 -30136 -47494 -41104 -19041
2652 -19041 12891 39932 46699 33936 5497 -26767 -44443 -43076 -23280 9733 36945 45951
2664 45951 37087 8542 -23214 -42568 -45622 -25783 7581 33399 46271 39308 10908 -19255
2676 -19255 -41515 -46220 -26551 3040 29768 47245 39691 14194 -14960 -40471 -45587 -28817
$$ packed form
2591E0113j1073k9095l2389k3334k054K0104L1971L0345J5102q342k6374l2981
2603a8007k5659m654J6939L0975L1669J7371n681k3660l3517k6940p347J4125
2615c4386L0132L2386J8510j994k2228l4120k6841r526J1418K9748L2331J9866
2627D5296P78k1703l2418k7339j2979J0004K8658L1456K2454K507j9914l0681
2639c881k8800j5385Q442K5745L1132K4988M601j6758k8533l1687j7358O390K2063
2652a9041L1932K7041O767j2763k8439l2264j7676J367J9796L3013K7212R006
2664D5951q864k8545l1756j9354l054J9839L3364K5818J2872o963k8400l0163
2676a9255k2260m705J9669K9591K6728J7477p554k5497k9154k5511n116J6770
$$ plain form
2688 -28817 -2663 28193 46667 39956 18544 -10622 -38298 -45286 -32723 -6997 26128 43203
2700 43203 41212 24102 -8212 -36063 -44417 -36427 -9549 22350 40371 44329 27498 -6161 -31354
2713 -31354 -43719 -38771 -12066 17933 38895 46230 27110 -2757 -26625 -45043 -40198 -14052
2725 -14052 13499 38330 45388 28224 3860 -24612 -45768 -39436 -17874 8615 36595 44368
2737 44368 32229 9646 -23916 -43324 -39050 -24593 4771 34394 43054 36380 11911 -21040
2749 -21040 -37275 -41585 -30073 3456 30747 41510 39294 14493 -15178 -34801 -45467 -30248
2761 -30248 1851 24404 41610 40993 16425 -10833 -35431 -45838 -27792 -4216 20466 44052
2773 44052 40484 18219 -6962 -34611 -43004 -30362 -11014 21443 43742 38023 22277 -3149
$$ packed form
2688b8817K6154L0856J8474o711k1412k9166k7676o988J2563K5726L3125J7075
2700D3203j991j7110l2314k7851q354P990K6878L1899J8021L958j6831l3659k5193
2713c1354j2365M948K6705K9999K0962P335j9120k9867k3868j8418M845K6146
2725a4052K7551K4831P058j7164k4364k8472k1156O332K1562K6489K7980P773
2737D4368j2139k2583l3562j9408M274J4457K9364K9623Q660o674k4469l2951
2749b1040j6235m310J1512L3529K7291J0763k216k4801k9671j9623j0666J5219
2761c0248L2099K2553J7206o17k4568k7258k4598j0407J8046K3576K4682K3586
2773D4052l568k2265k5181k7649q393J2642J9348L2457K2299n719j5746k5426
$$ plain form
2785 -3149 -32683 -41525 -35146 -13426 21011 37462 38216 29845 -1061 -30321 -40165 -38274 -14443
2798 -14443 16172 32496 43618 32246 -1445 -24644 -38796 -40364 -16539 9718 32351 46136
2810 46136 29117 2604 -18089 -40843 -41173 -18097 6358 33398 43449 28386 10890 -17158
2822 -17158 -43244 -38600 -20734 2302 31552 40463 33482 15303 -19295 -38658 -35537 -27536 -894
2835 -894 29123 39193 37725 15672 -16465 -30807 -39539 -33365 -902 25009 37378 39397 17280
2848 17280 -8935 -28596 -45170 -31445 -2193 17527 37336 40876 19731 -3585 -30037 -43692
2860 -43692 -28052 -9534 12808 40421 39997 22054 -188 -29440 -39156 -31187 -17440 14651 39069
2873 39069 35954 25805 3357 -26228 -37263 -36626 -18868 15050 31632 35689 33191 4974 -23217
$$ packed form
2785c149k9534q842O379K1720L4437J6451P54q371l0906k9260r844J891K3831
2798a4443L0615J6324J1122j1372l3691k3199j4152j568K3825K6257K2633J3785
2810D6136j7019k6513k0693k2754l30K3076K4455K7040J0051j5063j7496k8048
2822a7158k6086M644J7866K3036K9250Q911o981j8179l4598j9363L121Q001K6642
2835h94L0017J0070j468k2053l2137j4342q732O174L2463K5911J2369K019k2117
2848A7280k6215j9661j6574J3725K9252J9720J9809L540k1145k3316k6452j3655
2860d3692J5640J8518K2342K7613m24j7943k2242k9252r716P969J3747L2091K4418
2873C9069l115j0149k2448k9585j1035O37J7758L3918J6582M057k498k8217k8191
$$ plain form
2886 -23217 -35615 -38739 -18592 8518 25532 41729 35115 4725 -17069 -34077 -40061 -21231
2898 -21231 1411 25908 44133 30860 8896 -9744 -35344 -40376 -23087 -1909 26523 39761
2910 39761 29854 17970 -9206 -37331 -37260 -25404 -5009 23881 35677 34822 21507 -11629 -32106
2923 -32106 -33935 -31158 -7830 21257 34367 38516 20788 -8983 -24398 -37075 -35327 -7565 17130
2936 17130 32702 38927 21753 -1190 -22288 -41375 -33186 -8854 9901 32006 39786 24018
2948 24018 3987 -23054 -40041 -30480 -16354 5750 33871 37755 25674 6453 -22017 -34903
2960 -34903 -32429 -22394 7247 32614 34079 28862 9225 -18798 -32617 -36468 -22744 7623 25302
2973 25302 33941 34337 10304 -15817 -30712 -38092 -22053 1675 19887 37860 35206 10730 -9870
$$ packed form
2886b3217j2398l124K0147K7110J7014J6197o614l0390k1794j7008n984J8830
2898b1231K2642K4497J8225j3273k1964j8640k5600n032J7289K1178K8432J3238
2910C9761r907j1884k7176k8125P1J1856K0395K8890J1796q55j3315l3136k0477
2923c2106j829K777K3328K9087J3110M149j7728k9771j5415j2677J748K7762K4695
2936A7130J5572O225j7174k2943k1098j9087Q189K4332J8755K2105P780j5768
2948B4018k0031k7041j6987R561J4126K2104K8121L884j2081j9221k8470j2886
2960c4903K474J0035K9641K5367J465n217j9637k8023j3819l851J3724L0367J7679
2973B5302Q639L96k4033k6121j4895p380J6039K3728J8212J7973k654k4476k0600
$$ plain form
2986 -9870 -29593 -38537 -24594 -4516 19658 39148 32054 14857 -4230 -29928 -37621 -26413 -8161
2999 -8161 19784 34998 31286 21474 -3476 -29945 -34806 -28556 -9860 17282 31457 34242 23852
3012 23852 -4747 -25551 -32478 -31965 -11734 13887 29698 36815 23312 -1533 -19274 -34396 -34484
3025 -34484 -12514 9986 28067 36827 24324 4420 -16608 -36301 -33313 -15263 4001 26963
3037 26963 36943 26615 9191 -16072 -34537 -31415 -20333 547 26838 35085 28473 11774 -14225
3050 -14225 -30312 -32724 -24719 722 24338 32460 30903 13717 -11637 -27793 -35019 -25327 -399
3063 -399 19152 32166 33441 15395 -8283 -26032 -35588 -25455 -4877 15145 33290 33846 16428
3076 16428 -3414 -24163 -35167 -26885 -9542 13405 33036 32337 20057 927 -23128 -34128
$$ packed form
2986i870j9723q944J3943K0078K4174J9490p094j7197j9087k5698p693J1208J8252
2999h161K7945J5214l712r812k4950k6469m861O250J8696K7142J4175K785j0390
3012B3852k8599k0804o927N13K0231K5621J5811P117j3503k4845j7741j5122q8
3025c4484K1970K2500J8081Q760j2503j9904k1028j9693K988J8050J9264K2962
3037B6963R980j0328j7424k5263j8465L122J1082K0880K6291Q247o612j6699k5999
3050a4225j6087k412Q005K5441K3616Q122j557j7186k5354j6156p226R692K4928
3063c99J9551J3014J275j8046k3678j7749r556J0133K0578K0022J8145N56j7418
3076A6428j9842k0749j1004Q282J7343K2947J9631o99j2280j9130k4055j1000
$$ plain form
3088 -34128 -29091 -12919 11731 29480 32579 24424 2587 -21719 -32025 -30470 -14837 9464 26709
3101 26709 33462 26118 2876 -18459 -30631 -32111 -16460 6865 24816 34091 26131 5882 -14309
3114 -14309 -30377 -33048 -17547 3107 22813 33860 27187 9534 -11265 -30030 -32377 -20010
3126 -20010 -1061 21146 32632 28738 13320 -9386 -28147 -31774 -23040 -3926 19346 31158
3138 31158 29953 15753 -7472 -25607 -32262 -25815 -5618 16658 30018 31045 17637 -4582 -23199
3151 -23199 -32415 -26515 -7221 13412 28680 32138 19198 -1816 -21187 -32018 -27349 -10264 10196
3164 10196 27760 32407 21113 1866 -18847 -31439 -28262 -13802 7834 26426 31728 23228 5307
3177 5307 -16839 -30382 -29378 -16437 5059 23973 31473 25778 7504 -14472 -28896 -30693 -18320
$$ packed form
3088c4128N037J6172K4650J7749L099q155k1837k4306j0306J555J5633K4301J7245
3101B6709O753p344k3242k1335j2172j480J5651K3325J7951R275p960k0249k0191
3114a4309j6068k671J5501K0654J9706J1047o673j7653k0799j8765k347J2367
3126b0010J8949K2207J1486l894j5418k2706j8761l627Q734J9114K3272J1812
3138C1158j205j4200k3225j8135o655O447K0197K2276J3360J027j3408k2219j8617
3151b3199r216N900J9294K0633J5268L458j2940k1014j9371j0831M669J7085K0460
3164A0196J7564M647j1294j9247k0713j2592L177J4460K1636J8592N302q500j7921
3177E307k2146j3543J004J2941K1496J8914P500n695j8274k1976j4424j797J2373
$$ plain form
3190 -18320 2746 22009 31239 26954 9423 -11756 -27048 -30740 -19860 473 19612 30656
3202 30656 27361 11137 -9313 -26141 -30832 -21263 -2419 17778 29823 27915 13621 -6596 -24564
3215 -24564 -30724 -22867 -5024 15679 29555 29053 16186 -4229 -22757 -30536 -25059 -7570 13114
3228 13114 27850 30044 18486 -1527 -20678 -29903 -26120 -9947 10776 26305 30304 20381 1077
3241 1077 -18579 -29405 -26984 -11645 8255 24809 30110 21462 2879 -16433 -28477 -27591 -13616
3254 -13616 6181 23635 30134 22568 5481 -14420 -27673 -28150 -15804 3427 21832 29442 24486
3267 24486 8109 -12124 -26572 -28843 -18256 810 19285 29222 25698 10653 -9608 -24912
3279 -24912 -29056 -20463 -1987 17296 28874 27375 12858 -6932 -22943 -29289 -21557 -3925 14980
$$ packed form
3190a8320K1066J9263R230m285j7531k1179j5292l692J0880K0333J9139J1044
3202C0656l295j6224k0450j6828m691R569J8844K0197J2045j908j4294k0217j7968
3215b4564o160P857J7843K0703J3876n02j2867k0415j8528p779N477J7489K0684
3228A3114J4736K194j1558k0013j9151r225L783J6173K0723J5529L999r923j9304
3241A077j9656j0826K421J5339J9900J6554N301q648j8583j9312j2044Q86J3975
3254a3616J9797J7454O499p566j7087j9901j3253m77J2346J9231J8405P610m956
3267B4486j6377k0233j4448k271J0587J9066J8475R937l524j5045k0261j5304
3279b4912m144Q593J8476J9283J1578j499j4517j9790j6011o346P732J7632J8905
$$ plain form
3292 14980 27671 27415 14301 -4707 -21835 -28971 -22211 -6096 13067 26778 27485 15880 -1996
3305 -1996 -20210 -28518 -23653 -8746 10733 25263 27925 18753 705 -17883 -27640 -25412 -11446
3318 -11446 8189 23274 28587 20653 2971 -15576 -27328 -26575 -13462 5669 21461 29125 21949
3331 21949 5198 -13366 -26378 -27115 -14751 3044 20491 28224 22708 7726 -11177 -25139 -26784
3344 -26784 -16650 757 18999 27540 23270 10009 -9660 -23973 -27131 -18824 -1434 16681 26667
3357 26667 25209 12155 -7531 -21776 -27248 -21084 -3541 14701 25554 26245 14081 -4094 -19912
3370 -19912 -27885 -22500 -5998 11734 24871 27257 15872 -1419 -18570 -28141 -22777 -8169 8929
3383 8929 24176 27264 17162 832 -17275 -26600 -22963 -10661 7820 23387 26339 18646 2923
$$ packed form
3292A4980J2691k56j3114j9008j7128p136O760J6115J9163J3711P07j1605j7876
3305a996j8214q308M865J4907J9479J4530K662r172j8048j8588r757K228J3966
3318a1446J9635J5085N313p934j7682j8547j1752P53J3113J9131J5792P664p176
3331B1949j6751j8564j3012p37J2364J7795J7447P733n516j4982j8903j3962j645
3344b6784J0134J7407J8242Q541m270j3261j9669j4313l158Q307J7390J8115R986
3357B6667j458j3054j9686j4245n472O164J7543J8242J0853O91j2164j8175j5818
3370a9912p973N385J6502J7732J3137K386j1385j7291j7151r571N364J4608J7098
3383H929J5247L088j0102j6330j8107r325L637J2302J8481J5567K952p693j5723
$$ plain form
3396 2923 -15710 -25363 -24305 -12791 6504 21392 25856 20815 4460 -13435 -24227 -25786 -14065
3409 -14065 4456 18518 26581 22980 6638 -10833 -23268 -26413 -15553 751 16728 27395
3421 27395 23019 8741 -7848 -22609 -26374 -17188 -1938 16036 26489 22646 11623 -5306 -22116
3434 -22116 -25971 -18701 -3849 14605 24226 23591 14368 -5018 -20457 -24270 -20475 -5637 12716
3447 12716 22806 25379 15505 -3616 -17429 -24540 -22504 -7064 9977 21798 26260 15744 -468
3460 -468 -14617 -25997 -23640 -8415 6804 20823 26513 17263 3589 -14078 -26080 -22351 -10933
3473 -10933 3787 20946 26112 19130 5510 -13282 -23972 -22170 -14571 3086 19795 24113 20273
3486 20273 6956 -11898 -21438 -23983 -16521 3033 17378 23284 22343 8093 -9318 -20530 -25759
$$ packed form
3396B923j8633r653J058J1514J9295J4888M464n041j6355j7895j0792j559J1721
3409a4065J8521J4062Q063l601j6342j7471j2435l145J0860J6304J5977J0667
3421B7395m376j4278j6589j4761l765R186J5250J7974J0453l843j1023j6929j6810
3434b2116l855P270J4852J8454R621o35r223j9386j5439l813L795J4838J8353
3447A2716J0090K573r874j9121j3813p111K036J5440J7041J1821M462j0516j6212
3460d68j4149j1380K357J5225J5219J4019N690r250j3674j7667j2002L729J1418
3473a0933J4720J7159N166o982j3620j8792j0690J802P599J7657J6709M318l840
3486B0273j3317j8854r540k545P462J9554J4345N906r41j4250j7411j1212n229
$$ plain form
3499 -25759 -16148 974 13548 24120 24004 8692 -6635 -19922 -25734 -16475 -3117 12168 26073
3512 26073 23215 10472 -3056 -19317 -25338 -18361 -6268 12507 23971 21654 14107 -1281 -19082
3525 -19082 -24248 -19820 -7007 11689 20997 22707 16886 -2069 -17596 -22251 -21218 -8311 9339
3538 9339 19564 24892 16626 -1633 -13356 -22199 -23231 -8660 6673 19157 25330 16004 2506
3551 2506 -10295 -24047 -23484 -9784 3195 17952 24673 17726 7000 -10664 -24291 -21263 -12930
3564 -12930 259 17683 23872 19607 8496 -10409 -20764 -21013 -16819 -419 16801 22122 21045
3577 21045 9179 -7966 -17959 -23174 -17983 118 13352 20430 22428 10378 -5421 -17230 -24504
3590 -24504 -16860 -2200 9307 21804 23473 10951 -2824 -16186 -23764 -16946 -6613 8081 23392
$$ packed form
3499b5759R611J7122J2574J0572j16j5312j5327j3287n812R259J3358J5285J3905
3512B6073k858j2743j3528j6261o021O977J2093J8775J1464k317p547j5388j7801
3525a9082n166M428J2813J8696R308J710n821j8955j5527m655J033J2907J7650
3538I339J0225N328q266j8259j1723q843j032J4571J5333J2484O173r326j3498
3551B506j2801j3752N63J3700J2979J4757O721o947j0726j7664j3627L028Q333
3564a2930J3189J7424O189m265j1111j8905j0355k49M194J6400J7220N321j077
3577B1045j1866j7145r993n215N191J8101J3234P078J998j2050j5799j1809p274
3590b4504P644J4660J1507J2497J669j2522j3775j3362p578O818J0333J4694J5311
$$ plain form
3603 23392 22298 12613 857 -15970 -22646 -19123 -9847 8903 20954 20574 16176 2921 -14844
3616 -14844 -21583 -20471 -10109 7189 17156 21691 19137 2136 -13271 -20001 -21680 -10654 4546
3629 4546 15373 24052 18440 2441 -9392 -19288 -22731 -11480 2299 15501 23553 17360 5957
3642 5957 -6164 -21481 -22413 -12375 -779 14399 22071 18636 10154 -6216 -20466 -20347 -15259 -3678
3656 -3678 13200 21126 20296 11626 -6015 -17204 -20047 -18364 -4016 12160 19688 21315 11972 -3615
3670 -3615 -14309 -21829 -19030 -3465 9306 18017 22085 12489 -1125 -13970 -22622 -17710 -5123
3683 -5123 5840 18676 22333 12736 1077 -12662 -21784 -17720 -9080 4702 19533 20898 14304
3696 14304 3887 -11774 -20037 -19124 -11732 4540 17199 19031 17469 5279 -10789 -18688 -20439
$$ packed form
3603B3392j094r685j1756j6827o676L523R276J8750J2051l80m398j3255j7765
3616a4844o739J112J0362J7298R967M535k554j7001j5407o730j679J1026J5200
3629D546J0827Q679n612j5999j1833r896l443J1251J3779J3202Q052o193j1403
3642E957j2121j5317r32J0038J1596J5178P672l435q482j6370j4250J19N088J1581
3656c678J6878P926q30q670j7641j1189k843J683J4348J6176P528J627r343j5587
3670c615j0694p520K799J5565J2771Q711M068r596j3614j2845q652M912J2587
3683e123J0963J2836L657r597j1659j3739r122M064Q640J3782J4831J365o594
3696A4304j0417j5661q263R13P392J6272J2659J832j562j2190j6068p899j751
$$ plain form
3709 -20439 -12304 3224 13850 20395 19499 5213 -8883 -17485 -21229 -12719 658 12433 21713
3722 21713 18522 5813 -5416 -16305 -21225 -13622 -1328 11723 20535 17474 8985 -3343 -17335
3735 -17335 -20766 -14048 -4040 10681 19407 18362 11923 -2543 -16111 -19080 -16245 -6050 9194
3748 9194 18574 19799 13272 -1841 -13454 -18850 -18679 -7039 7767 16983 20649 13452 309 -11381
3762 -11381 -19885 -19030 -7146 5299 15388 20679 14078 2634 -9937 -19807 -18023 -8654 2728
3775 2728 15133 20413 14665 4342 -8978 -18507 -17548 -11383 1181 14843 19253 15848 6555 -7749
3789 -7749 -17279 -18994 -13307 905 13306 18132 17686 7659 -6669 -15883 -19840 -13713 -839 10820
3803 10820 18798 18651 8487 -4648 -15231 -19666 -14454 -2919 9185 19082 18502 9225 -2453 -14368
$$ packed form
3709b0439Q135J5528J0626O545q96j4286j4096q602l744Q510J3377J1775R280
3722B1713l191j2709j1229j0889m920P603J2294J3051Q812l061q489j2328j3992
3735a7335l431O718J0008J4721Q726j045o439j4466j3568k969K835J0195J5244
3748I194R380J225o527j5113j1613n396J71J1640J4806R216L666p197j3143j1690
3762a1381q504Q55J1884J2445J0089N291o601j1444j2571r870J784R369J1382
3775B728J2405N280n748j0323j3320r529R59O165J2564J3662M410l405r293j4304
3789g749r530j715N687J4212J2401M826m46j0027j4328r214l957O127J2874J1659
3803A0820P978j47j0164j3135j0583m435N212J1535J2104R897n80r277j1678j1915
$$ plain form
3817 -14368 -19695 -14470 -4512 8541 17887 17654 10852 -976 -13289 -18588 -15180 -6120 7019 16613
3831 16613 18236 12423 500 -12059 -17708 -16561 -7600 5507 15671 18766 13916 1589 -10494
3844 -10494 -17578 -17492 -8947 3882 14297 18990 14734 3483 -8364 -17404 -18175 -9862 1857 12963
3858 12963 19229 14965 4958 -7208 -16638 -18010 -10789 682 12208 18218 15140 6256 -6091
3871 -6091 -15854 -17170 -11802 -993 10974 17188 15980 7755 -4675 -14317 -17529 -13261 -2199 9695
3885 9695 16976 16858 9281 -3407 -13501 -18017 -14173 -3741 8102 16482 17490 10104 -1248 -12233
3899 -12233 -18234 -14912 -5060 6694 15634 17626 11403 102 -11029 -17141 -15394 -6317 4896 15057
3913 15057 17245 12192 1390 -9853 -16533 -15329 -7598 4250 14094 16914 13073 2546 -8485
$$ packed form
3817a4368n327N225R958J3053R346k33o802j1828j2313n299L408R060J3139R594
3831A6613J623n813j1923j2559n649J147Q961J3107J0164L095m850j2327j2083
3844a0494p084Q6Q545J2829J0415M693m256j1251j1847r040p71Q313J1719J1106
3858A2963O266m264j0007j2166r430j372P221J1471J1526O010l078q884j2347
3871f091r763j316N368J0809J1967O214j208q225j2430r642l212M268J1062J1894
3885I695P281j18p577j2688j0094m516L844J0432J1843Q380J008p386j1352j0985
3899a2233o001L322R852J1754Q940J992o223j1301j1131o112J747R077J1213J0161
3913A5057K188n053j0802j1243o680J204P731J1848R844K820l841j0527j1031
$$ plain form
3926 -8485 -16097 -15856 -8345 3166 12781 17424 13937 3773 -7392 -15217 -17030 -9920 1341 11957
3940 11957 17105 14452 5450 -6039 -14712 -16536 -11122 -173 11114 16903 14961 6457 -4932 -14320
3954 -14320 -16957 -11608 -1570 10013 16182 15479 7777 -3438 -13043 -16541 -12492 -2833 8340 15616
3968 15616 15576 8549 -2353 -12198 -16198 -13397 -3893 7324 14833 16057 9783 -1040 -10774 -15798
3982 -15798 -14189 -5362 5854 14238 16476 11302 640 -9959 -16299 -14585 -6714 3959 13400 16502
3996 16502 11722 2185 -8605 -15675 -14930 -8199 2844 12664 16528 12333 3619 -7814 -14716 -15077
4010 -15077 -9086 1781 11558 15935 13106 4413 -6804 -14414 -15292 -9400 559 10301 15837 13921
4024 13921 5550 -5066 -13274 -15531 -10734 -804 8909 15337 14419 6893 -3568 -12865 -16027 -11683
$$ packed form
3926h485p612K41P511J1511R615M643l487j0164j1165p825j813P110J1261J0616
3940A1957N148k653r002j1489q673j824N414J0949J1287N789j942q504j1389r388
3954a4320k637N349J0038J1583O169p03p702j1215r605l498M049R659J1173P276
3968A5616m0p027j0902r845m000K801R504J1217P509J224o274j0823r734n024
3982a5798J609Q827J1216Q384K238n174j0662j0599o340J714P871J0673R441L102
3996A6502m780r537j0790p070P45O731J1043R820L864m195q714j1433o902l61
4010a5077N991J0867R777M377k829q693j1217p610q78N892R959R742N536j916
4024A3921q371j0616q208k257M797R930R713O428r18p526j0461r297l162M344
$$ plain form
4038 -11683 -2026 8234 15172 14834 8212 -2144 -12016 -15739 -12777 -3676 7038 14199 15391 9180
4052 9180 -800 -10997 -14978 -12818 -4741 5950 13458 15252 10247 -114 -9674 -14438 -13629 -5810
4066 -5810 4415 12640 15376 10873 1461 -7919 -14346 -14112 -6732 2855 11569 15535 11649 3159 -6938
4081 -6938 -14314 -14392 -7997 1744 10907 15113 12451 4441 -6449 -13504 -14683 -9089 304 10344 14665
4096 14665 13271 5440 -5246 -12536 -14488 -10168 -345 9421 14163 13874 6184 -4123 -11650 -14824
4110 -14824 -10685 -1147 7575 13905 14378 7006 -2619 -11123 -14968 -10803 -2768 6490 14269 14328 7896
4125 7896 -1256 -10287 -14502 -11619 -4497 5718 13733 13930 9202 93 -9844 -14351 -12764 -5577 5033
4140 5033 11879 13992 10639 555 -8745 -13761 -13236 -6091 3689 10660 14320 10800 1330 -7408 -13056
$$ packed form
4038a1683R657J0260O938l38o622j0356r872l723K962R101J0714P161J192o211
4052I180r980j0197l981K160Q077J0691P508J794n005j0361r560m764Q09P819
4066e810J0225Q225K736m503r412r380o427K34P380R587Q714L966l886q490j0097
4081f938p376p8O395R741R163M206k662q010j0890p055j179N594R393J0040M321
4096A4665j394p831j0686p290j952M320R823R766M742k89p690j0307p527l174
4110a4824M139R538Q722O330M73p372r625q504l845M165Q035R258P779N9o432
4125G896r152r031m215K883P122J0215Q015J97m728r109r937m507J587P187J0610
4140E033O846K113l353j0084r300n016N25P145R780O971L660l520r470q738n648
$$ plain form
4155 -13056 -13440 -6559 2204 10355 14665 11011 2991 -5566 -13157 -13731 -7842 895 9797 14385 11052
4170 11052 4981 -4854 -12796 -13056 -8988 -523 9383 13637 12117 6105 -4706 -11556 -12906 -10466 -1517
4185 -1517 8306 13142 13411 6692 -3413 -10093 -13708 -11257 -1880 6700 12293 13015 7003 -1877 -9295
4200 -9295 -14350 -10790 -2398 5328 12324 13679 7620 -422 -8820 -13796 -10179 -4644 4247 12617 13395
4215 13395 8401 741 -8205 -12991 -11261 -6086 3809 11865 12560 9756 1968 -7742 -12236 -12569 -6945
4230 -6945 3696 9636 12814 11151 2260 -6928 -11816 -12896 -6836 2074 8745 13603 11406 2295 -5232
4245 -5232 -11149 -12884 -7237 490 8682 13736 10372 3880 -3357 -11522 -12932 -7871 -990 8293 12848
4260 12848 10552 6109 -3124 -11405 -12291 -9013 -2014 7366 11959 11684 6855 -3248 -10019 -11709 -10584
$$ packed form
4155a3056l84O881Q763Q151M310l654q020q557p591n74N889Q737Q902M588l333
4170A1052o071r835p942k60M068Q465R906M254j520o012j0811o850j350K440Q949
4185a517R823M836K69o719j0105o680l615K451R377Q580N593P22o012q880p418
4200i295n055L560Q392P726O996J355o059q042q398m976L617N535Q891Q370P78
4215A3395m994p660q946m786J730N175R895Q056O95k804p788r710m494l33N624
4230f945J0641N940L178j663q891r188m888j080O060Q910O671M858k197r111p527
4245e232n917j735N647P727Q192N054l364o492p237q165j410N061O881R283M555
4260A2848k296m443r233q281q86L278O999R380M593k75m829j0103o771j690J125
$$ plain form
4275 -10584 -2707 6504 11389 12799 7223 -1902 -8186 -12876 -11508 -2909 5060 11036 12811 7411 207
4290 207 -7205 -13177 -10779 -3681 3474 10566 13012 7566 1051 -7335 -12328 -10167 -5136 2518 10817
4305 10817 12086 8655 2109 -6846 -11118 -10942 -7388 2597 10198 11303 9909 2968 -5977 -10737 -11994
4320 -11994 -7168 1971 8153 11946 11266 3760 -4914 -10311 -12275 -7395 543 7001 12642 11386 3670
4335 3670 -3382 -10218 -12352 -7710 -1116 7051 12908 10066 4928 -1431 -9956 -12024 -8098 -2176 6625
4350 6625 11448 10285 6795 -1532 -9648 -11198 -9348 -3010 5651 10346 11662 7931 -1510 -8185 -10717
4365 -10717 -10720 -3609 4354 9910 12287 7578 -264 -6731 -11685 -11072 -3924 3423 9686 12072 7640 1226
4381 1226 -6032 -11836 -10111 -4653 1975 9094 12121 8605 2676 -5908 -11021 -9692 -6321 1264 9050
$$ packed form
4275a0584P877R211M885J410n576r125o284m690J368Q599P969N976J775n400p204
4290B07p412n972K398P098P155P092K446n446o515q386m993K161N031P654Q299
4305A0817J269l431o546q955m272J76L554R985P601J105j394o941q945m760j257
4320a1994M826R139O182L793o80p506q674n397j964M880P938O458N641j256p716
4335C670p052o836k134M642O594Q167N857k842n138o359q525k068L926N922Q801
4350F625M823j163l490q327q116j550J850O338Q661M695J316l731r441o675k532
4365a0717lP111P963N556K377m709p842o467m954O13P148P347O263K386m432o414
4381A226p258n804J725N458O628P119L027l516n929q584n113J329L371P585P786
$$ plain form
4396 9050 11352 8953 3046 -5424 -9812 -10306 -7434 980 8311 10235 9679 3656 -4340 -9356 -11310
4411 -11310 -7802 608 6585 10751 11002 3906 -3248 -8976 -11872 -7906 -909 5346 11462 10857 4671
4426 4671 -1779 -8722 -11344 -8143 -2437 5270 11146 10194 6037 -819 -8390 -11282 -8593 -3240 4880
4441 4880 9698 10183 7194 -349 -7664 -10273 -9079 -3632 3970 9134 11142 8064 -104 -6421 -9870
4456 -9870 -9928 -4505 3250 8553 11376 7921 1149 -4928 -10319 -10915 -5000 1792 8290 11058 8150 2485
4472 2485 -4683 -10086 -10241 -5801 591 7919 11264 8894 3397 -4197 -9819 -9838 -6732 12 7314 10171
4488 10171 9199 4288 -3261 -8555 -10147 -7871 -338 6561 9785 9630 4889 -2646 -8078 -10742 -7696
4503 -7696 -1013 5036 9502 10369 5160 -1785 -7865 -10493 -7868 -2528 4174 9814 10401 6120 -475
$$ packed form
4396I050K302k399n907q470m388m94K872Q414P331J924n56o023p996n016j954
4411a1310L508Q410N977M166K51p096p154n728k896L966O997O255O116o05o186
4426D671o450o943k622L201N706P707N876r52m157o856p571k892K689N353Q120
4441D880M818M85k989p543p315k609J194N447P602N164K008l078q168o317l449
4456i870n8N423P755N303K823l455o772o077n391n96N915O792O498K768k908n665
4472B485p168n403j55M440O392P328L345k370n497p594n622j9L106O744P302K857
4488A0171r72m911p549n294j592K276P533O899L224j55m741p535n432k664L046
4503g696O683O049M466Q67n209o945o080k628K625N340O702N640N87m281o595
$$ plain form
4518 -475 -6794 -10297 -8898 -3247 3866 9520 10135 6662 581 -6286 -10256 -8937 -4112 3202 8474
4533 8474 10047 7525 1073 -5996 -9661 -9121 -4640 2324 7829 9839 8040 1780 -4940 -8966 -9506
4548 -9506 -5050 1675 7277 10344 7998 2582 -3887 -8866 -9988 -5742 534 6829 10348 8811 3262
4563 3262 -3393 -8934 -9864 -6503 -635 6384 9777 9213 4122 -2574 -8257 -9416 -6940 -1209 5799
4578 5799 9253 9356 5031 -1904 -7656 -9851 -7475 -1699 4733 9139 9147 5291 -1045 -6649 -9432 -7784
4594 -7784 -2260 4060 8846 9600 5934 -196 -6473 -9617 -8257 -3003 3085 8623 10114 6495 968
4609 968 -5905 -9251 -8643 -4044 2681 8129 9818 6797 1257 -5311 -9152 -8519 -4958 2212 7359 9768
4625 9768 7646 2034 -4360 -8747 -9071 -5495 1139 6682 9535 8206 2880 -3482 -8248 -9207 -5713
$$ packed form
4518d75o319l503J399N651P113N654O15l473o081o867l970J319M825P314N272
4533H474J573k522o452p069l665N40M481O964N505K010j799o260o720m026n40
4548i506M456O725N602L067k346n416o469m979j122M246O276O295L519j537n549
4563C262o655n541r30L361N868P019L393n64n091o696n683j159K476N731P008
4578E799L454J03m325o935n752k195K376N776O432M406Ql856o336n604k783J648
4594g784N524O320M786P54l666o130o277l144J360N254O088N538J491l619n527
4609I68o873l346O08M599O725N448J689l021n540o568l841O33L561P170N147K409
4625I768k122n612o394m387l24L576O634N543K853j329n326o362m766r59L494
$$ plain form
4640 -5713 138 5822 9434 8354 3240 -2691 -7589 -9248 -6419 -654 5709 8888 8855 4064 -2013
4655 -2013 -7332 -9509 -6846 -1323 4624 8962 9051 5243 -1149 -6882 -9016 -7301 -2337 4149 8541
4670 8541 9038 5678 -607 -6187 -9011 -7785 -2639 3324 8163 9052 6017 -22 -5604 -8827 -7883 -3243
4686 -3243 2582 7639 9120 6456 775 -5069 -8898 -7928 -3932 2136 6932 9235 7067 1573 -4369
4701 -4369 -8643 -8243 -4702 1203 7102 9209 7431 2259 -3995 -8048 -8698 -5469 457 6352 8649
4716 8649 7626 2982 -3145 -7543 -9036 -5440 -125 5451 8553 8147 3499 -2490 -7102 -8684 -5944
4731 -5944 -808 4721 8379 8050 3738 -1705 -6960 -8585 -6346 -1682 4624 8327 8495 4590 -1294
4746 -1294 -6543 -8370 -6938 -2296 3926 8015 8630 5402 -504 -5914 -8758 -7346 -2822 2974 7358
$$ packed form
4640e713N851N684L612j080n114n931m898j659K829N765O363L179l3m791o077
4655b013n319k177K663N523N947M338Q9l808o392n733k134J715M964O486M392
4670H541M97l360o285n580k824J226N146N963M839Q89l035o039n582l223R44M640
4686c243N825N057J481k664n681n844l829R70L996O068M796K303k168n494n942
4701d369m274M00L541N905N899K107j778n172o254m053o50L229N926N895K297
4716H649j023m644o127m398j493L596N315N576L102m06m648n989m612j582K740
4731e944N136N529L658l29m312n443n255j625K239M664O306L703J68l905n884
4746a294n249j827J432M642O222M089O15l228n906n410k844J412M524N796M384
$$ plain form
4761 7358 8761 5811 27 -5297 -8177 -7790 -3186 2253 6740 8823 6193 967 -4442 -8091 -7713
4776 -7713 -3630 1400 6562 8556 6610 2017 -4069 -7982 -7848 -4383 1119 6163 8589 6610 2132
4791 2132 -3538 -7825 -7929 -5289 226 5596 8418 7824 3240 -2924 -7070 -8106 -5851 -424 5264
4806 5264 8202 7503 3326 -2095 -6431 -8416 -5943 -785 4495 8087 8020 3963 -1331 -6305 -8663 -6166
4822 -6166 -1480 3768 7665 7776 4248 -144 -5843 -7875 -6520 -2289 3543 7202 8115 5350 -168
4837 -168 -5314 -7852 -7100 -3314 2797 6878 8455 6308 374 -4814 -7798 -7752 -3405 2001 6203 8204
4853 8204 6266 974 -3954 -7416 -7586 -4131 863 5910 8170 6308 1795 -3040 -7256 -7636 -4327
4868 -4327 66 5717 8215 6238 2524 -2611 -6964 -7433 -4776 -248 4922 7358 7000 3454 -2787
$$ packed form
4761G358J403k950n784n324k880L87M604N439M487K083k630n226n409l649L78
4776g713M083N030N162J994j946m593o086l913J34L465N502N044K426j979m478
4791B132n670m287j04K640N515N370K822n94m584o164m146j036K255N427N688
4806E264K938o99m177n421m336j985K473N158N280L592o7m057n294m974k358K497
4822f166M686N248L897J11l528m392n699k032J355M231N832L659R13k765n518
4837a68n146k538P52L786O111M081J577k147n934n188k984M6M347N406M202K001
4853H204j938n292m928l462j70L455M994N047K260j862m513m835m216l80L309
4868d327M393N651K498j977l714n135m353m69K657M528N170K436l58l546o241
$$ plain form
4883 -2787 -6554 -7703 -5431 -779 4450 7184 7125 3644 -1926 -5681 -7894 -6172 -1027 4171 7092
4898 7092 7557 4059 -945 -5450 -8175 -6391 -1513 3263 7378 7786 4443 262 -5248 -8082 -6103
4913 -6103 -2545 2402 6754 7401 5107 360 -5033 -7119 -6172 -3596 2516 6580 7158 5395 858 -4354
4929 -4354 -7010 -6881 -3731 1911 5609 7362 6215 1330 -3430 -6772 -7458 -3844 998 5062 8019
4944 8019 6443 1568 -2753 -6819 -7637 -4286 117 4934 7993 6145 2538 -2151 -6518 -7404 -4820
4959 -4820 -571 4738 7400 6059 3351 -1595 -6425 -7026 -5164 -830 4459 6539 6395 3679 -1650
4974 -1650 -5458 -6783 -5861 -1445 3740 6679 7337 3902 -1399 -4610 -7116 -6344 -1445 3049 6527 7565
4990 7565 4093 258 -4162 -7465 -6296 -2369 2505 6448 7271 4729 800 -4587 -7343 -5908 -2923
$$ packed form
4883b787l767j149K272M652N229K734n9l481n570l755k213J722N145N198K921
4898G092M65l498n004m505k725J784M878M776M115M08l343m181n510k834J979
4913f103L558M947M352O47k294m747n393k086R47K576O112M064N78j763m537n212
4929d354k656J29L150N642L698J753j147m885m760l342o86L614M842M064K957
4944H019j576m875m321m066q18L351M403M817L059j848l607m689m367q86K584
4959d820M249N309K662j341k708m946m830o01J862M334N289K080j44k716n329
4974a650l808j325R22M416N185K939O58l435n301l211k506P72M899M494L478J038
4990G565l472l835m420l303J169L927M874L943Q23k542l929n387k756J435K985
$$ plain form
5005 -2923 1351 6244 7012 5492 1471 -4198 -6296 -6056 -4154 1691 5744 6622 5798 1662 -3381 -6484
5021 -6484 -7066 -3931 1391 4918 7068 6474 1887 -2544 -6070 -7167 -3991 1 4408 7417 6236
5036 6236 2239 -2194 -6182 -7200 -4466 -721 4340 7330 6259 2952 -1642 -5734 -6748 -5109 -1198
5051 -1198 4304 6857 6226 4059 -1155 -5490 -6469 -5485 -1337 3514 5905 6957 4637 -1101 -4878 -6287
5067 -6287 -5577 -1979 2563 5740 6938 4223 -359 -3998 -6671 -6072 -1835 2218 6296 6930 4146 901
5083 901 -3507 -7001 -6062 -2508 1414 5484 7095 4765 1139 -3734 -6572 -5908 -3256 1066 5515 6858
5099 6858 5494 1820 -3278 -6007 -6558 -4285 695 4862 6569 6035 2001 -2219 -5762 -6774 -4094
5114 -4094 492 3888 6121 6274 2292 -1748 -5483 -6864 -3975 -410 3506 6677 6308 2743 -1268
$$ packed form
5005b923M274M893P68j520m021n669k098K40J902N845M053Q78q24m136n043l103
5021f484n82L135N322L527K150n94m587m431l526j097L176L992M407L009j181
5036F236l997m433l988j018K734L745N061K990j071l307m594m092j014J639L911
5051a198N502K553o31k167n214m335r79R84M148M851K391J052k320n738l777j409
5067f287P10L598M542L177J198k715m582l639k673N99M237M053M078O34k784l245
5083I01m408l494R39L554L922M070J611k330l626m873k838O64K652M322M449J343
5099F858j364l674n098k729n51K273M980M167J707n34m034m220l543j012K680
5114d094M586L396K233J53l982m040l735j381K889L565L916L171l69l565m011
$$ plain form
5129 -1268 -5175 -6445 -4654 -1358 3330 6632 6116 3555 -368 -4863 -6662 -5348 -1875 3348 6008
5144 6008 6298 4118 -323 -4318 -6266 -5332 -2087 2519 5669 6693 4896 -175 -3782 -6063 -6187 -2531
5160 -2531 1621 5348 6484 4528 582 -3089 -6233 -6144 -2902 1264 5162 6597 4962 1445 -2773
5175 -2773 -6060 -6132 -3289 707 4958 6146 5172 2274 -2665 -5825 -5937 -4189 80 4626 6394 5442
5191 5442 2749 -2383 -5323 -6266 -4200 76 4171 5826 5952 3013 -1553 -4924 -6629 -4438 -381
5206 -381 3188 6051 5725 2881 -971 -4771 -6098 -4983 -1327 2709 6026 6136 3546 -519 -4592 -6366
5222 -6366 -4727 -1963 2246 5764 5999 4056 184 -4439 -6007 -5427 -2321 2213 5392 6173 4556 408
5238 408 -3849 -5787 -5466 -2425 1698 5328 6498 4615 912 -3189 -5859 -5589 -2781 1040 4632 5901
$$ packed form
5129a268l907j270J791L296M688L302n16k561l923m495j799J314L473N223K660
5144F008K90k180m441l995j948R34L245M606L150J024j797n071l607k281j24L656
5160b531M152L727J136j956l946l671l144Q9L242M166L898J435j635l517m218
5175b773l287p2K843L996M251J188r74k898m939l160j12J748M269M546J768r52
5191E442k693n132k940r43K066M276M095J655J26k939m566l371j705K191M057
5206c81L569K863l26k844l852l800j327J115L656M036L317J10k590m065m073j774
5222f366J639K764M209L518K35j943l872m623j568N80L106M534L179P81j617m148
5238D08m257j938L21L041M123L630J170j883l703m101k670K70K808L821L592J269
$$ plain form
5254 5901 4690 1157 -2705 -5635 -5757 -3465 220 4120 6064 5142 2126 -2076 -5595 -6044 -3822 -170
5270 -170 4064 5970 5543 2387 -1906 -5165 -6028 -4114 -515 3785 5664 6004 2815 -1467 -4841 -5876
5286 -5876 -4806 -511 2897 5541 5886 3246 -804 -4176 -5829 -4921 -1413 2284 5641 5801 3401 -280
5302 -280 -4044 -5676 -5025 -1466 2037 5443 5865 3880 253 -3407 -5788 -5351 -2087 1563 5078 6079
5318 6079 4566 784 -3383 -5701 -5228 -2679 1257 4774 6196 4554 965 -2822 -5381 -5500 -3269
5333 -3269 978 4114 6007 5083 1460 -2333 -5244 -5639 -3339 339 3555 6101 5136 2186 -1879 -4823
5349 -4823 -5732 -3477 -456 3244 5762 5370 2960 -1291 -4872 -5873 -4038 -1139 3497 5357 5461 3096
5365 3096 -944 -4327 -5845 -4417 -1373 2662 5321 5668 3689 -508 -4040 -5597 -4665 -1548 2598
$$ packed form
5254E901j211l533l862k930j22K292L685L900J944r22l016m202l519m49K222L652
5270a70M234J906m27l156m293l259q63J914L599M300J879L40l189m282l374j035
5286e876J070M295L408K644L45k640m050l372j653R08L508L697L357J60k400l681
5302b80l764j632O51L559L503L406M22j985l627l660k381M37L264L650L515J001
5318F079j513l782m167k318M73K549L936L517J422j642l589l787k559j19K231
5333c269M247L136J893r24l623l793k911l95K300L678L216K546r65k950m065k944
5349d823r09K255L021L700K518l92k410m251l581j001J835K899M636J860J04k365
5365C096m040l383j518J428L044M035K659L47j979m197l532j557R32L117M146
$$ plain form
5380 2598 5117 5894 3888 -44 -3526 -5824 -4984 -1781 1917 4669 5982 3938 418 -3196 -5372
5395 -5372 -5119 -2548 1204 4880 5711 4165 973 -3052 -5163 -5242 -2874 470 4158 5877 4728 1625
5411 1625 -2536 -5196 -5453 -3491 291 3797 5648 4858 1818 -2065 -5323 -5755 -3531 40 3515 5782
5427 5782 5119 2121 -1653 -4769 -5688 -4119 -305 3513 5463 5083 2636 -1033 -4010 -5530 -4178 -1157
5443 -1157 2663 5358 5215 2696 -754 -3996 -5498 -4381 -1681 2501 4871 5607 3292 -309 -3577
5458 -3577 -5289 -4741 -2104 2011 4640 5533 3804 -18 -3641 -5091 -4526 -2121 1566 4672 5561 3986
5474 3986 492 -2749 -5398 -5000 -2404 913 4306 5574 4117 1287 -2738 -4881 -4862 -2517 886 4114
5490 4114 5602 4541 1475 -1973 -4598 -5228 -3062 -21 3386 5397 4883 1933 -1705 -4339 -5275 -3461
$$ packed form
5380B598K519P77k006l932l482k298Q40L203L698K752J313k044l520l614k176
5395e372K53K571L752L676Q31j546l192m025k111p9K368L344L688J719j149l103
5411A625m161k660k57J962L782L506J851p90l040l883l258m32K224L571L475K267
5427E782o63k998l774l116r19J569L814L818J950l80k447l669k977j520J352L021
5443a157L820K695j43k519l450l242j502J117K700M182K370P36k315l601l268
5458c577j712N48K637M115K629Q93j729l822l623j450N65K405L687L106Q89j575
5474C986l494l241k649L98K596L317L393J268j457k830m025k143J9K345L403L228
5490D114J488j061l066l448k625o30K166L041L407K011n14k950l638k634r36J814
$$ plain form
5506 -3461 -213 3521 5163 4896 2240 -1343 -4002 -5164 -3852 -645 3095 5332 5314 2763 -659 -3888
5522 -3888 -5298 -4110 -857 2538 5185 5203 3012 -399 -4145 -4913 -4190 -1472 2331 4569 5359 3010
5538 3010 -103 -3209 -5236 -4487 -2010 1677 4415 5341 4184 332 -2802 -4917 -4996 -2175 1082 4022
5554 4022 5246 4125 757 -2581 -5151 -4804 -2664 1084 4031 5554 4031 1076 -2118 -5075 -4974
5569 -4974 -2687 138 3658 5224 4033 1879 -1807 -4579 -4773 -3340 -207 3543 4980 4657 2019
5584 2019 -1297 -4400 -4895 -3756 -454 3093 4886 4858 2376 -1070 -3530 -4965 -3943 -833 2661 4788
5600 4788 4860 2526 -603 -3446 -5193 -4118 -1130 1927 4695 5102 3083 -449 -3234 -5453 -4181 -1380
5616 -1380 1662 4717 4845 3339 22 -2966 -5095 -4410 -2077 1462 4216 5034 3657 431 -2605 -4663
$$ packed form
5506c461L248L734J642k67k656l583k659j162J312L207L740K237j8k551l422l229
5522c888j410J188L253L395K647J8k191l411l746p68P23K718L803K238P90k349
5538C010l113l106k027P49K477L687K738R26j157l852l134k115p9K821L257K940
5554D022J224j121l368l338k570L47K140L748K947J523j523k955l194k957J01
5569d974K287K825L520J566j191k154l686k772j94J433L133L750J437l23k638
5584B019l316l103m95J139L302L547J793k8k482l446k460j435J022L110L494K127
5600D788P2k334l129k843j747J075K988L057K768M07k019l532k785k219J272K801
5616a380L042L055J28j506l317k988k129O85K333L539K754Q18j377l226l036k058
$$ plain form
5632 -4663 -4664 -2430 1104 3644 4909 4148 930 -2562 -4719 -4707 -2325 666 3383 5054 4004 1031
5648 1031 -1826 -4526 -4803 -2600 400 3600 5380 4063 1713 -1549 -4581 -4770 -3126 -111 3401
5663 3401 4936 4144 2038 -1069 -4144 -4703 -3458 -706 2960 4311 4678 2607 -1008 -3402 -4708 -3886
5679 -3886 -1033 2350 4344 5117 3105 -330 -3246 -4627 -4030 -1008 1659 4486 4891 2820 -16 -2744
5695 -2744 -5010 -3993 -1556 1784 4560 4652 3200 639 -3082 -4937 -4110 -2171 1082 3895 4506 3851
5711 3851 987 -2785 -4359 -4235 -2469 848 3828 4806 3933 999 -2337 -4060 -4955 -2829 1042 3470
5727 3470 4760 4000 1358 -1709 -4213 -4903 -2635 266 2651 4960 3971 2021 -1111 -3905 -4802 -2976
5743 -2976 -788 2942 4755 4487 1879 -912 -3442 -4347 -3155 -734 2600 4563 4501 2823 -835 -3690
$$ packed form
5632d663jK234L534K540J265p61l218l492k157J2K382K991K717J671j050k973
5648A031k857k700k77K203L000L200J780j317k350l262l032j89J644L015L512
5663C401J535p92k106l107l075n59J245K752L666J351L67k071l615k394j306Q22
5679c886K853L383J994P73k012l435k916j381N97L022K667K827M05k071k836k728
5695b744k266J017K437L340K776R2j452k561l721j855Q27J939L253K813O11o55
5711C851k864l772j574J24J766L317K980R78q73k934l336j723q95K126L871K428
5727C470J290p60k642l067k504o90K268K901K385K309r89j950l132k794q97J826
5743b976K188L730J813k68k608k791k530r05J192K421L334J963o2j678l658k855
$$ plain form
5759 -3690 -4176 -4024 -1003 2352 4178 4749 2840 -471 -3153 -4486 -3704 -870 1914 3797 4813 3108
5775 3108 107 -2302 -4767 -4132 -1538 1345 4052 4858 3065 666 -2521 -4444 -4170 -2289 1087 3672
5791 3672 4667 3449 753 -2233 -4372 -3966 -2658 719 3648 4751 4027 1344 -2171 -4140 -4300 -2889
5807 -2889 650 3335 4403 4122 1702 -1892 -3716 -4742 -2856 229 2664 4487 4270 1544 -943
5822 -943 -3757 -4593 -2767 -473 2294 4594 4145 1993 -1191 -3212 -4663 -2935 -996 1972 4625 4150
5838 4150 2447 -336 -3308 -4254 -3537 -1399 2240 4206 4408 2920 17 -2746 -4200 -3859 -1342 1834
5854 1834 3548 4578 3227 122 -2567 -4175 -4228 -1937 1133 3475 4547 3261 479 -2147 -3798
5869 -3798 -4148 -1926 814 3490 4337 3503 905 -1831 -4232 -4109 -2542 371 3048 4564 3716 1464
$$ packed form
5759c690m86J52L021L355J826N71j909l311k682j333P82K834K784J883J016j705
5775C108l001k409k465O35K594K883K707Q06j793k399l187j923K74J881L376K585
5791C672R95j218k696k986k139M06J308L377K929J103p24k683l515j969j60J411
5807b889L539K685J068k81k420l594j824j026J886L085K435J823k17k726k487
5822i43k814q36J826K294K767K300m49k152l184k021j451J728J939K968K653m75
5838D150j703k783k972r46P17K138L639J966K02j488k903k763j454L41K517L176
5854A834J714J030j351l105k689j608n3K291L070K342J072j286k782k626j651
5869c798l50K222K740K676Q47q34k598k736k401J23J567K913K677J516q48k252
$$ plain form
5885 1464 -1762 -4020 -4260 -2801 264 2989 4470 3915 1650 -1405 -3463 -4372 -2892 -195 2775 4199
5901 4199 4645 1485 -1064 -3551 -4552 -3419 -515 2222 3966 3927 2345 -478 -3012 -4139 -3429 -859
5917 -859 1683 4152 4359 2603 31 -2825 -4387 -3529 -1444 1922 4127 4035 2866 38 -2887 -3966
5933 -3966 -3969 -1887 1477 3734 4534 3293 362 -2483 -4315 -4278 -1931 986 3240 4664 3464 404
5949 404 -1761 -3769 -4161 -2136 779 3094 4358 3600 1256 -1682 -3862 -4109 -2592 624 2859 4170
5965 4170 3695 1568 -1295 -3804 -3894 -2709 -33 2675 4163 3904 2045 -872 -3391 -3733 -3001 -511
5981 -511 2342 3632 3832 2271 -855 -2839 -3935 -3463 -646 2091 3916 4312 2515 -539 -2739 -4231
5997 -4231 -3288 -716 1671 3669 4225 2728 393 -2672 -3868 -3458 -1605 1521 3966 4052 3085 372
$$ packed form
5885A464l226k258k40J459L065K725J481n55k265l055k058r09J480K697K970J424
5901D199M46l160k549k487j001J133K904K737J744l9j582k823k534j127P10K570
5917h59K542K469K07j756k572k856j562Q58K085L366K205r2j169k828k925j079
5933c966lK082L364K257Q00j241k931k845j832L7K347K917K254J424j200l060
5949D04k165k008l92K025K915K315J264p58k344k938k180k47J517L216K235J311
5965D170m75k127k863k509r0J185K676K708J488k59j859k917k519l42P32K490
5981e11K853J290K00j561l126j984j096M72K817K737J825L96j797l054k200j492
5997d231R43K572K387J998N56j497k335l065j196M10J853L126K445Q6r67k713
$$ plain form
6013 372 -2551 -3557 -3595 -1738 1256 3507 4267 2929 889 -1778 -3928 -3748 -2196 665 3102 3898
6029 3898 3348 1021 -1701 -3621 -3770 -2632 359 2927 4304 3489 1554 -1285 -3389 -4086 -2369 185
6045 185 2938 4204 3787 1704 -1054 -3616 -4329 -2436 -391 2343 3857 4025 1885 -655 -2925 -4117
6061 -4117 -3036 -771 2134 3745 3880 2133 -675 -2678 -3655 -3186 -750 1563 3523 3988 2432 -104
6077 -104 -2519 -3897 -3421 -1443 1482 3518 4138 2941 258 -2498 -4127 -3669 -1452 917 3400 4312
6093 4312 2834 643 -2135 -3841 -3756 -1832 804 3050 4075 2813 1045 -2037 -3702 -3605 -2393 431
6109 431 2833 3866 3529 1196 -1335 -3298 -3786 -2684 178 2651 3962 3412 1763 -1391 -3201 -3895
6125 -3895 -2649 -94 2261 3973 3813 1601 -950 -2893 -3757 -2948 -502 2252 3733 3960 1838 -557
$$ packed form
6013C72k923j006l8J857K994K251P60j338k040k667k150J80J552K861K437P96
6029C898n50k327k722j920j49J138K991K568J377q15j935k839k104o97J717K554
6045A85K753J266m17k083k758k562p13J893K045K734J514J68k140k540k270j192
6061d117J081K265K905J611J35j747k808k003r77M69K436K313J960M65j556k536
6077a04k415j378M76J978K925K036O20j197k683k756j629M58K217K369K483R12
6093D312j478k191k778j706Q5J924K636K246J025j262j768l082j665R7J212K824
6109D31K402J033l37k333k531j963m88J102K862K473J311n50j649l154j810o94
6125c895J246K555K355J712j60k212k551j943q64Q09K446K754J481K27k122k395
$$ plain form
6141 -557 -2994 -3692 -2680 -912 1779 3713 3789 2288 -291 -2762 -3896 -3225 -1167 1522 3263 3952
6157 3952 2592 -105 -2514 -3546 -3077 -1446 1172 3064 3962 2689 219 -2131 -3542 -3899 -1505 1044
6173 1044 3374 4038 3029 500 -1605 -3480 -3501 -2215 487 2596 3519 3449 1045 -1481 -3266 -3996 -2355
6190 -2355 125 2650 3919 3661 1391 -1165 -3065 -3876 -2652 -213 2329 3566 3616 1744 -420 -2988
6206 -2988 -3328 -2908 -353 1922 3649 3525 1726 -106 -2640 -3713 -2913 -678 1735 3405 3666 2161
6222 2161 -14 -2529 -3709 -2867 -1074 1605 3367 3471 2334 55 -2368 -3702 -3275 -1510 981 3029
6238 3029 3361 2848 536 -2084 -3370 -3784 -1910 923 3009 3744 2798 554 -1750 -3187 -3532 -1799
6254 -1799 488 2470 3815 3082 1166 -1374 -3227 -3470 -2284 56 2220 3609 3109 1109 -1122 -2927
$$ packed form
6141e57k437o98J012J768K691J934P6j501k579k471j134O71K058K689J741O89
6157C952j360k697k409j032M69J631K618J892Q98j273k470k350j411l57K394K549
6173A044K330O64j009k529k105j875k1J286K702K109R23p0k404k526j785p30J641
6190b355K480K525J269k58k270k556j900q11J224K439K542J237N0j872k164k568
6206b988l40M20K555K275J727j24j799j832k534j073Q00K235K413J670K61j505
6222B161k175k515j180Q42J793K679J762J04j137k279k423j334M27J765K491K048
6238C029L32n13k312k620j286m14J874K833K086P35r46k244k304j437l45J733
6254a799K287J982J345p33j916k540j853k43J186K340K164J389n00k000k231j805
$$ plain form
6270 -2927 -3549 -2476 0 2097 3639 3063 1534 -986 -3052 -3223 -2794 -19 1936 3359 3506 1770
6286 1770 -626 -2629 -3480 -3237 -763 1686 3435 3580 1825 -459 -2540 -3634 -2981 -721 1499 3390
6302 3390 3628 2267 229 -2114 -3795 -3151 -1370 1218 3332 3454 2480 551 -1914 -3392 -3089 -1701
6318 -1701 747 3029 3325 2890 775 -2072 -3121 -3447 -1599 542 2636 3523 2911 854 -1654 -3203
6334 -3203 -3178 -2090 237 2355 3702 3110 1014 -1093 -2804 -3755 -2239 -13 2006 3586 2976 1388
6350 1388 -920 -3075 -3676 -2259 -358 1935 3536 3290 1670 -623 -2393 -3284 -2709 -1266 1814 3337
6366 3337 3005 2195 -280 -2645 -3172 -3003 -1309 1594 3260 3539 1899 56 -1920 -3405 -3136 -1010
6382 -1010 1392 3400 3616 2479 338 -2011 -3209 -2856 -1552 558 2842 3705 2555 903 -1674 -3049
$$ packed form
6270b927o22J073K476K097J542n76j529k520k066j71M29K775J955J423J47j736
6286A770k396k003q51K43K474K449J749J45j755k284k081j094O53K260K220J891
6302C390K38j361k038k343j681O44J781K588K114J22r74j929k465j478L03J388
6318a701K448K282K96m35k115k847j049l26J848K141K094Q87o12k057k508j549
6334c203K5J088K327K118J347n92k096k107j711r51J516K226K019J580o10j588
6350A388k308k155o01J417J901K293J601k46j620k293j770q91N75J443L080J523
6366C337l32q10k475k365n27J69J694K903J666K79j640j843j976j485K69K126
6382a010K402K008K16j137k141k349j198L53J304K110K284Q63j150j652k577j375
$$ plain form
6398 -3049 -3053 -1445 439 3016 3611 2419 1207 -1613 -3114 -3088 -1966 399 2369 3271 2854 995 -1315
6415 -1315 -2871 -3335 -2354 119 2147 3267 3316 1155 -1055 -2702 -3641 -2298 -441 1867 3209 3038
6431 3038 1660 -608 -2318 -3624 -2252 -506 1583 3201 3331 1823 -17 -2258 -3382 -2560 -957
6446 -957 1286 2901 3106 2077 -499 -2433 -3122 -3187 -974 1355 3083 3295 2383 230 -1756 -3056 -2843
6463 -2843 -1344 830 2574 3072 2492 351 -1875 -3190 -3068 -1410 818 2430 3652 2508 613 -1368
6479 -1368 -2998 -3292 -1631 295 2309 3327 2820 860 -1114 -2846 -3168 -1964 -38 2379 2921 2776
6495 2776 1125 -1057 -2574 -3115 -2343 -17 1926 3217 3156 1433 -857 -2160 -3194 -2423 -531 1582
6511 1582 2951 3145 1429 -511 -2358 -3194 -2546 -546 1331 3117 3063 2068 63 -2329 -3486 -2600 -608
$$ packed form
6398c049mJ608J884K577N95j192j212k820j501K6J122K365J970R02m17j859k310
6415a315j556m64R81K473K028J120M9k161k210j647r39J343J857K308J342j71
6431C038j378k268j710j306J372J746K089J618J30j508j840k241j124Q22J603
6446i57K243J615K05j029k576j934o89o5K213K329J728K12r12k153j986j300K13
6463b843J499K174J744M98n80k141k226j315J22J658K228J612J222j144j895j981
6479a368j630k94J661J926K014J018n07j960j974j732l22J204J926K417N42j45
6495B776j651k182j517n41P72K326J943J291o1j723k290j303j034P71J892K113
6511A582J369J94j716j940j847q36O48K000J877J786n4r95k005k392j157Q86J992
$$ plain form
6528 -608 1023 2770 3299 2299 175 -2112 -2904 -2452 -1216 574 2791 2987 2473 439 -1999 -2691 -2687
6545 -2687 -1426 661 2283 3026 2485 599 -1155 -2974 -3059 -1716 348 2315 3288 2685 952 -1323
6561 -1323 -2539 -3264 -1651 240 2239 3176 2747 1015 -1024 -2512 -3278 -2176 -326 1996 2992 2763
6577 2763 1130 -509 -2492 -3158 -2302 -256 1597 2837 2978 1901 -544 -2423 -2675 -2402 -470 1625
6593 1625 2828 2975 1954 -188 -2010 -3077 -2653 -700 990 2659 2992 1894 -186 -1880 -2867 -2626
6609 -2626 -1207 924 2781 3433 2055 186 -1851 -2724 -2708 -1369 565 2525 3088 2436 857 -1519
6625 -1519 -2845 -2801 -1582 398 2478 2901 2678 853 -967 -2541 -2555 -1863 142 2189 2988 2511 1139
6642 1139 -700 -2423 -2851 -1818 -19 1727 2998 2988 1382 -839 -2508 -3018 -2069 -680 1723 2992
$$ packed form
6528f08J631J747N29j000k124k287p92M52J236J790K217J96n14k034k438o92M
6545b687J261K087J622P43n41j886j754j819q5J343K064J967R73o03j733k275
6561a323j216p25J613J891J999R37m29j732k039j488p66J102J850K322R96k29
6577B763j633j639j983o66Q56K046J853J240J41j077k445j879k52K73J932K095
6593A625J203J47j021k142j822j067M24J953J690J669L33j098k080j694r87K41
6609b626J419K131J857O52j378j869k037q73J6J339J934J960N63o52j579k376
6625a519j326M4J219J980K080M23k23j825j820j574j4O92K005K047P99m77j372
6642A139j839j723m28J033J799J746J271j0j606k221j669n10R49J389K403J269
$$ plain form
6658 2992 2703 1371 -345 -2304 -2901 -1898 -672 1693 2962 2886 1767 -330 -2051 -2688 -2532 -841
6674 -841 1418 2871 2850 1659 -437 -1821 -2482 -2471 -909 977 2387 3177 1792 67 -1367 -2786 -2572
6691 -2572 -1280 567 2538 2947 2489 323 -1057 -2432 -2655 -1184 411 2412 2813 2272 619 -926
6707 -926 -2798 -2538 -1852 499 2178 2992 2636 518 -1068 -2484 -2936 -1865 -206 1930 2914 2721 997
6724 997 -549 -2245 -2856 -2020 -133 1727 2851 2761 1337 -506 -2307 -2624 -2036 -530 1394 2701 2853
6741 2853 1610 -396 -2004 -2952 -2461 -802 1459 2647 2978 1544 -176 -1814 -2681 -2344 -862 966
6757 966 2580 2603 2196 -7 -2071 -2648 -2577 -1158 667 2224 2701 2227 353 -1249 -2592 -2560 -1509 216
6775 216 2441 2495 2232 466 -982 -2126 -2651 -1246 314 2094 2719 2537 916 -1007 -2242 -2681 -1648
$$ packed form
6658B992k89j332j716j959n97J003J226K365J269p6j119k097j721o37J56J691
6674h41K259J453k1j191k096j384o61J1J562J886J410P90j385j725j434j419K14
6691b572J292J847J971M09m58k166j380j375k23J471J595K001M01n41j653j545
6707i26j872K60O86K351J679Q14l56k118j586j416m52J071J659K136R84j93j724
6724I97j546j696o11Q36J887J860J124r0j424j843j801l17N88J506J924J307J52
6741B853j243k006j608r48M91J659K261J188L31j434j720j638q67L37J482J828
6757I66J614K3m07k203k064n77P1J419J825J557M77m74j874j602j343L2J051J725
6775B16K225N4k63j766j448j144n25J405J560J780O25j82j621j923j235m39J033
$$ plain form
6792 -1648 -138 1819 2661 2357 1005 -725 -2623 -2465 -1720 -1 2069 2654 2529 1105 -648 -2264
6808 -2264 -2572 -1904 -636 1468 2535 2868 1624 -321 -1918 -2658 -2354 -473 1415 2250 2780 1387 -178
6825 -178 -1585 -2690 -2311 -881 1003 2348 2653 1794 295 -1341 -2509 -2220 -1043 847 2488 2729
6841 2729 1957 489 -1332 -2441 -2429 -1426 510 2178 2541 1925 521 -1475 -2381 -2717 -1264 6 2176
6858 2176 2938 2206 1124 -960 -2099 -2851 -1645 139 1799 2773 2347 1462 -617 -2038 -2656 -1827 50
6875 50 1566 2723 2590 1117 -383 -2127 -2671 -1896 -508 1253 2607 2247 1246 -470 -2029 -2507 -2184
6892 -2184 -459 1475 2573 2884 1376 -126 -1811 -2702 -2383 -727 1192 2479 2717 1825 129 -1509
6908 -1509 -2381 -2556 -1254 1093 2457 2691 1732 278 -1414 -2214 -2251 -1117 849 2222 2771 2180 463
$$ packed form
6792a648J510J957Q42l04j352j730j898J58P45J719K070N85j25j424j753j616
6808b264l08O68J268K104J067L33j244j945j597p40L04J881J888Q35N30j393j565
6825a78j407j105L79J430J884J345L05q59j499j636j168K89J177J890J641K41
6841B729p72j468j821j109J2J003J936J668L63o16j404j996r06l36J453J270K170
6858B176P62p32j082k084j139p52J206J784J660R74m26q85k079j421o18Q29J877
6875E0J516J157j33j473j500j744n44P75J388J761J354l60j001j716j559m78L23
6892b184J725J934J098L11j508j502j685q91L19J656J919J287K38q92j696j638
6908a509q72j75J302K347J364K34r59j454j692q00l7J134J966J373N49n91j717
$$ plain form
6925 463 -1301 -2327 -2711 -1303 253 1954 2647 2260 1149 -1000 -2194 -2238 -1489 197 1830 2561 2551
6942 2551 979 -905 -2195 -2514 -1664 -127 1782 2548 2689 762 -587 -1911 -2346 -1666 -190 1573
6958 1573 2743 2278 1486 -399 -1863 -2567 -2207 -706 1372 2418 2337 1472 -503 -1300 -2712 -2092 -946
6975 -946 979 2434 2450 1807 76 -1768 -2152 -2167 -1245 1056 2213 2825 1911 351 -1379 -2151 -2284 -1078
6993 -1078 418 2169 2712 2128 682 -1517 -2164 -2209 -1030 303 1934 2508 2241 545 -841 -2038 -2242
7010 -2242 -1032 201 1654 2313 2301 1197 -828 -2141 -2427 -1567 17 1801 2503 2504 1087 -460 -1984
7027 -1984 -2519 -1781 21 1168 2166 2487 1245 -302 -1831 -2376 -1870 -145 1179 2163 2739 1218 -261
7044 -261 -1545 -2504 -1987 -581 844 2576 2683 1489 42 -1505 -2323 -2051 -1003 962 2246 2191 1560
$$ packed form
6925D63j764j026l84J408J556J701O93l87j111k149j194m4P49J686J633P31j0
6942B551j572j884j290l19Q50J537J909P66J41j927j349j324m35O80J476J763
6958A573J170m65p92j885j464p04L60J501K078J046q1q65j975p97j412O20J146
6975i46J925J455J6o43j731j844l84j5R22K301J157O12r14j560j730p72j33J206
6993a078J496J751N43n84j446k199o47m5J179J333J631N74k67j696j386j197k04
7010b242J210J233J453O59j2j104k025j313k86Q60J584J784P02Jj417j547j524
7027a984n35P38J802J147R98L21j242j547j529n45N06J725J324R84N76j521j479
7044b61j284r59N17J406J425J732J07j194j447j547q18K72J048J965J284n5o31
$$ plain form
7061 1560 -24 -1462 -2048 -2048 -992 642 2138 2468 1749 404 -1217 -1852 -2170 -1006 284 2061 2531
7078 2531 2156 679 -1107 -2124 -2207 -1403 248 1903 2455 2092 625 -881 -2022 -2518 -1297 630 1626
7095 1626 2788 2052 1073 -469 -1886 -2284 -1752 -274 1565 2377 2343 1398 -718 -1840 -2107 -1752 115
7112 115 1129 2207 2459 1405 -97 -1634 -2180 -1888 -466 1182 2276 2298 1438 -15 -1662 -2270 -2071
7129 -2071 -543 1007 2092 2176 1629 278 -1198 -2240 -2033 -790 459 1992 2395 1704 348 -1604
7145 -1604 -2170 -2010 -842 485 1861 2264 2043 738 -1373 -2027 -2097 -972 108 1575 2240 1939 545
7162 545 -748 -1727 -2356 -1565 548 1393 2426 2039 796 -587 -1693 -2228 -1415 184 945 2501 2178
7179 2178 1031 -352 -2050 -2413 -1507 -669 1439 2269 1969 988 -403 -1561 -2112 -1596 -801 1321 1997
$$ packed form
7061A560j584j438n86%J056J634J496L30p19j345j621o35l18J164J290J777M70
7078B531l75j477j786j017q3Q04J651J655N52l63j467j506j141m96J221J927R96
7095A626J162p36r79j542j417l98N32J478J839Q12l4r45k116j122k67L55J867
7112A15J014J078K52j054j502j537n46K92J422J648J094K2q60j453j647o08J99
7129b071J528J550J085Q4n47j351j476j042K07J243J249J533M03o91j356j952
7145a604n66J60J168J327J376M03k21j305k111o54p0J125J080J467O65l01j394
7162E45j293r79o29P91K113Q45J033l87j243j383j106n35Q13J599P61J556l23
7179B178j147j383j698l63R06Q38K108Q30l00r81j391j158n51N16P95K122O76
$$ plain form
7196 1997 2244 1418 -110 -1519 -2167 -1829 -434 1205 1964 2122 1634 192 -1127 -2061 -2197 -779 478
7213 478 1619 2193 1909 -61 -1203 -2182 -1815 -634 493 1943 2481 1581 380 -1143 -1704 -2114 -766
7230 -766 354 1740 2221 1970 529 -1088 -2018 -2145 -1225 183 1910 2355 2097 562 -651 -2059 -2188
7247 -2188 -1305 101 1436 2382 2198 810 -536 -1754 -2440 -1839 -332 1195 2265 2509 995 -8
7263 -8 -1518 -1979 -1410 -613 1068 2170 2086 1088 -332 -1550 -1856 -1501 -840 1144 2228 1997 1351 -257
7281 -257 -1615 -2132 -2162 -752 778 1705 2570 1308 -57 -1082 -2169 -1941 -1061 680 1928 2122 1426
7298 1426 408 -1110 -2128 -1726 -1115 290 1750 2288 1696 594 -1010 -2049 -2443 -1034 229 1598
7314 1598 2210 1883 649 -756 -2079 -1657 -1054 302 1501 2025 1770 863 -1004 -1719 -2011 -1158 -53
$$ packed form
7196A997K47q26j528j409o48L38J395J639P59J58m88j442j319r34j36J418J257
7213D78J141N74k84j970j142r79L67J181J127J450N38r00j201j523n61m10J348
7230g66J120J386M81k51j441j617r30j27R20J408J727M45k58j535j213j408j29
7247b188Q83J406J335R46j84j388j346j218o86O01J507J527J070K44j514j003
7263hj510m61N69P97J681J102q4r98j420j218l06L55O61J984J084k31o46j608
7281b57j358n17l0J410J530R27Q65j262j365j025j087K28Q80J741J248J94o96
7298A426j018j518j018M02O11J405J460N38n92j102j604j039l94J409J263J369
7314A598O12l27j234j405j323M22O03J356J199N24k55r07j867p15k92Q53J105
$$ plain form
7331 -53 1207 2041 1924 760 -603 -1475 -1815 -1523 2 1358 1968 2276 990 -277 -1372 -2114 -1538 -23
7349 -23 794 2118 1979 1321 222 -1273 -1918 -1726 -667 877 1983 2038 1370 -73 -1246 -1888 -1799 -752
7367 -752 879 1845 2182 1537 144 -1282 -2201 -1962 -742 615 1609 1893 1591 140 -1159 -2105 -1853 -1141
7385 -1141 398 1590 2051 1798 897 -950 -1760 -1964 -1332 -118 1325 2462 1556 746 -540 -1904 -1571
7402 -1571 -1395 -131 1459 2045 1812 789 -430 -1770 -1984 -1488 -26 1075 2027 1979 983 -292 -1432
7419 -1432 -2102 -1502 -60 947 1944 2019 1172 -204 -1418 -1907 -1559 -545 979 1868 2117 1705 208 -1255
7437 -1255 -2088 -1900 -576 718 1913 1873 1430 102 -1207 -2203 -1621 -888 468 1542 2006 1799 39
7454 39 -977 -2021 -1726 -878 446 1756 1943 1778 153 -776 -1782 -1900 -1142 106 1638 2065 1521 351
$$ packed form
7331e3J260Q34j17j164j363q72l40K92J525J356O10L08j286j267j095p42N76J515
7349b3Q17J324j39o58j099j495o45J92J059J544J106N5o68j443j173o42Q9J047
7367g52J631R66L37o45j393j426r19K39J220J357R94K84l02j451j299r46K52P12
7385a141J539J192M61k53r01j847q10k04O32J214J443J137r06q10j286j364L33
7402a571J76J264J590N86k33j023j219j340k14M96J462J101R52m8r96j275j140
7419a432o70O00J442J007R97P5q47j376j214m89L48J014J524Q89K49m12j497j463
7437a255q33J88J324J294J195m0m43j328j309r96N82P33J356J074M64k07j760
7454C9j016j044K95Q48J324J310J87j65j625r29j006j18P58J248J532M27n44j170
$$ plain form
7472 351 -757 -1869 -2102 -1062 -27 1590 2079 1933 1054 -797 -1763 -2123 -1166 -127 1575 1814 1876 1082
7490 1082 -480 -1801 -1823 -1247 -158 807 1622 1549 1181 -494 -1218 -2044 -1563 -471 692 1791 1747 1291
7508 1291 -10 -1014 -1699 -1687 -748 771 1837 2050 1457 225 -1374 -2006 -1478 -643 696 1568 2265 1412
7526 1412 96 -1050 -1764 -1603 -613 522 1583 2021 1297 375 -738 -1831 -1640 -838 154 1132 2094 1772
7544 1772 584 -782 -1511 -1625 -1072 -77 1452 2043 1855 765 -452 -1514 -1981 -1284 35 1038 2141
7561 2141 1578 782 -235 -1587 -1867 -1322 -215 973 1797 1692 1155 -4 -1275 -1823 -1464 -533 986
7578 986 1982 1560 1070 36 -1532 -1533 -1456 -136 791 1469 2337 1306 -295 -1192 -1791 -1746 -720 278 1305
7597 1305 1815 1561 228 -810 -1511 -1737 -703 308 1453 2103 1320 511 -810 -1845 -1522 -1049 366
$$ packed form
7472C51j108j112k33J040J035J617M89j46q79j851r66l60R57J039J702K39O2p94
7490A082j562j321k2N76J089R65Q15p3l68j675p24q26M81J092J163J099m4m56
7508A291j301j004o85J2R39J519J066K13n93j232j599o32N28Q35J339Q72O97q53
7526A412j316j146p14J61R90J135J061M38p24r22j113j093J91Q02R92R78R62l22
7544A772j188j366p29j14N53R95J529N91j88j090j217j062m67O97J319J003J103
7561B141n63p96j017j352k80N45J107J188Q24j05n37j159j271n48L59R31J519
7578I86R96m22m90j034j568jP7J320R27O78Q68j031j601q97n99M5J026R98J027
7597A305N10k54j333j038p01k26J034J011J145O50p83q09j321j035L23M73J415
$$ plain form
7614 366 1144 1818 1447 516 -424 -1674 -1752 -1209 225 1360 1818 1617 899 -633 -1273 -1641 -1510 119 1001
7633 1001 1680 1764 869 -395 -1392 -1944 -1451 -194 1028 1936 1857 1026 -278 -1318 -1829 -1227 -345 713
7651 713 1808 1834 1010 -70 -1128 -1790 -1212 -572 1111 1638 1791 1116 -100 -1147 -1792 -1309 -784 966
7669 966 1475 2012 1375 -170 -836 -1608 -1434 -909 366 1358 1914 1666 429 -1123 -1555 -1912 -845 379
7687 379 1597 1803 1235 414 -732 -1218 -1623 -861 -7 1198 2041 1660 762 -390 -1370 -1815 -1238 -291 1146
7706 1146 1727 1557 790 -495 -1671 -1639 -1376 21 1109 1778 1692 1025 -133 -1372 -1808 -1382 -46 1265
7724 1265 1604 1714 1157 -23 -1126 -1843 -1103 -433 762 1571 1809 1117 -18 -899 -1614 -1269 -389 501
7742 501 1433 2055 1403 449 -934 -1408 -1626 -688 646 1703 1535 1452 379 -792 -1972 -1405 -824 465
$$ packed form
7614C66P78O74l71r31r40j250p8N43J434J135M58k01p18j532o40l68J31J629Q82
7633A001O79Q4q95j264r97n52M93J257J222R08p9q31j304j040n11O02Q82J058
7651G13J095K6q24j080j058o62N78O40J683N27J53o75j216j047o45M83N25J750
7669I66N09N37o37j545o66p72J74N25J275R92N56k48j237j552m32l57J067J224
7687C79J218K06n68q21j146m86m05P62Q54J205Q43l81q98j152r80m45N77R47J437
7706A146N81j70p67j285j176L2K63J397J088O69q6o67j158j239m36M26J336J311
7724A265L39J10n57j180j103p17P40O70J195Q09K38o92j135q81p15L45Q80Q90
7742E01R32O22o52r54j383m74k18R38J334J057j68q3j073j171j180N67N81J289
$$ plain form
7760 465 1140 1654 1387 367 -599 -1355 -1931 -963 307 1137 1806 1596 634 -690 -1287 -1649 -760 -91 1331
7779 1331 1863 1867 750 -321 -1311 -1672 -904 118 1078 1916 1725 995 -369 -1369 -1692 -1073 -63 1072
7797 1072 1835 1593 1169 -377 -1609 -1704 -1003 -178 668 1675 1581 1099 59 -1041 -1411 -1264 -671 826
7815 826 1418 1776 1143 284 -764 -1438 -1354 -577 846 1362 1612 1272 -78 -1088 -1497 -1346 -508 506 1283
7834 1283 1940 1281 350 -698 -1362 -1641 -836 345 1037 1743 1283 146 -549 -1610 -1432 -1017 293 958
7852 958 1228 1620 386 -366 -1471 -1420 -1126 245 1080 1504 1488 564 -535 -1183 -1725 -981 -166 977 1540
7871 1540 1484 829 -118 -955 -1735 -1093 -312 560 1620 1731 770 38 -1320 -1498 -1406 -207 686 1379 1715
7890 1715 924 297 -984 -1453 -1566 -274 576 1353 1683 1370 231 -684 -1443 -1326 -647 537 1280 1691
$$ packed form
7760D65O75N14k67j020r66p56n76R68J270Q30O69k10r62j324n97l62Q89O69J422
7779A331N32Mj117j071r90l61P68J022R60Q38j91p30j364j000l23O19J010J135
7797A072P63k42m24j546j232r5P01Q25Q46J007r4m82j040j100l70J47N93J497
7815H26N92L58o33q59j048o74Q4P77J423N16K50l40j350j010m09J51Q38J014P77
7834A283O57o59r31j048o64k79Q05J181O92P06m60j137o95j061J78M15J310O65
7852I58K70L92j234p52j105N1K94J371Q35M24j6r24j099o48n42P44Q15J143N63
7871A540n6o55r47q37p80O42P81Q72J060J11r61p32j358j78R2J199Q93O93L36
7890A715p91o27j281m69j13J292Q50P77L30l13j139r15p59J17O79J184P43M11
$$ plain form
7908 1691 1484 344 -752 -1589 -1316 -867 421 1228 1778 1286 317 -506 -1424 -1339 -853 486 1044 1846 1268
7927 1268 413 -229 -1106 -1512 -1010 199 1047 1383 1658 913 -463 -1301 -1636 -1112 239 804 1581 1591 1078
7946 1078 -195 -1091 -1546 -1016 -199 1070 1625 1304 870 -81 -881 -1699 -916 -287 632 1313 1602 987 -189
7965 -189 -844 -1411 -1235 -489 473 1247 1914 1217 368 -760 -1248 -1277 -547 291 1367 1697 1221 218 -772
7984 -772 -1368 -1260 -339 330 1075 1312 1130 321 -377 -1182 -1237 -719 157 1285 1491 1364 537 -384 -1160 -1238
$$ packed form
7908A691k07j140j096q37K73M49J288Q07N50m92r69q23r18Q5M86J339N58Q02n78
7927A268q55o42q77m06N02J209Q48L36K75p45j376q38l35N24J351N65P77J0n13
7946A078j273q96m55N30Q17J269N55l21m34r51q00q18P83O29R19O81K89o15j176
7965a89o55n67J76P46R62P74O67o97q49j128m88k9P30Q38J076L30m76j003r90
7984g72n96J08R21O69P45K37j82q09o98q05n5N18Q76J128K06j27q27r21p76p8
$$ [...]
8191c71
##END NTUPLES=NMR FID
##END=
