##TITLE=1H_SR167_k
 DMSO-d6
 8 sc, 
 17.2.2023
##JCAMPDX= 6.0         $$ Bruker NMR JCAMP-DX V2.0
##DATA TYPE= NMR FID
##DATA CLASS= NTUPLES
##ORIGIN= UXNMR, Bruker Analytische Messtechnik GmbH
##OWNER= root
$$ XWIN-NMR		Version 3.5
$$ Fri Feb 17 15:44:58 2023 Russian Standard Time (UT+4h)  she@DPX200
##.OBSERVE FREQUENCY= 200.13135
##.OBSERVE NUCLEUS= ^1H
##.DELAY= (6, 6)
##.ACQUISITION MODE= SIMULTANEOUS
##.ACQUISITION SCHEME= undefined
##.AVERAGES= 8
##.DIGITISER RES= 18
##SPECTROMETER/DATA SYSTEM= spect
##.PULSE SEQUENCE= zg30
##.SOLVENT NAME= DMSO
##.SHIFT REFERENCE= (INTERNAL, DMSO, 0, 15.7039)
##AUDIT TRAIL= $$ (NUMBER, WHEN, WHO, WHERE, WHAT)
$$ ##TITLE= Audit trail, XWIN-NMR		Version 3.5
$$ ##JCAMPDX= 5.01
$$ ##ORIGIN= Bruker BioSpin GmbH
$$ ##OWNER= she
$$ F:/spectra/data/she/nmr/H-F/1/audita.txt
$$ ##AUDIT TRAIL=  $$ (NUMBER, WHEN, WHO, WHERE, WHAT)
(   1,<2023-02-17 15:43:55.71 +0400>,<she>,<DPX200>,
      <created by zg, POWCHK disabled, PULCHK disabled
       configuration hash MD5:
       00 E9 B6 7A A2 85 ED C7 34 08 36 98 17 FE 4E 26
       data hash MD5: 16K
       F4 EA B5 BF 5B 74 22 55 7A CD 97 C4 E5 A9 5F B5>)
$$ ##END=
$$ 
$$ hash MD5
$$ 11 91 8D 3B FF 8C CB 71 70 04 50 F2 BB EF F9 72
##$RELAX= 
##$RELAX= 
##$RELAX= 
##$RELAX= 
##$RELAX= 
##$RELAX= 
$$ Bruker specific parameters
$$ --------------------------
##$DU= <F:/spectra>
##$EXPNO= 1
##$NAME= <H-F>
##$PROCNO= 1
##$TYPE= <nmr>
##$USER= <she>
##$AMP= (0..31)
100 100 100 100 100 100 100 100 100 100 100 100 100 100 100 100 100 100 
100 100 100 100 100 100 100 100 100 100 100 100 100 100 
##$AQSEQ= 0
##$AQ_mod= 1
##$AUNM= <au_zg>
##$AUTOPOS= <>
##$BF1= 200.13
##$BF2= 200.13
##$BF3= 200.13
##$BF4= 200.13
##$BF5= 200.13
##$BF6= 200.13
##$BF7= 200.13
##$BF8= 200.13
##$BYTORDA= 1
##$CFDGTYP= 0
##$CFRGTYP= 5
##$CHEMSTR= <none>
##$CNST= (0..31)
1 1 145 1 1 1 1 1 1 1 1 1 1 1 1 1 1 1 1 1 1 1 1 1 1 1 1 1 1 1 1 1 
##$CPDPRG= <>
##$CPDPRG1= <>
##$CPDPRG2= <>
##$CPDPRG3= <>
##$CPDPRG4= <mlev>
##$CPDPRG5= <mlev>
##$CPDPRG6= <mlev>
##$CPDPRG7= <mlev>
##$CPDPRG8= <mlev>
##$CPDPRGB= <>
##$CPDPRGT= <>
##$D= (0..31)
0 1.2 0 0 0 0 0 0 0 0.06 0 0.03 0 0 0 0 0.0002 0 0 0 0 0 0 0 0 0 0 0 0 
0 0 0 
##$DATE= 1676634235
##$DBL= (0..7)
120 120 120 120 120 120 120 120 
##$DBP= (0..7)
150 150 150 150 150 150 150 150 
##$DBP07= 0
##$DBPNAM0= <>
##$DBPNAM1= <>
##$DBPNAM2= <>
##$DBPNAM3= <>
##$DBPNAM4= <>
##$DBPNAM5= <>
##$DBPNAM6= <>
##$DBPNAM7= <>
##$DBPOAL= (0..7)
0.5 0.5 0.5 0.5 0.5 0.5 0.5 0.5 
##$DBPOFFS= (0..7)
0 0 0 0 0 0 0 0 
##$DE= 6
##$DECBNUC= <off>
##$DECIM= 32
##$DECNUC= <off>
##$DECSTAT= 4
##$DIGMOD= 1
##$DIGTYP= 9
##$DL= (0..7)
0 120 120 120 120 120 120 120 
##$DP= (0..7)
150 150 150 150 150 150 150 150 
##$DP07= 0
##$DPNAME0= <>
##$DPNAME1= <>
##$DPNAME2= <>
##$DPNAME3= <>
##$DPNAME4= <>
##$DPNAME5= <>
##$DPNAME6= <>
##$DPNAME7= <>
##$DPOAL= (0..7)
0.5 0.5 0.5 0.5 0.5 0.5 0.5 0.5 
##$DPOFFS= (0..7)
0 0 0 0 0 0 0 0 
##$DQDMODE= 0
##$DR= 18
##$DS= 0
##$DSLIST= <SSSSSSSSSSSSSSS>
$$ [...]
##$SUBNAM2= <"">
##$SUBNAM3= <"">
##$SUBNAM4= <"">
##$SUBNAM5= <"">
##$SUBNAM6= <"">
##$SUBNAM7= <"">
##$SUBNAM8= <"">
##$SUBNAM9= <"">
##$SW= 18.05172834244
##$SWIBOX= (0..15)
0 0 2 0 0 0 0 0 0 0 0 0 0 0 0 0 
##$SW_h= 3612.71676300578
##$TD= 16384
##$TD0= 1
##$TE= 0
##$TE2= 300
##$TE3= 300
##$TEG= 300
##$TL= (0..7)
0 120 120 120 120 120 120 120 
##$TP= (0..7)
150 150 150 150 150 150 150 150 
##$TP07= 0
##$TPNAME0= <>
##$TPNAME1= <>
##$TPNAME2= <>
##$TPNAME3= <>
##$TPNAME4= <>
##$TPNAME5= <>
##$TPNAME6= <>
##$TPNAME7= <>
##$TPOAL= (0..7)
0.5 0.5 0.5 0.5 0.5 0.5 0.5 0.5 
##$TPOFFS= (0..7)
0 0 0 0 0 0 0 0 
##$TUNHIN= 0
##$TUNHOUT= 0
##$TUNXOUT= 0
##$USERA1= <user>
##$USERA2= <user>
##$USERA3= <user>
##$USERA4= <user>
##$USERA5= <user>
##$V9= 5
##$VALIST= <valist>
##$VCLIST= <CCCCCCCCCCCCCCC>
##$VD= 0
##$VDLIST= <DDDDDDDDDDDDDDD>
##$VPLIST= <PPPPPPPPPPPPPPP>
##$VTLIST= <TTTTTTTTTTTTTTT>
##$WBST= 1024
##$WBSW= 4
##$XGAIN= (0..3)
0 0 0 0 
##$XL= 0
##$YL= 0
##$YMAX_a= 58802
##$YMIN_a= -102799
##$ZGOPTNS= <>
##$ZL1= 120
##$ZL2= 120
##$ZL3= 120
##$ZL4= 120
##$ABSF1= 10
##$ABSF2= 0
##$ABSG= 5
##$ABSL= 3
##$ALPHA= 0
##$AQORDER= 0
##$ASSFAC= 0
##$ASSFACI= 0
##$ASSFACX= 0
##$ASSWID= 0
##$AUNMP= <proc_1d>
##$AZFE= 0.1
##$AZFW= 0.1
##$BCFW= 1
##$BC_mod= 2
##$BYTORDP= 1
##$COROFFS= 0
##$CY= 11.3945322036743
##$DATMOD= 1
##$DC= 2
##$DFILT= <>
##$DTYPP= 0
##$F1P= 2.36226072786647
##$F2P= -0.459571619588291
##$FCOR= 0.5
##$FTSIZE= 0
##$FT_mod= 4
##$GAMMA= 1
##$GB= 0.15
##$INTBC= 1
##$INTSCL= 1
##$ISEN= 128
##$LB= 0.24
##$LEV0= 0
##$LPBIN= 0
##$MAXI= 10000
##$MC2= 0
##$MEAN= 0
##$ME_mod= 0
##$MI= 1.114404
##$NCOEF= 0
##$NC_proc= 0
##$NLEV= 6
##$NOISF1= 3.799351
##$NOISF2= 2.8
##$NSP= 1
##$NTH_PI= 0
##$NZP= 0
##$OFFSET= 15.70392
##$PC= 1
##$PHC0= -19117.74
##$PHC1= 16.20078
##$PH_mod= 1
##$PKNL= yes
##$PPARMOD= 0
##$PSCAL= 0
##$PSIGN= 0
##$REVERSE= no
##$SF= 200.130013532006
##$SI= 16384
##$SIGF1= 3
##$SIGF2= 2
##$SINO= 400
##$SIOLD= 16384
##$SREGLST= <1H.CDCl3>
##$SSB= 0
##$STSI= 0
##$STSR= 0
##$SW_p= 3612.71676300578
##$SYMM= 0
##$S_DEV= 0
##$TDeff= 0
##$TDoff= 0
##$TI= <>
##$TILT= no
##$TM1= 0
##$TM2= 0
##$TOPLEV= 0
##$USERP1= <user>
##$USERP2= <user>
##$USERP3= <user>
##$USERP4= <user>
##$USERP5= <user>
##$WDW= 1
##$XDIM= 8192
##$YMAX_p= 0
##$YMIN_p= 0
$$ End of Bruker specific parameters
$$ ---------------------------------
##NTUPLES= NMR FID
##VAR_NAME=  TIME,          FID/REAL,        FID/IMAG
##SYMBOL=    X,             R,               I
##VAR_TYPE=  INDEPENDENT,   DEPENDENT,       DEPENDENT
##VAR_FORM=  AFFN,          ASDF,            ASDF
##VAR_DIM=   8192,          8192,            8192
##UNITS=     SECONDS,       ARBITRARY UNITS, ARBITRARY UNITS
##FACTOR=    0.0002768,     1,               1
##FIRST=     0,             0,               0
##LAST=      2.2672688,     0,               0
##MIN=       0,             -102799,         0
##MAX=       2.2672688,     58802,           0
$$ Real data points
##PAGE= N=1
##DATA TABLE= (X++(R..R)), XYDATA
0@%%%%%%%%%%%%%%qJ6j6J6j6J7k5L2l3M1m9N7p2Q1r0J05j21J38j58J82k06K30
$$ 0 0 0 0 0 0 0 0 0 0 0 0 0 0 0 -8 8 -8 8 -8 9 -16 16 -17 24 -25 32 -40 41 -49 56 -65 73 -85 97 -109 121
36A21k58K90l26L64m05M52n02N56o14O79p50Q27r12J004j106J218j341J480j635
$$ 121 -137 153 -173 191 -214 238 -264 292 -322 357 -393 434 -478 526 -580 638 -703 777 -858
55h58J807k003K227k484K787l148L582m122M816n743P046r036J2490k0192P1633
$$ -858 949 -1054 1173 -1311 1476 -1672 1910 -2212 2604 -3139 3907 -5129 7361 -12831 58802
70E8802k4837p8443O6602J3351M509j7764l4814lL8076j9682o051J3669l8111
$$ 58802 33965 -44478 22124 35475 39984 22220 -12594 -12597 25479 5797 -254 13415 -24696
83b4696m2759L4252K6572l192j1075k3781J2248O4718l652n5012L718K9736K076
$$ -24696 -67455 -33203 -6631 -9823 -20898 -44679 -32431 32287 28635 -26377 -22659 7077 9153
96I153O391k098l789J5919n551j4126K7907L638m8846j2070K9667P868o079j9935
$$ 9153 15544 13446 9657 25576 20025 5899 33806 37444 -11402 -23472 6195 14063 7984 -11951
110a1951k0155K8262K5723l6014j8389K3926j260j0611R547L278R863P031k0893
$$ -11951 -32106 -3844 21879 -14135 -32524 -8598 -9858 -20469 -10922 -7644 2219 9250 -11643
123a1643O197L7535j2978l5935J2480K2306m79m407j2651n02K4214o126k9592
$$ -11643 -5446 32089 19111 -16824 -4344 17962 17483 13076 425 -77 24137 18011 -11581
136a1581P130J1351j7376n614Q485M034M920j0770j4710J9993J4852k5373j0955
$$ -11581 -4451 6900 -10476 -16090 -7605 -3571 1349 -9421 -24131 -4138 10714 -14659 -25614
149b5614K0622J0449m51k852k278J3815P628j9598l995J9241l501j5658M614Q467
$$ -25614 -4992 5457 5006 2154 -124 13691 21319 1721 -2274 16967 13466 -2192 2422 10889
163A0889L662m735j8408j474J7537q718k2535P018J4169j724l593k900M533J1397
$$ 10889 14551 9816 -8592 -10066 7471 -1247 -23782 -16764 -2595 -4319 -7912 -10812 -6279 5118
177E118q479j3575J4491J3433j0873l790J1229P897J933r593r558J0920O178j7365
$$ 5118 -3361 -16936 -2445 10988 115 -3675 7554 15451 17384 7791 -1767 9153 15331 -2034
191b034n974J2549J968o261l732j439N950j121j6272n90J5559j714j0272N707
$$ -2034 -8008 4541 6509 248 -3484 -4923 1027 -94 -16366 -16956 -1397 -3111 -13383 -7676
205g676R472L789k146q020K589J1829n080j1252Q892J0316l751m141L24K971K360
$$ -7676 1796 5585 3439 -4581 -1992 9837 4757 -6495 2397 12713 8962 4821 5145 8116 10476
220A0476j0347j0304Q435O279j0447m347Q509L864k297o558l323P411K421j0589
$$ 10476 129 -10175 -1740 4539 -5908 -10255 -1746 2118 -179 -6737 -10060 -2649 -228 -10817
234a0817L30J2872K502m397N78L899M461k385r928J466J0285l060q042M305O086
$$ -10817 -10487 2385 4887 490 1068 4967 9428 7043 -2885 -1419 8866 5806 -2236 2069 8155
249H155j377m749n555J153M480o867p794O901P191m710l065L040L615N82n345
$$ 8155 6778 2029 -3526 -2373 2107 -4760 -12554 -5653 1538 -3172 -6237 -3197 418 1000 -4345
264d345l942P763N105n908o11Q035L162l744l362j91M072j174q043M03P569l94
$$ -4345 -8287 -524 4581 -1327 -1938 6097 9259 5515 2153 1962 6034 4860 -3183 -2780 4789 4395
280D395o223n61L422J39m411n431K201N766k531m174M720N454j316l145m96L662
$$ 4395 -1828 -2389 1033 1172 -3239 -8670 -6469 -703 -3234 -7408 -2688 2766 1450 -1695 -2191 1471
296A471K281m087k129N860M406l915k704K593J678k183m826j306M014R71n175
$$ 1471 3752 -335 -2464 3396 7802 3887 1183 3776 5454 3271 -1555 -2861 1153 2124 -3051
311c051r73M955M75m788k031K002K301j966k642K407N544l4l653J231L796m4l494
$$ -3051 -4024 931 1406 -3382 -5413 -3411 -1110 -3076 -5718 -3311 2233 2199 -1454 -223 3573 3529 35
328C5q81L180K635k299k282K372K505k635m533j78K493o11l396l06L815J026l054
$$ 35 -846 2334 4969 2670 388 2760 5265 2630 -1903 -2081 412 -199 -3595 -3901 -86 940 -2114
345b114k094K376J778k552k288K416M203J57j982J086L412l3l308j858K651R57
$$ -2114 -4208 -1832 -54 -2606 -4894 -2478 1725 1882 -100 986 4398 4365 1057 -801 1850 2807
361B807k096j116K497J739j548l095n92J695j130m075K50L537O48j604m9K058
$$ 2807 711 -405 2092 3831 2283 -812 -1404 291 -839 -4914 -4664 -1127 -479 -2083 -2132 -74
377g4J568j892k881J289L079q32j646K805K784j6j864r19P01O17k977k723L139
$$ -74 1494 -398 -3279 -1990 1089 257 -1389 1416 4200 4184 2320 1401 2102 2719 -258 -2981 158
394A58J572j477j035R73Q33q10l136j288K566N84k183J033L091P38p19j388Q78
$$ 158 1730 253 -782 191 1024 214 -2922 -4210 -1644 -1060 -3243 -2210 881 1619 900 -488 390
411C90J060m15k897J219L640p23j225P83Q86o9j443k793K92K011j890j963K889
$$ 390 1450 1035 -1862 -643 2997 2274 1049 1832 2718 2649 1206 -1587 -1295 716 -1174 -3137 -248
428b48J150j194o82l57L74O04j802j656L504J383j451M57J865L47m45j461j106
$$ -248 902 -292 -974 -1331 -957 -353 -2155 -3811 -307 1076 -375 82 1947 2294 1849 388 -718
445g18K091K07k573J115K573o37j247m8o32K89q27l003R43K755j175j368J858
$$ -718 1373 1580 -993 122 2695 2058 811 763 131 420 -407 -3410 -2467 288 -887 -2255 -397
462c97N30j98n92j321O77K159r89j643L095J569k038L73L43o02Q13j600j610K252
$$ -397 133 -65 -657 -1978 -1301 858 -131 -1774 1321 2890 852 1225 1568 966 1779 179 -1431 821
480H21J002k419J43J250o66q29q22r09J477Q10k428R02K459q12q77R09n5O55N5
$$ 821 1823 -596 -453 797 131 -698 -1520 -2429 -952 -142 -2570 -1668 791 -21 -898 11 -44 611 666
499F66j259J042K176j387j368J721m4j275K01j051k1J853j350j721K088K10k197
$$ 666 -593 449 2625 1238 -130 1591 1547 272 473 -578 -599 1254 -96 -1817 271 481 -1716
516a716L34O15q09J027k82j008J964J241k161M24J920j080j25K34l69P04R36j667
$$ -1716 -1382 -767 -1576 -549 -831 -1839 125 1366 -795 -371 1549 469 344 578 209 913 1849 182
534A82J53K109j609j420R84q04k51M23p96k14K016q58j599J533M4j640O68J67
$$ 182 335 2444 835 -585 399 -405 -656 -233 -1029 -1243 773 -85 -1684 -151 -107 -1747 -1079 -912
552i12P0J598k94q20J796L16j724J03P06p77M92K91j320J572P58j998n8Q29j502
$$ -912 -842 756 462 -358 1438 1754 30 133 839 62 554 845 -475 1097 1855 -143 -201 628 -874
571h74m76L91n38L03J467j159J42J692j155r81Q39k71l27J286l16Q4J615k4j393
$$ -874 -1350 -959 -1497 -1194 273 -886 -744 948 -207 -1188 -349 -620 -947 339 23 107 1722 1698 305
590C05Q53j44j568O73%l78Q65J3j298J034J57j328j75N38r36L02R38o97P83J050
$$ 305 1158 1014 -554 119 119 -259 606 619 -679 355 512 -816 -991 -453 -1389 -1087 -149 -846 -63 987
610I87j008K7N78n54k55N51p18O34J018o31j81R38p29p97K89m60o81R71l27m38
$$ 987 -21 6 584 30 -225 326 -392 242 1260 629 448 1386 657 -140 149 -311 -992 -21 -348 -786
630g86J159j77p92M66j43o11N10j07J14O45N82o40L74O97r88N4K36o90M63M66
$$ -786 373 196 -596 -130 -273 -884 -374 -481 -367 278 860 220 594 1291 303 357 593 -97 366 832
650H32o29M01L94q17l56N26p70l18O60o34K97K68k54l30N78o2m90O48J23m33O39
$$ 832 203 604 998 181 -175 351 -419 -737 -77 -711 -414 -146 -400 -730 -152 -214 -704 -56 67 -366 273
671B73k1l41J029k2o09J27L01n01J15P2o08O51j15q91K64L19q11q7O47m77J91
$$ 273 252 -89 940 918 309 436 737 236 351 423 -185 466 351 -540 -276 43 -768 -855 -208 -685 -494
692d94N91o95M28L86p06J35P17n67K6O71k84J92P94p10n65P06j78m77K03j53k59
$$ -494 97 -598 -170 216 -490 -355 362 -205 -179 492 208 400 1194 484 -81 625 447 -30 173 20 -239
713b39M54k36k82J59J24p68R8K03k96L71L80j39L82L46p73J23K54k29N7M09k12
$$ -239 215 -21 -303 -144 -20 -788 -690 -487 -783 -412 -32 -171 211 557 -216 -93 161 -68 -11 398 186
734A86L46L27n54M5K68l18m75j79l1m5L43k70j49O12k99n56M76J0n80N23J81p4
$$ 186 532 859 305 350 618 300 -175 -354 -385 -430 -87 -357 -506 106 -193 -749 -273 -263 -843 -320 -139 -213
756b13N19L70l42J89R9o05JJ3J10O5L37m63J34L93o70k69j2K6k94J93M0J63M03
$$ -213 306 676 334 523 622 17 18 31 141 206 543 80 214 607 -63 -332 -344 -318 -612 -419 -379 -216 187
779A87j35l82P03n02k18Q1J38L3N24N9J29L3l9o51K28J79j71q9m08K31K13j52
$$ 187 52 -330 373 -129 -347 -266 -128 -95 429 488 617 650 611 -40 188 367 196 107 -301 -70 143 -9
801ik12r1J97k55k95J84R7K47J10j68K94K39k08l29J04K27k17J89K34l29M41k1
$$ -9 -221 -312 -115 -370 -665 -481 -384 -137 -27 -195 99 338 130 -199 -95 132 -85 104 338 9 450 429
823D29j18N4o7m58l27K22k4j78L01k42K83J91l53p5K42j72qJ19J28M33j67Q8k2
$$ 429 311 365 298 -160 -487 -265 -289 -467 -166 -408 -125 66 -287 -362 -120 -292 -300 -181 -53 380 213 301 279
846B79J28j16j27J38n2j9k8j00j39K47%o42J60J28o7k37J24j05N12k03q2k5%K10
$$ 279 407 291 164 302 250 231 203 103 -36 211 211 -431 -271 -143 -210 -447 -323 -428 84 -119 -201 -226 -226 -16
870a6k0k4L81J96m03p2J78j3m4J26j84J58m14J01o3K74L5k39j29k49K22n8j76
$$ -16 -36 -60 321 517 114 42 220 207 163 289 105 263 -151 -50 -113 161 196 -43 -172 -421 -199 -257 -433
893d33N95k78n6M1j25L00O8r4n5K14L29m44J25L13p6l43J88k39P6p2j46J15J72
$$ -433 162 -116 -172 -131 -256 44 112 18 -37 177 506 62 187 500 424 81 269 30 106 34 -112 3 175
916A75k35q5j1j66r5K49j8k5K83j59K43mJ34l54j0M6L1P2J75l1q3o1L41m5l0n42
$$ 175 -60 -145 -156 -322 -417 -168 -186 -211 72 -87 156 152 286 -68 -78 -32 -1 71 246 215 132 71 412 367 337 -205
942b05Q3j60n7K80J40j07N3j51l5n9J50k50K59K25k42J72J99K05l08J52m48J26
$$ -205 -122 -282 -339 -59 81 -26 27 -124 -159 -218 -68 -318 -59 166 -76 96 295 500 192 344 -104 22
964B2J2j22J9M27j90l1k9j69n3m2Q3k95L79j33n18O27n9M7j95J94o5rJ31J16m06
$$ 22 34 -88 -69 358 168 137 108 -61 -114 -156 -73 -368 11 -122 -640 -13 -72 -25 -220 -26 -91 -100 31 147 -259
989b59P03l36j62L13J63j18j21k03j12N5j19j91L99R6j70l6k82L62Q4n55k52O31
$$ -259 444 108 -54 259 422 304 183 -20 -132 -77 -196 -387 12 108 -62 -98 -380 -18 66 -489 -741 -110
1011a10L96l74Q7K14j4j36J98k99M03j19l86L54p3O6j43J45l24J13L58q48K67
$$ -110 286 -88 -1 213 199 63 261 -38 365 246 -140 214 141 207 64 209 -115 -2 356 -492 -225
1032b25j26J70L2J75J72m1k27k95K18K87O5m49L39J85j66KJ70k02p5K21r9j9J62
$$ -225 -351 -181 -149 26 198 157 -70 -365 -147 140 205 -244 95 280 114 116 286 84 9 230 131 112 274
1055B74j69l6K13j55j27R1p67O37R5k71L4J44j32q3M53j88K01j15k30J25M15j85
$$ 274 105 69 282 127 0 91 -676 -39 56 -215 -181 -37 -169 -252 201 13 214 99 -131 -6 409 224
1077B24m2j61J5jJ97k70L19k40k77J53K6J82m0Lj61k31J24J93j21L57j07k7k46
$$ 224 182 21 36 35 232 -38 281 41 -236 -83 -57 125 85 88 -73 -304 -180 13 -108 249 142 115 -131
1100a31K21l31K93K07j97J90L5k37l9N9J00j76mkj5J21n8k16L67j33j86K41j67
$$ -131 90 -241 52 259 62 252 287 50 11 70 170 -6 -10 -12 -27 94 36 -180 187 54 -132 109 -58
1123e8p4J45k2q1J63J68k54R5K73k79J53k67j0N9L7P2p1L55l46n2k15p8J22K07
$$ -58 -132 13 -9 -90 73 241 -13 82 355 76 229 -38 -48 11 48 120 49 404 58 6 -209 -287 -165 42
1147D2q5M6J61l44K55K07k25Pl48J89L8J65k08J00L84q9o1k47M4j82M9J83p9M8
$$ 42 -43 3 164 -180 75 282 57 64 -284 -95 -57 108 -100 0 384 295 234 -13 31 -151 -102 81 2 50
1171E0N1n0N2j55q2r8n5q2M60k35m6K55J31r9jM3l81J67Q4k12L70J67o8o4l1n
$$ 50 101 51 103 -52 -134 -232 -287 -369 91 -144 -190 65 196 97 96 139 -242 -75 9 -203 167 334 266 202 171 166
1197A66j72Q4l59L23M6Nl42R2R0k22L71k10j14L52k15j24K50lK6J30o1N4k98K92
$$ 166 -6 78 -281 42 88 93 -249 -157 -67 -289 82 -128 -242 110 -105 -229 21 18 44 174 113 167 -131 161
1221A61Mk01K03j74M2J2m2Q7J7m07L04j52J10Q4r5O2j71L12r3j1K70l41K5K36
$$ 161 165 -36 167 -7 35 47 5 92 109 -298 6 -146 -36 48 -47 15 -156 156 63 52 322 -19 6 242
1245B42j62q3o1O9M1q6o1n2L14k01k5j72K57q1j13M30l49J05j94P2l7J83J58o88
$$ 242 80 -3 -64 5 46 -40 -101 -153 161 -40 -65 -237 20 -61 -174 256 -93 12 -182 -110 -147 36 194 -494
1269d94M21Q8p9M7Q2k03M98m50K37J25k57k32J81J23J04l67L19k02K14j46k1m9
$$ -494 -73 15 -64 -17 65 -138 360 -90 147 272 15 -217 -36 87 191 -176 143 -59 155 9 -12 -61
1291f1L6J53k33j13J02R2l9r5J09J28k25Q8p2L72K08o18K27k27J57L52l99K8k3
$$ -61 -25 128 -105 -218 -116 -24 -63 -158 -49 79 -146 -58 -130 242 450 -168 59 -168 -11 341 -58 -30 -53
1314e3J50N8k48J08q3k79L87J25k05J24j74j87N71n48N47k25P7k05l1k23N79j88
$$ -53 97 155 -93 15 -68 -347 40 165 -40 84 -90 -277 294 -254 293 68 145 -60 -91 -314 265 77
1336G7r4Q5L3m7J47m38M40k60O9K6j77K86l49N2P3J18k47O4j50L18j49L0L30l50
$$ 77 -17 68 101 54 201 -237 203 -57 12 38 -139 147 -202 -150 -77 41 -206 -142 -292 26 -123 -93 237 -113
1360a13q9N09k73mK12l11l6J25k23J55K08j17k72J61J62q4l6p1m7J35k78L42r5
$$ -113 -202 307 34 30 242 -69 -105 20 -203 -48 160 43 -229 -68 94 10 -26 -97 -144 -9 -287 55 -40
1383d0J52l4m8l6J5N3R9j64n2M8M7P4J19k96J15o1k1P2J30j62j95Q7N4L0J46l51
$$ -40 112 78 30 -6 9 62 161 -3 -55 -7 40 114 233 -63 52 -9 -30 42 172 10 -185 -98 -44 -14 132 -219
1409b19M78k75P7l7K1qJ99k52J83j34j73K36j0l7K97o20K44j2n8J35n8R1o6J7
$$ -219 259 -16 61 24 45 37 236 -16 167 33 -140 96 86 49 346 -274 -30 -42 -100 35 -23 68 2 19
1433A9l67L20K73j21j02K6O9l71P3L9K31j55K62j45l5p5K6k93M70j10M07k93m6
$$ 19 -348 -28 245 124 22 48 117 -254 -181 -142 89 -66 196 51 16 -59 -33 -326 144 34 441 148 102
1456A02K5k04Q6k18K44J26k12L28m92K15m8rJ88j37P2M2l33L44j75J62j20J31
$$ 102 127 -77 9 -209 35 161 -51 277 -215 0 -48 -57 131 -6 66 108 -225 119 -56 106 -14 117
1478A17j70K05m0J18k22j47M8J97k37J55j10j02L58m4l92K57q6J9R0o2R6n7Q0
$$ 117 -53 152 112 230 8 -139 -91 106 -131 24 -86 -188 170 126 -266 -9 -95 -76 14 -48 48 -9 71
1501G1K2K37m62J54rJ00j09o6K60l97N07n2k02K45k53j54Q3j19R8j0K8J8Q4m5
$$ 71 93 330 -132 22 13 113 4 -62 198 -199 308 256 54 299 46 -108 -25 -144 -46 -56 -28 -10 74 29
1525B9j49K81k00j65J38K9j39K36l5k04K41k12R8Q8n0J4J56K3j74J0L0J10k05
$$ 29 -120 161 -39 -204 -66 -37 -176 60 25 -179 62 -150 -52 36 -14 0 156 179 5 15 45 155 -50
1548e0K83k95j57M22k40p3l3J47rj03N7J27r3q3J27N3j75R2J49l45K41j08p9K05
$$ -50 233 -62 -219 203 -37 -110 -143 4 -5 -108 -51 76 -17 -100 27 80 -95 -3 146 -199 42 -66 -145 60
1572F0j35K5J2j0j06L39j94j57J53P2K9o4NM6j47m3L01j14r3N1rJ68k40j0J97
$$ 60 -75 -50 -38 -48 -154 185 -9 -166 -13 59 88 24 29 75 -72 -115 186 72 -21 30 21 189 -51 -61 136
1597A36j28M2j04L00l38pj03K66P1j53o8Q7j37J66J36j66K17k98J80k27J29m1
$$ 136 8 50 -54 246 -92 -99 -202 64 135 -18 -86 1 -136 30 166 0 217 -81 99 -128 1 -40
1619d0p4M4ok7M53l36k05L34P0k65J46r9J23m23K21j22J03K69l61J2K42l1j47
$$ -40 -114 -70 -76 -103 350 14 -191 143 213 -52 94 -5 118 -305 -84 -206 -103 166 -195 -183 59 28 -119
1642a19nJ68j93K01J04k49J02J25k52j9L55N7j98K07n9r9q7l07K97o4p8J61J13
$$ -119 -124 44 -149 52 156 -93 9 134 -118 -137 218 275 77 284 225 126 39 -268 29 -35 -113 48 161
1665A61m01J83j26K78O0o6J31j86j43K6J39k02K83l11J19K0L5j80K40P0j30J52
$$ 161 -240 -57 -183 95 155 89 220 34 -109 -83 56 -146 137 -174 -55 -35 0 -180 60 130 0 152
1687A52o6j42k0K84j03j6j79J81j38k76j0j2M64J66k02lL4m7l24M12j60j6L1l2
$$ 152 86 -56 -76 208 105 89 -90 91 -47 -323 -333 -345 119 285 83 80 114 67 -257 155 -5 -21 10 -22
1711b2Oj51N43l79J48j27P9k85J49Q8K05k86j70k2j13J06J80j5P1k21K69j76J60
$$ -22 -16 -167 376 -3 145 18 97 -188 -39 49 254 -32 -202 -224 -337 -231 -51 -66 5 -216 53 -123 37
1734C7N8r1Pj86J36J52k09J04q1J02k04J50M53k40j90J29j51k7J75l93K5K95n1
$$ 37 95 4 11 -175 -39 113 -96 8 -73 29 -175 -25 428 188 -2 127 -24 -51 124 -269 -244 51 0
1757@J81r4l58M07j96P2O8o3Q7j29K4n2K18o2r0K78k17n3l61O62k58lqj67K26
$$ 0 181 87 -271 136 -60 12 80 17 104 -25 -1 -53 165 103 13 291 74 21 -340 322 64 61 53 -114 112
1782A12j21j06J16Q4p8n3Q5J29j49M8j02K8q2N1P9q4J09J35N2m34J79J55n5j91
$$ 112 -9 -115 1 85 7 -46 39 168 19 67 -35 -7 -89 -38 41 -43 66 201 253 -181 -2 153 98 -93
1806i3M7J4m9j46K16j18j08L33k21L26k31J03k69rK20l8k26K24k8j8K82m07K77
$$ -93 -46 -32 -81 -227 -11 -129 -237 96 -125 201 -30 73 -196 -205 15 -23 -249 -25 -53 -71 211 -196 81
1829H1j78l89P07o3l6J73j99nj46R0j99J52J93n2j3l5k50J10K0l20K29K53p6J45
$$ 81 -97 -486 221 158 122 295 96 91 -55 35 -164 -12 181 129 116 81 -169 -59 -39 -359 -130 123 47 192
1853A92j90K54j56k82J90k50R5L27j89mK31j09l03J36j23J1J69j76L68o9p1j53
$$ 192 2 256 100 -182 8 -242 -147 180 -9 -13 218 109 -194 -58 -181 -170 -1 -177 191 122 51 -102
1875a02j3J25j32J02L0m0K2J3J03j53J60j28K32l21JK50k26K67p5k37J52k0M1
$$ -102 -115 10 -122 -20 10 -30 -8 5 108 -45 115 -13 219 -102 -101 149 -77 190 115 -122 30 10 51
1898E1J16k12J23j11K91k82nJ46j23l7K4j9j2K80j19k49M3J14J00o4L8J07j90
$$ 51 167 -45 78 -33 258 -24 -29 117 -6 -43 -19 -38 -50 230 111 -138 -95 19 119 55 93 200 10
1921A0j33J71J55k37K04j96n9Q2M2p9p8K11p2P1L2n7J56j06J38m26K54n1P8j48
$$ 10 -123 48 203 -34 170 -26 -85 -3 39 -40 -118 93 21 92 124 67 223 117 255 -171 83 32 110 -38
1945c8mN5K30j51J35k13l6m5j5Q3j55l9J63J38k88M15k94m8J42o0J93l25J87k50
$$ -38 -42 13 243 92 227 14 -22 -67 -82 1 -154 -193 -30 108 -180 235 -59 -107 35 -25 168 -157 30 -220
1969b20N33r6m0k57L5j9K39j48j50K48j30J6j72R4J0J87l87K83J47j11J75k71
$$ -220 313 217 177 -80 -45 -64 175 27 -123 125 -5 11 -161 -67 -57 130 -257 26 173 62 237 -34
1991c4o7O2j06L76J2k07k60J78j4mK58m16L87m2j82P1j4n5o3K56l05K81J3k18
$$ -34 -101 -39 -145 231 243 36 -224 -46 -60 -64 194 -222 165 123 -59 12 -2 -57 -120 136 -169 112 125 -93
2015i3J2L8J38K40n33M3K14j8k42J82K64j01l53M37j00l70L42k20J5L93m31J09
$$ -93 -81 -43 95 335 -198 -155 59 41 -201 -19 245 144 -209 228 128 -242 100 -120 -105 288 -143 -34
2037c4K16k27J01Q1l87L60P1k4k12j33J22L26l11J38O0j06J5l6J25l58L4O0K95
$$ -34 182 -45 56 137 -250 110 181 157 -55 -188 -66 260 -51 87 147 41 56 20 145 -213 -179 -119 176
2060A76k81m7J2K18j46J58l44K90K7Q1j68J79j43j55K61j44j59L23k89J11j0J07
$$ 176 -105 -152 -140 78 -68 90 -254 36 63 144 -24 155 12 -143 118 -26 -185 138 -151 -40 -50 57
2082E7R7m6j82m5K43k02q8K09j96K31j80K17M2j50R1j26j59J43Rj79L00j00j40
$$ 57 154 108 -74 -119 124 -78 -166 43 -153 78 -102 115 157 7 98 -28 -187 -44 -35 -214 86 -14 -154
2105a54J59O2mq2j34qK6K82m4j72m0nm7Q2n1N0k0J05o0k6Q3n4J3K16k69K21j9
$$ -154 5 67 63 -19 -153 -161 -135 147 103 -69 -109 -114 -161 -79 -130 -80 -100 5 -55 -81 2 -52 -39 177 -92 129 110
2132A10j92Q3n8j00O8pP2P9n0j22j4K68k31K81k99K53j02L19k97j50J97k1l69
$$ 110 -82 1 -57 -157 -89 -96 -24 55 5 -117 -131 137 -94 187 -112 141 39 358 61 -89 108 87 -282
2155b82L22k16M9K00J2j96J0J92j98K5q0K49k18l4L69m40M07j02Pj69J47j28j19
$$ -282 40 -176 -127 73 85 -111 -101 91 -107 -82 -162 87 -131 -165 204 -236 171 69 76 -93 54 -74 -193
2178a93L89k27M29p94M24p5o3J4L58O0l29K21k34P2oj13K41m08J94J28j78k24
$$ -193 196 -31 398 -396 28 -47 -110 -96 262 322 -7 214 -20 52 46 -67 174 -234 -40 88 -90 -314
2200c14K46Q3k0l9j95J09M5j69K92l7N4j31O8j72NK73j92k4J54J46l89K34K58
$$ -314 -68 15 -5 -44 -239 -130 -85 -254 38 1 55 -76 -8 -180 -175 98 -94 -118 36 182 -207 27 285
2223B85k60O0j9n5K4j11K9q2K70j10K71k61N5o8j33J50J9R8k04j25J9j28L19m3
$$ 285 25 85 66 11 35 -76 -47 -129 141 31 302 41 96 28 -105 45 64 162 -42 -167 -148 -276 43 0
2247@n1J28n1l0j07J95q4O4k69O4M42l41P3J6j83L75k66n6K38K9k01l7N8n3K69
$$ 0 -51 77 26 -4 -111 84 0 64 -205 -141 301 -40 33 49 -134 241 -25 -81 157 186 -15 -52 6 -47 222
2272B22j67j34J70J14k81L2o9nK42k20k5J83j47j29J82K10l02L2M4j03P6O4j54
$$ 222 55 -79 91 205 -76 -44 -113 -118 124 -96 -121 62 -85 -214 -32 178 -124 -92 -48 -151 -75 -11 -165
2295a65K25n2J22k57L24k9K2m33J05j3J42j30M4M07k44j00j94l8O6L0r3L2K68
$$ -165 60 8 130 -127 197 168 190 -243 -138 -151 -9 -139 -95 312 68 -32 -226 -264 -198 -168 -261 -229 39
2318C9K9om5m0L29k94j6N6J88j67k01M5j0J0R2K29l57L55k27j0J7J30l28J31J69
$$ 39 68 62 17 -23 306 12 -4 52 240 73 -128 -83 -93 -83 9 238 -119 236 9 -1 16 146 -182 -51 118
2343A18j49j4n2J27P9k53P6j1J80O6k00r4K20j17o5N6l6q4R0J02J73l22J63O7
$$ 118 -31 -45 -97 30 109 -144 -68 -79 101 167 -33 -127 93 -24 -89 -33 -69 -153 -63 39 212 -110 53 120
2367A20q7k06L33M2K2k16J1n2j28M8L16j79o4O6J48j37J5q3J48l85L93j25L3k1
$$ 120 33 -173 160 202 224 8 19 -33 -161 -113 203 24 -40 26 174 37 52 -31 117 -268 125 0 33 12
2391A2o6j40N1J17j76K64K0j47o2J19k02M35n7k14q3J20P4j9k4n7j03J03J30R9
$$ 12 -54 -194 -143 -26 -202 62 82 -65 -127 -8 -210 225 168 -46 -129 -9 65 46 22 -35 -138 -35 95 194
2415A94k40J9J00j03K4m2O0J58k68L5J08J24l18R3n2K60j51O1j28K0J93j31L5
$$ 194 -46 -27 73 -30 -6 -48 12 170 -98 -63 45 169 -149 -56 -108 152 1 62 -66 -46 147 16 51
2438E1j14P7j84J3J02oJ61J03k20M3J16L9k92K09L1l57J49J48j42j65K26p9J34
$$ 51 -63 14 -170 -157 -55 -61 100 203 -17 26 142 181 -111 98 129 -228 -79 69 -73 -238 -12 -91 43
2461D3r1k00K49j92J00L62o8l08J19j9J61l42J01N1J63j74%j23K09j18O4N8k21
$$ 43 -48 -248 1 -191 -91 271 203 -105 14 -5 156 -186 -85 -34 129 -45 -45 -168 41 -77 -13 45 -176
2484a76M48J3l16J23j01Mk4m2J65j17J21l02J52K18j30J34m27L84r1k2j2J43k39
$$ -176 272 285 -31 92 -9 -5 -29 -71 94 -23 98 -204 -52 166 36 170 -257 127 36 14 2 145 -94
2507i4R8J2oP4j07o4K44j38j81K98j57m7j8K3J6Q3Lj86r8M38l7k73K73l02J14
$$ -94 4 16 10 84 -23 -87 157 19 -162 136 -21 -68 -86 -63 -47 36 39 -147 -245 193 156 -117 156 -146 -32
2532c2k4J12K04l88o1K32L7l0J77k35N6j59L09j66j23Q8K5k20L81j28M5j65N9
$$ -32 -56 56 260 -128 -189 43 80 50 227 -8 48 -111 198 32 -91 -3 22 -198 183 55 100 -65 -6
2555fl24K54K48j70J05L7Ko7j37J94k25p9K46K33j94N0k29J11j45pL46k75p5k5
$$ -6 -330 -76 172 2 107 144 146 79 -58 136 -89 -168 78 311 117 167 -62 49 -96 -103 243 -32 -107 -132
2579a32J80l34K40J13j02m0O6J00j5j98K99l78K40j54j2O7J46nj80L04k66J6j28
$$ -132 48 -286 -46 67 -35 -75 -9 91 76 -122 177 -201 39 -115 -127 -60 86 81 -99 205 -61 -45 -173
2602a73J67K04l76J04J36m0%P0k72j8n0R6p6J54j7M3q1M38m24J09l0L43k01k52
$$ -173 -6 198 -178 -74 62 22 22 92 -180 -198 -248 -152 -228 -74 -91 -48 -129 309 -115 -6 -36 307 106 -146
2626a46J0K79K1l3j6j97L9j78O26l74K16k59jK6K31o29J39N11j51j79j86J53k38
$$ -146 -136 143 164 131 115 -82 -43 -221 405 31 247 -12 -13 13 244 -385 -246 265 114 -65 -251 -98 -336
2649c36N61l73L15k73J86l03M54k97q2J3N3L28k70K0J69l53K14j04K59j86M5J48
$$ -336 225 -148 167 -106 80 -223 231 -66 -148 -135 -82 246 -24 -4 165 -188 26 -78 181 -5 40 188
2671A88m26Q8K30q6J26J38l0j05j87M2M3n5j86K58o3k35J9J67Q4p8P9k82J83J55
$$ 188 -238 -150 80 -6 120 258 228 123 -64 -22 21 -34 -220 38 -25 -260 -241 -74 10 -68 11 -271 -88 67
2695F7q2L2k07L35l9m5j56J88N8l07L01k90K05M1j57m8K38k14J51k23Q2J68l72
$$ 67 -15 17 -190 145 106 61 -95 93 151 -156 145 -145 60 101 -56 -104 134 -80 71 -152 -70 98 -274
2718b74L53j22r7J52q3J84j63p3o5M43q1l47K14k4K32l19J48N7j65K22nl25L92
$$ -274 79 -43 -140 12 -71 113 -50 -123 -188 255 174 -173 41 17 249 -70 78 135 -30 192 187 -138 254
2741B54j86M4l71M6K59l21K02J71k00J82k04l2j54N08l24K03j1j61K41k05j60
$$ 254 68 112 -259 -213 46 -275 -73 98 -102 80 -124 -156 -310 198 -126 77 66 -95 146 -59 -219
2762b19J00L6K09l11K38j5j23r7P5O7l7M3jK7j13K37l09K09Qr0lr4Q1J87j51K79
$$ -219 -119 -83 126 -185 53 38 -85 -182 -107 -40 -77 -34 -35 -8 -121 116 -193 16 24 -66 -69 -163 -82 105 -46 233
2788B33K4j09j82J96j50j47K24K7k59lJ63K2k19K73k40K27M3j16J53l29K28l24
$$ 233 257 148 -34 162 12 -135 89 116 -143 -146 17 39 -180 93 -147 80 123 7 160 -169 59 -265
2810b65J16p3K85k13J96K09j45j11J15KO5k39J02k0q8n7P8p8p3L0M4k21M57RQ6
$$ -265 -149 -222 63 -150 46 255 110 -1 114 116 181 -58 44 24 -64 -121 -43 -121 -194 -164 -120 -341 116 125 211
2835B11j69n4K49k29p1j7K30k17J4R6J81l93k0J20k7r9O4J17L2Q4m4J34j22j72
$$ 211 42 -12 237 8 -63 -80 150 -67 -53 43 224 -169 -189 -69 -96 -195 -131 -14 18 102 58 192 70 -102
2859a02O3NK49Lk12N2j24L76m47K01l25L81R0Q2m35M6J79O6k87L41k42Q1j3J79
$$ -102 -39 -34 215 218 6 58 -66 310 -137 64 -261 120 210 292 -143 -97 82 148 -139 202 -40 41 28 207
2883B07k08n1R4m5Q5o8j87O3M18j71k7J30k82R1j0n1l7j44L13l77L41J60l55J10
$$ 207 -1 -52 42 -3 82 14 -173 -110 308 137 110 240 -42 49 39 -12 -49 -193 120 -257 84 244 -111 -1
2907aj29L7J1K62j14k53J00j15M14k13m4J74N5j91R3R7m8J3k75K28k20K20j65
$$ -1 -130 -93 -82 180 66 -187 -87 -202 212 -1 -45 129 184 -7 86 183 135 148 -127 101 -119 101 -64
2930f4M8k15J93J22j12K55l88K52Ol8P7q4K60n07R3K70m89J18L73r6j8j80J98
$$ -64 -16 -231 -38 84 -28 227 -161 91 97 59 136 52 312 -195 -102 168 -321 -203 170 74 56 -124 74
2953G4k3l01K78J80l03J2l1K5o8K34lN7j64Kj15J53p2Q9M5n6Lk08q6K49K09l02
$$ 74 51 -250 28 208 -95 -83 -114 -89 -157 77 74 131 -33 -31 -146 7 -65 24 69 13 16 -192 -278 -29 180 -122
2979a22N3N8J65q8N1k07PK81Lk58N1J96k80K31k38N6J92k19q3J0o3K06k9K18k16
$$ -122 -69 -11 154 66 117 -90 -83 198 201 -57 -6 190 -90 141 -97 -41 151 -68 -151 -141 -204 2 -27 191 -25
3004b5k2J90J6j13M8j37Lj45L38o4o3r6K57l16J36j24NK64j24n7K4P0J6k75L90
$$ -25 -47 143 159 46 94 -43 -40 -185 153 89 26 -70 187 -129 7 -117 -112 152 28 -29 -5 65 81 -194 196
3029A96k96J66J53o5j66J07r6j02M6j67L75J76p49N67l01J99j88L29R6l24J87
$$ 196 -100 66 219 154 -12 95 -1 -103 -57 -224 151 327 -422 145 -156 43 -145 184 280 -44 143
3050A43k19R2R1p5L6N2l08J36j79o4L50l3p7k3J4K1K2j01j2L3J78j1j4k40L22
$$ 143 -76 16 107 32 68 120 -188 -52 -231 -295 55 22 -55 -78 -64 -43 -21 -122 -134 -101 77 66 52 -188 134
3075A34j93p4L22n21J78K08k15M83m58J66J16O6J5k12M9j01K31k66K4K16j18j32
$$ 134 -59 -133 189 -332 -154 54 -161 322 -136 30 146 212 227 15 64 -37 194 -72 -48 168 50 -82
3097h2p3q7J82L0Oj90M18k48jj58L09j59j91J64N6J09k17K69k24j85M46k81j01
$$ -82 -155 -242 -60 -30 -24 -214 204 -44 -45 -203 106 -53 -244 -80 -24 85 -132 137 -87 -272 174 -107 -208
3120b08J04N9j59M04l46j53M33j82J09jM0k69L3J50J45k64J67j38J08m5J47k21
$$ -208 -104 -45 -204 200 -146 -299 134 -48 61 60 100 -169 -136 14 159 -105 62 -76 32 -13 134 -87
3142h7J40n4j25P0J29LK1l1o1J49l84P1J25j52J31o3N4nj39J84J5J03j64J1J39
$$ -87 53 -1 -126 -56 73 76 97 66 5 154 -230 -159 -34 -186 -55 -118 -64 -69 -208 -24 -9 94 -70 -59 80
3167H0l6j95n4L53j80j60K54k59J50J46n0m91L6K88K4n7P5K37K7j14n7o6q1J09
$$ 80 44 -151 -205 148 -32 -192 62 -197 -47 99 49 -442 -406 -118 -94 -151 -76 161 188 74 17 -49 -130 -21
3191b1J88k3l6l72K50Q0j51j1J10p7K67J38k76j90K00n3J83j18j6K3O4k8j33j14
$$ -21 167 144 108 -264 -14 66 -85 -96 14 -63 204 342 66 -124 76 23 206 88 72 95 159 131 -2 -116
3215a16j69K29K34J49k94K8j64J15J52k38nM1Nk08L52m29M42o9J19j24p6q0O5
$$ -116 -285 -56 178 327 33 61 -103 12 164 -74 -79 -38 -33 -241 111 -318 124 55 174 50 -26 -106 -41
3238d1l1j33K31j26J80k67j20M49l23J25K4j85K95j15J04m6o3K64k69J73j1m0
$$ -41 -72 -205 26 -100 80 -187 -307 142 -181 -56 -32 -217 78 -37 67 21 -42 222 -47 126 115 75
3260G5J13l74J05j99K63k33O0J09m4O0p8M10k19k9Ok06M57k40M2J74k06o5p6k26
$$ 75 188 -186 -81 -280 -17 -250 -190 -81 -125 -65 -143 267 48 19 25 -181 276 36 78 252 46 -19 -95 -321
3284c21K06L08j97J72j75j03o2j00K39j49L30m11N7J93K55j40l0M5J00l6k49M
$$ -321 -115 193 -4 168 -7 -110 -172 -272 -33 -182 148 -263 -206 -13 242 102 72 117 217 181 -68 -64
3306f4n6K49l01M4L49j6l03J73k1l64K93p3K17L7l41mM4J16k9M6j09Rk6J68j93
$$ -64 -120 129 -172 -128 221 205 -98 75 54 -310 -17 -90 127 164 -177 -181 -137 -21 -50 -4 -113 -104 -130 38 -155
3331a55J74r1q6J75J58o8r3j93L28j51k17K27J23O6l51J38m7J58j78l45O54j69
$$ -155 19 -72 -158 17 175 107 14 -179 149 -2 -219 8 131 197 -154 -16 -63 95 -83 -428 226 57
3353E7j5n2m3L0j4L8J47m8m57L08Mq2p8L05k49J2J6L69k30J38k29J49k29M18k2
$$ 57 42 -10 -53 -23 -37 1 148 100 -357 -49 -45 -127 -205 100 -149 -137 -121 248 18 156 -73 76 -153 265 243
3378B43n4j65j33K06j25J9K1J31l0l16M17j00K6k93J10j4L22j88M2j80l6Q1M69
$$ 243 189 24 -109 97 -28 -9 12 143 113 -203 214 114 140 -153 -43 -57 265 77 119 -61 -97 -16 453
3401D53l74L7p1P2l78L24k37J83o7l2O8J30k0oj38J45l2M0J60j49l44K19%j43
$$ 453 79 116 45 117 -261 63 -174 9 -58 -90 -22 108 88 82 -56 89 57 97 257 108 -236 -17 -17 -160
3425a60M04j66j6j54K27j82J98k53J22k5K11l30Q9J82l26M42k70K2J49l14J17
$$ -160 244 78 62 -92 135 -47 151 -102 20 -5 206 -124 -35 147 -179 263 -7 15 164 -150 -33
3446c3L2k3l6J34p3J60l1m31L29p2J9O4Kk58J69R0l52L12j21O7J2j00K26L7r4
$$ -33 -1 -24 -60 74 1 161 130 -301 28 -44 -25 39 41 -217 -48 42 -310 2 -119 -52 -40 -140 86 123 29
3471B9n5K1P2k8j31J07j30M72m80K75J75m31J29n8N1j27L1l5M7J0O5k3n1J5K28
$$ 29 -26 -5 67 39 -92 15 -115 357 -123 152 327 -104 25 -33 18 -109 -78 -113 -66 -56 9 -14 -65 -50 178
3496A78l88L70q0oj80J40%j22R8q8k2j47L42K69m24j75L15j24J21J23k78L02j10
$$ 178 -210 160 80 74 -106 34 34 -88 10 -78 -100 -247 95 364 -60 -235 80 -44 77 200 -78 224 114
3519A14k64R2P7J22o0j72J8M7L39j75l17R0n5L4M0R0K43l28N0QK9J90k11J07J07
$$ 114 -150 -58 19 141 81 -91 -73 -26 313 138 -179 -89 -144 -110 -70 20 263 -65 -15 -7 22 212 1 108 215
3544B15L0o54M72q8n6J68j00k3R8k04K57J29j83l23R6J31j43L7l8L08j29q2KN3
$$ 215 245 -409 63 -25 -81 87 -13 -36 62 -142 115 244 61 -262 -166 -35 -178 -141 -179 129 0 -82 -80 -27
3568b7R6N2p0j05J30k45K82j06L3p6L8K57l83Q1nQ0J17O9k81K20n5k26R9K9M6
$$ -27 69 121 51 -54 76 -169 113 7 40 -36 2 259 -124 -43 -48 32 149 218 -63 157 102 -124 -25 4 50
3593E0k7k6k31K03RK24l82K04Q7j34m2j63K03j41Q0j93K67k43L26k25J58q1J47
$$ 50 23 -3 -234 -31 -22 202 -180 24 111 -23 -65 -228 -25 -166 -86 -279 -12 -255 71 -154 4 -77 70
3616G0k24K72k01K96k22J42l87L41k25J82j03O1jk93M21k31J89j23r1L10j34J03
$$ 70 -154 118 -83 213 -9 133 -254 87 -138 44 -59 2 1 -292 129 -102 87 -36 -127 183 49 152
3638A52J3j51q6R8n8l3R9j85K99l76l2J66R4k76K67RJ11j25j35J59k9j2K0K47
$$ 152 165 14 -72 26 -32 -65 34 -151 148 -228 -260 -94 0 -276 -9 0 111 -14 -149 10 -19 -31 -11 236
3662B36k36lQ3l46M00j39J59l64O7K34O8k20J43k20mK65pk42J64m1KN0K2j00r9
$$ 236 0 -3 80 -266 134 -5 154 -210 -143 91 159 -61 82 -138 -142 123 116 -126 38 -3 -1 49 71 -29 -128
3687a28L20p2j22L4J68k29k7N6m2j18K08J45j88k58L11j8K65l56L25n64L79m16
$$ -128 192 120 -2 32 200 -29 -56 0 -42 -160 48 193 5 -253 58 40 305 -51 274 -290 89 -327
3709c27J37L62qj71j7m2Q3q7K14j25K54l10J37n2J61p4k18L46k44Q4JN1k39M0
$$ -327 -190 172 164 -7 -24 -66 17 -70 144 19 273 -37 100 48 209 135 -83 263 19 103 104 155 -84 -44
3733d4n6J90j15lL25j44M7k43l2J43R5o7J11k83J67m6k81L47q4j63J46J22L5L7
$$ -44 -100 90 -25 -28 297 153 200 -43 -75 68 163 96 207 -76 91 45 -236 111 27 -136 10 132 167 204
3757B04k58l07K04J92J64m08R9J41j13q3l4L22o0k41J74j28M0J52P6Mk53K72k48
$$ 204 -54 -361 -157 35 199 -209 -110 31 -82 -165 -199 123 63 -178 -4 -132 -92 60 136 140 -113 159 -89
3780h9K20j20o2l3L75j63l63J95MJ36p3o3Mj61j1P0k8K75k29J59lp5j8j24L16
$$ -89 131 11 -51 -84 291 128 -235 -40 -36 100 27 -36 -32 -193 -204 -134 -162 113 -116 43 40 -35 -53 -177 139
3805A39k44J40j75L0J68j75J67j8l9j67l9K41qm8n6J65k16L43k40j46L1L71k66
$$ 139 -105 35 -140 -110 58 -117 50 32 -7 -174 -213 28 20 -28 -84 81 -135 208 -32 -178 -147 224 -42
3828d2J83o8l02L84N0j26lj15o3J36K7k9k05l8K08K01k7k81K5l9L43q8jJ1j05
$$ -42 141 73 -229 155 205 79 76 -39 -102 34 61 32 -173 -211 -3 198 171 -110 -85 -124 219 131 130 141 36
3853C6k14m8J96j14j89K43J96j55j3J06l7k44K68k4r7Rj7p6K57l6L9j26L14l74
$$ 36 -178 -226 -30 -144 -333 -90 106 -49 -62 44 7 -237 31 7 -90 -81 -98 -174 83 47 86 -40 274 -100
3877a00J9J41k39K43p5K42j35j11K6J9P7n8L2l34N45k86K08k38R2l4k00K10J08
$$ -100 -81 60 -179 64 -11 231 96 -15 11 30 107 49 81 -253 292 6 214 -24 68 34 -166 44 152
3900A52q9j41L30j70m83L80O2k3J16l43J48J16r2jj40L90m39K83j66n3K05j33
$$ 152 63 -78 252 82 -401 -21 41 18 134 -209 -61 55 -37 -38 -178 212 -227 56 -110 -163 42 -91
3922i1N6r2J12k0R7k8O7J14l05K56rj97J23j90N9m8J41n2J06r6q4J6J81j41lk28
$$ -91 -35 -127 -15 -35 62 34 101 215 -90 166 157 -40 83 -107 -48 -96 45 -7 99 3 -81 -65 116 -25 -28 -256
3948b56K29J50k43J86j03j14L13j20j6l15K79Q4k6j04jJ31j86L2m2J56l09K31
$$ -256 -27 123 -120 66 -37 -151 162 42 26 -289 -10 74 48 -56 -57 74 -112 -80 -122 34 -275 -44
3970d4r1K43k7l38K16P9n1LJ44j99N8j3L45l01O0k48M7K35k15J80j57K38M6p1
$$ -44 -135 108 81 -257 -41 38 -13 -10 134 -65 -7 -20 325 24 84 -164 -117 118 -97 83 -74 164 210 139
3994A39q2l1Q3q9k70L82J43l44K47k56J89J13k67K40l99K62n2J02n0q6Mk27L10
$$ 139 57 26 109 20 -250 132 275 -69 178 -78 111 224 -43 197 -202 60 8 110 60 -26 -22 -249 61
4017F1O7k36OJ19o7N9J44P2k59P3J53n09N53j34p0j25M1L0K34k62P5o2j69l8N13
$$ 61 128 -108 -102 17 -50 9 153 225 -34 39 192 -317 236 102 32 -93 -52 -22 212 -50 25 -37 -206 -244 269
4042B69j08K8l34J33J19j47J48o9P1j41J49j24J26j79N7J56j27q0r8J33M8q4o
$$ 269 161 189 -145 -12 107 -40 108 39 110 -31 118 -6 120 -59 -2 154 27 -53 -151 -18 30 -54 -60
4065f0m6O9L43l30J01k94R9J21j26O2J57%j85M26m26L42k63J07j1l15L27j53J29
$$ -60 -106 -37 306 -24 77 -217 -118 3 -123 -61 96 96 -89 337 -89 253 -10 97 86 -229 98 -55 74
4088G4j77P1JJ84J02j48j78l2K98k03k11K34N9j70J51R3J0K4l51N8J72Q6k05j85
$$ 74 -103 -32 -31 153 255 107 -71 -103 195 -8 -219 15 74 -96 55 148 158 182 -169 -111 61 147 -58 -243
4112b43L44M9J1k32J99l15J19O4r0J98k0n0n5n5N0J15m8N3l3l7r8J5J33j06J11
$$ -243 101 150 161 -71 128 -187 -68 -4 -94 104 84 34 -21 -76 -26 89 41 94 61 24 -74 -59 74 -32 79
4137G9n3j74Q9J67p9M8q0J40m8L5j77Q5l9P4j64J49N3j57R7M9j31L12l24l2N8
$$ 79 26 -148 -59 108 29 77 -3 137 89 124 -53 32 -7 67 -97 52 105 -52 45 94 -37 275 -49 -81 -23
4162b3j65K87q0k12J00O3m4P1j62M3O0k17M12o6k38J30j40L30j55rK92k15l42
$$ -23 -188 99 19 -193 -93 -30 -74 -3 -165 -122 -62 -279 133 67 -171 -41 -181 149 -6 -15 277 62 -280
4185b80L66o5k4l7m1O8N3k55K33j16K43M2k32o2r8K15j36K08J07r6k11K9K6M19
$$ -280 86 21 -3 -40 -81 -13 40 -215 18 -98 145 187 -45 -107 -205 10 -126 82 189 93 -118 -89 -63 356
4209C56l12J1m8k67J70R9J0Q9l2r4J5nm07J99J20J23r8J71k50K00Qm5j25K18k13
$$ 356 44 55 7 -260 -90 9 19 108 76 -18 -3 -8 -415 -216 -96 27 -71 100 -150 50 58 13 -112 106 -107
4234a07mK82J01k13N9k68M06j36l08P7J69L0k96Q9L9J71J68j26j45k69L76m5j7
$$ -107 -111 171 272 59 118 -150 256 120 -188 -111 58 88 -208 -119 -80 91 259 133 -12 -281 95 50 33
4257C3k41L00n8q0J14k56M41k87Q0q1K21o9j41L10m19R3K92m28J50J41j01j93
$$ 33 -208 92 34 -46 68 -188 253 -34 46 -35 186 117 -24 286 -133 -40 252 -176 -26 115 14 -179
4279a79L39M3k19j47k3K10K4k76J62M0M6j96K22L6k22K88j93r3K0N8P7L2J7K04
$$ -179 160 203 -16 -163 -186 24 48 -228 -66 -26 20 -176 46 82 -140 148 -45 -138 -118 -60 17 49 66 270
4303B70r9k26J98j39LN0k4n4R1k06J58q5j25K19K46k22k88pM27j63k32L52j03
$$ 270 171 -55 143 4 7 57 33 -21 70 -136 22 -63 -188 31 277 55 -233 -240 187 24 -208 144 41
4326D1J20l12N6p9K85q1j49J40Q4r9k2J75j5q2l39K07J85nj13J27j54j4QJ17j33
$$ 41 161 -151 -95 -174 111 30 -119 21 105 6 -16 159 144 62 -277 -70 115 110 -3 124 -30 -44 -36 81 -52
4351e2j75K15L3j33k79J89k4J04RQ6k1o8j24P4K82j60J72k80J4J14j04J60n6m4
$$ -52 -227 -12 21 -112 -391 -202 -226 -122 -113 -27 -48 -116 -240 -166 116 -44 128 -152 -138 -24 -128 32 -24 -68
4375f8J94o2J42j13m7jj88K53n4L21j37k25q5j25J23J98j36J64k14k3Q2J41ln2
$$ -68 126 64 206 93 46 45 -143 110 56 377 240 15 -70 -195 -72 126 -10 154 -60 -83 -1 140 137 85
4399H5o2l02K24Q4k6O5j67k05K46R9q0p4J06J60k1l08K37j02Q7j52J23J87l33
$$ 85 23 -279 -55 29 3 68 -99 -304 -58 41 -39 -113 -7 153 132 -176 61 -41 46 -106 17 204 -129
4422a29K03j03J58j27J44O6j34M1q1N4j48J66L2p4j10j55L05j36o5jJ43j79O4
$$ -129 74 -29 129 2 146 212 78 119 38 92 -56 110 142 68 -42 -197 108 -28 -93 -94 49 -130 -66
4445f6J3N0K5j22J19r5J81j68m3J08j56K20P4j89j11K24j18J34N4n6j76l8R7k7
$$ -66 -53 -3 22 -100 19 -76 105 -63 -106 2 -154 66 140 -49 -160 64 -54 80 134 78 -98 -136 -39 -66
4469f6Q7J4jkJ55k1l49N05n64K98pj01nJ02q7J74k01L8K19j30j68J25q7j58K62
$$ -66 21 35 34 32 187 166 -183 322 -242 56 49 -52 -57 45 -42 132 -69 -31 188 58 -110 15 -72 -230 32
4494C2K4k07j04J93J5K27j18k92M09j04j13p7J19J33j13rk7K0P2j69J29J63J5
$$ 32 56 -151 -255 -62 -47 180 62 -230 179 75 -38 -115 4 137 24 15 -12 8 80 -89 40 203 218
4517B18k3k24l3L36m32m3P9J0k2K34Q5k89K54KJj54L9k23J93kK45m45O4L20n0
$$ 218 195 -29 -62 274 -158 -201 -122 -112 -134 100 185 -104 150 152 153 -1 38 -185 8 6 251 -194 -130 190 140
4542A40J13r9k48J60k55K77k3J1J87l09K6K7P0J27n4k3k91j8J82O6q6k02J28Q0
$$ 140 253 154 -94 66 -189 88 65 76 263 -46 -20 7 77 204 150 127 -164 -182 0 66 -20 -222 -94 -14
4566a4M6l45K77k9j8J71j7l58K08P6j12J46k92L31J53l14K24j40n4k6j57M52l81
$$ -14 32 -313 -36 -65 -83 88 71 -287 -79 -3 -115 31 -261 70 223 -91 133 -7 -61 -87 -244 208 -173
4589a73J04L46n14M21j60r0n8L58k1l28N8J30K4j67jO8J23k98K26N4j92L22k89
$$ -173 -69 277 -237 184 24 -66 -124 234 213 -115 -57 73 97 -70 -71 -3 120 -178 48 102 -90 232 -57
4612e7kK3n3M8M9j96O1K5L5L6l4L0m3q2J40J37k72K46r5K91l50k66K19q2K76k7
$$ -57 -59 -36 -89 -41 8 -188 -127 -102 -67 -31 -65 -35 -78 -160 -20 117 -155 91 -4 287 -63 -329 -110 -192 84 57
4638E7k30K03j0M8j8k47J33M6Q9N6j19m0J75k8J55k5m41J39O4J21Oq1p6K6J14
$$ 57 -173 30 20 68 50 -197 -64 -18 71 127 8 -32 143 115 270 245 -196 -57 7 128 134 53 -23 3 117
4663A17r2J12J20l96K62J7q7J26l75m5K48p1J22j37L0k2k02M62M7k05j25L27j93
$$ 117 25 137 257 -139 123 140 53 179 -196 -241 7 -64 58 -79 -49 -71 -273 189 236 31 -94 233 40
4686D0j00n6J47j32J99P9p7j33j37K39j02K98j45k01l0k7J17J68j68j36L15j50
$$ 40 -60 -116 31 -101 98 177 100 -33 -170 69 -33 265 120 -81 -111 -138 -21 147 -21 -157 158 8
4708Hr1J85Q9k38MJ36P1J06j59r9J4jk48L51m9k50K27j04P8RN7j02k25L72j37
$$ 8 -83 102 191 -47 -43 93 164 270 111 12 26 25 -223 128 79 -171 56 -48 30 39 96 -6 -231 141 4
4733DK71n08K21J2Q6k41J26j9q9r9K75n5J30m6jo1Q9nj58K11j62r5L24l75K96
$$ 4 275 -233 -12 0 86 -155 -29 -48 -137 -236 39 -16 114 68 67 6 95 90 -68 143 -19 -114 210 -165 131
4758A31j08k32L42M4J02k43k02J49kO8j46J12K24m24J81O8m11L76M4k02J47M8
$$ 131 23 -209 133 177 279 36 -166 -17 -19 49 -97 15 239 -185 -4 64 -347 29 73 -129 18 66
4780F6K9p4P7p4l31M27J8k15Lr8L44J02qk2O3m11P6J69l0m8J35K69n12J82k4J03
$$ 66 95 21 98 24 -307 120 138 -77 -74 -172 172 274 266 244 307 -104 -28 141 111 63 198 467 -45 137 113 216
4806B16j96j10K6Q0j52N4J95l3k01M9J14m2J36J4k3k05J78j17k79M75j45j26J25
$$ 216 20 -90 -64 16 -136 -82 113 80 -121 -72 42 0 136 150 127 -78 100 -17 -296 179 34 -92 33
4829C3qp3K72m42J91k56K34J61l04K08N8k28J02J6J2K2nj06Q5o6J58N0J98n56
$$ 33 25 -48 224 -218 -27 -283 -49 112 -192 16 74 -154 -52 -36 -24 -2 -7 -113 -28 -94 64 114 312 -244
4853b44K51k9n0J59M3O2j54j72L94k60j27j03J48J85k46J49m7K9m7N5Q1kl36J81
$$ -244 7 -22 -72 87 130 192 38 -134 260 0 -127 -230 -82 103 -143 6 -41 -12 -59 -4 77 75 -261 -80
4877h0l30J42P1J21J50K9r3J26l14J34J95M1j77J75R7j59j73K38l92K06p1J29
$$ -80 -410 -268 -197 -76 74 103 10 136 -178 -44 151 192 15 190 287 128 -45 193 -199 7 -64 65
4899F5j12J89k41K34j47l4o2m5K99j28q4j4N9mJ24j03J54k19J53j23k05L8Q2J33
$$ 65 -47 142 -99 135 -12 -46 -108 -153 146 18 -66 -80 -21 -25 99 -4 150 -69 84 -39 -244 -206 -124 9
4923IO9N5k51L66N5m68K42J22N0q4j34J22m80L93l7j46K62k16L43m04J2K56r5
$$ 9 78 133 -118 248 303 -165 77 199 249 165 31 153 -327 66 29 -117 145 -71 272 -132 -120 136 41
4946D1Qn2o6L3K9P0Q3l14Q0R9J36J54k73Pj39K08P5k96J44K05j90p7J68j94j30
$$ 41 49 -3 -69 -36 -7 63 146 -168 -88 11 147 301 28 35 -104 104 179 -117 27 232 42 -35 133 -61 -191
4971a91L60l25J69j95J87j01j1N3J64K87m87J03m7n1J55k22K5M4J30J52j26P6
$$ -191 169 -156 13 -182 5 -96 -107 -54 110 397 -90 13 -34 -85 70 -152 -127 -83 47 199 73 149
4993A49k78K04pK57n90K64K6J17l06J36L63l93qo2J72k8j4L9K71m16K20j79q6
$$ 149 -129 75 68 325 -265 -1 25 142 -164 -28 335 -58 -66 -128 44 16 2 41 312 -104 116 -63 -149
5016a49K19j29K93j56pP0q3l9R5j25j43L57l93J53J07k73R3Q3J9r7L8J04k9r2
$$ -149 70 -59 234 78 71 141 58 19 114 -11 -154 203 -190 -37 70 -203 -110 -27 -8 -105 -67 37 8 -84
5040h4P9o4l3o3P4K5J33J95m39kJ49j35J92K87n16L61M5k78nj27J80Q4k6o2Q3
$$ -84 -5 -69 -102 -165 -91 -66 67 262 -177 -179 -30 -165 27 314 -202 159 204 -74 -79 -206 -26 58 32 -30 53
5065E3R7j16p9j69Qj5L16J36m31NL33l56M03j9j05k31J81j97P0j46L82mm94K23
$$ 53 150 34 -45 -214 -206 -221 95 231 -200 -195 138 -218 185 166 61 -170 11 -186 -116 -262 120 116 -378 -155
5089a55R2q3o8K41J2p3j14R7N7L66o27K63j9j42J20J68k23Q3k3j43M35n82M82
$$ -155 -63 -146 -214 27 39 -34 -148 -51 6 372 -255 8 -11 -153 -33 135 -88 -5 -28 -171 264 -318 164
5112A64j11k04N0p9J28J90K9k13K56m05O07m49K99k63j51R9J79j1j55q9J43J13
$$ 164 53 -151 -101 -180 -52 138 167 -46 210 -195 412 -37 262 -1 -152 -53 126 115 -40 -129 14 127
5134A27l4k18M6J51j4P2q4j2pj5Q9K16m13j95M33K6j42j14J16O6k59K92k70K4
$$ 127 93 -125 -79 72 58 130 46 34 27 12 101 317 -96 -291 142 168 26 -88 28 94 -165 127 -143 -119
5158a19J70N5J42j22l54M16l44j17Q9M5J2R8j64J19M9J02N6k28j63L38n5k8k46
$$ -119 51 106 248 126 -228 188 -156 -273 -184 -139 -127 -29 -193 -74 -25 77 133 -95 -258 80 25 -3 -249
5181b49K47K70k06Ok36J72k43J70K5J5j55L28j47j5K85k9j53l71K42J36j69j02
$$ -249 -2 268 62 68 -168 4 -239 -69 -44 -29 -184 144 -3 -18 267 238 85 -286 -44 92 -77 -179
5203a79J16J85J8R8l9k49n1J05k7l7Q9J3R9j64j5J7l1j13M79k96rJ8l0P7o5J07
$$ -179 -63 122 140 238 199 -50 -101 4 -23 -60 29 42 141 -23 -38 -21 -52 -165 314 18 9 27 -3 74 9 116
5229A16j02p9K48k04K06k36N7K0k9p3Q7j70j45J79J50J60k69NJ07q9P5k4n6j09
$$ 116 14 -65 183 -21 185 -51 6 26 -3 -76 11 -159 -304 -125 25 185 -84 -79 28 -61 14 -10 -66 -175
5253a75r9J83k8J5J19k62M92o8k11J4j4K0K27q4m6q9k60L60m0k98M7K26M1k90
$$ -175 -274 -91 -119 -104 15 -247 245 177 -34 -20 -34 -14 213 129 83 -6 -266 94 54 -244 -197 29 70 -220
5277b20K53J7k92K70j39J64k06K76L1n23K06L64k6j22Oj66K69q3L3l22L04k5J52
$$ -220 33 50 -242 28 -111 53 -153 123 154 -369 -163 201 175 53 59 -107 162 79 112 -210 94 69 221
5300B21m61N89m19p2N1k71K52J41L40m93J47p7J35j29M6k16K55j69L80l37Q3k9
$$ 221 -240 349 -70 -142 -91 -362 -110 31 371 -122 25 -52 83 -46 0 -216 39 -130 250 -87 -4 -33
5322c3k46K55J02j56q3m1N81o48k8L67k33L00l9k22J33l31K18p4L6K76p2k3ln0
$$ -33 -279 -24 78 -78 -161 -202 379 -269 -297 70 -163 137 98 -124 9 -322 -104 -178 -142 134 62 39 36 -14
5346a4j13J0J45q0J99j92J58n6K04j65l32L39o0j74J71Mj58JK50m8k14N5J00m1
$$ -14 -127 -117 28 -52 147 -45 113 57 261 96 -236 103 43 -131 40 44 -114 -113 137 89 -125 -70 30 -11
5370a1j94J70P5K21j37k80K04j11K5r1n5K72k79J28K36o5k50L03k94m2L2K81k75
$$ -11 -205 -35 40 261 124 -156 48 -63 -38 -129 -184 88 -191 -63 173 108 -142 161 -133 -175 -143 138 -137
5393a37K79j76J91j3j06R0j33J35r5j17J44J73j15j86J15M7q2j45K17J42O1k93
$$ -137 142 -34 157 144 38 128 -5 130 35 -82 62 235 120 -66 49 96 14 -131 86 228 289 -4
5415dp6J70j96K59l4l01J57J77j31J64L7k33j37J31m0m0J92j16J10j59K31j78
$$ -4 -80 90 -106 153 119 -182 -25 152 21 185 222 -11 -148 -17 -57 -97 95 -21 89 -70 161 -17
5437a7pK32l46K59N0P2m37j39M14N3k16l40K45K74k19j12J00J17j25j10K75j53
$$ -17 -24 208 -138 121 171 243 -194 -333 81 134 -82 -422 -177 97 -122 -234 -134 -17 -142 -252 23 -130
5459a30K51l43P4J67k71J39J47p6J11J42j88l39K89K2p9OM6q1qL95n62K62l3J99
$$ -130 121 -222 -148 19 -252 -113 34 -42 69 211 23 -316 -27 -5 -84 -78 -32 -113 -121 274 -288 -26 -59 140
5483A40P4j80j87J09R0mL8q9L0k03K35m9j23j08J60qP8j43J47j69M9J45J56k59
$$ 140 214 34 -153 -44 46 42 80 -9 21 -182 53 4 -119 -227 -67 -75 3 -140 7 -162 -113 32 188 -71
5507g1J43m0l56L49m0o9L63n12M75r9m73J26n4M56l95J76J06J17k53J72k03K44
$$ -71 72 32 -324 25 -15 -84 279 -233 242 143 -330 -204 -258 198 -197 -21 85 202 -51 121 -82 162
5529A62k17K5N1J84j92J68o7k15J01J06j65R3j69J40l4O4j14J79k28L2J2J04K4
$$ 162 -55 -30 21 205 13 181 114 -101 0 106 -59 34 -135 5 -29 35 -79 100 -128 -96 -84 20 44
5552D4j47J60n2k0ok69K3L08mM5o9Q1j86J21q3L71m41K49l9j27j1J77k17l8J73
$$ 44 -103 57 5 -15 -21 -290 -267 41 37 82 13 94 -92 29 -54 317 -124 125 86 -41 -52 125 -92 -130 43
5577D3K33j23k16J34K9j83JJ76QN2j29j04M0l3J0j24K42R1lk98K40J90J4l31L6
$$ 43 276 153 -63 71 100 -83 -82 94 102 154 25 -79 -39 -72 -62 -186 56 147 144 -154 86 276 290 -41 -5
5602eJ18k11L17k62K3rj6r4m2L72l55J39L3k06J87J2R2J7j49J54j02r9J54j65
$$ -5 113 -98 219 -43 -20 -29 -45 -139 -181 191 -164 -25 8 -198 -11 1 93 110 -39 115 13 -86 68 -97
5626i7L37n76M15k42O5n1Q4q9j96M48q2k77K02J30k06k6R2J79n9p8J71k3o6k14
$$ -97 240 -336 79 -163 -98 -149 -65 -154 -350 98 16 -261 -59 71 -135 -161 -69 110 51 -27 144 121 55 -159
5650a59J76Lj69L25j81j51J89p3p6J49P0k50k0L37j56j49r6N60j78m51N55k41
$$ -159 17 20 -149 176 -5 -156 33 -40 -116 33 103 -147 -167 170 14 -135 -231 329 151 -300 255 14
5672A4r6O1L0k29K05l2K51l50L2J61K0J01k91J12K60l83%K77k12m7K02q5q4k3
$$ 14 -82 -21 9 -220 -15 -47 204 -146 -114 47 67 168 -123 -11 249 -134 -134 143 -69 -116 86 1 -83 -106
5696a06J65n6j29L7J74O9j50r0L25l19J91o8j3P5o9j56K02j01N1O7j78J80P2l88
$$ -106 59 3 -126 -89 85 154 4 -86 239 -80 111 43 30 105 36 -120 82 -19 32 99 -79 101 173 -215
5720b15J43k30L87R0n8m18M06ok4j11j23L52j14K7m2j56K63j43o0O6J76l84L37
$$ -215 -72 -302 85 175 117 -301 105 99 75 -36 -159 193 79 106 64 -92 171 28 -32 34 210 -174 163
5743A63k41J16k7l2J9o7j54K63m7lK5R7k58K39j75r9O1J79j89P2n1J51N0k08l
$$ 163 -78 38 11 -21 -2 -69 -223 40 -7 -10 15 112 -146 93 -82 -181 -120 59 -130 -58 -109 42 92 -116 -119
5768a19j1o6O0Q3Q8l3J10J9k78L7N2m3j53K93Q4j31q5K30j29n0J24L5k94K28k14
$$ -119 -130 -196 -136 -53 35 2 112 131 -147 -110 -58 -101 -254 39 123 -8 -93 137 8 -42 82 117 -177 51 -163
5793a63M93l32j45o1R4L37k91n8j9L1q5J26k33L11J97j35j26J86k44K01M3l45
$$ -163 330 -2 -147 -208 -114 223 -68 -126 -145 -114 -199 -73 -306 5 202 67 -59 127 -117 84 127 -218
5815b18J25N9pj89L00N3L4k09J33K13j87j91K49l97L75j49J24j32N4Jq7K33r9
$$ -218 -93 -34 -41 -230 70 123 157 -52 81 294 107 -84 165 -232 143 -6 118 -14 40 41 -46 187 88
5838H8n5J32j72Q7k2j57J42j00J52k52N1O6J40q4J3j0L9Jo7K04m45L50O7n98M95
$$ 88 33 165 -7 80 58 -99 43 -57 95 -157 -106 -40 100 16 29 19 58 59 -8 196 -249 101 168 -430 65
5863F5J6j98l5L62k50r8P9L35j83j0j53Q0L11l93j29K62pmJ3J1r9j10J52Q4qJ57
$$ 65 81 -117 -152 210 -40 -138 -59 276 93 83 -70 10 321 -72 -201 61 54 50 63 74 -25 -135 17 101 93 250
5889B50k62L99l45N2j03Q4l9j09j98M72k81j9L07k50K03l0j64Q5Q6q4j31L56k86
$$ 250 -12 387 42 94 -9 75 36 -73 -271 201 -80 -99 208 -42 161 131 -33 52 138 54 -77 279 -7
5912gj57K82j33p6Q5N9N0j63j07K68j25l6J25J42m39K75n0k05L16Q5l12K74j56
$$ -7 -164 118 -15 -91 -6 53 103 -60 -167 101 -24 -60 65 207 -232 43 -7 -212 104 189 -123 151 -5
5935eJ68J32k36o6M7J7N1l0k2j22J44Rk27K86o8q7l1q5K38r7P2k50j55L73j62
$$ -5 163 295 59 -7 40 57 108 78 56 -66 78 87 -140 146 78 -9 -40 -125 113 16 88 -162 -317 56 -106
5960a06J48K9j56J13j77L4L30m09L87k03K4j9k41K73pj66J06P5l0N4p8J43k93
$$ -106 42 71 -85 28 -149 -115 215 -194 193 -10 14 -5 -246 27 20 -146 -40 35 5 59 -19 124 -169
5983a69K41Kl1L4J0l50L72j89J69m0N6j76l5J3J77N1l00J91l5m8k6L20j00k23
$$ -169 72 74 43 77 87 -263 109 -80 89 49 105 -71 -106 -93 84 135 -165 26 -9 -57 -83 237 137 -86
6007h6n1J44K03l7Q1j89M3P4k35J99k42n8J40J29j52O2k14M65k30nj72J36l5K05
$$ -86 -137 7 210 173 254 65 108 182 -53 146 -96 -154 -14 115 -37 25 -189 276 46 41 -131 5 -30 175
6031A75J14m82L24j39K57j38l45L46k00L05l32M00k23o6m3J20k8k76J70l0J01
$$ 175 289 -193 131 -8 249 111 -234 112 -88 217 -115 285 62 -4 -47 73 45 -231 -61 -91 10
6052A0K8L3L1o7Q4Pk00J30J9O0j3r7j06K63Pj1j60j86o2J98pJ18j60k7R6n9L37
$$ 10 38 71 102 35 119 126 -74 56 75 135 122 25 -81 182 189 178 18 -168 -230 -32 -39 79 -81 -108 -12 -71 266
6079B66o16M34j28N5q5l5k3J74J63k21j04J85J12k61K38j62O2J9j54Q4j06Q9j16
$$ 266 -350 84 -44 11 -74 -109 -132 42 205 -16 -120 65 177 -84 154 -8 54 73 -81 3 -103 -14 -130
6102a30J04L4j4j04O5l3L01Q6l44j23K40j87J11R8j01p4j42K91l7PK5k79J21j5
$$ -130 -26 8 -6 -110 -45 -78 223 309 -35 -158 82 -105 6 104 3 -71 -213 78 41 48 73 -206 -85 -100
6126a00rK18j79K02n6N2k03R5J18j60k43L43n6M8p7lJ25P9l18J87k14K72p7m0
$$ -100 -109 109 -70 132 76 128 -75 20 138 -22 -265 78 22 70 -7 -10 115 194 -124 63 -151 121 44 4
6150Dl5J05l64K12K2J6j60J16J23l2o7K21k48q6J37K82j40j81l6mK50j21j1l7
$$ 4 -31 74 -290 -78 -56 -40 -200 -84 39 7 -60 161 -87 -173 -36 246 106 -75 -111 -115 135 14 3 -34
6174c4K00k19o7K42j45J23N0k49M7Q7l26L09RJ03k31P9j23M4J32K60j72j10Q8
$$ -34 166 -53 -120 122 -23 100 150 -99 -52 35 -291 18 27 130 -101 -22 -145 -101 31 291 119 9 97
6197I7o9L7j07L63r1k97K0K7J75p0k05n2J21J65j29J88j78o6J36J15k86J86j5
$$ 97 28 65 -42 321 230 -67 -47 -20 155 85 -120 -172 -51 114 -15 173 -5 -71 65 180 -106 80 65
6220F5N5j31K33p6m30L88j49Q9P0j50K32j45j90p0K09p5O6P2j18K89k43P2q8l1
$$ 65 120 -11 222 146 -284 104 -45 44 114 -36 196 51 -139 -209 0 -75 -9 63 -55 234 -9 63 -25 -56
6244e6J72k85k0M23o8M7r4j19K1J4m4j57K25%j14O2r2L15j51pL7j98JK0J81J80
$$ -56 116 -169 -189 234 166 213 119 0 21 35 -9 -166 59 59 -55 7 -85 230 79 72 109 -89 -88 -68 113 293
6270B93j64j23Q8j61J65q5m1J00l44Q3J95O7N9j72J81k10m7J23M1n1k20J54p5
$$ 293 129 6 94 -67 98 13 -28 72 -272 -189 6 73 132 -40 141 -69 -116 7 48 -3 -223 -69 -144
6293a44K80k47K98j47k48K71oj8lL7o7rj03J79k44P3L4J37j25J88M6j85p3M8n9
$$ -144 136 -111 187 40 -208 63 57 39 36 73 6 -3 -106 73 -171 -98 -64 73 -52 136 182 -3 -76 -28 -87
6318h7J08j42Q5J34n1J11q4j39O9j15K30j75RL7M4P7n5N4j76J03Kj54J34j16P8
$$ -87 21 -121 -36 98 47 158 74 -65 4 -111 119 -56 -47 -10 34 111 56 110 -66 37 39 -115 19 -97 -19
6343a9J3J76j51q5P2j74K92j36Q7k2j65q8K38l48M26j98n5k3q4L38p8L9k72K04
$$ -19 -6 170 19 -66 6 -168 124 -12 75 53 -112 -200 38 -310 116 -82 -137 -160 -244 94 16 55 -217 -13
6367a3q3K89Nl01L46q9L2k50k6K62j19K37j89Q0p6M1p9K7l68L89j49NJ06k77M34
$$ -13 -96 193 198 -103 243 154 186 -64 -90 172 53 290 101 181 105 146 67 94 -274 115 -34 -29 77 -200 234
6392B34l60N7OQ2j3J80j58M4j06j34K83j80j3J94q8J30q2j70J64j60K94j72l4
$$ 234 -126 -69 -63 19 6 186 28 72 -34 -168 115 -65 -78 116 28 158 76 -94 70 -90 204 32 -2
6415bj8O0j30J27KJ43j29l77M93m30L14j15J30l17K63p7o5J98p8OP3O7j62%k85
$$ -2 -20 40 -90 37 39 182 53 -324 169 -261 53 -62 68 -249 14 -63 -128 70 -8 -2 71 138 -24 -24 -309
6440c09L16kO0j00jK22j67o1j57L16J96n48L58r6k91K77l5o4J81j75J64k87J94
$$ -309 7 5 65 -35 -36 186 19 -42 -199 117 313 -235 123 27 -264 13 -22 -86 95 -80 84 -203 -9
6463ij55J28J58n0j25k7k05K33J62K04l06L0J85q4R1j32Q0m7p2j07J77r8J27j54
$$ -9 -164 -36 122 72 -53 -80 -285 -52 110 314 8 38 223 139 230 98 178 131 59 -48 129 31 158 4
6487Dm4P5j01J18k37J64k53K10j96L10J14k11lL13l14N0K09P7j77k69J78K8j93
$$ 4 -40 35 -66 52 -185 -21 -274 -64 -260 50 164 -47 -50 263 -51 -1 208 285 108 -161 17 45 -148
6510a48j00o1M09J38m17K8M00j29m56K40P6RP8l4R5r7m93M66l1K84l14k2J66%
$$ -148 -248 -309 100 238 -179 -151 249 120 -336 -96 -20 -11 67 33 128 31 -462 4 -27 257 -57 -79 87 87
6534H7l09K97N0j38j42m7M3J64l9LP5L0k99Q9J17k8J7j53J72J83m73L96J76l42
$$ 87 -222 75 125 -13 -155 -202 -159 5 -34 -31 44 74 -225 -136 -19 -47 -30 -183 -11 172 -301 95 271 -71
6558g1R9M3m9Q4j47jJ08l3R5j76q0J68L00l48j29mK11j18J53j38J74l65L19K19
$$ -71 28 71 22 106 -41 -42 66 33 128 -48 -128 40 340 -8 -137 -141 70 -48 105 -33 141 -224 95 314
6582C14l65K7J38r5O2q3j8K07j82j6J42o5pP8k5O7k50PK93k97L0N0j26J16P4j68
$$ 314 -51 -24 114 19 81 -2 -20 187 5 -11 131 66 59 137 112 179 -71 -64 229 -68 -38 12 -114 2 76 -92
6608i2L19j94K02j51M5p7m58N70m0j67K3r1J01Rm06M30k28K76j57m2m1J07K19
$$ -92 227 33 235 84 129 52 -406 164 124 -43 -20 -111 -10 -1 -407 23 -205 71 -86 -128 -169 -62 157
6631A57m24M03m8J6k16J16k2j33K04j70q2L80l08J43j21L2M8k68J56K09j21L14
$$ 157 -267 136 88 104 -112 4 -18 -151 53 -117 -199 181 -127 16 -105 -73 -25 -293 -137 72 -49 265
6653B65l3l80K5K24l3k16R0J77j22Q2n8m36L36r6Q9o3L71j16j2K5M7r1j31J06
$$ 265 232 -148 -123 101 68 -148 -58 119 -3 79 21 -415 -79 -175 -86 -149 222 106 94 119 166 75 -56 50
6677E0r4J2m8l2L65k75j09K42j24Jl0K2P2m6J6j34J56k76J21J51l43L60P6k17
$$ 50 -44 -32 -80 -112 253 -22 -131 111 -13 -12 -42 -20 52 6 22 -112 44 -232 -111 40 -303 57 133 -84
6701h4J92l6O2k70M6J55j87J71L0Q4J33l94K63m22K27o0J05k20K44o2m4K55k04
$$ -84 108 72 134 -136 -90 65 -122 49 79 163 296 -98 165 -257 -30 -90 15 -205 39 -23 -67 188 -16
6724a6N0J5p2j15J77p8j03J01J84k43K76n2l22J58k34K61n1j52L50k57j03J84
$$ -16 34 49 -23 -138 39 -39 -142 -41 143 -100 176 124 -198 -40 -274 -13 -64 -216 134 -123 -226 -42
6746d2l5M3J96Mj41k44R2J09j80M95l87m4O8J27P8o9M1j58l0j32K01k51M57j26
$$ -42 -77 -34 162 166 25 -219 -127 -18 -198 297 -90 -134 -66 61 139 70 111 -47 -77 -209 -8 -259 198 72
6770G2PQ8j08J3j06J14o8K06k42J45m9k83J62QR4Q0k51J53k21J87m2K34j33k75
$$ 72 79 167 59 72 -34 80 12 218 -24 121 72 -211 -49 -41 53 133 -118 35 -186 1 -41 193 60 -215
6794b15L44k75J81J30l3j31J6j1k56J79M1MJ12o9j49L98k50n8j27Q6K2oM9L01
$$ -215 129 -146 35 165 132 1 17 6 -250 -71 -30 -26 86 17 -132 266 16 -42 -169 -83 -61 -67 -18 283
6818B83m07P4R4k4J22k35K96m32J55k18K64J03l9j79L22j06Q4k04M4N6J4r4r1
$$ 283 -124 -50 44 20 142 -93 203 -229 -74 -292 -28 75 36 -143 179 73 157 -47 -3 53 67 -27 -118
6841a18M6jm8Q7J71k07L5M5J11k52O6J75j49P0j37O1RL9Q3l30L43nk34J00p4J67
$$ -118 -72 -73 -121 -34 137 -70 -35 10 121 -131 -65 110 -39 31 -106 -45 -36 3 86 -244 99 94 -140 -40 -114 53
6867E3j0m3K2J45m06J24J02q0NJ59l3j12J41O7k96J02K18j41Q1l04J56j02J51
$$ 53 43 0 22 167 -239 -115 -13 -93 -88 71 38 -74 67 134 -162 -60 158 17 98 -206 -50 -152 -1
6890aJ39j0R3k35k34L96j12%J58l17K96k67K09j00q9P5J6P3J3j4r1N0RO3j91K01
$$ -1 138 128 221 -14 -248 148 36 36 194 -123 173 -94 115 15 -74 1 17 90 103 89 -2 48 57 120 -71 130
6916A30k22K42j97J46j4n1M6l55L33m8J53k23L6J36J52m85M8J47J77l83J6J83
$$ 130 -92 150 -47 99 85 34 80 -275 58 10 163 -60 -24 112 264 -221 -173 -26 151 -232 -216 -33
6938c3p8L91l91J39j97J60k3J38k27N3n6K75l59J49j10K77j91J16m6j39J94M4
$$ -33 -111 280 -111 28 -169 -9 -32 106 -121 -68 -124 151 -208 -59 -169 108 -83 33 -13 -152 42 86
6960H6l01J27K05j26L5j72K05j33J26o6J33k33J80R2m4np6m8J4r9K00j36k6%L1
$$ 86 -215 -88 117 -9 26 -146 59 -74 52 -14 119 -114 66 158 114 109 33 -15 -1 -100 100 -36 -62 -62 -31
6985c1L52l98Q5J95m3l16L28j66k07J88K55j48J74k83JK13j34j86J33k26L65k37
$$ -31 321 -77 8 203 160 -156 172 6 -201 -13 242 94 268 -15 -14 199 65 -121 12 -214 151 -86
7007h6J21j55p9K72j92K59j13j9k1k14L5n7J63L76n6l18l74N55k11n9J69nM9j00
$$ -86 35 -120 -199 73 -119 140 27 8 -13 -227 -192 -249 -86 290 234 -84 -458 97 -114 -173 -4 -9 40 -60
7031f0q6j5K36j86R9J65r1j19J9J83j24q9J2Q5j45R8P0m9j8J09o2j09J84k06M6
$$ -60 -146 -161 75 -111 -12 153 62 -57 -38 145 21 -68 -56 29 -116 -18 52 3 -15 94 32 -77 107 -99 -53
7056e3P6j23J76l4k1k18K04P9k5n0o7J36Jj18J02j3m1j90j6O3O3O8K1q7k9L42
$$ -53 23 -100 76 42 21 -197 7 86 61 11 -56 80 81 -37 65 52 11 -179 -195 -132 -69 -1 20 -67 -96 246
7082B46j95L01m48m4o8L39j72p9j31K67oj06J78J9Ql3k5J5J26M1m43M16k27k2
$$ 246 51 352 -96 -140 -208 131 -41 -120 -251 16 10 -96 82 101 109 76 51 66 192 233 -210 206 -21 -43
7106d3K65O4k66JJ82m56K38j82J36j11J71J7j66P1J46l35L52l65J67M8M59o39
$$ -43 222 286 20 21 203 -253 -15 -197 -61 -172 -1 16 -150 -79 67 -268 84 -281 -114 -66 393 -246
7128b46M14l57J12K04j46P6J71k55J88J79m47J0K4pK38l44J19J23O0j50J35j87
$$ -246 168 -189 -77 127 -19 57 228 -27 161 340 -107 -97 -73 -80 158 -186 -67 56 116 -34 101 -86
7150h6K39l2j46J19l6J0k73J47R5m29M00oJ44l19J38O4J10j28n3k0K4J49j83j81
$$ -86 153 121 -25 94 58 68 -205 -58 37 -392 8 2 146 -173 -35 29 139 11 -42 -62 -38 111 -72 -253
7174b53K16J26n6j69m4L33l5J57k36n8K70j22o6R3j55J90L0j34J45j51j66K25
$$ -253 -37 89 33 -136 -180 153 118 275 39 -19 251 129 63 156 1 191 221 87 232 81 -85 140
7196A40r3o1M4q0J12j88J94n0OO9j97J73P4j98j33K18j97K74n2k20K15k2k51M02
$$ 140 47 -14 30 -50 62 -126 68 18 24 93 -104 69 143 -55 -188 30 -167 107 55 -165 50 28 -223 179
7220A79k43R0J74j82k32L01j74R2n9J00O5k35K68l37L64l08J69j55mJ79K34l85
$$ 179 -64 26 200 18 -214 87 -87 5 -54 46 111 -124 144 -193 171 -137 32 -123 -127 52 286 -99
7242i9K1J17k66M9R0L25q4Q8k76J73Q5l35Q5j9J44j43k6pP0k4rP8j92L50j38R4
$$ -99 -78 39 -227 -178 -88 237 153 241 -35 138 223 -112 -27 -46 98 -45 -71 -78 -8 -32 -41 37 -155 195 57 151
7268A51l1J31m48J82P7k38R6M1J56m7n3L2K5j48L0j6K97l88J73l8R7r7oN8N7j20
$$ 151 120 251 -197 -15 62 -176 -80 -39 117 70 17 49 74 -74 -44 -60 237 -151 22 -16 81 -16 -22 36 93 -27
7294b7k48M01k14K00k23K43j27j24M37J15j03m06J30j93L04Ql14J68m5n3j77J76
$$ -27 -275 126 -88 112 -111 132 5 -119 318 433 330 -76 54 -139 165 173 -141 27 -18 -71 -248 -72
7316g2J36k33L62r1J3R3l67L87l39L34j39m8K66m24K14or9J46j36n8j37J72k7
$$ -72 64 -169 193 102 115 208 -159 228 -111 223 84 36 302 -122 92 86 -13 133 -3 -61 -198 -26 -53
7339e3R6L6qn2l48K23N9L15l13M5K2K79m26j42K55q2Q6j53K74k14M4k7J69k6j05
$$ -53 43 79 71 19 -329 -106 -47 268 -45 0 22 301 -125 -267 -12 -94 -8 -161 113 -101 -57 -84 85 59 -46
7364d6j07N7J45j18K27m27K69L5j09p4Q6L48k86j18j01K27j84L49l12K66k00j81
$$ -46 -153 -96 49 -69 158 -269 0 35 -74 -148 -62 286 0 -118 -219 8 -176 173 -139 127 -73 -254
7386b54K81Jj44J83j7lj51J54j21L5j00Jq5Q7K32j2l08M31k23J43J69l53J05K5
$$ -254 27 28 -116 67 50 47 -104 50 -71 -36 -136 -135 -220 -133 99 87 -221 210 -13 130 299 -54 51 76
7410G6Q1l11J62L7j20J89j05r7K60om01J77O0n4k05J43J40j55L81j95jL7k27Q8
$$ 76 157 -154 8 45 -75 114 9 -88 172 166 -235 -58 2 -52 -257 -114 26 -129 252 57 56 93 -134 -46
7434d6l4K5q0R0l9k1L47m30j30N62l90J09j50o5R4n7J88q6J80k81J19L07p3r9
$$ -46 -80 -55 -135 -45 -84 -105 242 -188 -318 244 -146 -37 -187 -252 -158 -215 -27 -113 67 -214 -95 212 139 40
7458D0r7j08l7K38Q1l47K65l7j3j24J90nJ09l96P8J05O3J43k11P9P7j62rmNj56
$$ 40 -57 -165 -202 36 117 -230 35 -2 -15 -139 51 46 155 -241 -163 -58 5 148 -63 16 93 -69 -78 -82 -77 -233
7484b33L46k00j52K37j13j09L38o4j54J25j45L18q0m4J52k35L45k41j15Q9J27
$$ -233 113 -87 -239 -2 -115 -224 114 50 -104 21 -124 194 114 70 222 -13 332 91 -24 65 192
7505A92k95J38pK6k2p0K07pn1r6M7j85K64p1l90L66J12j76M6J42k2m0R0k65J15
$$ 192 -103 35 28 54 32 -38 169 162 111 15 62 -123 141 70 -320 46 158 -18 28 170 148 108 198 -67 48
7530D8J8J19l94L11m26M45m8j44r4n7L79k03R5k2k12n8L57j37J96l39J97j60n8
$$ 48 66 185 -209 102 -324 121 73 -71 -165 -222 157 -46 49 27 -185 -243 114 -23 173 -166 31 -129 -187
7553a87n0L23l2M2J07k95L13k75r3J23M7q7p0L33k71l1K98J41m42J55j13RK9p8
$$ -187 -237 86 54 96 203 -92 221 -54 -147 -24 23 -64 -134 199 -72 -103 195 336 -106 49 -64 -55 -26 -104
7577a04jo1J33Q5n4j73K05J2R6k50K14P0m14K26P3k6R4k23K98l83J87j00J69m01
$$ -104 -105 -166 -33 52 -2 -175 30 42 138 -112 102 172 -242 -16 57 31 125 -98 200 -183 4 -96 73 -328
7601c28N29N4l42NJ68j54j2j09K32j63J25k37K59op4j62K5k9J75K75k82oL14k96
$$ -328 201 255 -87 -82 86 -68 -80 -189 43 -120 5 -232 27 21 -53 -215 -190 -219 -44 231 -51 -57 257 -39
7625c9Q8J51k37Q4l8k46j37N58k73J58j08P1k38K44K10l51K40k49J01L1l45M30
$$ -39 49 200 -37 47 9 -237 -374 184 -89 69 -39 32 -206 38 248 -103 137 -112 -11 20 -325 105
7647A05R0j75l7j34K50k04P5o1p2L38j87k0J02J8j65j23Q2J96J20q5l72N52m86
$$ 105 195 20 -17 -151 99 -105 -30 -91 -163 175 -12 -32 70 88 -77 -200 -118 78 198 113 -259 293 -193
7670a93K09K2j81L18k04Q7j34Ln7m0O8L08j67O2k29j9K15k28K22m3k29J32m9J64
$$ -193 16 38 -143 175 -29 58 -76 -73 -130 -170 -102 206 39 101 -128 -147 68 -160 62 19 -210 -78 -127 37
7694C7J60k93K1K10j15J40j5l66N28k46j07K67k41J55k63J32J03j69R0J64j35
$$ 37 197 -96 -75 135 20 160 145 -221 307 61 -46 221 -20 135 -128 4 107 -62 28 192 57
7715E7q5j92L21j3j08j18K7K80m6N9l52M01j96J73k73P2l7p5K21j09p6K72k73
$$ 57 -28 -220 101 88 -20 -138 -111 169 123 182 -170 231 35 208 -65 7 -30 -105 116 7 -69 203 -70
7738g0M04m53K24k22K60L0k3l18R5K22j08m5j55Q8j58L84k18O5j65L05j39L9k3
$$ -70 334 -119 105 -117 143 173 150 -168 -73 149 41 -4 -159 -71 -229 155 -63 2 -163 142 3 42 19
7761A9K2n8n2LpQ5n7J45K26m28K59j11j69R5M27k91O1P3k58j7RK03k84P2j06J86
$$ 19 41 -17 -69 -66 -73 12 -45 100 326 -102 157 46 -123 -28 399 108 169 242 -16 -33 -24 179 -105 -33 -139 47
7787D7j09r8P6J87k10O5j01L52J9k6P7n45J87K7J57l74L51q5K8K43l44J47o4N3
$$ 47 -62 -160 -84 103 -107 -42 -143 209 228 202 279 -266 -79 -52 105 -269 82 -3 25 268 -76 71 7 60
7811F0l4K0Ro5P3j34p3J12N8j30J81j93nJ02j3MQ3K05m40K35j36L40k82p2L93
$$ 60 26 46 55 -10 63 -71 -144 -32 26 -104 77 -116 -121 -19 -32 -28 55 260 -180 55 -81 259 -23 -95 298
7836B98k11N5r9j35J90j50j96J54O3p5K06l41K14J07n52M83J04l22M09j76j8k12
$$ 298 87 142 43 -92 98 -52 -248 -94 -31 -106 100 -241 -27 80 -472 11 115 -207 202 26 8 -204
7858b04K76mJ8j5j52mJ54p2o5K29m5J72k93j0Q6j40K7J33L2J03k88j02K10m9q2
$$ -204 72 68 86 71 -81 -85 69 -3 -68 161 116 288 -5 -15 71 -69 -42 91 123 226 -62 -164 46 -3 -85
7883h5K39j5l91K92j37J6j10K64Q1N7k92j96L36j19K46j24K5q1R1k15M6K04k28
$$ -85 154 139 -252 40 -97 -81 -191 73 154 211 -81 -277 59 -60 186 62 87 6 97 -118 -72 132 -96
7906i6Q0j57j66L80j91L59k40j55K63o3pk00L22o9j75L15j29q2K79k50J1k53M57
$$ -96 -16 -173 -339 41 -150 209 -31 -186 77 14 7 -193 129 60 -115 200 71 -11 268 18 29 -224 233
7929B33k74k87K3K35K94l55R4M2J02o3m6N9l06R1P4Q3J04j23k7m6J60l20M21q5
$$ 233 -41 -328 -305 -70 224 -131 -37 5 107 44 -2 57 -249 -158 -84 -1 103 -20 -47 -93 67 -253 168 83
7953H3o1J08K87m15o6M0r0L3K81k71J00k35L70k40l5K20j19l83M63j83K40j36
$$ 83 22 130 417 2 -64 -24 -114 -81 200 -71 29 -206 164 -76 -111 109 -10 -393 70 -113 127 -9
7975iK21l09R1L7l7r0K7J97k00L7K7n9K38N8l53J67K53k75J6j68O8J82l95K17
$$ -9 212 -97 -6 31 -6 -96 -69 128 -72 -35 -8 -67 171 229 -124 43 296 21 37 -131 -63 119 -276 -59
7999e9J44k23L08p2j23M7q0n9K99p6j61R4j88K28r6m5L26m15K71j68Jk36LL25
$$ -59 85 -138 170 98 -25 22 -58 -117 182 106 -55 39 -149 79 -17 -62 264 -151 120 -48 -47 -283 -280 45
8023D5j93J27j88J29J26m5O4j94M77m31R4q4M34n33L02q0j17J92j59J48L44o07
$$ 45 -148 -21 -209 -80 46 1 65 -129 348 -83 11 -73 361 -172 130 50 -67 125 -34 114 458 -149
8045a49L3K09Qj64L1m4j00K54q6K33j42k55Q0L13k17J87k26j7o2L1q9J97J11l52
$$ -149 -116 93 101 -63 -32 -76 -176 78 -8 225 83 -172 -92 221 4 191 -35 -52 -114 -83 -172 25 136 -216
8069b16L10J03j49p3L19l78j6N7r3J28J07jj64l2l0J45p6j08P2K23j0j6K37n09
$$ -216 94 197 48 -25 294 -84 -100 -43 -136 -8 99 98 -66 -98 -128 17 -59 -167 -95 128 118 102 339 -170
8093a70L83k33o1m3K05k41K5k5J0M06l42j23J41L30n18L35j95L25m76M97k59j3
$$ -170 213 -20 -81 -124 81 -160 -135 -160 -150 256 -86 -209 -68 262 -256 79 -116 209 -267 230 -29 -42
8115d2k4j1K1p2Q6p3M6m7K77j05j4L42m48PP6m5P2k62K54J69j76L2J8k18M31l91
$$ -42 -66 -77 -56 -128 -42 -115 -69 -116 161 56 42 384 -64 -57 19 -26 46 -216 38 207 31 63 81 -137 294 -97
8141i7k3J82k11j06J55J13m3M5pK10k67pp5j04M21J64m97J26r4J21j51K96k41
$$ -97 -120 62 -149 -255 -100 13 -30 15 8 218 -49 -56 -131 -235 186 350 -147 -21 -115 6 -145 151 -90
8164i0K17m78K30R5O8J71j76o1o4J41q0j48J12L32k70j49P7m6K01KK30l90K53
$$ -90 127 -351 -121 -26 42 213 37 -24 -88 53 -27 -175 -63 269 -1 -150 -73 -119 82 84 314 -76 177
8187A77r5j69O5J14
$$ 177 82 -87 -22 92
8191I2
$$ Imaginary data points
##PAGE= N=2
##DATA TABLE= (X++(I..I)), XYDATA
0@%%%%%%%%%%%%%%%%%jRj6J6j6J6j6K4l2L2l5M3m9N7o5P3q4R3j05J19j32J46j64
$$ 0 0 0 0 0 0 0 0 0 0 0 0 0 0 0 0 0 0 -1 8 -8 8 -8 8 -8 16 -16 16 -19 24 -25 32 -33 40 -44 49 -56 63 -69 77 -87
40h7J84k04K25k51K79l05L36l72M09m50M95n46O04o67P36q15R06j008J128j271
$$ -87 97 -107 118 -133 146 -159 177 -195 214 -236 259 -287 317 -350 386 -429 477 -531 597 -674
60f74J443j656J924k274K755l459M582o668J1777m5663o4886J01279M5350j4117
$$ -674 769 -887 1037 -1237 1518 -1941 2641 -4027 7750 -37913 -102799 -1520 43830 29713
74B9713j0486j4882P282M4653j2117k6263J1594k1128l4550L8054L1124k6056
$$ 29713 19227 4345 11627 56280 44163 17900 29494 8366 -26184 11870 42994 16938
86A6938k5263j6658K827M1868j2715o6463L465M6904K535n035K352m195J2319
$$ 16938 -8325 -24983 -22156 19712 6997 -59466 -56001 -9097 -6562 -11597 -9245 -13440 -1121
99a121M247j3708K0045J2231l6234l323M6111J2007j7655j4411j1655K0613K0582
$$ -1121 3126 -10582 9463 21694 -14540 -17863 28248 40255 22600 8189 -3466 17147 37729
112C7729l8145k7245K8773O045j8488O757M332l603J044j7862k866K9918r093
$$ 37729 -416 -27661 1112 7157 -11331 -4574 -242 -3845 -2801 -20663 -23529 6389 -2704
125b704l6290J8206L4702l183q834l602J931J9617j688k8887P556K2559j2059
$$ -2704 -38994 -20788 13914 10731 1897 -1705 226 19843 18155 -10732 -3176 19383 7324
138G324o689J4557K978m511j0281j5362J0841J2160k6424j4777K4373J1467r827
$$ 7324 635 15192 18170 13659 3378 -11984 -1143 11017 -15407 -30184 -5811 5656 -4171
151d171n543j917P155O081j6856n317K3335L432j3488R314J5643Q90n438j1800
$$ -4171 -9714 -11631 -4476 1605 -15251 -20568 2767 6199 -7289 2025 17668 18558 13120 1320
165A320l95J7266n346k2285P505J8016o290j0240k344n2M316r038j5491J0359
$$ 1320 925 18191 12845 -9440 -1935 16081 9791 -449 -2793 -2845 1471 -7567 -23058 -12699
179a2699J4322j2325o385J4231P376k582o869m473J1435R803j3166m818J7537
$$ -12699 1623 -10702 -17087 -2856 4520 1938 -4931 -9404 2031 11834 -1332 -6150 11387
192A1387N171q783j850J489K913j588j3502k444J4333k618j4630L070R248k114
$$ 11387 16558 7775 5925 7414 10327 8739 -4763 -7207 7126 4508 -10122 -7052 2196 82
206H2o151o388J697J0244l310j1271R155J3040m891n071L992M537K309n701o275
$$ 82 -6069 -12457 -10760 -516 -3826 -15097 -5942 7098 2207 -2864 1128 5665 7974 2273 -4002
221d002R755Q569j0235n395Q735K812o309o750k392N657J784j0184k197J1179
$$ -4002 5753 14322 4087 -1308 7427 10239 3930 -2820 -5212 445 2229 -7955 -10152 1027
235A027N47q990l19L775K425j508o082L131J1838j015q159M715P519k250m756
$$ 1027 1574 -7416 -7735 -3960 -1535 -3043 -9125 -5994 5844 4829 -3330 1385 8904 6654 1898
250A898k129L044N478l818o927O349O134p567o496K361J631k359m490k217O607
$$ 1898 -231 2813 8291 4473 -2454 3895 10029 2462 -4034 -1673 -42 -2401 -6891 -9108 -2501
265b501M977p400k389P302J553n225k335K847M978J240l997J573Q541l24p577
$$ -2501 2476 -4924 -7313 -11 1542 -3683 -6018 -3171 1807 3047 -950 623 9164 8840 1263
280A263l06L931m58m052l161K875N621l005o349K399L744m387n580m4L765K492
$$ 1263 957 4888 4430 378 -2783 92 5713 2708 -3641 -1242 2502 -1885 -7465 -7509 -3744 -1252
296a252k832j377O019M472m783l584L607K282j811k510J643N664J768m309j079
$$ -1252 -4084 -5461 558 5030 247 -3337 270 2552 741 -1769 -126 5538 7306 2997 1918
311A918M152j011o012k378K093J884j776k720K269L837j427n490q6L372j010l284
$$ 1918 6070 5059 -953 -3331 -1238 646 -1130 -3850 -1581 2256 829 -4661 -4747 -1375 -2385 -5669
327e669M18M832L094j406j539L046K122k669l859J241L707k24k631N42L879J45
$$ -5669 -5251 -419 2675 1269 -270 2776 4898 2229 -1630 -389 3318 3094 463 1005 4884 5029
343E029l979k943J389Q25l548k427K606L031q11k378J349K670q55l277r35L655
$$ 5029 1050 -1893 -504 321 -3227 -5654 -3048 -17 -828 -3206 -1857 813 -42 -3319 -4254 -599
359e99J643j457j26L483K246j737k495K68K043j100l600K38L790O0l286l31J584
$$ -599 1044 -413 -539 2944 5190 3453 958 1226 3269 2169 -1431 -1193 2597 2657 -629 -960 624
376F24R8k570k914J218K620j458j487K306K860m60k160Q6J547J303j864q88K893
$$ 624 722 -1848 -4762 -3544 -924 -2382 -3869 -1563 1297 837 -1323 -1237 310 1613 -251 -1139 1754
393A754K399j882j111J463P24j464k474r00K514L29l014o6K288K82k495q27M89
$$ 1754 4153 2271 1160 2623 3347 1883 -591 -1491 1023 1352 -1662 -1728 560 842 -1653 -2480 -1991
410a991R97l48j607R05L400l56k070J193J215j09q29j145J056K458j100j834J894
$$ -1991 -994 -1342 -2949 -2044 1356 1000 -1070 123 1338 1229 400 -745 311 2769 1669 -165 1729
427A729J749k750j286L1M07L34j514j240K530J296k961p09J672M5j165r9K6K210
$$ 1729 3478 728 -558 -527 -120 214 -1300 -2540 -10 1286 -1675 -2384 -712 -667 -1832 -1931 -1905 305
445C05J201k024N10K811r42j747K54J73O20L83j761J101K334j453k477P33M43
$$ 305 1506 -518 -8 2803 1861 114 368 541 1161 1544 -217 884 3218 1765 -712 21 464
462D64j747m13n47O44K039r51j606K281P77k330n14J078P0P82L36m21K192J452
$$ 464 -1283 -1696 -2243 -1599 440 -511 -2117 164 941 -1389 -1903 -825 -755 27 363 -58 2134 3586
480C586k923k20J614j204j237L76m24J345P40k241j40K304j910j986N36L32J1
$$ 3586 663 443 2057 853 -384 -8 -432 913 1653 -588 -728 1576 -334 -2320 -1784 -1452 -1441
497a441N29o81N41K793j046j831J571M27j589N04L10M63J583k61j678J519O20
$$ -1441 -912 -1593 -1052 1741 695 -1136 435 862 -727 -223 87 550 2133 1872 194 1713 2333
514B333k596o63R16p50K30L02r84J333J089k436j97J788j155j461J167K16O60
$$ 2333 -263 -926 -10 -760 -530 -228 -1212 121 1210 -1226 -1423 365 -790 -2251 -1084 -868 -208
531b08J125j017K44J727q41j693J027J33n31P47j11k54J607n23k255J132K55j915
$$ -208 917 -100 144 1871 1030 -663 364 497 -34 713 602 348 1955 1432 -823 309 564 -1351
549a351N3N74n92J110M43j557J056Q18j645k35J318p30K39J177p76Q59J359j521
$$ -1351 -1298 -724 -1316 -206 237 -1320 -264 554 -1091 -1326 -8 -738 -499 678 -98 761 2120 599
567E99n33J789j203r09Q92m00L8O48o47r20J213m28j403N82n4p31O33K38m81J286
$$ 599 66 1855 652 -257 635 235 273 921 274 -646 567 139 -1264 -682 -736 -1467 -834 -596 -1077 209
587B09j06j173J039J024j150K16O06l10O21L20j055K02Q80j594J78P17m83l35
$$ 209 103 -1070 -31 993 -157 59 665 355 976 1296 241 443 1323 -271 -93 624 141 -194
605a94P15p87l72Q90r90o12J273m59p86J099l44M76P38n72m65J230l09j190J167
$$ -194 521 -266 -638 252 -738 -1350 -77 -536 -1322 -223 -567 -91 647 75 -390 840 531 -659 508
624E08Q7k36P16j49o96O04m2j750M17P05n72P8K81m77M56Qo16j78P91j222L08
$$ 508 595 359 1075 926 230 834 792 -958 -541 164 -408 -330 -49 -526 -70 -62 -678 -856 -65 -1287 -979
645i79J317k12k17J201o75Q1L57j098j50J117m88l48R66j82l68O37p12q29M32
$$ -979 338 126 -91 1110 435 516 873 -225 -375 742 254 -94 872 690 322 959 247 -582 -150
664a50j96p48M08O03o14N45J28o39N63q0q08M57N71m47M42Q19j43P6M37p89k15
$$ -150 -346 -1094 -686 -83 -697 -152 -24 -663 -100 -180 -988 -531 40 -407 35 854 711 787 1224 435 220
685B20O47j166R7K62j71J97L80l30n11L19n99j72K88j73L3M25K62k9P71k34p94
$$ 220 867 -299 -202 60 -111 86 466 136 -375 -56 -655 -827 -539 -712 -679 -254 8 -21 750 516 -278
706b78K39M37p86P40J18k70N74K55q27J91L25j004l84M60j89J5L96l83J08N21
$$ -278 -39 398 -388 352 470 200 774 1029 202 393 718 -286 -670 -210 -399 -384 12 -371 -263 258
726B58n34n21L98j37kK23J06N91OJ62l88J13P4l74J36J85k18Q16m30l86K09J94
$$ 258 -276 -797 -399 -536 -538 -315 -209 382 388 550 162 275 349 -25 111 296 78 894 464 78 287 481
748D81j141N25J6k16j03M6j71L19L40n41M49J89n22j04M70k02J59N87m99M5N01
$$ 481 -660 -135 -119 -335 -438 -392 -563 -244 96 -445 4 193 -329 -433 37 -165 -6 581 82 127 628
769F28k88j99O11k30k69j41k12L03J27m42j46L35o2n55K3L31m37N69q2k40L55
$$ 628 340 141 752 522 253 112 -100 203 330 -112 -258 77 15 -540 -517 -186 -623 -54 -136 -376 -21
790b1j1j68O4L82m1Q8K39m57l4L97n13J35J00j28j65L52j14j86L50m53l53N40
$$ -21 -32 -200 -136 246 205 293 532 75 41 438 -75 60 160 32 -133 219 105 -81 269 -184 -537 3
812Ck11k52K59j2j93O87j95K3L71o40n5o6O31P4r6J09PJ24j73l80j16P6l29k39
$$ 3 -208 -460 -201 -213 -406 281 86 109 480 -160 -215 -281 350 424 328 437 444 568 395 15 -101 -25 -354 -593
836e93N36J83k34L3J2j40R8k80L6o7K53k3J24L75l0M59n28j48L19l80r2J93K86
$$ -593 -57 126 -108 -75 -63 -203 -105 -385 -349 -416 -163 -186 -62 313 283 742 214 66 385 5 -87 106 392
859C92j45J18k34J34n4l17j17r4j1J03j55K3N19m7j46j43J25p2R5j07K8N51j83
$$ 392 247 365 131 265 211 -106 -223 -317 -328 -225 -380 -357 162 115 -31 -174 -49 -121 -26 -133 -105 446 263
882B63J03J88j38l60L3j89klj63J29p7L99l55Mk9m9K01l56j56N00j13N96l91j7
$$ 263 366 554 416 56 89 -100 -102 -105 -268 -139 -216 183 -172 -168 -197 -246 -45 -401 -557 -57 -170 426 35 18
906A8M82n23L97l64J06J55j62P1o7J75r8j21n8j10K4m14J19K35J17k67L42j9j56
$$ 18 500 -23 374 10 116 271 109 180 113 288 190 69 11 -99 -75 -489 -370 -135 -18 -285 57 38 -118
929a18k7K03k55K48L9l33K04L67k86JJ2J33l3l7j9l31M95j97l20K96r8l31N48
$$ -118 -145 58 -197 51 90 -243 -39 328 42 43 55 188 155 118 99 -232 263 66 -254 42 -56 -387 161
952A61m71R5K90m36p1J39J81L5J27j33R8K42k99j67L51Q3o0j51J78K33l37r1O
$$ 161 -310 -215 75 -361 -432 -293 -112 -77 50 -83 15 257 -42 -209 142 225 165 14 192 425 88 -3 3
975CJ53N6l91K21l0lk53K62j03r8K60l27qM54l30l36O96P2n34O23k25r0K33J26
$$ 3 156 212 -179 42 12 9 -244 18 -85 -183 77 -250 -258 196 -134 -470 226 298 -236 387 162 72 305 431
999D31m77m1M51m37J07j71J85K9j60RP7j1k91k08J94J32q6J55R4J17K42l44J04
$$ 431 -46 -87 364 -73 34 -137 48 77 -83 -74 3 -8 -299 -507 -313 -181 -267 -112 -18 99 341 -3 101
1022A01Rn6L0q5J07p0L0k4j67M18j10k60o2j21J1P9J04k06K98P3m58K47n0nP6
$$ 101 110 54 84 -1 106 36 66 42 -125 293 183 -77 -139 -260 -249 -170 -66 -272 26 99 -359 -112 -162 -167 -91
1047i1r3K74k80K37q2J13K17j8k42J56q8j08J87k96L61k8m76L37M4l46j71K15
$$ -91 -184 90 -190 47 -35 78 295 277 35 191 103 -5 182 -114 247 219 -257 80 124 -222 -393 -178
1069a78n1j72N80m63J13M14j59r2J57k42k6n6L13l9K86j41p4r3K34l49L36j04
$$ -178 -229 -401 179 -284 -171 243 84 -8 149 -93 -119 -175 138 99 385 244 170 77 311 -38 298 194
1091A94m02Q4Q4L0k93K93k99K84K39l95j43J38J30K07l15K07N7J85j11j31j47
$$ 194 -208 -124 -40 -10 -303 -10 -309 -25 214 -181 -324 -186 -56 151 -164 43 100 285 174 43 -104
1112a04M99l84K70k11J75j47K94j24r0j63r8J72k59o1k17N35k15L16k21r5r2M03
$$ -104 395 11 281 70 245 98 392 268 178 15 -83 89 -170 -231 -448 87 -128 188 -33 -128 -220 183
1134A83n24L43R7k70L09J18q7m4O8j47J16j39k69J18J95r3j81K73k76J29J3j7
$$ 183 -341 2 99 -171 138 256 169 125 193 46 162 23 -246 -128 67 -26 -207 66 -210 -81 -68 -85
1156h5K3Q5J03l38J77M0k68J94K69k79J81N5j51O3j85K0K5K12j4j01l2Qn6K68
$$ -85 -62 23 126 -212 -35 5 -263 -69 200 -79 102 157 6 69 -116 -96 -71 141 127 26 -6 2 -54 214
1180B14l60J40j96K66j74LN9k22J69K9k36L23J7j97O8K9q6N08k5j14j60M07n27
$$ 214 -146 -6 -202 64 -110 -107 -48 -270 -101 -72 -308 15 32 -165 -97 -68 -154 354 329 215 55 462 -65
1203f5O4K2l43J83m2J66J72J64l91M2qj35J60j48J42m0j99K24J80j07J63j64J43
$$ -65 -1 21 -322 -139 -181 -15 157 321 -70 -28 -36 -171 -11 -159 -17 -57 -256 -32 148 41 204 40 183
1226A83j02m53M51l4N1N6P6j55j89K39m6j23oj99L70n3j05J72n9l35K04K56l22
$$ 183 81 -372 79 45 96 152 228 73 -116 123 77 -46 -52 -251 119 66 -39 133 74 -261 -57 199 -123
1249a23M5K4L1l1L20j42o3K4k38K87j06r6J74r0k41J00R3k2p3m9Q5r6K32j00P
$$ -123 -78 -54 -23 -54 266 124 61 85 -153 134 28 -68 106 16 -225 -125 -32 -54 -127 -176 -91 -187 45 -55 -48
1274d8k9J33j16j1K33m1k64K59%R3k12q9K88L0k39J19K22m92m6K4Q2j41L69k12
$$ -48 -77 56 -60 -71 162 121 -143 116 116 209 -3 -92 196 226 -13 106 328 -164 -210 -186 -104 -245 124 -88
1298h8n0m4P1L8n0J74j24K97l46j78K81K6J12P4o9j44K50k75J0J88K3k23J42l3
$$ -88 -138 -182 -111 -73 -123 51 -73 224 -122 -300 -19 7 119 193 124 -20 230 -45 -35 153 176 -47 95 62
1322F2k36m2L23n7j51L78o68M18R9k87N79k68j65O8Q7k91L60k8l11J09k4K33l33
$$ 62 -174 -216 107 50 -101 277 -391 27 126 -161 418 150 -15 53 140 -151 209 181 -130 -21 -45 188 -145
1345a45K92q1R6k98K87l60L42l27L30k42J15O6L8j27J9k39J02L25l5k38J08N1
$$ -145 147 66 162 -136 151 -209 133 -194 136 -106 9 75 113 -14 5 -234 -132 193 158 -80 28 79
1367G9k9P1k37L15l92P9J96j52o2L28k9j51J40l31K29l16K47J04l24J34n5J43
$$ 79 50 121 -116 199 -193 -114 82 -70 -132 196 167 16 156 -175 54 -262 -15 89 -235 -101 -156 -13
1389a3J93j73L2j83N3J48q5K62j47K16l34J79l57K32J63q9j84JN7m5L8K07j77
$$ -13 180 7 39 -144 -91 57 -28 234 87 303 -31 148 -209 23 186 97 -87 -86 -29 -74 -36 171 -6
1412fR2k27P0j3J32k0K0k43J64R5m9K53k09J39k42J01Nj11L14m77M63l27j03K38
$$ -6 86 -141 -71 -84 48 28 48 -195 -31 64 15 268 59 198 -44 57 62 -49 265 -212 251 -76 -179 59
1436E9J22o5k48L68m96K11j89K11lq6J49P9k16L12m19K18J07k3J02k0m9r0j42
$$ 59 181 116 -132 236 -260 -49 -238 -27 -30 -116 33 112 -104 208 -211 7 114 91 193 173 124 34 -108
1459a08J49J33l51O9L04l83J25K20k68L08j11J8p8q1qJ8N9l2m1K00M3J91l23M6
$$ -108 41 174 -177 -108 196 -187 -62 158 -110 198 87 105 27 -54 -62 -44 15 -17 -58 142 185 376 53 99
1483I9J55k96p1j54L93o8n6j30K18j04K37j11l78J99J75J01k14P0j31J34J1j56
$$ 99 254 -42 -113 -267 126 58 2 -128 90 -14 223 112 -266 -67 108 209 -5 65 -66 68 79 -77
1505g7j80O5J00K37j57l21N08k65K99j84o0o4L39r8j02r2J43R5j35l70L26N6m9
$$ -77 -257 -192 -92 145 -12 -333 175 -90 209 25 -35 -99 240 142 40 -52 91 186 51 -319 7 63 14
1528A4j87Q1q3j50N18j15l2j0J21k23L98l44N8L6k27J76J06k10J81L5k13o4M2
$$ 14 -173 -92 -175 -325 193 78 46 36 157 -66 332 -12 46 82 -145 31 137 -73 108 143 -70 -134 -92
1551i2l33J79J97j7Q9j30M34l09j93J03Q5q6q9p0L90l25L86j67mn9q4J96om8j43
$$ -92 -425 -246 -49 -66 23 -107 327 18 -175 -72 13 -73 -162 -232 158 -167 219 52 48 -11 -95 101 95 47 -96
1576i6K49l60o1K84J61k12L3j50k28M17M2o4p1N6J8N4K7k06j16J75K43k58j23
$$ -96 153 -207 -268 16 177 -35 -2 -152 -380 37 79 15 -56 0 18 72 99 -107 -223 -48 195 -63 -186
1599a86K59j02J8J15k92J81q2lJ32p6j60L26j81Q0M4j30Q5j82L36j19P7n26N79
$$ -186 73 -29 -11 104 -188 -7 -89 -92 40 -36 -196 130 -51 29 73 -57 28 -154 182 63 140 -386 193
1622A93m1k19K5J89j14N3k30Q5j49K65qj19K55l77q9K02K73j76k1J50k30q8N6
$$ 193 152 -67 -42 147 33 86 -144 -59 -208 57 49 -70 185 -192 -281 -79 194 18 -3 147 -83 -171 -115
1645a15L56k08k6M6J16k23K99l12K23j82k8J90OMj99n0j5J06p9K18qk05j95M18
$$ -115 241 33 7 53 169 -54 245 -67 156 -26 -54 136 142 146 -53 -103 -118 -12 -91 127 119 -86 -281 137
1669A37k55K70j87j24K61j81o9J16k4J39K5q6P1j31K73J6k98q4K94j55j08P8J80
$$ 137 -118 152 -35 -159 102 -79 -148 -32 -56 83 108 22 93 -38 235 251 -47 -131 163 8 -100 -22 158
1692A58J2j5j16P1k75J74P3O0j56j82K3L79r6j24k12K75R9k79k7K64R7k41j4J25
$$ 158 170 155 39 110 -165 9 82 142 -14 -196 -173 206 110 -14 -226 49 148 -131 -158 106 203 -38 -52 73
1716G3J2j33K1M0o6J91l1j54P5k53K37r2j52K30l80M93m58K44L6J24k26J86k4
$$ 73 85 -48 -27 13 -53 138 107 -47 28 -225 12 -80 -232 -2 -382 111 -347 -103 -67 57 -169 17 -7
1739gj01n4o2L33l05K89j02p4LJ56j24K35k67K18K6j70M2k1pj10L02j05j34j44
$$ -7 -108 -162 -224 109 -196 93 -9 -83 -80 76 -48 187 -80 138 164 -6 36 15 8 -102 200 95 -39 -183
1763a83K12J60l34K97j32J11n2j46J39j04J16O0j8P1j02k88L46Q5k88K05m33M00
$$ -183 29 189 -145 152 20 131 79 -67 72 -32 84 144 126 197 95 -193 153 238 -50 155 -278 122
1785A22j67N6o1j07N8L89l26l0K76J03l62p4K02Q9l7l36J76M0K41k58l5J23j43
$$ 122 -45 11 -50 -157 -99 290 -36 -66 210 313 -49 -123 79 168 131 -205 -29 11 252 -6 -41 82 -61
1808f1J53k6Q4j9j68L2M0j08K03o6j68J70p2O8k88K74J75l56J29N2J04k39M2J0
$$ -61 92 66 150 131 -37 -5 35 -73 130 64 -104 66 -6 62 -226 48 223 -133 -4 48 152 -87 -45 -35
1832c5P6j12O8J8K73j07k73j22P1L06k08k10K27J53k09J04j21J31j20J14k7J44
$$ -35 41 -71 -3 15 288 181 -92 -214 -143 163 -45 -255 -28 125 -84 20 -101 30 -90 24 -3 141
1854A41j75n0J30k46K12J9K5k14L45o8L7m9k28o4k2L91j1j77k6k6m9P0k65J37
$$ 141 -34 -84 46 -200 12 31 56 -158 187 119 156 107 -121 -185 -207 184 173 -4 -30 -56 -105 -35 -300 -163
1878a63k4J03j2k52L65R2J98m19J52P7l7k58L39J35n06N19l81j17J35K27j25j20
$$ -163 -187 -84 -96 -348 17 109 307 -112 40 117 80 -178 161 296 -210 309 -72 -189 -54 173 48 -72
1900g2J28k98K90l41L76n8j51K56j76J33p0P8l41K46J28m55M39m0M2j33j8k0J7
$$ -72 56 -242 48 -293 83 25 -126 130 -46 87 17 95 -246 0 128 -327 112 72 114 -19 -37 -57 -40
1923d0R9R4nn1N4k49J09j21k12N67l40K37k35Nj66K13r2K06q8P6j13J1q8J90R8
$$ -40 59 153 148 97 151 -98 11 -110 -322 245 -95 142 -93 -88 -254 -41 -133 73 -15 61 -52 -41 -129 61 159
1948A59N6j08O4q7L2m4k06K83j80r0J57j15K31q8O0j75J73k40M6k3j3J91j10n2
$$ 159 215 107 171 84 116 72 -134 149 -31 -121 36 -79 152 64 124 -51 122 -118 -72 -95 -108 83 -27 -79
1972g9J38L3nm3m7krK8l4j58Q6J58j0j11Oj8N6J11j98J91q7p7K6K33L5k01K54
$$ -79 59 92 87 44 -3 -5 -14 14 -20 -178 -92 66 56 -55 -49 -67 -11 100 -98 93 6 -71 -45 188 223 22 276
1999B76j29n5k11nL89l25o1K4j8K32K22m46J66Oj92k9J32k27L32k7j98L44p9r7
$$ 276 147 92 -119 -124 265 -60 -121 -97 -115 117 339 -107 59 65 -127 -156 -24 -251 81 54 -144 200 121 24
2023B4j75J19n9J09R5J6j00M5k6j38j30M28j84K8j37L74k94P1M8k33P7j9l5L39
$$ 24 -151 -32 -91 18 113 129 29 74 48 -90 -220 208 24 52 -85 289 -5 66 114 -119 -42 -61 -96 243
2047B43q2Q4l91L18J76k47j93o6K50j28Q9j3m7j31RR9R8j55j4J53l5k19J16J91
$$ 243 161 245 -146 172 348 101 -92 -158 92 -36 53 40 -7 -138 -129 -30 68 -87 -101 52 17 -202 -86 105
2071A05k11nM6k33M28r7J25j54R3k25J35M4K7K04k95j80M13j14j58QN4J95j21
$$ 105 -106 -111 -65 -298 130 33 158 4 97 -128 7 51 78 282 -13 -193 220 106 -52 -44 10 205 84
2094H4R8k71L61l64P1J71J78j72m02M46k29r6J34j84L27k85K07l9N3O7j89J93
$$ 84 182 -89 272 -92 -21 150 328 156 -246 200 -29 -125 9 -175 152 -133 74 35 88 155 -34 159
2116A59ml9k9j67O2K37k36R9k68L75m41L17K4l92P21l83j14J58k12j4L00l59O55
$$ 159 155 116 87 -80 -18 219 -17 82 -186 189 -252 65 89 -303 418 35 -79 79 -133 -147 153 -206 449
2139D49n20K09Q3j34m8m1M2m1J03q4o5l9K1K49l02M7oK17j84J32j8k0J44j1j48
$$ 449 -71 138 221 87 39 -2 40 -1 102 18 -47 -86 -65 184 -118 -71 -77 140 -44 88 70 50 194 183 35
2164C5l7j23j4K26q8r2j54K84k00M13m46N66j03Kk41k06J53O7K4q1K8q8nj36J75
$$ 35 -2 -125 -139 87 -1 -93 -247 37 -163 250 -196 370 267 269 28 -178 -25 42 66 -15 13 -75 -80 -216 -41
2189d1M7J51k45J42k8k61J63k57M20j36r4N6k1n1O8r7N4L35L0l67Q2j32L47k16
$$ -41 6 157 -88 54 26 -235 -72 -329 91 -45 -139 -83 -104 -155 -87 -184 -130 205 235 -132 -50 -182 165 -51
2213e1K25j20n6M2j36K33j08J7j07J11r1k37J21MJ97Rj02K34l86L8L7K41k75K11
$$ -51 174 54 -2 40 -96 137 29 46 -61 50 -41 -278 -157 -153 44 53 -49 185 -201 -163 -126 115 -160 51
2237E1j81j92L05o5K08j52J08K2j92J7k1L1k8K67j89j5k2k6K40j28k21J88J41
$$ 51 -130 -322 -17 -82 126 -26 82 104 -88 -71 -92 -61 -89 178 -11 -26 -48 -74 166 38 -183 5 146
2260A46k51J38M8j91K89k12N2j5j06R7j35K88n2k37K76j66J71l26J33P7K14l50
$$ 146 -105 33 81 -110 179 -33 19 4 -102 -5 -140 148 96 -141 135 -31 140 -186 -53 24 238 -112
2282a12J85j23l3j5j91J68N9o2j98L68k8k81N07j09k70L46k43K19j9l02P6J80
$$ -112 73 -50 -83 -98 -289 -121 -62 -124 -322 46 18 -263 244 135 -135 211 -32 187 168 -134 -58 122
2304A22k15j08K00j43L58q2k39P7P9r3%K95q1k88j22K81j01K36k69Q3p2R4J78
$$ 122 -93 -201 -1 -144 214 132 -107 -30 49 -44 -44 251 170 -118 -240 41 -60 176 -93 -10 -82 12 190
2327A90l40KL9K26o1r7J26k01L26k26L0Jj51K28o2j22q9j76L74K3q0j7O9L16l46
$$ 190 -150 -148 -109 117 56 -41 85 -116 210 -16 14 15 -136 92 30 -92 -181 -357 17 40 -40 -57 12 328 -18
2352a8J95k18p6j00L01lj85K06nk63J26J58J52l04k29K81n6J06j77K77k10j18
$$ -18 177 -41 -117 -217 84 81 -104 102 97 -166 -40 118 270 -34 -263 18 -38 68 -109 168 -42 -160
2374a60J02J1K59n9p2j40J44k49L22p4Q7Rj17j49J66p5P6ko1K05j03Q9k69M3j56
$$ -160 -58 -47 212 153 81 -59 85 -164 158 84 171 180 63 -86 80 5 81 79 18 223 120 209 -60 -17 -173
2399a73J62K11l64N8M8n2J6o1R8J00j16L6k8K19j88m1K95j75L0j25j82Q4K32J1
$$ -173 -11 200 -164 -106 -58 -110 -94 -155 -57 43 -73 -37 -65 154 -34 -75 220 45 75 -50 -232 -148 84 95
2423I5j15J77k21P4R3p1o9r8l5M03j28k20N3L0L4q8K81l06j6m2J81J51k60J7k3
$$ 95 -20 157 -64 10 103 32 -37 -135 -170 233 105 -115 -62 -32 2 -86 195 -111 -127 -169 12 163 -97 -80 -103
2448a03J95j33n3J82k28K26r8J20j11K8L2j55L30j78j50Q2M3P6j64J2K5j86K98
$$ -103 92 -41 -94 88 -140 86 -12 108 -3 25 57 -98 232 54 -96 -14 29 105 -59 -47 -22 -208 90
2471I0m0m19M33J38n4k63j20Q8J37K12l34j9O1l31K13J56J00r9L1O2m0J33r4J96
$$ 90 50 -369 64 202 148 -115 -235 -147 -10 202 -132 -151 -90 -421 -208 -52 48 -51 -20 42 2 135 41 237
2495B37k76q7J61l8K38l08J6L0l11L49p1M12l19J63m6j48j14J77M4j64J69J58
$$ 237 -39 -126 35 -3 235 -73 -57 -27 -338 11 -60 352 33 196 150 2 -112 65 109 -55 114 272
2517B72k67q4O0m7R5j7q6J02Q1j66j34M38n36K68L68k67N6o2n0J29l88J48K8J04
$$ 272 5 -79 -19 -66 29 12 -74 28 109 -57 -191 247 -289 -21 347 80 136 74 24 153 -235 -87 -59 45
2541D5j16K69l58K51m14M28k7j0Rl3k64R6R0KM3J04k82J14r0J44K21j42K0m7J21
$$ 45 -71 198 -160 91 -323 105 78 68 77 44 -220 -124 -34 -32 11 115 -167 -53 -143 1 222 80 100 53 174
2566A74j82j09L28j46m23M55k28J3P0j71J97j41K26r8R3J4M9J0n6J83l69L5N8
$$ 174 -8 -117 211 65 -358 97 -131 -118 -48 -219 -22 -163 63 -35 58 72 121 131 75 258 -111 -76 -18
2589a8j8J03k99P9L18l8J6m9l09L2M39k25q3K58k33p6J56R4M2k33J22J4q0J25
$$ -18 -36 67 -232 -153 165 127 143 94 -215 -183 256 31 -52 206 -27 -103 53 147 189 -44 78 92 12 137
2613A37l09p4R6J58j82J6K14p6Q1j67P9K23r9m4j94J00l0l6J76k82L53j16P7J26
$$ 137 -172 -246 -150 8 -174 -158 56 -20 61 -106 -27 196 97 53 -141 -41 -71 -107 69 -213 140 24 101 227
2637B27l43J33J13j86K37j55N3J13k25j64o3K35J78o2k99L45j43j74K06k12K71
$$ 227 -116 17 130 -56 181 26 79 192 -33 -197 -260 -25 153 91 -208 137 -6 -180 26 -186 85
2658H5N1r8m2K53j20N9j74q5K4j9K1J11k64P1k7K05l8q1m4J15k4NR3k63L97j38
$$ 85 136 38 -4 249 129 188 14 -71 -47 -66 -45 66 -198 -127 -154 51 13 -68 -112 3 -21 -16 77 -186 211 73
2684G3NJ9j48O3p7K5J04j94m6L28k40K79n77J96P4J73m3Pl5rk32J75K1m7O5K46
$$ 73 78 97 -51 12 -65 -40 64 -130 -176 152 -88 191 -386 -190 -116 57 14 21 -14 -23 -255 -80 -59 -106 -41 205
2710B05l56J27J37jj26o1R9j28K64n5J46j80l40J75K23q9j66J42l5L6M8m18L37
$$ 205 -151 -24 113 112 -14 -75 24 -104 160 105 251 71 -269 -94 129 40 -126 16 -19 17 65 -353 -16
2733a6Op2L3j4O3L4Q8pJ9p4k90L34k33L86j27j55n6L5M2q1lJ67p5Rj60M88k64
$$ -16 -10 -82 -49 -63 0 34 122 115 134 60 -230 104 -129 257 130 -25 -81 -46 -4 -85 -88 79 4 13 -147 341 77
2760G7k43J40K03l4p4p8K48k94r3J53pr1Q7o8K15k19j46J79Mq1k5K34j90K15J5
$$ 77 -166 -26 177 143 69 -9 239 -55 -148 5 -2 -93 -6 -74 141 -78 -224 -45 -41 -122 -147 87 -103 112 127
2785A27m6P7k46OM7qK63k63J00K73j16l80J38M0J60k26O2l8j99J68K03l96p5L63
$$ 127 81 158 -88 -82 -35 -43 220 -43 57 330 214 -166 -28 12 172 -54 8 -30 -229 -61 142 -254 -329 34
2809C4j35J50p8m4o7J00J60j39Q3l9j3l0M43q27O33j58j57J5J09r5R8M5p5M3P4
$$ 34 -101 49 -29 -73 -140 -40 120 -19 64 25 12 -18 425 -402 231 73 -84 -69 40 -55 43 88 13 56 130
2834A30J02j71l5pj33J99k31m6J82j06K16l42J65J49J02o9j42p3OJ86j0j32n2
$$ 130 232 61 26 19 -114 85 -146 -192 -10 -116 100 -242 -77 72 174 105 -37 -110 -104 82 72 -60 -112
2857a12R0l1J36M0j58J5r7j2J22J22J55j02j83j22J18J2J60j95j17K05r6J69j94
$$ -112 -22 -53 83 123 -35 -20 -117 -129 -7 115 270 168 -15 -137 -19 -7 153 -42 -159 46 -50 119 -75
2880g5K79k36j51N8K1L63k39O8q9K63k84J38j9lJ17m75L01k58J9J73K44j18J24
$$ -75 204 -32 -183 -125 -104 259 20 88 -1 262 -22 116 97 94 211 -264 37 -221 -202 -29 215 97 221
2903B21k18K3l0n9k55L37K4k25L13O8l79J67M4j05J34j26K4K98l06J61m4j50K54
$$ 221 3 26 -4 -63 -318 19 43 -182 131 199 -180 -13 31 -74 60 -66 -42 256 -50 111 67 -83 171
2926A71j80oK05K20m66J89l30J22K47jP1l18J33K0J03l10k4K98J1k08kO3J0j01
$$ 171 -9 -15 190 410 -56 133 -197 -75 172 171 242 -76 57 77 180 -130 -154 144 155 -53 -55 8 18 -83
2950h3L63m00K58k10K8Q5m08N15j86L1K10l31K20J64k94p6J33KJ40j29L0K4l02
$$ -83 280 -120 138 -72 -44 41 -367 148 -38 -7 203 -128 92 256 -38 -114 19 21 161 32 62 86 -216
2973b16K21k24M69n5k71QpO3mp5n9L41m11N16n7l06K40l68M05j66j44l7K15J54
$$ -216 5 -219 250 195 -76 -68 -75 -12 -16 -91 -150 191 -220 296 239 -67 173 -195 210 44 -100 -137 78 232
2997B32j54l61L6K88l8k86P6K87j61K13k18l6K15k20M13j28l50R6N4l7k3j5J54
$$ 232 78 -283 -247 41 3 -283 -207 80 -81 132 -86 -122 93 -127 286 158 -192 -96 -42 -79 -102 -117 37
3020C7k3m5P9L5L7k7r2MK89k39k09K69l39K08j21Q1l2J96j9q3o3k1J23k02O7K32
$$ 37 14 -31 48 83 120 93 1 5 294 55 -154 115 -224 -16 -137 -56 -88 108 89 6 -57 -78 45 -157 -90 142
3046A42l44P6J84J4Rj30J25j43J16k00L36k81l56K27J62m4J39j01n7O2O2J67k62
$$ 142 -202 -126 58 72 81 -49 76 -67 49 -151 185 -96 -452 -225 -63 -107 32 -69 -126 -64 -2 165 -97
3069i7R0o1K09j87J7j34j12M46k77J57Q9l24K26J85k67N3K35l55L02k33p9K35
$$ -97 -7 -68 141 -46 -29 -163 -275 171 -106 51 140 -184 42 227 -40 13 248 -107 195 -38 -117 118
3091A18j61K85m08J95r0K26j28j61J36o5J55r9K6J18l5j39m6Q2m4O6L9j10L4J33
$$ 118 -43 242 -166 29 -61 165 37 -124 12 -53 102 3 29 147 112 -27 -73 9 -35 31 70 -40 -6 127
3115A27j75N4J99k21rL0J54j67J70l70J77K42K9j53j01k32J84O9k64L67k98J95
$$ 127 -48 6 205 -16 -25 5 159 -8 162 -208 -31 211 240 87 -14 -246 -62 7 -257 110 -188 7
3137GL83l07K3j87J8J29k88J54J42p6l01M53k98j49L04O1l33R2K07J6j27O0O1
$$ 7 390 83 106 -81 -63 66 -222 -68 74 -2 -303 150 -148 -297 7 68 -265 -173 34 50 -77 -17 44
3160D4j0J33m98K56J17K5j11L09j25L2l59K94l29M16j52k86L39o8j15lK20l06
$$ 44 34 167 -331 -75 42 67 -44 265 140 172 -187 107 -222 194 42 -244 95 27 -88 -91 129 -177
3182a77L53j73R0q5L04j90q5J83k78R5q1M3J35k19L28k10J57k87O9k7j2J75K1
$$ -177 176 3 93 8 312 122 37 220 -58 37 -44 -1 134 -85 243 33 190 -97 -28 -55 -67 108 129
3205A29m32N88l41J75k87J98k62K42K63j77j59J5K07j06j07j2J22P9j41J36k86
$$ 129 -303 285 -56 119 -168 30 -232 10 273 96 -63 -48 159 53 -54 -66 56 135 -6 130 -156
3226a56K13p1j54M3o2K26M8k3j17J45j11k08K89j16R0p3m7J26j36J77j01l34N59
$$ -156 57 -14 -168 -125 -187 39 87 64 -53 92 -19 -227 62 -54 36 -37 -84 42 -94 83 -18 -352 207
3249B07m8l24p4L17k01K98l19K04R3J0nk03J76l88L70RP1j06k68J21K34n5K7j71
$$ 207 159 -165 -239 78 -123 175 -144 60 153 163 158 -45 131 -257 113 122 193 87 -181 -60 174 119 146 -25
3273b5M4J78o1j03j14M9j01P5K31k7l18K3J04L09q8j28q9J61j42p5N0Q0J10m19
$$ -25 19 197 136 33 -81 -32 -133 -58 173 146 -172 -149 -45 264 176 48 -41 120 -22 -97 -47 33 143 -276
3297b76J39J05r3J95k4k6r8K65j34P7j20R7l95M70J7j19N5r4J71O2m93J68J26
$$ -276 -137 -32 -125 70 46 20 -78 187 53 130 10 107 -288 182 199 80 135 41 212 274 -219 -51 75
3320G5L3J99n13J61O9K3r7j71k48M88m8lj18o9J57K36Lj99K0K0j86Q3K37j07r
$$ 75 108 307 -206 -45 24 47 -50 -221 -469 19 -29 -32 -150 -219 -62 174 177 -22 -2 18 -168 -85 152 45 36
3345C6j61J57j05j7j12L42M8q7j04l2k36J77N02o59K64j41M09l52j12J72m3M6
$$ 36 -125 32 -73 -90 -202 140 188 101 -3 -35 -271 -94 408 -251 13 -128 281 -71 -183 -11 -54 -8
3367ho2K21k05K54j78p9j12L59l03j41K19K53j90q2l4K82j19m60N28j9j06j10
$$ -8 -70 151 -54 200 22 -57 -169 190 -113 -254 -35 218 28 -54 -88 194 75 -385 143 124 18 -92
3389i2j58M71j62q4J32J30k52K34k10k31K62n2N0Q1j36p2K27m0K0j14J75l11J38
$$ -92 -250 221 59 -25 107 237 -15 219 9 -222 40 -12 38 119 -17 -89 138 98 118 4 179 -132 6
3412FJ61m19L2J79O9L1k65L31m6k28J6K96k78j39L54k53J28J17k29Q6K35j09n4
$$ 6 167 -252 -220 -41 28 59 -206 125 79 -149 -133 163 -115 -254 100 -153 -25 92 -137 -51 184 75 21
3435B1n7k54MJ30J98o8nR5l01K26k9K89m37j94L34J39j73j70L19j16N1nj16K4
$$ 21 -36 -290 -286 -156 42 -26 -31 64 -237 -11 -40 249 -188 -382 -48 91 -82 -252 67 -49 2 -3 -119 -95
3459i5J89J86K9l42O0K16m00J31R6l79M15j29P3J1L5N0n9J32l44Q7L14k55k20
$$ -95 94 280 309 -33 27 243 -157 -26 70 -309 106 -23 50 61 96 146 87 219 -125 -38 276 21 -199
3482a99K44L4J3j94k7L88k79L59l43N4j33K8J62k43N7r2J68R3k15L09m52K10l6
$$ -199 45 79 92 -102 -129 259 -20 339 -4 50 -83 -55 107 -136 -79 -171 -3 90 -125 184 -268 -58 -94
3505i4L23k60n9q8J92r2L27k89M9R7j86K35j43n2k02K67J95j49l30L94J47l53
$$ -94 229 -31 -90 -178 14 -78 249 -40 9 106 -80 155 12 -40 -242 25 220 71 -259 135 282 -71
3527g1mJ02j7k57K79N6p5n4J27k0r0m9M1l32M42j05mk50J43k20K25L85k93q6o0
$$ -71 -75 27 10 -247 32 88 13 -41 86 66 -24 -73 -32 -364 78 -27 -31 -281 -138 -358 -133 252 -41 -127 -187
3552a87M18m22L79l23MM6Q5o0K39k15J88l32K61j64k43K08N9m7l7RK25J68m36
$$ -187 231 -191 188 -135 -131 -85 0 -60 179 -36 152 -180 81 -83 -326 -118 -59 -106 -143 -134 91 259 -177
3575a77K26J81m12J30L43j56k99N17k68k34l8J93M7j8j2J43j79M3n3J25L4j99
$$ -177 49 230 -182 -52 291 135 -164 353 85 -149 -187 6 53 35 23 166 -13 30 -23 102 136 -63
3597f3m0j59O32k47m0N6j38k4Jl5j10l1m9J87j36K03L2K9j6P3j69L3r5n0L97j44
$$ -63 -103 -262 370 123 83 139 1 -23 -22 -57 -167 -198 -247 -60 -196 7 39 68 52 125 -44 -11 -106 -156 241 97
3623I7q0J3J75m18K10r9J09j52K09RL8Nl7J58k25j3O3J1R1j63J55j93J17j58K15
$$ 97 17 30 205 -213 -3 -102 7 -145 64 73 111 116 79 237 12 -1 62 73 164 1 156 -37 80 -78 137
3648A37q0j3O6M2q8j43r5K1M09j85L3L9j12Q7k78Q8J59L2k3J18j91O5nn4j82K35
$$ 137 57 44 110 152 64 -79 -174 -153 256 71 104 143 31 118 -160 -72 87 119 96 214 23 88 83 29 -153 82
3674H2J32l02L09l73J34J72k5j36n0K41k20q0J58J59q2j25K7J62K2m35K32N5L1
$$ 82 214 -88 221 -152 -18 154 129 -7 -57 184 -36 -116 42 201 119 -6 21 183 205 -230 2 57 88
3697H8J65q5r6o0J63k13jQ5k4j9q0J59o3m6L94j91M4j41j53J37k41m3K28j0m8
$$ 88 253 168 72 12 175 -38 -39 46 22 3 -77 82 19 -27 367 176 220 79 -74 63 -178 -221 7 -3 -51
3722e1q2L57k59m0Q2J99k20k90M33n2p0p4j53R0J41o5N6J6j4J20l9O8n1R7q3o2
$$ -51 -133 224 -35 -75 7 206 -14 -304 129 77 7 -67 -220 -130 11 -54 2 18 4 124 85 153 102 199 116 54
3748E4j50Q6K40j94k3O9rplk28K75j87L66l23k28K68kk28N95m05j63L90j88k45
$$ 54 -96 -10 230 36 13 82 73 66 63 -165 110 -77 289 -34 -262 6 4 -224 371 -34 -197 193 5 -240
3772b40K89Rp3K55m80K89O0j98n2L4K17k76J86j36L16j91j0m05N81j95l7l5R7
$$ -240 49 58 -15 240 -240 49 109 -89 -141 -107 110 -166 20 -116 200 9 -1 -406 175 -20 -57 -92 5
3795EJ11j87q3J70J76r7k14qJ47j59L85k81J00r8L2j10l0L77l58k9P2QP1K02l71
$$ 5 116 -71 -154 16 192 95 -119 -127 20 -139 246 -35 65 -33 -1 -111 -141 236 -122 -151 -79 -71 0 202 -169
3820a69M07l22J24K09k25l35L03p4O3K02k37L2j70L56k05p2K70k89J59J09o2R
$$ -169 238 -84 40 249 24 -311 -8 -82 -19 183 -54 -22 -192 164 -41 -113 157 -132 27 136 74 83
3842H3j00mJ0l8j09K39J4p0J16k13p5M42l63J28J4l2l59L01j56K28O8k13j9J81
$$ 83 -17 -21 -11 -49 -158 81 95 25 141 -72 -147 295 -68 60 74 42 -317 -16 -172 56 124 -89 -108 73
3866G3m4J10r0J20l84J22L12J8q7r1m56M10m1j75M9L04q2o6K49l42K0J6k1L60
$$ 73 29 139 49 169 -215 -93 219 237 150 59 -397 13 -28 -203 -154 150 68 2 251 -91 -71 -55 -76 284
3890B84j29n36J17L72k69J03M4m0j66M3J57J12m0J54j70O9l19K13R5Oj98O2L29
$$ 284 155 -381 -264 108 -161 -58 -14 -54 -220 -177 -20 92 52 206 36 105 -214 -1 94 100 -98 -36 293
3913B93m25J79r7M0j32J77j27K03k88J83j83K00k37L10j74L6J63k31J08k28K18
$$ 293 -132 47 -50 -10 -142 35 -92 111 -177 6 -177 23 -214 96 -78 -42 121 -110 -2 -230 -12
3934a2j98L75q5j93P3J21m7J92l31k64J64J63N4J39j5%l49K37N1j47J17p7j51
$$ -12 -210 165 80 -113 -40 81 34 226 -105 -369 -205 -42 12 151 136 136 -213 24 75 -72 45 -32 -183
3957a83j9L01l50K87M3l02O6J80j5k2K28p9p4j90L27j69J90k20j59L35q1k11J64
$$ -183 -202 99 -251 36 79 -223 -157 23 8 -14 214 135 61 -129 198 29 219 -1 -160 175 94 -117 47
3980D7R6j05JL1K5M8M1m3m1Kl30J67J07j35J29l3J19M8kk31p3J36K26k61J30O4
$$ 47 143 38 39 70 95 143 184 141 100 102 -228 -61 46 -89 40 7 126 174 172 -59 -132 4 230 -31 99 163
4006A63k30K81n9j31p6p1J54j67R3p3J13Q5k68K5Q6M4oK0k51M62j69j62L10k52
$$ 163 -67 214 155 24 -52 -123 31 -136 -43 -116 -3 82 -186 -161 -75 -31 -37 -17 -268 194 25 -137 173 -79
4030g9r5K15j48J64k25J35m6J96l1j08m2N4J69L6Mk9l23M4M13l42r4K07l42K54
$$ -79 -174 41 -107 57 -168 -33 -79 117 86 -22 -64 -10 159 195 199 170 -153 -109 304 -38 -132 75 -267 -13
4054a3l0k04K44J87l36PO11n34k78N06l08J25j52J79j7n6J42jl4j65L56k65K34
$$ -13 -43 -247 -3 184 -152 -145 466 -68 -346 160 -148 -23 -175 4 -13 -69 73 72 38 -127 229 -36 198
4077A98J5k21k8J14J35k92L07j67k38K28j41J40r0m4J79k72K60o5j10J38j53L23
$$ 198 213 -8 -36 78 213 -79 228 61 -177 51 -90 50 -40 -84 95 -177 83 18 -92 46 -107 216
4099B16L7k27k46M17k37pJ30j84J07j59J3J97M2J38l51K57k37nJ7O7k53K22J52
$$ 216 253 26 -220 197 -40 -47 83 -101 6 -153 -140 57 99 237 -114 143 -94 -99 -82 -15 -268 -46 106
4122A06q2L1L6R5j0l9p0O4k02j97Q1L8J72l6K24p5j98J03p1q0Q7O0O6m0j55J25
$$ 106 24 55 91 186 176 137 67 131 -71 -268 -187 -149 23 -13 211 136 -62 41 -30 -110 -23 37 103 63 -92 33
4148C3K1J22j06Ok96K78j09J68j1j51J7J88k82n4J2L93j68k42K9J92j35Kp9J93
$$ 33 54 176 70 76 -220 58 -51 117 106 -45 -28 160 -122 -176 -164 229 61 -181 -152 40 -95 -93 -172 21
4172B1l1Jj39l3J53j05J70J34l03L21k09j02L32l63J74q3k1O2R7k40J80M6lJ66
$$ 21 -10 -9 -148 -181 -28 -133 37 171 -132 189 -20 -122 210 -153 21 -62 -83 -21 76 -164 16 62 59 225
4196B25K9k98j50K84j75J08j88J54J50k62J14j57L23l12Q6k0%J00j3o6P4o8M4
$$ 225 254 -44 -194 90 -85 23 -165 -11 139 -123 -9 -166 157 -155 -69 -89 -89 11 -2 -68 6 -62 -18
4219a8K48j64j60O3l3kJ05k23L68k79M8Oq0l3M02j00O3r6k05n4K18K4r3m0l2L86
$$ -18 230 66 -94 -31 -64 -66 39 -184 184 -95 -47 -41 -121 -154 248 148 211 115 -90 -144 74 98 5 -35 -67 319
4245C19q5k02M4r4l2M4J79k58p3L40k95K30j67L6J77j46j91J58N6M6j62J81J24
$$ 319 234 32 76 -18 -50 -6 173 -85 -158 182 -113 117 -50 -14 163 17 -174 -16 40 86 -76 105 229
4268B29o7j98L1N6p4O7j39J80K4j57j4K1j07o5N8N7r2J62lk22L93l19L18L0j75
$$ 229 162 -36 -5 51 -23 44 -95 85 109 -48 -62 -41 -148 -213 -155 -98 -190 -28 -31 -253 140 -179 139 169 -6
4293fL14k33N6ok19K74l88J19J09n6M7lM3Q3k20J23r2p4J91k45L11j21J73r2j00
$$ -6 308 75 131 125 -94 180 -208 -89 20 -36 11 8 51 134 -86 37 -55 -129 62 -183 128 7 180 88 -12
4318a2K26l74K46j07Jl4j96K51Q1r8J17n4o4L4o5o5Q4J50l32K87j6N8j03M1k41
$$ -12 214 -160 86 -21 -20 -54 -250 1 82 -16 101 47 -17 17 -48 -113 -29 121 -211 76 60 118 15 56 -185
4343a85J34l91N45j35J10k36k8M2K29Rn4j38o0K39j89N4J6J88j87J57k1j37J43
$$ -185 -51 -442 103 -32 78 -158 -186 -144 85 94 40 -98 -158 81 -108 -54 -38 150 -37 120 99 -38 105
4366A05j42L1j13J78J8O3j86N8k14L69N7j98k13L35j93j64L63Q0l56o9J08J56
$$ 105 -37 -6 -119 59 77 140 -46 12 -202 167 224 26 -187 148 -45 -209 154 234 -122 -191 -83 73
4388G3k18K34j27k71R2K95j22j57J67j04J04J54j08q5K67k44j04NJ17j34OO6Q0
$$ 73 -145 89 -38 -309 -217 78 -44 -201 -34 -138 -34 120 12 -73 194 -50 -154 -149 -32 -166 -160 -94 -14
$$ [...]
8191a34
##END NTUPLES=NMR FID
##END=
