##TITLE=1H_SR167RTFA
 CDCl3
 48 sc, 
 19.4.2023
##JCAMPDX= 6.0         $$ Bruker NMR JCAMP-DX V2.0
##DATA TYPE= NMR FID
##DATA CLASS= NTUPLES
##ORIGIN= UXNMR, Bruker Analytische Messtechnik GmbH
##OWNER= root
$$ XWIN-NMR		Version 3.5
$$ Wed Apr 19 16:22:23 2023 Russian Standard Time (UT+4h)  she@DPX200
##.OBSERVE FREQUENCY= 200.1316
##.OBSERVE NUCLEUS= ^1H
##.DELAY= (6, 6)
##.ACQUISITION MODE= SIMULTANEOUS
##.ACQUISITION SCHEME= undefined
##.AVERAGES= 48
##.DIGITISER RES= 18
##SPECTROMETER/DATA SYSTEM= spect
##.PULSE SEQUENCE= zg30
##.SOLVENT NAME= CDCl3
##.SHIFT REFERENCE= (INTERNAL, CDCl3, 0, 15.7039)
##AUDIT TRAIL= $$ (NUMBER, WHEN, WHO, WHERE, WHAT)
$$ ##TITLE= Audit trail, XWIN-NMR		Version 3.5
$$ ##JCAMPDX= 5.01
$$ ##ORIGIN= Bruker BioSpin GmbH
$$ ##OWNER= she
$$ F:/spectra/data/she/nmr/H-F/1/audita.txt
$$ ##AUDIT TRAIL=  $$ (NUMBER, WHEN, WHO, WHERE, WHAT)
(   1,<2023-04-19 16:18:03.56 +0400>,<she>,<DPX200>,
      <continue with go, POWCHK disabled, PULCHK disabled
       configuration hash MD5:
       00 E9 B6 7A A2 85 ED C7 34 08 36 98 17 FE 4E 26
       data hash MD5: 16K
       C9 7D 59 2A 3D E4 90 3C F9 0A 9C DB A4 9B F2 F5>)
$$ ##END=
$$ 
$$ hash MD5
$$ CE 51 11 0D 62 63 7E CD 93 F1 B9 EB 20 0F 4C C9
##$RELAX= 
##$RELAX= 
##$RELAX= 
##$RELAX= 
##$RELAX= 
##$RELAX= 
$$ Bruker specific parameters
$$ --------------------------
##$DU= <F:/spectra>
##$EXPNO= 1
##$NAME= <H-F>
##$PROCNO= 1
##$TYPE= <nmr>
##$USER= <she>
##$AMP= (0..31)
100 100 100 100 100 100 100 100 100 100 100 100 100 100 100 100 100 100 
100 100 100 100 100 100 100 100 100 100 100 100 100 100 
##$AQSEQ= 0
##$AQ_mod= 1
##$AUNM= <au_zg>
##$AUTOPOS= <>
##$BF1= 200.13
##$BF2= 200.13
##$BF3= 200.13
##$BF4= 200.13
##$BF5= 200.13
##$BF6= 200.13
##$BF7= 200.13
##$BF8= 200.13
##$BYTORDA= 1
##$CFDGTYP= 0
##$CFRGTYP= 5
##$CHEMSTR= <none>
##$CNST= (0..31)
1 1 145 1 1 1 1 1 1 1 1 1 1 1 1 1 1 1 1 1 1 1 1 1 1 1 1 1 1 1 1 1 
##$CPDPRG= <>
##$CPDPRG1= <>
##$CPDPRG2= <>
##$CPDPRG3= <>
##$CPDPRG4= <mlev>
##$CPDPRG5= <mlev>
##$CPDPRG6= <mlev>
##$CPDPRG7= <mlev>
##$CPDPRG8= <mlev>
##$CPDPRGB= <>
##$CPDPRGT= <>
##$D= (0..31)
0 1.2 0 0 0 0 0 0 0 0.06 0 0.03 0 0 0 0 0.0002 0 0 0 0 0 0 0 0 0 0 0 0 
0 0 0 
##$DATE= 1681906519
##$DBL= (0..7)
120 120 120 120 120 120 120 120 
##$DBP= (0..7)
150 150 150 150 150 150 150 150 
##$DBP07= 0
##$DBPNAM0= <>
##$DBPNAM1= <>
##$DBPNAM2= <>
##$DBPNAM3= <>
##$DBPNAM4= <>
##$DBPNAM5= <>
##$DBPNAM6= <>
##$DBPNAM7= <>
##$DBPOAL= (0..7)
0.5 0.5 0.5 0.5 0.5 0.5 0.5 0.5 
##$DBPOFFS= (0..7)
0 0 0 0 0 0 0 0 
##$DE= 6
##$DECBNUC= <off>
##$DECIM= 32
##$DECNUC= <off>
##$DECSTAT= 4
##$DIGMOD= 1
##$DIGTYP= 9
##$DL= (0..7)
0 120 120 120 120 120 120 120 
##$DP= (0..7)
150 150 150 150 150 150 150 150 
##$DP07= 0
##$DPNAME0= <>
##$DPNAME1= <>
##$DPNAME2= <>
##$DPNAME3= <>
##$DPNAME4= <>
##$DPNAME5= <>
##$DPNAME6= <>
##$DPNAME7= <>
##$DPOAL= (0..7)
0.5 0.5 0.5 0.5 0.5 0.5 0.5 0.5 
##$DPOFFS= (0..7)
0 0 0 0 0 0 0 0 
##$DQDMODE= 0
##$DR= 18
##$DS= 0
##$DSLIST= <SSSSSSSSSSSSSSS>
$$ [...]
##$SUBNAM2= <"">
##$SUBNAM3= <"">
##$SUBNAM4= <"">
##$SUBNAM5= <"">
##$SUBNAM6= <"">
##$SUBNAM7= <"">
##$SUBNAM8= <"">
##$SUBNAM9= <"">
##$SW= 18.0517057926174
##$SWIBOX= (0..15)
0 0 2 0 0 0 0 0 0 0 0 0 0 0 0 0 
##$SW_h= 3612.71676300578
##$TD= 16384
##$TD0= 1
##$TE= 0
##$TE2= 300
##$TE3= 300
##$TEG= 300
##$TL= (0..7)
0 120 120 120 120 120 120 120 
##$TP= (0..7)
150 150 150 150 150 150 150 150 
##$TP07= 0
##$TPNAME0= <>
##$TPNAME1= <>
##$TPNAME2= <>
##$TPNAME3= <>
##$TPNAME4= <>
##$TPNAME5= <>
##$TPNAME6= <>
##$TPNAME7= <>
##$TPOAL= (0..7)
0.5 0.5 0.5 0.5 0.5 0.5 0.5 0.5 
##$TPOFFS= (0..7)
0 0 0 0 0 0 0 0 
##$TUNHIN= 0
##$TUNHOUT= 0
##$TUNXOUT= 0
##$USERA1= <user>
##$USERA2= <user>
##$USERA3= <user>
##$USERA4= <user>
##$USERA5= <user>
##$V9= 5
##$VALIST= <valist>
##$VCLIST= <CCCCCCCCCCCCCCC>
##$VD= 0
##$VDLIST= <DDDDDDDDDDDDDDD>
##$VPLIST= <PPPPPPPPPPPPPPP>
##$VTLIST= <TTTTTTTTTTTTTTT>
##$WBST= 1024
##$WBSW= 4
##$XGAIN= (0..3)
0 0 0 0 
##$XL= 0
##$YL= 0
##$YMAX_a= 707279
##$YMIN_a= -716700
##$ZGOPTNS= <>
##$ZL1= 120
##$ZL2= 120
##$ZL3= 120
##$ZL4= 120
##$ABSF1= 10
##$ABSF2= 0
##$ABSG= 5
##$ABSL= 3
##$ALPHA= 0
##$AQORDER= 0
##$ASSFAC= 0
##$ASSFACI= 0
##$ASSFACX= 0
##$ASSWID= 0
##$AUNMP= <proc_1d>
##$AZFE= 0.1
##$AZFW= 0.1
##$BCFW= 1
##$BC_mod= 2
##$BYTORDP= 1
##$COROFFS= 0
##$CY= 11.3945322036743
##$DATMOD= 1
##$DC= 2
##$DFILT= <>
##$DTYPP= 0
##$F1P= 15.7292609196834
##$F2P= 12.9074282941183
##$FCOR= 0.5
##$FTSIZE= 0
##$FT_mod= 4
##$GAMMA= 1
##$GB= 0.15
##$INTBC= 1
##$INTSCL= 1
##$ISEN= 128
##$LB= 0.24
##$LEV0= 0
##$LPBIN= 0
##$MAXI= 10000
##$MC2= 0
##$MEAN= 0
##$ME_mod= 0
##$MI= 1.114404
##$NCOEF= 0
##$NC_proc= 0
##$NLEV= 6
##$NOISF1= 3.799351
##$NOISF2= 2.8
##$NSP= 1
##$NTH_PI= 0
##$NZP= 0
##$OFFSET= 15.70392
##$PC= 1
##$PHC0= -19830.31
##$PHC1= 10.80081
##$PH_mod= 1
##$PKNL= yes
##$PPARMOD= 0
##$PSCAL= 0
##$PSIGN= 0
##$REVERSE= no
##$SF= 200.130013532006
##$SI= 16384
##$SIGF1= 3
##$SIGF2= 2
##$SINO= 400
##$SIOLD= 16384
##$SREGLST= <1H.CDCl3>
##$SSB= 0
##$STSI= 0
##$STSR= 0
##$SW_p= 3612.71676300578
##$SYMM= 0
##$S_DEV= 0
##$TDeff= 0
##$TDoff= 0
##$TI= <>
##$TILT= no
##$TM1= 0
##$TM2= 0
##$TOPLEV= 0
##$USERP1= <user>
##$USERP2= <user>
##$USERP3= <user>
##$USERP4= <user>
##$USERP5= <user>
##$WDW= 1
##$XDIM= 8192
##$YMAX_p= 0
##$YMIN_p= 0
$$ End of Bruker specific parameters
$$ ---------------------------------
##NTUPLES= NMR FID
##VAR_NAME=  TIME,          FID/REAL,        FID/IMAG
##SYMBOL=    X,             R,               I
##VAR_TYPE=  INDEPENDENT,   DEPENDENT,       DEPENDENT
##VAR_FORM=  AFFN,          ASDF,            ASDF
##VAR_DIM=   8192,          8192,            8192
##UNITS=     SECONDS,       ARBITRARY UNITS, ARBITRARY UNITS
##FACTOR=    0.0002768,     1,               1
##FIRST=     0,             0,               0
##LAST=      2.2672688,     0,               0
##MIN=       0,             -716700,         0
##MAX=       2.2672688,     707279,          0
$$ Real data points
##PAGE= N=1
##DATA TABLE= (X++(R..R)), XYDATA
0@%%%%%%%%%%%M8r6R6r6J30j78J92k40K91l39M32n28O24p20Q40r84J152j342J534
30H16j751J994k266K577k918L297l708M157m658N203n800O453p164P945q798R729
46E108j0743J1848j3060J4392j5853J7460j9240K1213k3414K5884k8671L1847
58A6771l5507L9777m4836N0940n8469O8043q0708R8336j24790J69641k66396Q74477
70G07279k83790k84327K55589q37369O61562m32967J09318J35799n39997L49752
80a59151j70797j73414M34828l87037L07241o4017j54344N20219j49863J038J45116
91A49819j29413K00659r3900J84547J6912k06486J24778k19033Q9284J32663k31219
102A8611J33645k21586l5910J07831j94621K33474j43888j12424K20657k90519
$$ plain form
0 0 0 0 0 0 0 0 0 0 0 0 0 48 -48 48 -48 82 -96 96 -144 147 -192 240 -288 336 -384 456 -528 624 -718 816
30 816 -935 1059 -1207 1370 -1548 1749 -1959 2198 -2460 2743 -3057 3396 -3768 4177 -4621 5108
46 5108 -5635 6213 -6847 7545 -8308 9152 -10088 11125 -12289 13595 -15076 16771
58 16771 -18736 21041 -23795 27145 -31324 36719 -43989 54347 -70443 99198 -167198 707279
70 707279 423489 139162 394751 -442618 218944 -214023 -104705 31094 -508903 -159151
80 -159151 -329948 -503362 -68534 -455571 -148330 -212347 -366691 153528 3665 4703 149819
91 149819 20406 221065 127165 311712 328624 122138 246916 27883 117167 249830 18611
102 18611 152256 -69330 -105240 2591 -192030 41444 -102444 -214868 5789 -284730
112b84730J33263J02047j08018K03890k08712M7516J37566j30178K49574p8450
122F3768o3250J23373j49222J80015P249j02141J36099j60742P112M7945p3235
133A6971Q9311j09003j5750J1100j29828R1621j1163j3943M8030j10874L2122
144a01406K1589J1111R1774m4080l877J0236l341O3767k479J2904q31l3172J5413
157C7608j3861K1465J1907k5345l064m0808L642J4738j105L5664m2994k8415J6812
170a3756k0227M4550J2393l9382J0845l1021p379M5480j8828L383O348m3407K1225
183b9776M773o299N4515l1346p304L5902m7758M9635L5109l9255M4725m1626j5282
196F013N7887l9204K9237o387o0311L4470l8122J858L4314n8097J6218j4469l6884
$$ plain form
112 -284730 -151467 -49420 -157438 46452 -162260 -114744 22822 -107356 142218 63768
122 63768 518 123891 -25331 154684 161933 59792 195891 35149 42261 90206 16971
133 16971 106282 -2721 -18471 -7371 -137199 -45578 -56741 -70684 -22654 -133528 -101406
144 -101406 -79817 -68706 23068 -21012 -24889 -14653 -17994 45773 43294 56198 55367 22195 37608
157 37608 23747 45212 57119 31774 28710 -12098 -8456 6282 5177 40841 -2153 -30568 -13756
170 -13756 -33983 10567 22960 -16422 -5577 -36598 -43977 1503 -17325 -13942 -7594 -51001 -29776
183 -29776 -25003 -31302 23213 -8133 -15437 20465 -27293 22342 57451 18196 62921 21295 6013
196 6013 63900 24696 53933 47546 -12765 21705 -16417 -14559 19755 -38342 -22124 -36593 -73477
209g3477L8639j1055R593J6066k5267J0754N512J9467K4583K450N197o740Q096
222B3818J2134J4812P402j8502N454j7939j0029K2914k7008N479j1168m0753J7418
235a5968j9230J965J8558l4911J4766j4839p608M3150j7616K0663J0633k6958
247b7395L5544j400J2085K7252k3914J4691o786q502K5804j6581L743m911l1355
260a725J0078r431n129Q027k1111n458p225n799J3166N00J873j97n729N571J1497
275a1092R981P029N889n382O24J0417O64J1959O69j4129K604j0232J790J0220
289B1011j4134K483j2498j4211J1212o320L839M600j7263L562q77q15J7385l008
303e034K09K569r815J0750P412J72Q697p887p129O377j431N226N837j0178k449
$$ plain form
209 -73477 -34838 -45893 -36300 -20234 -45501 -34747 -29235 -9768 14815 17265 22462 15722 23818
222 23818 35952 50764 58166 39664 45118 27179 17150 40064 13056 18535 7367 -33386 -15968
235 -15968 -35198 -33233 -14675 -49586 -34820 -49659 -57267 -14117 -31733 -11070 -437 -27395
247 -27395 8149 6749 18834 46086 22172 36863 30077 21575 47379 30798 34541 29630 -1725
260 -1725 8353 -1078 -6207 1820 -19291 -24749 -31974 -37773 -24607 -24107 -22234 -22431 -28160 -22589 -11092
275 -11092 -1111 5918 11807 6425 7049 17466 18130 30089 30758 16629 19233 9001 10791 21011
289 21011 6877 9360 -3138 -17349 -6137 -12457 -8618 -4018 -21281 -17719 -18596 -19411 -2026 -5034
303 -5034 -4825 -2256 -12071 -1321 6091 6263 14960 7073 -56 6321 4890 10116 15953 5775 3326
318C326l757k974J0694k573r86J21j3725M738M437k032R024p347o730K658m567
333i693Q526L675n071J436r270R05O794m70P137j878r869M641M89L189R356k065
349G832l404k49l579O635M402q34L80r108k547M149l832M938j329j1354K25k944
365a0619j216P840j736k722j562m980O436M462M073M000m816P55M051N28Q795
380A3289J265m928N58l987j28N268j205l278m428o350j499J92J061R50o859k517
396a2596M07k690Q223K925j553K227l926K320Q654J903M906k841m001L497j525
411E930N668K164o935P76o455l135M816l146M24k782p317J161l01K293N573m366
427e632j520j01p24P233M075j918J467k525j319O655J423r45K523n827n87J754
$$ plain form
318 3326 -431 -3405 7289 4716 3730 3851 -9874 -5136 -699 -2731 6293 -1054 -7784 -5126 -9693
333 -9693 -1167 2508 -2563 -1127 -10397 -9492 -2698 -3168 3969 2091 -7778 -3137 -2648 541 9897 7832
349 7832 4428 4179 600 7235 11637 10803 11183 2075 -472 3677 -155 4783 3454 -7900 -7675 -10619
365 -10619 -11835 -3995 -5731 -8453 -10015 -14995 -8559 -4097 -24 3976 -840 -85 3966 4494 13289
380 13289 14554 9626 10184 6197 6069 11337 10132 6854 2426 -3924 -5423 -5231 -4170 -3220 -10079 -12596
396 -12596 -12189 -14879 -6656 -3731 -5284 -3057 -6983 -4663 3991 5894 10800 7959 3958 7455 5930
411 5930 11598 13762 6827 7603 1148 -1987 2829 -317 107 -2675 -9992 -8831 -9132 -6839 -1266 -5632
427 -5632 -7152 -7253 -7977 -744 3331 1413 2880 355 -964 5691 7114 6169 8692 2865 2278 4032
443D032m880P047j247o533K037q012L070P079n535L912m863o658R781j631K432
458C1L634r074M021J810k891Q362m091L2K618p487K002L332j387L740l861m775
474c984O41J953K499L024m737l044K179j561N069L635o040K580m37m370P244l705
490I46J61L491p086K34J56k253O632k237l231n33l884N235M185k194n09j376j475
507c738N532L352j500P0n5k148K843K10k418L789k856k842j125m371N376L92m000
524c489K062p659Q14O415k231L510j875m312N380J518K253J185j505K45K016l39
540C988k92J762k70J30j091n942J971K825l924L957o770n318P198m451N071J567
556D11q871N222o43m01P580n699K893K679m557N313j076j295O124k985l268J028
$$ plain form
443 4032 -848 6199 4952 -1581 456 -7556 -4486 2593 -2942 970 -3893 -10551 -770 -2401 31
458 31 3665 -5409 -1388 422 -2469 5893 1802 1834 4452 -3035 -1033 2299 912 4652 791 -3984
474 -3984 -3343 -1390 1109 4133 -604 -3648 -1469 -3030 2039 5674 -366 2214 1777 -2593 4651 946
490 946 1107 4598 -2488 -2254 -2098 -4351 2281 44 -3187 -3720 -7604 -2369 1816 -378 -887 -2263 -3738
507 -3738 1794 5146 3646 3716 3661 1513 4356 4566 2148 5937 3081 239 -886 -5257 119 511 -3489
524 -3489 -1427 -9086 -8272 -1857 -4088 -578 -2453 -6765 -1385 133 2386 3571 2066 2311 4327 3988
540 3988 3696 5458 5188 5318 4227 -1715 256 3081 -843 3114 -3656 -8974 -1776 -6227 -1156 411
556 411 -8460 -3238 -3881 -4282 3298 -2401 492 3171 -1386 3927 2851 1556 7680 4695 1427 2455
572B455k026K551L043m260l436j29k748M530J613o754L587l489P7P016o152L140
588i82K992o070P207m224j871R348n391K620r67o110O796n13p91J982o508J557
604i25Q32n06J610j222k115J47J218L29j909L853j960R66Q73n185N823m68L72
621A733K314q068L930J563l446O323n124k374L581m175M892m75k667L334k997
636a656J820J27r25K575m03K85j945j86J445J033J451l526j561J752k722M380
652A944j108m203K220l327K528K565l788L493j987p81L372l551L894J974k254
667I91J745j782j098L176J99N52j934j539m08R64J461k180m30j928r12J906k242
684c459K222j96k753M064l338K043L528l395L399j066k167L190n39K580k19k329
$$ plain form
572 2455 429 2980 6023 1763 -1673 -1802 -4550 -20 1593 -5161 -1574 -5063 -4986 2030 -4122 -982
588 -982 2010 -4060 3147 -1077 -2948 6400 1009 3629 2662 -3448 3348 2835 2044 4026 -2482 -925
604 -925 -93 -599 1011 -211 -2326 -2179 -961 -632 -2541 1312 -648 318 1191 -3994 1829 1361 1733
621 1733 4047 -4021 -91 1472 -1974 4349 -775 -3149 432 -3743 1149 674 -1993 1341 -1656
636 -1656 164 291 -634 1941 1538 1823 -122 -308 1137 2170 3621 95 -1466 286 -2436 1944
652 1944 836 -3367 -1147 -4474 -1946 619 -3169 324 -1663 -2444 928 -2623 1271 3245 991
667 991 2736 954 -144 3032 3231 3783 1849 310 -98 866 2327 147 -283 -2211 -3123 -1217 -3459
684 -3459 -1237 -1433 -4186 -122 -3460 -1417 2111 -1284 2115 1049 -1118 2072 1533 4113 3894 1565
700A565Q95j690Q8J583j478o32j675q15J112l67J02j012M72j178p87K514m55J550
718b08N37k283K301n82Q71K745k560J007k50j425L156j824J27k07k372J176o99
735d90J63Q19j469K58j079k06P95k03J936j944k72J363p59K451o79n17J297j980
753e16J422J08q74J743k004M24K24j454J831n19k03K39k786K244M94n83J056j347
771e01J7k28l76K034r6M35r25r36R19k49N02Q0j376O14j242N69J154p19R20j072
791d76r26J488p01J220K63l80M37j684J908kk83P9l25j86K98m59K99l51j311j29
811a221q05J426l80m67N37N0k64m16Q36J387j226Q1N68N08R45n41J093J33j870
830C74J83k39O88K1r70j02m50p63O62l09M72r51k54J83%Q00J48k67O52m15L99
$$ plain form
700 1565 2460 770 858 2441 963 331 -1344 -2159 -1047 -1414 -1312 -2324 -1852 -3030 -3817 -1303 -1758 -208
718 -208 329 -1954 347 -235 636 3381 821 1828 1578 153 3309 1485 1612 1405 -967 209 -490
735 -490 -327 492 -977 -719 -1798 -2004 -1209 -1412 524 -1420 -1692 -329 -1088 1363 684 167 1464 -516
753 -516 906 1014 140 1883 -121 303 527 -927 904 385 182 421 -2365 -121 373 -210 846 -501
771 -501 -484 -712 -1088 946 850 1285 360 -576 343 94 596 676 -700 -86 -1328 -759 395 -324 596 -476
791 -476 -1402 86 -615 605 868 488 925 -759 1149 1147 864 943 618 432 730 271 570 219 -1092 -1221
811 -1221 -2026 -600 -980 -1447 -910 -860 -1124 -1540 -704 683 -543 -462 106 614 1559 1018 2111 2244 374
830 374 557 318 1006 1027 57 -45 -495 -1258 -596 -905 -433 -1384 -1638 -1455 -1455 -655 -507 -774 -122 -537 -138
851a38Q94M86Q24j67j287O16m62N10j08J63l78j613N3L69J13l45o60r2J36l59
871a445N06O41k66n03L11n05J268Q71M31p04K80l54N02j06M80K43j300L06p89
890a33K94L20n13m11l53q5N24K38m26M26o24m03Q94q27J561K82n15m39R26o29
910A07M27J007l51j306j19Q01n9o8j6j07j045O66l25k20J387j051r00J076m02
929d98N01J080j430K44N57p85P43m80J414m83j705N90o08KJ203r45P29j67n27
948e65j42L59P51j011R08o59P54J57K8K10k46m15L15M22q94L56m47O7J12n70K52
969b58n81O01P17r41q22O23K57K50J74k45l24N2R57j13K06J86q23N25M45N2j55
990G83r35O98j321R30n06l38M60K7k28Q7r66R91N35o52K66j172M54J594m45k85
$$ plain form
851 -138 756 1242 2066 1899 612 1228 766 1276 1168 1331 953 -660 -607 -238 -125 -470 -1130 -1222 -1086 -1445
871 -1445 -939 -298 -564 -1067 -756 -1261 7 878 1309 605 885 531 1033 927 1407 1650 350 656 -133
890 -133 161 481 -32 -443 -796 -881 -357 -119 -545 -119 -743 -1146 -252 -1079 482 764 249 -190 736 107
910 107 534 1541 1190 -116 -235 566 507 439 423 316 -729 -63 -388 -608 779 -272 -1172 -96 -498
929 -498 3 1083 -347 -103 454 -331 412 -68 1346 863 -842 -252 -860 -858 345 -600 129 -38 -565
948 -565 -707 -348 403 -608 300 -359 395 552 580 790 544 129 444 866 -28 328 -119 -52 60 -510 -258
969 -258 -839 -238 479 -462 -1284 -661 -404 -154 20 -225 -549 -497 460 347 553 739 -84 441 886 938 783
990 783 -152 546 -775 155 -351 -689 -229 -202 -430 -343 -1309 -318 217 -435 -169 -1341 -887 707 262 -23
1010b3m6K52M37O03p52O37k03o04L99m7l76J49j436Q13l06q57O24O77p17J241
1030D65q26j219J120K23L54M0j075J338k10J21N71r50L13K56j069L91J186j051
1048b2N25n95K29n0o69Q52l72r9r36K31Q34j6M41n35K51P38n67L43q60K23J018
1069I64r44J87o83N93j9k02n98J174j406M11N08Q7N38j285K69J122n52m69J95
1088a10j18J10M09j98n11K48J063o46n49J97M52p6j23N9r15K15O77j11N6j61o29
1109f61P88N06J1k38l10K49J7N8j46M1k06J26K9q38R08p60O1L97m17j73L25k0
1131b53j28L51q38L78q0L12R32r79N37j67L61K88q0RK0j147O80K42j88P0p00O17
1153B37p37J2R4R5lm77J04J06J5j1k50R18k50R9L85M3lO11l60r3m4p30J246M1
$$ plain form
1010 -23 -69 183 620 1223 471 1108 905 301 700 653 277 426 -1010 -197 -503 -1360 -736 -59 -776 465
1030 465 -361 -1580 -460 -237 117 157 -918 420 210 331 902 -48 265 521 -548 -157 1029 -22
1048 -22 503 -92 137 87 -582 270 -102 -201 -1137 -906 -72 -88 353 -182 69 807 240 583 -277 -54 964
1069 964 20 207 -476 117 98 -104 -702 472 -934 -523 -15 72 610 -675 -406 716 164 -305 -110
1088 -110 -228 -118 291 93 -418 -170 893 247 -302 -105 347 271 148 207 -708 -493 184 73 129 -32 -661
1109 -661 127 633 644 406 96 345 362 420 274 315 109 235 264 -574 334 -426 -365 32 -385 -558 -233 -253
1131 -253 -381 -30 -868 -490 -570 -258 674 -305 232 65 426 714 634 643 663 -484 196 438 250 320 -380 237
1153 237 -500 -488 -394 -299 -302 -779 -675 -569 -554 -565 -815 103 -147 -48 337 380 377 988 628 535 491 -239 1007 1048
1177A048j178J82m03L77j60Q0m19J81l04J39R9l82K76O61m77P53j73l82O88p35
1197a29M07l35L4J51o74R56M3o64M43q0m48M30K05m90j23l27J2L58N82M32j436
1218f53O71J64j58n60K25N21j03N3l28R9K51K53l36j98M52j168N97k44O22l6J5
1239A39k33k03M26j78M79n60k30P28j007P77K19l03OR6j5n41J27L04m67J82O79
1260D25q37N45O34q51j35n1p8J0P44m53K99j30K6L05m0J57p6k55k25l52J099j602
1282h41Q21K85l74L62p74j40O10l99P86j74j035N02Q2N46l29K37j63L99m93Q58
1302G66j231R97K69m70m6j57O4j00j59o8k55nM50j45l14L03j47K64p2L2p7N80
1324D79j139O40L69k99M38n07N89k88j40j18L60Q1J7l6o16r2N73j035N23l05P06
$$ plain form
1177 1048 -130 52 -351 26 -134 -54 -473 -292 -596 -457 -358 -740 -464 197 -280 473 300 -82 606 -129
1197 -129 278 -57 -23 128 -546 410 453 -211 232 152 -296 134 339 -151 -274 -601 -589 -231 351 783 -653
1218 -653 18 182 24 -536 -311 210 107 160 -168 -69 182 435 99 -99 353 -815 -218 -462 160 124 139
1239 139 -94 -297 129 -49 430 -130 -360 368 -639 138 357 54 60 156 141 -400 -273 31 -436 -254 425
1260 425 -412 133 767 -84 -219 -270 -348 -338 406 -47 252 122 148 453 413 570 494 239 14 -338 761 -841
1282 -841 -20 265 -109 253 -521 -661 -51 -450 336 162 -873 -371 -289 257 -72 165 2 401 -92 766
1302 766 -465 532 801 331 285 128 192 92 -67 -135 -390 -395 55 -90 -404 -101 -248 16 -56 -24 -101 479
1324 479 -660 -20 349 50 488 -19 570 282 142 24 384 465 482 446 -170 -262 311 -724 -201 -506 200
1345B00j015M62M17r1J14o5L54n53P1K8j87L53j73n2P52q98M05o1N54o77M01k19
1367A20M06o28P9Jk88O62n08J2O4j88L97N9k92N77r6o29N4J84N38l39Q8n32M8
1390b11K46N69q25l02N60j21k15J40M93m97O3j52J70N60p3m69J84n82N98n05J049
1411F80q54K84n94K01N2K31L50n73l94K0L97l92P45p8j35k03K95O8J09m57P4K60
1433H6r5M75k48J18n25L01J96j47p55K01j12J22O04j14l18K10m91K30M94m21L20
1454A31o16K49O70r44Q62j05m95J86P66o62L0o39M52O04p38L72n83J33j83P23
1474B13q04N91M72J09j154N70j81M14r4j07j76J72l46K57J50k00q3l22O40k4N5
1495A52M14n55J5o0m98R95q5l68L03n83o3K39J7J08m22L35m07O67o35P05m73l22
$$ plain form
1345 200 -815 -353 64 -27 87 22 376 -177 -106 -78 -265 88 -85 -137 615 -283 122 61 615 -62 339 120
1367 120 526 -102 -23 -22 -310 352 -156 -144 -80 -268 129 188 -104 473 377 -252 -198 -14 524 185 273 -259 -211
1390 -211 35 604 -221 -523 37 -84 -299 -159 334 -163 -100 -252 -82 478 405 -64 120 -462 136 -369 680
1411 680 -174 110 -484 -283 -231 0 350 -223 -617 -597 -200 -592 153 75 -60 -263 32 100 209 -248 -174 86
1433 86 -9 466 218 336 -189 112 308 161 -594 -393 -505 -383 221 107 -211 -1 -492 -262 232 -189 131
1454 131 -485 -236 434 -510 352 247 -248 -62 704 42 72 -567 -115 489 -249 123 -460 -327 -510 213
1474 213 -591 0 472 581 -573 -3 -184 230 136 29 -147 25 -321 -64 86 -114 -197 -519 121 97 152
1495 152 566 11 26 -34 -532 463 378 10 313 -270 -333 -94 -77 31 -391 -56 -463 204 -431 274 -199 -521
1517e21R02j40J52l93l57M49k9m50l99P19M01n29k08P28K87j130Q96n11k16Q18
1537D69n50L69K60p33k47J23R54m39J16k73O81j117j57Q43o12O26n40K93K92K
1557C60q35L73K45m65J17N15k59j04P84n26m01J26L55m1K04k87l14J19O3K10p96
1578e57L12N1l97K66J43n35M45L33l86K6O29J07J45k46n07j15L88m06M49l82p5
1599c12R7K47l93L40o1l4q6M02p07M36N93m61j99N44r08M21k5j36j40K30k99N23
1621G2j21K74k73l57P61j70J21N3n01K5K50m76P80k70n8m9k62N51k51J97M5n81
1643b40k15L21J58l05J6N13n76N81m62k42j14L95K40k40L91k64P26r30K31k44
1663b60J17M65k14m27O84j75k02K94q53K68l9K75j27K34N81m27m58P36O6l35J65
$$ plain form
1517 -521 381 241 393 0 -357 92 63 -387 -786 -67 334 -195 -403 325 612 -518 378 -133 -349 469
1537 469 -81 288 548 -185 -432 -309 645 206 322 49 730 -387 -544 299 -313 313 -227 66 358 360
1557 360 -475 -102 143 -322 -205 310 51 -53 731 205 -196 -70 285 244 448 161 -153 -34 29 239 -557
1578 -557 -245 -194 -591 -325 -182 -717 -272 61 -325 -299 330 437 582 336 -171 -286 102 -304 145 -237 -312
1599 -312 -215 32 -361 -21 -82 -116 -202 200 -507 -71 522 61 -138 406 -502 -81 -106 -242 -382 -152 -451 72
1621 72 -49 225 -48 -405 356 186 307 360 -141 -116 134 -342 438 168 110 61 -201 350 99 296 341 -240
1643 -240 -455 -134 24 -281 -265 248 -328 253 -209 -451 -565 -170 70 -170 221 -43 683 -247 -16 -260
1663 -260 -143 322 108 -319 365 190 -12 282 -571 -303 -342 -67 -194 40 621 194 -264 472 538 203 368
1684C68l79p79M92p4M47q8K82J11o11k0M33K37l78N7n5K11l03j40L27k4l80N8
1706b08J0O8j05M10n1k50N23o92J119r96M5p98R89k67K8L76k48k25M11l45O1J48
1728Cn6J01N21o32k0k67O2Q5J52L25j16L78q17o9K03P11k40p42P70m92N09j66
1750B03k33K03n56K18R8j75L08K59j46o71K38L58l98J17J9J18O03r14M06J92m24
1771a77L22m09O64n97j25J86QO03q16R77o06Mk02M37j78k65K89j16J87r5n59L97
1793g1M3R9l55N61K80K54j12m40K15o90N00k52m0j27R88p80k70K63j27k7J87J20
1815B19l69O21r85P18j27J97K9j75J43p77P88m28o5Q32n07J4p48M78K38m11L90
1836G5j30O5j60K18Q6q64J41N51M29m97j41N79k47j51N44o64L26J5J3j15j06K28
$$ plain form
1684 368 -11 -790 -298 -372 75 -13 269 380 -231 -251 182 419 41 98 43 254 -49 -189 138 114 -266 -208
1706 -208 -198 -130 -235 175 124 -126 397 -295 824 -172 -127 -925 64 -203 -175 201 -47 -272 139 -206 -145 3
1728 3 -53 48 569 -63 -83 -350 -288 -203 -51 274 158 536 -281 -350 -147 564 324 -418 352 -140 369 203
1750 203 -30 173 -383 -165 -67 -242 66 325 179 -492 -254 104 -294 -177 -158 -40 563 -351 55 247 -177
1771 -177 145 -264 400 -197 -322 -136 -128 475 -341 636 30 34 -168 269 91 -174 115 -1 186 91 -468 -71
1793 -71 -28 71 -284 277 557 811 699 259 474 -216 284 32 -8 -135 853 73 -197 66 -61 -88 99 219
1815 219 -150 471 -514 204 77 274 303 128 271 -506 282 -146 -211 621 114 128 -620 -142 96 -315 75
1836 75 -55 10 -150 68 154 -710 -569 -18 411 -86 -227 352 105 -46 498 -166 160 175 188 73 -33 195
1858A95m78K89J47Q5l43n79L51N31K1RO0p86N66l72lO0Q1m04P00l60N29p83l9
1881e23J019j36J70m21p23R79p74M2N10K59o7m3n84L45m2l11k81Q48J6J54j60
1902B77k54N5l63j2J52n5J51K42J1L8j38L4k58n3M7k29k66K53L39L79l51J57K60
1925D16n1n64L33j22M5l16P33l41l31L42q0k93O07p02K88J82j19l97J179n18r06
1946f15L00k27O84L0j39j7o62N40M98k73n48O16p0J07m25Q00o31m23O09J57k73
1967C8J34L08n64j00o1J52L86L85j316L70P13n12m74l5R40Rj51P12m36j162N94
1988g0J60j45k37L17k37J147r87j30k66N52k45N5L87m61p4P8K67J49p53L30L28
2009A65m08Q6N75q7o20K08O15n79Ol3N3L43m39N01k91M14p48J47J92K47n04k0
$$ plain form
1858 195 -283 6 153 238 -105 -684 -333 198 219 228 288 -498 68 -304 -307 -247 -166 -570 130 -230 299 -484 -523
1881 -523 496 360 530 109 -614 365 -409 -367 143 402 335 292 -292 53 11 -300 -581 267 283 437 277
1902 277 23 78 -285 -297 -145 -200 -49 193 204 242 104 138 -120 -173 -126 -355 -621 -368 -29 350 -1 156 416
1925 416 365 -199 134 12 57 -259 474 133 -198 144 64 -229 378 -324 -36 146 27 -370 809 291 -615
1946 -615 -315 -542 142 172 33 16 -646 -106 392 119 -429 187 117 224 -201 599 -32 -455 154 311 38
1967 38 172 480 -84 -184 -245 -93 293 678 -638 -268 445 -67 -541 -576 364 373 222 934 498 -664 -70
1988 -70 90 -55 -292 25 -212 935 -52 -182 -448 104 -141 -86 301 -160 -234 -156 111 260 -493 -163 165
2009 165 -243 -157 418 331 -289 -81 534 -45 -39 -72 -19 324 -115 386 95 509 -239 -92 100 347 -157 -177
2031a77P7J45k26k59L03O68k30j66q5l18J36O22r03Q18o7K27j37j70q2p07Q40
2052C09k74j38j42M51mR2k31j2l59p7K72O90m28n00N80K56l58k01K48J86q33J53
2074c20M69k09M38n35j19Q80m49p1M8m59j67N79N57q77M35K14o43L80J30m16K55
2095A20j2m45n8K91L47k56Q22o14l74L34j02K66j16j15k27O9K22n04L81qN4n52
2117d77N53m55R5j15P92o62L94m30j26P8R7N8O31K7q87P39j5k42n09M39J87j84
2139a2M3m15p5O21m08L4J82N0K52Lm98M72o41M11J46k21Q9l69N01p74P91m49O7
2162b00m0l17K19J26n46Q90n02M23k65Q1j89M51j50j00L38k6L09o16O35k45j28
2183A48J09J96m46O9j83j2K96K33l07o8q6k50j74L81K12m45J62k29L74k48K02
$$ plain form
2031 -177 -100 45 -181 -440 -137 531 301 135 50 -268 -132 490 -413 405 338 565 428 258 176 -531 309
2052 309 35 -103 -245 206 202 294 63 51 -308 -385 -113 577 149 -351 229 485 127 -74 174 360 -473 -320
2074 -320 149 -60 378 -157 -276 604 155 84 132 -327 -494 85 642 -235 200 414 -229 151 281 -135 120
2095 120 108 -337 -395 -104 243 -13 809 195 -179 155 53 319 203 88 -139 -70 152 -352 29 21 75 -477
2117 -477 76 -379 -284 -399 393 -269 125 -305 -431 -353 -256 -198 433 460 -427 312 297 55 -454 -15 172 -12
2139 -12 31 -384 -459 162 -246 -212 -30 20 272 275 -223 249 -392 19 165 -56 33 -336 165 -609 182 -267 -200
2162 -200 -240 -557 -338 -212 -758 132 -370 53 -212 -131 -320 131 -19 -119 219 193 502 -114 521 276 148
2183 148 257 453 7 76 -107 -119 177 410 103 35 -51 -301 -475 -94 118 -327 -165 -394 -20 -268 -66
2204f6j34K43k03J36J34l08P8J5K34k74J5K96o52L41LJ81j22J74K17P4n05K77
2226A54o00j95P65j11K54k42k43K42%K65k80L73l21J84m64N8K78J74n9j68J77
2247B41j29o51J42j98N73J43j46l67O51M8q5lp5k74K40k58j02N16k39J81p1k26
2269h9k58M05M13p07J9O04m7J6K76k37o13K55m45K01K57L04m02n26M48K21j97
2290a02K00l40M5K32n10N23K22l41o5m6L92n30j61K69L35j48l92O16k80j48M15
2311A86j27k25P8N15q99L04K70j61K14J70m4r6N3n27M16j05k08k22Q8Q56o23P80
2333F93j107M25j40J94l17J050q31K24Q1m26R09o10J15m69l0J42q1K73L1l85L94
2354A35j83L55k49L51m14o5m13R61l99o47L02M43k68K3P2m18L72R1N29n60K80
$$ plain form
2204 -66 -200 43 -160 -24 110 -198 -120 -105 129 -145 -130 166 -486 -145 -142 39 -83 91 308 382 -123 154
2226 154 -446 -641 124 13 267 25 -218 24 24 289 9 382 61 245 -219 -161 117 291 232 64 241
2247 241 112 -539 -397 -595 -22 121 -25 -392 259 307 222 219 144 -130 110 -148 -250 266 27 208 137 -89
2269 -89 -347 58 471 -236 -217 387 340 356 632 395 -218 37 -408 -207 50 354 -48 -574 -126 95 -102
2290 -102 98 -242 -197 35 -475 48 270 -71 -136 -182 210 -320 -481 -212 123 -25 -417 199 -81 -229 186
2311 186 59 -166 -88 427 -472 -168 102 -59 155 325 281 185 238 -289 127 22 -186 -408 -320 536 -87 693
2333 693 -414 11 -129 65 -252 798 -33 191 272 -154 755 145 260 -209 -239 -97 -178 95 126 -259 135
2354 135 -48 307 58 409 -5 -70 -483 478 79 -568 -266 177 -91 -68 4 -414 -42 49 578 18 298
2375B98m52M57o40p2M46l08J54J6K14M26j010L15k86R02n78l14N85m90K63J9j93
2396b48M14k38l1M63k77l49J53K51K45l07J09J24n46L24o13K12K58M73m75J57
2416I9o1j24J65l30K02l18O33o87k45M85l05O77o79N31JQ0o66Q34j63K87q56J81
2438b59J7K78L93n92m01N43k05M89m26K26O6r1l20P9K83j73l7K58l29J69L79q20
2460d73M9M94k22K16J08n6r3p18L60O28j31q4k27m48O24j21O06n84M83L15k39
2481D87n11M91j148N31m57Q69J14o19M95m7p16J06K77J43R3j99M0m4l4L21L07
2502D99j10m64jK43m25M20m45M95j06o63P84o23N94m10M5k26K11K95l49K37K79
2523B80k56L59q00k11j44J082J64p46o0M85j42j35J125o65j49m3L49k70p26O93
$$ plain form
2375 298 -154 303 -337 -409 37 -271 -117 -101 113 539 -471 -156 -442 460 -118 -432 153 -337 -74 -55 -248
2396 -248 166 -72 -103 360 83 -266 -113 138 383 76 185 309 -237 87 -526 -314 -56 417 -58 99
2416 99 38 -86 79 -251 -49 -367 266 -421 -666 -181 -486 191 -488 43 44 124 -542 292 129 416 -440 -259
2438 -259 -242 36 429 -163 -564 -21 -226 263 -163 63 129 38 -282 -203 80 -93 -130 128 -201 -32 347 -473
2460 -473 -424 70 -152 64 172 116 23 -695 -335 293 162 78 -149 -597 27 -94 512 -72 411 726 487
2481 487 -24 467 -681 -150 -607 262 376 -243 252 205 -511 -405 -128 15 108 -91 -51 -95 -129 192 499
2502 499 389 -75 -76 167 -258 162 -283 212 106 -557 227 -396 198 -212 -167 -393 -182 113 -236 1 280
2523 280 24 383 -417 -628 -772 310 474 -272 -332 153 11 -124 1001 336 187 144 493 223 -503 190
2543A90M20j24q75R80k81o57N40n45J07k05O59m46M41k85K37J44j09m2j63N7l3
2564A0n6L29N6l28k07o9K09l64R12j23j54m90Q7K17L85m34N70n59j73K23K44l64
2586g9K10k99N10m2l71n73L99O08j095P47K09j40k8L33k51o27J038M7p90K32L17
2607C55Q2m11r5k87O06P2N5p6n81K67j72J02R0M74j020M20O60r30P89J34k59J93
2629D68n89L30J78q68M84O44j049O30j04K01m64J61N14k92k1j44LM81q05L33n2
2650C9q6k38N69L32l91l04L14l96n59J018l05K30M6m93N8k29O25n66J60N29p36
2671c83p3K68Q90p78kk30K50k8r3M07l03M26n35K44NJ93o74K48k9K85n0lk13M06
2695B28L0K58l90L08n99P65q81l7J109p73M15k53n65L13J22j53J82K47n86N03
$$ plain form
2543 190 610 486 -389 591 310 -347 193 -352 -245 -450 209 -237 204 -81 156 300 191 149 -14 43 10
2564 10 -46 283 339 11 -196 -265 -56 -420 492 369 215 -275 -188 29 414 -20 550 -9 -182 41 285 -79
2586 -79 131 -168 342 300 -71 -644 -245 363 -732 15 224 84 56 389 138 -489 549 596 -194 38 355
2607 355 437 26 -69 -356 250 322 377 301 -280 -13 -185 -83 7 481 -539 -119 541 -389 400 534 275 468
2629 468 -121 209 387 -481 3 647 -402 228 124 325 -139 22 536 244 223 79 82 563 -242 91 39
2650 39 -47 -285 284 616 225 -79 235 -161 -720 298 -7 223 269 -224 -166 -395 230 -336 -176 353 -383
2671 -383 -456 -188 702 -76 -78 -308 -58 -86 -179 228 -75 351 -184 60 65 258 -416 -168 -197 88 38 35 -178 228
2695 228 258 516 126 434 -165 600 -281 -318 791 18 433 180 -385 -72 50 -103 79 326 -260 243
2715B43l47n9l62J71M5M61j2o40K10Q3lN20j68J09k29J14J63K90m46J54J47l19
2737A25q5q3n67L91K20J61O3L26l19q79M4P21O1k89M2M66J08n8r77O55L48j97
2759B77k10m3o8K50m62J39q0K43mJ78j74l65N69l92P1Q03q48K00Oj09N99j006
2781d26J032q76M73j05j47j47P5J34P4L07j074O35m2o58P82P02p56o40N87L83
2801C13m81K08k26Q2L63o26Q39l78O5o97P67k77j91P07N3m01L43m07k36K20l03
2822b63L45l79N17m71J30k97MN37P3K22m61j40M92o47M94n80M83j74K10J04L1
2843B30k52n67P15k20M49L65p81m64P76j036Q69l05K07K70j11k16O2k73L53j17
2863d6k31m3L66N08j024P53k32J7M20m38l6M72m75j28R2J03j80J78m96J41J76
$$ plain form
2715 243 -104 -163 -525 -354 -309 152 140 -500 -290 -207 -210 310 142 251 22 136 299 589 143 297 444 125
2737 125 40 -43 -610 -219 1 162 225 551 232 -647 -603 118 179 -110 -68 398 506 448 -529 126 474 277
2759 277 67 24 -44 206 -256 -117 -197 46 42 220 46 -319 250 -142 -71 732 -116 84 90 -19 580 -426
2781 -426 606 -270 203 98 -49 -196 -121 13 87 394 -680 -45 -87 -745 37 739 -17 -657 -70 313
2801 313 -168 40 -186 -104 259 -367 472 94 159 -538 229 -48 -239 468 521 120 463 56 -180 40 -263
2822 -263 82 -297 220 -251 -121 -418 -414 123 196 418 -43 -183 309 -338 156 -424 59 -115 95 199 230
2843 230 -22 -589 126 -94 355 720 -61 -525 251 -785 84 -221 -14 256 145 -71 -9 -282 71 -46
2863 -46 -277 -320 46 554 -470 283 51 68 488 50 14 486 11 -117 -25 78 -102 76 -420 -279 -103
2884a03m3L54j66m72%R01k52l00p4J34J43j64L49P6m19q91J147J6l90j87k61P41
2906A39l59m43O52l9j79O88l83n5l21K32o19R53k32N21n57r85P83l02P99l17m06
2927d30P86q75J05K89J07k32j46L80K06j42n4j97j89P69n55n94J222r77N49K09
2947B31l88O1Q6l00Q63j81l23n54Q28m31K0J21l26N96l09M41K22j017L07M77J75
2968E99l71m09J61J32r4J31k83O52o95J078o10K00r67O61Q3J75m13j85j12M09
2988A42l82j53K10N56m68j73L5L36P64o45mn24M98n70J02j57j02K8K69k87r7J030
3010D08o77K34L37m32K37j58K23j8P6L6j76o26J81R00n74L26p2l2K62q42K50l30
3032d67P56o30K04J58L93j033R80r07K89l9K21P62r68J069j728J053o49K60J41
$$ plain form
2884 -103 -146 208 42 -430 -430 471 219 -81 -155 -21 122 -42 307 383 -36 -927 220 236 -154 -341 -602 139
2906 139 -220 -663 -11 -50 -229 459 76 21 -300 -68 -687 266 34 555 -2 -987 -204 -506 293 -24 -430
2927 -430 356 -519 -414 -125 -18 -250 -396 -16 190 48 -6 -203 -392 377 -178 -772 450 -527 22 231
2947 231 -157 -96 -10 -310 553 372 49 -505 323 -108 -88 33 -293 303 -6 435 657 -360 -53 424 599
2968 599 228 -181 -20 112 18 149 -134 518 -177 901 291 491 -476 185 268 443 30 -155 -267 142
2988 142 -240 -393 -183 373 -95 -268 -233 103 867 222 218 -306 192 -378 -276 -433 -535 -507 -238 -525 -622 408
3010 408 -269 -35 302 -130 107 -51 172 154 230 266 90 -536 -355 545 -29 297 225 193 455 -387 -137 -467
3032 -467 289 -341 -137 21 414 -619 361 -546 -257 -296 -75 687 -281 788 -940 113 -536 -276 -135
3051a35J18j47lN8L14M2M9l38k91J97p5L92K3J87j040N73P75m69p8k19j5j15m64
3074f61L07M38l10J96k8K18l53O00J36j126L40K49k93Q62m08o9R1k15k82N07k14
3095a5j83j87M16L12q10P49Jl63K16l24k97J076k00o57M3j48M23K6K41m08L32
3116B43o91R10p6k50n73l4R66l39p27N03Q9o22P42k76J91l07N8M35m19Q17m63
3137A77o44R58o52k88Q38J27m75k45M55j24k70n9K43J79L22n63m93N51J57J7n4
3158A57j45K90k27K52p58M93K53q0l38k57J015p76M31p2K90n42p0JL44Q19j590
3179e10K07M67L21r15N14n31O71K03l93J04p57P74l83j90O16j92j52L28N95p40
3199C7M44j88m27J80n43Q41l86j90L09j79N09n78O41p60K66j58J63L49r27P57
$$ plain form
3051 -135 -17 -164 -167 -109 205 247 296 -42 -333 -136 -211 181 204 391 -649 -76 699 230 152 -67 -82 -197 -661
3074 -661 -354 84 -226 -30 -58 160 -193 407 543 -583 -243 6 -287 575 167 98 189 -26 -308 199 -15
3095 -15 -198 -385 31 343 -467 282 283 -80 136 -188 -485 591 391 -266 -223 -371 52 78 319 -89 243
3116 243 -448 462 386 136 -437 -471 495 156 -571 -68 21 -601 141 -135 56 -251 -193 242 -177 640 177
3137 177 -467 491 -161 -449 389 516 41 -204 251 127 -143 -202 41 220 542 -21 -514 37 194 211 157
3158 157 12 302 75 327 -431 62 315 235 -103 -360 655 -121 310 238 528 -14 -84 -83 261 1080 -510
3179 -510 -303 164 485 -430 84 -447 224 427 34 138 -619 155 -228 -418 198 6 -146 182 777 37
3199 37 481 293 -134 46 -497 344 -42 -232 77 -102 407 -171 470 -290 -24 -182 -19 330 -597 160
3219A60m10P34r68K02M1K02J15K45l52L47J65l18j44L45n67N58l51N9o31J055
3239D87m97m18J087q18P45k87o0p57K49O32m65k34J76K68m34r9J30j10l1K81L23
3260A68q94O97N03k19m20K56N00j105K81k72N00No9K51o28N17m18L19o2M35o68
3281c23j02O68k29P0L05k17m61L9K30J15l4l42N55q4r7Q4j11l25K94J91n90R0
3303b74L19M6j00J9K33k59K18J67k4k52L83p04m55N15N39l32l8R6K72m00O6k9
3325FL01l39l45L91p6M83p34J26J48O91p38M03n2j122N77J58N64o36j58N54m01
3346a99K15n01Q41m42j31K66n25K49R97m41m75j64K74J11j54j61K88j1q0n51K77
3367c17J34j8O05p59K25k09O03j17j82p4N73K23j214N42P3J97m43L06J6L69j433
$$ plain form
3219 160 -250 484 -484 -282 -241 -39 76 321 -31 316 481 163 19 364 -203 355 4 63 -568 487
3239 487 -10 -428 659 -159 586 299 239 -518 -269 363 -102 -336 -160 108 -326 -425 -295 -405 -436 -155 168
3260 168 -726 -29 474 255 -165 91 591 -514 -233 -505 -5 0 -69 182 -446 71 -347 -28 -90 345 -323
3281 -323 -425 243 14 84 389 172 -289 -250 -20 95 61 -281 274 190 93 177 66 -259 35 226 -364 -274
3303 -274 45 91 -9 10 243 -16 202 369 345 93 476 -228 -683 -168 371 39 1 97 369 -31 35 6
3325 6 307 -32 -377 14 -62 421 -313 -187 -39 652 -86 317 265 -857 -280 -122 442 -194 -352 202 -199
3346 -199 16 -485 356 -86 -217 49 -476 -227 770 329 -146 -310 -36 75 -79 -240 48 37 -43 -594 -317
3367 -317 -183 -201 404 -355 -130 -339 264 147 -35 -109 464 687 -527 15 88 285 -158 148 164 533 -900
3388i00J076k59j81J13l1J96k95O17q70J87O58p48P77L82j003O42J29k40k03L00
3408C47m24M27l57K4j06N58l83j35N69m20n7J31n21OL2N47m50N8m53O33l89K06
3430a57n6J10l04K61L46m68L62m18j36M18Q60r93K98m98N4J35N57l86k38N67m84
3451a70K28k93M60L20o5j15J9m23M80k43j67j60k90Q27m00o63K14J63K36p20P48
3472a4K0k54N71j039Q83m85P29j198Q89N09r5l98J78n39L32l36J8l9M41n55O76
3493B94m35N26l12q33Q38J20m61J73o08J357l77k55K98q01O70M09p30j31l4P84
3513D92l12l89L23l08j71K85O0j28L52m18N43m83j78r9L29j63Q48L07j082M66
3533B74n99M43J16N7j66m51J94N52k14m16l21M52k77p8J01M10K45m94J56K86m76
$$ plain form
3388 -900 176 -83 -264 -151 -182 14 -281 336 -534 -347 311 -437 340 722 -281 361 490 250 47 347
3408 347 -77 350 -7 17 -89 469 86 -49 520 100 43 174 -347 -341 -309 238 -212 -154 -607 26 -363 -157
3430 -157 -213 -103 -407 -146 200 -268 94 -324 -460 -42 818 -175 123 -375 -321 -186 371 -15 -253 314 -170
3451 -170 58 -235 225 545 480 365 384 -39 441 198 31 -129 -419 408 8 -655 -441 -278 -42 -762 -14
3472 -14 6 -248 323 -716 167 -318 411 -787 102 611 516 118 296 -243 89 -247 -229 -268 173 -382 294
3493 294 -141 385 73 -760 78 198 -263 -90 -698 659 282 27 325 -476 194 603 -127 -258 -292 492
3513 492 180 -209 114 -194 -365 -80 -20 -148 204 -214 329 -154 -332 -431 -102 -265 583 890 -192 274
3533 274 -325 118 234 291 125 -326 -132 420 206 -210 -531 -79 -356 -434 -333 77 322 -172 -16 270 -206
3554b06Q70j290K27K56LJ11n07l8K49O14k35n32L85o09P32%M9J43p05P90l94j49
3576b36K01M32k42k03k47L77j99P22o68j56j70L67J36l53K05L96o82M28j51l41
3596c84J80K26m70M56j75J74M92o38J13l10M23o3L12p78n8L85J80L50m94L66J75
3617D62j074L61k9K1N39k99j06M62l09j78J04K23k38K06k79J60M16l83q1k88J27
3638a83K48n84O31m68N65m27P27n10k19J031j490K59P60k10J18Q8q40K51J56P3
3658b4k2J39n71M04K69On70O90N1l74R3r1k79N64j02L02p92L24N2K26K81n83k97
3681c04M05n9L29o85Q08m04p6P72n3l44q92P68l92J69J45q7l73O18j55K31l96
3702B5O10p25M35l30n13P4m87P82J35K6n84O41n98M29J05q0kl29Q99m15m83M82
$$ plain form
3554 -206 664 -626 -399 -143 -140 -29 -536 -574 -325 289 54 -478 -93 -702 30 30 79 222 -483 307 -87 -236
3576 -236 -35 397 155 -48 -295 82 -117 605 -63 -219 -389 -22 114 -239 -34 362 -320 108 -43 -384
3596 -384 -204 22 -448 8 -167 7 499 -139 -26 -336 87 24 336 -442 -500 -115 65 415 -79 287 462
3617 462 -612 -251 -280 -259 280 -19 -125 337 28 -150 -46 177 -61 145 -134 26 442 59 -22 -310 -183
3638 -183 65 -519 112 -356 209 -218 509 -1 -220 811 -679 -420 340 130 248 336 -504 -253 -97 -24
3658 -24 -46 93 -478 -74 195 201 -369 321 372 -2 91 0 -279 285 183 485 -307 17 69 295 576 -7 -304
3681 -304 101 42 371 -314 494 90 14 786 733 389 -503 265 -127 42 187 100 -273 345 190 421 25
3702 25 635 -90 345 15 -498 -424 -911 -129 6 32 -552 89 -509 -80 25 -55 -57 -386 513 98 -385 97
3724I7M4M4k53r2m69P58K66o38K77j97l23P10m24p2j27O18k75n22K82J78K28n61
3746d51L76J79K45k73M16l56k86j23K49O7k84P10k38J56o83l5K63R06n58LJ40
3767D23n34j50L1K50J93K29m29k71P53o60M86n10o0L60K34J32m94M43p09J55M50
3788C22j00o68R58o63O42r10J41M92J81k51m67J93K06p05R34M30q59P91o75q9
3808i7K47k27K21j77n14K74P6N41J8o76O5O24L7k20j16J12P4o41k14N05k98L17
3830f9K74p38Q44o74K10j17j05R2nQ16m05j92k75K17L93k87j66K20n65K8J9Q07
3852C22p20M22j15P48p07m85L61O28o95J67r6Q0n87P14j45L16p08M86K22J02m33
3873a23m05M63J35O7k43n5l15O33j50q3j28N19J38n63K9l10P99n76K06K12n86
$$ plain form
3724 97 141 185 -68 -160 -629 129 395 -243 34 -163 -486 224 -200 -272 -399 219 -56 -578 -296 -118 110 -451
3746 -451 -75 104 349 76 492 136 -150 -273 -24 43 -241 469 231 387 -296 -331 -68 838 280 283 423
3767 423 -111 -261 -230 20 213 442 13 -258 495 -165 321 -189 -249 111 345 477 -17 426 -283 -128 322
3788 322 222 -446 512 -151 491 -419 -278 214 395 144 -323 -130 76 -629 305 735 -124 667 -8 -97
3808 -97 150 -77 144 -33 -547 -273 -197 344 362 -314 -249 375 412 192 76 188 262 -379 -593 -88 -386 -69
3830 -69 205 -533 311 -363 -153 -270 -375 -283 -288 528 123 -69 -344 -127 266 -21 -187 33 -532 -504 -485 322
3852 322 -398 24 -91 657 -50 -535 -174 454 -241 -74 -170 -90 -677 37 -108 208 -500 -14 208 310 -123
3873 -123 -528 -65 70 137 -106 -161 -476 157 7 -76 -204 315 453 -110 -81 -391 408 -168 38 250 -336
3894c36M02J66n82M7L26L54m55q11P72j3L89k2J01k91n5o3k77N26J30j54l29M93
3916C18p24k21Q02P2J16k01j030N25k19N86j14m02N67M1l41r1L07K9J32M30n81
3937Ak80j45K08N5L24J6j82n6k4j84N68j1q3m68K01K61J18j23J54n33qK64j54
3960h1RJ65o46J006k93q6j37k14M42p18R57m02m69M26K80j00m07l5j8j8L59q42
3982h22P67J64q99L35l8N12K88r8l21K39j16n5k94L78K81m96o9M86p4q78J181
4003D71j061M98j88l94O71J86j51p0J40n3K24m87K67L02J17q06l97J005k39j2
4023B3j65L30R6k24O30q66N58l78L06m47K23L34o08N05J7K12l65J64l84L96p45
4044c88P80O38r82K4O73k48l99K63oj86l81m67M08O9L54k73R31o05j73K9k87M60
$$ plain form
3894 -336 66 232 -350 -303 23 377 -78 -889 -117 -130 259 237 338 47 -8 -71 -348 178 308 154 -175 318
3916 318 -406 -627 175 247 363 162 -868 -343 -562 24 -90 -492 75 116 -225 -316 -9 20 152 582 1
3937 1 -279 -424 -216 -161 163 179 -3 -59 -83 -267 301 290 207 -261 -60 201 319 196 350 -183 -191 73 -81
3960 -81 -72 93 -553 453 160 74 -63 -277 165 -553 404 2 -467 -41 239 139 -268 -303 -321 -339 20 -822
3982 -822 -55 109 -790 -455 -493 19 307 209 -112 127 11 -44 -338 40 321 -175 -244 242 168 -710 471
4003 471 -590 -92 -280 -674 -3 183 32 -38 102 49 273 -214 53 355 472 -334 -731 274 35 23
4023 23 -142 188 284 60 690 -176 382 4 310 -137 86 420 -188 317 334 546 181 345 -39 357 -388
4044 -388 392 1030 48 72 745 497 98 361 355 169 -212 -679 -271 -202 152 -121 810 205 32 61 -226 234
4066B34p7j8k24lM50m02J44M0q05P26j24j90j70J85R8K34k11k63N87l93M44j64
4088I8J96j60N1l74O9K13k91jK28k10m9L22M5k13KL10k08K54o24R45j548J252
4110C07L08o92L2O5l63J43J89J54n44O15L24p84M50p44O79L99o77K61J35o74K63
4131a54o1M54J73q91O75L72r39P52o31J87j91L31r3M92m99L69n92l38M83K83j11
4152G1p01R50m21j30j8K2n0O20Q8j32r9j86J45m00J60J16l37R43m44J33l38L11
4174C03l24K26m55J58K3L42j95L72q9n64J84K26n2N6l18k33M69m3m07J30O95l12
4196A92o44O31j19Nk72O40l52N79l50j60j60j19l16K65K79j27K7n38J44L24P17
4217F46q23J11m9L80l06O32n13o02L72N3J61K99r48L36K31o7L32O7n87j4O94L8
$$ plain form
4066 234 157 139 -85 -88 362 -40 104 144 -661 65 -59 -249 -419 -234 -136 98 -113 -376 211 -182 262 98
4088 98 294 134 185 -189 -120 93 -198 -199 29 -181 -230 92 137 -76 -74 236 28 282 -342 603 -945 307
4110 307 615 -77 -45 20 -343 -200 -11 143 -401 214 538 -246 204 -540 139 538 -139 122 257 -417 -154
4131 -154 -215 239 412 -479 196 568 -371 381 -250 -63 -254 77 -16 476 -23 346 -246 -584 -101 182 71
4152 71 -630 320 -101 -231 -249 -227 -277 343 431 299 200 14 159 -241 -81 35 -302 641 197 330 -8 303
4174 303 -21 205 -250 -92 -69 273 78 450 361 -203 -19 207 155 211 -107 -340 129 86 -321 -191 504 192
4196 192 -452 179 60 65 -207 433 81 660 310 150 -10 -129 -445 -180 99 -28 -1 -539 -395 -71 646
4217 646 -177 -66 -115 265 -41 591 78 -524 -152 -99 62 361 -587 -251 -20 -87 245 312 -275 -289 405 443
4239D43k21l2p10N14o17r1J031m69J38J32q78N39J46l9J18j32n76N03J68Oo23
4260f50R17l22L95R7p80Q51L9j33m51L74o60N74m21l89K08M02L8k91M83Q0Q2p74
4282c31O06m44j38O30o02O18m53J52P84p94q68J006j34j36K62Nm35M56O2l08j99
4303b61n3k55N69k79P96j09k87p95O33L10m55J76j14k53M79L59k83K1J70k95j06
4324c2L24l48M90l19j8J82j95p13M75k79L59k11L54o23O52J76q18J79P15n58K21
4345A3K76m23L50p0N2k46M15p91R97n68rp99M68L31M0l37J81m54O76J50r0k7k09
4368g4j44J54L10ok90J8Rq8m25P6N15R1o8l16M18k29l33M01M26j37o90O30p67
4391e19R04n95J33n55Q36k53M42r24L18k93J153n79m57O00j72k94M44l5m04L12
$$ plain form
4239 443 222 190 -520 -6 -623 -714 317 -152 -14 118 -760 -221 -75 -114 4 -128 -704 -201 -33 -27 -650
4260 -650 267 -55 340 437 -343 508 547 414 -37 337 -323 251 -170 -559 -351 51 89 -202 281 361 443 -331
4282 -331 275 -169 -307 323 -279 339 -114 38 822 28 -840 166 32 -104 158 163 -272 184 246 -62 -261
4303 -261 -314 -569 0 -279 517 408 121 -674 -41 269 -186 -10 -124 -377 102 461 178 199 369 74 -32
4324 -32 292 -56 434 115 97 279 84 -629 -154 -433 -74 -285 69 -554 98 274 -544 -365 350 -208 13
4345 13 289 -134 216 146 198 -48 367 -424 573 5 -4 -803 -335 -4 36 -301 -120 -574 102 252 162 135 -74
4368 -74 -218 -64 246 240 -50 -32 -23 -111 -536 -460 55 146 78 -238 180 -49 -382 19 445 308 -382 248 -519
4391 -519 385 -210 -77 -632 204 -49 393 -531 -213 -506 647 68 -389 211 39 -255 189 154 -250 62
4411F2l03J03l08P82M6n42N62l40k51Q3q4J61k88j74M11K63o3j21m2K65l51R5
4433c4J4M2l63P52j00k60k84M35J0n16L77p1J30O87j185j09j08P21m16M60L49
4454E31j32j170O91p2M78N48p74j38Lj98j2n2N50m8j94k7r5L83n31L06K42k56
4476C3M78o25k77O90r87J001n84k19O80n76l1N06N49q27J86P9k33l61M33J13J5
4497D3m39K56L4l33M69j61K73j50n57J133l22n1o35M6J84L8K05R6j51oq59P78
4519a09Q3n07R15o10R26k31q79L87m66R47l28K44k25j66J3K8j35n8N87j91L20
4540E45j012K95K1k8k42K96R3L38j007J012l50M2m4L87n53P29o3r3q27N84k58
4561a35L92p75P0J98L4J61M97n94J66j03K78K77K24p46m62K37N44r63O39O89r90
$$ plain form
4411 62 -241 -138 -446 336 382 -160 402 62 -189 -106 -190 -29 -317 -491 -80 183 120 -1 -43 222 -129 -34
4433 -34 -20 22 -341 411 311 51 -233 202 212 -304 73 2 132 819 -366 -475 -583 138 -278 182 531
4454 531 399 -771 -80 -152 326 874 100 -38 -35 -233 -245 -297 253 205 11 -16 -111 272 -259 47 289 33
4476 33 511 -114 -391 299 -688 313 -271 -490 190 -386 -417 89 638 -189 -3 76 -157 -518 -85 28 43
4497 43 -396 -140 -106 -439 30 -131 142 -8 -565 568 246 195 -440 -394 -210 -172 33 129 -22 -28 -887 -109
4519 -109 -26 -533 382 -228 698 467 -412 -25 -491 456 128 372 147 -19 -6 22 -113 -171 416 225 545
4540 545 -467 -172 -151 -179 -421 -125 -32 306 -701 311 -39 3 -41 346 -207 522 459 366 -461 123 -135
4561 -135 257 -518 -448 -250 -216 -55 442 -152 14 -89 189 466 690 -56 -518 -281 263 -700 -61 628 -362
4582c62J32k1Q8k83L44R9K6j41L35K23m36M36o24P15k0j189Q64r81N06L75m23
4603c37M05m53K54J098j037J27l12p30O91M86j65l70M01k72L15k84K00M34m8n2
4623C51q09k22j6Q35J18J09l62O64j112k1M76m95K92mp1J75K77j53m9k11m5Q98
4645F25r19Q5q3N59n30l45L73N67m89j27K72r5qN50n10k86O75p00L22n50P68J58
4667C12o08P15j73k25n89N30l11J62O22m30L81l16j4m80M92m94P51j57rJ44l01
4688BM02k84K08k23O5n73J063j79p30Q45q38N81m0l57K90p71M53j90J23K70L62
4709D79n87k25J50R7K03m16L86K16j41M49o33P53r17K65n26P56o72M45O85q03
4729c6O33m97m2J09M38k89r64O93j61MM5k32M54o62j83P82K15q53Q85R7l12j99
$$ plain form
4582 -362 -230 -251 -163 -446 -102 -3 23 -118 217 440 4 440 -184 531 511 -678 186 -795 -289 86 -337
4603 -337 68 -385 -131 967 -70 57 -255 -985 -294 192 27 -343 58 -214 101 -183 17 451 403 351
4623 351 -458 -680 -696 139 257 366 4 668 -444 -465 11 -484 -192 -196 -267 -92 185 32 -17 -228 -273 625
4645 625 -294 -209 -292 267 -263 -608 -235 332 -157 -284 -12 -107 -115 435 -75 -361 314 -386 -64 -614 154 312
4667 312 -296 419 246 21 -568 -38 -349 -187 435 5 386 70 56 -424 68 -426 325 168 159 303 2
4688 2 404 120 328 105 170 -403 660 481 -249 596 -242 339 299 -58 232 -539 -86 -276 -153 117 479
4709 479 -108 -333 -183 -86 117 -299 87 303 162 611 -22 731 -186 79 -447 309 -363 82 767 -36
4729 -36 597 100 58 167 605 316 -648 45 -116 -112 -67 -299 155 -507 -690 92 307 -546 339 436 124 -75
4751g5L84m84O60k76j4Q97j096j95K7j56N07L0L75m33l59j26N02M00j020R13l02
4772A59K39n50L8j22J076o84j74k91M77j52j05K04K95l65L04j50j41N20o81r2
4792a95J94j85M84l79L7rJ29K4K63n65K55n02N84q39P36k52j01K88m6j58J07K96
4814A66K50r3k72P23p14k57k65J127j112M60R1K6m66p7M38m48M28J17k1K22k60
4835F3j44k08J91l43R47m33K11o85M98m41O39j3J63m34K08l39j03P00j42k29l80
4856b74M76m70L15P0m44N94n15J90K72q46N43K49n70p2M45K43k14N19m19m14J126
4877H04r84J1m28N03j74N33m70m04O20l13J142r17P46l2l56r13K28N43L08l71
4897G6J0l78Q45l76l64J73l55R22m60k33O42l46l70L14m83N43m7m5R0n39m45Q68
$$ plain form
4751 -75 309 -175 485 209 195 1092 -4 -199 -172 -328 179 209 584 151 -208 -334 168 568 -452 461 159
4772 159 398 -152 -114 -236 840 156 -18 -309 168 16 -89 115 410 45 349 199 58 578 -103 -195
4792 -195 -1 -186 298 -81 -44 -53 76 100 363 -202 53 -449 135 -704 32 -220 -321 -33 -79 -237 -130 166
4814 166 416 323 51 774 60 -197 -462 665 -447 13 104 130 -336 -413 25 -423 5 122 101 323 63
4835 63 -81 -289 -98 -441 506 73 284 -401 97 -344 295 282 445 11 219 -120 -223 477 335 106 -274
4856 -274 202 -268 47 117 -327 267 -248 -58 214 -632 -89 160 -410 -482 -37 206 -8 511 92 -322 804
4877 804 -180 -169 -597 -94 -268 265 -205 -609 11 -302 840 -77 669 637 281 -632 -404 139 447 76
4897 76 86 -292 553 177 -187 -14 -369 553 93 -140 502 156 -214 100 -383 160 113 68 158 -381 -826 42
4919D2K99o93N86j56J18n95J63J55q5P77m85K24J75l07o21J26L88J24k97L73k65
4940D6j06j46K73k90n14M59M43l3K20J9k28N04j057OL01P66j87n24l85J9M06N88
4962E80k86m06R51l72n73o4J44N86m37J32n90J57K2O62q04K64l46m45P59K05k64
4983a25j15K69p4Q32o81r9M40o11L10j5K32J26o74L20l50J01N97r88r8P57l5j61
5005d2K67n16qK12p0m47L11J78Q6L88o9N5p05j99M98K80K21j67l99J3N6r4M57
5028C06k65J05m90M87m41L58j66K73M91j74m06K75j86n11M52m49K86ok03K86k64
5049b42K18N18j231J052o9l42pN39m18mK33m26L03q4pR9k81k6m3P12r23O50j29
5072I2K8R9l05j27L14n6L0k63J30j88N56o39M54jj79N02q02M02m32O71o27q7R91
$$ plain form
4919 42 341 -352 234 78 196 -399 -236 -81 -166 611 126 350 525 218 -403 -277 111 235 -62 311 46
4940 46 -60 -206 67 -223 -737 -278 165 132 352 371 143 647 -410 -404 -103 663 476 -48 -433 -414 -8 580
4962 580 294 -112 839 467 -106 -170 -26 560 123 255 -335 -178 -156 506 -298 -34 -380 -825 -66 139 -125
4983 -125 -240 29 -45 787 106 7 447 -164 146 131 363 489 -185 135 -215 -114 483 -505 -603 154 119 -42
5005 -42 225 -291 -299 -87 -157 -604 -293 -115 -29 359 290 345 -360 -559 -61 219 440 273 -126 -113 -57 -151 306
5028 306 41 146 -344 143 -298 60 -106 167 658 484 78 353 167 -344 108 -341 -55 -61 -264 22 -242
5049 -242 -24 494 -737 315 246 -96 -103 436 18 14 247 -179 124 40 33 132 -149 -175 -218 494 -429 221 92
5072 92 120 219 -86 -213 101 45 75 -188 -58 -246 310 -329 125 124 -55 447 -355 47 -385 286 -341 -428 563
5095E63k18l00m96L46J9PK86k60j061J116L8J0P9k10J53l62P47p56J58J76n2K7
5117A0J89K51q41N8J70M24j97k53K52M14n69n74P42M8m0k00M0K98J04j76k95j65
5139c10l57J213j65m33K10m36L07Q0m32P67j32l28r8K69p46N34k72M56J90j53
5159A64k54M66m52j58N87j6l07k7j99j97J98J01Q7l43J94k01J007q16P89p74K
5180a49P96n02j17m31l09N6L44J72J31J90m85k37K72J05L00m41L80L65l64l51
5200b75L3J68n6j18j60N73Q3q54Q70l2n90O16k2l54K40rk38K86l6J26n36K90L20
5223C25q06J46j70N10K56m35N42k65J06K33l42K61m97K66n47K0L21K97n08K73
5243a4k06M17o80K68N02L8l73K8mj24k29L50K50o1K3n4P7m58N74j02j38m06K04
$$ plain form
5095 563 345 45 -451 -105 -86 -79 207 -53 -1114 2 40 50 129 -81 72 -290 457 -299 -141 35 -17 10
5117 10 199 450 -391 -333 -163 261 64 -189 63 477 -92 -666 76 124 84 -116 -76 222 326 150 -145 -310
5139 -310 -667 546 381 -52 158 -278 29 109 -323 444 312 -16 -114 155 -591 -57 -329 127 317 164
5159 164 -90 376 -76 -234 353 337 30 3 -196 -393 -195 -94 -7 -350 -156 -357 650 -166 623 -151 -149
5180 -149 647 145 28 -403 -712 -656 -312 -140 -9 181 -304 -541 -269 -164 136 -305 75 440 76 -275
5200 -275 -242 -74 -130 -248 -408 165 248 -606 264 232 -358 258 236 -118 122 113 -125 161 125 251 -285 5 325
5223 325 -481 -335 -505 5 261 -174 368 103 209 442 100 361 -136 130 -417 -397 -76 221 -287 -14
5243 -14 -220 197 -483 -215 287 325 -48 -20 -24 -148 -377 -27 223 162 185 131 208 -250 324 222 84 -322 -118
5266a18q4K42k39K12M73o25n1k36M02J85k80J07m2n65J137j61l40l13N19m6L53
5287E30k59m87M93p15Lk8P2j2m3O28Q4k55m85O02p6o62Q56l6K64m03r7L17r8j92
5311AJ46r81M10N71r42O58l36N90j83O6j08q2RP60l38Q5q4o87O35L72q40P6r2
5334b94J48l46N56j38p63R04M89l74o6k40N9j00N19k28o16m4R8J170q28J39k32
5355a87O5m10J100q63L10K90j56r5l07l15L05m93Q70K07l62l2J04M12k03o41L28
5376g3L15l78N56q30Q92m49l8j33M00k71k61k63M13O03k88j58L85n20J81L72m60
5397eM93p01O34m30k38ro1O54l16j93M13l26K72J59k48J46N9o92J79o3K69n9O9
5420FM79k73p85K80M9K18O89j057n1N85l27M35m20j66M64Q8l48Q95k064J028K47
$$ plain form
5266 -118 -202 40 -199 13 486 -139 -190 -426 -24 161 -119 -12 -54 -619 518 357 17 -296 223 177 530
5287 530 271 -216 277 -438 -435 -463 -391 -403 -446 182 266 11 -474 128 52 -610 246 210 474 71 -26 291 193 1
5311 1 147 -834 -424 147 -795 -137 -473 117 -66 0 -108 -190 -181 579 241 326 242 -445 190 562 -278 -202 -294
5334 -294 -146 -492 64 -74 -837 67 556 182 116 -124 -65 -165 354 126 -490 -534 -436 734 -94 45 -187
5355 -187 -122 -532 568 -295 15 305 149 54 -253 -568 -263 -756 114 321 -41 -73 31 443 240 -401 -73
5376 -73 242 -136 420 -410 482 33 -5 -138 262 -9 -270 -533 -120 483 195 37 422 -98 83 455 -5
5397 -5 488 -213 421 -9 -247 -256 -317 337 21 -172 241 -85 187 346 98 244 303 -389 -210 -273 -4 -63 6
5420 6 485 212 -573 -293 -244 -26 663 -394 -445 140 -187 248 -172 -338 126 214 -134 761 -1303 -275 -28
5441b8r67P21K13m90M14J93n65Q00j88j92M89o57L18j3K47L22m37J9k25j64k14
5462d04P39n1ml6o46N33J46n30K39p63N68q3m3N28m9r38J214p98K13m64J21O29
5484A21j44k76J17J29k4k76N30l18R0l81L47O21n83J76K88q66P90m69m05R21K8
5505D16O7l88l2J09m87N25p00P51m70K73j58m03Q75k96N24q96M71j69J55m87Q31
5526E11j74m93L03R7l49r6O8j1L83J76n23N89m17R2M65p12O06q19L11m44K4M78
5548F5P1n1j65N04p56j67J46j42J07O84o6j29J01N8l17m18M88n0j94J45j28O21
5570D07l04q1Rl08Q56p95K50n03N87P9n37J53K65J21j99J25k48p0o9P6J68R2M13
5593D87M8m51q14O74P74m55j22k88J45K09l12o47J019k26J39p33R44j8r30J55
$$ plain form
5441 -28 -995 -274 -61 -551 -137 56 -509 291 103 -89 400 -257 61 48 295 617 180 199 -26 -190 -404
5462 -404 335 284 280 244 -402 131 277 -253 -14 -777 -209 -292 -335 193 144 -794 420 -378 -165 -629 -508 121
5484 121 -23 -299 -182 -53 -77 -353 177 -141 -51 -432 -85 536 -47 129 417 -449 341 -128 -533 388 416
5505 416 483 95 63 172 -315 210 -490 261 -209 64 -94 -497 378 82 606 -290 181 12 167 -320 511
5526 511 337 -156 147 244 -105 -201 -133 -144 239 415 -108 481 64 156 621 -91 515 -304 7 -437 -413 65
5548 65 136 85 -80 424 -332 -499 -353 -495 -388 296 230 101 202 260 -57 -475 13 -37 -231 -86 -214 407
5570 407 103 22 31 -277 579 -216 34 -469 118 197 -340 -187 78 199 0 125 -123 -193 -262 -186 -18 74 487
5593 487 535 84 -730 -56 718 263 141 -147 -2 207 -105 -752 267 41 180 -553 391 373 -557 -402
5613d02M66k52k81J49R7L95k41o7O01n67L85m16L77l97m43K83R95j487P57n22
5633e70Q66P7q86P76m41N12n39J00L02L07j428Q97J9l75K95L32r15P73l12R83
5653G73r51K7P5N0L90j141J502l53p76J97J95n02J48J83L12j72l46Q0J83N52l97
5674B9P0j033R20L3q26J029J01l95Q4l17q9K12l25K90R9m12O63q4Pj90jjk45K16
5698a65P69m96L95p56L60q3L84n31N98p85O42k23j18K64n06N2j13K61j50M80K36
5719E15m79p2j57K89j93j25M8K99p35M77J60m04P43k54O13o76K22k96r5q9Q4n22
5741f47L09J180j610M58M26o56L31R5L05k27J19j05l45K06K24r1L36j4L1m28j1
5762a14j45M04j81J97r4o16R31J10l37o75Q88n27o9M34k73j17K46l34Q4L41Q3
$$ plain form
5613 -402 64 -188 -469 -320 -223 172 -69 -136 465 -102 283 -133 244 -153 -596 -313 682 -805 -48 -570
5633 -570 296 373 -513 263 -178 334 -205 -105 197 504 -924 -27 -8 -383 -88 244 -671 102 -210 773
5653 773 -178 -151 -76 -26 364 -777 725 372 -404 -207 -12 -514 -366 -183 129 -43 -389 -309 -126 426 29
5674 29 99 -934 -14 19 -807 222 323 -72 12 -305 -394 -182 -507 -217 -118 -530 133 49 56 -134 -135 -136 -381 -165
5698 -165 604 108 503 -253 107 24 408 -123 475 -310 332 109 -9 255 -251 -199 -312 -51 -201 279 515
5719 515 36 -36 -193 96 -97 -222 -174 125 -610 -133 27 -377 366 112 725 49 271 -25 -120 -209 -125 -647
5741 -647 -338 842 -768 -310 116 -540 -209 -114 191 -36 83 -22 -367 -161 63 -28 308 294 325 -103 -114
5762 -114 -259 145 -36 161 67 -549 382 492 155 -520 368 -159 -228 206 -67 -184 62 -272 -188 153 236
5783B36K53m72p5J43M2k81M75L11o54J17L06o27k99R23k46l83M08k18j85L91J88
5804C53m30L99N5m18m6p09P84J06j68J10k67L58nO50r35M2m4M7Q24o27N9p6J34
5827A96j48L39o36O20n55J38o05R3J046N2o3l63O53j103M70k0j89K57j39K79J25
5848D47p53K24jl02J18P74r11n30R53K22l89P30j78m51J08K21L20n59Mm5k50j15
5870c63k5Q1m8K15O08o5m48m19R84m08N2L71k91q50R47p86j20J091l14o26J25
5891b89K64J97j85k64L31K71j01m9j86N58o40J36m09K90m00M19J16J62j97j4j60
5912a50M7J46N90k94l91L17l76O66j62N4k54m63J59o88P71l03M11n4k16O5k62
5933c87R00j51l76p81O62J47k30q4j72r3J72L75m52j5P16l84J03P4K2l12K11N88
$$ plain form
5783 236 489 17 -58 85 127 -154 321 632 -22 95 401 -226 -525 398 152 -231 177 -41 -226 165 353
5804 353 -77 322 377 -41 -87 -796 -12 94 -74 36 -231 127 122 772 -163 -121 -165 -118 706 79 138 62 196
5827 196 48 387 -249 371 -184 -46 -651 -558 488 540 477 114 767 -336 134 114 -75 182 43 322 447
5848 447 -306 -82 -83 -385 -267 507 -404 -934 19 241 -148 582 404 -47 61 282 602 43 47 2 -248 -363
5870 -363 -388 -307 -355 -140 468 403 -45 -464 520 112 164 535 244 -606 341 -445 -565 526 212 -414 -289
5891 -289 -25 172 -13 -277 54 325 224 175 -11 547 -93 43 -366 -76 -476 -57 59 221 24 10 -150
5912 -150 -103 43 633 339 -52 265 -111 555 393 447 193 -270 -111 -799 -28 -331 80 26 -190 -125 -387
5933 -387 513 362 -14 -795 -133 14 -216 -300 -472 -565 -393 -18 -470 -485 231 -153 -50 24 46 -266 -55 533
5955E33p54K99J72M68q9q20J36J30L83j336R60J14j89K79n85L16j63K56l35J66
5975e9k1j91J77j60rL75k69J19O7l33J80L07j83r9l61Q66l04l07K69J34K09J35
5997E42n68n89P65k14K37n68P90o62K2Q27j051K53L18k44M71Kj87K02p83L99L63
6018C25P82p04l90l90L57K02k88M41k21n5J08J06l57l45M00n92L52L67p13K97
6038c18J356p48q14k4P74j19k57N29q3k4l9n01K00J33O46q24j17M71n62M00o77
6059e98N22n5J63p9Q7L18q42j72L58j17N21n1J69q5k07P9j27J82K39n18M07l93
6081a99R05q22N81k19L26j051O31L9p35N02J53J49j84n01R61p97P8L05oj67L00
6102B49k44J22M12jn42q86J250n91k04L98j57P4k65N44r2l53K06k02O55L59m79
$$ plain form
5955 533 -221 78 250 718 629 -191 -55 75 458 -878 82 196 7 286 -299 17 -146 110 -225 -59
5975 -59 -80 -271 -94 -254 -263 112 -157 -38 29 -304 -124 183 0 -99 -460 406 102 -205 64 198 407 542
5997 542 -26 -615 150 -64 173 -395 395 -267 -245 582 -469 -216 102 -142 329 331 144 346 -437 -38 325
6018 325 1107 403 13 -377 -20 182 -106 335 114 59 167 273 -84 -429 -29 -621 -269 98 -615 -318
6038 -318 1038 290 -524 -548 226 107 -150 379 296 272 233 -268 -68 65 711 -113 -230 241 -321 79 -598
6059 -598 -76 -131 32 -47 40 358 -484 -656 -298 -415 106 55 224 139 -68 11 -116 66 305 -213 194 -199
6081 -199 706 -116 465 246 572 -479 152 191 -544 -42 111 260 76 -425 536 -261 -183 122 116 -51 249
6102 249 5 127 539 538 -4 -890 360 -231 -435 -37 -194 -120 -385 159 67 -286 -80 -282 373 732 253
6123B53j85l38K46K00k43k35O36l42j57N06J76l04m36J069o96Q9L55l53l67L40
6143B14N5o5l44j45O00o05L90J98L41m14m00N39m43k46K43L77Q4p80O54q12Q02
6164B43l92J14k80L53n17K35N35N9m27l31L45K7j38J12Q2m41Q03m18M63O3o34
6185a44M05L50q63R7M49k26n90J98K32mk2J13k96K07P4O2j46k9K58m23k66O05
6207D1K24N71m34m22j71O73l88j53L80n45L03j19N69n38l25P48n1o12R4k83N99
6228A61r64R91m89K65Q9j82M19j97J21m35k90K66K95k43J00L62r8m3l37J87k04
6249b26J49L26j039O91K20l55M75n47J76M29k24PM32k96j67o85O43K0l56K29m26
6270e24O26J04l15J09l51J22M38J00r90O41J15o3K85k95m58o7O33p2J86l75J93
$$ plain form
6123 253 68 -270 -24 176 -67 -302 334 -8 -165 341 517 213 -223 846 150 239 594 241 -126 214
6143 214 269 204 -140 -285 315 -290 100 298 639 225 -175 364 -79 -325 -82 295 379 -401 253 -559 243
6164 243 -149 -35 -315 38 -479 -244 291 350 -77 -408 -63 -36 -174 -62 20 -421 382 -36 427 490 -144
6185 -144 261 611 -252 -155 294 68 -522 -324 -92 -96 -118 -5 -301 -94 -20 42 -104 -133 125 -298 -564 41
6207 41 265 836 402 -20 -191 482 94 -59 321 -224 79 -40 529 -9 -334 414 363 -249 -155 -438 161
6228 161 -803 188 -301 -36 53 -129 290 93 214 -221 -511 -245 50 -193 -93 269 171 128 -209 -22 -226
6249 -226 -77 249 -790 -99 121 -234 241 -306 -130 299 75 82 514 218 51 -634 9 29 -327 -98 -524
6270 -524 102 206 -109 0 -351 -229 209 309 -681 -40 75 12 297 2 -456 -523 110 38 224 -151 42
6291D2j65K81m77N35J78l32n16O52l41M22k56J5M24l14L76n39J56k15J32k09O68
6312E17q85L14N0K11l31q3j15M64J18m42k18J046n43m75P25l99L30k21m78R38
6332E23m46j11N62k9m12m76P21l95l77K28N72j13rj17M5l54P65o64J0L52k07J00
6354A68j93K01P1n9k15K36j39jr7j03m5K99j79J82j94r91R59N1o83L63J65l9P15
6377D72n50J85n09K93M20K21q46O67m45L01l06n65O61j0J70o31N52n07J85k1j85
6398d48J41M55L98q26N90m21K89l11M23K61k47L1k45l14M21r3k20J25r8l05K26
6419a68K86k85M30k63l91L57N50r66Q40o49j01M45k17K31K40r02P14k1K3r15K99
6440d63J179m36m64L60r8k56L37n49j70L38o2J17L32n41J9%P5PN24p12M4Q98j40
$$ plain form
6291 42 -123 158 -319 216 394 62 -454 198 -143 279 23 38 462 148 524 -15 141 -74 58 -151 517
6312 517 -368 -54 -4 207 -124 -207 -322 142 260 -182 -400 646 103 -372 353 -46 284 63 -415 523
6332 523 77 -34 528 499 87 -389 332 -63 -440 -212 360 247 238 121 166 -188 577 -87 -77 275 68 168
6354 168 -25 176 247 188 -27 209 70 69 -28 -131 -176 123 -56 126 -68 -1059 -100 -49 -732 -369 -204 -243 472
6377 472 -78 107 -402 -109 311 532 -314 353 -92 209 -97 -662 -1 -11 159 -472 80 -427 -242 -263 -448
6398 -448 -307 148 546 -280 310 -111 178 -133 290 551 304 335 90 -224 197 104 -116 9 -89 -394 -168
6419 -168 118 -167 263 0 -391 -34 516 -450 390 -259 -360 85 -132 99 339 -563 151 130 153 -762 -463
6440 -463 716 280 -184 176 78 -178 159 -390 -560 -222 -284 -167 165 -376 -357 -357 -282 -275 249 -463 -419 479 339
6463C39j3J51p67O1L77l71Q10j325Q98k25N75j055P07l52j54N01l25J7p65M76
6483d40L46O86n36m99L29Rj97K35l84M58j2K9l4O03m53j82O15n28p2M08K7j08
6505C00K67J80o25K10o51K46l51K30M11l4m35L01K56k97Q6R99j022n8L01k87J2
6526C9R2O4n97M30l28O31k98L82n17L58k45n9k19K40J99l44j22K18k18M48K35
6547C89k04j76m09j42P46m23j34O23j89l20K35j03p68N43j46N22L07j60l10Q9
6567c0j80j63J30MO26n18M6M9j63j13O40o65M22l3l72J69J57K52j65q0L5L63l54
6590E7L39n10r8M41p26O19n26Q21L2l14J41l50k7j35O61n49P6k6K33l3k22k25
6612c21O01l38j35O3n52L53K12M97j77r4m28MN96k39J78%m95j73L18M08q6m03
$$ plain form
6463 339 326 477 -290 -229 148 -223 587 -738 160 -65 510 -545 162 -190 -344 157 -168 -151 -916 -440
6483 -440 -94 592 56 -443 -114 -105 -302 -67 -451 7 -5 24 -10 593 140 -42 573 45 -27 381 408 300
6505 300 567 747 122 332 -319 -73 -424 -194 217 183 -252 49 305 8 94 1093 71 13 314 27 39
6526 39 131 195 -402 28 -300 331 33 415 -102 256 11 -48 -267 -27 172 -172 -294 -76 -294 154 389
6547 389 185 9 -400 -542 204 -219 -353 270 81 -239 -4 -107 -875 -332 -478 44 351 191 -119 -30
6567 -30 -210 -373 -243 -239 387 -131 -85 -36 -199 -312 328 -337 85 52 -320 -151 6 258 93 13 48 411 57
6590 57 396 -114 -212 229 -497 122 -404 417 449 135 276 -74 -101 -236 425 -124 -48 -74 159 126 -96 -321
6612 -321 280 -58 -193 -130 -682 -329 -117 380 203 109 -319 -315 281 42 220 220 -275 -448 -130 278 192 -211
6634b11l71M4R01n41Q1L28R5K02j274O48k66K3R1P88j125Q25k93M07j007O70j97
6655a82M10k75L7K95l7m35p4P99m80Rj6J001p86j2K31p86J72K12m52J57K32J04
6677A24L67j44n34L87M17p03K15k7MK83p49r9J42K95n45Q79n73m16R77o34O03
6698B69n85K28j75o3n4J112o38k90J39K2L02j66n05j0J26N82m08p6NM79r4o83
6720d83N13L64j57K01r33P58q02M44J28J65k22ML94n67P6J08L73r26P79j56n4
6741GJ25l6L1r8j10k94J087q55O51o81M7L78l38r6K95n09k57M37L4k57K10O26
6763C97r16KP65q58Q96l96k95R66q72k41L81L41l0o36K56L86R7l64QJ14M31K56
6785F88o60m0l31N01o18O56l81M50j08n45M34J28Nk55N47l77l57L30J15l18l6
$$ plain form
6634 -211 -582 -538 363 -178 -97 231 326 528 -746 -98 -364 -341 -250 538 -587 238 -55 352 -655 15 -182
6655 -182 228 -47 -10 285 248 -187 -261 538 58 67 51 1052 266 254 485 -301 -129 83 -369 -212 20 124
6677 124 491 347 -187 200 617 -86 129 102 106 389 -360 -459 -317 -22 -567 312 -261 -677 300 -334 269
6698 269 -316 -88 -263 -326 -380 732 94 -196 -57 -35 267 101 -404 -414 -288 294 -114 -190 -185 294 200 -483
6720 -483 30 394 237 438 -495 263 -539 -95 33 198 -24 -20 374 -193 -117 -9 364 -562 217 61 7
6741 7 132 96 127 29 -81 -375 712 -143 508 -173 -126 252 -86 -182 113 -396 -653 -216 -182 -439 -229 397
6763 397 -519 -517 248 -610 286 -110 -405 561 -311 -552 -171 170 140 -496 -240 146 243 -121 -113 1 432 688
6785 688 28 -12 -343 158 -460 196 -185 265 157 -388 46 174 179 -76 471 94 -263 67 182 -136 -172
6806a72j07K84J92n85N86n5p80P01K9l78K89O1m76j53R40m72N79l40O2k23l75
6827c93Q3J77J06k98M20j01L23n90n8L68m32j01N91l23OO88o65J6j46M27q1k35
6849b18J82p9m00P41j4m29K64m96M26M23m43j39L3r7L26j52j61J7K43M9j85R9
6871a0L07k8l98k29J17M45q95P11N26j127N89n13M33L30k86M49p38K19M22q87
6891e63M29J15N92o00L21j81J5q32J008j44L22k02l88O4r8o7L27l19J39O81m57
6912A62o5J86q68J23J85M68p3j95K03n19P03q30N48j0l62P44n72J85l62O78n53
6933b24N48L77n08n24O57L54n56n64O89j91K99k15Q9m20k50O46K50k39Q1m37m7
6954a85K04j55L30n55N55k13L65L22p10l08p3J56j40Q35k74P6j66n89Q30q7Q4
$$ plain form
6806 -172 -279 5 197 -388 198 143 -637 64 93 -285 4 65 -411 -564 376 -96 483 143 205 -18 -393
6827 -393 -310 -133 -27 -325 95 -6 317 -273 -331 37 -395 -496 95 -228 -222 466 -199 -183 -329 98 17 -218
6849 -218 -36 -115 -515 226 212 -217 47 -449 -23 400 -43 -182 -149 -246 80 -72 -233 -216 27 76 -109 -10
6871 -10 297 269 -129 -358 -241 204 -691 20 546 -581 8 -505 -72 258 -28 421 -317 -98 324 -563
6891 -563 -134 -19 573 -27 294 113 128 -704 304 160 482 280 -108 -44 -142 -209 118 -201 -62 619 162
6912 162 97 283 -585 -462 -277 191 118 -77 126 -393 310 -520 28 18 -344 400 -172 13 -349 329 -224
6933 -224 324 701 193 -331 326 680 124 -440 249 58 357 142 231 -189 -439 207 457 218 299 -138 -185
6954 -185 19 -136 194 -361 194 -19 346 668 -42 -350 -423 -267 -407 428 154 230 64 -525 305 218 302
6975C02k50P45p65q4N73j346J134Q9m56Q2k51N23k11p6R9Lp81M12O9R01j155K92
6997a51P37n87j30L45p31M33J30k64l38Q59o21L07l18r2J1j57N52M01l61r4K01
7018A32j91L49k09j4m31K18J24J20o84M58J44k87P45l40o35N82l66n8J06q1P9
7039b39K62Q23q76K5p6M2p3o8N04K35j73J68o00k98K26l55O47J66J05n43M19m63
7061a42K79r9L08k60K07q15R90m35K1l4j27K98p62J9O87K6j10j24L98Q5q4m02
7083g6L53p63l32P93j330J401j25J9L15j3q0M56o58J86n56J98J96K01N3n89M31
7104H0q0N47r92R82l06m19K15k54q7K95k4r3L66j30N48r67j64R4N52l16Pq31R66
7127a1L43n82L33L7O23m71Pk66L34o0n41L45j76K7R35j553M30J8n3N77J65p61
$$ plain form
6975 302 52 797 32 -52 521 -825 309 398 -58 24 -227 296 85 9 108 111 -670 -258 -189 712 -443 -151
6997 -151 586 -1 -131 214 -517 -84 46 -218 -556 303 -318 -11 -329 -421 -410 -567 -15 386 25 -69 132
7018 132 -59 290 81 67 -364 -146 -22 98 -586 -128 16 -271 474 134 -501 81 -285 -343 -237 -318 -239
7039 -239 23 846 -30 -5 -81 -39 -112 -180 324 559 386 554 -46 -344 -118 -473 174 340 445 -98 321 -142
7061 -142 137 38 346 86 293 -522 468 33 54 20 -107 191 -571 -552 135 161 51 -73 325 410 326 -76
7083 -76 277 -486 -818 -25 -1355 46 -79 -60 255 242 162 618 -40 146 -410 -212 -16 185 238 -351 80
7104 80 0 547 -445 537 231 -188 27 -227 -314 -19 -43 -136 230 100 648 -319 -483 -389 163 -153 -146 -977 -11
7127 -11 332 -250 83 120 743 272 279 13 347 287 -254 91 -85 -58 877 -676 -246 -228 -281 296 461 -300
7149c00P20j30n62L02j34M1n7N5J87l64O25p05P10r80P85n00L94N3k80j01M51
7170B10j48l48Q99q27K48k19N45n65J21l97Q57m89L0J29o00J64k1N24k59L69n87
7191c64P37o05J97K34J61p5r7m65K30K84l2J42l16K3K06N5k50K08l3Rk78J92K90
7214D53o16J75j19K20o7K8j18l71O31J94l40P1n73J068j215N73k47k21J95L55
7234G6m18M21j54j99M77j18m2N1m77m26J121n04N18m98O60n68J16o03M62L45N2
7255B92p54O26n44M73M9j64M89k99k64K54L53l01o2j35m56L97R3n05M31K70J62
7276D05l53m37o8Q25m36J3k15P9J07M35l59J5n14P22o17Q19n35k53J37o6j25M03
7298a8m30O08j44j45J27J93j86K07K45j36j12k59K35m16K48m30L51N63q50O84
$$ plain form
7149 -300 420 290 -272 30 -104 -63 -120 -65 122 -242 383 -322 388 -592 193 -307 87 140 -140 -241 210
7170 210 62 -286 613 -214 34 -185 360 -205 -84 -481 376 -113 -83 46 -554 -390 -411 113 -146 223 -364
7191 -364 373 -232 -35 199 360 285 188 -277 -47 237 205 347 31 54 260 315 65 273 240 249 -29 163 453
7214 453 -163 12 -107 113 46 74 -44 -415 216 410 70 141 -432 636 -579 -6 -253 -474 -279 76
7234 76 -342 79 -75 -274 203 85 43 94 -383 -809 312 -192 326 -172 488 -80 36 -567 -105 240 292
7255 292 -462 164 -380 93 142 -22 467 168 -96 158 511 210 148 13 -443 -46 47 -458 -27 243 405
7276 405 52 -385 -453 372 -64 -51 -266 -187 -80 355 -4 11 -503 219 -398 421 -114 -367 -230 -296 -421 -18
7298 -18 -448 160 16 -129 -2 191 5 212 457 321 209 -50 185 -231 17 -413 -62 501 -349 335
7318C35l54j82L74M03k29L25l84J00J48n93J82m4K40n37L09J4n17N55p54L82K45
7339A8n57M98K80l26K76k91M1j44J92J15K8r3o61M27K2M35m8Q2J12l13k91l78
7361e76J257j346R11l48J03K68m05m53P20r66J284J75n49N40k80k96k11J86n29
7380e15Q35k35q5n4j6q5l8P07p25o4N91m66O68o25l06K35K49k20j43k71L04O21
7402C62o89M20j26n03L93k42K48l6J81J29N7O7j01n14m02R37m8k01K14k12j98
7423b64O13k56j56OR6J00K8K67o01N30j34l60N68n09J60j65m30P08J19j71j69
7444b0p6J98l20J36L7p62N54O09o38N44k95k14N74k79n27M84J09j76k50l2M3O78
7466C77r70O76J53o97M98K93j77Pl03N42r53J131n82L0P6j08N48L18p36j71M50
$$ plain form
7318 335 -19 -201 173 576 347 672 288 388 536 -57 125 81 321 -216 93 107 -410 145 -609 -227 18
7339 18 -539 -41 239 -87 189 -102 -61 -205 -13 102 130 37 -624 -197 -175 260 212 294 406 93 -198 -576
7361 -576 681 -665 246 -102 1 269 -136 -589 131 -835 449 624 75 615 335 39 -172 14 -515
7380 -515 320 85 0 -54 -70 -155 -193 514 -211 -275 316 -150 518 -107 -413 -178 71 -149 -292 -563 -259 362
7402 362 -327 93 -33 -536 -143 -385 -137 -173 8 137 194 261 160 -354 -756 181 133 -68 146 -66 -264
7423 -264 349 93 -63 -57 39 139 167 434 -167 363 229 -131 437 -72 88 -77 -507 201 320 149 -20
7444 -20 -96 102 -218 -82 -45 -807 -253 356 -282 262 -33 -247 327 48 -479 5 114 -62 -312 -344 -301 377
7466 377 -593 83 236 -461 37 330 153 160 -143 399 -554 577 -5 25 101 -7 541 859 123 -48 402
7487D02n61j4J14L57k12K19k99M83K57j98q86K00K21j98L91J22j11l00J0n46O79
7508A30p86J044k83k92L8N12l37K34o97J16k55N7J036l31j49l82k87N03M7J57
7528G5o14O6K65O75p23K45L3j41j44J55J75j87qL21l41k11j59L65m28L13O10p07
7550c65L52o90L44N55k91m05P55j006P40m97P4K13M07j1m24M26m92L66N03m66
7570H8L55r5k45%qk36k93L00L84m87N06J22k42J35j19J64l67J10L42j51m31P31
7592E63L0P7q53M79o10j78R05l85L38R0n58n81N28K99K96j293J428j118M32K27
7612A16K25n91M75k19M78j05j18p74O43q2j87L71l96N17m01p0K71l54K1K41n12
7633d51Q68p16L93O9J73q62J039k0o66n6j15M9R3j22M96l93k2J94n37O76m42J13
$$ plain form
7487 402 -159 -173 -59 298 86 305 6 489 746 548 -338 -138 83 -115 276 398 287 -13 -3 -549 130
7508 130 -656 388 105 -187 -149 363 26 260 -437 -321 -576 -519 517 186 37 -345 -632 -129 -82 75
7528 75 -539 -473 -208 467 -256 -11 22 -119 -263 -108 67 -120 -128 193 -148 -359 -518 -153 -581 -268 342 -365
7550 -365 -13 -703 -359 196 -95 -500 255 -751 -11 -508 -434 -221 186 175 -249 177 -315 51 554 88
7570 88 443 348 103 103 95 -141 -434 -134 250 -237 269 391 149 284 165 329 -38 72 414 263 -168 563
7592 563 593 670 -183 296 -314 -492 413 28 366 456 -102 -683 -155 144 440 -853 575 -543 -111 116
7612 116 341 -250 225 6 484 379 261 -513 130 48 -139 232 -164 353 -48 -118 153 -201 -180 61 -451
7633 -451 417 -299 94 163 336 -526 513 493 -173 -229 -344 -295 -202 -324 172 -221 -243 -49 -586 90 -352 -239
7655b39k34P64j98j24n97P39q55J84O13R7l47j59N09k46M19o92N44l52O36m93
7675c1K49m12O6K32o16L57J24M2k95k9J9O73r31K78K84k59P28l22n4k33N3m27
7697e04M37k88R54p61N45m09k45o46J003J00J01k75Q2r2R4J92j103j0R12R5o41
7718d59J28K27O3l4m8p8M57l58Q54m40n19M4K47q3K46k88k61M95o29M20k47N16
7740B53k09J5O63l5n60k38k5J62o0J26L63l20n59M39K49j91l25O40o53J16M37
7761B88l57R5M30p02K78j92k64N21j50N16m16m19N07J00m23K00L77j89q39K66
7781c73R12l01m86m00L47L77m83J53l12O56O6L97q86M56L70n24J48r0K53q5l77
7802a82p0N86rj16p98N13L46K29j25k82M31p93J71L55k72J9q4O8J7j92O79j064
$$ plain form
7655 -239 -473 291 93 -31 -628 111 -744 -560 53 150 -197 -356 153 -93 326 -366 178 -174 462 -31
7675 -31 218 -194 -128 104 -512 -155 -31 11 -284 -313 -294 379 -552 -274 10 -249 479 157 103 -130 -77 -504
7697 -504 -67 -355 599 -162 383 -26 -271 -917 86 186 287 12 94 2 96 288 -815 -825 87 182 -459
7718 -459 -331 -104 -41 -75 -123 -201 256 -102 752 312 -207 -163 84 1 247 -41 -302 193 -436 -16 -263 253
7740 253 44 59 722 687 127 -111 -136 26 -34 92 455 135 -424 15 264 73 -252 388 -265 -149 288
7761 288 -69 26 456 -246 32 -160 -424 97 -53 463 47 -372 135 235 -188 12 389 200 -639 -373
7781 -373 539 238 -248 -648 -301 76 -407 -254 -566 90 156 553 -333 123 493 -31 117 27 280 195 -182
7802 -182 -252 334 325 209 -589 -76 270 499 374 92 523 -270 -99 256 -16 3 -81 -13 4 -188 491 -573
7824e73Q09o96M85K39k14l02L37o9L51p25k29Q95o65N15P38j755J323k39l86n3
7844b14m2L94n32N81q7O37j030R12r98M25k5k18P82q79K21M76k20M55r72K20k75
7865c89J5M16J9k75k48R52p27k28j56J238n25j76m34O59o64P27j65j02j87n6N60
7886B54n99Q3P94o20N6k41L44l4k87K37k27L55j33j65K38k54L76J56k85J19j055
7907h88R93k0k25p53J296l25L20m32J24j71M04N9m2j56p86N35o59K80N49K42m45
7928a00j17QJ54k11J067o31p31M95K23p9n88P50m02L7K61j41K44j30m25P57m24
7949A7l34L75k44K09O2m35j62R02k81p39M00J9K81l47k50P39l65K98n74J92N7
7970a80L57K42j052Q20k06j26l7O33j09L83j014J96l19Q76o76mK90l53N60m89
$$ plain form
7824 -573 236 -460 25 264 50 -252 85 16 367 -358 -587 308 -357 158 896 -859 464 225 -161 -214
7844 -214 -256 138 -394 187 100 737 -293 619 -379 46 21 -197 585 -294 -73 403 183 638 -334 -114 -389
7865 -389 -374 42 61 -214 -462 490 -237 -465 -621 617 92 -84 -518 141 -523 204 39 -63 -250 -306 254
7886 254 -345 -262 532 -88 -32 -273 71 37 -250 -13 -240 115 -18 -183 55 -199 177 333 48 167 -888
7907 -888 105 85 -140 -893 403 78 398 -34 90 -81 323 382 340 184 -602 -67 -726 -446 103 345 -100
7928 -100 -217 -209 -55 -266 801 170 -561 -66 157 78 -510 240 -162 -125 136 -5 239 109 -316 441 17
7949 17 -317 58 -186 23 85 -350 -512 390 109 -630 -230 -211 70 -277 -527 212 -153 145 -429 -237 -180
7970 -180 177 419 -633 187 -19 -145 -182 451 342 725 -289 -93 -412 464 -212 -216 74 -279 281 -208
7990b08J41J66l90M61K21p76P88j027Q26l9n69J20m07J114n04q0j66L26j40p3
8010b16L11k70KO03k76n88M23j4L65l65J80J67p14R9J60N76j48m48J65p2J93l48
8032b15N98j23j63j86m13M62J74M51m47K28o62R97j434O16j56m44N95M5M29r2
8052B60m33J79k12K63l42J90P8K33q52N86j8j55J8L44l48L30n6l66M34J11p13
8073d69M37q9M23K75o82K30k67O30q51Q7l0j12K78L33k05L29j55n78N25k44O36
8094E01r84L0L97j4L07k69O1q4M58q00N55o8j07k57N73k89O43k99o09O79q53N92
8116A63m28K51r0k07R7M95n82j36O23k83o79J172o52N45k28m98J32k7J45P12k27
8137B98l04K0K73o32L81N25p50K24M24j17k73k39K22M04n89K66l6J65m23K99J96
$$ plain form
7990 -208 -67 99 -291 170 391 -385 403 -624 202 163 -406 -286 -693 421 -83 -163 -329 -3 -143 -216
8010 -216 95 -175 -173 430 154 -434 -11 -25 340 -25 155 322 -392 -293 -133 443 295 -153 12 -60 133 -215
8032 -215 383 260 97 -89 -502 -40 134 585 138 366 -296 701 -733 -117 -273 -717 -122 -77 352 260
8052 260 -173 6 -206 57 -285 -95 -17 216 -636 -50 -68 -223 -205 139 -209 121 65 -301 133 244 -469
8073 -469 -32 -121 302 577 -105 125 -142 488 -363 -276 -306 -418 -140 193 -12 317 162 -416 109 -135 501
8094 501 -483 -453 -56 -70 237 -32 29 -55 403 -397 158 90 -17 -274 299 10 653 354 -255 424 -429 163
8116 163 -265 -14 -104 -311 -214 281 -301 -437 186 -97 -776 396 -256 289 61 -437 -305 -332 -187 525 298
8137 298 -6 14 287 -345 36 561 -189 35 459 342 69 -170 52 456 -133 133 97 262 -161 138 334
8158C34p1k97m5k4J6J5L09o94M90J2o09J007q34L00P72p96r3l92L16jN21l96m01
8181e61O15O76k80l83J8L19q24M67L4m39
$$ plain form
8158 334 263 -34 -79 -103 -87 -72 237 -457 33 45 -564 443 -391 -91 681 -115 -208 -600 -284 -285 236 -160 -561
8181 -561 54 730 450 67 85 404 -420 47 81 -358
8191c58
$$ Imaginary data points
##PAGE= N=2
##DATA TABLE= (X++(I..I)), XYDATA
0@%%%%%%%%%%%%%%M8r6R6r6R6j44J92j92K37k85L21l69M32n04N59o35P29q35R51
33E05j078J216j366J533j714J913k129K368k630K913l220L555l921M323m764N246
49B750n777O360p005P724q526R428j0450J1611j2957J4535j6399J8651k1438K4976
63A3483k9626L6022m5348O0173q7111J50156n32863k81586J120283p79465J87637
74a88245o8909m54629N02343l30035K82118L60256l76188M89903k01869k8317
84a3572K97987k95655M36971P17l19157K23829j86149P1164j5917p1735P9100
95B07583l16457O1002l8605q5398K38634k57621J9426M985j45418K58397j25063
106a78535R5218P8257k43304K79345j08631l2205K89127j82528J20737m7778j11477
$$ plain form
0 0 0 0 0 0 0 0 0 0 0 0 0 0 0 0 48 -48 48 -48 48 -96 96 -96 141 -144 177 -192 240 -264 295 -340 389 -446 505
33 505 -573 643 -723 810 -904 1009 -1120 1248 -1382 1531 -1689 1866 -2055 2268 -2496 2750
49 2750 -3027 3333 -3672 4052 -4474 4954 -5496 6115 -6842 7693 -8706 9945 -11493 13483
63 13483 -16143 19879 -25469 34704 -52407 97749 -435114 -716700 403583 -375882 -188245
74 -188245 -257154 -711783 -209440 -539475 -257357 102899 -273289 216614 14745 -13572
84 -13572 284415 -11240 425731 426448 107291 331120 144971 216135 200218 128483 207583
95 207583 -108874 -47872 -86477 -171875 66759 -190862 -171436 -166451 -311869 -53472 -178535
106 -178535 -83317 -5060 -248364 30981 -77650 -109855 179272 -3256 117481 69703 -41774
117d1774K60202j42603Q9944L9522k26700J55621r4234K0622J03266k17685Q7417
128C3598o7918r7813J35640r0509L8838k8504q3963R6148q3158O7533Q5457o8682
140f3333O7090n6924O893J00094j7472O5084l1021n4345M1816j3294L8347l296
152G9639m0216m37m3087P099N256o406J5250l8547r962j1448M4L9282r254J4200
166A413k2398m1218M1650K600J6881K5754n4285J677O421j2484N0935o376k2854
179a2284K0940k8830J3436L6424j7070L6346j1089m0942M7416k5325N095N2770
191G6887o3588N433l821m8935O1449k5768k3796K0374o7570K6382J0676k6680
203e8957N2254l9532o947L3589l2766M5234J9224j2424K8401j9059O122K2056
$$ plain form
117 -41774 218428 75825 165769 205291 -21409 134212 39978 60600 163866 -53819 33598
128 33598 -34320 -132133 3507 -87002 -48164 -76668 -160631 -64483 -147641 -80108 5349 -63333
140 -63333 3757 -53167 -46274 53820 36348 101432 70411 16066 57882 44588 82935 79639
152 79639 39423 38986 -4101 2998 8254 1848 17098 -21449 -31411 -42859 -42815 -3533 -12787 1413
166 1413 -20985 -62203 -20553 -17953 -1072 24682 -29603 -27926 -21505 -33989 16946 10570 -12284
179 -12284 8656 -20174 -6738 29686 12616 48962 37873 -3069 44347 19022 24117 76887
191 76887 13299 18732 14911 -34024 27425 1657 -22139 -1765 -69335 -42953 -32277 -58957
203 -58957 -6703 -46235 -53182 -19593 -52359 -7125 12099 -325 28076 9017 15139 37195
215C7195O080J7616j1219j1822q149k786Q656m780n106k9299j0301k958j9513
228c6386K3377j5242j6567J2618l3025K0490J6789j0323L3397k0365L984K2559
240A306j2456M6583l122j0457K4945l1705K0632J4395k0113K1063k9058j1876
252A0137P417k3227J8004j2530j9806N840k8725Q137J1502j1337J4796j1696m231
265c5719J2058K858J8237P504j393L659j757Q362J1967N884j404l140q018o008
279A3090Q885k966l023k589k0954j052j218m626J1847j2391n639K243j2111J5653
293a4851O220l728J0557j2584K101J3914k088J4094o7r071N718n990M887J0292
307A9404p590P57o203j0638Q495J76l68L458j1815m980L176j690Q799Q2p302K403
$$ plain form
215 37195 43275 60891 49672 37850 29701 26915 35571 30791 25685 -3614 -13915 -16873 -36386
228 -36386 -13009 -28251 -44818 -32200 -65225 -44735 -27946 -38269 -4872 -25237 -21253 1306
240 1306 -11150 35433 32311 21854 46799 15094 35726 50121 30008 51071 22013 10137
252 10137 17554 -5673 12331 -199 -20005 -14165 -42890 -34753 -23251 -34588 -19792 -31488 -35719
265 -35719 -23661 -20803 -2566 4938 3545 7204 5447 13809 25776 31660 30256 27116 19098 13090
279 13090 21975 19009 15986 13397 -7557 -8609 -9827 -14453 -2606 -14997 -20636 -18393 -30504 -14851
293 -14851 -8631 -12359 -1802 -14386 -12285 1629 -459 13635 13568 4497 10215 4225 9112 19404
307 19404 11814 12571 6368 -4270 4225 4401 4033 7491 -4324 -9304 -6128 -7818 981 1063 -6239 -3836
323c836q437L643J0924n032M307k836j0203Q216n96M733O284q963k99j746n00
338d341J1256j377M66J205j0151M313O487j424N963m128q032J112j525L458L593
353F875n972l170o598k241O017l81N23L79r617Q63O140j09Q691K40n227L279j306
370a614O732O836q80K044o220j785O223j341J807n34j0595k244j424j451L426
385a020j827o401k908k932J997M461J639K654l315j258N327K147O198N965n825
400D902J603p12Q25P626o97l314k495o580K439q84n9J256r257j595r41l545O565
417d863o81k135J545n568L384N386J945M964l111k831L952M86N010M147n337k151
433D142o53k089N068J117n549O49n487k158M756l125K159J662q963L291o56l21
$$ plain form
323 -3836 -12273 -8630 2294 -2738 1569 -1267 -11470 -3254 -3850 883 7167 -1796 -2095 -3841 -4341
338 -4341 6915 5538 6004 7209 -2942 1371 7858 6434 12397 8269 237 1349 -176 3282 6875
353 6875 903 -2267 -8865 -11106 -5089 -5470 -4947 -4568 -14185 -13322 -7182 -7291 1400 1640 -3587 -308 -1614
370 -1614 5118 11954 11074 13118 6898 5113 11336 9995 11802 11268 673 -1571 -2995 -4446 -1020
385 -1020 -2847 -9248 -12156 -15088 -13091 -8630 -6991 -4337 -7652 -8910 -3583 -1436 4762 10727 4902
400 4902 6505 5793 6618 14244 13547 10233 7738 1158 3597 2713 2654 3910 -5347 -6942 -7883 -11428 -4863
417 -4863 -5544 -7679 -6134 -11702 -8318 -2932 -987 3977 866 -1965 1987 2473 7483 11630 6293 4142
433 4142 3489 1400 6468 7585 2036 2685 -2802 -4960 -204 -3329 -1170 492 -8471 -5180 -5836 -6157
449f157J0991o508j757K520o090R434L012l566M916q407K63O436n378N711j694
464C726o423N106m576j124O831l189Q59k509m150K720L094K203N09l628k890L267
480a74J354J225K684o338p83L447m808M948J210n938L661l451k778M152j882N043
496A572j28n832K649p05L701O401m762j755kj14M152J810l477k231K76j708J16
513c7J023l994K481j163m666J464j954L058M676o490L125k769O90R082k326l71
529A829K021m453M339L138j753R87k968r93N09q0k123N00O3k758j170l713O29
546e996N746m401J789k122n461R646N52p78M556p879L929M859l493O930m494k280
562A103N811o073K049J570l990M668l657m831K015q07P39L329n041l764K990K7
$$ plain form
449 -6157 4834 -1674 -3431 -911 -7001 2433 5445 1879 6795 -1612 -1349 5087 -291 5420 3726
464 3726 -2697 2409 -2167 -3291 3540 351 1210 -1299 -5449 -2729 365 2568 3077 -551 -3441 -174
480 -174 1180 2405 5089 -1249 -2032 1415 -3393 1555 2765 -3173 488 -2963 -5741 -1589 -3471 1572
496 1572 1444 -4388 -1739 -2444 1257 7658 2896 1141 1139 1025 5177 6987 3510 1279 1555 -153 -37
513 -37 986 -3008 -527 -1690 -6356 -4892 -6846 -3788 888 -5602 -2477 -5246 -4556 4526 2200 1829
529 1829 3850 -603 3736 6874 5121 6108 3140 2147 2656 2576 453 953 1016 -1742 -2912 -6625 -5996
546 -5996 -250 -4651 -2862 -4984 -10445 -799 -247 -1025 3531 -4348 -419 4440 947 7877 3383 1103
562 1103 6914 841 2890 4460 470 5138 1481 -3350 -1335 -2142 -1403 1926 -3115 -6879 -3889 -3862
578c862K029L993o675J601K747l509Q675l368l367Q321p449L212J941o015Q786
593G060l870m799M296p294M898L559n324K338m680m25M676j040J165k063j160
608b663J326M49J914j646J652K87j605K439l862K631K907m287K829n956M28O926
624C769n199L525j900n646O715j900O59L049n493K934P65j753K858k258J649n73
640A201j338o25j28J692n70n9j252l222L734j449J590J498n814L171N27n70M665
657C051l651J517R18k746M320k009k96L502l893N03k98j189K809r22j140j683
673a207j947Q40Q32J308j621n44m44j006L438K54n21K316l430L735m21j421M776
690D937k897n03K172m544L290O14k187J495m631J206N82r84J705j961j181p0j71
$$ plain form
578 -3862 -1833 2160 -4515 -2914 -167 -3676 4999 1631 -1736 6585 -864 2348 4289 -1726 7060
593 7060 3190 -1609 2687 -4607 291 3850 -1474 864 -3816 -4241 435 -605 560 -1503 -2663
608 -2663 -1337 -888 1026 -620 1032 1319 -286 2153 -1709 922 3829 -458 2371 -3585 -3157 3769
624 3769 -1430 2095 195 -5451 1264 -636 23 3072 -2421 513 1278 -475 2383 125 1774 1201
640 1201 -137 -762 -890 802 232 173 -1079 -4301 -567 -2016 -426 1072 -4742 -1571 -1044 -1614 3051
657 3051 -600 917 1835 -911 3409 1400 1104 4606 713 1216 918 -271 2538 1616 476 -1207
673 -1207 -3154 -2314 -1482 -174 -1795 -2339 -2783 -3789 -351 -97 -618 1698 -1732 2003 1582 161 4937
690 4937 2040 1537 3709 -835 2455 3069 882 2377 -2254 -1048 -466 -1450 255 -1706 -2887 -2957 -3128
707c128J312R63M6j102Q45O03n01K729K07p69J292k423J030J315p45K044l179
724E39r09J199k201K510m62j863P00k443J055O42L0J309j557L67n52Q4K301l45
742D04M05k19r61J565o69J967m15k046M76n20L20J628k195J283j459r34J266j147
760a251J900j98j765J086j220O71J176m33L58m04l69M65m55J459n48k86L31q35
778c18L71L64n1M04k140J723j133L98J444p32L57m49j006J642R5m48N23q37K05
797D12l39J54M45j214J36l11q28R32j04j87J2p45M20p38K379l57l53R55n88n24
817d43J091M49O97q37k87O34q07J001o39m24N30j501j37q9j99Q25j008l85n70
836b099O77J154j97J86k71m99P67J082n70P62K01m80J18P30M43o84j67p84k00
$$ plain form
707 -3128 -1816 -853 -807 -1909 -1064 -461 -962 1767 1974 1205 2497 74 1104 2419 1674 3718 539
724 539 -370 829 -1372 1138 676 -1187 -487 -2930 -1875 -1233 -1203 106 -1451 -1084 -1636 -1552 749 404
742 404 809 590 -371 1194 525 2492 2077 31 507 -13 307 1935 -260 1023 -436 -1370 -104 -1251
760 -1251 649 451 -1314 -228 -1448 -777 399 -34 324 -80 -449 16 -439 1020 472 186 517 -318
778 -318 53 417 366 770 -1370 353 -780 -382 1062 330 687 238 -768 874 969 521 1044 207 412
797 412 73 227 672 -542 -406 -717 -1545 -613 -717 -904 -892 -1637 -1217 -1955 424 67 -286 669 81 -443
817 -443 648 1097 1794 957 670 1304 497 1498 859 435 965 -536 -673 -762 -961 -136 -1144 -1529 -2099
836 -2099 -1422 -268 -465 -279 -550 -1049 -282 800 230 992 1193 713 831 1561 2004 1320 1153 369 169
855A69l5K78l91k63o72k90j252R80K66R14K4p85m57N90J05J242M5K97r09N56P00
876A112j48M47k59k14o01J7l04J75m32J01p15l59P73l62n0L43l89k62L87o8L68
897d40J056J5p16M04M98m55K52L10q94K49K71j5l00M94p27n52O31k91Q33o95k29
918c01l3n61R02n9n71Q46K63j538J456J89n95J503j548k74P73p20Q03o0j31o50
938c06n47Q6N75L00l53J75k87K54K22m39O64N94p85l2m33L43J309l87p40k26j61
959a74k81N98l67J25k06n43O46r42Q69k5p63M14O05p41J140K45QO31q95j03O41
980H82o79Q35l71j07j56m71j50J95j68o34M65k35j9R2k39J09Pk12N34J61j07J263
1002I95j122P41Kr40Q81R9m32L17q29M5J179j445K24N32j017N58r5n65J000p51
$$ plain form
855 169 134 412 21 -242 -914 -1204 -2456 -1476 -1210 -296 -272 -1057 -1514 -924 -819 423 468 765 -144 412 1112
876 1112 964 1411 1152 938 337 354 50 225 -207 -106 -821 -1180 -407 -769 -819 -476 -865 -1127 -740 -808 -440
897 -440 616 631 -85 319 817 362 614 924 30 279 550 535 235 729 2 -550 81 -210 623 -72 -301
918 -301 -334 -895 7 -52 -623 223 486 -1052 404 593 -2 1501 -47 -321 452 -268 535 475 344 -306
938 -306 -853 -767 -192 108 -245 -70 -357 -103 119 -320 344 938 153 121 -312 31 1340 953 213 -13 -174
959 -174 -455 143 -224 -99 -305 -848 -202 -1144 -275 -300 -1063 -649 -44 -785 355 600 608 1239 344 241 882
980 882 203 1038 667 560 404 -67 -217 -22 -190 -824 -359 -594 -613 -521 -760 -651 -644 -856 -322 -161 -268 995
1002 995 -127 614 616 -324 557 656 224 541 -288 -243 936 -509 -285 247 -770 -212 -307 -872 128 -623
1022f23l36J63j15M71J134n93K23k30p48J943q36OL71q20J23N65o73Q76r00j05
1042a04N22o20J43J32n70N20l38k4l87M89M36J48o41J65J9P06o67N53p66k87Q87
1063C16k35P68p85m40R85k62p34R77j053R65p25j09K63k69M8J255o58n24J01j02
1083b18Q49m3r91P37p37Q7Q12q5q02K40K06j26l95K62R14n96j91m01L01o55J438
1104F06p06K85l32l68O95r3l53R36k52p74P37o10K54J24o30N18m48l75Q61l22
1124b47J66k4m42j38O68k42J8j14J10Q63n1k23M99n94l34K62J60k57O94j135N92
1145B31m5r86Q08n60j46P5K12K65j58m94O97J54M62o80L99o19O47J6l89J114j154
1166a51N66L28n14j20J2o3L11r35N60k07j26O89q46j37P89p33j28R51m56k13p8
$$ plain form
1022 -623 -959 -796 -911 -440 694 101 324 94 -654 1289 453 459 830 10 133 698 25 901 1 -104
1042 -104 418 -202 -59 73 -497 23 -315 -339 -726 -237 199 347 -294 -129 -110 596 -71 482 -284 -571 316
1063 316 81 849 64 -376 609 347 -387 590 -463 502 -223 -332 -69 -338 -290 965 307 -217 -116 -218
1083 -218 631 588 -403 334 -403 -316 496 411 -391 -151 55 -71 -466 -204 710 114 -77 -478 -177 -832 606
1104 606 -100 185 -147 -515 180 87 -266 670 418 -356 381 -229 25 149 -481 37 -411 -786 75 -247
1124 -247 -81 -105 -547 -685 -17 -259 -241 -355 -245 618 567 344 843 249 -85 177 337 80 774 -361 231
1145 231 186 -800 8 -552 -698 -623 -411 -146 -304 -798 -101 53 515 -165 234 -385 262 278 -111 1003 -151
1166 -151 415 743 229 109 121 58 369 -566 -6 -213 -339 350 -496 -633 156 -577 -705 246 -210 -423 -501
1187e01N73R87j606J198j72m74Q4l12K58l5K25m46O34m58J22n34O11o25qj17J45
1208d51R9L7k3j45N66r5k80Q10k69M70o29K88j8l45P15k98n00J07l81M10p3k56
1230b61L05m53l60J078m5o57P62m91j78K90Q3J60m58M43N4J59l75j76j05M48p55
1251e32N82L31l71n10K59R9l23L50M67k63j29l20N8m28K56J568j568P45j82L07
1271C96p1l1j15n41L49n05P25K60n70k89m2L3r4K0Q39p90P33j23m37k87Q73k80
1293E3k77R96k38k33j39k91j78L4K22M60l95k00N75j37n63J37n52M80L33l65J0
1314b68J67k66J60L5N3J10l49M69l24Q7J63O87o60k92j22J15j53K56r5N31j61
1335A43p69N4K52r3O50p96M4o85J405o10M34j10j67K44J08l9k97N42o46M76l39
$$ plain form
1187 -501 72 1059 -547 651 479 5 89 -223 35 0 225 -221 413 -45 77 -457 154 -471 -479 -596 -451
1208 -451 -352 -315 -338 -483 83 -12 -292 518 249 719 90 378 360 15 730 432 -68 39 -342 68 -5 -261
1230 -261 44 -409 -769 309 264 -393 369 -122 -300 -10 73 233 -225 218 272 431 56 -120 -225 223 -532
1251 -532 50 381 10 -500 -241 -142 -465 -115 352 89 -40 -360 -302 -730 -474 1094 -474 271 89 396
1271 396 325 294 179 -362 -13 -518 207 467 -103 -392 -434 -401 -495 -475 364 -426 307 184 -253 -540 333 53
1293 53 -224 772 534 301 162 -129 -307 -273 -51 409 14 -186 389 252 -311 -174 -726 -246 87 -278 -268
1314 -268 -101 -367 -207 -172 -119 -9 -358 111 -213 -126 37 724 64 -228 -350 -235 -388 -132 -227 304 143
1335 143 -626 -572 -320 -413 237 -559 -515 -1200 205 -405 29 -81 -248 -4 104 65 -232 310 -336 140 -199
1356a99M40j27L57n40l66K80M53J30l75J38j49l65j77N15N2k03J16M54n21M82
1376C95l04l32L69p1m26R15p6l93k93J65N72n23l21L77j8M56o83L78Q7%m97L92
1398A69m2k8k31N2K01J21R7j0m2m14l0K0K70K75j16l0q7K59o00L05L71n00J30
1421A40l30K32k79Q13m73m07N51J48k53J42K28p62R2P98n40n59K70q7O4P24n09
1442CK40k89J02P6L30o71M43k73m28Q18l65j37O44o24L23J3o23N64j20j25K61
1463A62j66K28m75j05N85o81L51J69J20k03l01J24K18J00j73p9J005q23j88J88
1483E6J16K94n11N8m81K58Q37o64l3L76n87N48q2m70L30o9N16k17j11j8p87J010
1505C69o90O81o68N5P73o12J83k69J08j3k37J007j321P12J0q4L44o27K83N05j14
$$ plain form
1356 -199 241 114 471 -69 -435 -155 298 428 53 191 42 -323 -500 15 67 -136 -20 434 -87 395
1376 395 91 -241 128 57 -369 546 470 77 -216 -51 521 -2 -323 54 36 492 -191 187 274 274 -223 169
1398 169 127 99 -132 -80 121 242 339 329 287 -127 -157 -137 133 408 292 262 175 434 -166 139 510 10 140
1421 140 -190 42 -237 576 103 -304 247 395 142 284 512 -250 -158 640 100 -459 -189 -276 -212 512 3
1442 3 243 -46 56 132 462 -209 234 -39 -467 351 -14 -151 493 -131 192 205 -418 146 26 -99 162
1463 162 -4 224 -251 -356 229 -452 -101 68 188 -15 -316 -192 26 126 -47 -126 879 56 -132 56
1483 56 172 466 -45 13 -468 -210 627 -37 -70 306 -281 267 185 -285 45 -24 492 275 164 146 -641 369
1505 369 -321 360 -308 -253 520 -92 91 -178 -70 -83 -320 687 -634 78 88 4 348 -279 4 509 395
1526C95p29N33m2q13L76O08n57J11K04m2l5qN7l28K03P0O1j80K45l45N6J8O23
1549D81l02J05m04J91L18n02l2m82M13O7p9N41l56k57j29L94K19O3n61N83o20
1570c49J92Q53q72N20n31O0l50P88m29L64l95l02K00O72K34Q0q80l3P8J76K52
1591C28J98l52j72J78n80M12l76L06J32p4l97q6K50k22O26N2K07l26J55n43L76
1612I2J13M55r8m35j20L67m35Q84q93J93m2K39j2J06k28K72p00L0k17L17K14j57
1634e5o4M93n63J29l42N48j19R3RK77n6p24L67l73R09o54J85l82j0O20rQ5l10
1657E4k21K56j198J271k56O1k88j14K26O42r8k33o9J02l92R17k52r4l61M78o56
1678b25L04k89l73R32o15M02K1l65M72o66M40J33k96O69l51L54l90k85L21j96
$$ plain form
1526 395 -334 199 157 -656 -280 328 -229 -118 86 44 9 1 58 -270 -67 3 64 -116 129 -216 -160 -142 481
1549 481 179 284 -120 71 389 -113 -145 -627 -214 -147 -226 315 -41 -298 -427 -33 186 249 -312 271 -349
1570 -349 -157 696 -176 344 -187 -127 -477 311 -118 246 -149 -451 -251 421 655 735 -145 -178 -100 76 328
1591 328 526 174 2 180 -400 12 -364 -58 74 0 -397 -483 -233 -455 171 223 430 104 259 -284 92
1612 92 205 660 562 127 7 374 -61 823 -70 123 81 320 308 414 186 458 -242 -212 -429 -112 102 -55
1634 -55 -119 374 -189 -60 -402 146 27 120 129 406 350 -374 -7 -380 529 -125 60 -322 -332 288 279 364 54
1657 54 -167 89 -1109 162 -94 -33 -321 -435 -209 433 335 102 33 135 -257 660 408 314 -47 431 -225
1678 -225 79 -210 -583 349 -266 136 157 -208 264 -402 38 171 -125 544 193 547 157 -128 193 -3
1698cO04k63l46L63o37J63K47J65l28j19L97jk92J48J60j27R7j59p2o3j28J86
1720hm5M8l42L56r5Q6k39L90K30l00J1N9n24O64m37K20l91O62K48k55j01k10K12
1743B39l16N0k7L28n72L31LJ44l31K39J55O0k33o6l5J59K48m11n57P23j240J059
1765e0J35PJ20P5m32M88o10L17k95J57j76K81M65m23m10N26N99k92r10Q0J82M94
1787C28J60l38L70K81q34j92L18R7nn28M37J37o01N80M77p55M48l03K51p30R69
1808E67p15m17M92q28J183l49k73N91o54N81L01o44n53P96m1n4O07m65k91K25
1828E9m08J97L5l77P38L98o84j53j68L75k16J74j54M71n15l18P06j46l89L26M40
1849C91K27p81M01l34O9L60o90L09j68N2N5J22p2J30n75K81K11O4k44R59j320
$$ plain form
1698 -3 601 338 -8 355 -282 -119 128 293 -35 -154 243 242 -50 98 258 131 228 69 -3 -66 -194 -8
1720 -8 -53 -5 -347 9 -86 0 -239 151 381 81 92 151 -373 291 -146 74 -317 345 593 338 237 27 239
1743 239 -77 -27 -54 274 -298 33 36 180 -151 88 243 303 70 4 -31 128 376 -35 -592 131 -1109 -50
1765 -50 85 92 212 287 -145 343 -267 50 -245 -88 -264 17 482 59 -351 175 774 482 -428 -348 -166 328
1787 328 488 150 520 801 -33 -225 93 190 185 -343 94 231 -370 210 687 -68 380 77 328 -402 567
1808 567 -148 -565 -73 -901 282 -67 -340 251 -403 178 479 -165 -718 78 37 -17 590 125 -166 59
1828 59 -349 -152 -117 -494 244 642 -42 -195 -363 12 -204 -30 -184 287 -228 -546 160 14 -375 -49 391
1849 391 618 -163 238 -96 -27 333 -357 -48 -216 -164 -109 13 -59 71 -504 -223 -12 52 -192 767 -553
1870e53L43q0O03n3l90K76m3o37L62L25M1M37p63j36M98q1n80N98l44K62p77J082
1892C90j54n65n8K78j84M2K18k55P42N5o53R29r97j65J80K34l39K70J64j36P3
1913F9j69L41l29Q9o36Q22k41M45j09R3j70k68p4l5P8R9l51R4J23L13k33o66O84
1936c1L14j003K21N13J27J06m03n16J336o63Q5p7l03P39J27k87m65j31O26m69
1956a54j06j26M97k05j10N28j90J44k79j43j19R44l31J67m05j35n95N02q60J279
1976C03q54j2L43M13j75l18N96m57J98p6k17K58L22m10L34L6k83J3l30L97k66
1997a85J32L13n12J00k55L75P49r18r7L20M38o11R55j177P95l56r2O55j093O77
2017B13j06N9j61K53O9n88J73L3o57P25k42L93p78j59J217p24O91n06L57m16l19
$$ plain form
1870 -553 -210 -290 313 260 -130 146 103 -534 -172 153 194 631 -132 -268 230 149 -431 167 -177 85 -692 390
1892 390 236 -329 -387 -109 -293 -251 -33 -288 454 509 -144 785 -212 -377 -197 37 -302 -32 132 -4 69
1913 69 -100 241 -88 1 -635 187 -54 391 282 375 205 -63 -137 -172 -94 5 -346 -252 -129 184 -49 -715 -31
1936 -31 283 -720 -499 14 141 247 -156 -672 664 1 86 9 -294 445 572 285 -180 -311 315 -154
1956 -154 -260 -386 111 -94 -204 324 134 278 -1 -144 -263 681 350 517 112 -23 -618 -116 -976 303
1976 303 -551 -563 -220 193 18 -300 296 -161 37 -39 -256 2 324 -86 248 284 1 14 -316 81 -185
1997 -185 -53 260 -252 -152 -407 -32 717 -201 -298 22 460 -151 804 -373 422 66 -26 629 -464 213
2017 213 107 166 5 258 327 -261 -88 -55 -712 13 -229 164 -614 -773 444 -280 411 -95 262 -154 -473
2038d73Q76J73k43l50J35m13M47q90N47j40K54K5K97j71m14J33J02j13Q2p99J061
2059A26P7r2l37K57jn56N42l10L56M24m40L79k49n07L93J53j59k25M7J06K74p19
2081d61P78o55M11k59k51L80j40k5M04n84M24k57M9R07l87j95o29Q63o40M53q
2102A78l66n0Q53k85l52m63K94Q5L62p2l11L40l01K2K94j97L1J79m36O78q71J76
2124b12J81K52m14J34J67n35J50M09l2o5L24j81j72r5M75M5r60M55n40M85J31
2145Bl70l94O12N36m88M60o19K39m5m21O98R4J78k40l23j56m9J134l02r26Q9Q86
2167E95n93j27j92Q97q00L2O39n8k00j91K37n65j70R87k92J98l61j4K28m46J90
2188fJ36M18p83K85k14J78j28j65L75k3K3j36L04l36j82J76l89M85K76m53j39
$$ plain form
2038 -473 403 576 333 -17 118 -295 152 -738 -191 -331 -77 -52 245 74 -340 -207 -105 -218 -136 -935 126
2059 126 203 111 -226 31 30 -526 16 -294 62 486 46 425 176 -331 62 215 56 -169 -122 -16 258 -461
2081 -461 317 -338 73 -186 -437 -57 -197 -222 182 -402 22 -235 -186 721 334 139 -490 373 -267 186 178
2102 178 -188 -238 615 330 -22 -485 -191 -106 256 184 -127 213 -88 -66 228 31 62 241 -195 483 -388 -212
2124 -212 -31 221 -193 -59 108 -427 -277 132 100 35 359 178 6 -89 386 431 -529 -74 -614 -129 2
2145 2 -368 -762 -150 386 -102 358 -261 -22 -67 -488 210 304 482 242 -81 -237 -286 848 546 -380 -291 595
2167 595 2 -125 -317 580 -220 -188 451 393 193 2 239 -326 -496 491 199 397 36 22 250 -196 -6
2188 -6 130 548 -235 50 -164 14 -114 -279 96 73 96 -40 264 -72 -254 -78 -467 18 294 -159 -298
2209b98K02K14k8m10l24N68L64k45o9J8k95L22m0p15R07L68m72L89j93p7l39M50
2231B97m04M39p9K15p17k45L82k0L68l42m31M54L64j76lp00O81J24M01o14k73
2252b79j31N92j50J17k39j24k30L83M51m09p03O84l65O42k82K33k48p30R55l23
2272a56N8K01K89m44J45p22M34M18l82N76k17j09l68OP42n55r7P34m14q5J67k75
2294e4P64m18j31o01L02L84n57K27L55o21m77M70N2J74L41L94q30J83N06k68l26
2315a31N19j9q9m23K98k68J56o0J88J01n38K70l08K73q71J97N79R63r70O53m98
2336B2M51q29K83O04l87l75RK13j10O38K84r36j70l40O06k79P0K17O7M69n29R8
2358G6J00m88N62Rn3n89P6N86j96K28l61M63n7J83r99L15J86K66J20q47L75m54
$$ plain form
2209 -298 -96 118 90 -320 -644 -76 288 43 -26 -8 -303 19 -21 -736 171 539 67 456 263 186 -153 297
2231 297 -107 332 253 468 -249 -494 -112 -132 236 -106 -537 -83 281 105 102 -598 83 207 608 -6 -279
2252 -279 -410 182 32 149 -90 -214 -444 -61 390 -19 -722 -38 -403 239 -43 190 -58 -788 167 -156
2272 -156 -98 103 392 -52 93 -629 -195 223 -159 417 200 91 -277 -271 471 -84 -181 553 139 54 221 -54
2294 -54 710 292 161 -440 -138 246 -311 -84 271 -350 -827 -357 -305 -131 210 604 -226 -43 463 195 -131
2315 -131 388 369 280 -143 155 -113 43 -17 171 272 -266 4 -304 -31 -902 -705 -126 837 -133 520 22
2336 22 473 -356 -73 531 144 -231 -222 -9 -119 519 803 -133 -303 -643 -37 -316 -246 -29 38 507 -22 76
2358 76 176 -312 250 259 206 -383 -307 279 83 311 -50 413 356 539 -460 -145 41 307 427 -420 -45 -499
2380d99Q22m81j69j03Q77o68N40n52L99m61K07Q72r52L0M67p9K75o12L4k95R51
2401F03p33L06o00K81P7N23o8l25k4k78k06P9Q71J47j67q31Q50k79M80j180L32
2422a42O50m71j50j55M94n70L39M22l51r9L05M3o96N57Q6q3j012O42J51l38N74
2443A96o92O21j93J79L03k9r31P53J36m70j21K98m2K35P8n1K30l18m84K31JN70
2465E00o23l67N78o06L89m34N32L57o9l93K4L62k96n74J14Q75n74K46o7j45O02
2486D31j27k21o3j92p47P79N41j7l78J51j09k81K5l05M92m5K84O9j13l19m3L12
2508A24k63J22Q2l10M13J12o91N38m35k84P53J09m86j97L83l08K03l03R41o51
2528a48L13r9O3n2J47J11k64k24K25L39n43j80O43p97O15k18k27N30M07n6r72
$$ plain form
2380 -499 323 -158 -327 -430 447 -221 319 -233 166 -295 -88 784 -168 -138 329 250 525 -87 -53 -348 603
2401 603 -130 176 -424 -143 -66 457 389 64 40 -238 -444 -365 506 653 486 -345 505 226 706 -474 -142
2422 -142 508 37 -113 -268 226 -344 -5 417 66 -33 272 315 -381 176 262 179 -833 -191 -40 -378 196
2443 196 -496 125 -68 111 414 385 -546 207 343 -127 -248 50 8 243 321 270 500 182 -302 -71 -70 500
2465 500 -123 -490 88 -518 -129 -563 -31 326 257 -136 -112 250 -46 -620 -506 369 -205 41 -26 -171 431
2486 431 304 83 20 -172 -919 -140 401 384 6 157 48 -233 -208 -513 -21 -66 218 287 174 -145 -188 124
2508 124 -139 -17 65 -245 168 280 -411 127 -308 -592 161 270 -216 -413 -30 -338 -135 -438 503 -148
2528 -148 165 66 129 77 224 335 71 -153 72 411 -132 -312 331 -466 149 -69 -296 234 641 585 -387
2549c87O26n6r6L02j51j85r8O7K3J48M95n13j15q53R15k10l57L52K88p0j5j45
2571c5L32R9k32J73J52j32l17l60J89R6m82N60K0P9O7l1K86p00N1K15J87j1K54
2594D60o27K22l27K48m46Q73P8k78J92m43m1N09q72l72J045l19L17n40N75j20
2614A34J00j0m21k2L69J39k43l6L01r62N68rM2J16M03n21k02J12j43J160p79m6
2636E0O58l24m29j01r1K16L07l20j97M11l92J3j15M1M5J36k34o4M29l81k16J2
2658e46K33L10p8k54P87m67k55N61k00J28K02p17N56m92m11Q19p2k6n13M85J04
2679A54l59M81p1L6r35J125n31M4k52K47K45L32p78K87l48O35J3n7n49P57o15
2700a39O87m32l18Q68j040N68n30P53m92N32J0p05K16J37n62J56M24p4j77L04
$$ plain form
2549 -387 239 183 87 389 238 53 -45 22 45 193 688 175 60 -793 122 -88 -445 -93 195 125 110 -35
2571 -35 297 396 164 337 489 357 40 -320 -131 -35 -517 43 63 142 209 178 464 -236 -185 30 217 206 460
2594 460 -167 55 -272 -24 -470 403 481 203 395 -48 -89 420 -452 -824 221 -98 219 -321 254 134
2614 134 234 224 -197 -219 150 289 46 10 311 -651 -83 -92 -50 66 469 -52 -254 -142 -285 875 96 50
2636 50 708 384 -45 -146 -237 -21 286 -34 -231 180 -212 -199 -314 -273 -228 -92 -326 -390 39 -342 -558 -546
2658 -546 -313 -3 -81 -335 452 -15 -270 291 91 219 421 -296 260 -232 -643 176 104 78 -435 50 154
2679 154 -205 276 205 241 -694 431 -100 -56 -308 -61 184 516 -262 25 -323 312 325 268 -281 476 -139
2700 -139 548 116 -202 666 -374 194 -336 417 -75 457 467 -238 -22 115 -447 -291 133 59 -118 186
2720A86Q7k20J15l73N0j75p9N11n08L16K98m99O96J3k32L28l50k80k7M10m50L33
2742A50K80r46O21p8m22K13J011o60K42n18k14L1K18j88M48L2l11j9J12l73L45
2763b6o6L52n29j88P86j86m92N76k20J25J53j65n0m45L45l10L21l2N64q14N5L53
2785A07K60J97o97P6J06J1K3k30O1L09l12l5k28P50n48rJ20K60k12n62P41k22
2807c4o3p40J126n46K22K68m58K48n34O54k97J3M21n84N15k21j88N84o55K41P8
2828E0m3K83J8l23J98m87N42m49L72K52o39k28K16N29j31m80N01m64L12n0K32
2849B11J9j20r0k29M39p87O59o84P07K91O1q2j48k69m89qJ97J57l19O70q02O49
2871C3j08J19P5j48N3k57O63N60j342O74r2L2l24J78j5l31N43k24k89N80l47r9
$$ plain form
2720 186 273 53 168 -205 -155 -330 -409 102 -406 -90 208 -291 405 418 186 514 164 -116 -143 267 -183 150
2742 150 430 -516 105 27 -395 -182 829 169 411 -107 -321 -290 -72 -260 188 220 -91 -110 2 -371 -26
2763 -26 -92 260 -269 -457 329 143 -349 227 7 132 285 120 70 -375 -30 -340 -19 -51 513 -301 -246 107
2785 107 367 564 -133 -57 49 60 83 -147 -86 223 -89 -124 -352 398 -150 -159 -39 221 9 -553 188 -34
2807 -34 -97 -837 289 -257 -35 233 -225 23 -511 143 -154 -141 280 -304 211 -10 -198 386 -269 -28 50
2828 50 7 290 308 -15 183 -304 238 -211 161 413 -226 -454 -238 291 160 -320 181 -283 29 -21 211
2849 211 230 110 20 -209 230 -557 102 -582 125 416 477 395 247 -22 -511 -519 -322 -165 -484 186 -616 33
2871 33 -75 44 119 -29 24 -233 430 990 -352 322 230 262 -62 116 101 -230 313 89 -200 380 33 -66
2893f6J26k1o2j87J78k68m3J8K20M65p2p92J58j25M11j50J40K20l77N23l52K56
2915B00L95j305O72R05j279l09R24l02k73K8R82n15P3Q6k58Nm64P09J20o52J34
2936a24K55j9j16p09J98N92n69N34O08l58L07q51L67l00J6L05J2K15l96M39n82
2957a76J90J37Ql4k99M65m06L78n3k58Q9J70J98j87p06M74R4n5l9j18j1N65n33
2980a07m7l00M36k98M66J41o30N85j42J41n46O08o53M03m27M71L06k06m06N05
3000C00j31K6J58j02j22J32m08Kk6m08J175j001M83p85M10P3M50j86k52o6J29
3021a49R1K61k13Q3M38n95l81K43M07L65l68k96K04J39J30l1N14r02M12m08O2
3042Fk43J33ON14l68j16k69M77M20o32j01K75k92J65K1M7J70j47O56j050L44k80
$$ plain form
2893 -66 60 39 -23 -210 -32 -300 -343 -325 -105 360 288 -504 -346 -471 -60 -210 -70 150 -227 296 -56 200
2915 200 595 -710 -38 867 -412 -721 203 -99 -372 -344 638 123 196 282 24 29 -435 274 394 -258 -124
2936 -124 131 112 -4 -713 -515 77 -492 42 650 292 599 -252 115 -185 -169 136 148 363 -33 406 -176
2957 -176 14 151 159 125 -174 291 -115 263 210 -48 41 211 409 222 -484 -10 84 29 -10 -128 -139 426 -107
2980 -107 -154 -454 -18 -316 150 291 -339 246 104 245 -301 307 -346 57 -370 101 407 201 -205 300
3000 300 169 195 353 251 129 261 -147 -145 -171 -579 596 -405 78 -707 -297 -224 226 40 -212 -278 -149
3021 -149 -58 203 -10 73 511 -84 -465 -222 185 550 182 -114 90 229 359 328 842 -60 352 -56 6
3042 6 -237 -104 -98 416 48 -68 -337 140 560 -72 -173 102 -190 -25 -4 43 213 66 722 -328 16 -264
3064b64N26j95m75Q91j72o00j25O12l62J94K7j24k7J88R4J2n09K84M33j59r5J47
3086C01K22j48n40M95o01m24J424j301N19M09n42j06k58J75Q19m28q07O90L87
3105B86L19j74m07L39J05m49m21K3O54M07j013L74o0p2L1M99n94M59k94K32j60
$$ plain form
3064 -264 262 67 -408 483 311 -289 -414 198 -164 30 57 -67 -94 94 188 200 -309 -25 408 249 154 301
3086 301 523 375 -165 330 -271 -695 729 -572 -53 356 -186 -292 -550 -375 444 16 -791 -101 286
3105 286 605 431 24 363 468 19 -402 -379 275 682 -331 43 -17 -89 -58 441 -153 306 12 244 84
$$ [...]
8191D20
##END NTUPLES=NMR FID
##END=
