##TITLE=1H_SR167R3TFA
 CDCl3
 64 sc, 
 20.4.2023
##JCAMPDX= 6.0         $$ Bruker NMR JCAMP-DX V2.0
##DATA TYPE= NMR FID
##DATA CLASS= NTUPLES
##ORIGIN= UXNMR, Bruker Analytische Messtechnik GmbH
##OWNER= root
$$ XWIN-NMR		Version 3.5
$$ Thu Apr 20 14:17:18 2023 Russian Standard Time (UT+4h)  she@DPX200
##.OBSERVE FREQUENCY= 200.1316
##.OBSERVE NUCLEUS= ^1H
##.DELAY= (6, 6)
##.ACQUISITION MODE= SIMULTANEOUS
##.ACQUISITION SCHEME= undefined
##.AVERAGES= 64
##.DIGITISER RES= 18
##SPECTROMETER/DATA SYSTEM= spect
##.PULSE SEQUENCE= zg30
##.SOLVENT NAME= CDCl3
##.SHIFT REFERENCE= (INTERNAL, CDCl3, 0, 15.7039)
##AUDIT TRAIL= $$ (NUMBER, WHEN, WHO, WHERE, WHAT)
$$ ##TITLE= Audit trail, XWIN-NMR		Version 3.5
$$ ##JCAMPDX= 5.01
$$ ##ORIGIN= Bruker BioSpin GmbH
$$ ##OWNER= she
$$ F:/spectra/data/she/nmr/H-F/1/audita.txt
$$ ##AUDIT TRAIL=  $$ (NUMBER, WHEN, WHO, WHERE, WHAT)
(   1,<2023-04-20 14:14:18.26 +0400>,<she>,<DPX200>,
      <continue with go, POWCHK disabled, PULCHK disabled
       configuration hash MD5:
       00 E9 B6 7A A2 85 ED C7 34 08 36 98 17 FE 4E 26
       data hash MD5: 16K
       0F 7A 0B C1 5E A9 8B 2F 07 85 1D BE 36 81 9C 60>)
$$ ##END=
$$ 
$$ hash MD5
$$ 31 96 79 38 C3 D4 81 52 A5 F0 0D BB 37 08 2F 69
##$RELAX= 
##$RELAX= 
##$RELAX= 
##$RELAX= 
##$RELAX= 
##$RELAX= 
$$ Bruker specific parameters
$$ --------------------------
##$DU= <F:/spectra>
##$EXPNO= 1
##$NAME= <H-F>
##$PROCNO= 1
##$TYPE= <nmr>
##$USER= <she>
##$AMP= (0..31)
100 100 100 100 100 100 100 100 100 100 100 100 100 100 100 100 100 100 
100 100 100 100 100 100 100 100 100 100 100 100 100 100 
##$AQSEQ= 0
##$AQ_mod= 1
##$AUNM= <au_zg>
##$AUTOPOS= <>
##$BF1= 200.13
##$BF2= 200.13
##$BF3= 200.13
##$BF4= 200.13
##$BF5= 200.13
##$BF6= 200.13
##$BF7= 200.13
##$BF8= 200.13
##$BYTORDA= 1
##$CFDGTYP= 0
##$CFRGTYP= 5
##$CHEMSTR= <none>
##$CNST= (0..31)
1 1 145 1 1 1 1 1 1 1 1 1 1 1 1 1 1 1 1 1 1 1 1 1 1 1 1 1 1 1 1 1 
##$CPDPRG= <>
##$CPDPRG1= <>
##$CPDPRG2= <>
##$CPDPRG3= <>
##$CPDPRG4= <mlev>
##$CPDPRG5= <mlev>
##$CPDPRG6= <mlev>
##$CPDPRG7= <mlev>
##$CPDPRG8= <mlev>
##$CPDPRGB= <>
##$CPDPRGT= <>
##$D= (0..31)
0 1.2 0 0 0 0 0 0 0 0.06 0 0.03 0 0 0 0 0.0002 0 0 0 0 0 0 0 0 0 0 0 0 
0 0 0 
##$DATE= 1681985407
##$DBL= (0..7)
120 120 120 120 120 120 120 120 
##$DBP= (0..7)
150 150 150 150 150 150 150 150 
##$DBP07= 0
##$DBPNAM0= <>
##$DBPNAM1= <>
##$DBPNAM2= <>
##$DBPNAM3= <>
##$DBPNAM4= <>
##$DBPNAM5= <>
##$DBPNAM6= <>
##$DBPNAM7= <>
##$DBPOAL= (0..7)
0.5 0.5 0.5 0.5 0.5 0.5 0.5 0.5 
##$DBPOFFS= (0..7)
0 0 0 0 0 0 0 0 
##$DE= 6
##$DECBNUC= <off>
##$DECIM= 32
##$DECNUC= <off>
##$DECSTAT= 4
##$DIGMOD= 1
##$DIGTYP= 9
##$DL= (0..7)
0 120 120 120 120 120 120 120 
##$DP= (0..7)
150 150 150 150 150 150 150 150 
##$DP07= 0
##$DPNAME0= <>
##$DPNAME1= <>
##$DPNAME2= <>
##$DPNAME3= <>
##$DPNAME4= <>
##$DPNAME5= <>
##$DPNAME6= <>
##$DPNAME7= <>
##$DPOAL= (0..7)
0.5 0.5 0.5 0.5 0.5 0.5 0.5 0.5 
##$DPOFFS= (0..7)
0 0 0 0 0 0 0 0 
##$DQDMODE= 0
##$DR= 18
##$DS= 0
##$DSLIST= <SSSSSSSSSSSSSSS>
$$ [...]
##$SUBNAM2= <"">
##$SUBNAM3= <"">
##$SUBNAM4= <"">
##$SUBNAM5= <"">
##$SUBNAM6= <"">
##$SUBNAM7= <"">
##$SUBNAM8= <"">
##$SUBNAM9= <"">
##$SW= 18.0517057926174
##$SWIBOX= (0..15)
0 0 2 0 0 0 0 0 0 0 0 0 0 0 0 0 
##$SW_h= 3612.71676300578
##$TD= 16384
##$TD0= 1
##$TE= 0
##$TE2= 300
##$TE3= 300
##$TEG= 300
##$TL= (0..7)
0 120 120 120 120 120 120 120 
##$TP= (0..7)
150 150 150 150 150 150 150 150 
##$TP07= 0
##$TPNAME0= <>
##$TPNAME1= <>
##$TPNAME2= <>
##$TPNAME3= <>
##$TPNAME4= <>
##$TPNAME5= <>
##$TPNAME6= <>
##$TPNAME7= <>
##$TPOAL= (0..7)
0.5 0.5 0.5 0.5 0.5 0.5 0.5 0.5 
##$TPOFFS= (0..7)
0 0 0 0 0 0 0 0 
##$TUNHIN= 0
##$TUNHOUT= 0
##$TUNXOUT= 0
##$USERA1= <user>
##$USERA2= <user>
##$USERA3= <user>
##$USERA4= <user>
##$USERA5= <user>
##$V9= 5
##$VALIST= <valist>
##$VCLIST= <CCCCCCCCCCCCCCC>
##$VD= 0
##$VDLIST= <DDDDDDDDDDDDDDD>
##$VPLIST= <PPPPPPPPPPPPPPP>
##$VTLIST= <TTTTTTTTTTTTTTT>
##$WBST= 1024
##$WBSW= 4
##$XGAIN= (0..3)
0 0 0 0 
##$XL= 0
##$YL= 0
##$YMAX_a= 1439671
##$YMIN_a= -1641047
##$ZGOPTNS= <>
##$ZL1= 120
##$ZL2= 120
##$ZL3= 120
##$ZL4= 120
##$ABSF1= 10
##$ABSF2= 0
##$ABSG= 5
##$ABSL= 3
##$ALPHA= 0
##$AQORDER= 0
##$ASSFAC= 0
##$ASSFACI= 0
##$ASSFACX= 0
##$ASSWID= 0
##$AUNMP= <proc_1d>
##$AZFE= 0.1
##$AZFW= 0.1
##$BCFW= 1
##$BC_mod= 2
##$BYTORDP= 1
##$COROFFS= 0
##$CY= 11.3945322036743
##$DATMOD= 1
##$DC= 2
##$DFILT= <>
##$DTYPP= 0
##$F1P= 15.7292609196834
##$F2P= 12.9074282941183
##$FCOR= 0.5
##$FTSIZE= 0
##$FT_mod= 4
##$GAMMA= 1
##$GB= 0.15
##$INTBC= 1
##$INTSCL= 1
##$ISEN= 128
##$LB= 0.24
##$LEV0= 0
##$LPBIN= 0
##$MAXI= 10000
##$MC2= 0
##$MEAN= 0
##$ME_mod= 0
##$MI= 1.114404
##$NCOEF= 0
##$NC_proc= 0
##$NLEV= 6
##$NOISF1= 3.799351
##$NOISF2= 2.8
##$NSP= 1
##$NTH_PI= 0
##$NZP= 0
##$OFFSET= 15.70392
##$PC= 1
##$PHC0= -19829.52
##$PHC1= 12.20081
##$PH_mod= 1
##$PKNL= yes
##$PPARMOD= 0
##$PSCAL= 0
##$PSIGN= 0
##$REVERSE= no
##$SF= 200.130013532006
##$SI= 16384
##$SIGF1= 3
##$SIGF2= 2
##$SINO= 400
##$SIOLD= 16384
##$SREGLST= <1H.CDCl3>
##$SSB= 0
##$STSI= 0
##$STSR= 0
##$SW_p= 3612.71676300578
##$SYMM= 0
##$S_DEV= 0
##$TDeff= 0
##$TDoff= 0
##$TI= <>
##$TILT= no
##$TM1= 0
##$TM2= 0
##$TOPLEV= 0
##$USERP1= <user>
##$USERP2= <user>
##$USERP3= <user>
##$USERP4= <user>
##$USERP5= <user>
##$WDW= 1
##$XDIM= 8192
##$YMAX_p= 0
##$YMIN_p= 0
$$ End of Bruker specific parameters
$$ ---------------------------------
##NTUPLES= NMR FID
##VAR_NAME=  TIME,          FID/REAL,        FID/IMAG
##SYMBOL=    X,             R,               I
##VAR_TYPE=  INDEPENDENT,   DEPENDENT,       DEPENDENT
##VAR_FORM=  AFFN,          ASDF,            ASDF
##VAR_DIM=   8192,          8192,            8192
##UNITS=     SECONDS,       ARBITRARY UNITS, ARBITRARY UNITS
##FACTOR=    0.0002768,     1,               1
##FIRST=     0,             0,               0
##LAST=      2.2672688,     0,               0
##MIN=       0,             -1641047,        0
##MAX=       2.2672688,     1439671,         0
$$ Real data points
##PAGE= N=1
##DATA TABLE= (X++(R..R)), XYDATA
$$ [...]
2514c62R62j125O33r12P93M70n40J90Q54m33p79P05Q9o73M72m91j66KK45J58n54
2535d62K36J37p02O56j52p2J007j357K72O60M22J52l70M58m59l39N67K09r03R64
2555I24n51K38m10m22m54j32j17N8J173j420K66O70m15L11M55K66q73R89j34J25
2575E47L48n73o52Q88j37j09J77n54k13Q2L42M43j150M44k81j44m4P34n84O32
2595A96n09M09N65m00l20O49j92Q9K95j10l53l72m8K93q86R15m26l74l7n8L57
2616c17M16r52M16O00p20P23O58m39j50j21L88M16q29R64o60lm65L88k84J1n63
2637e23P01l44o9j9j26m77J74N41k08O5N85j457J156K37N4j95J02K45L15n76K05
2658C86j31J12m4j011K10o3J17L41o03P30l33m5L68K53m95j13L42J86J17K63q3
$$ plain form
2514 -362 600 -525 108 -804 -11 459 -81 109 963 530 -249 456 545 -128 344 -147 -313 -311 -66 92 -462
2535 -462 -226 -89 -791 -135 -287 -359 648 -709 -437 223 645 797 427 885 426 87 654 863 -40 924
2555 924 373 611 201 -221 -675 -807 -924 -866 307 -1113 -847 -177 -592 -281 174 440 -433 556 422 547
2575 547 895 322 -330 558 421 312 489 -65 -278 -196 146 589 -561 -117 -398 -542 -586 148 -436 196
2595 196 -313 96 661 261 -59 590 398 487 782 672 319 -53 -101 192 -694 221 -205 -579 -616 -674 -317
2616 -317 99 -853 -437 163 -557 166 824 385 235 114 502 918 89 1053 393 390 -75 313 29 40 -523
2637 -523 178 -166 -235 -254 -380 -857 -683 -142 -350 -285 300 -1157 -1 236 290 95 197 442 757 181 386
2658 386 255 367 323 -688 -478 -541 -424 -83 -686 44 -289 -334 34 287 -208 -321 21 207 324 587 504
2679E04pK50k21l81q9J034j350J45j66j78R20l13j6l53p64L09J36L17k7L34J80
2700B64J31n52J74P25K99l00j213J320k44m22M81k3j77q21K88m47L39m47j34M84
2720b75m1r1j30rL76k21Q57J23l26K83J7K39j67q7L17k56r0m78M37m35L0n25K31
2743b21k09P05q45N19Pp03N38J60K12k5K30l82K85j76M6L91L49kk91m25J065j300
2765g2N55o38k94L21p8j65l80O72j024O14P22lr0M74m33Q27r47n52N92M52K6l09
2787B70M68r08Q76k34q59K39o15p4K59m76O52j97L17m70P20l90J41O69k83K40
2807C45J73j23J94k79J93L6j01m25P25j177O59o27P34n87J88m8o45R05o98J40
2827d18M03m69N47L27j26K33m12Q56l01N09o33J31L15l05m94K83m17o98L20P77
$$ plain form
2679 504 497 747 526 145 56 1090 -260 -115 -281 -459 461 148 132 -221 -985 -676 -540 -223 -250 84 264
2700 264 395 -157 17 742 1041 741 -472 848 604 182 663 640 463 -358 -70 -517 -178 -625 -759 -275
2720 -275 -316 -407 -537 -546 -170 -391 466 589 263 546 563 802 635 548 865 609 519 41 478 43 73 -452 -221
2743 -221 -430 275 -570 -51 -44 -747 -209 -49 163 138 368 -14 271 95 141 532 881 879 588 163 1228 -72
2765 -72 483 -155 -449 -128 -206 -371 -751 -79 -1103 -489 233 230 140 614 181 1008 61 -491 101 553 579 270
2787 270 738 -170 706 472 -387 -148 -763 -837 -578 -1054 -402 -599 -282 -752 -32 -422 -281 388 105 345
2807 345 518 395 589 310 503 539 438 13 738 -439 220 -407 327 -260 -72 -120 -765 140 -558 -418
2827 -418 -15 -484 63 390 264 497 85 941 640 1149 516 647 962 657 163 446 29 -669 -349 428
2847D28k81j047N18N92l75K38m92R18l40o44Q61m54O22q29J634r79P89r95n3k12
2867a01P78q20J059q33m53M37p00l91j66K27O24o06K81k01P54r56R79L2K98L52
2887E94n48Q19j7L56r27k69K62m28K66k1n59K84k94n02N00p9j21M11K01q40P82
2908a30L01K53k32K84Q7k38r2j86J78K99m96M10m64m6N52l22n8l66j84r4N7O8
2930d19O32j78o1p37K57P35p05K77J029J99n93L73J05m05m12j9K12j55k3q7m54
2951d29J19n7J31p18K50J00k08N16P4K57N85o29O96m86P07N5j54k95N74o31J91
2972F48q22K45j96r2R0m21M25K8l56q54R23k78L51O82RO3m86P8K54k08L88K05
2994F76l79j67N02n52k95j69K17j02n65L85L23j27K99p23n0K12K12N1k58P70N8
$$ plain form
2847 428 147 -900 -382 210 -165 73 -419 499 159 -485 376 -78 544 -285 1349 370 1159 164 111 -101
2867 -101 677 -143 916 83 -370 67 -633 -1024 -1190 -963 -339 -945 -664 -865 -111 -1067 -88 -56 242 594
2887 594 46 865 848 1204 277 8 270 -158 108 87 -472 -188 -482 -984 -484 -563 -684 -273 -72 -912 -130
2908 -130 171 424 192 476 563 325 233 47 225 524 28 438 -26 -72 480 158 100 -266 -450 -544 -487 -419
2930 -419 213 35 -26 -763 -506 229 -476 -199 830 1029 436 809 914 509 97 78 290 135 112 25 -429
2951 -429 -310 -367 -236 -954 -704 -604 -812 -296 -222 35 620 -9 687 201 908 963 809 514 1088 457 648
2972 648 -174 71 -125 -217 -127 -548 -123 -95 -451 -1305 -382 -660 -309 373 382 445 -41 37 291 83 471 676
2994 676 297 130 632 80 -215 -384 -167 -269 -834 -449 -126 -253 46 -677 -727 -515 -303 -252 -510 260 318
3015C18k05N75K12n47M22k42J94j49k97J12n57O2L70o50K34o73o69O63N84R1k28
3036c80L0Q38j169P04J42L62K17k38L95k59pM36j238K87O95n80k83K23j40j267
3056a232Q28j74n10N38jj33L75m30L54K71P71K66j04n18o07R6L65M23j4l93o04
3077d33R07m01M94j288K18M68j221N61j67J15P57q2K65j524Q51J297k97R8o84
3096f6K81N22o38K15j88J95k31P1n05P40m13j11J23j325Q43M81j80m66J42Q87
3116C77r48L95K97P2K41k69J07M02k69J97o17j20J050q16M9m88j70N94r57P59
3136a14q61M44K77q66J515j145N03J44L20k2Q34k40p73K66N7M05J47r52l48M86
3156G7p4m11J4n48L23m3J20J22p25O84K23l32p6K19N38N24J9m21K88R8p02N54
$$ plain form
3015 318 113 688 900 353 775 533 727 578 281 393 -164 -102 268 -382 -148 -821 -1490 -827 -243 -152 -380
3036 -380 -350 488 -681 23 165 527 744 506 901 642 635 1071 -167 120 815 235 -48 175 35 -1232
3056 -1232 -404 -578 -1088 -550 -551 -684 -309 -739 -385 -114 657 923 819 301 -306 -210 155 578 564 171 -433
3077 -433 474 73 567 -721 -503 -35 -1256 -695 -862 -747 10 -72 193 -1331 -480 817 520 618 -66
3096 -66 215 737 99 314 126 321 90 161 -344 396 -17 -128 -5 -1330 -487 -6 -186 -652 -510 377
3116 377 -571 -176 121 193 434 165 272 674 405 602 -15 -135 915 99 148 -340 -510 84 -873 -114
3136 -114 -975 -531 -254 -1120 395 -750 -247 -103 217 195 1029 789 16 282 339 744 891 -61 -409 77
3156 77 3 -408 -394 -942 -619 -662 -542 -420 -1145 -461 -238 -570 -646 -427 111 635 654 233 521 619 -83 471
3178D71M31J67o23m98k13J294l02r94O2k08l62K83Q89m05p11O17m3l27p8M05L96
3199B51J65M36m79P8M5O7m93P36J01k47n27o14L81jJ68n49K67l97J5O42m24M11
3221C2k87P34m13n15J059m06j17J6R8L40O54r53K27n26j38N82q45J47Q4k57o48
3242a132Q79j52L35j28k19k36J115l17r26J077N21p77Q22k87j16lK5J42q20P73
3262E76p49L72p13k42K52L97p19M56l27P41J2k64M16j174J453J86L38j248Q87
3281F50K50q62K18K28j074N40J172q37k25K7n48k75J79N24o40N37q76Q17J58K1
3301a6m7L4O51k47j08j07j72K39L71j46q46K58N66m11n9M36q00L62k10r95J107
3322a40n28L01j65m33Q81Q3M16J29L34l15j47o33J294l44j76j95N47m77o72p5
$$ plain form
3178 471 902 1069 446 -52 -265 1029 727 -267 -205 -413 -775 -492 397 -8 -719 -102 -145 -472 -550 -145 251
3199 251 416 852 373 451 496 563 70 806 907 660 133 -481 -100 -101 67 -482 -215 -612 -597 45 -379 32
3221 32 -255 479 66 -449 610 204 87 103 201 541 1195 242 469 -57 -195 387 -458 -311 -227 -484 -1132
3242 -1132 -253 -405 -70 -198 -417 -653 462 145 -781 296 817 40 862 575 459 456 481 623 -197 576
3262 576 -173 199 -514 -756 -504 -107 -826 -370 -697 44 56 -208 208 -966 487 673 1011 -237 650
3281 650 900 38 256 484 -590 -50 1122 285 60 87 -461 -736 -557 -33 -673 -136 -1012 -195 -37 -16
3301 -16 -63 -29 622 375 267 160 -12 227 598 452 -394 -136 430 19 -40 396 -404 -42 -252 -1247 -140
3322 -140 -668 -367 -532 -965 -84 -1 415 544 878 563 416 -217 1077 733 557 362 909 432 -240 -315
3342c15M37J12p27J84l93M9J37L04j00J32m0K45M06j17K28N04P1p72o86J506n80
3363E85q71R85o07j45N07n33K50j248J107m51J83l28K65nn55K47K47L65R2K58
3383C48R16o47q4m00k85Q49l35j78k85m27o9K31k04M63p97M45J31j91K54M31o79
3404e13K31k1j64J166k15O5j42l65K39N8J35K5l75K68k99o83O77m77J63r5j27
3425d49k92O09n21j21Q31n28P67l89j57M59P25K03q07L12j64k69Q2N5j43j51l55
3446c03K05l57q9L02j36n29P43p3O5q30P43R12q99R26o9k69q99R22j09N6l0L62
3468F44k54K99p78OL78o32n69M77o48N74l53L16j72P02l7L46j47n05M30j01P5
3489E1k38J007j018P55n3m90n56Q54m82N62o67n55O17n10O09p01O53O6K3m1J05
$$ plain form
3342 -315 122 234 -493 -309 -702 -653 -516 -212 -312 -180 -220 25 431 314 542 1046 1117 345 -341 1165 585
3363 585 -286 699 92 -53 454 -79 171 -1077 30 -421 -238 -566 -301 -306 -861 -614 -367 -2 90 348
3383 348 1264 617 533 133 -152 697 362 184 -101 -528 -597 -366 -570 -107 -904 -459 -328 -519 -265 166 -513
3404 -513 -282 -303 -467 699 484 549 407 42 281 339 474 499 124 392 93 -590 87 -390 -227 -322 -449
3425 -449 -741 -132 -653 -774 57 -471 296 -93 -250 209 934 1137 330 642 478 209 291 346 203 52 -303
3446 -303 -98 -455 -544 -242 -378 -907 -164 -237 -172 -1002 -259 653 -246 680 611 342 -557 365 256 312 282 644
3468 644 390 689 -89 -83 295 -337 -906 -429 -1077 -503 -856 -540 -712 -10 -47 299 152 -353 77 -24 51
3489 51 -187 820 -198 557 504 14 -542 312 -170 392 -275 -830 -213 -723 -114 -815 -162 -96 -73 -114 -9
3510ik24K09O71K3P9J47n03K57L4j05K00k39l55P4m40P54o09o87M71o65O41k7
3532c03L28n79M70k29L4M40O5L1n2P1J24k08M22K09r9j062R15m85J67J27Rp24
3554c29j79K10k89K02k55J94l35M44K34P05m38M81p20N09l91M38j7k83L6q62Q8
3575e57N43K64r10Q3J11N19q88M41j72M52N30j058O23N88l33J59n26N04k5n21
3595a73N11l44j13L62L12q79K49k10K30J11j0p65m59O66kN28l49K3N45n50M02
3616H5j02N98m70J80K85n62K42L54Q9q20K14K98Mj85r54J43J90l54m5K14k8N60
3638f4q1k98nj74O89M69j01J28m65Q50m20m10Q91o03l69L58P31j240r1j86L59
3659c2J25o57J53K78j50K59j82M84m29k77L09R47m56K55r44J019l58l47J148j479
$$ plain form
3510 -9 -233 -24 647 670 749 896 393 650 684 579 779 540 185 259 -181 573 -36 -723 -252 -917 -276 -303
3532 -303 25 -554 -84 -313 -279 161 226 257 205 276 400 192 614 823 724 -338 577 92 259 386 395 -329
3554 -329 -508 -298 -587 -385 -640 -446 -781 -337 -103 602 164 645 -75 434 43 481 464 181 217 -645 -557
3575 -557 -14 250 -660 -577 -466 53 -835 -394 -566 -114 416 -642 -19 569 236 395 -131 373 348 -173
3595 -173 338 -6 -119 243 555 -324 -75 -285 -55 56 46 -719 -1178 -512 -514 14 -335 -312 233 -317 85
3616 85 -17 581 111 291 576 14 256 610 699 -121 93 391 395 210 -744 -601 -411 -765 -810 -596 -624 -64
3638 -64 -145 -443 -448 -622 67 536 435 563 98 948 528 118 1009 406 37 395 1126 -114 -205 -391 -32
3659 -32 93 -564 -411 -133 -283 -24 -206 278 -151 -428 -119 828 372 627 -317 702 344 -3 1145 -334
3679c34M09l29J275j064o04K27M30k41k72j9N63n32k17R7N06M12l82J054j42l78
3699D59J28j61o2j37k19n7O22j226M28k1r9J32k98O7o3m18L8K14Q50j146O28P39
3721C98O43j020l8N33N52n29l4q51R23m38p41R12q44R71j031J85R7J8J47m74o8
3742f89J441j469m2O89p71J112q6J09l40L91m9N23r25O67o91O61q93O77M6r54
3762e93J216j076J69k05k37L92Q73j057K82M43J18l11j39Q67r90Q27k82P59q58
3781A98j0n8K0J62o35L12lLp61K84q6l74R51l92m43J055q02L48L37k29M45K37
3803E59k55m37O79p75M42j27L8j85L55n39J09k47N25J15j81M4j058J203o9l30
3823a34N86n58J53j6R1N73n81O8j14N69p09K02K53l87M61m44J30p40J023j088
$$ plain form
3679 -334 75 -254 1021 -43 -647 -420 10 -231 -503 -522 41 -491 -708 -611 -105 307 -75 979 837 459
3699 459 587 426 364 227 8 -49 573 -653 -225 -246 -345 -213 -511 -444 -507 -925 -887 -673 177 -969 -341 398
3721 398 1041 21 -17 516 1068 539 505 -346 577 139 -602 310 -534 437 -594 -409 -312 -294 -147 -621 -689
3742 -689 752 -717 -759 -70 -841 271 185 294 -46 345 296 819 -106 561 -130 531 -362 315 361 -593
3762 -593 623 -453 -284 -489 -726 -334 539 -518 -236 207 325 14 -125 742 -248 579 297 1056 198
3781 198 188 130 150 312 -323 -11 -14 -11 -772 -488 -574 -948 3 -389 -832 223 -579 -231 106 -123 322 559
3803 559 304 -133 546 -229 213 86 124 -61 294 -245 -136 -383 142 257 76 120 -938 265 196 -134
3823 -134 452 -106 47 31 122 695 114 182 68 637 -72 130 383 -4 457 13 143 -597 426 -662
3843f62L73l99J124l94P8M4p25R7Q82n51M02J24K92q4k0n17L32j30O28j050P23
3864E67l97m80M51k25J75k76k58k05P75m90n0M45k55k3L93j60J51L10J63m01n68
3885c58L14N71l99J11J93n66k12O26o97K69m91M9P87r23O20m92O89o47O03O65
3905G12k94p03J060l38K75n16j3M36o90k3r34J167O4j21q25N04j49L35o45J009
3925C11k96K01p34N47P8J7l26L25N7M00N00o15q66j6M78L3j21K52m32K22J2L38
3947C65p8n97O99n70J52l57J53K82j60l08k8O27R16k2p30J45o26M89K68r6o51
3968a27K17m12L53o51L12r3J020j119j95J430j088P5K58N8l39P00l0j55m81K10
3988e7j58O10j35l61k00m9j09O00l1p64K26j71L27l11N14k98R39q08j2M12l3l33
$$ plain form
3843 -662 -289 -688 436 42 120 164 -561 -464 418 -133 269 393 685 601 581 64 396 266 894 -156 567
3864 567 170 -310 141 -84 91 -185 -443 -648 127 -363 -413 32 -223 -246 147 -13 138 448 611 210 -358
3885 -358 -44 527 128 239 432 -134 -346 280 -417 -148 -639 -590 197 -726 -106 -598 91 -556 47 712
3905 712 418 -285 775 437 712 196 183 619 -71 -94 -1028 139 203 82 -743 -239 -388 -53 -698 311
3925 311 15 216 -518 29 107 124 -202 123 180 580 1080 465 -401 -417 61 94 -27 225 -207 15 27 365
3947 365 287 -310 389 -181 -29 -386 -233 49 -111 -419 -447 180 1096 1074 344 489 -137 352 620 524 -127
3968 -127 90 -322 31 -620 -308 -401 619 -500 -695 735 -353 -278 -20 38 -301 399 369 214 -267 -57
3988 -57 -215 395 260 -101 -301 -350 -459 141 110 -654 -428 -599 -272 -583 -69 -367 572 -236 -248 164 131 -202
4010b02M47l63Q2q4O15l41J05p05Q48j35L83j193M09p1J46k18l82J100j231N72
4030b18L13k81n68J111l24J93J25j40l74p5J055q60L36k50k70K13m7j87L38m45
4050c55p41J208N4l19n62N20l66P95o28M65L03j39O21j139K27K35o88L84J251
4069A126q92n64J497k492P34R21m79m15M4K34j09K85N52l08o11L77Q0J09n95L64
4089a42R66j36j8k25k85N09j252J269o68l36N35l54K75m3P2q38q9J045M4k87n16
4110d74l99J096N7n43L02k69N33k05l36P52j61r95K72M05m31N15k44o69O03N35
4130C44p82N8L21N40o25q7L90r82J011k64M27r5R6l19J94l04L21L72r9No15k19
4152c12N24J79j53L2m6j36k36o97J038K08n27M46k29j07k19K1l0Q31n18M04q8
$$ plain form
4010 -202 245 -118 -36 -120 495 154 259 -446 402 267 650 -543 -134 -205 -59 -277 -659 441 -790 -218
4030 -218 95 -186 -754 357 33 226 351 211 -163 -238 817 -43 293 43 -227 -14 -61 -248 90 -355
4050 -355 -1096 112 166 -153 -715 -195 -561 234 -394 71 374 235 856 -283 -56 179 -509 -125 1126
4069 1126 234 -330 1167 -1325 -591 330 -149 -564 -520 -286 -395 -110 442 134 -477 -100 -20 89 -506 -142
4089 -142 824 688 670 445 160 669 -583 686 18 -318 217 -137 138 95 167 -671 -760 285 329 42 -474
4110 -474 -873 223 280 -263 39 -230 303 98 -238 514 353 -642 -370 35 -396 119 -125 -794 -191 344
4130 344 -438 -380 -59 481 -144 -231 159 -823 188 -76 351 256 352 33 227 -77 244 616 517 522 -93 -312
4152 -312 212 391 238 270 224 88 -148 -845 193 401 -126 320 91 -16 -235 -214 -244 587 69 473 385
4173C85p79L24K49j61p89J074j40M17l36k40l18M12j72j22n13P1J191o18r9K0
4193a44J66O00n19J030n94j145J237m72K03L3l69L8n10N89L26j607Q56n11L99
4212c94O82k53k23L22J15l83M22k55l11Q50p06M41n38K41N8L37M6q66k4O83qj63
4234G3P7k00m68Q21j44j85L95Jo74r6O54P36j20o44J74j39o2o4m68P28L7k35M51
4257F48p20K4M25q32M3R54q92K97r4N17J31l01J82j68k54J89N04K76p99P12m00
4278D42n82m8N10m54K23l40L13r45O93k76O66J92r43P51L3k13O9l54k42L48N26
4299C69l22Q4L96j40l93m76Q22K1k54j22l52j73N78o96M41M37k75O66p67m83O88
4320D9O05n57k17k61Q59n99M13m80L31k16M24K22l8n33J00p4mM87n79m5j32p07
$$ plain form
4173 385 -394 -70 179 18 -771 303 163 580 244 4 -314 98 -74 -196 -709 -638 553 -65 -164 -144
4193 -144 22 622 103 1133 539 -606 631 159 362 395 26 64 -446 143 469 -1138 -282 -793 -394
4212 -394 288 35 -188 134 249 -134 288 33 -278 572 -134 307 -231 10 68 405 451 -415 -439 244 236 73
4234 73 150 -50 -518 303 159 -26 369 370 -304 -400 254 990 870 226 400 261 199 135 -333 395 432 197 648
4257 648 -72 -48 377 -455 -412 542 -350 -53 -147 370 501 200 382 214 -40 149 653 929 130 842 442
4278 442 -140 -188 322 -132 91 -249 64 -881 -188 -464 202 394 -549 202 235 22 91 -263 -505 -157 369
4299 369 47 131 527 387 -6 -482 340 361 107 -15 -367 -540 38 -658 -217 220 -55 611 -156 -639 49
4320 49 654 97 -120 -381 478 -121 292 -188 143 -73 351 573 535 2 102 28 24 511 -68 -113 -245 -952
4342i52J11R76n68L54m11Q1J256q50l3M13o53Q83n93j7n70P50j68N06o09K35n35
4363c94K99m68m88J503l39k68k43K54r0L19n4l14P08j42k57J7Q82o85k98O42o01
4384a7q4J12n89P71M9k23j65L02k80M69n58L44L34k32l69K60M39k82K66j082L32
4405b03L62n11K3R22j263J043n02k89O34k51l43M46m07J81O0l30L9k3K5L9O68
4426C20k17k05L88L43m43J21J24n02K07k94L29m67N54K65j074O5O51L03j294P81
4446d5m10L85M2j90K05l94j8J35j09P78N5n00J40J57L69m99n23N05j79M74Jl06
4468G3j7k46L66k54J31j80K53l12N09l24J38j63Q7Q38n16j066P41N07l02P60j321
4489b98M56K39l47j76n79M72j25N38j071P57J10n74K79P20m06K56N78j228L88
$$ plain form
4342 -952 -841 135 -433 -79 -490 -409 847 -3 -36 377 -276 607 14 -3 -573 177 9 515 -94 141 -394
4363 -394 -95 -563 -1051 452 113 -155 -398 -144 -234 85 31 -283 425 283 26 43 925 240 -58 584 -17
4384 -17 -101 11 -578 193 242 19 -146 156 -124 345 -213 131 465 233 -136 124 563 281 547 -535 -203
4405 -203 159 -352 -329 593 -670 373 -129 -418 216 -35 -378 68 -339 -158 -98 -428 -389 -412 -387 -348 320
4426 320 103 -102 286 629 186 307 431 -71 136 -158 171 -296 258 523 -551 -486 165 468 -826 -45
4446 -45 -455 -70 -28 -218 -13 -407 -425 -290 -399 379 434 -66 74 231 600 101 -422 83 -96 378 379 73
4468 73 56 -190 176 -78 53 -127 126 -186 323 -1 137 -26 61 899 383 -683 58 565 263 1023 -298
4489 -298 158 397 50 -126 -705 -233 -358 180 -891 -134 -24 -598 -319 401 -5 251 829 -399 -11
4508a1k76l4Q07k48j73k07l64O87l63K37o48L44M15o32L74n52O43P10m34q69J47
4529d47N53n43R67J2J68n50l05J01L51m97L45k35L16M80r58m64O21l85L8m7M23
4550e6k1k56q9n1K21K07J93l9L13o98J454r32J39J6k58O9l74l46Q2R58q52q7j77
4573e84J3M35M46l26l2L12n21J99o0k50L69L05r8L69n83m38K20J53m14O95j052
4594h42P78N9J68j66k03K46p36K08o09P37Q18j064J113J0o90K35m43K85L90k41
4614E3pj009Q09j46J017m06l81n20L44J89l34L37M3k14K60p56J82L61L7j86K93
4635c4k9O34l63l38Q44q56M46m99m3N73r07N76J48j50K81o08J34J80K65q16J48
4656d14k55Q62l7m21L61k37L15p5J28k38Q71q45R28m75J33j27o61K6pk41M32L77
$$ plain form
4508 -11 -287 -321 486 238 65 -142 -506 181 -182 55 -593 -249 166 -466 -92 -644 -1 709 275 -594 -447
4529 -447 106 -437 530 542 710 160 -145 -44 307 -190 155 -80 236 716 -242 -706 -85 -470 -432 -479 -56
4550 -56 -77 -333 -422 -473 -252 -45 148 109 422 -276 1178 246 385 401 143 212 -162 -508 -426 532 -320 -407 -584
4573 -584 -571 -136 310 -16 -48 264 -257 -58 -118 -368 1 306 208 577 -6 -444 -224 -71 -485 210 -842
4594 -842 -64 -5 163 -3 -206 40 -696 -488 -1097 -360 458 -606 507 517 -173 62 -381 -96 294 53
4614 53 46 -963 -154 -300 717 311 -70 -590 -246 -57 -391 -54 -11 -225 35 -721 -539 -178 -141 -327 -34
4635 -34 -63 571 208 -130 714 -142 304 -195 -238 335 -572 4 152 2 283 -325 -191 -11 254 -562 -414
4656 -414 -669 193 156 -265 96 -141 174 99 227 -11 860 15 943 468 601 474 -187 -161 -168 -409 23 400
4678D00l51J42J05l89K72j74q9m24N70j52O69q4o94Rj11P82k99l21N04n7m13j26
4700b31K6p1l09R57l19m32K13L63J47j20m07N53o43m92L39P97J90l21K59k15j60
4721A24J9Q90l77j185R20l53N6k24k10K30j44J33m75R30m16M6k41N09m15K92l7
4742G2j86j7j56N56q36O05J24n19R35j120M16n05J53N18q63M68j03j63R59k85
4762E3o79O10j42k70Q69q52O52k75K59p78M29O22j58j02K00j27k47J44m09R6j99
4783c04M80r2l05L11m9o02K03R7O13J97p28N92l76j5N73k48J28j71N7R4k90k9
4805A36J27R8J57m27k69j64m43J63O40j7m07K8J035n19n37R51k60n9k14N24m43
4826A00k4N93o94r9K28k49k85R3m62N73k50n45O41k57K11J87M05j37l95J50Q43
$$ plain form
4678 400 49 191 296 -93 179 5 -84 -508 62 -90 579 495 -199 -190 -301 481 182 -139 365 308 -105 -231
4700 -231 -205 -276 -585 372 53 -379 -166 197 344 224 -183 370 -273 -765 -426 371 561 240 499 284 124
4721 124 143 1033 656 -529 391 38 94 -130 -340 -110 -254 -121 -596 334 -82 -36 -277 232 -183 109 72
4742 72 -114 -131 -287 269 -567 38 162 -357 578 -542 -126 -631 -478 40 -823 -355 -458 -621 338 53
4762 53 -626 -16 -158 -428 441 -411 241 -34 225 -553 -124 498 340 238 438 311 64 208 -201 -105 -304
4783 -304 176 84 -221 90 41 -561 -358 -261 352 549 -179 413 37 22 595 347 475 304 361 455 165 136
4805 136 263 361 518 91 -178 -342 -785 -622 18 1 -406 -378 657 138 -399 552 292 233 19 543 100
4826 100 76 669 -25 -124 104 -145 -430 -337 -799 -226 -476 -1021 -380 -637 -426 -239 166 29 -366 -216 627
4847F27l68n97m36R68m11L28j69j54p9L07M46l00J01q83J442o37j50j91n4L54
4867A44m16j5L33q60P07J52j3l2k47J90N45J55o27k95O6O88N3r06L27L75l55l08
4889c39M51k08K51q8r47N24L41j18q4N81J48m06p01Q38l90M9J76K67o1j003L05
4910d14P65j88k71j33N17p3j09n90O74m37J22M0J474j510K16P54n93L37k63k64
4930E4k69Q65o22P7K43k49j94M03J94J34o17lj42O6m96J187o89o56Q81r75N60
4951b48P7J15M32m16M9j02K1k06L58r9K88k03j56J31J53k39M68k23n66N34j415
4972a247J050L0p00J105l02K45N74o03m93J96N03M9j53L38k60l90N87n69m22J86
4992b76O25J27n85J73Jj4K37M84n20j96m89N98k38O90J26n38o17k56J075p56N88
$$ plain form
4847 627 259 -338 -774 194 -217 111 -58 -212 -291 16 462 162 263 -620 822 185 35 -156 -210 144
4867 144 -272 -287 46 -814 -107 45 32 0 -247 -57 488 643 16 -279 -213 475 528 -378 -51 324 -31 -339
4889 -339 112 -96 155 67 -880 -356 -15 -133 -217 364 512 106 -595 243 -147 -98 78 345 284 -719 -414
4910 -414 351 163 -108 -241 276 203 94 -496 178 -259 -137 -97 1377 -133 83 837 244 581 318 54
4930 54 -215 650 28 105 348 99 -95 308 502 636 19 16 -126 -60 -556 631 -58 -714 167 -808 -248
4951 -248 -171 -56 376 -40 9 -93 -72 -278 80 -19 269 66 -90 41 194 -45 423 200 -366 168 -1247
4972 -1247 -197 -167 -867 238 -64 181 755 152 -341 -145 358 407 254 592 332 -58 529 -40 -462 -276
4992 -276 349 476 -109 64 65 51 288 772 252 56 -433 165 -73 617 743 205 -412 -668 407 -349 239
5013B39r51N39P7J8L21p02L63K5j88j52n73P30k99R70p60Q26q09P18j074J192
5033E10K53m64j10J09L31n75P70j250P18l06L89k88o16Q31n28M57n71k46O38L91
5053D43n12o71O40J73M1P7K67o90M95o33Q3N6J9J98l73k12N87j58j34N00m93j76
5075d73m6P34j02p24J33M08M19j62j39rR5q55Q83j24j81O03r33O01n80q8O50L39
5097D49k84o74M22l58Q93q51Q05pL11j195K07N93l59L05j66j42k96P09l92R6p8
5118a2N38r13K77m70L34P23m69q7k11j80M74L62p58J61o58J119L1j11l81k10M93
5139E2K96o71M25Q36q47J91J79q55P46k13J94n19N0K21l59K44K3K7M05K92m51
5160B66l41N03j74l29L37k34j42L86j92j14K50L2k33o95P53l96O09p0L5L19r93
$$ plain form
5013 239 -712 -173 -96 -78 243 -459 -96 -71 -259 -411 -984 -254 -553 417 -343 483 -326 392 -682 510
5033 510 763 299 189 298 629 54 824 -426 292 -14 375 87 -529 302 -226 231 -340 -586 52 443
5053 443 -69 -740 -100 73 114 191 458 -232 263 -370 -287 -231 -212 -14 -387 -599 -12 -170 -304 196 -297 -473
5075 -473 -519 215 113 -611 -478 -70 349 187 48 39 134 -721 162 38 -143 460 -473 128 -452 -540 110 449
5097 449 165 -509 -87 -445 448 -403 402 395 706 -489 -282 311 -48 257 91 -51 -347 362 -30 66 -12
5118 -12 526 -387 -110 -580 -246 477 8 -79 -290 -470 4 366 -392 -231 -889 230 261 150 -231 -441 52
5139 52 348 -323 102 938 91 282 461 -394 352 139 333 -186 -136 85 -274 -30 -7 20 425 717 266
5160 266 -75 428 254 -75 262 28 -114 272 80 -34 216 248 15 -680 73 -323 286 216 251 570 -423
5181d23J88k6J93n5l98N02o6M47L84n92J24j54O41j189J25K5J37L97J41r08N77
5202G0j17j87M12p08M19L82o99R75m86m34N82k35m21K71R30p03N59n36O89n52
5222B11p76L95J98j40K97O21j054J205j026K64j41m20Q76n16r2q2L47J42o7l82
5242a40n55J035n49K89q1M40l61K47L72j157k77N89j88n1M08o69Q48n20L33m00
5262c87N29j27l5N84k74p63Q31j003N43L25m74o8K81k15K38N34l18r17P94o64
5282e86Q9L75J84j71n15P41Q9L24p55NJ2j77N13l28P8K41k44Q6L91P5j93o62K84
5305a44J37O3p75J080r67J000L21j315O22k81K34N01k15l56l75m2P56K4j6K11
5325D63n47O12J17q39O72j252M22M1Q1M40Q9n86l04R01m85N12j319Q10J08O45
$$ plain form
5181 -423 -235 -261 -68 -123 -521 -19 -85 362 746 154 278 124 765 -424 -299 -274 -137 260 401 -507 70
5202 70 -47 -234 178 -530 -111 271 -428 547 61 -373 209 -26 -447 -176 754 51 610 74 763 211
5222 211 -565 -170 28 -112 185 806 -248 957 -69 195 54 -366 510 -6 -98 -180 167 309 242 -140
5242 -140 -695 340 -209 80 -1 439 78 325 697 -460 -737 -148 -336 -387 21 -648 200 -320 13 -387
5262 -387 142 15 -20 564 290 -473 358 -645 -102 223 -251 -319 -38 -253 -15 519 201 -716 78 -586
5282 -586 -497 -122 62 -109 -624 117 206 530 -225 -220 -208 -385 128 -200 -122 119 -125 -39 352 427 234 -428 -144
5305 -144 -7 56 -719 361 -606 394 715 -600 22 -259 -25 476 261 -95 -470 -512 244 268 252 463
5325 463 -84 528 645 -194 478 -774 -352 -311 -230 210 299 -287 -591 310 -175 337 -982 -172 -64 581
5345E81k50J0j62N71j274K50j6J90L07p1l63O84r89L68o89J344j76j12k41L07
5365B69K17j088P59M8m07L61K29J30j232J369o21K19K84p00J133o80l19l0k14
5384b73J81r0k16R25o65n8o3p90N63J088j114O57l87m54P69j3K91P67j601O29
5404A46K2k16K09K82m11L72n39m03P13m23O58l53k63l75Q81j72K45k31o18N60
5424H4K28J83n69O21l06L3n37P30K7p24k1l3K52M46m50m53J45M23N1l91j90J68
5446b83J55L91o85L55J62J8N88k51l82l72O85q79J61K53l75L7O12J43j80n78L32
5467i3N88q0k97j60j86M50J90p9j146N82O02L62k07n73K26m95l44J11L60Q03m69
5488A45o05j12K20R05o29J11K18n38K70K26j42l65N98m30J09l02J052m25m61N54
$$ plain form
5345 581 331 341 179 750 -524 -274 -290 -100 207 136 -227 457 -532 -164 -853 491 315 203 -38 269
5365 269 486 -602 157 205 -202 159 388 518 -714 655 34 253 537 -163 970 290 -29 -59 -273
5384 -273 -92 -182 -398 527 -138 -196 -259 -1049 -486 602 -512 145 -242 -696 73 60 351 1118 -483 146
5404 146 168 -48 161 443 32 404 -135 -538 175 -248 410 57 -206 -581 300 128 373 142 -476 84
5424 84 312 495 -74 547 241 274 -263 467 494 -230 -251 -284 -32 414 -36 -489 -344 79 130 -261 -451 -283
5446 -283 -128 263 -422 -67 95 113 701 450 68 -304 381 -498 -337 -84 -459 -422 190 333 153 -425 -93
5467 -93 495 415 118 -42 -228 222 412 333 -813 -231 371 733 526 -47 179 -316 -660 -549 -189 614 145
5488 145 -460 -572 -352 553 -76 35 253 -285 -15 211 69 -296 302 -128 -19 -321 731 306 -155 399
5508C99r74J214l09l9nr50O04n10O55j7m64K11L33j50k69k81K42K85jJ3N7O72
5530G16q44O53n15P6L9L41j346Q52R4l68p71L40L07j74O90k9j46k19J10K66m0
5551C2J38L20p00N83o9m37O22o76j85N26j53L00n08N20n32P31k32J77j377P15
5571b05M40MK04M7j19p77Q21l23j53N14J45p63l49N48o00O76J75K17n55l16L51
5592a8o0j00kL53J35J76q95M88P39j134K89k05K58K32L84r54j23M81M1Q69o27
5613C27k41m93L27J42K02r3p26Q86j178P51K55l19N67O0o20M48k12l91L46M63
5633E01m21k75L3m0M85L17k51o48j12K83r7L3L6n3J96J59k52L93j74j77k07J089
5655H18j100P03m26J04m15K57P59m56J50p51N19q61Q95m96j4J04k6M67p97l98
$$ plain form
5508 399 -575 639 330 291 286 -664 -60 -570 85 68 -396 -185 148 -2 -271 -552 -310 -25 -26 -13 44 716
5530 716 -128 525 10 86 125 466 -880 -28 66 -302 -1073 -733 -426 -600 90 61 -85 -304 -194 72 32
5551 32 170 490 -210 373 304 -133 489 -187 -372 154 1 301 -207 313 -219 512 280 457 -920 -205
5571 -205 235 239 443 490 371 -406 415 92 -61 453 598 -165 -514 34 -566 110 285 502 -53 -369 -18
5592 -18 -78 -178 -180 173 308 484 -411 77 816 -318 -29 -234 24 256 640 -314 -437 44 85 954 327
5613 327 86 -407 -80 62 264 171 -555 331 -847 -96 159 -160 407 467 -153 295 83 -308 38 501
5633 501 80 -195 -162 -202 283 600 349 -299 -411 -128 -225 -192 -156 -209 -13 146 -106 287 113 -64 -271 818
5655 818 -282 421 -5 99 -316 -59 700 244 394 -357 162 -699 196 -300 -314 -210 -236 231 -566 -964
5675i64L50O19M18q02O06L55J26m98K31j001Q25K97j21l84o9J01J45l27m11L89
5695a15O67r75j09J02O87Q7m30q3M03k93L30L02o70J96n82J020m35L33J42q08
5715b31K45K34L67p65P8o7M10k12j75M39p99P61m82M66m25m26K09k2Q06l61j71
5736a21K82j289J405j08m53J23J11N65L06r95K63j62k80M82j98K12j79r5QkK9
5757i6k41M09L6l8k41J03j09k87L32M99n6L68k5j16l69n23L49M95m72l77j27Q6
5779d00P45J79n16M26m03m53L55J7j41N64m79O43j63K16m09m98J164p03L29k64
5799B09m80P04j82n13M14j86n7o84J323l47l31N6k19R59p93m27M34K15j93M81
5819C83j053L71l12N39K47p3j211P83K26j33J40k21M50k80J68l40K9M87q63P48
$$ plain form
5675 -964 -614 5 423 -379 227 582 708 210 441 -560 265 562 441 57 -12 89 234 -93 -504 -115
5695 -115 552 -423 -532 -430 257 344 -86 -169 234 -59 271 573 -97 99 -483 537 102 435 577 -231
5715 -231 14 248 615 -150 -72 -139 271 59 -116 323 -476 285 -197 269 -156 -582 -373 -395 411 50 -121
5736 -121 161 -1128 277 169 -284 -161 -50 515 821 -174 89 -73 -353 129 -69 143 -36 -131 -123 -125 -96
5757 -96 -337 72 108 70 -171 -68 -177 -464 -132 367 311 679 654 538 169 -354 -5 490 18 -359 -486 -400
5779 -400 345 524 8 434 31 -422 -67 -50 -191 373 -106 537 374 590 181 -317 847 144 473 209
5799 209 -271 433 251 -262 152 -34 -91 -775 548 201 -130 -74 -293 666 -127 -554 -120 95 -98 383
5819 383 -670 -299 -611 -72 175 102 -1109 -326 -100 -233 -93 -314 136 -144 24 -316 -287 200 -663 85
5839H5m70j74R6J105j053J73l06O92j66j31J91j48N09n19L59q43J06Q1J70j18
5859c61J34J258j522R69p59N43L78l40O68j098m1K06J16m00k63J43j50L19L58
5878A58q22j10P11J03N18m50n94N26N02L01m05K3o59l91J087K21j97q5q02O30
5898B65p13M53m1k01K90M5j97N8l42K17M5oP59o94n7M84m91m21M01k31L60P50
5920G33n56M8L84n82J37n20LL53j39M40J32l46k4j05M2O9P9m7J06m61J60m37Q76
5943C45l14Mj91R3M52L52p99J36K16n42K55k73L9M43L39k61m25k09P95q95J521
5964A081j113m34P00l49K40j024J546j25j8p60l63M10L36L30o30k14J81k88N24
5983C0K2P59o74k0J32jm38M57j34J57p75P23m19p3J86O6K95j1m80K01N61J1m98
$$ plain form
5839 85 -385 -559 -463 642 -411 -238 -544 148 -18 -149 42 -106 403 -116 243 -600 -494 -413 -243 -361
5859 -361 -227 1031 -491 478 -281 262 640 300 968 -130 -171 35 151 -249 -512 -369 -519 -200 158
5878 158 -664 -774 -63 40 558 108 -486 40 542 843 438 461 -198 -589 498 719 522 437 -365 265
5898 265 -448 5 -36 -237 53 98 -99 -41 -383 -166 -121 -127 632 -62 -119 365 -126 -547 -146 -377 -17 733
5920 733 177 225 609 27 164 -356 -353 0 -139 301 433 87 63 -42 0 69 148 101 207 -254 -94 -531 345
5943 345 31 35 -156 -63 389 741 -58 78 294 -248 7 -266 -227 216 555 294 -131 -340 455 -440 1081
5964 1081 -32 -466 234 -115 125 -899 647 522 504 -256 -619 -209 127 457 -173 -387 -206 -494 30
5983 30 52 811 137 117 249 248 -190 267 133 290 -485 238 -181 -254 -68 -2 293 282 -198 3 564 575 77
6006G7P34l99m01K99r87N72n38K82J8n42N46K67O76j512J289r45Q84M2p95O82
6026B49K06n86J91m40L37Ml87l00J003j37o08L17m24O93j73M46J0p29O35O9r67
6047e91M56K64P18q68N9N06m67J4l94N37j34j76J5k60K27J05k75O46p70O08k88
6068f8p93N80m59P31r3o84R62m49N35n33O30M40j449P65R7j17O2n09J83m42R04
6089B93r12K20L69J49J0M2p76O40P23o02k46J83J83J6J3k19O08j125R06r46M56
6110a5Q27j293M7K87K7L74l42q33J189O1n1m18m11L28J53Q5l62J86K53J40m92
6131b60J76N26m97M62j140J23J101q28K58L74l01q55J154n01r2L31J71l9l04M93
6151C52l38Q20p53o23k03N17l48Q33K33n49P9j87k93K6K9M45n96O96r1K29m67
$$ plain form
6006 77 811 412 11 310 -677 -105 -643 -361 -343 -885 -339 -72 604 -908 381 -564 320 362 -433 249
6026 249 455 -131 60 -380 -43 -39 -426 -726 277 140 -468 -151 -575 118 -55 391 401 -328 307 376 -591
6047 -591 -135 129 847 -21 38 544 77 91 -303 234 100 -76 -61 -321 -94 11 -264 382 -388 220 -68
6068 -68 -861 -281 -740 -9 -102 -786 176 -273 262 -271 359 799 -650 115 212 95 157 -352 -169 -611 293
6089 293 -619 -399 -30 119 129 171 -605 35 758 156 -90 93 276 292 305 86 694 -431 475 -471 -15
6110 -15 812 -481 -434 -147 -120 254 -88 -921 268 329 278 -140 -551 -223 -70 15 -347 -161 92 232 -260
6131 -260 -84 442 -55 407 -733 -610 491 -337 -79 295 -6 -861 293 -208 -300 31 202 163 -141 352
6151 352 14 834 81 -542 -745 -228 -576 257 490 -59 20 -167 -460 -434 -405 40 -556 140 49 278 -189
6172a89L97k31R0J01L82K62n48j09j24P91j408N65l12M78K19n86O02n99L00j7
6192F4n56P90m45J01M93r63J05N59M92j342J191r01M83K18l20n33N48k57l22Q30
6212B35j97l62K69L06K09j57J75o24o39L18j18L75p89R38m06Q13k55K10r98O15
6232h2M5k00K81L76n61r7j35O47K9j7o61K26P09n18n23L64k53J98M24j89R53j030
6254a4k69o09O71j1Q25q01M9M13l12M4j31M02p26K78j37K36k69K97M7R2r7J98
6276A76q0m00K22K68R4l1m35K98n29R3P54m02m21M52j40M00N7n46k0J81P85j107
6298c31L77r8K60l33l68P16P4m92N14m53K86k79P45l63k6n53j7r0L15L52j64J24
6320A96L34K06r27L4J8K61k45j20L75J27l74LQ7K67M03n28L21j97R7n77N06n51
$$ plain form
6172 -189 208 -23 67 168 550 812 264 155 31 822 -586 -21 -333 145 364 -222 380 -219 81 64
6192 64 -492 298 -147 -46 447 -516 -411 148 640 -702 489 -412 71 289 -31 -564 -16 -273 -595 235
6212 235 38 -324 -55 251 460 303 478 -146 -785 -467 -585 -210 -999 -61 -467 346 91 301 -697 -82
6232 -82 -37 -237 44 420 -141 -238 -373 274 303 286 -375 -149 560 42 -481 -117 -370 -172 252 63 1016 -14
6254 -14 -283 -892 -221 -232 593 -208 -159 254 -58 -14 -145 257 -469 -191 -328 -92 -361 -64 -17 75 -22 176
6276 176 96 -304 -82 186 280 249 -186 112 -417 -324 430 28 -393 59 -81 319 376 -170 -190 -9 776 -331
6298 -331 46 -52 208 -125 -493 223 297 -195 319 -134 152 -127 618 255 229 -324 -341 -431 -116 236 72 196
6320 196 530 736 -191 -157 -139 122 -123 -243 132 259 -115 -112 -25 242 645 117 438 241 338 -239 267 -284
6342b84K21q71q7J402n97K43K54JK1J83o79L7J95K61q80P61l75J1P43k82r76R06
6364B08p48R33n55o71J033q66P86k2J80p06J18J46M41l10L5M82k30M0k88P0N11
6385E87o79j25L45l36L00n53L26J9M70o49L14J09l60R46j290Q06l02q14N70Q08
6405D92o99M32j2j97J34K10M16j384R36m88J59N9L72j27J74j38l05n28J066l76
6425A96m71K43k88Q63jp94M24J56r85L28N49l22J38j30r9P29j98l89j11R50K4
6446H12j997J282q27J155k18o74P53j57K16n36P89n64O87r58K34K33p13M68o6
6465h1K1K17p76Q64l75N76J49q21Q34q34K25J90l0n81K01o7J2O28j241R34j93
6486a48N48L93o40J30j71O0m26N86r3k77k03q3l84O64j50J84L60n49k8P24m42
$$ plain form
6342 -284 -63 -934 -1021 381 -216 27 281 282 303 486 -193 -156 39 300 -580 181 -194 -183 560 278 -698 208
6364 208 -540 393 -162 -833 200 -666 120 98 278 -428 -310 -164 277 -33 2 484 254 294 6 76 587
6385 587 -92 -217 128 -208 92 -461 -135 -116 354 -295 19 128 -232 714 -576 230 -72 -886 -316 492
6405 492 -207 225 213 16 150 360 776 -608 328 -160 -1 58 430 303 477 339 34 -494 572 196
6425 196 -275 -32 -320 543 542 -252 172 328 -657 -329 220 -102 36 -94 -193 536 338 -51 -162 788 812
6446 812 -1185 97 -730 425 207 -467 286 129 345 -191 598 34 721 -237 -3 230 -483 -15 -81
6465 -81 -60 157 -619 245 -130 446 595 -226 608 -226 -1 189 159 -422 -221 -288 -276 352 -889 45 -148
6486 -148 400 793 153 283 112 172 -254 332 239 -38 -241 -324 -708 -44 -194 -10 350 -199 -227 497 55
6507E5k1k43K28l69q2j41K11K34M09l92J48q0kl9M67l74o65J033j18k33L49L68
6529G43j147k8P27k17p7l60O68m07J15k46m5L65o6L80p07Q73n13J61j078J246
6549C87m76M06o30l02l9K04P13k30j34J60o14K18M83l07K27j58M53m59j73N38
6569B67n89P92l45k36J78j20m79O25N24o64O2q12N76L47k18j51P26r94J84L32
6589En47J324l96k71J00J94n06j36j43m6O29P4m37J31K83N6l85j86L53L1L8m08
6611b43J48L23q27R59m09K15n07O64q42L36n16N75O80r71K58K79L44l47j53o4
6631i8J93P1K77K74m63l74o31P52n81R27l12l40N95m28N2L18r50M51o2j76J81
6652c24L77q3K80m68K52L02n90K38N00k83l18M08j038P22Q3R9l37K57K65l34J83
$$ plain form
6507 55 34 -209 19 -350 -432 -573 -362 -128 281 -111 37 -43 -45 -84 383 9 -656 377 259 26 375 743
6529 743 -404 -432 295 78 1 -359 309 -98 17 -229 -274 91 25 405 -302 571 58 219 -859 387
6549 387 -89 317 -313 -615 -654 -450 263 33 -101 59 -555 -337 146 -161 66 -92 361 -98 -271 267
6569 267 -322 470 125 -111 67 -53 -532 93 617 -47 15 -797 -221 126 -92 -243 483 -511 -327 5
6589 5 -542 782 386 115 215 409 -97 -233 -376 -422 207 281 -156 -25 258 314 -71 -257 96 127 165 -243
6611 -243 -95 228 -599 360 -49 166 -341 323 -519 -183 -699 -124 556 -415 -157 122 466 119 -34 -98
6631 -98 95 166 443 717 254 -120 -751 1 -580 347 35 -305 290 -138 -86 232 -718 -267 -329 -505 -324
6652 -324 53 -30 250 -218 34 336 -254 -16 484 201 -117 291 -747 -25 58 157 -180 77 342 8 191
6673A91O81r53M32m18K94p97N85K19l80j48l32O61ON49o16L95Q88j853P56J56
6693C16m5Q8q07L04j93k58M77J05Mm5Q82m53j159J196p4K2o84k06R78o62K12k98
6715c00J14R5L29M88o76o5O25n75j27N66r87O84m3M20n99p38N63R88j089M99M37
6736F09n31l44Q8O5j06K46k9J89rl37j58K82K47o18L43l0J52K84o60M75J38q59
6758e63L93L27O7m97M56J28k21K0L5m68PK32O62j171K95K76J14l06K25J57l9M72
6780F01l26n08L36J80j82o20P17K73r5M9k00l88L65l30J30R7j79m34k77J004l92
6801a79K84J57m17k82J030m09M71n05O5l84P33q6j73j190R18m99j35J9J174r52
6821c60P47K42p57j06l47O26m32l86L70K25l82M15l1l24K82O27n67O3L1O53n94
$$ plain form
6673 191 872 -81 351 -67 227 -570 15 234 -146 -294 -626 35 41 590 -26 369 1257 -596 160 316
6693 316 271 359 -448 -144 -337 -595 -118 -13 -9 -54 828 375 -784 412 338 360 -324 -530 448 -214 -2 -300
6715 -300 -186 -91 238 726 50 -15 610 35 -92 474 -513 171 128 548 -51 -789 -226 762 -327 172 609
6736 609 78 -266 -178 -113 -219 27 -2 187 178 -159 -317 -35 212 -406 -63 -93 59 343 -317 158 296 -563
6758 -563 -170 157 224 -273 183 311 90 110 145 -323 -316 -84 578 -593 -298 -22 92 -214 11 168 129 601
6780 601 275 -233 103 283 101 -519 198 471 376 425 225 -163 202 -128 2 99 -80 -514 -791 213 -179
6801 -179 105 262 -155 -437 593 184 655 150 215 -169 564 478 305 -885 33 -466 -601 -582 592 -360
6821 -360 387 629 -128 -234 -581 45 -387 -773 -403 -178 -560 -145 -176 -500 -218 409 -158 -95 -64 589 -5
6842el29P72q69N94n70K20L87j168M72P00J5r24J102q3K89J1l9Kk81q87J163k38
6864C34K31m15M9o18l28R24J76o29L2L37j65J56Kl21J9R20p33M63K21j012M27
6885G0L70j67O6r1n76qK80L21k1j72k65L54m68N45j09o99L80J054o79q32N16j30
6907b61J97j59J11N72q87Q10o99M98mo28N61k58L71N20j047J22j08J95o07N55
6927a46K5l8M50j47Q18j268K77j35K63k36n48J048Q6n22J53K33k26J3l07p52N56
6948d03J09Q13j025R48n86P20j121P17m23K66lk66j67J54j45J04l05L6M24n03
6968f56R87pk98L6p18J141p48M90K53p1J38m06P0k65J2O27j88j072P97m02M32
6989A52L24p88M33J64o91K26Q29p44k40K50P63k84l78m9l62L76N48j151R47l1
$$ plain form
6842 -5 -334 438 -431 163 -407 -187 200 -968 -496 204 219 -705 397 314 603 614 575 577 296 -591 572 334
6864 334 565 150 199 -419 -747 177 353 -276 -244 93 -72 84 86 -235 -216 704 -29 434 655 -357 70
6885 70 440 273 339 248 -328 -336 -56 265 244 72 -193 161 -307 238 129 -570 -190 864 185 -647 -131 -261
6907 -261 -64 -223 -112 460 -427 383 -316 182 178 -450 111 -147 224 744 -303 -181 -289 -94 -701 -146
6927 -146 -121 -159 291 144 962 -306 -29 -164 99 -137 -685 363 449 -73 80 313 87 100 -207 -959 -403
6948 -403 -294 519 -506 442 -144 576 -545 172 -251 15 12 -254 -421 -267 -412 -308 -613 -577 -153 -656
6968 -656 331 324 26 62 -656 485 -263 227 480 409 547 141 211 -54 -42 585 397 -675 122 -280 152
6989 152 476 -312 121 285 -406 -180 649 -95 -335 -85 678 394 16 -33 -395 -19 529 -622 325 294
7009B94m30K66k80L05L5K21n30j20J72Q51o68o2k07P19r64J57k80N29J58m53M74
7030A87o43l58Q19j33n5L25k62jQ2r9l4K75K6m63qL89k50mP87r20N33q44L53j54
7054d52j89L13K00l59L39J016p98n19J96L03j05L83j43m5N33o54P4J14q73L85
7074b81L60L0r8J49j74L27k31l25O20n45J28L88p12O87l74O9K7P7m7l00N13p8
7096B10QJ41m61J12j37J15K4k90O41o27k02K68R9N14j57k21K87m37L16K8j31K11
7118C11k70L56J13o65J83n3k17R88n21n83k5Q54p94m99L55M46l05O23o16M57n06
7139c68J8l67J198o42Q43m21p96J176m56n90M12Q48j085l62N92J61j301M62M61
7158b17j38N51l10L84o06P5P03l61l34L09k37R83j077R20j504J160j93o76L61
$$ plain form
7009 294 -136 130 -150 155 190 411 -119 -239 -67 784 116 54 -153 566 -398 -241 -521 8 166 -287 187
7030 187 -456 -814 5 -128 -183 142 -120 -121 -39 -138 -172 103 129 -334 -342 47 -203 -207 580 -340 193 -651 -298 -452
7054 -452 -641 -328 -128 -487 -148 868 70 -449 -253 50 -55 328 185 140 673 19 93 207 -666 -281
7074 -281 79 109 11 160 -14 313 82 -243 377 -168 -40 348 -364 323 -51 18 45 122 75 -225 288 210
7096 210 218 359 -102 10 -127 -12 12 -278 363 -264 -466 -198 -99 415 258 37 324 -113 203 231 100 311
7118 311 41 397 510 -155 28 -25 -242 746 225 -358 -383 471 -323 -822 -467 -21 -326 297 -319 138 -368
7139 -368 -350 -717 481 -161 682 261 -535 641 185 -405 7 855 -230 -592 0 161 -1140 -678 -217
7158 -217 -355 196 -114 270 -336 -261 442 81 -253 56 -181 802 -275 645 -859 301 108 -568 -207
7177b07N13m80K93j07j74P53l75q73P72l90l82Q91N21m58r07J188k52r44J04J647
7197A133j074m68K06o06J494j910M97K72K15j66j50M67l22j12L98R21j382Q57
7215B70n52K94k3j23J05m53N45L52j64M08l81j82M50p41K65o02P67m66M58j60
7235F7J36j401J369K06q61R12p66J301j651O81M43k16n39j85N07m2m74R33q54
7254d34j64Q98o43J85P66o81M8m06J039m06r97R81n41L49%N49L13j155O02j25
7274A78M07k03o75J94kj23N77L22q32k13q3L93J41l27M3L19j94m12R17n6l90K31
7296B12n08N28l69L53j92J78Q4j55J8m34M34Jk45R22o75q4o28j19R66r75J236
7317E48r44P75l01J4j95N36q32j25M08j28O05n10N88p10M69n83N22k12K30k29
$$ plain form
7177 -207 306 -174 119 12 -162 591 216 -657 115 -275 -657 234 755 297 -610 578 326 -618 -514 1133
7197 1133 59 -409 -203 -809 685 -1225 -728 -456 -241 -407 -557 -90 -412 -524 -126 795 -587 270
7215 270 -282 12 -11 -134 -29 -482 63 415 251 659 278 96 546 -195 70 -532 235 -231 227 67
7235 67 203 -1198 171 377 -484 428 -338 963 -688 -7 436 220 -319 -504 3 -39 -513 420 -434
7254 -434 -598 300 -343 -158 608 -73 -25 -431 608 202 -795 186 -355 -6 -6 543 856 -299 303 178
7274 178 585 382 -293 -99 -101 -224 353 675 -157 -370 -453 -60 81 -246 -203 116 -78 -490 427 371 -19 212
7296 212 -296 232 -137 216 24 202 286 131 149 -285 149 150 -95 827 152 68 -560 -679 287 -688 548
7317 548 -396 379 78 92 -103 433 -399 -524 -116 -244 361 -149 439 -271 198 -385 137 -75 155 -74
7337g4m05qO24o84M85L76l48n6q2K94j09L71l0p20k96J339j030K84k67J81M67
7358C12j90K93n36K83n69P59J45m63q1P99q33m1p91O85j15K17J7m2R1l74O16J62
7380C44n12K73o94J082n18M38r4n90P63l38K92j82p2m15M82n9j96O02k37q18R1
7401c58P87j076j24R91Ql17J48M22l12k08N06r2p06J05M09r7M16R2p97K85m24
7422c42J83K89J39m51J207j257P84n80l83P25j520Q57K52j3k84J43k33J082j099
7441e01Q75q98r0J3Q17L10p98K5N11p9o85J246r43q9j4k0M73K94j005Q30l02m81
7463e11J264o01m05n5J021j346R42J06k39k94j29Q92j083M9m51O17L94K32q94
7482d91O09k98R2L87K58n11q9l59L54K83J47n61L52M6L51q65K83K86k81N94k70
$$ plain form
7337 -74 -479 -487 137 -547 -62 314 -34 -90 -172 122 13 384 354 -366 -662 677 -353 -69 -336 -155 312
7358 312 122 415 -121 162 -407 352 497 34 -47 752 -81 -122 -913 -228 -343 -126 -109 -151 -60 -434 182 344
7380 344 -168 105 -589 493 -25 413 319 -271 492 154 446 264 192 -223 259 200 4 606 369 -449 -358
7401 -358 429 -647 -771 220 228 -89 59 481 169 -39 467 375 -331 -226 183 86 502 594 -203 82 -342
7422 -342 -159 130 269 -182 1025 -232 552 -28 -411 314 -1206 -349 -97 -110 -394 -251 -484 598 -501
7441 -501 374 -524 -614 -601 216 526 -272 -247 264 185 -500 746 -197 -286 -300 -320 153 447 -558 272 -30 -511
7463 -511 753 152 -253 -308 713 -633 309 415 176 -118 -247 645 -438 -389 -840 -223 171 403 -491
7482 -491 118 -180 -88 299 557 46 -43 -402 -48 235 382 -179 173 219 570 -295 -12 274 -7 587 317
7503C17l15l09L37q0j50k27N9Q74j92n43j96N94K23Jp06K93L1J39q47R73q05L50
7525a79O93q80P6J37J079j250K01M89n2o88K47p17L17K11jJ15K45k90L32Q0n15
7546c50N26J57p48M96j80P30q64L28n20J072l41q93R46n99n0J79L32l89M92n35
7566b11q2N80j56m7n02M30r65O31J42k07J061r64N34r4J87m62J70K3K89o14K2
7587b35l1L97n55Q79J11o77O75m76R7k51l59P00p78l9q1R88P32p34j14k61j51
7608a63J71J93k67K20k67n76Q11p70J236j003j4N89j58K0l94L39K35l97R99r14
7628a10q3j93R5m15J52M89m23J289j266o0Q85P6p05L98N18j47L19n05k71p36M54
7649b39K02J78m59M54l70N90o65P4K78j93q0LP23j709J286P42m45k06M5k20n5
$$ plain form
7503 317 2 -307 30 -50 -200 -427 -368 506 314 -229 -425 169 392 393 -313 -20 11 150 -697 276 -529 -179
7525 -179 514 -366 -290 -153 926 -324 -123 366 314 -374 -127 -844 -527 -316 -317 -202 43 -247 85 165 -350
7546 -350 176 333 -415 81 -99 631 -233 95 -425 647 306 -587 359 -240 -290 -111 221 -168 324 -211
7566 -211 -293 287 131 84 -418 12 -953 -322 -180 -387 674 -290 244 150 337 -125 45 68 357 -257 -235
7587 -235 -266 131 -424 455 566 -111 564 88 185 -66 -425 275 -503 -542 -623 365 1097 363 249 -12 -163
7608 -163 8 201 -66 154 -113 -689 122 -648 588 -415 -429 160 2 22 -372 -33 202 -195 804 -110
7628 -110 -193 -386 -291 -706 -554 -65 -488 801 -465 -525 360 436 -269 129 647 500 819 314 43 -693 -239
7649 -239 -37 141 -318 136 -234 356 -309 -235 43 -150 -230 -227 496 -1213 73 815 370 164 209 -11 -66
7670f6K84Lk82k07N23l71m2N52rn97j97M85J67l63j48L54O30j068R0j82K42j93
7692c95M13N39M05p50n24P7R4j87P36r74M5J0K28Q65r27M56N9n67M50p8K06j74
7714GO38j121l51O21J45k01l33Q57j189J226j57l08R35m75P36m96l58Q6N00m21
7734C41Q5K48m67k01l06L29k08l85J270k86j09j223M89J181j088J21N93K40n5
7753E69o21j63K5P40p62M96J06q61O2m2O10m27K65n46j33J251j053O01m5J89j84
7774G7j11J5PL92j68K64q96P67n10K86K44j7n21M66j71N3j37L2k7M9j07j98k79
7797d90M80q7N34n05K68Kj28k10J31L00O4l50M42l54l76q2O82k95L7j78K38k49
7819a26P82k86n17P94r61O65j97P8r7J75n40r5N76J5k75q9L63q39N90q83R72M50
$$ plain form
7670 -66 218 221 -61 -268 255 -116 -158 394 385 -212 -409 76 243 -120 -268 86 716 -352 -262 -444 -202 -395
7692 -395 18 557 962 212 -312 -235 -141 -328 408 -566 -521 -511 -283 582 -345 111 170 -397 53 -25 181 7
7714 7 645 -476 -827 -206 -61 -262 -595 262 -927 299 142 -166 769 294 1030 534 176 262 762 341
7734 341 426 674 207 6 -300 29 -179 -564 706 420 311 -912 -423 758 -330 -209 384 624 569
7753 569 -52 -215 -190 550 -212 284 390 -471 -409 -451 159 -268 -3 -549 -682 569 -484 117 72 261 77
7774 77 -34 -19 -12 380 212 476 -420 347 -163 123 367 350 -171 295 124 177 40 72 45 94 -13 -211 -490
7797 -490 -10 -97 437 -68 200 202 74 -136 -5 295 359 9 451 97 -279 -361 321 26 63 -115 123 -126
7819 -126 656 370 -147 647 -314 351 154 232 135 310 -230 -325 251 266 -9 -98 265 -574 16 -867 105 555
7841E55j80o35J39J14o11O10j31K13J13N9j020J199l29L1l80M95k27L73n73P47
7861E62q20M74l0K65p3j53L84n92r7M76J91r83O12r13R60j049N92j03M95k35M5
7882Hk32Q7lr8JJ7j37M30O26j084k31Q97L95n69j72l53M91j46L50n00M53l70J12
7905b8j00n8p5J75p6q1M04o26J02J66N5k34J011o27n75M06J05k63l4K28K40q26
7927g11Q16n0K69l32l10j56N06j0l34R3L72l88M87o3l12P4o42N69m19J255n02
7948B12K1R8k86j84K04k0k85K55n89K90O59p78R15o12L30Q2j28M16j144O31Ol32
7970b39L15k87P14m09O21q96K60J97O9n55k11K88j8j25q8N33p73N75l98K38O0
7991a29j12L21p67Q89p67J376q98j34J77j93P08q72J004r40j05O00j08l46L52
$$ plain form
7841 555 375 -260 -121 -7 -618 -8 -139 74 187 246 -774 425 96 127 -253 242 15 388 -185 562
7861 562 -258 216 186 451 378 225 609 17 -80 396 587 -396 216 -697 263 -786 -194 -297 198 -37 8
7882 8 -224 -137 -140 -238 -237 -220 -357 73 699 -385 -616 281 676 107 -65 -418 73 -73 277 -223 230 -140 -28
7905 -28 -128 -186 -261 -86 -162 -243 161 -465 -363 -197 -142 -376 635 8 -567 -161 -56 -319 -353 -125 115 -711
7927 -711 105 55 324 -8 -318 -474 32 22 -312 -219 153 -235 252 189 -123 -49 -691 -122 -541 714 212
7948 212 233 331 45 -139 65 45 -240 15 -574 -284 375 -403 512 -100 230 312 184 600 -544 87 93 -239
7970 -239 76 -211 503 94 715 -181 79 276 345 -210 -421 -133 -151 -276 -364 169 -604 -29 -427 -189 -129
7991 -129 -241 80 -687 202 -565 811 -87 -221 -44 -237 471 -401 603 -337 -442 158 50 -296 56
8010E6J22J68l42r2J04M52j81q93O10J66K37m60J54M0M78m67j12k63L4N48p07
8031c48L00K29J18L5j160P08L11j14M33o68N61p09L12j01k81L42M2N6L50m11k31
8052b26L46l80P31l20l01K06o9l78Q77j15r53J367j447O35j21K8M29o52j2k05
8072e60k11R05n46J58O73m51M12p89L48n12L64L86l27O73m32P3p03J76Q37m18
8092E6K73k44L04n81k75L84q34P61k00J49n9L96K28m48P63q43R22r02O18k48k3
8113A97l38RK39n96L24L91K09L46k96j348J003q6p26M49J36N0j54Q83n06J07m00
8134a07M25j20j265J053M41n84J40k09Mo80L05J58O60J39k35q0r60P33m77Q20
8154A61j059J137p81M42n60N80M3j87Q40Q1o97J16K30p33L94o6k60K07m81L3R95
$$ plain form
8010 56 178 346 4 -88 16 468 287 -606 4 170 407 -53 101 141 619 152 40 -223 -189 359 -348
8031 -348 -48 181 299 334 -826 -118 193 79 512 -156 405 -304 8 -93 -374 -32 10 66 416 5 -226
8052 -226 120 -260 471 151 -150 56 -13 -391 486 371 -582 785 -662 -27 -148 -120 309 -343 -355 -560
8072 -560 -771 134 -412 -254 419 -32 380 -409 -61 -573 -209 177 -150 523 91 164 -539 -363 474 56
8092 56 329 85 389 -192 -467 -83 -917 -156 -356 -207 -266 130 358 -90 673 -170 752 -150 468 220 197
8113 197 -141 -132 107 -489 -165 226 435 781 485 -863 140 54 -672 -223 -87 -37 -191 692 186 293 -107
8134 -107 318 198 -1067 -14 427 -157 -17 -226 -222 -902 -597 -439 221 360 125 45 -915 -182 -659 161
8154 161 -898 239 -542 -100 -660 -80 -37 -224 616 697 0 116 346 -387 7 -59 -319 -112 -593 -560 435
8175D35P5m7q47M55k83k73j17O49k61N78J84p0r0n54l95j77
$$ plain form
8175 435 510 463 -384 71 -212 -485 -602 47 -214 364 548 478 388 -166 -561 -738
8191g38
$$ Imaginary data points
##PAGE= N=2
##DATA TABLE= (X++(I..I)), XYDATA
0@%%%%%%%%%%%%%%O4j28J28j28J28j92K56k56L20l84M46n22N88p04Q14r23J052
31E59j188J345j524J718j926K161k423K705l015L360l733M131m567N050n578O148
47C223o778P469q228R064r987J1012j2154J3431j4876J6525j8419K0624k3233
60a2327K6382l0254L5140m1533N0282o2977Q3092j19642K05937p47195o34721
71a247816J186304r06535k47794j69192k56014O36417j1587L44329M45728k58150
81d84310N83904R6492J46053M72551j15011M43198N1226m70111K31218j20635
91H34575j55152j03790k60520j10806l82171k10685j14332j65449J22725k24090
101g69695q0688Q6091n3588K74003P9219J63908K42708p4503L36654Q6835q538
$$ plain form
0 0 0 0 0 0 0 0 0 0 0 0 0 0 0 0 64 -64 64 -64 64 -128 128 -128 192 -192 254 -268 320 -384 430 -493 559
31 559 -629 716 -808 910 -1016 1145 -1278 1427 -1588 1772 -1961 2170 -2397 2653 -2925 3223
47 3223 -3555 3914 -4314 4750 -5237 5775 -6379 7052 -7824 8701 -9718 10906 -12327
60 -12327 14055 -16199 18941 -22592 27690 -35287 47805 -71837 134100 -613095 -1247816
71 -1247816 -61512 -968047 -1215841 -1385033 -1641047 -1004630 -1016217 -671888 -226160 -484310
81 -484310 99594 196086 342139 814690 699679 1142877 1194103 723992 955210 834575
91 834575 679423 575633 315113 204307 -177864 -388549 -502881 -668330 -545605 -769695
101 -769695 -850383 -764292 -817880 -543877 -464658 -300750 -58042 -132545 204109 290944 282406
112B82406L82418p8239K0319P847j78716J84588k01031j36914L0154l50058k0991
123e8217j27609j61991J10476k55538o020M7926j50343K24780M7125L3257J55729
134a40425p670J99534O4946O4087K18201l6701N8298p775q3135R3320j01683o0728
146B60269o4225j91727k7745j16844p1011j4563j30430J6858m7646q427J19118
157b76373r418J11706O8484K1203J60883L5012J07418R9701j6874P5351o0879
168C16214j5026L9483j14390j4612j11208j37444j4809j36832k7753k8144j11604
179c56125L7881m4833J3211R9751M631J15791N7201L4317J44375L4232Q5879Q3211
191C09522j2622N1378k8102k9132R531p8052m9994q5595j09809n1529q5629m9833
$$ plain form
112 282406 664824 586585 606904 614751 436035 620623 419592 282678 312832 -37226 -58217
123 -58217 -185826 -347817 -237341 -492879 -498899 -450973 -601316 -376536 -329411 -296154 -140425
134 -140425 -148095 51439 116385 180472 398673 361972 420270 412495 329360 422680 320997 260269
146 260269 196044 4317 -23428 -140272 -211283 -225846 -356276 -339418 -387064 -395491 -276373
157 -276373 -285791 -174085 -105601 -84398 76485 111497 218915 318616 301742 377093 316214
168 316214 301188 340671 226281 211669 100461 -36983 -51792 -188624 -216377 -244521 -356125
179 -356125 -318244 -363077 -349866 -250115 -245484 -129693 -72492 -38175 106200 140432 226311 309522
191 309522 296900 348278 320176 291044 300575 222523 172529 86934 -22875 -74404 -160033 -209866
203b09866m6375o2988r901j4485J9778M6605M9939P6987N4227P0365Q0358O9360
215A24004Q8864M3892L2995K5013j3532M254k7708m3790m4119r1047o6009o9866
227c7049p6924m0058o8007m3012k3030k9077K4963K0913L7046O3548L9143P1145
239f0399O7264O4411Q4756M1890M1902K9420k456J4817j9347l1358l3353p3601
251A23946n3950o1674o7867m0188n9965m4139k7555k9552R428J5197K1545M5234
263a69540L3882N0079O0923N3958O5042M9627L4236L0622J0812P436L82k1909
275B05550l2898m2822n4820n0647m6391n0850m1017m0675l5875j3615n809R379
287b00490K4903K1012L5505M0942M0766N6146M6529L9948L9325J5090J7178J1093
$$ plain form
203 -209866 -256241 -319229 -329130 -343615 -323837 -277232 -227293 -150306 -96079 -25714 54644 124004
215 124004 212868 256760 289755 314768 301236 305490 277782 233992 189873 98826 32817 -37049
227 -37049 -113973 -154031 -222038 -265050 -288080 -317157 -292194 -271281 -234235 -170687 -131544 -60399
239 -60399 6865 71276 156032 197922 239824 269244 266788 281605 262258 230900 197547 123946
251 123946 69996 8322 -59545 -99733 -159698 -203837 -231392 -260944 -251516 -236319 -214774 -169540
263 -169540 -135658 -85579 -24656 29302 94344 143971 178207 208829 219641 227077 227459 205550
275 205550 172652 129830 75010 24363 -22028 -72878 -113895 -154570 -190445 -204060 -209869 -200490
287 -200490 -175587 -154575 -119070 -78128 -37362 18784 65313 105261 144586 159676 176854 187947
299A87947p333o723k9547l8260l5987m9390l9591l6523m2580l1190k9665j9040
311a77882J208L048K0006K7895K1641L8143L9846M0900M8907L2752K6622K4254
323A47340P177P991J267j7927j8661l4203l9905l3028m1554l1701l0858l6431
335a20493k1301j5619o945J2683J1119K2790K9255K5214M0935M2090L6566L9040
347I5334K2931J8648J5232N24J597j0267k6483k6970l7324l5732l0100l7996k9756
360h0362k6541k8796j2296l281M017J7200J5770K4148L0197L1432M0918L6176
372D8582K9624L0146J6950J1868J1339k875p652j8207l1319k7175l4783l4347
384g849k7714l3702k8126k2454j8037k334K889Q589J9171J6072K7139L4051K9800
$$ plain form
299 187947 180614 173891 144344 106084 70097 20707 -18884 -55407 -97987 -129177 -158842 -177882
311 -177882 -176674 -173626 -153620 -125725 -104084 -65941 -26095 14805 63712 96464 123086 147340
323 147340 154517 162508 163775 145848 127187 92984 53079 20051 -21503 -53204 -84062 -120493
335 -120493 -141794 -157413 -164358 -151675 -140556 -117766 -88511 -63297 -22362 19728 56294 95334
347 95334 118265 136913 152145 152669 154266 143999 117516 90546 53222 17490 -12610 -50606 -80362
360 -80362 -106903 -135699 -147995 -151276 -147259 -130059 -114289 -90141 -59944 -28512 12406 48582
372 48582 78206 108352 125302 137170 148509 145634 137982 119775 88456 61281 26498 -7849
384 -7849 -35563 -69265 -97391 -119845 -137882 -140216 -137327 -128738 -109567 -93495 -66356 -32305 -2505
397b505L7928K9343K1705K3248J1571R410M600r980j2973k4138k8236k4316l2502
410C155k9418k5723l1453k0601j5163r727N839N954J0050K0514J9226K9305L2812
423e230K6361L0684K1032J4953J9379P077K810j179j7569j5778k1708k7581k0454
436A2797k7654k9209j9684k5001j3735l782o505R480Q920J0520K3738K1517K6924
449a1674L1901J9030K2572J7524J0058J5258J653n417o877k1100j9026j6305k6117
462A1480k1006k4748k5205j4110j5971q174K266m12R449J3441J3069K3971K5331
475a0619K3046K4852J5525J5741J7987P128M803j143j3412j1810j7520k1381j8716
488A4481k3725k3707j8362k0473j1396o541l943M698O944R296J7523J8664K2427
$$ plain form
397 -2505 35423 64766 86471 109719 121290 130700 135300 125320 112347 88209 59973 35657 3155
410 3155 -26263 -51986 -83439 -104040 -119203 -128930 -123091 -117137 -107087 -86573 -67347 -38042 -5230
423 -5230 21131 51815 72847 87800 107179 114256 117066 115887 98318 82540 60832 33251 12797
436 12797 -14857 -44066 -63750 -88751 -102486 -106268 -112773 -103293 -94373 -83853 -60115 -38598 -11674
449 -11674 20227 39257 61829 79353 89411 104669 106322 100905 94028 72928 53902 37597 11480
462 11480 -9526 -34274 -59479 -73589 -89560 -97734 -95468 -95880 -86431 -72990 -59921 -35950 -10619
475 -10619 12427 37279 52804 68545 86532 93660 98463 97320 83908 72098 54578 33197 14481
488 14481 -9244 -32951 -51313 -71786 -83182 -89723 -93666 -88968 -82024 -72728 -55205 -36541 -14114
501a4114K5951J7881J7842J5629J4674J1409L818l102q773j0328j6556j8170j9209
514A6952k3031k0628k0742j8392j1958q301k122L206K524J1081J4323J6207K5244
527a5637K0391J8314J8976J3280J4899J2987J904p79o252j0457j0840j7307j9452
540B0027j7657k1446j7983j6727j4991p115l254k532M770O671J1231J9637J8006
553b1363J7933K0021J4200J6474J5149R180P747j213o250m165j3157j2499j4903
566B7154k1607j4984j7038j9244j0372j0305m108N50j946N609J1623J2699J8324
579b3645J6083J4507J7448J4597J4043J1039N247J068j773p379q820j1998j4701
592B5716j4835j7511j6587j4288j2700p096m533k747O18L146Q538J4571J4505
$$ plain form
501 -14114 11837 29718 47560 63189 77863 89272 93090 89988 81215 70887 54331 36161 16952
514 16952 -6079 -26707 -47449 -65841 -77799 -86100 -88222 -85016 -82492 -71411 -57088 -40881 -15637
527 -15637 4754 23068 42044 55324 70223 83210 85114 84335 78083 67626 56786 39479 20027
540 20027 2370 -19076 -37059 -53786 -68777 -75892 -79146 -81678 -76908 -70237 -59006 -39369 -21363
553 -21363 -3430 16591 30791 47265 62414 71594 79341 78128 71878 67713 54556 42057 27154
566 27154 5547 -9437 -26475 -45719 -56091 -66396 -70504 -69954 -71900 -66291 -54668 -41969 -23645
579 -23645 -7562 6945 24393 38990 53033 64072 69319 70387 68614 61235 52415 40417 25716
592 25716 10881 -6630 -23217 -37505 -50205 -57301 -61834 -64581 -63963 -60817 -52279 -37708 -23203
605b3203J2966J4530J5175J3251J3894Q480N805K818j524n620q028j0950j2191
618B5403j2966j7553j4787j4252j2223n863n764l994K646J499Q776J3711J0454
631b4913J5338J3642J1771J5610J0772Q823P260j277J422l305j0444p620j1543
644B5536j4230j2469j7021j3565p897j0637m817k843k188O177P138Q579J5260
657b2977J0871J3819J5385J0583J2423J0500K273O031j541n821l346j1239j0603
670B6358j0322j7418j1585j3134j2236m543q447n279K038N20O842J0551P745J4447
684a4463J2148J1075J5936R238R959R017P65J072j754p678o082j0051j2799j1674
698D709j5530j1192q154j0507m929m465l244M056K951P506J0662R525J1226J3565
$$ plain form
605 -23203 -10237 4293 19468 32719 46613 55093 60898 63716 62192 56572 48544 37594 25403
618 25403 12437 -5116 -19903 -34155 -46378 -52241 -58005 -61999 -59353 -57854 -49078 -35367 -24913
631 -24913 -9575 4067 15838 31448 42220 51043 58303 57026 58448 55143 44699 37079 25536
644 25536 11306 -1163 -18184 -31749 -39646 -50283 -55100 -57943 -60131 -53954 -46816 -38237 -22977
657 -22977 -12106 1713 17098 27681 40104 50604 52877 58908 57367 51546 48200 36961 26358
670 26358 16036 -1382 -12967 -26101 -38337 -42880 -51327 -56606 -54568 -54048 -47206 -36655 -28910 -14463
684 -14463 -2315 8760 24696 33934 43893 52910 53675 54747 52993 45315 39233 29182 16383 4709
698 4709 -10821 -22013 -30167 -40674 -45603 -50068 -53312 -49256 -46305 -38799 -28137 -18612 -7386 6179
712F179J0011J2136R853N641N352K34j201l119p687p008j0423j3504j0506j2548
726a6590r829p257q723m133j152m48N158O403Q645R057R289J1689J0291R653J0375
741C2428O429L671J728j685j650n074o867r579j1080j1068r201r916p650o109
755c5623n407j885k72L314N723P283Q022R910R058J0019J0011Q493O124M017J216
770D0003j01k628l891o860q814p781j0594j0001o573r212o277l190m251K158J311
785c6701M482O478P243Q868R175Q800J0437P733N134N207P92P8j476m675n752
800B5823p455r481r118q607p911o316p188l823k567J2K185L703N841P635P471
815i796P750Q527Q992Q711N017M606J580O7j520k728o059o750p829r637p779q021
$$ plain form
712 6179 16190 28326 38179 43820 49172 49406 48205 45086 37399 30391 19968 6464 -4042 -16590
726 -16590 -26419 -33676 -42399 -46532 -47684 -48132 -42974 -36571 -27926 -18869 -9580 2109 12400 22053 32428
741 32428 38857 42528 44256 42571 40921 35847 28980 19401 8321 -2747 -11948 -21864 -29514 -35623
755 -35623 -41030 -42915 -43187 -39873 -34150 -26867 -18845 -8935 123 10142 20153 28646 34770 38787 40003
770 40003 39902 37274 33383 26523 17709 9928 -666 -10667 -17240 -26452 -32729 -35919 -40170 -38012 -36701
785 -36701 -32219 -25741 -18498 -9630 -455 8345 18782 26515 31649 36856 37648 37726 36250 31575 25823
800 25823 18368 8887 -231 -8838 -16749 -23065 -30253 -34076 -36643 -36631 -34446 -30743 -24902 -17267 -9796
815 -9796 -2046 6481 15473 24184 29201 33807 35387 35454 33934 31206 25147 18397 10568 931 -6848 -14869
831a4869o202o269m830l241M8R79M481N143N941Q009O942R314P876O984O605L872
847C0783J927J064j275k157m784p006o575q490p452p739o803o769l825l533j23
862c2757O83L022M676N699O455O830Q842P933O618N018N291J779J009j48k979
877B7971l031n571p511o557o959p157o189o275m595l255j284J726K079K804N435
892a8369N380P064P744O763O866N663K949M071R93r58j691l621m560n950o685
907E659o379o852n511n018n348k782j128R9L017K287M316N472N665N822P918O059
923A3296M273M153K685J664j22m04l806m362n905o257n921n206n556o070m579
938b2117k504j390R44P23L308M236L893O987M941N690O861M355L779K678J424
$$ plain form
831 -14869 -21071 -27340 -32170 -35411 -35363 -34384 -29903 -24760 -18819 -10810 -3868 5446 13322 20306 26911 30783
847 30783 32710 33774 32499 30342 25558 18552 11977 3487 -3965 -11704 -18507 -25276 -29101 -32634 -32757
862 -32757 -32074 -29052 -24376 -18677 -12222 -5392 3450 11383 18001 23019 28310 30089 31098 30950 27971
877 27971 24940 19369 11858 5301 -1658 -8815 -15004 -21279 -25874 -29129 -30413 -28687 -26608 -23804 -18369
892 -18369 -12989 -5925 1819 8582 15448 21111 24060 28131 29124 28166 26475 22854 18294 12344 5659
907 5659 -720 -7572 -13083 -18101 -23449 -26231 -27359 -27260 -24243 -21956 -17640 -12168 -6503 -681 7237 13296
923 13296 17569 21722 24407 26071 25949 25545 21739 17377 11472 5215 -706 -5912 -11468 -17538 -22117
938 -22117 -24621 -26011 -25067 -24344 -21036 -16800 -12907 -5920 -979 4711 11572 15927 19706 22384 23808
953B3808J253j357k629l932n617n077n311o426n629n139l620l641m98m42J346
968b2911K826L773L945N543N699O175M947M589L443L195K132j12o52k196m250
983A6146m533m559n767n363m862n009l577k727j426n87J361J048L360M397M582
998g516N483M636O372M487L942K696J382P34j563j775k992l405m962n546l517
1013a544n833m626l868k915r57k82L99J725K284L470M139M206O335N022L030M212
1029A4797K984R84J638j05j692l177m103m084m049o233l462m360l493j382k809
1044a8546r74R80J100K343L872K915N260M677L697M753K041L001L620m95O62j213
1060A7693m187j392m578m403l202m950m251k194m163j416m84j50J598K466K756
$$ plain form
953 23808 25061 23704 21075 17143 11526 6449 1138 -5288 -10917 -16056 -19676 -23317 -23815 -24257 -22911
968 -22911 -20085 -16312 -12367 -6824 -1125 5050 9997 14586 18029 21224 23356 23244 22592 20396 16146
983 16146 11613 7054 1287 -4076 -8938 -13947 -17524 -20251 -21677 -22264 -20903 -19855 -16495 -12098 -7516
998 -7516 -2033 2603 8975 13462 17404 20100 21482 22216 20653 18878 15886 12481 7519 1973 -1544
1013 -1544 -7377 -12003 -15871 -18786 -19743 -20025 -19626 -17901 -15617 -12147 -8008 -3802 2533 7555 10585 14797
1029 14797 17781 18765 20403 20298 18606 15429 11326 7242 3193 -3040 -6502 -10862 -14355 -15737 -18546
1044 -18546 -19520 -18540 -17440 -15097 -11225 -8310 -3050 1627 5324 10077 12118 15119 18739 18244 18906 17693
1060 17693 13506 12114 7536 3133 -69 -5019 -9270 -11464 -15627 -17043 -17527 -17677 -16079 -13613 -10857
1075a0857L754M016L555M546K824M418K584O74J644L26j860k394k859k810l057
1090D504n095l180m290l526j389k607j151J5J644J946J967L809L713M104L456
1105C920L431K851L319K093J055j87j358k621k471k259l524l795m212m112k605
1120a0475k495j767j254K71Q77J419K263L864L005L639M368K811L004L073J962
1135A4565P28L46j089j961j544l212m075l104m122k058l411l618p47j164l1K51
1151a4246J059K385L763K435M008K551L807L090K777J736Q41Q95j442j151j942
1166A0566k380l569k982k911m872j811k938j748o43m43P9K005J475K471L104K728
1182a869M158J634L126K264K702Q94J274j387n96k236k182j858l626k948l474
$$ plain form
1075 -10857 -7103 -3087 468 5014 7838 12256 14840 15514 17158 17484 15624 13230 10371 7561 4504
1090 4504 -591 -3771 -8061 -11587 -12976 -15583 -16734 -16719 -15075 -13129 -11162 -7353 -3640 464 3920
1105 3920 7351 10202 13521 15614 16669 16482 15124 12503 10032 7773 4249 454 -3758 -7870 -10475
1120 -10475 -12970 -14737 -15991 -15720 -14843 -13424 -11161 -7297 -4292 -653 3715 6526 9530 12603 14565
1135 14565 15293 15639 14550 12589 11045 7833 3758 654 -3468 -5526 -8937 -12555 -13302 -14466 -14497 -14246
1151 -14246 -13187 -10802 -7039 -4604 -596 1955 5762 8852 11629 13365 14206 15101 13659 12508 10566
1166 10566 8186 4617 1635 -1276 -6148 -7959 -10897 -12645 -13288 -13731 -13652 -11647 -10172 -7701 -4597 -1869
1182 -1869 2289 3923 7049 9313 12015 12909 14183 12796 12200 9964 7782 5924 2298 -650 -4124
1197d124l538j867j945j083j00R4J428J336J599K451M079L150J589L957K067K091
1213A1184M70R89j95j432r85k216k404l322k431k865l486j484j130j807K58r53
1229a1809P35J364K238K551J888L453K493J989K664K364P98R05j3p87j556j686
1245G591k561j968l380k893k819j279j340j060j367J91P07Q61J929J970K805J718
1261h95L285K095K468J718J743L13M04r66q78k261j874j951k575k788k277j755
1277f194k068j256j557Q51k26O09K335K411K602J604K667K483K059J652O22J659
1293A0253K36J88j832j498j900k390k186j761k691j555k707l94j550j02K79J096
1309h514r8K733K703J569K352K183L010M94J627J253J351j868m00j418n56k597
$$ plain form
1197 -4124 -7662 -9529 -11474 -12557 -12657 -12563 -11135 -9799 -8200 -5749 -1670 1480 3069 7026 9093 11184
1213 11184 11654 12643 12448 11016 10031 7815 5411 2089 -342 -3207 -6693 -8177 -9307 -11114 -10856 -11809
1229 -11809 -11074 -9710 -7472 -4921 -3033 420 2913 4902 7566 9930 10728 11633 11620 10833 9277 7591
1245 7591 5030 3062 -318 -3211 -6030 -7309 -8649 -9709 -11076 -10885 -10178 -9317 -7388 -5418 -2613 -895
1261 -895 2390 4485 6953 8671 10414 10727 11131 10165 9287 7026 5152 3201 626 -2162 -4439 -6194
1277 -6194 -8262 -9518 -11075 -10224 -10450 -9841 -7506 -5095 -2493 -889 1778 4261 6320 7972 8594 10253
1293 10253 10489 10677 8845 7347 5447 3057 871 -890 -3581 -5136 -7843 -8237 -9787 -9889 -9610 -8514
1309 -8514 -8612 -5879 -3176 -1607 745 2928 5938 6432 8059 9312 10663 8795 8395 6977 6421 3824
1325C824k124k060k393j634k487n63j993N31J37L55J680J866Q16J736K000K663
1341B354J559K063J690J017k71Q0K59j475n09k701k122j610k254k251r43k026
1357g140j275L62R7j21R23J413J789J560K185J928J305K050J872N30O48p9l58
1374G689j512j310r26j490j561k242j835j167j173p98j316m43R26N97O97J349
1390d515K432J329J860J971J173R69J440l6M10M03j623n76q60j541j879j973q62
1407a878k978n99j374K73p70J177o3R60J592L90K746J125J404J861J102R73J306
1424G247l24j014N16j556j055j557j920j080j372j291j150o52j439L62o51J222
1440e714J233R99J124J174J181K614J666R73k45K14J240q46K48q37j123j965j599
$$ plain form
1325 3824 1700 -360 -2753 -4387 -6874 -7437 -9430 -8899 -8762 -8407 -6727 -4861 -4045 -2309 -309 2354
1341 2354 3913 5976 7666 8683 8412 8492 8751 7276 6767 4066 1944 334 -1920 -4171 -5114 -7140
1357 -7140 -8415 -8053 -7956 -8077 -7154 -5741 -3952 -2392 -207 1721 3026 5076 6948 7478 8126 8047 7689
1374 7689 6177 4867 3941 2451 890 -1352 -3187 -4354 -5527 -6325 -7641 -8084 -7158 -6561 -5864 -4515
1390 -4515 -2083 -754 1106 3077 4250 5219 6659 6623 7033 7436 5813 5237 4377 2836 957 -1016 -1878
1407 -1878 -4856 -5455 -6829 -6556 -7326 -6149 -6212 -5252 -3660 -3270 -524 601 2005 3866 4968 5941 7247
1424 7247 6923 5909 6425 4869 3814 2257 337 -743 -2115 -3406 -4556 -5208 -6647 -6285 -6936 -5714
1440 -5714 -4481 -3482 -2358 -1184 -3 2611 4277 5250 5005 5219 6459 5613 5861 5024 3901 1936 337
1457C37j219j511p90r61j155j016l30J454m69O69J536K34J808J953J013J403J089
1474D045N84M44J265k64j026J27j531l96k460q00j378j265j209o31j89q45J43
1491e386J41J73J294J457Q71J434Q00K263R62J41J023N93l32m44k10p30j378j405
1509A267j938j85o41j873m06o58p97K71J23P68J99J770O68J327J207L94J686M82
1527C664J737m94L8j15m78j37j396j398n78j120j767j493J97j426k27J28o6J490
1545c441J5J681k1O30K491L89J177O42R06K79J09q3p16q42l29j309q86j197j057
1564a562p00j685j7l57k13n63J231J230P1J096O26J552R25J371J26J070R90n35
1582D656m33p23N7p79j123j902R4q45r54j666n25K21r03J89K58J149M48J433N56
$$ plain form
1457 337 -882 -2393 -3183 -4144 -5299 -6315 -6645 -5191 -5660 -4991 -3455 -3221 -1413 540 1553 2956 4045
1474 4045 4629 5073 6338 6074 5048 5175 3644 3248 788 -12 -1390 -2655 -3864 -4495 -4684 -5529 -5386
1491 -5386 -5245 -5072 -3778 -2321 -1450 -16 784 3047 4009 4150 5173 5766 5434 4990 4780 4050 2672 1267
1509 1267 -671 -856 -1497 -3370 -3776 -4434 -5231 -4960 -4837 -4069 -3870 -2100 -1432 -105 1102 1496 3182 3664
1527 3664 5401 4907 4945 4830 4352 4215 2819 1421 843 -277 -2044 -3537 -3340 -4766 -4993 -4865 -4931 -3441
1545 -3441 -3426 -1745 -1766 -1136 1355 1744 2921 3563 4469 4748 4857 4774 4058 3216 2887 1578 692 -505 -1562
1564 -1562 -2262 -3947 -3964 -4321 -4534 -5097 -3866 -2636 -2565 -1469 -843 709 1634 3005 3131 4201 5191 4656
1582 4656 4223 3500 3557 2778 1655 -247 -153 -998 -1952 -3618 -4143 -3922 -4825 -4636 -4378 -3229 -2781 -1348 -792
1601g92J376R25J69J880k98J353m06J53L27q14j318n18j139n99j447q06j416o77
1619d047L62p81L63P9O21J070P37K26J925R85N59L60K00J538M03r96j56J42l96
1638C194p83j745o94j013j444j32m07n92l76O80l76N22J278P00K25P06J232R21
1656A896L50J023Q82o29j3J21m62l70j198q94m65j14k069m39l54r53l39J08P69
1675c150j50N91J484P6K79J597R24J729l93j53O54m54J48N4n39p72k99j363r19
1694f56r69J56j392m02O8l74J410q82Q54R60L54O91J061M61J131j24J111n09J69
1713C118P72q53l06o97j185l53r71n79p17o91o35j42n98J377n43Q90O13N6J213
1732b31N27R34Q71R09M30L25p02k4n37L12j214m40p65n65p30j676J22k07m12l3
$$ plain form
1601 -792 584 1509 1678 3558 3260 4613 4207 4360 4687 3873 2555 2037 898 299 -1148 -1954 -3370 -4047
1619 -4047 -3685 -4466 -4103 -4024 -3403 -2333 -1596 -1370 555 1540 2099 2459 2659 4197 4600 3604 3448 3590 3194
1638 3194 2411 666 -28 -1041 -2485 -2617 -3024 -3616 -3992 -3312 -3688 -3166 -1888 -1188 -963 -257 975 1896
1656 1896 2246 3269 4151 3522 3509 3630 3168 2798 1600 706 241 127 -1942 -2381 -2735 -3688 -4027 -3919 -3150
1675 -3150 -3300 -2709 -1225 -1149 -870 727 1651 3380 2987 2834 3488 3034 3182 3236 2697 1925 1626 263 -656
1694 -656 -1625 -1469 -2861 -3263 -3195 -3569 -2159 -3041 -2187 -1227 -873 -182 879 1340 2471 2347 3458 2949 3118
1713 3118 3890 3037 2731 2034 849 496 -475 -1054 -1771 -2462 -3097 -3239 -3837 -2460 -3003 -2113 -1500 -1444 -231
1732 -231 296 1230 2101 3010 3440 3765 3063 3039 2502 2814 1600 1160 395 -170 -900 -2576 -2454 -2661 -3073 -3106
1752c106p22P51m92J487O05P00J305J52R63p21K216k55J97l55l90K30n13m94j115
1771D43k35j333k79m39r85O87q64M59J69N76L28N79K07L78N64J321L43L59L89
1790B667l54R3M51m43k73o40l77o14j332l63j135Qm50M34o28Q58j96N33R17n81
1810a425J160R74L46O36J81M66K22P29j100M82j005n5l28q76m87q92o64o65Q8
1829b213j50M86r78N18K51M87O31P99Q57L64M22K98N13j37k64Q93r02K35o56j64
1849A290j226k76o9p37l39J06j619L96O23P0k68R19n2M94Q60O9O45R37M96ml12
1870B003J28q5l37k75o41k22j062J50k5j294k51j61n68J136o04Q43n17J202J072
1889D92k76k6J369o99J341m14k97J109j495K64p25J100j565o80J52l05p96O9k01
$$ plain form
1752 -3106 -3828 -3077 -3569 -2082 -1477 -777 528 680 1643 922 3138 2883 3080 2725 2335 2565 2052 1558 443
1771 443 208 -1125 -1404 -1843 -2828 -2141 -3005 -2546 -2377 -1801 -1473 -894 -687 -309 255 1576 1919 2278 2667
1790 2667 2313 2406 2857 2414 2141 1501 1124 510 -822 -1185 -2320 -2312 -2762 -2328 -2956 -2098 -2294 -1761 -844 -1425
1810 -1425 -265 709 1055 1691 1872 2338 2560 3289 2189 2671 1666 1611 1283 407 -80 -972 -1636 -2301 -2213
1829 -2213 -2363 -1877 -2855 -2337 -2086 -1599 -968 -169 688 1052 1474 1772 2285 2148 1884 2777 1875 2110 1454 1290
1849 1290 64 -212 -281 -1018 -1357 -1251 -2870 -2474 -1851 -1781 -2049 -1130 -1182 -688 172 241 886 1823 2319 2315 2003
1870 2003 2131 2046 1709 1434 793 571 -491 -341 -366 -1660 -1911 -2072 -2640 -1504 -2108 -1265 -1782 -580 492
1889 492 216 190 1559 860 2201 1787 1490 2599 1104 1368 643 1743 178 -502 -350 -655 -1451 -1382 -1583
1908a583j12k21j21J492M2M5L73N51k6L71n5J96J262k40L08l18m59n08l25p75
1928a03m6K44q10m40j53J45O5K18m19m17O44K29L40J036J60l55Q41M7P52Q1m8
1949B011o53j50l16k01m91P9o41q36P4M80p38J58N57q24L85N95q37P38L4J545
1969I69m85l14J030l21J21N18K39m47p49j96J28n81q7k67l06O2m25L22j185N15
1989a459K60L57JN2J081l67J161O2l35M86l61M01Oj98K42q91J15k46o14m25J52
2010e20q87L80k6M73k90m25M85l57O41Q86n28O10L25r2Q56o9L51j2j02j218p5
2031D06l34P96j689Q70o22r0k50j84k58M73K03m13K38o3O91P19k5J96j47K11j40
2052E88N91K3N07j024L36j114K48K10j581N43p33K24J34m28Q9P62j32O97m73J40
$$ plain form
1908 -1583 -1695 -1916 -2037 -545 -503 -458 -85 466 440 811 756 952 2214 1974 2282 1964 1505 997 672 -103
1928 -103 -149 95 -715 -1155 -1308 -1163 -1098 -880 -1299 -1716 -1072 -843 -503 533 693 338 1179 1226 1978 2059 2011
1949 2011 1358 1208 892 691 200 279 -362 -1198 -1124 -644 -1382 -1224 -667 -1491 -1106 -511 -1348 -610 -576 969
1969 969 484 170 1200 879 1000 1518 1757 1310 561 365 493 -88 -175 -442 -748 -686 -1111 -789 -1974 -1459
1989 -1459 -1199 -842 -841 -789 292 -75 1086 1148 813 1299 938 1339 1345 1147 1389 498 613 367 -247 -672 -520
2010 -520 -1407 -1027 -1053 -580 -870 -1295 -810 -1167 -526 360 -168 442 767 675 1531 1462 1813 1801 1699 481 406
2031 406 72 868 -821 49 -573 -663 -913 -1097 -1355 -882 -679 -1092 -854 -917 -226 493 468 664 517 728 588
2052 588 1179 1202 1709 685 1021 -93 155 365 -1216 -673 -1406 -1182 -1048 -1476 -1387 -625 -757 -60 -533 -393
2072c93K07R34m62R13o71N82k77m35m67N23R44j214j17l42J75n33L87r37M6K61
2092h76jk45J96O00J64K53K94J60l96M62j46P84p43L53M03j105L49l07K13n85
2112a73m01j5N6k6o49J195j140J321n55l15n16J108R27q03j94P83Q03n28L1m06
2132E03N90j53k38j360J010p94L71m95k02M91p92P10K62j037M80N48K1K4O26k79
2152B86J30R7K19M15j083P05l93M1M09k85n38l13j26O04k91k11O90p13k63J82
2172d38j64L82j86R51k75P7N41m01K8m2o16J452k43r17k10K78O0o20J25j329K83
2193a264J045k43l08j56j3P55Q0n77R68l79P47m64O70L53j098J64K98L39o41k23
2213E3L61r37L27j39l70R2Q36j212N98N4j35P71L2m95L66l90M92L95QP0K87m95
$$ plain form
2072 -393 -186 748 286 1199 528 1110 833 398 -69 454 1398 184 67 -275 -100 -633 -246 -1183 -1137 -876
2092 -876 -877 -1122 -926 -326 -162 91 385 545 149 611 465 1249 506 859 1262 157 506 199 412 -173
2112 -173 -574 -589 -533 -559 -1208 -13 -1153 168 -387 -702 -1218 -110 817 14 -180 603 1406 878 909 503
2132 503 1093 940 702 -658 352 -442 -71 -566 -768 -277 -1069 -359 -97 -1134 -654 -106 -85 -61 565 286
2152 286 416 513 732 1147 64 769 376 417 826 541 3 -310 -436 168 -123 -334 356 -357 -620 -438
2172 -438 -602 -220 -406 545 270 347 888 487 515 473 -143 1309 1066 149 -61 217 277 -343 -218 -1547 -1264
2193 -1264 -219 -462 -770 -926 -939 -184 -104 -681 287 -92 655 191 861 1214 116 280 578 917 276 53
2213 53 414 -523 -196 -335 -705 -613 223 -989 -391 -337 -472 299 331 -164 202 -188 304 699 707 777 1064 569
2235E69j187J319n92K52n42M6j103J105m30L24j60j41J266p60K64n24J49N00o29
2254b74L21k1Q30m7n71j91%M41N8n36K36n58O41l62q8m5l81M34m11L41p14M14
2276d83O81n4K4j69O59l22m00K42q1l7L83k09J90O3n09P59j100j58J42N54m05
2297b30o63Q04p54M32J48L3k1M44m32L58K26J55M15j071N35l89N96l47nM44q22
2318a44k59N1N54o2q81K90m5k16N23L61J64r78Q53k04l82N55m79J28R04o20M73
2339E86J7j44m80l26Q2M31m40M22j032K08N40o29J50K44m0N00k91O61l77N31m71
2360A42O29k62k9O22Q5r71l87R64p86l51l02P21l44n83Q32r49N43k05K3P78j085
2381i15R24J11O31j220R75j92R01o60j07o22J226j095K64L17K01j233Lm72L3J44
$$ plain form
2235 569 -618 701 109 361 -181 -135 -1238 -133 -563 -239 -399 -540 726 -34 230 -294 -145 355 -274
2254 -274 47 26 856 809 238 47 47 488 546 10 246 -312 329 -33 -121 -166 -547 -113 -524 -183 -897 -483
2276 -483 198 144 168 -1 658 336 -64 178 97 60 443 234 424 487 -22 737 -363 -521 -379 175 -230
2297 -230 -893 -89 -843 -411 -263 -230 -251 193 -239 119 345 500 915 -156 379 -10 586 239 234 678 -144
2318 -144 -403 -352 202 140 -741 -451 -496 -712 -189 172 336 -642 211 7 -375 180 -299 -171 733 113 586
2339 586 603 459 -21 -347 -265 166 -274 148 -884 -676 -136 -765 -615 -371 -411 89 -202 459 82 613 142
2360 142 771 509 480 1102 1187 216 -171 793 7 -344 -646 75 -269 -852 -20 -969 -426 -631 -608 170 -915
2381 -915 9 120 751 -469 506 314 1215 555 448 -174 1052 -43 221 538 739 -494 -491 -963 -930 -786
2401g86M9j60O84o49J88P35o61N12K86N94j39o50M87L26J52n43k66l32K12J50
2421A89j39M04j219J70k17Q00j68k48k49N26JM81p65Q50M26m43j94m61J042r79
2441a93N74L03o74n15N70n12J13L57j80q36M89l14M26j33L45P47j469N05Q10m2
2461C71k54P49r37P48K37n36m06l4j69L23L97q23K00mm16jP3O76j040M81PK65
2483i3j55M65o74M08K76PK88M21o95m26N31L76l24j06l10n27J29j7j92M16o04
2504h06O10m44L44j26J1L62j9j20Q33r4M38m19J07j90n96N82K18p88N00N23p64
2525A62n53j75q4k39M53N7L9k95M11j21J45l76K16M64Q51p31R4M9Q43j793Q25
2546B42M97l39l66q9k05J78n87J82J56n42P32j64J82q24R47Q7j59m77M85L63j49
$$ plain form
2401 -786 -737 -897 -213 -862 -674 61 -600 -88 198 792 653 3 490 816 968 425 159 -173 39 189
2421 189 50 454 -765 -595 -812 -12 -180 -428 -677 -151 -150 331 -434 416 842 399 205 -256 786 -193
2441 -193 381 684 10 -505 65 -447 -334 23 -157 -993 -504 -818 -392 -525 -180 567 -902 -397 413 371
2461 371 117 866 -71 677 914 378 -28 -62 -231 92 489 -334 -134 -138 -554 -555 -482 194 -846 -365 -358 -93
2483 -93 -248 217 -457 -49 227 234 522 943 248 -178 353 729 405 299 -11 -538 -409 -426 -618 -202 -806
2504 -806 -196 -640 -296 -422 -411 -49 -68 -188 645 551 989 570 677 487 -109 473 691 -97 403 926 162
2525 162 -391 -566 -650 -889 -436 -379 -340 -635 -224 -345 -200 -576 -360 104 955 224 318 367 1210 -583 242
2546 242 739 400 34 -55 -260 -82 -669 -487 -331 -873 -141 -305 -123 -947 0 87 -72 -549 -64 299 150
2567A50M9M34K53j20q3m03L19q12L58J02J0k98q02J75K4j40L49J06K65k11k8l0
2589c33j48P88K25r1L89l41J09o93M61jK67p20N78n26l74P49n23l24k56J63k39
2610h40l78P32L96p79J244q17O68m25N4R05K19m75k30K68k65J90l08O13m27J95
2630E40n87j079Q25j11k16Q53p5K31k01m54L62p01N71J48L79L03l62k69k74N36
2650D19K74n03L84m60K47m76J58j97p81M54J25j61P0J97k7L59p2k51K16J98K25
2671C98p65N29L15J79m47J32k23J53m22ON93n79n1j15J44o11L28j11N1j17K75
2692c38J34q9J60J85J95n29J055l17P9L34k35O8p7o92O9j35m49L23k03N4k89l00
2714i97L71N6J14l71L81k4R73j34n34Q61l18R5l43J093j154j83J56K46N78q72
$$ plain form
2567 150 199 633 886 766 683 280 599 -213 145 247 257 -41 -843 -668 -644 -784 -435 -329 -64 -275 -303 -333
2589 -333 -481 307 532 441 830 489 598 -95 366 365 632 -88 490 -36 -410 339 -184 -508 -764 -601 -840
2610 -840 -1218 -486 -90 -869 375 -442 226 -199 -145 760 979 504 274 542 277 467 159 772 345 540
2630 540 -47 -1126 -301 -412 -628 225 150 381 180 -274 88 -613 -42 106 485 788 426 157 -117 419
2650 419 693 190 574 114 361 -115 43 -154 -935 -481 -356 -517 -447 -250 -277 82 10 -241 -25 173 398
2671 398 -367 162 477 656 209 341 118 271 -151 -145 448 -131 -182 -297 -153 -764 -436 -547 -496 -613 -338
2692 -338 -204 -293 -133 52 247 -282 773 456 535 869 634 702 625 -67 2 -133 -582 -259 -462 -408 -697 -997
2714 -997 -626 -570 -456 -827 -446 -470 503 369 -165 696 378 473 130 1223 69 -114 42 288 866 -6
2734fN54o07j64J59j059J364q64l37M32J087o05O11l81k75M69r3J58QO45m73J9
2755F42Q2o68l90L73k56K05m6p78O55l21L61M72j346Q35j50M82M08R6l80L89K75
2776I40n12L71o61n5K31J27o19J59j44l43M4K09k31l62P89m50L61k46K14l43Q53
2797C32L68N5j149N54k93R76on99M30p97K09P56o37m27m2M07J68p91K01l60P38
2818I3n43N30n31l8j97M82j9l0K04N27l5k60J4L23m62J66p23O9M33L41rn39j58
2841c62k92j62J47o40R91j38L04NL85JJ34l30M41K44M20q49m8K38L00j274N09
2862B4l23L28n19L20n98L42L86l62l67L27k93N91k24N40J26l23M22j83L54o2K94
2883H00K1n70k46O16o0pk70p5j475N86j2n2Q73m91p7j09j6q6J36L76O64l65k12
$$ plain form
2734 -6 548 -59 -223 -64 -1123 241 -623 -960 -528 559 -46 565 184 -91 378 285 443 451 1096 623 642
2755 642 724 56 -334 39 -217 -12 -58 -836 -181 -502 -141 331 -1015 -180 -330 152 560 656 276 665 940
2776 940 428 799 138 83 314 441 -178 -19 -163 -506 -462 -253 -484 -846 -57 -507 -146 -392 -178 -521 332
2797 332 700 755 -394 160 -133 843 837 238 668 -129 80 836 199 -228 -270 137 305 -486 -285 -645 93
2818 93 -450 80 -451 -489 -686 -204 -223 -253 -49 478 443 183 197 520 58 224 -499 -430 3 344 335 -204 -362
2841 -362 -654 -816 -669 -1309 -318 -456 -152 -147 238 239 373 43 484 728 1148 299 251 489 789 -485 24
2862 24 -299 29 -490 -170 -768 -426 -40 -402 -769 -442 -735 -144 -368 172 298 -25 397 214 568 506 800
2883 800 821 251 5 621 561 554 284 209 -1266 -680 -692 -744 129 -362 -439 -548 -564 -650 -514 -138 526 161 -51
2906e1K70r4N39n03R2M53m02o25L77J12q91m3J49O59j356J041n87J005j396O85
2926e66n34M36J150m03R43l41J36l95J65k65R6k30p8K56Q0p72K00N0j39O6l81
2947e26l0J53o42R17l11O73l41N87q57Q53k21K01o42J463j119L3N52K03l47l95
2967B04m99O06q2m06K56m42N24J91p74L4M25m70K37J06O72p33M19K02n79J212
2987A103q62M03p27j81k44R46n04n42L69m89J57j4M1Q4M52k62r4N2k06O49L79
3008E10n42j17Q39L3m16J51m28M42l73J74k69n79P50n85n0J76k18l58K28m00K95
3029g37k24O76P70q96M36P38j045L19j58N49j61M56n41K97j70M46l09o12N3K6
3049h7q12K42m2n06Q35m36R91l99K11k23Q04p36Q24J5o77J76M50K09j37r75M47
$$ plain form
2906 -51 219 125 664 161 253 706 304 -321 56 168 -723 -766 -617 42 -1314 -273 -860 145 -1251 -566
2926 -566 -1100 -664 486 83 1026 685 821 426 591 326 422 192 114 370 450 -322 -122 -72 -211 -145 -526
2947 -526 -556 -403 -1045 -128 -439 234 -107 480 -377 476 255 456 -186 1277 158 191 743 946 599 204
2967 204 -295 311 229 -177 79 -363 161 352 -422 -388 37 -433 -196 -90 582 -151 268 470 -109 1103
2987 1103 241 644 -83 -264 -508 438 -66 -608 -239 -728 -571 -585 -544 -460 -8 -270 -364 -312 -518 131 510
3008 510 -32 -149 690 723 307 458 30 472 99 273 4 -575 175 -410 -460 -284 -502 -860 -632 -1032 -737
3029 -737 -961 -285 485 -411 25 763 -282 37 -121 428 267 723 182 479 309 755 446 -166 -113 -87
3049 -87 -899 -657 -699 -1205 -370 -806 185 -214 -3 -226 578 -158 666 681 4 180 630 839 702 -273 174
3070A74J45j87l5n04K83J95j16l17n22R46k62J64m10j49M04L54N10k82j58j89
3090D4L13qL51o18P63j92Pj114M93k29m50K01J08K94j03J08r90J82J16K84P35
3111B95k03j49j62P49K68r70K54L86K05p54J465j521P12m95J61m87n72K13N43
3130f2j93m45J134q48L13L19n00K59Mp8Q68n64K98P65q96n51J274o93K48o87K17
3151A82k09n64K7M42m42N87l78L77o72K91J58L5k23P14k65P00j166N56N03j89
3171D64L25n74N12q50%P19o85Q3l77R7o09N60k65m89P13O69j65l37O35r78J287
3192G35m8j90K77K17K2j84q6n35K09J59p14N40m40l79r9j93L1O53l42J2k1l08
3214f84M81R3J66L80m69L71j04M30j27m53K22j8p43N78j68L3N05q77L79J72p08
$$ plain form
3070 174 319 132 97 -407 -124 71 -45 -362 -884 62 -200 -36 -446 -595 -191 163 673 391 233 44
3090 44 357 349 700 82 845 653 660 -454 39 -190 -640 -439 -331 -37 -140 -32 -1022 -840 -724 -440 295
3111 295 92 -57 -219 530 798 -172 82 468 673 -81 1384 -137 575 80 241 -246 -818 -605 -62
3130 -62 -255 -700 434 -414 -101 218 -282 -23 -19 -97 771 207 505 1270 374 -177 1097 404 652 -35 182
3151 182 -27 -591 -564 -122 -564 23 -355 22 -650 -359 -201 -166 -389 325 60 760 -406 150 653 464
3171 464 789 215 727 -123 -123 596 -89 -6 -383 -286 -895 -335 -600 -1089 -376 293 128 -209 426 -552 735
3192 735 687 497 774 991 1013 829 743 208 417 576 -138 402 -38 -417 -516 -709 -678 -25 -367 -355 -376 -684
3214 -684 -203 -110 56 436 -33 338 234 664 537 84 306 288 -455 123 -45 -12 493 -384 -5 167 -541
3235e41m92P00Q5m0M62p72J82J7N63k42n78P31L35m46n0O41N96m36l92M30n3j416
3257g16L43p06O40n13O83l85L93l44m70J098J05k63L41l3N60j017L54J46K2J54
3277C92N68o00l31Q65o06n58M80q79M25o59N91n94N09j29L65o2N35j68j93m8N35
3298D38l59k37j28R02K23n25o51Q52l18K47n56k77K27r36O59O58p14L46l65O90
3318A76q8Q88n51o79P77l20M91l08R35r80o8N49o29J81m75K12l46Q73r84r5o51
3339a092J089m76j19R90m07j17kj45J99J07R64k1m28l8J85L0k34m60n12J631q45
3360B99j045Q66k8o35L7K33l47m56R15n31K8M27N51m74M89l8Q54p85p17N94K91
3381E28k22K46l05j62k52L55r30N76n6L1q16K24L55n1l5L47j61J19k29Q22L10
$$ plain form
3235 -541 -1033 -333 -248 -288 174 -598 -416 -399 164 -78 -656 75 410 -36 -86 555 1151 715 323 753 700 -716
3257 -716 -373 -1079 -439 -952 -269 -654 -261 -605 -1075 23 128 -135 206 173 733 -284 70 216 238 392
3277 392 960 360 29 894 288 -270 210 -669 -244 -903 -312 -906 -397 -526 -161 -223 312 144 -49 -97 438
3298 438 79 -158 -286 616 839 314 -337 515 197 444 -112 -389 -162 -1098 -439 219 -495 -149 -514 176
3318 176 88 976 425 -254 523 203 694 386 1321 341 273 822 193 374 -101 111 -235 638 -346 -441 -1092
3339 -1092 -3 -479 -598 392 -15 -132 -134 -279 -80 27 991 970 542 504 689 719 485 25 -487 1144 299
3360 299 -746 120 92 -543 -506 -273 -620 -1076 -161 -692 -664 -237 314 -160 329 291 1145 360 -357 237 528
3381 528 306 552 247 85 -167 188 -742 -166 -222 -191 -1007 -783 -428 -479 -514 -167 -328 -209 -438 384 694
3402F94j62m32K60N7M01j34m31J5k62M56m18K13m1p03j23m6K57J34q89J139K36
3423B21k94O35p51j87P33n12O05Jj98k08O52p05k85J096j003P3n30R47k90k86
3443b86q1L02k29J50j36n32O59m79J439n01k04L18L10K86q31o20J337m92m52L22
3463B80j2j0n20M79j76l35p05P11r5M11m77P4q5l56M74O49k8O8o7P22m59m70j3
3486F0M16k5j8o76P85j4j176M86n75L01L82m95m33J281l03n30J16L00N74n7J15
3507E14n64k22J135l23l04k03q8P80p88K74P4j013L40L8r76J004j25l85Q09Q0
3527E7q72j6O32J65M30L38k93l8J69l40k86L43m69P62%j027O75o4m69o44M56J54
3549c37k39l47J079o2j51j32o26O73M01J44J03J46O95n61n45j29P20o39k08l20
$$ plain form
3402 694 532 100 360 417 818 684 253 268 6 462 44 257 216 -487 -610 -656 -399 -265 -1154 -15 221
3423 221 -73 562 -189 -376 357 -155 450 451 253 45 697 -8 -293 803 -200 -127 -657 290 0 -286
3443 -286 -367 -65 -294 -144 -280 -812 -153 -632 807 306 102 420 730 1016 185 -435 902 410 -42 280
3463 280 268 258 -262 217 41 -294 -999 -288 -383 28 -449 -375 -460 -816 -342 307 279 347 280 1002 543 73 60
3486 60 476 451 433 -243 542 528 -648 -162 -737 -436 -54 -549 -982 299 -4 -534 -418 -118 456 399 514
3507 514 -50 -272 863 540 236 33 -55 725 -63 211 285 -728 -388 -350 -1326 -322 -447 -832 -23 57
3527 57 -815 -831 -199 -34 396 734 441 403 572 232 -54 289 -180 582 582 -445 230 166 -303 -947 -491 -337
3549 -337 -576 -923 156 94 -57 -189 -815 -142 259 403 506 652 1347 786 241 112 832 193 -15 -335
3569c35M12j48n91R18m62l77J96j06m65M28J20P61j180J352m17M09K32p75L71
3588C43j27l14n5P70q02n6Q91j68o12p1N86n98k89J17Lq0l40J431j013L02j35
3609b17L3L14n25O96l4L90j61o47Q34m56J85j69n91Q37k73k32j79jm62J40k09
3630g27R8R48q25N45k6J33P6K40N0J07m20J91K8o13N77L75l89p58J22M86J1k16
3652A3n33N80n94L74k82M02p99J055o14L57l15J54L12k21J076m99l37M53q6k39
3672B57q0k80M68q71o8M97j95j83J74qM1J85K84k53l85J46Q80p80N52K43o68M96
3694D52q30R28K50q36Q50o77p04j77N95Q6j49j0n82O02Lj30l5L86m44Q55m72J093
3716A054o10m42L49J73M9j26J5n11L51j4k3n21k76L51M1o89L95J30o41R36L73
$$ plain form
3569 -335 77 -71 -662 256 -206 -583 -387 -493 -958 -530 -410 351 -829 523 106 515 747 -28 343
3588 343 216 -98 -153 617 -185 -241 650 482 -130 -201 385 -213 -502 -385 -382 -462 -802 629 -384 -82 -217
3609 -217 -184 130 -395 301 267 657 496 -151 683 227 412 243 -348 489 216 -16 -195 -196 -658 -518 -727
3630 -727 -629 319 -506 39 13 146 222 462 512 619 199 390 418 -195 382 757 368 -390 -268 218 229 13
3652 13 -520 60 -534 -160 -442 -40 -839 216 -398 -41 -356 -202 110 -111 965 466 129 582 496 257
3672 257 177 -103 365 -506 -574 -77 -272 -455 -281 -289 -248 -63 221 -32 -417 -271 609 -171 381 624 -44 452
3694 452 -378 550 800 -36 814 137 -567 -744 -149 -63 -212 -222 -804 -202 -199 -329 -364 22 -422 433 -39 1054
3716 1054 444 2 351 524 573 447 462 -49 302 288 265 -256 -532 -181 -140 -829 -434 -304 -945 -9 364
3737C64q68L74O73j47p41N76O8q5N96Q9m71l02PK03j00K78p01j24j95M46k33j53
3759d46M42r76O67P19l78J13n39n9J145n48N86o23L7n7K57J92k92L65j766Q76
3779b85KK24Q0m67J29JM02l14r35J067K31K15P36q44J18p4Kj25N80j54K07n31
3801B65l91N34l9l3j013N22j94P63o6j062J071q76q7J82M34m76n9M48M12m99J044
3822H80p82M08k53j82Q2P4r9L07o11j26N42n8j92m20P6K75J28m86L29q4M88p88
3844d92Q08k7J48O5m92P64j18q6M42o7p30K19n56k30N96n70p1j84N75k95k51J06
3866d46K68M58n72O68p51K92J8L66j29O29j15J23J34k90n18m70M75N99n18p99
3886e78N31J9j11k17K80k28J328j375O88q89J139m23m7R53o62k77J04K59l81L29
$$ plain form
3737 364 -504 -130 543 396 -345 231 299 214 810 899 428 126 133 336 236 514 -187 -311 -506 -60 -293 -446
3759 -446 -4 -980 -313 406 28 141 -398 -457 688 140 726 103 140 83 340 532 240 605 -1161 -285
3779 -285 -283 -59 21 -446 -317 -316 86 -228 -1163 -96 135 350 1086 242 360 286 288 163 743 589 796 265
3801 265 -126 408 369 336 -677 -155 -349 414 348 -714 357 -519 -606 -424 10 -466 -525 -77 335 -164 880
3822 880 98 506 253 71 153 227 128 435 -176 -302 240 182 -10 -430 -354 -79 49 -437 -108 -192 296 -492
3844 -492 316 289 437 502 10 774 656 570 1012 945 215 434 -122 -352 244 -326 -397 -581 -6 -301 -552 -446
3866 -446 -178 280 -292 376 -375 -83 -65 301 172 801 686 809 943 653 135 -335 140 739 221 -578
3886 -578 -47 -28 -139 -356 -76 -304 1024 -351 337 -552 587 164 117 1070 408 131 235 494 113 442
3906D42l0l02o38L12J6L06L84m72l74N2k61j1L18k54p8L74N97o29O17j36j99J163
3928A197j299J6M36M29k87l9r36N37j72K79n36J48p4p8r1k2j65L58L27P73j089
3949b88j68R7R29l78r5P74p39j97q9J6m9k48M11Q38p95o00P57l82j21L74j53K81
3971A75j03k82j67k29J009o04J027p84O49q40j0Q66p27P87p05o19N27K00o56O94
3991B08m52R50j225K85L11k00o58N64N53k26k39l7N20J10n10K45J60J10J75J11
4011G55j133K2M89m95R60j021K51L67p58L87q04R15k60L24p53L35K05K12K03N06
4031G07j295J239n46M82q2M20j152P49n70j2J82j37n61L38l09L58o05N14J92l96
4051d84K16k80R56k68L65n08o0O37p0J82o89K95k17L25n68L45n70K60l24o4J18
$$ plain form
3906 442 412 110 -528 -216 -200 106 490 18 -356 -304 -565 -576 -258 -512 -590 -216 381 -248 369 233 34 1197
3928 1197 -102 -86 350 779 492 453 -483 54 -118 161 -375 -227 -301 -379 -470 -492 -657 -299 28 801 -288
3949 -288 -456 -359 570 192 97 871 132 -65 -154 -138 -187 -435 -24 814 19 -581 176 -206 -327 47 -106 175
3971 175 72 -210 -377 -606 403 -201 826 42 691 -149 -159 707 -20 767 62 -557 -30 170 -486 208
3991 208 -244 706 -519 -234 77 -123 -781 -217 336 110 -129 -166 354 464 -46 199 359 469 644 755
4011 755 -378 -356 133 -362 598 -423 -172 195 -563 -176 -980 -65 -325 -1 -754 -419 -214 -2 201 707
4031 707 -588 651 105 587 505 925 -227 522 -48 -60 122 -15 -576 -238 -547 -189 -794 -280 -88 -484
4051 -484 -268 -548 408 140 505 -3 -63 574 504 686 -3 292 75 400 -168 177 -393 -133 -457 -521 -403
4072d03k47M26j57j59P03l72P59p55J36J87o0J069o15P6p78P6m78J031m83L24
4092B80p71O84p50K27m44O99m40N1N9K58O9M17Jj23o32M03J03K04m0l64l8M13
4114B66R2n94Q59j65l00O8p12K16L07m48P81j335Q65L6o63O44n29M70L68m10j07
4135b91O34J31n83n9J81J75p10P12r9l83J57J10m67O58l42L53k56j62n34N67O6
4156a42q7M28j014Q26M74l39L66k03M90p6o07J83n87O68m6k37P1n10N17j29m3
4177Ck16o6N06L01j386O26L19rN5K05j107J191K9k97l69K14J92k12K8o46N37l32
4199d34L47M17r36Q48m90q66J464p45K36l51L91P4oO67m28q11O57K68p8m87O97
4220D34p83M84n80M69m06M31j47l90N86r42J048p28J062j009K42L45m15K97k22
$$ plain form
4072 -403 -650 -224 -381 -540 163 -209 550 -205 -69 118 58 1127 512 588 -190 -114 -592 439 -44 280
4092 280 -491 193 -557 -330 -774 -75 -515 -464 -405 -147 -78 339 340 217 -415 -12 91 295 255 -109 -147 266
4114 266 358 -236 623 458 158 226 -486 -270 37 -411 370 -965 -100 -64 -727 -83 -612 -142 226 -184 -291
4135 -291 343 474 -109 -168 13 188 -522 190 91 -292 -135 -25 -492 166 -176 177 -79 -241 -775 -208 -142
4156 -142 -229 199 -815 11 485 146 512 309 799 723 116 299 -288 380 334 97 168 -342 175 46 3
4177 3 -213 -279 227 528 -858 -232 87 78 133 338 -769 422 451 154 -215 -1 191 -21 7 -639 -102 -434
4199 -434 -87 330 -606 242 -248 -1114 350 -395 -159 -510 -119 -45 -51 616 188 -623 34 302 224 -263 434
4220 434 -349 135 -445 24 -382 49 -98 -488 98 -844 204 -524 538 -471 -229 116 -299 -2 -224
4239b24J96j44L27J98m11o5J83K28M73o99l08L29l22K12L9o30L5Q5M31p34M65
4260c36N91m19j2k5J27M8K78J19j51J84O03n53l05OM4o71J077q25P33q83m66M47
4282c89L06O6l48m91P69j33K15M97n43Q67j019N92J28JPm43r63O39J59p7j81Q93
4304E52o37k06M50K33n37m4k10k82k72M01o94J335qL38l27J60K9j95J37J39l75
4325a3N34n66n21j32M57L3k33r7K04j31M58K56K79o54J03L39N8O6J2l16J49Rm19
4348a25J35o22O02L07K01p76O88n92n8p04R34O4k93Q83p45m00l58O98J26k39k40
4369e14J57L56q2P13n89N31m88j18m8N21j46n79M59p39R57o11J45L97n07k71R63
4390E07n77k99M85l76L46k33O60n62L81o89Q05n84J85Q86j034l87P37L7p63K30
$$ plain form
4239 -224 -28 -172 155 353 -58 -123 60 288 761 62 -246 83 -239 -27 12 -618 -583 -498 -67 -801 -336
4260 -336 255 -164 -176 -201 -74 -26 252 371 220 404 1007 454 149 155 199 -472 605 -220 513 -370 -836 -389
4282 -389 -83 -17 -365 -856 -87 -220 -5 492 -51 816 -203 389 517 518 525 82 -881 -242 -83 -160 -341 552
4304 552 -85 -291 159 392 -145 -189 -399 -681 -953 -552 -1246 89 81 419 92 252 281 86 223 362 -13
4325 -13 521 -45 -566 -698 -241 -208 -441 -538 -334 -465 -7 249 528 -126 -23 316 374 440 452 136 285 294 -125
4348 -125 10 -612 -10 297 498 -278 410 -182 -240 -944 -10 54 -239 644 -101 -501 -859 -161 -35 -274 -514
4369 -514 -357 -1 -83 630 41 572 84 -34 -82 439 293 -286 173 -566 391 -220 -75 322 -185 -456 507
4390 507 -70 -369 116 -260 86 -147 513 -49 332 -357 448 -136 49 935 -99 -486 251 288 -475 -245
4410b45R2N54o55L67m51l03N92K61o0Nq2L20k89o35Q81j92O66p21R0k95m2O39
4432D97p02P09m11m42l71PM30k75mM46J19K3J46K6K4m48M38k86l10L37k83N0N4
4455b26L94k57N96j109R52k49m53J87J72k72J9O26n17L58Q8l55n6l90L15L44O58
4476H25m14k19o07Q78m92M93m55j63N67n53j83M32J90m59j71P13r32N92j01L76
4496C17k09k4m66Q93M69j023K05k67K48l78j10R93m00n74M86l30J1J58N07r63
4516d57J22J28r8Q3J95k71L55J59n27J64K39L5j72p81J519o23r26Q72j07J40r09
4537h60R34k25L9o3K70j37j07M99o31J87L22O7l00l31N61j01p6K00m28K96Nk1
4559A00J84p24J93P81l90n59j06K59L50m69o3N10M46o45N12J48l12k05K37N47
$$ plain form
4410 -245 -153 401 -254 113 -338 -641 -49 212 152 157 75 395 106 -529 352 160 826 105 195 -100 -142 497
4432 497 -205 504 93 -349 -720 -713 -283 -558 -562 -116 3 26 172 198 222 -226 212 -74 -384 -47 -330 -280 -226
4455 -226 168 -89 507 -602 350 101 -352 -165 7 -265 -246 380 -137 221 309 -46 -102 -492 -177 167 825
4476 825 411 192 -415 463 -29 464 9 -154 413 -140 -323 109 299 -160 -331 382 -550 42 -59 317
4496 317 108 84 -382 511 980 -43 162 -105 143 -235 -345 648 248 -326 160 -170 -159 -1 506 -457
4516 -457 -335 -207 -305 -222 -27 -298 57 216 -311 -147 92 127 -45 -826 693 70 -856 16 -91 49 -860
4537 -860 74 -151 -112 -175 95 -42 -149 350 -281 -94 228 295 -5 -336 225 124 48 248 -180 116 121 100
4559 100 284 -440 -247 534 144 -415 -521 -262 88 -381 -444 66 512 -133 379 527 215 10 247 794
4579G94m09k30j26N68l75J71n41L65j78K74q6p03N31M12j68r69R34n87J40M61
4599B78n35o22O42K16l1K46k7R3M14o41j16K95L15k91k13K98n70M04J10J67m43
4620a1K94m25J93K09k3k04n51O28n43J01M96j57M05k89N12q31L86L6j51l38K35
4641b8J65n00K27n61M36L8J8Q7l44N82j65m31R35k99K27q25Q69R0p67J90J46N9
4663A49n26K45L59r6p38Q58K4o85M77l50n41M70J81n63R38m76L75j20R0Q19n43
4684C47p11J64J53L41J02q22M46M07j047J88m0Q1J68K9K03j53m61l2P03o88N14
4705a08Q00l79k85p2L63l08R5N75q93K66L90j103L13k89N94k51k82R37p80q0K11
4726b86N86p80O5M23J03M32n18k35M04j75M04J62q41P3N50n78q8M79L99J32r97
$$ plain form
4579 794 385 155 29 597 222 393 -148 217 39 313 227 -476 55 467 299 -670 264 -323 -183 278
4599 278 -257 -879 -237 -21 -52 194 167 260 674 33 -83 212 527 236 23 321 -249 155 265 432 -11
4620 -11 283 -142 51 260 237 33 -518 110 -433 -332 164 7 412 123 635 -196 190 226 75 -263 -28
4641 -28 137 -363 -136 -697 -261 -223 -205 -118 -462 120 -45 -476 459 160 387 -438 431 521 -246 -56 90 149
4663 149 -377 -132 227 131 -607 251 275 -410 67 -283 -824 -354 -173 -736 202 -274 101 -19 71 890 347
4684 347 -364 -200 -47 294 396 -426 20 427 -620 -432 -472 -391 -223 -194 9 -144 -605 -637 66 -622 -108
4705 -108 692 313 28 -44 319 11 106 681 -212 54 444 -659 -346 -635 -41 -292 -574 363 -417 -497 -286
4726 -286 300 -480 -415 8 111 543 25 -210 194 19 423 585 -256 -183 367 -211 -299 180 579 711 -286
4747b86J57n07M44n44J72O18j60M52m6j66j123R79q05M48O09J66m2p13L36j48
4767a59J45R1K67j25m72O2J96m45O12J27k25q1L06j68k24j92k57Q50l22l44Q30
4788D72o94J004k49q08L80N53r26k22M95k66mQ93p37K12l51J025q28N65j345M41
4808c90J89R09q80n06J44Q60k81M35m50j94R5M0L00oJ5o26M47q20M10M80k79L14
4830B06K48K27p72j20l81P43L78l02m62M60M48j015K27J01qO94r41J20Q62o83
4850C0q6q4L03J28k95J82l68K10o89J182n05l84k58Q42j6j46M23l40M64j119K94
4871b32O57K62m49M39l62j35m94Q82m90k18QQ2L6j51K82n90M77j022L06J147K83
4892G18p09K68n77OJ94N70o40R88l92o27l44O39l33k30N93N37n27n39L32m1J5
$$ plain form
4747 -286 -129 -636 -192 -736 -564 54 -106 346 300 134 -989 -10 -815 -367 242 408 366 -347 -11 -159
4767 -159 -14 77 344 219 -253 -191 5 -440 172 299 74 -7 299 131 -93 -285 -542 308 -14 -358 472
4788 472 -222 782 533 -275 105 658 -268 -490 5 -261 -265 628 -109 103 -248 777 -51 514 -831 -390
4808 -390 -201 708 -172 -678 -534 326 45 480 30 -164 -69 -29 271 265 280 -346 101 -719 -309 171 -108 206
4830 206 454 681 -91 -211 -592 151 529 227 -235 225 673 -342 -115 -14 -22 672 -269 -149 713 30
4850 30 -56 -140 163 291 -4 178 -190 20 -669 513 8 -376 -634 208 192 46 469 129 593 -526 -232
4871 -232 425 687 238 677 315 180 -314 568 78 -140 -132 -50 -14 -165 117 -473 4 -1018 -712 435 718
4892 718 9 277 -300 -294 -100 470 -170 818 426 -201 -545 94 -239 -469 124 661 134 -405 -73 -114 -99
4913i9K91k27J14o26K18k53J116k23o64J5M28k77P4J45p93Q47j24L10l58J36j20
4934g0K43l1m60N01j43j98p17J309l28k47O11m0n74o6nO77J38n98k68p3L09J19
4956H9j67J16l60p9o4J92M97m85K19M6j38m98O55k07L33J8k7o55N60K72p73O01
4978A45n59Q07qm22q82K82J257n52k50K10M03j70j49o8l56J39O0L06r7R4k20K74
5000B44K78o57k85P25J45p16K28J10J50K94l36m01k78j71L09L9j47L88L05l35
5020a11o9m86P79K55l63O3J38k86P85n29l92K43j87M24m43O84j26q38o6O12L87
5041D74k23o81P74j00l87K88n13O4J43l16J928j159N3P17p65K45l6l47m75R01
5061E85j107N21m79m37Q72j51J33m37K60K72l78M4Q34j319L36j16J084N1l12m67
$$ plain form
4913 -99 192 -35 79 -547 -329 -582 534 311 -353 -338 90 -187 -113 32 -761 86 -38 272 -86 50 -70
4934 -70 173 142 -318 183 40 -158 -875 434 106 -141 470 430 -144 -210 -215 462 600 2 -266 -339 -30 89
4956 89 -78 38 -322 -401 -465 -273 224 -261 -42 4 -134 -632 23 -184 149 167 140 -515 45 317 -456 145
4978 145 -414 393 385 -37 -919 -637 620 68 -182 28 431 261 112 44 -312 -173 -113 193 96 190 -30 244
5000 244 522 -135 -420 305 450 -266 -38 72 222 516 180 -221 -499 -670 -361 -322 -469 -81 224 -111
5020 -111 -180 -666 113 368 5 68 206 -80 705 176 -216 27 -160 264 -179 505 379 -459 -525 87 474
5041 474 251 -430 344 244 -143 145 -368 -304 -161 -477 1451 292 345 1062 297 542 506 159 -316 585
5061 585 -522 -1 -480 -917 -45 -196 -63 -500 -240 32 -346 -302 532 -787 -451 -567 517 568 256 -211
5081b11R24j46p51N24L5m07O97q39n8K40l12L60J91o80r5L61J86r7L22l65L45
5102B24r30O68K43K47l89k62L71J53n54Q25q14Q86L5n85l90l99Q89l82O01l49
5122H8l26P57p40P73j024J012p21j08O04j43o03N00M33j85k66o37k7Q26m09n7
5142b53K83L83o16L30o28R94o60j96K12k25O11j74k11m63R92k30L7l86J10O93
5162F03r22M72j8n62L47K77n28P3l42K19Q95n04o8k29K89j84k20O36j42J02J76
5183C70k36L21j14L9m26O5k48K9J043k33j073N80o5J42J35q11J93j74O05j25K44
5204B61l90N1O9l95K77R72l34M8m54k33J25j38M77m19P18m46O5k68k79l2P35p48
$$ plain form
5081 -211 713 567 -184 340 375 -32 665 -174 -232 8 -304 56 247 -433 -528 -167 19 -78 244 -121 224
5102 224 -706 -38 205 452 63 -199 172 325 -229 596 -218 668 703 118 -272 -671 218 -164 437 88
5122 88 -238 519 -221 552 -472 540 -181 -289 315 172 -431 69 502 317 51 -586 -613 213 -196 -253
5142 -253 30 413 -203 127 -501 493 -167 -363 -151 -376 235 61 -150 -613 379 149 186 -200 -90 603
5162 603 -319 153 135 -427 -80 197 -331 -258 -600 -381 514 10 -58 -287 2 -182 -402 234 92 194 370
5183 370 134 455 341 380 -46 19 -229 -200 843 610 -463 117 52 194 329 -482 -289 -463 142 17 261
5204 261 -129 -78 -9 -404 -127 845 511 559 105 -128 -3 -141 336 -83 635 189 254 -14 -293 -325 410 -338
$$ [...]
8191e32
##END NTUPLES=NMR FID
##END=
