##TITLE=1H_SR167R1
 DMSO-d6
 8 sc, 
 24.3.2023
##JCAMPDX= 6.0         $$ Bruker NMR JCAMP-DX V2.0
##DATA TYPE= NMR FID
##DATA CLASS= NTUPLES
##ORIGIN= UXNMR, Bruker Analytische Messtechnik GmbH
##OWNER= root
$$ XWIN-NMR		Version 3.5
$$ Fri Mar 24 15:56:31 2023 Russian Standard Time (UT+4h)  she@DPX200
##.OBSERVE FREQUENCY= 200.13135
##.OBSERVE NUCLEUS= ^1H
##.DELAY= (6, 6)
##.ACQUISITION MODE= SIMULTANEOUS
##.ACQUISITION SCHEME= undefined
##.AVERAGES= 8
##.DIGITISER RES= 18
##SPECTROMETER/DATA SYSTEM= spect
##.PULSE SEQUENCE= zg30
##.SOLVENT NAME= D2O
##.SHIFT REFERENCE= (INTERNAL, D2O, 0, 15.7039)
##AUDIT TRAIL= $$ (NUMBER, WHEN, WHO, WHERE, WHAT)
$$ ##TITLE= Audit trail, XWIN-NMR		Version 3.5
$$ ##JCAMPDX= 5.01
$$ ##ORIGIN= Bruker BioSpin GmbH
$$ ##OWNER= she
$$ F:/spectra/data/she/nmr/H-F/1/audita.txt
$$ ##AUDIT TRAIL=  $$ (NUMBER, WHEN, WHO, WHERE, WHAT)
(   1,<2023-03-24 15:55:33.85 +0400>,<she>,<DPX200>,
      <created by zg, POWCHK disabled, PULCHK disabled
       configuration hash MD5:
       00 E9 B6 7A A2 85 ED C7 34 08 36 98 17 FE 4E 26
       data hash MD5: 16K
       5B F7 C9 51 CF F9 1F 0B 44 4B D7 68 D9 C6 DD 7E>)
$$ ##END=
$$ 
$$ hash MD5
$$ A2 2F 29 CC 95 C6 C7 65 36 F6 01 18 5E 5B C9 B7
##$RELAX= 
##$RELAX= 
##$RELAX= 
##$RELAX= 
##$RELAX= 
##$RELAX= 
$$ Bruker specific parameters
$$ --------------------------
##$DU= <F:/spectra>
##$EXPNO= 1
##$NAME= <H-F>
##$PROCNO= 1
##$TYPE= <nmr>
##$USER= <she>
##$AMP= (0..31)
100 100 100 100 100 100 100 100 100 100 100 100 100 100 100 100 100 100 
100 100 100 100 100 100 100 100 100 100 100 100 100 100 
##$AQSEQ= 0
##$AQ_mod= 1
##$AUNM= <au_zg>
##$AUTOPOS= <>
##$BF1= 200.13
##$BF2= 200.13
##$BF3= 200.13
##$BF4= 200.13
##$BF5= 200.13
##$BF6= 200.13
##$BF7= 200.13
##$BF8= 200.13
##$BYTORDA= 1
##$CFDGTYP= 0
##$CFRGTYP= 5
##$CHEMSTR= <none>
##$CNST= (0..31)
1 1 145 1 1 1 1 1 1 1 1 1 1 1 1 1 1 1 1 1 1 1 1 1 1 1 1 1 1 1 1 1 
##$CPDPRG= <>
##$CPDPRG1= <>
##$CPDPRG2= <>
##$CPDPRG3= <>
##$CPDPRG4= <mlev>
##$CPDPRG5= <mlev>
##$CPDPRG6= <mlev>
##$CPDPRG7= <mlev>
##$CPDPRG8= <mlev>
##$CPDPRGB= <>
##$CPDPRGT= <>
##$D= (0..31)
0 1.2 0 0 0 0 0 0 0 0.06 0 0.03 0 0 0 0 0.0002 0 0 0 0 0 0 0 0 0 0 0 0 
0 0 0 
##$DATE= 1679658933
##$DBL= (0..7)
120 120 120 120 120 120 120 120 
##$DBP= (0..7)
150 150 150 150 150 150 150 150 
##$DBP07= 0
##$DBPNAM0= <>
##$DBPNAM1= <>
##$DBPNAM2= <>
##$DBPNAM3= <>
##$DBPNAM4= <>
##$DBPNAM5= <>
##$DBPNAM6= <>
##$DBPNAM7= <>
##$DBPOAL= (0..7)
0.5 0.5 0.5 0.5 0.5 0.5 0.5 0.5 
##$DBPOFFS= (0..7)
0 0 0 0 0 0 0 0 
##$DE= 6
##$DECBNUC= <off>
##$DECIM= 32
##$DECNUC= <off>
##$DECSTAT= 4
##$DIGMOD= 1
##$DIGTYP= 9
##$DL= (0..7)
0 120 120 120 120 120 120 120 
##$DP= (0..7)
150 150 150 150 150 150 150 150 
##$DP07= 0
##$DPNAME0= <>
##$DPNAME1= <>
##$DPNAME2= <>
##$DPNAME3= <>
##$DPNAME4= <>
##$DPNAME5= <>
##$DPNAME6= <>
##$DPNAME7= <>
##$DPOAL= (0..7)
0.5 0.5 0.5 0.5 0.5 0.5 0.5 0.5 
##$DPOFFS= (0..7)
0 0 0 0 0 0 0 0 
##$DQDMODE= 0
##$DR= 18
##$DS= 0
##$DSLIST= <SSSSSSSSSSSSSSS>
$$ [...]
##$SUBNAM2= <"">
##$SUBNAM3= <"">
##$SUBNAM4= <"">
##$SUBNAM5= <"">
##$SUBNAM6= <"">
##$SUBNAM7= <"">
##$SUBNAM8= <"">
##$SUBNAM9= <"">
##$SW= 18.05172834244
##$SWIBOX= (0..15)
0 0 2 0 0 0 0 0 0 0 0 0 0 0 0 0 
##$SW_h= 3612.71676300578
##$TD= 16384
##$TD0= 1
##$TE= 0
##$TE2= 300
##$TE3= 300
##$TEG= 300
##$TL= (0..7)
0 120 120 120 120 120 120 120 
##$TP= (0..7)
150 150 150 150 150 150 150 150 
##$TP07= 0
##$TPNAME0= <>
##$TPNAME1= <>
##$TPNAME2= <>
##$TPNAME3= <>
##$TPNAME4= <>
##$TPNAME5= <>
##$TPNAME6= <>
##$TPNAME7= <>
##$TPOAL= (0..7)
0.5 0.5 0.5 0.5 0.5 0.5 0.5 0.5 
##$TPOFFS= (0..7)
0 0 0 0 0 0 0 0 
##$TUNHIN= 0
##$TUNHOUT= 0
##$TUNXOUT= 0
##$USERA1= <user>
##$USERA2= <user>
##$USERA3= <user>
##$USERA4= <user>
##$USERA5= <user>
##$V9= 5
##$VALIST= <valist>
##$VCLIST= <CCCCCCCCCCCCCCC>
##$VD= 0
##$VDLIST= <DDDDDDDDDDDDDDD>
##$VPLIST= <PPPPPPPPPPPPPPP>
##$VTLIST= <TTTTTTTTTTTTTTT>
##$WBST= 1024
##$WBSW= 4
##$XGAIN= (0..3)
0 0 0 0 
##$XL= 0
##$YL= 0
##$YMAX_a= 99931
##$YMIN_a= -157924
##$ZGOPTNS= <>
##$ZL1= 120
##$ZL2= 120
##$ZL3= 120
##$ZL4= 120
##$ABSF1= 10
##$ABSF2= 0
##$ABSG= 5
##$ABSL= 3
##$ALPHA= 0
##$AQORDER= 0
##$ASSFAC= 0
##$ASSFACI= 0
##$ASSFACX= 0
##$ASSWID= 0
##$AUNMP= <proc_1d>
##$AZFE= 0.1
##$AZFW= 0.1
##$BCFW= 1
##$BC_mod= 2
##$BYTORDP= 1
##$COROFFS= 0
##$CY= 11.3945322036743
##$DATMOD= 1
##$DC= 2
##$DFILT= <>
##$DTYPP= 0
##$F1P= 2.36226072786647
##$F2P= -0.459571619588291
##$FCOR= 0.5
##$FTSIZE= 0
##$FT_mod= 4
##$GAMMA= 1
##$GB= 0.15
##$INTBC= 1
##$INTSCL= 1
##$ISEN= 128
##$LB= 0.24
##$LEV0= 0
##$LPBIN= 0
##$MAXI= 10000
##$MC2= 0
##$MEAN= 0
##$ME_mod= 0
##$MI= 1.114404
##$NCOEF= 0
##$NC_proc= 0
##$NLEV= 6
##$NOISF1= 3.799351
##$NOISF2= 2.8
##$NSP= 1
##$NTH_PI= 0
##$NZP= 0
##$OFFSET= 15.70392
##$PC= 1
##$PHC0= -19110.17
##$PHC1= 10.80079
##$PH_mod= 1
##$PKNL= yes
##$PPARMOD= 0
##$PSCAL= 0
##$PSIGN= 0
##$REVERSE= no
##$SF= 200.130013532006
##$SI= 16384
##$SIGF1= 3
##$SIGF2= 2
##$SINO= 400
##$SIOLD= 16384
##$SREGLST= <1H.CDCl3>
##$SSB= 0
##$STSI= 0
##$STSR= 0
##$SW_p= 3612.71676300578
##$SYMM= 0
##$S_DEV= 0
##$TDeff= 0
##$TDoff= 0
##$TI= <>
##$TILT= no
##$TM1= 0
##$TM2= 0
##$TOPLEV= 0
##$USERP1= <user>
##$USERP2= <user>
##$USERP3= <user>
##$USERP4= <user>
##$USERP5= <user>
##$WDW= 1
##$XDIM= 8192
##$YMAX_p= 0
##$YMIN_p= 0
$$ End of Bruker specific parameters
$$ ---------------------------------
##NTUPLES= NMR FID
##VAR_NAME=  TIME,          FID/REAL,        FID/IMAG
##SYMBOL=    X,             R,               I
##VAR_TYPE=  INDEPENDENT,   DEPENDENT,       DEPENDENT
##VAR_FORM=  AFFN,          ASDF,            ASDF
##VAR_DIM=   8192,          8192,            8192
##UNITS=     SECONDS,       ARBITRARY UNITS, ARBITRARY UNITS
##FACTOR=    0.0002768,     1,               1
##FIRST=     0,             0,               0
##LAST=      2.2672688,     0,               0
##MIN=       0,             -157924,         0
##MAX=       2.2672688,     99931,           0
$$ Real data points
##PAGE= N=1
##DATA TABLE= (X++(R..R)), XYDATA
0@%%%%%%%%%%%%qJ6j6J6j6K4l2L5m3N6o4P2q8J04j20J36j58J82k08K40k72L06
34A62l47L94m42M94n54O19o89P67q51R42j045J156j275J405j551J710j881K073
52A087k285K522k786L079l411L792m232M749n364O107p031Q214r796J2031j5449
67h773K1399l4746J22051j2908j24358R5402j8821l299J7259k8851j7690L8621
79D5286o3110k2343N7012k9410p1048K4668j0986r593N9601o268m3861O7338K1479
92A8765n6844K6407L5705m1844J8828L7553k0527J9560K4231m3901J4756L7952
104G0641o0027l2653M3560j3204k5472J6305j2521L315L2244m4394l3722N7961
116B033K457n6729J5355L0481J835K2231j0301k6506M6372J9934n9143j680M2366
$$ plain form
0 0 0 0 0 0 0 0 0 0 0 0 0 0 -8 8 -8 8 -8 16 -16 19 -24 32 -32 40 -48 56 -64 72 -86 96 -112 128 -144 162
34 162 -185 209 -233 261 -293 326 -363 404 -447 495 -550 606 -669 736 -815 895 -986 1087
52 1087 -1198 1324 -1462 1617 -1794 1998 -2234 2515 -2849 3258 -3773 4441 -5355 6676 -8773
67 -8773 12626 -22120 99931 87023 -37335 58067 39246 35947 53206 24355 6665 45286
79 45286 -17824 -40167 16845 -12565 -83613 -58945 -69931 -79524 -19923 -26191 -70052 -2714 18765
92 18765 -38079 -11672 24033 -17811 1017 38570 18043 37603 61834 17933 32689 70641
104 70641 10614 -22039 21521 8317 -17155 -850 -13371 -10056 22188 -22206 -55928 2033
116 2033 4490 -52239 -36884 -6403 -4568 17663 7362 -19144 27228 47162 -11981 -13661 28705
129B8705j4554j3347J1405n293J4086R244m2372r367L2802j9954k8386J9291L567
142a4173n721J7414p060j1014K4359n260k8207K2203K2639j7815J723K0333L939
155B3360N111m175j7717J2040J2370k9134r511K5995n97k0469k106J115J917j183
169b984k4037r855K6897M020k4648M840K3199K120o347k515L086J6293L361j7818
183d388N378K5908k002j6500L678Q128k384o819j1719k673J1914n923j9380N823
197a0959J3055j0864j1254M705L735J443j689n345R940J5981q396p437J7125P939
211A7979j1274j251N860L282K625q033q365J3130L745k2051n278J2531l981j0697
225a1778k620o68P770L086j5889r85K0708j939j4124P966J1212J564K164l927
$$ plain form
129 28705 14151 804 12209 6916 21002 30246 -12126 -21493 11309 -8645 -37031 -17740 -14173
142 -14173 -19894 -2480 -9540 -20554 3805 -1455 -29662 -7459 15180 -2635 -912 19421 23360
155 23360 28471 24296 6579 18619 30989 1855 -7656 18339 17742 -2727 -4833 -3718 -1801 -2984
169 -2984 -27021 -36876 -9979 -5959 -30607 -25767 -2568 -448 -6795 -9310 -6224 10069 13430 -4388
183 -4388 990 26898 24896 8396 12074 20202 17818 10999 -720 -3393 8521 2598 -16782 -10959
197 -10959 2096 -8768 -20022 -15317 -11582 -10139 -11828 -17173 -7233 8748 352 -7085 10040 17979
211 17979 6705 5454 11314 14596 17221 9188 823 13953 17698 -4353 -9631 2900 -1081 -11778
225 -11778 -14398 -15066 -7296 -4210 -20099 -21084 -376 -2315 -16439 -8473 2739 4303 6467 2540
239B540P57J6402j486j7328P581J2532q953o832K446k027K823l919j4837L121
253g180J0509j2997r339J1443J817o722J820r32K503Q041o398m292J5829M663
267H765j0151M671R124j883r51l076k901Q806K40j4125K220J1726p287r831J052
282c601J68O14k987j0023L699J3137m908r448Q115P227l311k334r12M044Q626
297H106l525n727R621P123p625l858J898j118j004l672m584M319L759p312l042
312f641N658j453p016j297K344K555J69j602M432P915q32m917L201M604k100l716
328A304N37N358L751l063m600L062L708o844r067p13M541j877n383L77O123K266
344e20m496m239K818L633k373l448L922Q214K369j157J296L676Q59l850m684J796
$$ plain form
239 2540 3297 19699 18213 885 8466 20998 12045 5213 7659 5632 8455 4536 -10301 -7180
253 -7180 3329 -9668 -19007 -7564 -5747 -12469 -10649 -11581 -9078 -1037 -7435 -11727 4102 8765
267 8765 -1386 3285 12409 10526 9575 6499 3598 12404 12644 -1481 739 12465 5178 -4653 -3601
282 -3601 -3433 -2819 -5806 -15829 -12130 1007 -3901 -13349 -5234 1993 -1318 -3652 -4564 -520 8106
297 8106 4581 -1146 8475 15598 7973 4115 6013 4895 3891 219 -4365 -46 3713 -3599 -6641
312 -6641 -983 -2436 -9452 -10749 -8405 -5850 -5681 -7283 -2851 5064 4232 -685 2516 7120 5020 1304
328 1304 1841 7199 10950 7887 3287 6349 10057 3213 -5854 -6567 -2026 -3903 -9286 -8909 -2786 -520
344 -520 -5016 -9255 -6437 -2804 -5177 -8625 -4703 3511 5880 4723 6019 9695 10554 6704 2020 3816
360C816K485l361j597L290J957l621l760j966r99k441m751q48N408K425k727K134
376d556N328M66l025k570J506M354R4k610M464P202j56m667j87N22j657m160m288
393c940J834N044j759l994K348L146l548m990j292J214J583j341k60N188M924
408D157j697k353K183N13k585j627L10K945K293q79j085L174N38m937l192R74
424a268p04j968m29J311L517P32k771n65L028j308m826P87L804J007L29Q74J658
441C208L302q58n333K74L143l209k583K496J780N19J02l383o80K723m395n321
457h215L393K457k390J530J916r1K904j313m289L472L173m543O84N906m50L00
473D444J746k919M98K404n861k793N594j917m553L720Q7k928K034k853l519M921
$$ plain form
360 3816 6301 2940 1343 4633 6590 2969 -791 -2757 -3756 -6197 -10948 -11796 -6388 -3963 -6690 -4556
376 -4556 772 1238 -1787 -4357 -2851 1503 1597 -1013 3451 10653 10497 5830 5643 6165 4508 348 -3940
393 -3940 -2106 2938 1179 -2815 -467 2679 -869 -5859 -7151 -5937 -4354 -5695 -5955 -767 4157
408 4157 2460 107 2290 2803 218 -1409 -1099 1846 4139 3260 2175 5349 5887 950 -2242 -1268
424 -1268 -1972 -3940 -4369 -3058 459 1191 -1580 -2145 883 -425 -5251 -4464 -660 347 676 1550 3208
441 3208 6510 5652 319 593 3736 527 -2056 440 2220 2739 2841 -542 -1222 1501 -2894 -8215
457 -8215 -4822 -2365 -4755 -3225 -1309 -1400 1504 191 -4098 -626 2547 -1996 -1312 4594 4144 4444
473 4444 6190 3271 3769 6173 312 -2481 3113 1196 -3357 363 450 -2478 -444 -3297 -6816 -1895
489a895K23o544M450M499k714J046K518k233K708K371n718K085N962m927j564
504B67N611k099k758K578l891j609M824m648m683O195J57n792L264J263l769L973
520a117P9m739N510L258n866K544N368l839O91L209l753J282M019n737r74O224
536F159m531m195M836k651l226L991k606l585N391r41n338M699J197m878L569
551b109J811k988M460J674m816L857M428n898m40N330k976j161L384k838m0L408
567E086n002k197M188k708m520M082m82k573L428l02l710L795J027m075J854K840
583G31k594K138K295k548K564K636m342o37M061l180k158L253j416q84K031j978
599b8j557K044j785k912K447j62j731K121J507j284J668J035k403J239J766k212
$$ plain form
489 -1895 -1672 -8216 -3766 733 -1981 -935 1583 -650 2058 4429 -1289 796 6758 1831 267
504 267 5878 3779 1021 3599 -292 -1901 2923 -1725 -6408 -213 -56 -5848 -2584 -1321 -5090 -1117
520 -1117 -1038 -5777 -267 2991 -2875 -331 5037 1198 1889 5098 1345 2627 6646 909 -65 6159
536 6159 1628 -2567 2269 -382 -3608 383 -2223 -5808 -417 -1358 -6696 -1997 -800 -5678 -2109
551 -2109 -298 -3286 1174 2848 -1968 1889 6317 419 -21 5309 2333 1172 4556 1718 1678 5086
567 5086 84 -2113 2075 -633 -5153 -1071 -1553 -4126 -698 -1000 -4710 -915 112 -3963 -2109 731
583 731 -1863 275 2570 22 2586 5222 880 243 4304 1124 -1034 2219 803 -81 1950 -28
599 -28 -1585 459 -1326 -4238 -1791 -1953 -3684 -1563 -56 -1340 328 1363 -1040 199 1965 -247
615b47L91K676p31m89J531j110l82O18k034j545Q35l94j031Q94J55j025O69j37
633a356j708Q79O00p71j0K320N57J46R14K31j25N94r23q36J274L43j299P72J115
652B717j634r15o1j376p75O34j145l22J501L60r26J450k47r04J330K07j037J363
670B20J178j224J852J383j909L5R81k358J71J293k132o2K096j739j405J921j252
687i51j939J141l84j210K683J47j952K741R21j898J289R87k057J451J434j487
703I16J052K027k743k76K227k782j431J969k250j244L234j245k335K412q37k092
719c398J614j18j435K342O28j249K835J123k392J094J675k306P41J468j943N82
735A261J837j526m45J593k213j551J410j441j280J766j114r70K323l05j943J814
$$ plain form
615 -247 144 2820 2089 1600 3131 2021 1639 2257 223 -1322 -487 -881 -1912 -1018 -863 -1888 -1219 -1356
633 -1356 -3064 -2185 -1585 -2356 -2366 -46 511 657 1571 1802 1677 2271 1348 512 1786 2129 830 1602 2717
652 2717 1083 168 107 -1269 -2044 -1410 -2555 -2877 -1376 -1016 -1942 -492 -739 -1643 -313 -106 -1143 220
670 220 1398 174 2026 3409 1500 1535 2516 158 329 1622 -510 -572 1524 -215 -1620 301 -951
687 -951 -2890 -1749 -2133 -3343 -660 -513 -2465 276 1197 -701 588 1575 -482 969 2403 916
703 916 1968 3995 1252 976 3203 421 -1010 959 -1291 -2535 699 -546 -2881 -469 -1306 -3398
719 -3398 -1784 -1902 -3337 -995 -367 -1616 1219 2342 -50 1044 2719 413 1154 2622 679 1261
735 1261 3098 1572 1127 2720 507 -1044 366 -1075 -2355 -589 -1703 -2673 -350 -655 -2598 -784
751g84m75j599K071L87q17J964R59j720J846J424k655Q1J371j878K22J686j736
768C47K2J244j426j259J186j063j502J164n52L0J461J98j444J944L42j355O13
785e0Q19j095J255P90r89Q10R98j619l4K45j000q33N25q01q3R32n95m39O80n09
805i93q04P40J29j86M70L83K61J220L71j179Q12O27j034J05P3J89J09L0r59j6
825C48K92q98j178K01Qk95o8k70M03M86O8l61M51M61O7L41K48L94N30J34j49M06
847A619K25o72J89l96n10O0k95j37j91j15l20m10k35K43k64kJ65k05L00J91K88
868d72M12L88j37N48J79K13k30j82O86j53m91m24M28l3k71j91p12L49j77q52q2
889a204j20O52k13j6K93K82M10m70q6L25N71k15L89P2N93j86lm0m56J13p55l30
$$ plain form
751 -784 -1259 -2858 -787 -400 -1217 747 1706 -14 1832 3256 601 682 2053 175 397 2083 347
768 347 369 1613 187 -1072 114 -949 -2451 -1287 -1839 -1809 -348 -150 -1594 350 692 -663 -50
785 -50 769 -326 929 1719 730 1540 2538 919 885 1130 130 -703 -178 -979 -1062 -130 -725 -1164 -484 -993
805 -993 -1797 -1057 -928 -1114 -644 -261 0 1220 1591 412 1224 1851 817 922 995 1184 1293 1323 364 348
825 348 640 -258 -1436 -1235 -1227 -1522 -1590 -1860 -1457 -971 -903 -1264 -813 -352 -285 56 304 698 1228 1362 1213 1619
847 1619 1844 1172 1361 965 455 515 220 83 -108 -223 -543 -953 -1188 -945 -1209 -1211 -1046 -1251 -951 -760 -472
868 -472 -60 328 191 739 918 1131 901 719 1405 1252 761 337 765 732 461 270 -442 -93 -270 -1122 -1204
889 -1204 -1324 -672 -885 -901 -608 -326 84 -386 -472 -147 424 209 598 670 1263 1077 1074 1034 578 691 -64 -394
911c94J59P0l88K71o7l38j23j82l57K26J75m48O88J033k73L83O10m13J39J55o07
932C19J74P89l76l36O77k20n94m37k62n12J76m95o01P46L35l06M01K05o77N16
952d78j0r21J059R38o34J69J327j06k85M31q33j41N74j079n16J432l16p82M98
971C27j40j088N94o59j287J722P0j406J321Q29q52L98M83p29L44N69o78J93J589
990A600o91j16N20k73o77K76j060l44P85m31o69J081M2r84L96J63r12N00L78j094
1010a510J103J143q44L12P28l27m41J055j256M35J000r85k92J377p52q68Q36r21
1028b07m02J52k26q50J170M0r90O82O68p83N59K36r54P67Q24j036O30J093o22
1047G51J5M83m00m01L55m36l31R78j001o01Q92j38r91J05q0k54N00L0n64P99L49
$$ plain form
911 -394 -235 -165 -553 -282 -349 -687 -810 -992 -1349 -1123 -948 -1396 -708 325 52 435 1045 632 771 926 319
932 319 493 1282 906 570 1247 1027 433 -4 -266 -778 -602 -1097 -1698 -952 -617 -923 -522 -317 -994 -478
952 -478 -488 -1409 -350 588 -46 123 1450 1344 1059 1490 657 516 1090 11 -505 927 611 -171 327
971 327 187 -901 -307 -966 -2253 -531 -461 -1867 -546 283 -569 -171 312 -417 -73 496 -182 11 1600
990 1600 909 793 1313 1040 363 639 -421 -765 20 -411 -1080 1 43 -941 -545 -382 -1294 -794 -416 -1510
1010 -1510 -407 736 -108 204 932 605 164 1219 -37 398 1398 413 121 1498 746 -122 714 -207
1028 -207 -609 -457 -683 -1533 -363 -323 -1313 -631 37 -746 -187 49 -905 -138 686 -350 280 1373 751
1047 751 766 1249 849 448 803 367 36 1014 13 -588 304 166 -825 -720 -800 -1054 -554 -524 -1088 -289 60
1068F0p81N73J84j67L48K44j94K59N69n17o5O75m63o32N11m07k40J90l0n25O07
1089A99p09k91J83R2k61J07N82m15L65L56m10M04O13k30l81Q4K86k76L74r1n70
1110A1M92k11o99J97K47m53m41J97J89j42K44l03k31P04K2n23O71N36l02O4L80
1131F49k60L44J82o60jK09n2l47O28m51m27J70n03K1L97o88k90O91j67k0M20j22
1153b77j67K97J09m09O74L67m39J88N76m93K01J65m67j37M34o95j56O09m55k13
1173b88K15j89l87L65k36m54P08j02m85N98K80l93N17N87o43M09K2o14N01P88
1193A199r57O3N74q39J28M11p03l21J056o38o51N93j58m32M54j13n07O59J8l47
1213e11O73R0n01L73M01o95P41K56q23K91M16m58m10Q55l91m90M35l75l16L26
$$ plain form
1068 60 -721 -148 36 -131 217 461 267 526 1095 578 513 1188 725 93 604 197 -43 147 117 -408 199
1089 199 -510 -801 -618 -526 -787 -680 -98 -513 -148 208 -202 202 815 585 204 288 574 298 672 581 11
1110 11 503 292 -407 -210 37 -416 -857 -660 -471 -613 -369 -672 -903 -199 -177 -700 -29 507 205 269 649
1131 649 389 733 915 255 254 463 411 64 692 241 -186 -16 -519 -498 -101 -789 -1079 -388 -555 -575 -155 -277
1153 -277 -444 -147 -38 -447 227 594 155 343 919 426 627 792 325 188 622 -73 -229 380 -75 -288
1173 -288 -73 -262 -649 -284 -520 -974 -266 -368 -853 -255 25 -368 149 736 93 502 524 -90 411 1199
1193 1199 242 305 879 40 168 579 -124 -445 611 -27 -678 -85 -243 -675 -221 -334 -841 -182 -164 -511
1213 -511 162 252 -249 124 525 -170 571 827 4 295 711 253 -157 698 307 -183 252 -123 -439 -113
1233a13l50k73P97k55q01P20q1j01N60O1k60P28j49n47O35K35o95J91J04j67L66
1254F05j85m01r5L93n47l56K11j0k37K45k69K43J39k65j03O05km12M85j4P7N02
1276F09p9k74M20J10m89k37M62k60K2L6k55Q0j74l43j46J61p4k37J43K02j35M31
1298b7k0k57L77J96l79J42J68k0P2l7K34K01j20l32l47K50n1j45j23j59M37j24
1320f4l74L00j22J87l41K8J82J06q7K87L86P5mn72J20J07P8r9o2K85N1k26j59
1343H2k34k29K88k45L5j78J88k62J31K08N5R7j75P4J47j22K96j01L24j62LJ66
1365C86J13o2l34j31K47k21J39l13J9K28j19j66m9K60l64o9K10j2J86o9l8L14
1387A55k3N9k00j9K37K8J93P8k63L40n36N55n10J9l17R9N1l1k33J08l60O20k23
$$ plain form
1233 -113 -463 -736 61 -194 -995 -275 -356 -457 103 164 -96 632 483 -64 571 806 111 302 406 239 605
1254 605 420 19 -76 317 -230 -586 -375 -385 -622 -377 -646 -403 -264 -529 -632 -27 -29 -441 44 30 107 609
1276 609 530 256 676 786 297 60 522 262 284 320 65 145 -29 -372 -518 -357 -431 -668 -525 -323 -458 -27
1298 -27 -47 -304 73 269 -110 32 200 180 252 215 449 650 530 198 -149 101 50 -95 -218 -377 60 -64
1320 -64 -438 -138 -260 -73 -414 -386 -204 -98 -185 102 488 563 559 -13 107 214 292 193 131 416 467 241 82
1343 82 -152 -381 -93 -338 -303 -481 -293 -555 -424 -216 -161 -64 -239 -165 -18 -140 156 55 379 217 220 386
1365 386 499 437 103 -28 219 -2 137 -176 -157 71 -48 -214 -263 -3 -367 -436 -226 -238 -52 -121 -159 155
1387 155 132 191 -9 -28 209 237 430 508 245 585 49 604 94 113 -204 -105 -54 -85 -318 -210 -570 50 -173
1410a73k96K03K04j00N1j33K76J53K31l27J82K92l33k67K50j66j6j25mP9j00J09
1432a0l76K87P6k53O4k21L34J15j4k88L27K03l01O7K11K0R8l11k9L58J71n63K10
1455A75J43j59m37j58L00k04J74k88N2L82n8l08J40l7L04K21n58K17M63l09Q0
1476A35K2J85p3Q3l92K71k44O6O7j12J99k06k30J95j37Lj1k9j7r2n6J30L21j33
1500e5j10J68O9%j09J06j19J23J81j72l45M79K44k77rk30k31J52J4k43L28om19
1523d61R1K71J80k59K5J59K41l11P5O6K82j24k18J01P7k16P9O4l02L92j66j97
1545a51J87Q7m25j12N0n3J02j00J80J75K69l29k73M78m5m7K46j10J13K99n72K80
1567B49k93J3J46j92O9J6l5l8J35j15m8j50J00K71j21j21j18k07J53N93j52j93
$$ plain form
1410 -173 -469 -266 -62 -162 -111 -244 32 185 416 89 271 563 230 -37 213 47 31 -94 -98 -19 -119 -10
1432 -10 -386 -99 -23 -276 -212 -433 -99 16 2 -286 41 244 -57 10 221 241 339 28 -1 357 528 -35 175
1455 175 318 159 -278 -436 -136 -340 -166 -454 -402 -20 -78 -386 -246 -283 21 242 -316 -99 364 55 135
1476 135 157 342 269 352 -40 231 -13 53 120 8 207 1 -229 -34 -171 -168 -179 -208 -225 -317 -373 -243 78 -55
1500 -55 -165 3 72 72 -37 69 -50 73 254 82 -263 216 460 183 174 -56 -287 -135 -121 -364 -36 -42 -461
1523 -461 -370 -99 81 -178 -153 6 247 -64 11 77 359 235 17 118 195 -21 58 122 -180 212 46 -151
1545 -151 36 123 -302 -414 -364 -417 -315 -415 -235 -60 209 -120 -393 85 40 -7 239 129 242 541 -31 249
1567 249 -44 -31 115 -77 -8 8 -27 -65 70 -45 -93 -243 -143 128 7 -114 -232 -439 -286 307 155 -38
1589c8L13J21l31l0L6r2k49N15j52k26J24oj8K14Nn44O3J78J67l52q6K85R2j0
1613b1M5J32q6l14M63Pk14J85J08j88J50J61l72q3M88m45k11M3K3J20j26k19J29
1636b25J46K20m49Q4L10q5J4J00q4n6K92l44N1M80m72j90K35J35j24J50o4n4R1
1659A61l00L0L14l22r7RR7n1L08k06j02j22K07j42J99J64l02J33M73n41N65k20
1681B55r2k04M8o1k61J28N4L6k8J7lL71m22J7K28r7l1n6J15j1j0J14O2j6p6k13
1707a36K43J72k31j03J80k5J41J02l56J07j40l72M11q9q0K23k14L9j35K24j32
1728a71k92K06M34l77m9L50K64l30l2J66j66K3l03J24K50j82Q8j7K6j72J19k62
1750c03K53q4R5l13L78k79K72K2k10O8R1j7k66N63k09jR8j5k27pJ35j17K47k00
$$ plain form
1589 -38 275 396 65 35 71 -21 -270 245 93 -133 -9 -15 -33 181 186 -358 -295 -117 50 -302 -388 -103 -11 -21
1613 -21 24 156 70 -244 219 226 12 197 305 117 267 428 56 -27 461 16 -195 -152 -129 -9 -135 -354 -225
1636 -225 -79 141 -308 -224 86 1 15 115 31 -25 267 -77 -26 454 -18 -208 27 162 38 188 124 70 161
1659 161 -139 -109 205 -117 -214 -205 -108 -159 149 -57 -159 -281 -74 -216 -17 147 -155 -22 451 -90 475 255
1681 255 163 -41 7 -54 -315 -187 -133 -97 -125 -108 -111 260 -162 -145 83 -14 -45 -101 14 3 -7 107 169 153 77 -136
1707 -136 107 279 48 -55 125 100 241 343 -13 94 -46 -418 -7 -96 -176 47 -167 -128 -263 -39 -171
1728 -171 -463 -257 177 -200 -249 101 365 35 3 169 3 26 -277 -153 97 -85 3 -14 12 -160 -41 -303
1750 -303 -50 -134 -39 -352 26 -253 19 41 -169 -101 -10 -27 -293 270 61 60 158 143 -84 -91 44 -73 174 -26
1774b6j1j80L42k00j64L30J7k93J67k26L78l52L23m50j27M96j92J98K21q1L2j
1796B01l32R7L72l59J50j37L19O1n63K03j8J84m19N8j62M43N1l47R5J41Q7j61
1818c6p9R2l5J42N7j50M11k89j50P2J86j98k66J1M07j28n6l72M50J79n50J22J70
1841a0k7L3j12J01J02J9j46K06J02N3k38J04J02k42j45j61L53J61j64k54J71N4
1863F2J07k87r2M4J94j53l06L72J26j98Q7p5J61J63l03k44N05pj89n1j9M07n40
1886b36J26J61p9L15j39j53J83j08l22M3L37q2mn06L68P3Q8k83K31J37j3o1k60
1909a84K86l31K37m21L98pR1k62P7J49p3j66J0L25j81J8k05L50p1j63j9K54J50
1932B62k44l59K99J75J34m02j27K53L82n6m28J37K03l15j04k3J53K58m10P3J59
$$ plain form
1774 -26 -37 -217 125 -75 -239 91 108 -185 -18 -244 134 -218 105 -345 -472 24 -168 30 251 170 202 201
1796 201 -131 -34 338 -21 129 -8 311 372 -191 12 -6 178 -241 -183 -345 98 149 -198 -103 38 125 -36
1818 -36 -115 -23 -58 84 141 -9 402 113 -37 35 221 23 -243 -232 175 47 -9 -381 69 248 -302 -180 -10
1841 -10 -37 -4 -116 -15 87 106 -40 166 268 321 83 187 289 47 -98 -259 94 255 91 -163 8 62
1863 62 169 -118 -210 -166 28 -125 -431 -59 67 -131 -44 -119 42 205 -98 -342 163 156 -33 -84 -103 304 -236
1886 -236 -110 51 -28 287 148 -5 178 70 -252 -209 128 46 42 -464 -96 -23 65 -218 13 150 137 76 -184
1909 -184 102 -229 8 -413 -15 -22 69 -193 -116 33 -40 -206 -196 129 -52 -34 -239 111 40 -123 -142 112 262
1932 262 18 -341 -42 133 267 -135 -262 -9 373 317 -111 26 229 -86 -190 -213 -60 198 -212 -139 20
1953B0%j17j51j7J51J57j11m6L74k85j30R8J20m46L81p4J64j1r7j04L76l24J18
1976D6l42M3R0J24m5M6J79J6l66J0K15M8l60j40K19K91Rk55J31J02M15m46k23
1999a93M26Q7l29k04J48j4L2K02k74K43J66m36J82j5j17M5l04L74q7M29m93K20
2021H8J13o7k51K80j01L5o9j47N3L43l84j54L07j73J39l20r5M27J28k60l0J00
2043c8Q1m7j67J58K5oL6q4Q2p4p1Q3N5K27j23k09K21o1j41P3J35J11l5l08k2J29
2069C0r2J4K2Q7n7o1R5j44P4k24K89j73K86l29n3K47j60L33l45J87J11o1j57J3
2093f8R6j67K6L7R7j04J80l69K10K31q1l49L34P1l1k7K47l70J24k21j8J99m8L4
2117C3l50L54j65l1K13l39J37J54l44L02l0Q6j52M05m20K80m1j69J64J58k17L8
$$ plain form
1953 20 20 -97 -248 -265 -114 43 -68 -114 260 -25 -155 -57 63 -383 -2 -76 88 77 -20 -124 252 -72 46
1976 46 -296 -253 -163 -39 -84 -38 141 157 -209 -199 16 64 -296 -436 -217 74 83 -172 -41 61 476 30 -193
1999 -193 233 320 -9 -213 -65 -79 -47 155 -119 124 290 -146 36 21 -96 -51 -355 19 -68 361 -132 88
2021 88 201 134 -117 163 62 97 28 -119 -66 277 -107 -261 46 -127 12 -308 -403 24 152 -108 -138 -38
2043 -38 43 -4 -171 -13 12 6 42 -42 40 -34 -105 -22 33 260 137 -72 149 88 -53 20 155 266 231 -77 -99 30
2069 30 -62 -48 -26 61 4 -57 38 -106 -32 -256 33 -140 146 -183 -236 11 -149 184 -161 26 137 76 -81 -68
2093 -68 28 -139 -113 -76 21 -83 97 -272 -62 169 88 -261 73 144 113 86 333 -37 87 -134 -152 47 -1 33
2117 33 -317 37 -128 -159 54 -285 -148 6 -338 -36 -66 20 -132 273 -147 133 92 -77 87 245 28 66
2139F6k89M00j6j95O8K7L5M2l74J23j22L18j03O1o7l42K60r2J23J61j49J93N4
2162A82n7j53j77K09J20l4j76K5J37R1pn1J07k5j08m4J6J55j07k01R6n5L75l43
2186b5m0K49m9p3l03J57J24k3J09m13K84M1N1j73K62O4j04j6j86K88m04j10M24
2209A34J52j17K0j62J03j80O5p7K83k7k40k54L8L34j2p2j20L24q1l05JM27p3j02
2233E9r4Q8Q3k77K00pj77J21Jr8J69m0K17m06J32J43j67K31Ll4O1k74O5j1J05
2258I3l05M8L03j61M3j07L39j37k82J06P4j43J98k2r0m8j4L15k52J3K05j70J9
2281B5j37L28k02J44j40j16K61l22K13Q2J57l25j18k15M78k42K45k16J71J89l10
2302e0R6j36J85k51J45J4M8j10J68k25K99k66m4J49K1r0J45n7O3j4l72J71L15
$$ plain form
2139 66 -223 177 161 -34 34 61 96 138 -236 -113 -235 83 -20 41 -26 -368 -108 -200 -77 84 -65 128 182
2162 182 125 -28 -205 4 124 90 -86 -61 76 167 160 109 216 191 83 39 55 210 103 -98 -2 -57 318 -25
2186 -25 -65 184 135 62 -241 -84 40 17 126 -287 -3 38 89 -84 178 242 138 122 -64 224 -180 -290 134
2209 134 286 169 189 27 130 -50 15 -62 221 194 -46 -300 -262 72 60 -12 -132 192 111 -194 -193 234 161 59
2233 59 -35 53 136 -141 59 52 -125 -4 -3 -101 68 28 245 -161 -29 114 -53 178 181 147 208 -66 -1 -12 93
2258 93 -212 -164 139 -22 21 -86 253 116 -166 -60 14 -129 69 47 -43 -91 -105 210 -42 -29 176 6 25
2281 25 -112 216 14 158 18 -98 163 -159 54 136 293 -32 -150 -365 113 -129 116 -100 71 260 -50
2302 -50 46 -90 95 -156 -11 3 51 -59 109 -116 183 -83 -127 22 43 -47 98 41 104 90 -282 -111 204
2325B04q9k71K88k29J06J32j37j68QL38k62L3K27k45K33l57L04m4j09KJ37Rj67
2348e7K18k05j19L88n45L19J01J3k53J55L0qn9J68k41P1J22o6O2Nq1p3J47k8j96
2373a32k8J71k91L10Q1R8j31k33J28QJ53l39oR3k3J57k63N75m03J03K02k0j4p6
2397A20k1k66M04k71J9K1L5j52J07Q9q8K49j64j61j41K08P3Pq3P0K1k29K64O8
2421A79k29N2R8o5n8r4J81K6Jj82K17l08L33qr0k24L82k09q1j37L02Nk28K7J86
2446G6l43J40L9L06j63j94K62j78P7r1K70m71L24P8k84J81k66K48k56j34M17k8
2468A0J84J01k35J82k71j2j06J77j43R0r1K25l5p3P8n36L91J6p7L59n3j64l7K9
2492IO4j33n6J38M4l04P5J37N7J21k06J07nj48L56l04j22J16N5j0k2n4M8L82l49
$$ plain form
2325 204 115 -156 132 -97 9 141 4 -164 -156 182 -80 -47 180 -65 168 -189 115 71 -38 -36 101 110 -57
2348 -57 161 -44 -163 225 -320 -1 100 113 -140 15 45 37 -22 146 -95 -24 98 32 94 99 18 -55 92 64 -132
2373 -132 -160 11 -280 30 111 209 78 -155 -27 -19 134 -205 -211 -118 -141 16 -247 328 -75 28 230 210 196 120
2397 120 99 -167 237 -34 -15 6 41 -111 -4 85 -3 246 82 -79 -220 -12 61 68 -15 55 76 -153 111 179
2421 179 -50 2 100 35 -23 -117 64 90 91 -91 126 -182 151 143 53 -171 211 2 -79 -216 86 91 -137 -110 76
2446 76 -267 -127 -88 218 55 -139 123 -55 22 -69 201 -270 54 132 -152 29 -237 11 -245 -379 38 10
2468 10 194 295 60 242 -29 -41 -147 30 -113 -23 -114 111 76 3 81 -455 -64 -48 -125 234 181 17 -20 9
2492 9 73 -60 -116 22 66 -238 -163 -26 31 152 -54 53 48 -100 256 -48 -170 -54 1 -9 -31 -85 -37 345 -4
2517dJ17n1j62K38j12N2l8Q9rN6l97R0K00j21P8j18j41L70Lk81K54l43O2L14k33
2542h7J44j53j06mp1mJ91JJ36Q6J59l5m27K39Q6l17o0K25J63j48K50k42l4N3j32
2567h7K59K5m93N44j14l68L46l88J99J03J25m23L64J00K8j88L2j05r3K25k64j9
2589a92K04n2P3Ll58L07J34p7k17J18J82q9M35l64j50K56j84J05l49K2l1K72j56
2612a08j83L41j12j3j7N1p7J26k05L21k31jJ16k17K65K81l66O2j43M3K3o2k6L14
2636A82j62J5p4k37J20P3J97J15l57J94J0j46K50k39j26K87J76n4k84P9k3K40
2658B36j2jk31n2K02j18j42L70l90K15l14P2L8m6KK02J4q5p6n2J98j89J32k5j58
2683b10L46j37j62J07N1M0K93m11K33L9k19l02M28j44J80k11J08J48l97J86j27
$$ plain form
2517 -4 113 62 -100 138 26 78 40 129 120 176 -221 -131 69 -52 26 -92 -233 137 140 -141 113 -230 -168 146 -87
2542 -87 57 -96 -202 -206 -277 -281 -90 -89 47 133 292 257 -170 69 155 -162 -222 3 166 18 268 26 -8 45 -87
2567 -87 172 197 -296 248 134 -234 112 -276 -77 26 151 -272 92 192 220 32 64 -41 -134 91 -173 -192
2589 -192 12 -40 33 36 -322 -15 119 42 -175 -57 125 36 471 107 -43 213 29 134 -215 -193 -224 48 -108
2612 -108 -291 50 -62 -75 -92 -41 -118 8 -197 124 -107 -108 8 -209 56 337 -29 33 -110 -67 -44 -106 -132 182
2636 182 20 35 -39 -276 -156 -83 114 229 -128 66 76 -70 180 -59 -185 102 278 224 -60 19 -4 236
2658 236 224 223 -8 -60 142 24 -118 252 -138 77 -237 -165 -127 -173 -171 31 45 -40 -116 -168 30 -159 -27 -52 -210
2683 -210 136 -1 -163 -56 -5 35 328 -83 150 189 -30 -332 96 -48 132 -79 29 177 -220 -34 -161
2704a61L60k91L6K3l05L37J79j7l26J08J06r3j05N8J31j54j48L39k25N3j04L54
2726A55Q8m61M70m23K57R3m8lR7m80K40K6R2j17QJ09r4L5j20K5j84K50k36K70
2750D9J41j47j34K73l8j77K3o7k4J23j34K25j94Q9j90K49k4K37j96j3j97J45K14
2773B33j52l28J73j6J87J21k60O4L3j16J08J90k86j66L47M2m8k09j50J04K54k
2795A23q4m0L6N3j60M0p9J33j13K03k78K04m7P6R1k10K67m5m00L2K07J47j01j39
2819h4j10J11K92l12J95j54J77L48l81R0j59J81k06K78k84O7L6j69K73J39l58
2840c0J53l90J32O2K8j57K54j60Pj67J03K81p7j60j6J24l8P4K7o1J12LJ65k43
2864B6l4J90q5j16NN1K28l17L23r7j14j50q0J22J30J12k57K62j22K2p0o0k19Q6
$$ plain form
2704 -161 199 -92 -56 -33 -338 -1 178 161 -165 -57 49 -44 -149 -91 40 -114 -262 77 -148 -95 -199 155
2726 155 243 -218 252 -171 86 179 131 128 225 -255 -15 11 103 -14 -6 103 9 44 -76 -51 -235 15 -221 49
2750 49 190 43 -91 182 144 -33 -10 -77 -101 22 -112 113 -81 8 -182 67 43 280 84 71 -126 19 233
2773 233 81 -247 -74 -90 97 218 -42 22 55 -61 47 237 -49 -215 132 174 126 -83 -233 -129 125 123
2795 123 39 -1 35 88 -72 -32 -111 22 -91 112 -166 38 -9 67 158 -52 215 170 -230 -198 9 156 55 -84
2819 -84 -194 -83 209 -103 92 -62 115 463 82 172 13 194 -12 266 -18 49 85 -84 189 328 -30
2840 -30 123 -267 -135 -73 -45 -202 52 -108 -101 -268 -165 116 39 -121 -137 -13 -51 23 50 -11 101 104 269 26
2864 26 -8 182 97 -19 -14 37 265 -52 271 174 60 -90 -170 -48 82 194 -63 199 77 99 29 -31 -250 -164
2888a64N6J43j50J87NN1j82K30OJ3k23j63K57m53K71L15j40q8J51J1j2j77l1j32
2912b19L09k23l9P5K2J96q5k0J9k93J07K41j71K43n6j7j69j40N24l53R8J27r7
2935G9k08M04j95j19K99l72K40j5j39J62r6k35K32q9K49j87k06K00J9r1L00p7
2957A55l32K35n3j78L13J18o20L38J03k08K03r5N4N4k22K85j11j62Kl2K91q8J8
2980F8j14j3j61K67k15J65O5Q2l6k05J70j90K08l56J2J63Q4L2k43K15J23l11J91
3003Aj39m7J66J61k08J43q5L3O0K01l89J01n3J38M01n09K08k0p2q8j33N9J7pM0
3028b1J99j38L9J1j01k6J07o2j50K69R2l51J14m9K62n3j46m9p0o6J76K5p0k5j88
3053b71K76J2k75K60o5m6KJ30k80K90j50L08k92K14p3j56N3j59J11j3J79J75p6
$$ plain form
2888 -164 -108 35 -115 72 77 128 -54 176 182 195 -28 -191 66 -387 -116 199 59 -29 122 133 121 -56 -87 -219
2912 -219 90 -133 -172 -97 -75 121 36 16 35 -258 -151 90 -81 162 106 89 -80 -220 304 -49 49 176 79
2935 79 -129 275 80 -39 260 -112 128 113 -26 136 40 -195 37 -52 197 10 -196 4 23 -68 232 155
2957 155 -177 58 5 -173 140 258 -362 -24 79 -129 74 -21 33 87 -135 150 39 -123 -121 -153 138 50 68
2980 68 -46 -59 -220 47 -168 -3 62 144 108 -97 73 -117 91 -265 -253 -90 -6 26 -217 -2 121 -190 1
3003 1 -138 -185 -19 142 -66 77 -8 25 85 286 -103 -2 -55 83 484 -25 183 163 91 3 -130 -71 -54 -61 -21
3028 -21 178 40 79 90 -11 -37 70 8 -142 127 219 -132 -18 -67 195 142 -4 -53 -123 -189 -13 12 -58 -83 -271
3053 -271 5 17 -258 2 -63 -109 -107 23 -257 33 -117 191 -101 113 40 -116 -63 -222 -111 -124 55 230 154
3076A54q5Rj35K98m39J76M1k2j45J96m0oJ05J03k23k3j54M45k04J7k23K62r9j53
3100a45J46m0k26L38k20MK39k07Q3N1Q5q2J42j99k11M00p4l06K09j81K97J3l59
3123b43M20j8k90j67N99k38J9j0K5j3j88Q9R6j72J97j49J1O4o8K31m09J57R3J41
3147A77k22p6R1mQ1j13J56j0k5K6J9l39K21M4k6k50L92Ll28K5K16k30K13k01O9
3172i1L87j23N1j79p0qK03j77J2m4q6J64j45N7Q3J92j23kK99k51k21L05n9l9P7
3197B12k14p6j07J15P7J11k66J74j28L21l64R4K9J4p7n5J70lR6j44K64j53j1k2
3221E7K2k18J49K06k95K10M3k27j25R9K47l80JK98j48M7o0J50K5m8q3j33Q0J0
3245g3j61O8L02o5j06k61M61m8M4k97K8K69r9J4L8j87l1m2Q9J64k74J80om4J54
$$ plain form
3076 154 69 78 -57 241 -198 -22 19 -3 -148 48 8 2 107 210 -13 -36 -190 255 51 68 -155 107 8 -145
3100 -145 1 -39 -265 73 -147 -143 96 -111 -28 23 108 26 168 -31 -242 158 84 -222 -13 -194 103 116 -243
3123 -243 177 159 -131 -298 301 63 82 72 97 84 -104 -15 81 -91 106 -43 -32 32 -36 195 -214 -57 36 177
3147 177 -45 -121 -30 -34 47 -66 90 80 55 81 100 -239 -18 26 0 -250 142 145 -183 -158 58 -172 41 -160 -91
3172 -91 296 173 224 45 -25 -33 170 -7 5 -39 -125 39 -106 -49 34 226 103 101 400 149 -72 233 174 135 212
3197 212 -2 -78 -185 -70 7 118 -148 26 -102 219 -145 -51 -22 -8 -85 -140 30 27 123 -21 243 90 79 57
3221 57 79 -139 10 216 -79 131 174 -53 -178 -79 168 -212 -211 87 -61 -14 -74 76 101 53 -30 -163 -83 -73
3245 -73 -234 -166 136 71 -35 -296 165 117 161 -136 -108 161 62 76 114 -73 -104 -146 -57 107 -167 13 7 -37 117
3270A17j77J08J25j93j46K50J35j5j90L4n3l9P6n2O9M5j54j07M6K9K86l02M2j75
3294b41J10J67j81L54j75j66l8K4M02l35j07l3K00j73L12j20l0P2j72Q7K9m5J02
3317D3l4j31J97j28j30L03m6j24l8K26j76l2L8M3n2L0O4K3M5j0j24k1P9j79J83
3342D9J02m11M2K75q3PL1o0K21j83o2q9K34J64m66K45j67mJK47n7q4J18P2j1k61
3368a30M79k67j36p9J57p7l4K15k09OK20n31M82Q8l38K78J41l16q4J29K88l44
3390f2Q9j80Q7N1n7k3J65k44Q5L27k87J6P0j58J58pk55L9J31k7j3PO8J41j75J98
3416A44j9Q8o4k87K82r3M3k26R3N0P2k59K19j25J34R0k65L3L3J17J09k81J13j0
3440iJ81j12j63K66k42j11J26q9J54P0K03j44j26K47n90M70m1J58k82k90J24J39
$$ plain form
3270 117 -60 48 173 -20 -166 84 219 204 14 48 -5 -44 32 -20 49 94 -60 -167 -121 -92 194 -108 -66 -241
3294 -241 -131 36 -145 209 34 -132 -170 -146 256 -79 -186 -219 -19 -192 120 0 -30 42 -130 -43 -14 -59 43
3317 43 9 -122 75 -53 -183 120 74 -50 -88 138 -38 -70 -32 11 -41 -11 53 76 121 111 -13 -34 45 -134 49
3342 49 151 -260 -218 57 -26 -19 12 -48 173 -10 -72 -161 73 237 -229 16 -151 -155 -154 93 36 -48 70 142 131 -130
3368 -130 349 82 -54 -133 24 -53 -87 128 -81 -75 145 -386 96 184 -154 124 265 -51 -135 -6 282 -62
3390 -62 27 -153 -66 -15 -72 -95 70 -174 -89 238 -49 -33 37 -121 37 30 -225 -186 -55 -82 -95 -88 -20 121 -54 144
3416 144 125 213 149 -138 144 51 94 -132 -39 11 83 -176 43 -82 52 142 -123 -90 -57 60 169 -112 1 -9
3440 -9 172 60 -103 163 -79 -190 -64 -153 1 71 274 130 4 251 -339 131 90 248 -34 -324 -200 -61
3462f1j36J63m4Q1O0l2Jk27K06J78k74N0P2o5J42p4k5l7J09k7k02J03P5J01j0
3487A27j76Oj15R0K85l30K32k03K6P4m6j1M5j90J81M8LJ72n4l08n2J38Q7k68K33
3512fK5j3k19K07q3J76n7k35K49k2k49K92j89J6p8K34j74J7RK65r2P7Kk63K88
3537A77j39J97l79J99J27l62K05j12k3J3K3K28q4j46m3L0Q2l06K43J31m11J55
3559a95K37Jk58O1P8QJ65j29l01K55J69k4p1j06J11k95L12j88l4N5J72l3J5j27
3583a22j6J32J33k12J0J2J65j12J81l39K83n0k7Lj17M3l8J06P5j68J02J4j02M8
3607DR7J07k72R4p5q6J74p5J33O6k19K88k46K54l68J79n5j91K42r6L48m58K20
3630F5L8o3P4q3l4j20o8J37J92j37L6PPj9q5L62k47O7p1j60L3m5j05L10k09L12
$$ plain form
3462 -61 -197 -34 -78 3 63 31 32 -195 11 189 -85 -35 37 -28 114 40 15 -22 87 60 -142 -39 36 137 127
3487 127 -49 -43 -158 -68 217 -113 119 -84 -58 16 -30 -41 4 -186 -5 43 46 218 164 -144 -196 -58 29 -239 -6
3512 -6 19 6 -213 -6 -89 87 30 -205 44 22 -227 65 -124 -108 -186 48 -126 -109 -100 165 73 150 152 -111 177
3537 177 38 235 -144 55 182 -180 25 -87 -110 -97 -74 154 70 -76 -119 -89 -7 -313 -70 61 -350 -195
3559 -195 42 43 -215 -154 -76 -68 97 -32 -333 -78 91 67 -4 -110 1 -294 18 -170 -204 -149 23 -10 5 -122
3583 -122 -138 -6 127 -85 -75 -63 102 -10 171 -168 115 65 38 41 -76 -33 -71 35 110 -58 44 58 -44 4
3607 4 101 208 -64 30 -45 -131 43 -32 101 167 -52 236 -10 244 -124 55 0 -191 51 -45 303 -155 65
3630 65 103 40 114 31 -3 -123 -191 -54 138 1 37 44 51 32 -53 309 62 129 58 -102 -69 -114 -219 91 -118 194
3656A94o2k59j08J65J28q9J40J10k67K0J28N2o2j59n7K5L02n1q7j7L1k77J45J98
3680A43q8L65m15p1K12j56o4k7J41K93k67k18J38k54L9K57k44J57J81Q9l93K07
3702B5l3l7k5k7J80j42J02kLj12N3R2j55M0j83K46j76j11J07L97k23j11j11J04
3726i9J09r7M3N0Oj26R3J02j75J44J53k34J00m0j19p2M1O4J80j51j57K14j2q8
3750g1p8L42k7J67l24O1m8k10K2L05O8J2j29Pj37R5J35k14k9k83M89n7o4N5l56
3775b69J93K07PN8k86K52j21M7l5K9k70L10o9k02K02K97k67M7k46J80o1K0n5L8
3799FM9k19K43k43J97J12k62P7k39J96K98m51L56l80L30j60J18M9j57J26J44l55
3821a65M7Q4J06K9l22R6j04J17qJ64m8J47j19j09q8K09j35R5N5K73l02o9L2p0
$$ plain form
3656 194 132 -127 -235 -70 58 -31 109 219 -48 -28 100 152 90 -69 -126 -101 201 150 63 46 77 -200 -55 143
3680 143 55 420 5 -66 146 -10 -74 -101 40 333 66 -152 -14 -268 -229 28 -216 -59 122 211 -182 25
3702 25 -8 -45 -70 -97 83 -59 43 41 44 -68 -15 77 -78 -38 -221 25 -151 -262 -155 242 19 -92 -203 -99
3726 -99 10 -87 -44 6 12 -114 -21 81 -94 50 203 -31 69 29 -90 -162 -121 -57 123 -28 -185 29 17 -71
3750 -71 -149 193 166 333 9 70 22 -188 -166 139 207 219 90 97 -40 55 190 -24 -53 -336 153 96 32 87 -269
3775 -269 -76 131 138 196 -90 162 41 88 53 82 -188 122 53 -149 53 350 83 130 -116 64 3 23 -32 6
3799 6 55 -164 79 -164 33 145 -117 -40 -279 -83 215 -236 120 -260 70 -90 28 77 -80 46 190 -165
3821 -165 -118 -34 72 101 -221 -125 -229 -112 -120 44 -4 143 24 -85 -173 36 -99 -4 51 324 22 -47 -15 -85
3845h5J75r8j43K84J14j89j23j45K70j37o3M5O5K30l58K7R3k23K21R6m0J83J3
3868B12o2Rk28Q8k06L03J64k36J97m34N54m87J44J3j26J91l23M9L03J53k20k8
3890C0j33L85k32j46J34p9K28l17K2J9J06O9j15k23RJ25J24M3j68J00o4Q3k24
3913b24J49J40J4j46j6K00k0k03Q7n5R7j23j34L03J3o6j08j25R4l0J85j21J75
3936H6n4q5Lk0oL58j11k49P6k1j82L76l37L17q8k58r9L19O1j11j37K18P5k63J37
3961Ej69L10j7j68J54J41j38R9k60JJ21k35J19j3o2j4O1K53l10K11p0Q0r8r1K38
3986A48j71j17R3l2l7j77L29k06k5M58l24kj2K90j70q2K45j31j01o2J24j11J00
4009B7Q5j21Kj58q1L52j30K22l00J15j00J18J70o1j48j77l2K22N7J66j77L7j14
$$ plain form
3845 -85 90 -8 -151 133 247 58 -65 -210 60 -77 -140 -95 -30 200 -158 -131 -38 -261 -40 56 16 199 212
3868 212 150 159 -69 19 -187 116 280 44 241 -193 361 -126 18 31 -95 96 -227 -178 125 278 58 30
3890 30 -103 282 50 -96 38 -41 187 -130 -108 -89 17 86 -29 -252 -243 -118 6 49 -119 -19 -83 0 -224
3913 -224 -75 65 79 -67 -83 117 97 -106 -19 -74 23 -100 -234 69 82 16 -92 -217 -123 -153 32 -89 86
3936 86 32 -53 -50 -70 -76 282 171 -78 -2 -23 -205 171 -166 151 63 -195 -294 25 86 -25 -162 56 131 -132 5
3961 5 -164 146 129 -39 115 256 118 217 -43 -42 79 -156 -37 -50 -112 -126 -65 188 -122 89 19 99 1 -90 148
3986 148 -23 -140 -47 -79 -116 -293 36 -170 -195 263 -61 -63 -75 215 45 -37 208 77 -24 -86 38 -73 27
4009 27 112 -9 -7 -165 -246 106 -24 198 -102 13 -87 31 201 140 -8 -185 -217 5 62 228 51 88 -26
4032b6j55K12k79K53Q2%j60M7J30j48rL00k06M6r4j57K76J27j4L4l40O8J60j66
4056a9k53K29K1k23L01r2J04k44J19J3m3o8K67j07N0L0J05m7j27j96M9J33j0K44
4080B36l01k1K83K4l27k07J67K49R1m58L91j6l7j09Q4N7k10K10m39L79j02j44
4102b00K50o9J40j03k29J59K17k26K3lK03p4p5J79j91o6p4r8J87r7K61K9J09k07
4126D5j69m0L08k80nJ69k42J23P3J62J35j29j17J39J32j49Kk35J61j76O8O0j50
4149a15l8J71k29Q3j05K47P3j46J9J54q9j2J35k81K18n9j73j42M00m7k60L56j19
4172D1k50J18J36J34Q6j57l5l9P8M2l52N4KL18j66K09r8K2j15l81J22P0R0K3J98
4197A50k81J53j08Q8r1Q8p6Q6k27M08k75j94J33o4K00Q3j17LK55N8jj08j27l98
$$ plain form
4032 -26 -181 31 -248 5 87 87 -73 -26 104 -44 -53 247 41 87 -7 -164 112 239 225 259 -81 -13 147 -19
4056 -19 -272 -43 -22 -245 56 -36 68 -176 -57 -44 -87 -155 112 5 55 85 190 143 16 -180 -131 2 -8 236
4080 236 -65 -86 197 221 -106 -313 -146 103 194 -264 127 111 74 -35 49 106 -104 106 -333 46 -56 -200
4102 -200 50 -19 121 18 -211 -52 165 -61 -38 -41 162 88 13 192 1 -65 -139 -237 -50 -147 114 143 252 45
4126 45 -124 -164 144 -136 -141 28 -214 -91 -18 144 279 150 33 172 304 155 157 -78 83 -93 -25 35 -115
4149 -115 -153 18 -211 -128 -233 14 87 -59 -40 114 25 13 148 -133 85 26 -147 -289 111 64 -196 160 41
4172 41 -209 -91 45 179 265 108 73 34 112 154 -198 -144 -142 176 10 219 121 143 28 -353 -231 -161 -71 -48 150
4197 150 -131 22 -86 2 -89 -1 -77 9 -218 190 -85 -279 -146 -210 -10 73 -44 -41 214 272 271 163 36 -362
4221c62L75k9m3N2m2K90j39r5k05J51J45m64M85J24l04Q0nl0q7L38k60K72o8j89
4245a0j49K50K30l20n7j43K19j04O1k1J91j59p4J21J5j75J43k89M2Q3J33o3J5
4268f1j3Q5j25J26j83K56j17Q9j24q4L17j12j13l07K29J30j89p9K34j08o8K2J24
4291g1J95j97J13o1J03j85J16k94M62l32J74p5m7K25j87K93l90J43j61p1K84j45
4313a08J39J75l34K06k17L05l57L59j46R4l5j24K72m08L6q0P2J09J21j0k68L80
4335A81l36J36Rr8J4J4J13j61J24J70j31j03k9l4Q4J85j69l2L16k54k5R0Q7jL8
4360A88p6J70j79j93qJ06J87j77j61J90k22K23J70o7j02j26J54k58K51k11K94
4381A53m9q6O3N4n0O7l61L80j93q8j54M96k27J35o8j27p6J63Rk40K04j98j13K80
$$ plain form
4221 -362 13 -16 -59 -7 -49 241 102 7 -198 -47 98 -366 119 243 -61 19 14 -16 -103 235 -25 247 179 -10
4245 -10 -159 91 321 1 -56 -199 20 -84 -23 -44 147 -12 -86 35 50 -125 18 -271 -229 -146 -13 -76 -61
4268 -61 -74 11 -114 12 -171 85 -32 57 -67 -151 166 54 -59 -366 -137 -7 -196 -275 -41 -149 -217 -195 -71
4291 -71 124 -73 40 -21 82 -103 13 -281 181 -151 23 -52 -99 126 -61 232 -158 -15 -176 -247 37 -108
4313 -108 31 206 -128 78 -139 166 -191 168 22 116 81 -43 229 -179 -143 -223 -151 -42 79 69 -199 181
4335 181 -155 -19 -10 -108 -94 -80 33 -128 -4 166 35 -68 -97 -131 -47 138 -31 -63 253 -1 -26 64 151 150 188
4360 188 112 282 103 -90 -98 8 195 18 -143 47 -175 48 218 151 49 -77 77 -181 70 -141 153
4381 153 104 18 81 135 85 152 -209 171 -22 -110 -264 232 5 140 72 -55 -131 32 41 -199 5 -193 -306 -26
4405b6K89k83KJ44rm68M26j14J3j77L00R8q5q1K59k16k51K03K2k27L69o9k07K50
4429A62k51J82j06J64J40l23pJ0J28r8K7M5J39m4j72p6K1K51j07n2k6j10q8KR9
4454i0P8j83J2J58j80J11J67m5r6n3%J64J3N5k15J0K32P5j01l05L9Q5J60j53J24
4479F2n4j1k80L22P7j67J45j32j59qL38l95L16J39l31L32j28K8n8j48K02Oj42
4502d6m1R0N9N7m34M8K14K1N9J43Ok43q3R6J54j77P5J7J29l54L11q2k07J11J81
4527A04N4j72j02N9J78O1r5o5j76J43J94k12J67j95J57j11j8o7OON7M3J55p0K16
4552C17l35l0j35K65j02j03J5K68j37q0k55L45m9K03j36O8l7r2O1l9J10k81J01
4575e8K33n06M11K02k16o0L2o6k9J78K0l2k96L49o1R1j43L14l09k39L15k40J04
$$ plain form
4405 -26 263 -20 -18 126 117 -351 75 -39 -26 -203 97 195 110 29 288 72 -179 24 46 -181 188 119 -88 162
4429 162 -89 93 -13 151 291 -32 -39 -29 99 1 28 73 212 168 -4 -80 -59 192 85 33 7 -103 -191 -189 -90
4454 -90 -12 -195 -183 -25 -205 -94 73 28 -68 -121 -121 43 56 111 -104 -94 138 213 112 -193 -154 -69 91 -62 62
4479 62 8 -3 -283 39 116 -51 94 -38 -197 -205 133 -262 54 193 -138 194 66 94 36 -112 90 96 -46
4502 -46 -87 3 62 119 -315 -267 -53 -32 27 170 176 -67 -150 -54 100 -77 -2 15 144 -210 101 19 -188 -77 104
4527 104 158 -14 -116 -57 121 182 87 22 -154 -11 183 -29 138 -57 100 -11 -29 -96 -90 -84 -27 16 171 101 317
4552 317 -18 -48 -183 82 -20 -123 -108 160 23 -57 -312 33 -16 187 51 119 82 -10 51 12 122 -159 -58
4575 -58 175 -331 80 282 66 6 38 -28 -57 121 141 109 -187 162 101 192 49 363 54 -185 130 -110 -6
4598fq5J0N4J35n4J5k9K5n0J89r9K13o13K17L7J32j88j07K87ok45J21j20K76o9
4623D0j56J36p0j38J07j0J85P5k78K47r6Q3j8J18j99j9l6qJ50j68J27k3k04L04
4647A49m2j74J97kq5%l2j85K05k5RK67n03K20P1k5k09P9J06j35J21Pkj70J20J95
4673A57Q9k85rl85L86J15ok5O9o4j32J08K06j23m8M4q2j27R5N6j56J18j24K24
4697A01j26J82oj61N3l1j96K02j6m7j4oL59l26J54J09l04J46k60j58N10k11n9
4720a05J76N9O5r6L7j59j85K68J21m0l35K83k16K05j99j0J44q9K66k56m8M1K5
4743d8K84m64M9r3M57r6l17J99j4R3j17J60L9o6o7J57l24J20q7n8L92k59K33k93
4767a20P6J12R5L2j37K9k06J53Q1l34J0L33l04k9p8L20j93J00J48k6j40J42k91
$$ plain form
4598 -6 -91 -81 -27 108 54 69 40 65 15 204 105 318 -295 -78 -41 91 -97 -204 83 77 -168 -47 -167 109 40
4623 40 -116 20 -50 -188 -81 -91 94 169 -109 138 42 125 107 225 26 7 -29 -37 113 -55 72 49 -155 149
4647 149 107 -67 130 128 43 43 11 -174 31 6 15 282 -221 -1 70 45 -164 -85 21 -114 7 14 12 -158 -38 157
4673 157 246 -39 -48 -433 -47 68 62 37 106 42 -90 18 224 101 53 97 15 -112 -17 39 -117 1 -123 101
4697 101 -25 157 151 -10 43 12 -184 18 2 -45 -59 -65 294 -32 122 231 -73 73 -187 -345 165 -46 -105
4720 -105 71 130 195 99 136 -23 -208 60 181 141 -194 89 -127 78 -121 -131 13 -76 190 -66 -114 -73 -48
4743 -48 236 -228 -179 -272 185 89 -228 -29 -43 50 -67 93 132 66 -1 156 -168 -48 -135 -193 199 -60 173 -120
4767 -120 -44 68 163 195 58 87 -119 34 115 -219 -209 124 -180 -209 -287 33 -160 -60 88 62 -78 64 -227
4790b27J13L05j70M3p9j82Q5K05j69J0j67Q2J88J24k26o6K6j46J68Q6o6R7k37
4813b03K72k06K51j14k07K09QK8j19J17j35J79O2j23J17p2j26j62J64J76J15l09
4835g8Q6M0j52j29J27J27l14L43Q7p8l12L20M2m0J8j4K8p3j56qK49o2o4j24J7
4860a20R5P0l6k47K20K35O7l46K00k25q3k7K16R3M2j28p8n3K10J13j24l3K1qj34
4885f0o4L35m69J76J48k15M09k29n4k41K82K4O9j58O0Q8j3j16J04p6J60R3l36
4908h3R7j06J90k07l3K77p2j67j67J26N8l5J05P5k49J71l2J34k85J81j25K52j14
4931iq9J15K8j87L90k26K17j79Q2o6k06J81M6j68K00j17M27k24j37R7k26K1J0
4954b0r0K20k06K43N1j46K45l22K29l47R5k85J41J62k76K36J16j0k0n3K46j43
$$ plain form
4790 -227 -114 191 21 64 -15 -197 -112 93 -76 -66 -233 -151 37 161 -65 -131 -105 -251 -83 3 -63 34 -203
4813 -203 69 -137 114 0 -207 2 10 38 -81 36 -99 80 142 19 136 64 -62 -224 -60 116 231 -78
4835 -78 8 48 -104 -233 -106 21 -293 50 137 59 -253 67 109 69 87 73 101 28 -128 -136 113 51 -13 -137 -120
4860 -120 -25 45 9 -238 -18 217 284 -62 138 -87 -170 -197 19 112 154 26 -52 -105 105 218 94 61 82 74 -60
4885 -60 -124 211 -258 -82 66 -149 260 31 -23 -264 18 42 111 -47 13 101 88 -28 76 0 160 253 -83
4908 -83 14 -92 98 -109 -142 135 63 -104 -271 -145 -87 -122 -17 58 -191 -20 -52 82 -203 -22 -147 105 -9
4931 -9 -98 17 45 -142 248 22 239 60 142 76 -130 51 97 -71 129 12 439 215 78 175 -51 -30 -20
4954 -20 -110 110 -96 147 198 52 297 -25 204 -143 -48 -333 -192 -30 -306 -70 46 36 16 -37 209 66
4976F6J2l2j99J13K59j82J08m4j90J42k45J63J29j35K13k11l45M31j90o6J86K5
4998HJ66j96j39J89j13K26k00K35Ok00K01k96J15M6R8j90L4p2M1j44J68J96j70
5021Ij3J00k35K09m10N94l42L0M4N4R3j04oP5q3k57M7j46J73J20n2J53j0j34J61
5046G0Ml15M07j89MN8o1k1NJ9R5k9k04K31Q9J36k25R7n44K14J73K0Mk03K02j21
5072h4M6k86K60j66L32l45J45p7J67M6j19J72nOl56K61K34k9k45J56lk29mK89
5096A66j84R5l36K86l7J35l4L3k4n4j12k43K46p6J59O1j54j22K02M7o6P5j19L46
5120B90k89j18L20r6k9j9L9k79M07l90o8J32K16j12M4j61l0J92j70J73J17j88
5142a9R1K8j11J32r2q5K15j65m8J51r4l3j23J18J01P8j20J41P5r8l14L05j43K60
$$ plain form
4976 66 78 46 -153 -40 219 37 145 101 -89 53 -192 -29 100 -35 178 -33 -378 53 -137 -203 -17 8
4998 8 174 -22 -161 28 -85 141 -59 176 182 -18 183 -113 2 48 146 -44 -10 -82 -41 -185 -17 179 9
5021 9 -4 96 -139 70 -340 254 -88 -58 -14 40 133 29 23 98 15 -242 -195 -341 -168 -48 -100 53 43 -91 70
5046 70 74 -241 166 -23 -19 39 -22 -43 -38 -19 76 47 -157 74 163 299 74 171 -373 -159 14 34 38 -165 37 -84
5072 -84 -38 -324 -64 -230 102 -243 -98 -175 -8 38 -81 91 86 92 -264 -3 231 202 -43 113 110 -119 -123 166
5096 166 -18 77 -259 27 -10 125 91 124 100 46 -66 -309 -63 -139 20 81 -73 -195 7 54 -12 63 -56 290
5120 290 1 -117 203 107 78 59 98 -181 226 -164 -232 -100 116 4 48 -113 -143 49 -121 52 169 -19
5142 -19 72 100 -11 121 29 -56 159 -6 -54 97 3 -30 -153 -35 66 144 24 165 240 142 -172 133 -10 250
5166B50l46K52k20J52%l1q7j72L63M4k87P6J09k40K71k39k09L95k20K94j72K25
5188B08k66P1pl8O9J68k82P0Q2J82l48m4J57m5J13j35J97j35K79j30N3K8k52K0
5212A5n0P0j15nj08K43k9J02k07J23K19m56J36J8L5L9m9j11K38q8N7j04J07r3
5236a3O4k3R1j0o4l22M43l9j76j96K49J55j45J65k00O6j33j89K89J19k03m2K3
5259i1%J42L5m3J15j54j4k9K3M04n24N0L1J36k04L36k52K1N6q5K00l3j72j04J1
5284a45K10r8n7J55O3j17p0J86Jo7j3j0k86J67J62j01j24J66O7k97L88k04q8J21
5308IL0j71Q6J96j0J73k22j02j33m4K04O0j36K58j49N9l38L11J19k01r1Q3Oj18
5332a21J81K9j32J71lk59jQ8K12j95K01p7k37J96m1n1k47K98J34j83K26k18m5
$$ plain form
5166 250 -96 156 -64 88 88 57 -30 -202 161 205 -82 -6 103 -137 134 -105 -314 81 -139 155 -17 208
5188 208 -58 13 6 -32 37 205 -77 -7 75 257 -91 -135 22 -23 90 -45 152 17 296 166 219 247 -5 15
5212 15 -35 35 -80 -85 -193 50 21 123 -84 39 258 -198 -62 -44 -9 30 -19 -130 108 20 77 -27 80 -13
5236 -13 51 28 119 109 45 -277 166 127 -49 -245 4 159 14 179 -21 45 -88 -277 12 131 -72 -114 -91
5259 -91 -91 51 86 43 158 4 -10 -39 -16 388 -136 -86 -55 81 -123 213 -39 -18 38 -47 153 120 -52 -156 -145
5284 -145 65 -33 -90 65 128 11 -59 127 128 61 48 38 -248 -81 81 -20 -144 22 89 -208 180 -24 -112 9
5308 9 39 -132 -46 150 140 313 91 -11 -144 -188 16 76 -60 198 49 108 -230 81 200 -1 -92 -9 -3 -121
5332 -121 60 89 -43 128 125 -134 -135 -47 165 -30 171 94 -143 53 12 -39 -286 12 146 -37 189 -29 -74
5355g4j4P4L9pQ5k48J66j33R4L0j85K43j33L57l34n9K90j78J93j85m7K49l72M3
5379a06J90L9j54J01jP4k40L5N2j34L23j65n1j07M9k1K57r9Q2k41L52j35Q8k80
5403i2pJ84j79J05m8J05j40R6j04J76P3r0k28L3J40j10J29l8k09J63K53k33n2
5426g3j11K01pN2J47L6k15p8n1j50J50R5r4K39k63J04P2r9L4j58L97l10K61m10
5450b31M11k43k9J37M2L5j59M4K39l54J93j19K52j61j47J15O9j33M1J25l29K21
5472A9j42J79j4j30L35l04k79M34q6k01K09M33m58j59j9M10l41j39J00K98J10
5493B55l45q4J61m3l2M4M3j8O4k04J70O8j17J14N5m18R9J96m7J4j17J87j67K98
5517A76j45m39M97l4j23N7Q4k28J91j68R6k0J09l9r8J06Q9j6n3l9r7m4L08k75
$$ plain form
5355 -74 -88 -14 25 18 103 -145 21 -112 -18 12 -173 70 -63 294 -40 -99 191 13 206 21 -26 223 -149 -106
5379 -106 84 123 -31 70 69 143 -97 -62 -10 -144 179 14 -37 -144 -95 -116 141 42 124 -117 235 100 188 -92
5403 -92 -99 85 -94 11 -37 68 -72 24 -80 96 169 79 -149 -116 24 -86 43 5 -204 -41 212 -21 -73
5426 -73 -184 17 10 62 209 245 30 -48 -99 -249 -99 -4 -98 141 -122 -18 54 -45 -11 -169 228 -82 179 -231
5450 -231 180 -63 -92 45 87 122 -37 7 246 -108 85 -34 218 57 -90 25 94 -39 2 127 -202 19
5472 19 -123 56 42 -88 247 -57 -336 98 12 -189 20 453 -5 -164 -183 227 -114 -253 -153 145 255
5493 255 -90 -174 -13 -56 -88 -44 -1 -19 45 -159 11 79 -38 76 131 -287 -188 8 -39 -25 -142 45 -122 176
5517 176 31 -408 89 55 -68 -11 73 -155 36 -132 -36 -56 53 14 -84 22 111 95 42 3 -94 -138 170 -105
5541a05o2J34j43R1j28J68J17J76k79O2k11L53n6j13R3R0p2k09J39J02j45r8P3
5564b3J70k7j46j10K19k70K01r7l2p1J65J64l16L33rl44L41l26K78J63l93j7K09
5587F2O6j65L52m62J42j77K15J21l28L70O4j72j90q6K94J9l07L98p1n7j50l27
5609c89M61k40K79k26O3l21J77J71KK21j99J59J02m51L74l9j42M0J88j68J0j43
5631g1K39l97M72L3m48K40ml39K41j42K21P3j91J46j41m8J11OOO9k02L38m74M97
5655B35j45j45%K15J0p9Q6N3k26j2n9o9k2K32o1K49n6l68R1L3R6l2p1n2J69r0
5681a8j46K32K7j54O6N8k03L5K01l17K78J92l50j30N77m29j6J10m7K0Q1k47M5
5704a35L37j14mrk6j0K9K10m17M8J62l4k58O7L7K45j21k77L48J1Pk97J43R0l8
$$ plain form
5541 -105 -167 -33 -176 -85 -213 -45 72 248 -31 31 -180 173 117 4 97 187 115 -94 45 147 2 -96 -23
5564 -23 147 120 -26 -136 83 -187 14 -83 -115 -186 -21 143 -173 160 151 -193 148 -178 100 263 -130 -147 62
5587 62 128 -37 315 -147 -5 -182 33 154 -174 196 260 88 -102 -188 106 125 -182 216 145 88 -62 -389
5609 -389 72 -168 111 -115 -52 -373 -196 -25 -23 198 -1 158 260 -191 183 144 2 42 230 62 72 -71
5631 -71 168 -229 243 276 -172 68 64 -275 -34 -176 45 118 -73 73 -68 -116 -5 1 7 76 -126 212 -262 235
5655 235 90 -55 -55 160 170 91 177 230 4 -8 -67 -136 -158 74 13 262 206 -162 -71 -38 58 26 -45 -97 72 -18
5681 -18 -164 68 95 -59 7 65 -138 -103 98 -219 59 251 -99 -229 348 -81 -97 13 -34 -14 67 -180 -135
5704 -135 202 88 84 75 49 39 68 278 -139 -91 71 37 -221 -154 -117 128 7 -270 78 89 96 -201 -58 32 -6
5729fq8o2J49J6p3J28j03L72l93m1nJ45k80L91q0j13j9m6Q0m70M53j48K93o5K14
5754B49p0j31k10K76k88K27q7JJ4L6k18J71P1k36J35N6P9K5O5k17K40nj53k04
5778a74k1J33J69j57M11j92l08L53l46J10k9n0j44NJ07m1J43J24M4Q3l84K05j06
5801f5J5L22k88L37l92K43j56j3l5k42K99K08k41j92L28R2l26J00O1M2Lq3j7m2
5825d2j01O6j06L37q8k01K25j35L1n7K50l43J77R3l6j83K90j16l0k07L78n5j74
5848b7R0j73J58J41j55l88J43P2K18P7m42L40rR7k60N3K35k02mK65k87M1J73k77
5872a21L1J10J00m7j1m6p5K20j28L1j70K88N7K8k73K52k09k10L40k18J51j83J76
5895I3k06J81n0q3J43r0J4J79j41J36p1j54k6k59L56r5p5m7R6j18J38J26j7J86
$$ plain form
5729 -6 -94 -156 -7 9 -64 64 -39 333 -60 -101 -106 39 -241 150 70 -43 -62 -108 -28 -498 -45 -193 100 35 249
5754 249 179 48 -162 114 -174 53 -34 -33 -19 17 -201 -30 41 -195 -60 -4 75 100 165 -52 188 183 30 -174
5778 -174 -195 -62 107 -50 361 169 -139 214 -132 -22 -51 -101 -245 -240 -133 -174 -31 93 137 220 -164 41 -65
5801 -65 -50 272 -16 321 -71 172 16 3 -32 -274 25 233 -8 -200 128 220 -106 -6 55 97 100 17 0 -42
5825 -42 -143 -77 -183 154 66 -135 90 -45 -14 -71 179 -164 13 106 70 -113 177 61 31 -176 202 147 -27
5848 -27 63 -110 48 189 34 -354 -211 -139 79 156 -286 54 45 142 -118 -65 170 -32 -36 229 -58 -17 156 -121
5872 -121 -90 20 120 73 62 16 -59 161 33 64 -106 182 239 267 -6 246 37 -173 167 -51 100 -83 93
5895 93 -113 68 18 -65 78 -12 2 181 40 176 105 -49 -75 -334 22 -73 -148 -195 -99 -217 -79 47 30 216
5919B16k23J84l02J94M4l13L45n5r6J60j54k59L7K35J22k13O7nl1k32Q4L95m17
5942b17L76p5q7j34K16j93j8K06k54P0J46m8l4q1qJ90j08o2k2J1L40k51K34j69
5966B8k7l8k3R4j08Q7j25K02J12k65k95M34kk19L33l94J81J7K4k72K98p6J35l2
5990F9l74J81K05Ll30L97M1q7k98L37k29L57m49O5J53o0nk50L05L2L9Oj10Q5j43
6015f0j11K98j88P9p8q5P7K79l78P0%J63L0M7k01j64N04l69J79j93K05l1mJ0N7
6040A36M7k49PR3j83K70k93J80q1R1j37o2j27L23p9m2Q6O7p8K01j55L19l22p5
6064f3j64L58j49J91r2j04M4L4J4k1m5j15K19j28j02Q2k20O6J97l5L54k23M8j49
6088cr1J44mL4r1j02J63j42P0J25j1p5k71K02LM3O3k13J59j38j3J66p2J53m5j46
$$ plain form
5919 216 -7 177 -125 69 113 -200 145 90 -6 154 0 -259 -222 13 135 -78 -11 -16 -47 -279 -195 200 -217
5942 -217 159 84 -3 -137 79 -114 -132 74 -180 -110 36 -12 -46 -127 -135 55 -53 -115 -137 -126 214 -37 197 28
5966 28 1 -37 -60 34 -74 13 -112 90 202 -63 -358 76 74 -145 188 -206 -25 -8 16 -256 42 -34 101 69
5990 69 -305 -124 81 84 -246 151 192 105 -193 144 -85 272 -177 -112 41 -19 -24 -274 31 63 102 108 -2 83 -60
6015 -60 -171 127 -61 18 -60 -145 -68 211 -167 -97 -97 66 96 143 -58 -222 282 -87 92 -101 104 73 69 79 136
6040 136 183 -66 -59 34 -149 121 -172 8 -73 18 -119 -181 -308 15 -64 -106 -20 47 -31 170 15 334 12 -63
6064 -63 -227 131 -18 173 81 -23 21 55 69 48 3 -112 107 -21 -123 -41 -261 -195 2 -33 321 98 146 -3
6088 -3 -94 50 46 80 -11 -113 50 -92 -22 103 92 17 -254 -52 -49 -6 57 -156 3 -135 -148 18 -54 99 54 -92
6114i2N0J4o3M9P9m6j76M84p0p5P4l19P4j4K8j92K17r5PO1R4N4O2j91O3j42J61
6141I6o6j10K20j45p8JRj30n3M4K54q7o2K38k84J81K7l62M16n2K5j75J83J65j95
6166F0J13p2K8k38Lq4L34k15J07r1m4O8o9j37N02k87q2R9J10Pj30N9J1j67Q8k3
6192e0K86r9k08K00K5K1j21j98K40K1K3r9k84K82Q8j18J12P5j41r5J44k29m6n1
6216b22J23N5K6k3m9K74j35k13M92k82j23J71k70p0K17L8j25K14j06L4j64J59
6238B1K74m13N4j19K23o3J29j02Q2j89J57j08K89l01m0J4L1O3j27J60n2j64o4
6261b45L96l01K10k9n5j06L84k00k29N1J20j0l3o3K57m0j57N5j03P5K7L00m46
6284a42M3L6qj49K93j8K55n77L66j21J81P3l33J77j5j12R7L2q2p8j3R3O0j55M73
$$ plain form
6114 -92 -42 -28 -91 -42 37 -9 -185 299 229 154 228 -91 -17 -31 -3 -195 22 -73 -66 -5 89 143 205 14 77 -65 96
6141 96 30 -80 140 -5 -83 -82 -73 -203 -256 -212 42 -45 -107 131 -153 28 55 -307 109 57 82 -93 90 255 60
6166 60 173 101 129 -109 -106 -190 144 -71 36 -55 -99 -31 -100 -237 265 -22 -104 -5 105 112 -18 41 52 -115 -27 -50
6192 -50 236 137 -71 129 154 175 54 -144 96 117 140 41 -243 39 127 9 121 196 55 -40 104 -125 -171 -222
6216 -222 -99 -44 -18 -41 -90 184 49 -164 328 46 -77 94 -176 -246 -29 9 -116 98 -8 26 -138 21
6238 21 295 -118 -64 -183 40 -23 106 4 86 -103 54 -54 235 -66 -106 -92 -61 2 -125 35 -17 -181 -245
6261 -245 151 -150 60 31 -24 -130 254 54 -175 -124 -4 -14 -47 -110 147 107 -50 5 -98 -23 4 304 -142
6284 -142 -99 -63 -71 -220 73 55 310 -267 99 -22 159 232 -101 76 61 -51 46 78 -4 -82 -95 -2 58 -97 376
6309C76m27j41l2n3J87Q8L3J00k62J08q2L92j46k40J65n3j68L54k35j08K13j97
6331a28k01N23j50j14K26j4M3R0m6k50K29M8j88l12M38k60L2J66L4o0j05n0K91
6354B42k24J40k15j37K56K06l67J64j76K48j28k45K85ql0L4j83k2l7L12k45K7
6376a03q3J09N1oJ64p8k7j21J69j4K23j56Kp6Q7k6O4j59O5k26J35J18j65J22k9
6401D0q3P7j31j24Q1O1Q9O6J08q7R3k96J16o2j53K94k13J02mJ12m6k19m9K65K41
6426B78j63K6j31J25j26J37j48n3J54l05K19k5j9R1q8K8N2k27J88J00l11M8P6
6449g4L53n87K20J24mk66L41r0m0M13l54o1Q0J56l12Q8n4n2j66R9J85j03m7J36
6473a5m3J49N7q9J03%o5k90K45j42K69j32j06J03J40ol48J20J17j04j33O3j40
$$ plain form
6309 376 -51 -192 -224 -277 -90 -2 31 131 -131 -23 -105 287 141 -99 66 13 -155 199 -36 -144 69 -128
6331 -128 -329 194 44 -70 156 142 185 275 229 -21 208 256 68 -244 194 -66 -34 132 166 106 1 -49 242
6354 242 18 158 -57 -194 62 268 -99 65 -111 137 9 -236 49 41 11 45 -138 -160 -197 115 -130 -103
6376 -103 -186 -77 -26 -32 132 54 27 -94 75 61 284 128 130 54 141 115 179 20 85 -141 -6 112 -53 69 40
6401 40 -43 34 -97 -221 -140 -79 10 76 184 97 190 -106 10 -52 -205 89 -124 -22 -26 86 40 -179 -228 37 278
6426 278 115 141 10 135 9 146 -2 -55 99 -206 13 -12 -31 60 -28 0 52 -175 13 113 -198 -150 -74
6449 -74 279 -308 -88 36 32 -234 107 17 -23 390 36 -25 55 211 -101 -13 -67 -119 -285 -186 -1 -104 -151 -15
6473 -15 -58 91 148 59 162 162 97 -193 52 -90 179 47 -59 44 184 178 -170 -50 67 -37 -170 -107 -247
6496b47q6L47l9j65J86K32n5k69Q1J4N2J17k32p5J83r6Q0R8l20N3J6p6K69r8j92
6521b22R1n4R3K0PJ47q4L6Rj03j95L21k84J15m9K21j28P6J89k75j77J08J73n6
6545b1K05l04K86j32k27J42K8O8j1J96j69n3j29J19j90N2K99P5m81J20K27j42
6567d2R4J2p5Q0j76J55J18r8k70J66mN1j4J50j17k01J37J92k8k39L18k5n04L30
6591A0m0J91k54J24k99K54J0r4L80l30J86j0k12L8L27m48j83L39Q6j12J65p2P8
6614A34j63m7o0J86J68l40K74m1j24K11l17Km6L30j92P1N2k32J70K3J45J17o02
6637b81K14L01j26q7O5M9j42k26O59l45K4j12J26O6k36lJ37J14j46J49k04L0K
6660B8j30j2J91j68J51k95K35K64k51L4J20R7k64k17L42n3j71J00M7o8k7J91p2
$$ plain form
6496 -247 -333 14 -25 -190 -4 228 173 -96 -15 -1 51 168 -64 -139 44 -52 28 126 -194 -141 -125 -201 68 -30 -222
6521 -222 -131 -185 -92 -72 -65 82 -2 34 43 -60 -255 66 -218 -103 -152 69 -59 17 206 -69 -246 -138 35 -21
6545 -21 184 -120 166 34 -193 -51 -23 45 34 230 61 8 -121 -2 -192 -140 159 234 -247 -127 100 -42
6567 -42 52 64 -11 69 -107 48 166 68 -202 -36 -40 11 -3 147 30 -171 -34 158 130 -109 209 184 -320 10
6591 10 -30 161 -93 31 -268 -14 -4 -98 282 -48 138 128 -84 -46 281 -167 -350 -11 75 -37 128 56 134
6614 134 -29 -76 -136 50 218 -122 152 111 -13 198 -119 -117 -163 167 -25 46 98 -134 36 59 204 321 -281
6637 -281 -67 234 108 21 86 135 -7 -233 426 81 105 -7 119 185 -51 -54 83 197 51 200 -4 26 28
6660 28 -102 -114 77 -91 60 -235 0 264 13 47 167 264 0 -217 125 72 -99 1 48 -20 -47 144 72
6683G2l22J34L55k88R7rJ33j85q4J00LQ0l6J25r6k79K43OR9o0L0QK97l43q7J7
6709A0o6n8M1L5Q2j28J92p0j72L77j70m4J53k67m8j7J05J31j3j69pQ4nJ76jp3
6735G8k19j4J50j3M9M5k23q3J90J77l36J83k1k82J90J97n5J5K43K8l79M1O0k04
6759a83pJ43r5J2K49p1Q5K42m18L15j66k54j44L23nm7J02m8p9K41j12j68L6J88
6783A39l09J02j40P5j02L88j53J67o6Pm7qL0l99J15J12p9q1N69k77j20nK30o9
6807G9j10J49J60j77k06o5L8L2K41k57R5J33k27J63n1M6J09J0l1j19O1k24J80
6830B9J09j98N7K20j69j22nK34j20J27l11J90J42j93J40r0o4k8J76k41J29M7k87
6853b28M7K18k14pK00j30K05k00K35P1q6j0J74m19O2P3J91j57L5j74K56n8j27
$$ plain form
6683 72 -250 -116 239 -49 48 39 172 -13 -97 3 6 86 50 175 79 -200 43 49 148 88 118 126 423 80 -7 10
6709 10 -56 -114 -73 -38 44 -84 108 38 -134 243 73 29 182 -85 -133 -150 -45 86 73 -96 -103 -19 -24 152 151 78
6735 78 -141 -155 -5 -18 31 76 -147 -230 -40 137 -199 -16 -37 -319 -129 68 13 28 271 299 -80 -39 21 -183
6759 -183 -190 -47 -142 -130 119 48 133 375 -43 272 106 -148 -292 31 26 -21 81 33 -46 195 83 -85 -49 139
6783 139 -170 -68 -208 -133 -235 153 0 167 101 108 61 53 83 -316 -201 -89 -168 -249 320 43 -77 -82 148 79
6807 79 -31 118 278 101 -105 -170 -132 -100 141 -116 -21 112 -115 48 -3 43 152 162 131 12 73 -151 29
6830 29 138 -60 -3 217 48 -74 -79 155 35 162 -149 41 183 -10 130 40 -24 -52 124 -117 12 59 -228
6853 -228 -181 37 -177 -184 16 -114 91 -109 126 197 111 101 275 -144 -82 -9 182 25 60 -114 142 84 -43
6876d3K5J09J11k06j15l3K47j27Nj18L97m58J8J75R9p3MJ00j68N5L3q1k8L6m67
6901e03N51J0m00M41J53k79M0o3o2J03k02j35L55j55m4J33l1P1N2j13J37L3j63
6924g1J0K71k82J89j43j89Q9K46Rr6m68K97J80mL1Mj6m9k8J05J02j34o0J12J16
6949B21j17n1J38k51R5m5j40J59j8Q9J22m01K39l0o3r8J60P8l15L30m1l0K7J08
6973A66l44K37j68N1Q5J53j79J24j51P0L0J1j34K85j75q3j26j9K24l6O0J15j74
6996B2O0j85O7R8j90k04M15K13m12K94l49K58j61P4n5K5J23l2j02J5N4M4J94j20
7020A46j56J46k58K21k34K99k69K3O5J96r9j74J79j83J88j11j40K10l01L98k74
7041a28K98k04j29j7K37k9J52k18Q9J39k66j6QN5J23O7l44L15k81LJ02r9K26m1
$$ plain form
6876 -43 -18 91 202 -4 -119 -152 95 -32 -27 -145 252 -206 -188 -13 86 13 17 117 -51 4 37 -44 -72 -36 -503
6901 -503 48 58 -342 99 252 -27 13 -50 -112 -9 -211 -346 9 -146 -190 -57 -88 -17 35 -78 59 92 -71
6924 -71 -61 210 -72 117 -26 -215 -126 120 129 33 -435 -138 42 38 69 73 57 8 -20 85 187 53 -7 105 221
6949 221 104 53 191 -60 35 -10 -150 9 -9 80 202 -199 40 10 -53 -151 9 87 -228 102 61 31 58 166
6973 166 -178 59 -109 -58 27 180 1 125 -26 44 74 85 -49 236 61 -22 -148 -167 57 21 81 196 22
6996 22 82 -103 -36 62 -128 -332 83 296 -116 178 -171 87 -74 0 -55 -30 93 61 -41 -26 28 72 266 146
7020 146 -10 136 -122 99 -135 164 -105 -82 -17 179 80 -94 85 -98 90 -21 -161 49 -252 146 -128
7041 -128 170 -34 -163 -180 57 28 180 -38 51 190 -76 -92 -84 -29 94 161 -183 132 -149 -146 -44 -143 83 42
7065D2Pj97J36J50k33J22J0o2o0pK80J7l12n1op5o2L62J7j04M10k08o7J5k39R2
7091b3P4Q9o3j11m0K09j84L71j3k51j09K32J54l63J86l36J52J48p2J69j60j17
7113e8r7J85l7k55M47j26l7j06K00n4j71K06j37n2k67L29L00l04N6J44k74J66
7135E8j22O1j58J88p7K60l85L17k36L6R2K9Q6k35K21j17Q6l81K79J56k84K40l8
7158G6P8l34K78lq1q7PP3J95k40J24j20k36M35l37M96o56M25j45O5n7K06M8k50
7182d0K27r1L3j61j08N1K02j64J80j76O1J28l26J99J82k87J61l56M40J96l10j01
7204f0JJ42k30J86J07l06M3R0K83j14r0K75l65j1K6k05K71R6j58K6n4J88k69j61
7228b89K81M06m27j67K14j30J92n0j48O7o4J3J32o5j47R5J02PP1k34L92l72o4
$$ plain form
7065 42 49 -148 -12 138 -95 27 37 -25 -85 -92 188 205 -107 -158 -164 -239 -301 61 78 -26 384 176 109 124 -115 -23
7091 -23 51 140 77 -34 -74 135 -49 322 309 58 -51 181 335 -28 158 -178 -26 122 50 219 59 -58
7113 -58 -155 30 -7 -262 185 59 22 -84 116 62 -109 97 -40 -92 -359 -30 270 -34 22 166 -108 58
7135 58 -64 -3 -161 27 -50 210 -175 142 -94 -58 34 63 149 -86 135 18 104 -277 2 158 -126 114 76
7158 76 154 -180 98 95 14 -73 -66 7 202 -38 86 -34 -270 165 -172 324 -332 93 -52 13 -44 162 210 -40
7182 -40 187 96 129 -32 -140 -89 113 -51 129 -47 14 142 -184 15 197 -90 71 -285 155 351 41 -60
7204 -60 -59 83 -147 39 146 -160 -117 -27 256 142 52 327 -38 -49 -23 -228 43 139 -19 7 -47 141 -128 -289
7228 -289 -8 398 -29 -196 18 -112 80 30 -118 -51 -115 -102 30 -35 -182 -87 15 22 93 -141 251 -121 -185
7251a85K6K09k04J51K16k78n5J93k99K12jn8R3L1k18K45j41J22j55J75n3J49k09
7274c4o0O4R4N2nK0l85J47L1q5J03M5M7J5K1O3l3j83j67J15L4K56j69L7m1M1j38
7301a15M29k36j46K01l35J16l1L2jM5J2L3K18q4k91K91r1k02N7n0J68m3L26l46
7325d3j28J67m9N5m0J06k89K18%O9J2l2j32L9K03l04M5J96k17L66j58j65L7Q3
7349C9p8J70k64L16j93k72L09j38O7n8K7n5j59L61n5l5q5J91j41r4J92L5k30J49
7373aO2j73J54J8j44J95Jj32n2jN9j30K99k40j1K42J10l41PO0J25oj81J16J07
7398A43q5j56l1P3j28L60k23O0l21K97j25O8J06k15K45r7q7K97n4n8n0j72m8J76
7422b5J33p4j30K92l00K30j83L1J49m9k17R5O6P0J22l36J73j23j67M78k59n3j4
$$ plain form
7251 -185 -159 50 -154 -3 213 -65 -120 73 -226 -14 -15 -73 20 51 -167 78 -63 59 -96 79 26 175 -34
7274 -34 -94 -30 64 116 111 131 -254 -107 -76 -161 -58 -13 34 49 70 133 100 -83 -250 -135 -101 155 -14 23 -18 23 -115
7301 -115 314 78 -68 133 -202 -86 -117 -85 -86 -41 -29 4 222 138 -153 138 47 -155 -98 -148 20 -23 303 -43
7325 -43 -171 -4 -53 2 -38 68 -221 -3 -3 66 78 46 -86 -47 156 -148 -103 93 -124 242 84 -81 -44 39
7349 39 -39 131 -133 183 -10 -282 27 -111 -44 -102 -75 -130 -289 72 17 -18 -103 88 -53 -147 45 80 -150 -1
7373 -1 61 -112 42 60 -84 111 112 -20 -72 -73 -14 -144 155 -85 -96 146 256 -85 -78 -18 107 101 -80 36 143
7398 143 58 -98 -129 -56 -184 176 -47 13 -308 -11 -136 -68 38 -177 68 -29 -116 181 127 69 19 -153 -201 -25
7422 -25 108 34 -96 196 -104 126 -57 -26 123 74 -143 -48 18 88 210 -126 47 -76 -243 235 -24 -77 -91
7445i1L4l4J14L3j99K49j32k54O7K13l04n1N21K8m21o6J41K32o3k7R3m4J24N2
7469B15j18Q5P2Ml96L0o5J30k87K94J01J1Q4l39L98n03J53mK09J7k11J59q5J93
7493A47l11o5J51K20Pk57J28j48M2J50r4O4J00n4m20K7K48J21J28j05j51L00Q3
7516C11m34Q4l4k9J91j50n7J43k29J10J81j9R2j30J87J6l61L40k5l12K30K2j36
7539ij07K71j43L4q7J84k08J55j45j8J05J59k68J36q0o3k7M37j67n3j60R7l5M3
7563E1J54J0j45j58K38k49j38L15J0R4j16q2J43k15k2K05q2l8J18k36P1J70k26
7586a28M14n74L03j54M64m28J85L40o40J79K06J29k81J23m1K52l85K51o07K29
7606a63L93l57M3J35l30L11j98Q6J68o2O4k27J41k05K85j62J09%j35K31j28R8
$$ plain form
7445 -91 -57 -91 23 56 -143 106 -26 -280 -213 0 -304 -355 166 194 -227 -293 -152 80 17 -10 83 39 163 215
7469 215 97 182 254 258 -138 -108 -173 -43 -330 -36 65 76 160 -179 219 -284 -131 -135 74 91 -120 39 -46 147
7493 147 -164 -229 -78 142 149 -108 20 -128 -86 64 -30 34 134 80 -340 -313 -65 56 184 79 -72 228 311
7516 311 -123 -39 -73 -102 89 -61 -118 25 -204 -94 87 68 160 30 217 233 -128 212 187 -125 105 127 -9
7539 -9 -116 155 12 46 -41 143 -65 90 -55 -73 32 191 -77 59 -21 -84 -111 326 159 106 -54 43 8 51
7563 51 205 215 70 -88 150 -99 -237 78 88 182 66 -16 127 -88 -110 95 13 -25 93 -143 -72 98 -128
7586 -128 286 -288 15 -139 325 -103 82 422 -218 -39 167 296 15 138 97 349 -36 215 -392 -163
7606 -163 230 -127 -84 51 -279 32 -166 -80 88 26 90 -137 4 -201 84 -78 31 31 -104 127 -1 97
7628I7m32L50j56K18j22O0m2l1K46k37n3k7J76l68M34%k19K3L0M3J48m03J15p
7652a57N56k57j65q7K58j29K54r0l91K44Nq8j54k0K86K52l84kP5o3m0L25m69L09
7676F8J24k32K59l36lL3n4M19j62j60O8M0q0l03M08K22m43J35K58m85J72m5O9
7699b8j38N0J41Rj20K20k03J46P5l9J12n3j22j64M77l51j04J61o3k83K40n5j2
7722a04Q6P6k00K12j16k1j69J88p4K2k2L5K30k98r2J97J3k72L53N4j26J8R5k69
7746a84J97M1Q0J12k88j16P7j23J90J35n4j44J62Q4q7P0j32j49K62k73J70o9n0
7769h9R8J10m8k63J67o5k7R4p1J05Mk13K43R4j64M0j83K57n2j31J79p5K07j83
7793C4j75K3L2J1K22j98l1J51o2O2O8k43J21J20m29M40n7k7J51l28j16J76J31
$$ plain form
7628 97 -335 15 -141 77 -45 15 -27 -58 188 -49 -102 -129 47 -321 113 113 -106 -83 -53 -10 138 -265 -150 -157
7652 -157 399 142 -23 -110 148 19 273 183 -208 36 41 -47 -201 -221 65 317 -67 -69 6 -57 -97 228 -241 68
7676 68 192 -40 219 -117 -120 -87 -141 278 116 -44 24 64 -16 -319 89 311 -132 3 261 -224 -52 -97 -28
7699 -28 -166 -116 25 34 -86 134 -69 77 152 113 225 172 50 -114 363 12 -92 69 6 -277 -37 -92 -104
7722 -104 -18 58 -142 70 -46 -67 -236 -48 -122 -100 -122 -87 143 -155 -247 -50 -37 -309 44 98 -28 -10 85 -184
7746 -184 13 54 134 246 -42 -158 -81 -204 -14 121 67 -77 85 169 82 152 20 -129 133 -140 30 -39 -89
7769 -89 9 119 71 -192 -25 -90 -117 -23 -94 11 15 -198 45 139 -25 15 -168 89 37 -94 85 10 217 34
7793 34 -141 -118 -86 -75 147 -51 -82 69 7 69 137 -106 15 135 -294 146 89 62 213 -115 -231 -55 76
7816G6m0l72L60O5k3q6O2L5K9j11J10P0l8q1j3N8J63l21J8p2K3L8j27L41O7l27
7842i6K4J2j7J54k16O2QK7K38j04j47J48q7M7j12L9L10l69K8M3P2j3qL0k5J43
7868A91j07oJ84n52J20K74j36M0p9K73j01j68J27p9K03j57J2r5J44n6m89M83j68
7891a42K7P7N7p0l6o5J63j46k4J48J44m53K18L47l36k17K37o8k12M78k86J51r
7914a7N1K67l11j60J99q%N5l88K34J8j76J35K1PP6Q0r2o6J69r1L0j42l5L08j59
7940EM0j51K24p4q2J50j56K95m02J32n1n5Q8K5K2r2l82L72j31J60J18j04K16l6
7964A31j82N6J40R1k64p4K69k8j08l4L30j17k02k3J21k38L37m23K53j19K82l55
7986a57J47J10j11J0q5K6j49L03P1m86L35L6o1N8j24J03J5l2K00k71K05j51l8
$$ plain form
7816 76 36 -336 24 89 66 -20 42 77 106 -5 105 175 137 56 43 101 264 -57 -39 -111 -88 -50 -177 164 231 -96
7842 -96 -72 -60 -77 77 -139 -77 -69 -42 196 92 -55 93 6 53 -59 -20 290 -79 -51 -8 64 51 43 73 48 191
7868 191 84 78 262 -290 -170 104 -32 8 -71 202 101 -67 60 -19 184 27 39 -56 88 32 -457 26 -142
7891 -142 -115 -38 19 -51 -87 -152 11 -135 -159 -11 133 -320 -102 245 -91 -308 -71 -139 -351 127 -159 -8 -17
7914 -17 34 301 -10 -170 29 21 21 76 -312 -78 -60 -236 -101 -80 -73 3 83 -9 -75 94 3 33 -109 -144 164 5
7940 5 45 -106 118 44 -38 112 -44 251 -151 -19 -70 -125 -37 -12 10 -82 -464 -92 -223 -63 55 -49 167 131
7964 131 -51 5 145 236 -28 -102 167 139 31 -3 327 210 8 -15 106 -132 205 -218 35 -84 198 -157
7986 -157 -10 100 -11 -1 -86 -60 -209 94 165 -321 14 50 -11 47 -77 26 41 9 209 -62 143 -8 -46
8009d6m0P9j86nM7L1n8J11q2J32J81R5l50K35j90J83J03j26j78J78J73o45L08
8032e0m9K00o1o7l6n0P1J42p8r3P2p8O0J14J73k63k37l8M71l29M3K34K2N1l59
8057a35J04RJ54k29L59m98M00kl62K17o1j10M0R3J47j87J83n5j35Q1K74k14j20
8080d7j00J7J78N3r2J32m1j76j48K02J3O7J9k28J39K26j00L6o9j51L7Oqm3P2l9
8106d5j34k9J57k45L55j21K28j97J2Oj56L91j76l9k7J47m12M77j46m9p7M4O6r6
8130f6Q9K8j76j59L09k0Q4k5JK18m72K58j19O9q9%J61k26L03j92J58j39n7J74
8154A12k04J99j87J30m9J22j78NM3r0L6J36p7J13j78J72l76L48o5j75J54j72K79
8177I8k01m2Jo0M8O8K92k61pJ83q7n0q3K4
$$ plain form
8009 -46 -86 -7 -193 -198 -151 -120 -178 -67 -149 -17 164 259 -91 144 -46 137 240 114 -64 114 287 -358 -50
8032 -50 -99 101 40 -27 -63 -113 -42 100 22 -71 1 -77 -17 97 270 7 -230 -268 203 -126 -83 151 173 224 -135
8057 -135 -31 -22 132 -97 262 -236 164 162 -200 17 -44 -154 -114 -21 126 -61 122 67 -68 13 287 73 -47
8080 -47 -147 -130 48 101 9 141 100 -76 -224 -22 -9 58 77 -151 -12 214 114 150 81 -70 -33 -27 -35 -78 -6 -45
8106 -45 -179 -208 -51 -296 59 -62 166 -31 -19 -13 -169 222 46 7 -20 127 -285 192 46 -3 -80 -36 30 -66
8130 -66 23 51 -125 -284 25 5 89 64 65 283 -189 69 -50 19 -70 -70 91 -135 168 -24 134 -5 -62 112
8154 112 -92 107 -80 50 1 123 -55 -50 -7 -97 -61 75 -2 111 -67 105 -271 77 12 -163 -9 -181 98
8177 98 -103 -145 -144 -204 -156 -88 204 -57 -64 119 32 -18 -101 -77
8191g7
$$ Imaginary data points
##PAGE= N=2
##DATA TABLE= (X++(I..I)), XYDATA
0@%%%%%%%%%%%%%%%%Pj5J6j6J6j6K4l2L2l9M7n1N9o8P6q8J03j15J28j44J61j82
38i7K05k27K51k80L12l46L80m20M65n10N62o19O81p52Q30r16J012j120J243j387
58g33J555j752J991k284K656l145L816m799O387r349J6657o5501j03423J47726
72a0198N5303j8473L5693O0k0453M4932k6462l5656N6631j1306q1529K2412K0751
85C1705k9630K7183p588p1505K7519K4723p4631o45N0606l4840k79N2332j4529
98a9579k368L3702k8259L58N0634l2971l0848O2832J4349l3898J9418L824j4947
111B2247J8482l1258m3315M7431J4139o4824O422M4015j1431n315p378k9731K8292
124a2224K6687n3083n952N9669j168k1763K0918N576J149R612l0646j1937L9628
$$ plain form
0 0 0 0 0 0 0 0 0 0 0 0 0 0 0 0 0 0 7 -8 8 -8 8 -8 16 -16 16 -23 24 -27 32 -36 40 -48 55 -60 68 -76 85 -97
38 -97 108 -119 132 -148 164 -182 198 -222 243 -267 295 -324 357 -395 435 -481 531 -589 654 -733
58 -733 822 -930 1061 -1223 1433 -1712 2104 -2695 3692 -5657 11000 -54501 -157924 -10198
72 -10198 45105 26632 62325 62385 41932 86864 60402 24746 81377 70071 -11458 10954 31705
85 31705 2075 29258 21670 -49835 -22316 2407 -72224 -72869 -22263 -57103 -57382 -5050 -19579
98 -19579 -21947 11755 -16504 -16146 34488 1517 -29331 33501 47850 13952 33370 37194 22247
111 22247 40729 9471 -33844 13587 27726 -37098 -30676 13339 1908 -3407 -10785 -40516 -12224
124 -12224 14463 -38620 -44572 15097 13929 -7834 13084 18660 19809 29421 -1225 -13162 26466
137B6466n199l2526K1327J4451j7614L768o839k3411J0701j049l0653J4182K7705
150A309j9809p577K3053J478o159j043r605J1461K1793j5196n469L5071Q022k2651
164A4678J53Q956k008m013j7014q596K2917M968k9887l562K0569o546j9388n954
178b4727K044Q471J765j4679M267K7216Q44j7599P030J5464r56m222k166L987
192F739J4349L0j5456N568J4983j2543j6440L840K185o221n268o574L699J0396
206g13r422j2395J3052Q623j3612k762J2046M682K848r38k159J4243R111j6347
220F257l935J7840j031j3912l21K509K228j65j5022n580J6007l689k1190L066
234a6938J1384n041m014j659L88J3423J911j3999P711J8808o597p140Q868L426
$$ plain form
137 26466 21267 -11259 10068 24519 6905 10673 3834 -19577 -8876 -9925 -40578 -26396 1309
150 1309 -18500 -26077 -3024 -1546 -7705 -8748 -18353 -6892 14901 -295 -5764 29307 37329 14678
164 14678 14831 23787 21779 17766 752 -7844 15073 20041 -9846 -13408 7161 615 -18773 -24727
178 -24727 -22683 -14212 -12447 -27126 -22859 4357 5201 -12398 -5368 10096 9140 4918 2752 6739
192 6739 21088 21118 5662 11230 26213 13670 -2770 1070 3255 -2966 -8234 -14808 -11109 -713
206 -713 -10135 -22530 -9478 -855 -14467 -17229 -5183 -501 2347 1409 -750 13493 22604 6257
220 6257 2322 20162 19131 5219 4898 7407 9635 9470 -5552 -11132 4875 1186 -20004 -16938
234 -16938 -5554 -10595 -14609 -16268 -15880 -2457 -546 -14545 -6834 11974 5377 -1763 7105 10531
248A0531J733J176p993L163J3400j0131j2504J0482J712j2950k276p56k332L072
262c673n590p212J1242M457j3946Q98J0764k788l234K644J512R088N225r027K453
277B813J4661n157j1330L729M032j312j926o279J883J0786o444j4348M192N878
291A178q261n962Q04L988O227k019n399P874Q106p826m611O006K580K0R81j8N689
308I357N121o202m588M314j969q888j869K912Q73j367k683J258L931l558p753
323a1111J511M518k231k600M070P409M704j780k767L999M572m848o507L177O913
338I029o16m596J72N035p69p926o035M57J552l960m571L277O614L9l656J45L016
355b793K59l180j509N110N666j0J47N485L136l610l155k95l59j416l151l78M176
$$ plain form
248 10531 12264 13440 5447 8610 22010 11879 -625 9857 11569 -1381 -3657 -4413 -6745 -3673
262 -3673 -9263 -16475 -5233 -776 -14722 -13824 -3060 -5848 -9082 -6438 -4926 4162 9387 360 2813
277 2813 17474 12317 987 4716 8748 7436 5510 -769 1114 11900 5456 -8892 -4700 1178
291 1178 -7083 -13045 -12241 -8253 -2026 -4045 -9444 -1570 6536 -1290 -5901 105 2685 2705 3686 3668 9357
308 9357 14478 8276 3688 8002 6033 -2855 -4724 -1812 -939 -2306 -4989 -3731 200 -3358 -11111
323 -11111 -9600 -5082 -7313 -9913 -5843 1566 6270 4490 1723 5722 10294 5446 -1061 2116 9029
338 9029 8413 3817 3989 9024 8255 329 -5706 -5249 -3697 -7657 -12228 -8951 -2337 -2298 -5954 -5809 -2793
355 -2793 -2534 -5714 -7223 -2113 3553 3543 3690 9175 12311 8701 5546 5251 4892 3476 325 -53 4123
372D123M49m889j404K074k989n738k223J658L369J48j833L647O772j232m876J276
388a668L103K18j529k41L667N631r72m696J549K685m549n351l04K179N76j780
404a482j650L080K331m047l974J655J198j801n39K174L642J794r88o43K421Q71
420D042l810k285L646J040j592j7K143J150r28l969j926K418j431m516J425M024
436e86M76j745L23L72J436r42l905J121N315o34k292L684K792r85n31k257o09
453A033K973k194m692M091L375l634j240R56k151n75p89m340K089M221m024n11
469e412O361p48k614J896j080j2M278k406j562P265P61n253L302J775m849P19
485B421n73m092L472J607o472J398N197n237k620K763k603k94L386l699R55P327
$$ plain form
372 4123 4572 -317 -1721 353 -2636 -8374 -10597 -8939 -5570 -5422 -7255 -3608 3164 1932 -2944 -1668
388 -1668 1435 1653 124 -117 3550 9181 8209 3513 5062 7747 3198 -2153 -2457 -278 298 -1482
404 -1482 -3132 -52 2279 -1768 -5742 -4087 -2889 -4690 -5229 -3055 587 2381 1393 750 3171 4042
420 4042 232 -2053 1593 2633 1041 1024 3167 4317 3389 -580 -2506 -88 -1519 -6035 -4610 -586
436 -586 -110 -1855 -1532 -1160 276 -666 -4571 -3450 1865 1231 -1061 2623 5415 4430 3899 1642 1033
453 1033 4006 1812 -2880 1211 4586 952 -288 668 -1483 -2058 -2847 -7187 -5098 -877 -4901 -5412
469 -5412 949 201 -2413 -517 -1597 -1609 2669 263 -1299 5966 6727 1474 4776 6551 1702 2421
485 2421 1848 -2244 1228 2835 -3637 -2239 2958 -2279 -4899 -2136 -4739 -5033 -1647 -5346 -4391 2936
501B936k761l713P144k77m080L465n13k015N246q35n258N106K286p408Q13K507
517B643n360P03J774n333K808M168o094o25O033l790k106M712j836n05N770k621
533C41j748P569j491n314M892P87m844L368m1m297M257O00o637K527K577o540
549c994K28L101l816J003K947m864J403N410m555j995O402j138k650M558o34j116
565B90M489j849l174M728M7n234L019J634m218J340J158m833J954J919m911J96
581c445L386k776k63K405k283J96L635l193o26M871p74k607L934Q23k481J808
597B610k80k337K086J11l257J733J432k911K82J116k587k37J178k264J68K603
613e54j707k14L317o6j591J679n1p92J287J18j059J888J125j414L40M51j664p54
$$ plain form
501 2936 175 -3538 3606 3329 -751 2714 2201 186 5432 4597 -661 4445 6731 -677 136 2643
517 2643 -2717 -2014 -240 -5573 -2765 1403 -4691 -5316 717 -3073 -5179 -467 -2303 -2808 2962 341
533 341 -1407 6162 4671 -643 4249 5036 192 3560 3519 -778 3479 4079 -2558 -31 2546 -3994
549 -3994 -3766 -665 -4481 -3478 -531 -5395 -3992 1418 -3137 -5132 1270 132 -2518 2040 1406 290
565 290 4779 2930 -244 4484 4531 -703 2316 3950 -268 1072 2230 -2603 -649 1270 -3641 -3445
581 -3445 -59 -2835 -3098 -693 -2976 -2780 855 -2338 -2964 1907 1133 -1474 2460 3283 802 2610
597 2610 2330 -7 2079 2190 -1067 666 2098 -813 -531 585 -2002 -2239 -1061 -3325 -3157 -554
613 -554 -2261 -2475 842 776 -815 864 813 21 1308 1426 367 2255 3380 1966 2306 2757 1093 339
631C39l06j555k07J372j143r35J981pj605j32j89k37P91J84k41K190J593p41M46
650A598J267j099r97R27p84l60J046P7n03J097n47j878n04o88j615Q01L46p16
668b532J205J262j122M15J356j879l91J565n65K46K465j42o60K364o95k298J352
685A946q46k522J237L26j234J536M77k819R72J065l260K4J411j699R76K714q88
702e84K77K928k022q31K402q02j693K344l06r72K864m18k563J284N3l213N30O37
720h5k756J304R96j722Q84J744k662m99K168j698j65K279o50J00L014o81q39K372
738C104j462j738K020M9j638J320Q7j300J373J79l101J67R64k605M27J514j913
755b553P78J936k303P76K038j975p33K343n57k19K153k1q09J871l83j958J119
$$ plain form
631 339 33 -1522 -1729 -357 -1500 -2435 -454 -461 -2066 -2198 -2387 -2624 -1833 -1649 -1890 300 1893 1152 1598
650 1598 2865 1766 769 1696 912 552 1598 1675 1172 2269 1722 -156 -660 -1348 -2963 -2162 -1816 -2532
668 -2532 -1327 -65 -1187 -772 584 -1295 -1686 -121 -686 -440 2025 1883 1223 3587 2892 594 1946
685 1946 1100 -1422 -185 141 -1093 443 920 -1899 -927 138 -3122 -3098 -1687 -3386 -2410 304 -584
702 -584 -307 2621 599 -232 2170 1368 -325 2019 1713 741 3605 3187 624 1908 1961 -1252 -722 -85
720 -85 -2841 -1537 -541 -2263 -1379 365 -2297 -2796 -628 -2326 -2491 -212 -862 -762 2252 1571 732 3104
738 3104 1642 -96 1924 1973 335 1655 1742 442 1815 1994 -1107 -940 24 -2581 -2154 -640 -2553
755 -2553 -1775 161 -2142 -1366 672 -1303 -2036 307 -250 -469 1684 1663 854 2725 2342 384 1503
772A503j07j637P76n0p85P10k11j615O53M54j574P6J131j088L23J504q11L77J384
791A013q37m30K076q08m33J001l20m52R44l25j215O49n04j264P64l6j297K68K64
810i42p45Q75l19m05J34J125j87j81R29J75L4N93o3J80Q04p13j12K68K50o40n07
831E53l78m60L19o29p83Q2L23o17L43n4J1O7J06q9O31L45L14K02P26R1k9L04K30
854A608j72l30j22Q4J10l36n47k5n4m98m53m03j95N1k6k3K51M61P5k54lN57K51
877Gk52J82R10L14L01j83j21N3j38k70q57J36M36m87m37J41J79k58m74m76M67
898h27J7l40J06O93K35J58J61k2K17L59l25j9L99J88r0m16M34n54K68l76n11j62
920d07J35p33K45J64j07l35M09k74J11J08m5K38P27J66n22R75M67m06J24l30J09
$$ plain form
772 1503 1396 -241 535 485 -300 410 199 -1416 -763 -309 -1883 -1807 -676 -1764 -1441 63 -748 -371 1013
791 1013 176 -254 1822 1014 581 1582 1262 810 1754 1429 214 863 359 -905 -141 -177 -1474 -1206 -942
810 -942 -1687 -812 -1131 -1536 -1402 -277 -464 -645 284 459 493 1086 1023 1203 2007 1294 1182 1450 1700 1060 553
831 553 175 -285 34 -595 -1378 -1296 -973 -1590 -1247 -1301 -1290 -1223 -1117 -1206 -575 -230 84 286 1012 1103 1074 1378 1608
854 1608 1436 1106 984 1068 1178 842 295 270 216 -282 -735 -1138 -1333 -1282 -1308 -1331 -1080 -619 -544 -798 -801 -244 7
877 7 -245 -63 847 1161 1462 1279 1158 1211 1073 803 -54 82 518 31 -406 -265 -86 -344 -818 -1294 -827
898 -827 -810 -1150 -1044 -351 -116 42 203 181 398 757 432 413 812 1000 910 494 928 374 642 266 -245 -407
920 -407 -272 -1005 -760 -596 -703 -1038 -629 -903 -792 -684 -729 -491 236 402 -120 855 1322 916 1040 710 819
941H19J49O6p35M19M06j061k82Q8o06K59m08n61N36N87n16m99J026j4n18N67o9
962c47L7P66J5l80J215K49j144O33J81r67M05m0j048P19K82j131L42O90j541j33
982a197P30n58l98J200q19j4J628n87p51J168J51o64N91P3m92J562l69j051P83
1001I86L74j324k92L27n31K13L39q73J35Q91j357k17J039n29m72Q10j34L43J080
1020H08j72n75J029j17r76L33L05l28M26L73q78Q22j50j217K26L44j041l33O04
1039e17m50K85Q04r06j45J141p50p96Q31K01l06J150N4j72J023m17o73N86J32
1058A075r75L03J50l95L47n8p02L64M1j109o2L39l11lM79O1mP52o36k64O66L73
1080D31q23O11M67l64M74L99m25L13j67q51k26L42n04p7K35k2l19N04n28l17R46
$$ plain form
941 819 968 1034 299 718 1124 63 -219 -131 -737 -478 -886 -1447 -911 -324 -840 -1339 -313 -327 -845 -278 -347
962 -347 -310 456 471 91 1306 1555 411 1044 1225 258 663 623 -425 294 576 -555 -213 477 -1064 -1197
982 -1197 -467 -1025 -1423 -223 -1042 -1056 572 -15 -766 402 553 -111 480 553 61 1623 1254 203 986
1001 986 1360 36 -256 71 -460 -247 92 -781 -646 245 -1112 -1329 -290 -819 -1291 -481 -615 -272 808
1020 808 636 61 1090 973 -3 330 635 307 733 1106 228 1050 900 -317 -91 253 -788 -1121 -517
1039 -517 -967 -682 122 -784 -929 212 -538 -1334 -503 -302 -608 542 596 424 1447 1030 357 943 1075
1058 1075 100 403 553 158 505 447 -255 109 150 -959 -1021 -682 -993 -996 -517 -456 -460 292 -344 -608 58 431
1080 431 -392 219 686 322 796 1195 770 1083 916 65 -161 181 -323 -400 -165 -187 -506 -2 -530 -847 99
1101I9n99n58N91K54j7K63N98l11L58J07o19K32L51l15l64L56J36m33K06k51k61
1122a77N1k66m24J81L62j51k08M63l72M58K98o06K28N70m77L51M28K4m7K22m84
1143D24q7L60m01l70K15K36r22N80j76n63J91K92q80K57O06l01k46P22j09j98
1163c70N36J14p2N82l77m44J115m85n44O79P9n63L66P9q90J89J11r15N26M8n16
1184g52J92L88n37J60P09r19L39N74n01kP22k80q5P21j24m72Q63k42q56P75j52
1205E21p12J93k9m18N61O8p64L87J64m26k94O72l66P8N26l00K18M69n16k64O55
1226D23l80k22O07j53M4N51n33o25O13J32j140L65R1l99K56J46k53O23pq64J79
1247e46M81k57j45N16kJ81M85l45L3K99l16m68L97K1j97R9J3k11J55N7p64K32
$$ plain form
1101 99 -500 -1058 -467 -213 -230 33 631 320 678 785 166 398 749 434 70 426 562 129 335 84 -177
1122 -177 -126 -392 -816 -635 -273 -424 -632 -169 -541 -83 215 -391 -163 407 -70 281 709 733 686 908 424
1143 424 337 697 296 -74 141 377 -545 35 -141 -704 -513 -221 -1101 -844 -238 -539 -785 -63 -172 -370
1163 -370 166 280 208 790 413 -31 1084 599 55 734 813 250 616 695 -195 -6 105 -810 -284 -236 -752
1184 -752 -560 -172 -709 -549 160 -759 -420 154 -347 -349 373 93 8 729 605 133 996 754 -102 673 521
1205 521 -191 2 -27 -445 116 184 -580 -193 -29 -455 -749 -77 -443 -365 161 -139 79 548 32 -232 423
1226 423 43 -179 428 275 319 870 337 -288 325 457 -683 -318 -227 -626 -370 -224 -477 146 139 -725 -546
1247 -546 -65 -322 -467 49 47 228 713 368 401 700 384 -84 313 334 137 236 249 38 193 250 -514 -282
1269b82N3l02l66N40l47K44K87J0lM18j79l08P70m09j55N00p5J50J20r6l39m2
1291A89J71l36j94L1%j63Q6m01K74J1k82K87j37j30J30L39L8l1j5J4K62L72l16
1314A99K38k43M10l28k9M8J57k30j49l26N1J25p9k81M5O3J50j34K00m9P2j35p1
1337b96L25N7K0P3K57n7J35k96Ql0L57n06J22j03n4l06J01k52K20Oj99r7M27j62
1361b50o6k7M41j37R3kq3K58J2J19R3k00J03m1j96o1J58r9l7j26R9k32j41J29
1385a93k61k3P2p7K70j71L04J35O1j99K83j26M0J9K29r4k03L12J46m9n21J43p3
1408B4l41J33O4k22M62n00M37l63K01j07j27J86o7N22m67J1K65O6oM9Q0J84j93
1431B91l97K70l13K0K51j25M2J43n04m15L54J10j3MJ36O0J34r1L4J28o0J3j20
$$ plain form
1269 -282 -229 -531 -897 -357 -704 -460 -173 -163 -166 252 73 -235 535 126 -29 471 396 546 666 570 231 189
1291 189 360 24 -170 -139 -139 -302 -216 -617 -343 -332 -614 -327 -464 -594 -464 -125 -87 -118 -133 -119 143 515 199
1314 199 437 194 604 276 247 295 452 222 73 -253 -202 -77 -156 -437 -392 -329 -179 -313 -113 -162 -90 -225 -296
1337 -296 29 86 106 179 436 379 514 218 226 196 553 47 169 66 12 -294 -193 -445 -225 -219 -418 -515 -88 -250
1361 -250 -316 -343 98 -39 54 52 -31 227 239 358 451 251 354 313 117 56 214 115 78 -48 51 -181 -322 -193
1385 -193 -454 -477 -405 -482 -212 -383 -79 56 117 -82 201 75 115 134 363 269 66 378 524 475 -46 97 24
1408 24 -317 -184 -120 -342 120 -380 57 -306 -105 -212 -339 -153 -220 302 -165 -154 111 177 171 220 300 484 291
1431 291 -106 164 -149 -129 122 -3 39 182 -322 -737 -383 -273 -286 -282 -146 -86 48 -43 -9 119 59 72 -48
1454d8J49K19j63M33k98L8k20j05j7K32k08n6j64K70k84J4j32J48O1l52L06j40
1476c17L6J09K80J5m4p2K63j58J32n4J24m07L91K19k85l9j50j97J60Q4j90j44
1498b44K51k9n37K43j94J25K92J44q6J24l0l41L57K00k02L10j88J23J6j43l34
1519a43K61J38l28n3K52J46m88M6o5J95n0l03K17K98k12j40R3K70j66n3J93o4
1541D4J36p9n9R0j65K34k62j8K27k65J5N3M6j40N6l42M81l3l7p7q7J65M2k83J83
1566g5K35K32k60k36K90j39K38k39K6J06j28j50K7L4j42P1Q2R8k69L2r3j25M24
1589C9l86K86J01J8pj37K73K8k07j79L37o0K88k35k11L99k4m56K64j29m2k15p5
1612c30o7J39M81l77lJ91L0l38N9J1J85J02l18M86q9K14m61l3K26j74Q4k5J76
$$ plain form
1454 -48 101 320 157 590 292 330 110 5 -12 220 12 -44 -208 62 -222 -208 -340 -192 -131 -483 -177 -317
1476 -317 -281 -172 108 123 79 7 270 112 244 190 314 -93 298 517 232 193 43 -154 6 90 -100 -244
1498 -244 7 -22 -559 -316 -510 -385 -93 51 -35 89 59 -282 75 275 73 383 195 318 334 191 -143
1519 -143 118 256 -72 -125 127 273 -215 -169 -234 -39 -89 -392 -175 123 -89 -229 -136 134 -32 -85 108 44
1541 44 180 101 42 132 -33 201 -61 -79 148 -117 -102 -49 -3 -143 -87 -429 52 19 -18 -95 -182 -17 25 -258 -75
1566 -75 160 392 132 -104 186 47 285 46 72 178 50 -100 -73 -39 -181 -110 -28 70 -199 -167 -260 -385 39
1589 39 -347 -61 40 58 51 -86 187 215 8 -171 166 106 394 159 -52 347 323 -133 131 2 -40 -255 -330
1612 -330 -397 -258 223 -154 -157 34 64 -274 -215 -204 -19 83 -235 251 162 376 -85 -118 108 -66 18 -7 169
1635A69q1KO2k55K96k57k5j26l7N6J94k88R2K44k28K96NK50m33L10j09j31L36
1658C42j93M1J2jq9k58K27k62J63n4J52k34J56m38L70J21m66J95J22p3o2M70l68
1681a27M8Q23n82m85L91j3N1R9q5l00K99j91l6J29J12J95k87J05k21q5j8n9K57
1704B0J37l37O7L15p5j37m8Q9J25r5k37L9K24n2n1k8P0J44m94N42j40j03K29j83
1728B1j59Q0j2K36K0j93o0j9j85L24P7l05P1L70j3m52J02O4J68J98j00k54K76
1751B55j5j82j36J96j64l11K42p8Q4K2J05J41p3l5j28J21j4J27l86L06p8M00k38
1774A61mk32L63m10J88n3m7J16k24r0K80M9j23j28K30m2k46J26L8L7r6Q4l3M50
1798C94l48j95O8L12l58L0j81L45J62k07j60J96K25m67o1M3K06J5N7n78N94r0
$$ plain form
1635 169 88 90 152 -103 193 -64 -89 -215 -252 -196 -2 -290 -198 46 -182 114 119 369 -64 246 137 6 342
1658 342 149 190 202 201 112 -146 81 -181 -18 -72 80 -154 2 -436 -66 55 -411 -216 -94 -167 -229 241 -127
1681 -127 -79 744 162 -323 68 55 106 205 120 -180 119 -72 -108 21 133 328 41 146 -75 -160 -178 -237 20
1704 20 157 -180 -113 202 127 -10 -58 31 156 61 -176 -137 87 35 -16 -44 26 170 -324 218 78 -25 204 21
1728 21 -138 -58 -70 166 186 -7 -67 -86 -271 53 130 -175 -104 266 253 -199 -97 -33 135 333 233 -21 255
1751 255 240 58 -78 118 -46 -357 -115 -193 -109 -87 18 159 86 51 -77 44 30 157 -229 77 -1 399 161
1774 161 157 -75 288 -122 66 13 -34 82 -142 -232 48 97 -26 -154 76 34 -212 -86 -48 -11 -107 -23 -56 394
1798 394 46 -149 -81 231 -127 -97 -278 67 229 22 -138 58 283 -184 -245 -202 4 19 76 -502 92 2
1820BO3k88J84q9j22j4L70J50j6l01L13k09j91jR3L44k37r3k2r4K63j70j23K63
1844G5l13J15O7j24J04j22J12j97M66J5k35j52J15l9J47j57J99M8J04j6j71j48
1866a07M16k92n1J13K63l07j88N9L10j03l56K46J79k01j47k30M56J28l09o2J9
1887a64P21m78j58j25M37l3p7k4K45k63k13j42J75J85k8l39M31J03k42k70K55
1908dJ5P0r5j23J65j44q7R1Q9K59K5l30K52j20m8k64l9M14J3l63J77K2k15K11
1932b9k94J44L17j23l20J60L37l6k3k72K7K47j9m13K63L88j39l79J04K50p0k71
1954a51J73J07j40j53OK35K82n00L2n1j27J58m7k33L90J27k0k20J63Q2L0j51K2
1977A4J73J8k93P4Q2K3j65j17J77K2J76l66L08j06k16JNk9K54M8L2N2k52j21K38
$$ plain form
1820 2 65 -223 -39 -128 -250 -264 106 256 240 -61 252 43 -148 -149 -56 288 51 -42 -64 -158 105 -65 -188 75
1844 75 -238 -123 -56 -180 -76 -198 -86 -283 183 198 -37 -189 -74 -113 34 -123 76 124 228 212 41 -107
1866 -107 309 17 -34 79 342 35 -153 -94 216 113 -243 3 182 -19 -166 -396 60 188 -121 -183 -164
1887 -164 557 79 -79 -204 233 200 123 99 344 81 -132 -274 -99 86 58 -281 150 253 11 -259 -4
1908 -4 11 81 -14 -137 28 -116 -203 -112 -23 236 261 -69 183 63 15 -249 -288 126 139 -224 -47 -25 -240 -29
1932 -29 -323 -179 138 15 -305 -145 192 156 133 -139 -112 135 116 -297 -34 354 215 -164 -60 190 120 -151
1954 -151 22 129 -11 -164 -158 77 359 -141 -109 -160 -287 -129 -176 -409 -19 108 88 -132 31 113 143 -8 14
1977 14 187 205 -88 -14 68 91 -74 -191 -14 8 184 -182 126 20 -196 -195 -190 -219 35 83 115 167 -85 -206 32
2002C2j03n3p7J40K93l20L39j40j95J65J4m34K83J62j14j96J74j71L52r3j09k14
2024b65K97K5k19J32L6n0m9M0L82k00J14k83QJ1L3k57J33J48Q9j8j87J30J63l10
2048i7l49L77K26k40j59j40K84J38j17J26j20J51M3p0J51k0k80L35l22J14n0q4
2070a03J70k52K47k94K22P7n7k3M4K13p3j53P3J04m02K14J7q4j2J17j40k4J98
2093G9R5l21k1K22J28J8l77Q7P4l4J47k17o9L5J41J0j25M3K99k29k46L97K8k11
2117d7j50L36l3J09l27J19J58j57j38M1J92n1L4k32J91P1Nk85J31L78l24k0O7
2140F8j45N6l14N75j52q9L9J16l20P7J07K49j29j94n0K28J34l17K50k60N6J32
2162A17k89j42K54k02K67r4q4J52k7j51K07o4J78r8k23OK48K57l73n9J90M3r6
$$ plain form
2002 32 -71 -124 -201 -61 232 -88 251 111 -84 81 95 -339 -56 106 -8 -204 -30 -201 151 58 -51 -265
2024 -265 32 57 -162 -30 6 -44 -93 -53 329 129 243 -40 -32 -21 12 -245 -112 36 125 107 -80 50 213 -97
2048 -97 -446 -69 157 -83 -242 -382 -98 40 -77 49 -71 80 123 53 204 184 -96 239 -83 31 -19 -103
2070 -103 67 -185 62 -232 -10 67 10 -13 31 244 171 18 91 195 -207 7 24 -60 -72 45 -95 -119 79
2093 79 174 -147 -168 54 182 200 -177 -90 -16 -50 97 -120 -189 -154 -13 -3 -128 -85 214 -15 -261 136 164 -47
2117 -47 -197 139 106 215 -112 7 165 8 -130 -89 103 52 86 -146 45 116 121 -164 -33 345 21 1 68
2140 68 -77 -21 -335 240 88 -1 38 154 -166 -89 18 267 138 -56 -106 122 256 -61 189 -71 -15 117
2162 117 -172 -314 -60 -262 5 -89 -173 -21 -48 -199 8 -56 122 24 -199 -193 55 312 -61 -120 70 113 17
2185A7j80J72j97J80J01R2j43N5p8q2J7J29P0n9j13PJ69j07Lr3K91l59QJ8J04
2210B2P4o1o2J00k1k23J3J46kJ57j52j24QK00Q4k67K37j06O5k37L06k13O0k62
2234b58J51K59k42L2N3k1p3k2J52Jj58K21p8J32k45j91PJ62L18k71p4J32mJ00
2258H3k16J76J79k76j85M70j05M7j19r4J92j33p2j75K57J1q4j5N1J46k97M0J95
2281G6n0k46P2J24K44k41j4n1J79K83l26l2O7r3K0q3J78j44j18L33l88L45k84
2304a49P4k49J36J73J05j56j46K76q0J81l8l4N0k14J32q0j27J94p1p6J05o6K11
2327A51j18j13j67N6N9K51n8rj23m8K82j63JJ2Jj89J62j32M17l48m8K66o4n7j26
2352a05J13j61J77Q0j36pR5n8n9j96jK19l3J25l0R9m1k75J72J12j22j64L31J38
$$ plain form
2185 17 -163 9 -188 -8 93 185 42 97 19 -63 -46 83 153 94 -19 -12 157 50 53 -40 251 -108 -100 -82 22
2210 22 96 35 -27 73 52 -171 -158 -12 -14 143 -9 -133 -125 75 159 -108 129 23 88 -149 157 -56 4 -258
2234 -258 -107 152 -90 -58 -5 -26 -99 -121 31 32 -126 95 17 149 -96 -287 -280 -118 200 -71 -145 -13 -17 83
2258 83 -133 43 222 -54 -239 231 126 173 54 -40 152 19 -53 -228 29 40 -44 -59 -8 138 -159 -119 76
2281 76 26 -220 -148 -24 220 -21 -35 -86 93 376 50 18 85 -8 12 -71 107 -37 -155 178 -210 135 -149
2304 -149 -75 -324 -188 -15 90 -66 -212 64 -16 165 127 93 143 -71 61 -19 -146 48 -23 -99 6 -60 151
2327 151 33 -80 -247 -191 -132 119 61 52 -71 -119 163 0 1 13 14 -175 -13 -145 272 -76 -124 142 78 21 -105
2352 -105 8 -153 24 104 -32 -39 56 -2 -61 -257 -258 -39 -72 53 23 122 81 -194 -22 90 -32 -196 135 273
2376B73k77j6J43K6M7j08m1j54K39k37K50m81L24J6PM4K13j69j63m0MJ76o3K17
2400B30k34j54K60l61K00J93j71K34l45J84r7L84l77R5o0q8K02M5q7j80j54K96
2422A5k04m7J67J39J75l39L60k69m8J12o5l8j6P4M0R6k31R5n7R1j32O4K95k29
2446D8o1j26J09l08M19O8q2L8o1j77J40R8j43j51N43l63J35PK0j86n0k3k2J25
2470cj40J72nQ4j55j59p6K46L28l29j00K43k48K32j12q3J17k71L79j25k6P2k84
2493b43L75k19r7K89j78J03J95l05J79l5j26n0N2P8O4j67k8Q7q4J39j01K6j1K4
2517c3J88K5m33L68J9j96oJ02j16R3K54m54L3J90K03k50k32R8R1l2p8o4J57k6
2541i9K23k69L4Nl2J08k2K05j33j30Rj53L82j89j79L42J35l53K81j59j95K22J00
$$ plain form
2376 273 -4 -20 123 149 196 88 47 -107 132 -105 145 -336 -12 4 11 55 268 99 -64 -104 -100 76 13 230
2400 230 -4 -158 102 -259 -59 134 -37 197 -148 36 -61 323 -54 41 -19 -107 95 140 53 -127 -281 15
2422 15 -189 -236 -69 70 245 -94 266 -3 -51 61 -4 -42 -58 16 56 152 -79 16 -41 50 -82 -18 277 48
2446 48 -13 -139 -30 -338 81 149 67 105 44 -133 7 105 -38 -189 354 -9 126 133 153 -33 -83 -106 -128 -3
2470 -3 -143 29 24 108 -47 -206 -282 -36 292 -37 -137 106 -142 90 -22 -105 12 -259 120 -5 -31 41 -243
2493 -243 132 -87 -184 105 -73 30 225 -80 99 64 -62 -112 -60 18 82 -85 -113 -26 -110 29 -72 -46 -57 -33
2517 -33 155 180 -253 115 134 -62 -68 34 -82 11 265 -189 -156 34 237 -13 -245 -147 -56 -88 -166 -230 -73 -99
2541 -99 124 -145 -111 -106 -138 -30 -52 153 20 -110 -101 -254 128 -61 -240 102 237 -116 165 6 -189 33 133
2564A33j55j54J41l3J6RJ08o3r7J01p0J76j27l4ML0K72k91j26M11l72K14j82R1
2588Bk06Q4QJ76k52K82J03l20l3J47K69m96K45j63J08m8m9M35k31j17j69J80N0
2611En9n9K52j50q8J6K51j30q8J23K2k81K18j19%J60k06L10k90J25Jn9K6J99k65
2636h6L26j91M2j46K66j18k70J41m0j20K54k2N4j71J95k25r6K99O4k81J15P1L21
2659C82m81N4N0J79j06r5L6N6M6Q5m33K00qm1P6j11r2J44M5l3R0j57J28Q7J0k28
2685a17J40O0j75Q4l1n6P3J05p8k40J92j09K3o5k4J64P1r8o4O6J68J06l13K83
2709A65j63r1m0J26L9j77J17N2K06m23L68m79J39J63j04j16K75J01j62j13J61
2730D4J01j81nk46J86J16K15l20j0O2qj06l7P5l4K81J5l69J59K05r0n9M6j41O0
$$ plain form
2564 133 -22 -176 -35 -68 -52 -43 65 2 -95 6 -64 112 -15 -49 -45 -15 257 -34 -160 251 -121 93 -89 2
2588 2 -204 -120 -112 64 -188 94 197 -123 -156 -9 260 -236 9 -154 -46 -94 -143 292 61 -56 -225 -45 5
2611 5 -54 -113 139 -11 -99 -83 168 38 -50 73 95 -186 32 -87 -87 73 -133 177 -113 12 13 -46 -20 179 -86
2636 -86 240 49 91 -55 211 93 -177 -36 -76 -196 58 36 90 -81 114 -111 -207 92 156 -125 -10 61 382
2659 382 -99 -45 5 184 78 -17 19 75 121 206 -227 -27 -35 -76 0 -111 -203 -59 -14 -47 43 -114 14 101 111 -117
2685 -117 23 83 -92 -8 -39 -95 -22 83 5 -235 -43 -152 -129 -194 -218 -54 17 -81 -145 -79 89 195 -118 165
2709 165 2 -89 -129 -3 36 -141 -24 28 234 -189 179 -300 -161 2 -102 -218 57 158 -4 -117 44
2730 44 145 -36 -41 -287 -101 15 230 -90 -100 -38 -46 -152 -189 -114 -148 133 148 -221 -62 143 53 -6 40 -101 -41
2755d1j6k49M72j67Q4J66k68n3L42m74K65r2r4J93O2J7k92J22J53l30M26l39P
2778a06pJ64j16j30K51J04j14Q7ol99K88p0L79j89j83J92k68K17K1j51j14K17
2800F7q7o4K17k39K05l20K87J27k72K60l99K24Q5j48K35j76J70j30j01P3O6Q6
2822A66l46K91o0k08J67J63k61J43j95m7J91j28K25j3l53j2L19n1M9j10j08J99
2844B1L1P7p0l81K36j10J95l3j04Q8P3N2k08O3N7j40L24l27k5P4M61l35j18J37
2868C8J46m4l9q2k05J27j7K06j33Q0nl40J14R8K70o8l7ok46L72k89k8l2J44J1
2893C5p6j22L66k56K5M5Jl4r3M6j68L82J2J24k77J1M7k19K44j04p0J1l7Q0J2k56
2919b71N09m90M85l18M4J50k08J21j67K36k37J14K5j63L60LJ45j97k33l8%K22
$$ plain form
2755 -41 -57 -306 166 -1 83 249 -19 -72 270 -204 61 -31 -125 68 130 147 -145 -23 130 -200 226 -113 -106
2778 -106 -113 51 -65 -195 56 160 46 133 127 -272 16 -54 325 136 -47 145 -123 94 115 -36 -150 67
2800 67 -20 -84 133 -106 99 -221 66 193 -79 181 -218 6 91 -57 178 2 172 42 -59 14 80 166
2822 166 -180 111 51 -157 10 173 -88 55 -140 -187 4 -124 101 88 -265 -277 42 -9 40 -70 -178 21
2844 21 52 129 59 -322 -86 -196 -1 -34 -138 -50 23 75 -133 -70 -13 -153 171 -156 -181 -107 354 19 -99 38
2868 38 184 140 101 19 -186 -59 -76 130 -3 77 72 -268 -154 -56 214 146 109 103 -143 229 -60 -88 -120 24 35
2893 35 -41 -163 203 -53 -28 17 18 -16 -109 -63 -231 151 163 287 10 21 68 -151 93 -11 -81 -70 -107 -27 -15 -271
2919 -271 238 -252 233 -85 -41 109 -99 22 -145 91 -146 -32 -7 -170 190 193 338 141 -92 -130 -130 92
2941I2j61J18j08P6k01m0M22m05K35j17K26k84j04J44M6L16l50J3R9K10k76J84
2963A35k25J19J06k2j17L8K98k55k27M13m63n4K50K01j20k05K20k90N78m61K13
2984A32j92k05K00R5p4K65k94j33J92O4j89K05j56m3J94J34j61j08K8m4J18j8
3006A0j0M3Jn2J20r2j06N6l1Q1k54J59r9r6J24N0j5K41k06J86p1j04L1J84k84
3031a34J15r9J72r8Q5j47K84l29J04O8K2j8l17Q7K96k03m5k4J60l4J68j95n4K32
3055I6k5R2k07L5J61m6j34M2J39N2j31K7J23l06M1J14j91J62j68R0l0O1j13K96
3079A80l28J43m1o9J1J99j05k51L54k67J63j68L95j75l03L09%J34k94L4O2J74
3101A57k65P4On5Ql8k09L78j33K25k95K49l69L16k8j15p2j1J5M0K61kl37M8Q0
$$ plain form
2941 92 -69 49 -59 17 -184 -224 198 -207 28 -89 137 -147 -251 -107 -61 255 -95 -82 17 227 -49 135
2963 135 -90 29 135 113 -4 34 332 77 -150 263 -200 -254 -4 197 77 -128 92 -198 380 -81 132
2984 132 -60 -265 -65 30 -44 221 -73 -206 -14 50 -139 66 -90 -133 61 195 34 -74 -46 -90 28 10
3006 10 0 43 44 -8 112 20 -86 -30 -61 20 -234 -75 -174 -270 -146 -96 -111 130 -76 110 39 -65 -34 150 -134
3031 -134 -19 -118 54 -44 41 -106 178 -151 -47 21 43 25 -292 -205 91 -112 -157 -181 -21 -55 113 -82 -136 96
3055 96 71 163 -44 -9 152 106 -28 14 153 205 74 101 224 -82 -41 73 -118 44 -124 -34 -64 -3 -116 180
3079 180 -148 -5 -46 -115 -104 95 -10 -261 93 -174 -11 -179 216 41 -262 47 47 181 -113 -79 -17 157
3101 157 -108 -34 -28 -83 -75 -113 -322 56 -77 148 -147 102 -267 49 21 -94 -166 -177 -162 -122 139 137 -200 -152 -72
3126g2K61j84Jp3K4O1J15j06j14J24j37o2O6j08L00J00l12K00j20j36J71j20J35
3149A4J6M0N5j74J74m3l96N2L39%j0k31K66N7j34m3R2o9o0r0L2RN0J40q4j92J12
3176g8L2j22K51l9q3J22k59j1K47k09J74n9L26j39k29J93K31l72k7j12K07J46
3198A90l27L90k37K37l05K53j37j55K02J53l90lJ58k25K00j27J00mJ59k60j2J39
3220ak16M14m87K30J38l48J47J17M2p6n1K7J54k54J65K21q6k94Q0k39J87J31N4
3243E5M3j11j74P1j2j12K30J07j30j53JP2J23n3q0J77K9j83J96j41K72k03k10
3266a86K32j84M57n99M11N5J1M6n66M62j08J47P3j99n8o6K11k55M7J18q7Pk7K20
3290A62Q9l19J07k0j95M54j63j94K90l25J89k20L70j85p5K24n4l50K80J40j30
$$ plain form
3126 -72 189 5 6 -67 -43 18 133 27 -87 37 -100 -162 -96 -204 96 196 -116 84 -36 -172 -1 -121 14
3149 14 30 70 125 -49 125 82 -314 -262 77 77 67 -164 102 159 25 -18 74 5 -55 -145 -113 -104 -54 86 2 -190 -78
3176 -78 -46 -168 83 44 -39 83 -176 -187 60 -149 25 -34 292 153 -76 117 348 -24 -51 -163 44 190
3198 190 -137 253 16 253 -52 201 64 -91 111 264 -126 -129 29 -196 4 -123 -23 -27 132 -128 -140 -1
3220 -1 -217 197 -290 -60 78 -270 -123 -6 36 -40 -91 -64 90 -164 1 222 136 -158 -78 -317 -130 1 55
3243 55 98 -13 -187 -116 -128 -240 -10 97 -33 -186 -185 -113 10 -43 -123 54 83 -100 96 -45 227 24 -186
3266 -186 46 -138 319 -280 131 186 197 243 -323 139 31 178 251 52 -6 -72 139 -116 -69 49 -38 -31 -58 162
3290 162 251 -68 39 19 -176 278 115 -79 211 -114 75 -145 225 40 -35 189 135 -215 65 205 75
3311G5J52j51j39Kj93K94P3j69J70j92O1j50J79j38J55M6k41K29k09k9o7L29j22
3334c5j4R0j71K87p7J89m59J12K11j02K7j6M6j85l5m7L55j62J9q7pK43j46j58
3358a22J65Q3r7ol9j8p2J65jk54L91m68J82M0o8K13k76j83K62J86l12K29M3m1
3382Bj26j0K21j71N0p2M1rk08J52L30j21k93J29J05L36m07m6J97j22k82K35k3
3405i2L41k58J6Q1o1n6j5J72o1Q1k12L5l1O7N8l0q1j03J58J59l35J87r3l7O0J98
3431A48K9j30l7L83m09q0J78k87K04N5q4o9j87M36k40m1K05j34n2J18J12j54Q8
3454E2J5q7J46L4k08J35J27k97J98j60R7n8K66k64m2P8j07k7J9J85j81j46k6L97
3478A46j18q8m0J44J09k98J04j07O2J41j50N6J01j23K4l9r6L14L8k81J79p1J2
$$ plain form
3311 75 227 76 -63 -61 -254 40 113 -56 114 -78 -17 -167 12 -126 29 75 -166 63 -146 -175 -242 87 -35
3334 -35 -49 41 -130 157 80 269 -190 -78 133 31 58 42 88 -97 -132 -179 176 14 33 -54 -61 182 36 -122
3358 -122 43 126 29 23 -16 -34 -106 59 58 -196 195 -273 -91 -51 -119 94 -182 -365 -103 83 -229 0 43 2
3382 2 -124 -134 87 -84 -34 -106 -65 -74 -282 -130 200 79 -214 -85 20 356 -51 -97 100 -22 -304 -69 -92
3405 -92 249 -9 7 88 27 -29 -44 128 67 148 -64 -29 -60 7 65 35 -46 -149 9 168 -167 20 -73 -110 -50 148
3431 148 177 47 10 393 -16 -96 82 -205 -1 54 -30 -99 -286 150 -90 -131 74 -60 -112 6 118 -36 52
3454 52 67 -20 126 160 -48 87 214 -83 115 -45 52 -6 260 -4 -46 32 -75 -102 -83 102 -79 -225 -251 146
3478 146 28 -60 -100 44 153 -145 -41 -148 -86 55 -95 -39 62 -61 -37 -76 -172 142 180 -101 78 7 19
3501A9K42l47r4J55k7P2J16j19L1j40J64l10l6L14J15j28O4n9k09K90m16K40J31
3524F8n5P9j71K34k14Nm7J64k63K2j12K44N3j7P6l5o7j4J91j4j50m4K17K09l58
3549Aj95K80l5j07J08n1J33l35J86J67Lj8l1l8j16r1K16k79L30q5j27J35j5p1
3573c5K88j44k14J06m6O9m1J38j52J09j39J8l57L93k5j09K31Qm5L63k52j38J6
3596D2j1j17R7q1o0K9o1J15j60J58L51j60ml3j36o2j02L77l62M80m22K86j42K1
3620D3k25L03j0k4l14K81k73L2O0R9K5J63p5l49K78j0l37J04L05jk64J81J03j3
3644H2k19K31n9j65P7K20k08k31L99q5n0j05J9J23q9R7M3m4J06P6k81J24l1l6
3668fJ32l34K53O3j09j17J35K4mP5q8k0q3J31nl22J98L60m69m9J60J55k58K83
$$ plain form
3501 19 261 -86 -180 -25 -52 20 136 17 48 -92 72 -238 -274 40 155 27 91 32 -177 113 -303 -63 68
3524 68 13 92 -79 155 -59 -54 -101 63 -200 -178 -290 -46 7 -10 66 31 -36 -50 141 127 -23 -67 150 359 1
3549 1 -194 86 51 -56 52 1 134 -201 -15 152 155 137 106 68 -48 -139 77 -202 128 43 -84 51 36 -35
3573 -35 253 109 -105 1 -45 24 -17 121 -31 78 -61 -43 -400 -7 -32 -141 90 98 53 416 164 26 42
3596 42 31 -86 11 -70 -130 -101 -162 -47 -207 -49 302 142 138 105 -31 -93 -195 182 -180 300 -122 164 22 43
3620 43 -182 121 111 87 -227 54 -219 -187 -127 -28 -3 160 85 -264 14 4 -333 -229 76 75 -189 -8 95 82
3644 82 -137 94 35 -130 -53 167 -41 -272 127 42 -8 -113 -94 29 -60 37 80 36 142 218 -63 61 30 -6
3668 -6 126 -208 45 108 -1 -118 17 41 37 112 24 4 -79 52 47 -275 -77 283 -186 -235 -75 80 -178 105
3692A05J98l77O1j44J48K71j77q3Q4l18K20n9L2l8q7J67J23pJ24J6l08J31K5r7
3716A0K61l62L1M9l9j06N3K84k75n4J05O3K26m2k02O7m1R9k05j11LJ71p5O8l7
3741e9q1Q0P5K06k23J13L98n55q2o5J68j81Q4n4J83K9p8r4J47j84J54P4o0J97
3765A92k86J63q7jj81L43k49L43m24K67R5o9l01L16J69l75P4q7j5J27k18J97J74
3788A67l30K08J03l17M65l09j43J30J24n0j7o1J14j55J21j59L84k28J27q5k01
3809a12K52l11L20k58P3q4R3L9j88K65j8o2L9j90J38j08o7K4K56j24l74M66M4
3832A13j41O5P0n2k24L12K1k82JJ52L8j55O3J0J68l16J81J23k47M1Q5J08j40N
3856ao4k1k08K05K3K6j93K75j65j41L03Qj21j2o5N8J10J78j95J12J3l60K05M7
$$ plain form
3692 105 303 -74 -13 -157 -9 262 85 2 86 -232 -12 -71 -39 -77 -164 3 126 119 243 259 -49 82 107 10
3716 10 271 -91 -60 -11 -50 -156 -103 181 -94 -148 -43 20 246 204 2 69 28 127 -78 -189 -186 -15 -90 -22 -59
3741 -59 -140 -60 15 221 -2 111 509 -46 -128 -193 -25 -206 -122 -176 7 36 -42 -136 11 -173 -19 55 -5 192
3765 192 -94 69 -18 -19 -200 143 -106 237 -187 80 175 106 -195 121 290 -85 -11 -98 -113 14 -204 -7 167
3788 167 -163 45 148 -169 296 -13 -156 -26 98 48 31 -30 84 -71 50 -109 275 47 174 89 -112
3809 -112 140 -171 149 -109 -36 -120 -27 12 -176 89 71 9 48 -142 -4 -112 -179 -155 101 -23 -397 69 113
3832 113 -28 37 107 55 -169 143 164 -118 -117 35 73 -82 -19 -9 159 -157 24 147 -100 -59 26 134 -6 -1
3856 -1 -65 -86 -294 -89 -66 -40 -233 42 -123 -264 39 47 -74 -86 -151 -93 17 195 0 112 125 -235 -30 17
3880A7k6j60o7K91l6J65k32J04K8P0j73r9n6Q6j0J33k62N01n0k51J40O9k4j79
3904b1j32K48j23J64k61J32M7Q6j73J19L7k67J22K20k28j60J19L03k8l05J66k39
3926a74O4k3J23J2p4l9o5K43n0kj22L53j31r9oM8%l04r4M72j92J23K32m90K30
3951C5j39P9K51j02k25L2J27j38RNJ76n6n4j4k28L22j66J67k28j2K61J2j39J08
3975H3K8r5o3M2Q2q5R7o4k04K65j44kJ90k5j40L7L5p3P5k94M60j89j09j8J36O2
4001H7n7l2l7R2o6K4K82j48l53J31j72L12J30Oj42p3L6K67k39l2%l8K10l66J38
4026d0L8n5Q4k4M9J46l71lK06J57j30j79J67O6j16k64M15j30n2p5l5Q0J75M9n7
$$ plain form
3880 17 -9 -169 -236 55 19 184 -48 56 84 154 -19 -118 -174 -88 -98 35 -227 274 224 -27 113 182 158 -21
3904 -21 -153 95 -28 136 -125 7 54 140 -33 86 123 -144 -22 198 -30 -190 -71 232 204 -101 65 -174
3926 -174 -110 -133 -10 2 -72 -111 -176 67 17 15 -107 246 115 16 10 58 58 -246 -340 132 -60 63 295 -195 35
3951 35 -104 -25 226 124 -101 -69 58 -80 -71 -66 110 54 0 -14 -242 80 -86 81 -147 -159 102 114 -25 83
3975 83 111 16 -47 -5 77 -8 89 25 -179 86 -58 -60 130 105 -35 2 37 -36 39 -255 205 16 -93 -111 25 87
4001 87 30 -2 -39 53 -13 11 293 145 -208 -77 -249 63 193 199 57 -16 20 287 48 16 16 -22 188 -178 -40
4026 -40 -2 -57 27 3 52 198 -173 -176 30 187 57 -122 45 111 -5 -269 146 16 -36 -111 -146 -66 109 158 101
$$ [...]
8191H6
##END NTUPLES=NMR FID
##END=
