##TITLE=1H_SR166_k
 DMSO-d6
 8 sc, 
 21.2.2023
##JCAMPDX= 6.0         $$ Bruker NMR JCAMP-DX V2.0
##DATA TYPE= NMR FID
##DATA CLASS= NTUPLES
##ORIGIN= UXNMR, Bruker Analytische Messtechnik GmbH
##OWNER= root
$$ XWIN-NMR		Version 3.5
$$ Tue Feb 21 18:18:04 2023 Russian Standard Time (UT+4h)  she@DPX200
##.OBSERVE FREQUENCY= 200.13135
##.OBSERVE NUCLEUS= ^1H
##.DELAY= (6, 6)
##.ACQUISITION MODE= SIMULTANEOUS
##.ACQUISITION SCHEME= undefined
##.AVERAGES= 8
##.DIGITISER RES= 18
##SPECTROMETER/DATA SYSTEM= spect
##.PULSE SEQUENCE= zg30
##.SOLVENT NAME= DMSO
##.SHIFT REFERENCE= (INTERNAL, DMSO, 0, 15.7039)
##AUDIT TRAIL= $$ (NUMBER, WHEN, WHO, WHERE, WHAT)
$$ ##TITLE= Audit trail, XWIN-NMR		Version 3.5
$$ ##JCAMPDX= 5.01
$$ ##ORIGIN= Bruker BioSpin GmbH
$$ ##OWNER= she
$$ F:/spectra/data/she/nmr/H-F/1/audita.txt
$$ ##AUDIT TRAIL=  $$ (NUMBER, WHEN, WHO, WHERE, WHAT)
(   1,<2023-02-21 18:17:10.42 +0400>,<she>,<DPX200>,
      <created by zg, POWCHK disabled, PULCHK disabled
       configuration hash MD5:
       00 E9 B6 7A A2 85 ED C7 34 08 36 98 17 FE 4E 26
       data hash MD5: 16K
       F8 51 67 95 7E 28 1B 2E 14 2B ED 32 FE 81 8D 3C>)
$$ ##END=
$$ 
$$ hash MD5
$$ 43 61 A3 1F 3D B1 B7 95 55 1B BC 82 B1 02 89 7B
##$RELAX= 
##$RELAX= 
##$RELAX= 
##$RELAX= 
##$RELAX= 
##$RELAX= 
$$ Bruker specific parameters
$$ --------------------------
##$DU= <F:/spectra>
##$EXPNO= 1
##$NAME= <H-F>
##$PROCNO= 1
##$TYPE= <nmr>
##$USER= <she>
##$AMP= (0..31)
100 100 100 100 100 100 100 100 100 100 100 100 100 100 100 100 100 100 
100 100 100 100 100 100 100 100 100 100 100 100 100 100 
##$AQSEQ= 0
##$AQ_mod= 1
##$AUNM= <au_zg>
##$AUTOPOS= <>
##$BF1= 200.13
##$BF2= 200.13
##$BF3= 200.13
##$BF4= 200.13
##$BF5= 200.13
##$BF6= 200.13
##$BF7= 200.13
##$BF8= 200.13
##$BYTORDA= 1
##$CFDGTYP= 0
##$CFRGTYP= 5
##$CHEMSTR= <none>
##$CNST= (0..31)
1 1 145 1 1 1 1 1 1 1 1 1 1 1 1 1 1 1 1 1 1 1 1 1 1 1 1 1 1 1 1 1 
##$CPDPRG= <>
##$CPDPRG1= <>
##$CPDPRG2= <>
##$CPDPRG3= <>
##$CPDPRG4= <mlev>
##$CPDPRG5= <mlev>
##$CPDPRG6= <mlev>
##$CPDPRG7= <mlev>
##$CPDPRG8= <mlev>
##$CPDPRGB= <>
##$CPDPRGT= <>
##$D= (0..31)
0 1.2 0 0 0 0 0 0 0 0.06 0 0.03 0 0 0 0 0.0002 0 0 0 0 0 0 0 0 0 0 0 0 
0 0 0 
##$DATE= 1676989029
##$DBL= (0..7)
120 120 120 120 120 120 120 120 
##$DBP= (0..7)
150 150 150 150 150 150 150 150 
##$DBP07= 0
##$DBPNAM0= <>
##$DBPNAM1= <>
##$DBPNAM2= <>
##$DBPNAM3= <>
##$DBPNAM4= <>
##$DBPNAM5= <>
##$DBPNAM6= <>
##$DBPNAM7= <>
##$DBPOAL= (0..7)
0.5 0.5 0.5 0.5 0.5 0.5 0.5 0.5 
##$DBPOFFS= (0..7)
0 0 0 0 0 0 0 0 
##$DE= 6
##$DECBNUC= <off>
##$DECIM= 32
##$DECNUC= <off>
##$DECSTAT= 4
##$DIGMOD= 1
##$DIGTYP= 9
##$DL= (0..7)
0 120 120 120 120 120 120 120 
##$DP= (0..7)
150 150 150 150 150 150 150 150 
##$DP07= 0
##$DPNAME0= <>
##$DPNAME1= <>
##$DPNAME2= <>
##$DPNAME3= <>
##$DPNAME4= <>
##$DPNAME5= <>
##$DPNAME6= <>
##$DPNAME7= <>
##$DPOAL= (0..7)
0.5 0.5 0.5 0.5 0.5 0.5 0.5 0.5 
##$DPOFFS= (0..7)
0 0 0 0 0 0 0 0 
##$DQDMODE= 0
##$DR= 18
##$DS= 0
##$DSLIST= <SSSSSSSSSSSSSSS>
$$ [...]
##$SUBNAM2= <"">
##$SUBNAM3= <"">
##$SUBNAM4= <"">
##$SUBNAM5= <"">
##$SUBNAM6= <"">
##$SUBNAM7= <"">
##$SUBNAM8= <"">
##$SUBNAM9= <"">
##$SW= 18.05172834244
##$SWIBOX= (0..15)
0 0 2 0 0 0 0 0 0 0 0 0 0 0 0 0 
##$SW_h= 3612.71676300578
##$TD= 16384
##$TD0= 1
##$TE= 0
##$TE2= 300
##$TE3= 300
##$TEG= 300
##$TL= (0..7)
0 120 120 120 120 120 120 120 
##$TP= (0..7)
150 150 150 150 150 150 150 150 
##$TP07= 0
##$TPNAME0= <>
##$TPNAME1= <>
##$TPNAME2= <>
##$TPNAME3= <>
##$TPNAME4= <>
##$TPNAME5= <>
##$TPNAME6= <>
##$TPNAME7= <>
##$TPOAL= (0..7)
0.5 0.5 0.5 0.5 0.5 0.5 0.5 0.5 
##$TPOFFS= (0..7)
0 0 0 0 0 0 0 0 
##$TUNHIN= 0
##$TUNHOUT= 0
##$TUNXOUT= 0
##$USERA1= <user>
##$USERA2= <user>
##$USERA3= <user>
##$USERA4= <user>
##$USERA5= <user>
##$V9= 5
##$VALIST= <valist>
##$VCLIST= <CCCCCCCCCCCCCCC>
##$VD= 0
##$VDLIST= <DDDDDDDDDDDDDDD>
##$VPLIST= <PPPPPPPPPPPPPPP>
##$VTLIST= <TTTTTTTTTTTTTTT>
##$WBST= 1024
##$WBSW= 4
##$XGAIN= (0..3)
0 0 0 0 
##$XL= 0
##$YL= 0
##$YMAX_a= 158778
##$YMIN_a= -188199
##$ZGOPTNS= <>
##$ZL1= 120
##$ZL2= 120
##$ZL3= 120
##$ZL4= 120
##$ABSF1= 10
##$ABSF2= 0
##$ABSG= 5
##$ABSL= 3
##$ALPHA= 0
##$AQORDER= 0
##$ASSFAC= 0
##$ASSFACI= 0
##$ASSFACX= 0
##$ASSWID= 0
##$AUNMP= <proc_1d>
##$AZFE= 0.1
##$AZFW= 0.1
##$BCFW= 1
##$BC_mod= 2
##$BYTORDP= 1
##$COROFFS= 0
##$CY= 11.3945322036743
##$DATMOD= 1
##$DC= 2
##$DFILT= <>
##$DTYPP= 0
##$F1P= 2.36226072786647
##$F2P= -0.459571619588291
##$FCOR= 0.5
##$FTSIZE= 0
##$FT_mod= 4
##$GAMMA= 1
##$GB= 0.15
##$INTBC= 1
##$INTSCL= 1
##$ISEN= 128
##$LB= 0.24
##$LEV0= 0
##$LPBIN= 0
##$MAXI= 10000
##$MC2= 0
##$MEAN= 0
##$ME_mod= 0
##$MI= 1.114404
##$NCOEF= 0
##$NC_proc= 0
##$NLEV= 6
##$NOISF1= 3.799351
##$NOISF2= 2.8
##$NSP= 1
##$NTH_PI= 0
##$NZP= 0
##$OFFSET= 15.70392
##$PC= 1
##$PHC0= -19137.72
##$PHC1= 55.20076
##$PH_mod= 1
##$PKNL= yes
##$PPARMOD= 0
##$PSCAL= 0
##$PSIGN= 0
##$REVERSE= no
##$SF= 200.130013532006
##$SI= 16384
##$SIGF1= 3
##$SIGF2= 2
##$SINO= 400
##$SIOLD= 16384
##$SREGLST= <1H.CDCl3>
##$SSB= 0
##$STSI= 0
##$STSR= 0
##$SW_p= 3612.71676300578
##$SYMM= 0
##$S_DEV= 0
##$TDeff= 0
##$TDoff= 0
##$TI= <>
##$TILT= no
##$TM1= 0
##$TM2= 0
##$TOPLEV= 0
##$USERP1= <user>
##$USERP2= <user>
##$USERP3= <user>
##$USERP4= <user>
##$USERP5= <user>
##$WDW= 1
##$XDIM= 8192
##$YMAX_p= 0
##$YMIN_p= 0
$$ End of Bruker specific parameters
$$ ---------------------------------
##NTUPLES= NMR FID
##VAR_NAME=  TIME,          FID/REAL,        FID/IMAG
##SYMBOL=    X,             R,               I
##VAR_TYPE=  INDEPENDENT,   DEPENDENT,       DEPENDENT
##VAR_FORM=  AFFN,          ASDF,            ASDF
##VAR_DIM=   8192,          8192,            8192
##UNITS=     SECONDS,       ARBITRARY UNITS, ARBITRARY UNITS
##FACTOR=    0.0002768,     1,               1
##FIRST=     0,             0,               0
##LAST=      2.2672688,     0,               0
##MIN=       0,             -188199,         0
##MAX=       2.2672688,     158778,          0
$$ Real data points
##PAGE= N=1
##DATA TABLE= (X++(R..R)), XYDATA
$$ [...]
$$ plain form
1724 -112 183 68 -231 -17 -41 80 -40 -76 30 115 -12 -6 -34 166 -32 43 -109 36 131 -10 -86 -84 1 -103
1748 -103 -28 -185 8 83 136 49 -57 257 -100 34 -4 119 181 16 -165 -39 -9 150 150 91 58 -31 -73 -105 187
1773 187 218 50 74 165 165 67 -205 214 94 -59 -353 -92 -248 389 150 16 215 -274 -292 -114 -168 -82 111
1796 111 1 -19 36 -20 -13 -299 52 -75 32 225 8 -91 65 -219 102 -40 97 67 -117 276 111 148 127
1819 127 -46 -72 145 -91 30 -27 -22 5 221 -184 113 305 -134 -91 71 23 -185 21 23 37 -263 49 -21 97
1843 97 -154 92 91 88 9 34 37 -114 54 -77 233 17 -270 -86 27 -45 -140 14 -64 -199 14 -112 -79 -10 -71
1868 -71 -34 -175 32 136 98 63 -67 -230 -152 47 119 -52 35 39 267 -230 -162 114 -212 126 -172 423 -143
1891 -143 48 55 20 1 -113 131 147 128 -46 -1 -150 47 -96 -105 -46 -2 -191 -21 -197 -43 214 -76 -132 4
$$ packed form
1724a12K95j15k99K14k4J21j20l6J06Q5j27Ok8K00j98P5j52J45R5j41p6KQ5j04
1748a03P5j57J93P5N3q7j06L14l57J34l8J23O2j65j81J26L0J59%n9l3q9m2l2K92
1773A87L1j68K4R1%r8k72M19j20j53k94K61j56O37k39j34J99m89j8J78n4Q6J93
1796A11j10k0N5n6Pk86L51j27J07J93k17r9J56k84L21j42J37l0j84L93j65L7k1
1819A27j73k6K17k36J21n7NK7K16m05K97J92m39M3J62m8k08K06KJ4l00L12p0J18
1843I7k51K46jlp9K5Lj51J68j31L10k16k87J84J13p2r5J54p8j35K13j26L3O9o1
1868g1L7j41K07J04l8l5j30j63P8J99P2j71Q7MK28m97O8K76l26L38k98N95n66
1891a43J91Pl5j9j14K44J6j9j74M5j49J97j43rN9M4j89J70j76J54K57k90n6J36
$$ plain form
1915 4 -118 -20 -175 60 -145 -4 23 140 51 -46 8 -194 47 77 275 -14 227 63 -82 242 -284 -171 -200
1938 -200 -136 43 -19 -46 -163 -94 -56 -30 -118 153 -72 -252 20 -58 133 69 138 301 -101 131 76 -96 322 179
1962 179 157 151 317 -221 -29 -21 -26 -131 265 -55 -209 -167 18 -28 10 121 20 231 -27 129 -237 59 349
1985 349 213 -70 98 -140 12 35 -269 -102 122 144 -56 -33 188 430 -56 -199 158 -126 -32 22 -140 -3
2007 -3 216 -201 -173 220 86 3 -88 -284 -97 18 -240 -188 236 38 1 51 52 -21 51 63 43 -106 -18 -64 -50 37
2033 37 -44 -190 151 -155 -106 87 -256 -41 271 -145 -109 151 45 38 2 33 -187 -217 252 193 -40 340 0
2056 0 -116 -15 21 -32 4 204 2 -51 -129 -41 -201 -346 -183 38 78 176 57 211 174 260 -63 21 -61 67 120
2081 120 64 148 101 61 20 33 -323 143 238 -15 94 35 -37 -34 -82 -74 14 142 -166 100 -32 58 -4 -25 0 32 171
$$ packed form
1915Dj22R8j55K35k05J41K7J17q9r7N4k02K41L0J98k89K41j64j45L24n26J13k9
1938b00O4J79o2k7j17O9L8K6q8K71k25j80K72p8J91o4O9J63m02K32n5j72M18j43
1962A79k2oJ66n38J92Qnj05L96l20j54M2J85m6L8J11j01K11k58J56l66K96K90
1985C49j36k83J68k38J52K3l04J67K24K2k00K3K21K42m86j43L57k84R4N4j62J37
2007cK19m17K8L93j34q3r1j96J87J15k58N2M24j98l7N0Jp3P2J2k0j49Q8m6J4Q7
2033C7q1j46L41l06M9J93l43K15L12m16L6K60j06pl6L1k20l0M69n9k33L80l40
2056@j16J01L6n3L6K00k02n3p8Q8j60j45J63K21M0R8j19J54l7Q6l23Q4q2J28N3
2081A20n6Q4m7m0m1J3l56M66R5k53J09n9p2Lm8QQ8J28l08K66j32R0o2k1K5L2J39
$$ plain form
2108 171 49 -106 326 213 174 108 -61 21 36 -138 -28 15 -54 -167 -48 202 86 -82 -36 83 -207 -81
2130 -81 130 28 302 59 -145 6 77 240 99 43 121 -54 -11 -8 27 -27 -162 154 164 148 -44 -99 -13 91
2154 91 -10 -127 147 70 37 106 269 374 38 69 5 40 -22 129 96 44 38 168 -107 -114 187 365 191 -6 51
2179 51 -193 -197 62 -9 89 251 -120 -167 84 42 -202 216 -114 243 39 54 -137 -18 -7 -66 18 58 54 -216 -45
2204 -45 -52 -247 -146 -24 -78 113 47 106 161 -87 -187 48 -137 7 54 -45 -107 225 182 -57 104 43 3 71 169
2229 169 -106 -9 126 38 92 28 52 -114 -62 14 257 -30 -206 38 118 57 -84 -89 -129 12 -17 37 319 -166 70
2254 70 19 25 -94 -65 308 96 -129 -131 -32 -86 -2 116 289 29 -11 63 150 -64 -116 93 138 215 128 13 139 423
2280 423 -100 230 -293 287 104 81 33 -241 -31 115 351 -42 104 150 -42 -229 -239 -104 44 -338 -12
$$ packed form
2108A71j22j55M32j13l9o6j69Q2J5j74J10M3o9j13J19K50j16j68M6J19k90J26
2130h1K11j02K74k43k04J51P1J63j41n6P8j75M3LL5n4j35L16J0j6j92n5Q6J04
2154I1j01j17K74p7l3O9J63J05l36L1o4L5o2J51l3n2oJ30k75pL01J78j74j97N7
2179E1k44mK59p1R8J62l71m7K51m2k44M18l30L57k04J5j91J19J1n9Q4M0mk70J71
2204d5pj95J01J22n4J91o6N9N5k48j00K35j85J44M7r9o2L32m3k39J61o1m0O8R8
2229A69k75R7J35q8N4o4K4j66N2P6K43k87j76K44Q0o1j41nm0J41k9N4K82m85K36
2254G0n1Oj19K9L73k12k25kR9n4Q4J18J73k60m0P4Q7k14n2K09M5P7q7j15J26K84
2280D23n23L30n23N80j83k3m8k74K10J46K36l93J46M6j92j87j0J35J48l82L26
$$ plain form
2301 -12 89 66 122 29 -249 -38 58 -65 -10 -73 313 79 -112 22 155 56 137 179 -26 -106 220 16 -39 -140
2325 -140 134 -102 2 -99 -107 -265 -222 0 224 106 -127 -65 40 64 60 18 23 218 80 -136 33 -132 18
2348 18 -179 230 35 -76 43 164 1 -163 305 263 -129 15 -442 128 -189 109 7 -3 164 -219 144
2369 144 64 119 -83 -109 -164 -111 116 -95 -101 37 43 91 -149 171 147 113 124 -97 -114 20 149 -76 11 103 217
2394 217 95 173 152 -165 -123 124 -35 -26 -174 -59 -38 55 -91 -52 119 17 129 -63 106 180 -127 125 66
2417 66 166 -194 -151 104 -146 108 55 -189 -186 -190 142 -87 119 -133 103 -3 -62 -87 83 141 15 -82 -21 -31
2441 -31 84 -211 159 159 -157 -92 130 -167 130 -130 31 36 -14 27 98 34 -100 -300 -105 251 143 -211 68
2464 68 -27 16 -28 171 74 136 -338 -99 151 50 -40 -133 288 213 -90 131 -12 49 56 155 177 -261 147 39 171
$$ packed form
2301a2J01k3N6r3k78K11R6j23N5o3L86k34j91J34J33r9Q1M2k05q0L26k04n5j01
2325a40K74k36J04j01qj58M3K22K24j18k33O2J05K4mm2NJ95j38k16J69j65J50
2348A8j97M09j95j11J19J21j63j64M68m2l92J44m57N70l17K98j02j0J67l83L63
2369A44q0N5k02k6n5N3K27k11oJ38OM8k40L20k4l4J1k21j7J34J29k25Q7R2J14
2394B17j22P8k1l17M2K47j59Rj48J15K1R3j46L9J71j02J12j92J69P4l07K52n9
2417F6J00l60M3K55k50K54n3k44LmL32k29K06k52K36j06n9k5J70N8j26r7O1j0
2441c1J15k95L70%l16O5K22k97K97k60J61Nn0M1P1o4j34k00J95L56j08l54K79
2464F8r5M3m4J99r7O2m74K39K50j01r0r3M21p5l03K21j43O1PR9K2m38M08j08J32
$$ plain form
2489 171 -142 11 182 -186 1 86 -205 -74 -53 69 -111 -94 165 -80 -90 -1 217 -40 -95 153 92 -43
2511 -43 -15 247 -20 -135 219 -143 15 139 51 86 -117 99 -190 -152 141 129 -124 -10 -4 84 -228 204 -143
2534 -143 -131 -26 11 48 -106 -142 -19 177 55 -34 -68 190 13 -15 -294 -26 -231 -10 215 -98 -212 192
2556 192 123 18 -25 35 112 -90 -2 103 -97 94 32 8 339 165 -201 278 190 162 235 -27 57 133 -20 137
2580 137 242 46 105 -154 126 14 211 -10 120 -224 4 136 178 -123 27 -50 -100 -79 -29 99 72 -119
2602 -119 -221 75 -160 -21 21 29 -10 115 136 -289 247 -107 117 211 -68 -47 -89 14 88 20 49 -25 1 -51 43
2627 43 86 -20 127 -183 -217 130 147 -32 71 190 -362 -179 144 66 -122 39 -44 -45 -18 214 72 -30 100
2650 100 -123 66 23 -96 15 -48 -198 114 -21 221 100 99 -23 26 130 -12 58 305 -30 34 228 169 -37
$$ packed form
2489A71l13J53J71l68J87Q5k91J31K1J22j80J7K59k45j0Q9K18k57n5K48o1j35
2511d3K8K62k67j15L54l62J58J24q8L5k03K16k89L8K93j2k53J14OQ8l12M32l47
2534a43J2J05L7L7j54l6J23J96j22q9l4K58j77k8k79K68k05K21K25l13j14M04
2556A92o9j05m3O0P7k02Q8J05k00J91o2k4L31j74l66M79q8k8P3k62Q4P6j53J57
2580A37J05j96N9k59K80j12J97k21J30l44K28J32M2l01J50p7n0K1N0J28k7j91
2602a19j02K96k35J39M2Ql9J25K1m25N36l54K24R4k79K1m2J03P4o8K9p4K6n2R4
2627D3M3j06J47l10l4L47J7j79J03J19n52J83L23p8j88J61q3jK7K32j42j02J30
2650A00k23J89m3j19J11o3j50L12j35K42j21jj22M9J04j42P0K47l35O4J94n9k06
$$ plain form
2673 -37 28 -23 -175 113 84 105 37 55 -193 88 -18 -113 27 85 -37 -163 73 -42 37 -43 170 -14 -147 -227
2697 -227 -61 -72 -21 26 -39 -356 42 27 114 72 90 39 -7 112 125 151 33 -92 -16 42 -7 5 47 195 208 49
2723 49 -252 -26 -48 158 -39 122 109 305 -25 -76 88 -69 -181 256 89 -182 213 115 126 -18 53 -198
2745 -198 -31 -63 -176 -231 -12 33 97 -23 4 164 -17 144 21 99 137 -189 -274 -203 -265 137 -23 -6 -34 79
2769 79 330 3 15 -136 64 -47 -106 20 107 -105 167 296 234 106 -112 -100 141 307 -60 284 157 44
2791 44 -91 157 31 -120 -30 -120 52 -13 11 -15 268 -58 248 -103 -393 6 -216 100 100 -52 14 201 75
2814 75 -67 -91 38 -57 254 132 -254 -38 112 -26 -61 6 166 -1 -205 -61 91 235 -140 -78 30 82
2836 82 0 -134 75 143 1 -75 -44 208 218 -39 50 -141 41 -101 138 -65 112 63 368 -90 -107 -108 10 396
$$ packed form
2673c7O5n1j52K88k9K1o8J8k48K81j06r5J40N8j22j26K36j15P9q0K13j84j33q0
2697b27J66j1N1M7o5l17L98j5Q7m2J8n1m6J19J3K6j18j25P6N8m9J2M2J48J3j59
2723D9l01K26k2K06j97J61j3J96l30n1J64j57j12M37j67k71L95r8J1j44P1k51
2745a98J67l2j13n5K19M5O4j20K7J60j81J61j23P8L8l26q5P1o2M02j60J7k8J13
2769G9K51l27J2j51K00j11n9J26Q7k12K72J29o2j28k18J2K41J66l67L44j27j13
2791D4j35K48j26j51R0r0J72o5K4k6K83l26L06l51k90L99k22L16%j52O6J87j26
2814G5j42k4J29r5L11j22l86K16J50j38l5O7J60j67k04J44J52J44l75O2J08N2
2836H2q2j34K09O8j42p6L1K52J0k57Q9j91J82j42K39k03J77m9L05m58j7jJ18L86
$$ plain form
2860 396 -196 89 -118 -52 -121 107 -168 104 -226 -222 -87 -59 -145 271 -33 17 -158 -248 -11 -165 38 -76 -15
2883 -15 109 25 -39 318 187 -187 -155 252 110 -225 237 -160 67 -160 147 -238 -167 -82 199 131 -56 76
2905 76 -67 -108 -43 -193 -51 47 85 -80 104 -108 -77 67 -141 173 63 77 201 44 -157 197 158 125 -163
2928 -163 -20 -74 252 -169 -55 -134 -133 -5 119 101 -187 -143 -73 183 173 -2 -61 -147 -59 10 46 -130 -16 -197
2952 -197 -7 189 12 38 -134 224 -7 -112 -114 145 140 9 -100 63 6 -203 -167 58 -36 -82 46 38 179 -94
2976 -94 202 -236 152 -68 -154 -93 37 184 229 -227 9 47 4 -187 22 173 -72 -142 123 -77 -80 -255 -5
2999 -5 256 95 -118 188 -124 -150 -16 47 -111 -61 107 -275 -4 161 95 -88 29 37 224 -132 -58 69 -182
3022 -182 16 150 301 179 -156 -16 159 -146 -29 75 -30 -67 46 203 -211 -74 -19 -71 -49 65 57 -29
$$ packed form
2860C96n92K85k07O6o9K28k75K72l30MJ35K8q6M16l04N0j75r0K37j54K03j14O1
2883a5J24q4o4L57j31l74L2M07j42l35M62l97K27k27L07l85P1Q5K81o8j87J32
2905G6j43m1O5j50J42R8L8j65J84k12L1J44k08L14j10J4J24j57k01L54l9l3k88
2928a63J43n4L26m21J14p9JJ28J24j8k88M4P0K56j0j75n9q6Q8O9L6j76J14j81
2952a97J90J96j77K6j72L58k31j05kK59nj31j09J63n7k09L6K25r4m6J28qJ41k73
2976i4K96m38L88k20q6O1J30J47M5m56K36L8m3j91K09J51k45p0K65k00lj75K50
2999eK61j61k13L06l12k6J34O3j58N0J68l82K71J65o6j83J17QJ87l56P4J27k51
3022a82J98J34J51j22l35J40J75l05J17J04j05l7J13J57m14J37N5n2K2J14qq6
$$ plain form
3044 -29 259 -212 122 -49 -14 93 -127 -115 29 -26 -37 -52 78 92 -251 145 -175 -29 -150 -40 -63 -174 -123
3067 -123 -196 41 -11 32 121 66 -192 101 89 -28 135 95 -93 -287 -85 -135 203 10 -43 -44 84 179 55 231
3091 231 225 107 -23 276 29 -210 62 -11 110 43 87 17 -34 -59 126 -170 -89 -213 85 20 52 119 -42 -26
3115 -26 189 12 166 31 -20 -69 -184 47 -230 -4 29 81 87 -144 -127 -102 -100 -389 -128 -17 39 92 -132 39
3139 39 -93 -77 -167 204 -102 87 -151 112 -102 5 217 -103 142 143 -201 -202 -85 232 -2 50 -42 -28 103
3162 103 129 -182 -50 -121 -106 374 -34 -73 172 140 -164 -62 -112 173 14 29 16 124 -40 -147 -140 12 -88
3185 -88 75 15 -8 -48 132 82 -56 33 78 -75 239 -96 -32 230 -65 54 -278 70 50 205 -1 227 213
3208 213 -103 9 -73 -105 105 54 -51 32 66 4 177 -68 123 144 -186 232 184 225 -147 -43 -12 59 -210 56
$$ packed form
3044b9K88m71L34j71L5J07k20J2J44n5j1j5J30J4l43L96l20J46j21J10k3j11N1
3067a23p3K37n2M3Q9n5k58K93j2j17J63m0j88j94K02n0L38j93n3jJ28R5j24J76
3091B31oj18j30K99k47k39K72p3J21o7M4p0n1k5J85k96Q1j24K98o5L2O7j61J6
3115b6K15j77J54j35n1m9j15K31k77K26L3N2Ok31J7K5Kk89K61J11N6N3k24J71
3139C9j32J6r0L71l06J89k38K63k14J07K12l20K45Jl44jJ17L17k34N2r2J4J31
3162A03K6l11J32p1J5M80m08l9K45l2l04J02n0K85j59J5j3J08j64j07PJ52j00
3185h8J63o0k3m0J80n0j38Q9M5j53L14l35O4K62k95J19l32L48k0J55k06K28j4
3208B13l16J12q2l2K10n1j05Q3L4o2J73k45J91K1l30M18m8M1l72J04L1P1k69K66
$$ plain form
3232 56 163 -203 -288 112 -219 217 31 69 -5 -80 185 72 -132 46 -191 109 109 112 -112 47 -72 62 -61
3255 -61 22 82 -102 -67 -81 110 -62 -41 114 -108 16 -7 5 33 -19 83 -48 -238 25 102 69 -53 -150 -81 168
3280 168 87 148 -79 -227 -5 191 -320 -177 -234 23 -22 133 174 -206 -21 11 133 -175 -319 30 62 -194
3302 -194 -260 -123 -117 -138 -158 18 21 42 -90 -6 -136 -115 -299 -34 4 86 15 104 -34 200 103 119 132 -266 35 -17
3328 -17 -91 30 51 87 -99 57 -115 -140 -26 -3 42 -29 -87 207 121 -79 122 51 -65 91 -261 132 12 -54
3352 -54 -55 -325 4 -312 -3 327 164 -50 58 -28 128 -23 -141 12 354 -119 -91 128 -111 -37 -105 -39 -30
3375 -30 36 61 60 -265 86 157 -23 -261 -72 -204 -216 -92 124 -161 1 11 -16 -77 -113 -62 97 67 -92 141
3399 141 131 17 -110 -117 2 -156 90 63 95 88 -98 363 14 289 -75 22 96 203 124 85 -54 2 113 67
$$ packed form
3232E6J07l66q5M00l31M36j86L8p4p5K65j13k04J78k37L00%Lk24J59j19J34j23
3255f1Q3O0j84L5j4J91j72K1J55k22J24k3J2K8n2J02j31j90K63P7l3j22r7O9K49
3280A68q1O1k27j48K22J96n11J43n7K57m5J55M1l80J85L2J22l08j44L49L2k56
3302a94o6J37Ok1k0J76LK1j32Q4j30K1j84K65L8Q2p1Q9j38K34r7J6J3l98L01n2
3328a7p4J21K1L6j86J56j72k5J14K3M5p1n8K94q6k00K01p1j16J56l52L93j20o6
3352e4jk70L29l16L09L30j63k14J08q6J56j51j18J53L42m73K8K19k39P4o8O6R
3375c0O6K5jl25L51P1j80k38J89j32j2J24K16k85J62J0k7o1l6N1J59l0j59K33
3399A41j0j14j27pJ19j58K46k7L2pj86M61l49K75l64R7P4J07p9l9j39N6J11m6
$$ plain form
3423 67 -74 30 292 27 -203 54 357 78 8 71 99 113 361 221 114 -65 188 162 -15 66 -99 -156 -136
3446 -136 -155 48 -77 -68 50 80 -8 68 117 171 27 -104 5 -89 -23 107 -42 -51 190 67 120 99 150 113 -62
3471 -62 35 -44 -93 32 -251 15 -42 -33 -143 -198 26 -68 -35 -1 -252 -88 -55 -135 -350 165 134 -1 -7 56 -9 -227
3497 -227 -91 155 51 81 -260 14 11 -3 25 -200 -59 -106 -114 187 107 -114 -27 49 -110 -5 -141 121 -106 31
3521 31 61 15 108 33 -33 -147 -220 -143 73 -6 -277 -99 -86 94 10 -16 -1 112 -180 103 57 259 129 -180 -78
3546 -78 -98 -61 45 170 10 -14 -204 -66 148 39 92 123 70 -210 54 -143 -10 148 185 25 321 11 -212
3569 -212 -58 -157 -203 -12 24 -100 -121 -56 -49 265 96 5 -86 118 203 55 53 82 -14 1 -69 -194 -51 62 -43
3594 -43 -1 253 11 156 141 67 -76 -202 16 176 -42 -62 -17 -34 -71 -63 285 57 11 -232 141 158 139 55 134
$$ packed form
3423F7j41J04K62k65k30K57L03k79p0O3K8J4K48j40j07j79K53k6j77Q1j65n7K0
3446a36j9K03j25RJ18L0q8P6M9N4j44j31J09r4O6J30j49rK41j23N3k1N1l7j75
3471f2R7p9m9J25k83K66n7Rj10n5K24r4L3L4k51J64L3q0k15N15l1j35oO3o5k18
3497b27J36K46j04L0l41K74lj4K8k25J41m7qL01q0k21Q7P6j59J05j36K62k27J37
3521C1L0m6R3p5o6j14p3P7K16p9k71J78J3J80q4k6J5J13k92K83m6K02j30l09J02
3546g8k0L7J06J25j60k4j90J38K14j09N3L1n3k80K64j97J33J58L7j60K96l10k23
3569b12J54r9m6J91L6j24k1O5PL14j69r1r1K04Q5j48kK9r6J5p0j25J43J13j05
3594d3M2K54k42J45j5p4j43j26K18J60k18k0M5j7l7QL48k28m6k43L73J7j9q4P9
$$ plain form
3619 134 -68 -122 -145 -23 -109 33 41 -19 -34 -297 9 -176 114 -29 -50 240 74 66 294 -102 65 18 -37 87
3643 87 50 109 -66 -87 130 163 -16 -22 -221 -103 130 34 30 -22 329 -180 28 64 25 -162 123 -2 81 127 99
3668 99 -196 -44 -51 -85 36 158 241 -141 333 112 110 184 193 -295 -14 -204 325 75 -253 320 158 283 12
3691 12 -98 100 -13 3 -54 -93 105 -39 36 -103 -14 166 -66 -326 265 162 11 -205 -110 -101 15 75 -23 95
3715 95 -18 116 -6 47 -65 -96 -98 -8 11 -416 -190 -136 -86 105 74 306 102 -85 0 -66 -77 -14 57 1 35 60
3741 60 -89 409 129 -6 -130 -26 117 104 50 -307 -66 -136 83 150 169 -120 -39 -139 -117 0 304 148 33
3764 33 4 22 20 -57 -73 -11 -108 -235 33 -32 116 -103 -115 185 189 -203 -167 -8 -254 115 83 52 -34 -238 60 -42
3790 -42 28 6 -53 56 16 51 -33 47 -13 151 -226 134 -83 45 -83 -41 -175 -187 170 288 10 -33 -52 119
$$ packed form
3619A34k02n4k3J22q6J42Qo0j5k63L06j85K90j43k1K90j66qK28l96J67m7n5J24
3643H7l7N9j75k1K17L3j79oj99J18K33r6mn2L51n09K08L6l9j87K85j25Q3M6k8
3668I9k95J52pl4J21J22Q3l82M74k21kP4Rm88K81j90N29k50l28N73j62J25k71
3691A2j10J98j13J6n7l9J98j44P5j39Q9J80k32k60N91j03j51k16R5RJ16O0r8J18
3715I5j13J34j22N3j12l1kR0J9m27K26N4N0J91l1K32k04j87Q5o6j1O3P1n6L4K5
3741F0j49M98k80j35j24J04J43j3n4l57K41p0K19O7J9k89Q1j00K2J17L04j56j15
3764C3k9J8kp7j6O2r7j27K68o5J48k19j2L00Ml92L6J59k46L69l2l1q6k04K98j02
3790d2P0k2n9J09m0L5q4Q0o0J64l77L60k17J28j28M2j34j2L57J18k78m3j9J71
$$ plain form
3814 119 105 -225 -310 40 74 85 -96 34 -4 133 67 176 -162 -224 -111 -115 -132 44 49 -182 78 22 37 -83 -130
3839 -130 -271 -169 80 -53 205 25 -187 34 68 193 84 -182 1 -63 -363 -86 223 -148 -104 -128 18
3860 18 218 142 41 -154 65 5 -172 -184 107 45 43 149 -97 -69 -59 -18 162 86 -4 -36 113 149 -200 -9 129
3885 129 76 -76 -88 -148 70 -29 -195 -280 159 -67 -258 -92 47 -7 52 -5 -71 63 -6 197 -67 -197 -33
3908 -33 35 75 49 359 243 60 99 -94 38 -131 133 -107 -206 101 112 119 163 253 -142 301 -35 159 30 -15
3932 -15 208 -201 86 -128 -152 -57 -65 151 38 -65 -104 92 -4 -42 -78 110 201 -62 0 4 30 74 117 -121 76
3957 76 55 22 -39 -90 178 189 120 32 161 -144 0 -32 -152 -9 32 205 -90 -87 177 -221 -194 159 -149 -147 127
3982 127 106 58 -43 87 -242 -80 253 68 -18 56 36 62 43 138 49 81 132 123 222 157 96 -48 42 291 -119 -186
$$ packed form
3814A19j4l30q5L50L4J1j81J30l8J37o6J09l38o2J13mj7J76Nk31K60n6J5j20m7
3839a30j41J02K49j33K58j80k12K21L4J25j09k66J83o4l00K77L09l71M4k4J46
3860A8K00p6j01j95K19o0j77j2K91o2kJ06k46K8J0M1J80p6r0l2J49L6l49J91J38
3885A29n3j52j2o0K18r9j66q5M39k26j91J66J39n4N9n7o6J34o9K03k64j30J64
3908c3O8M0k6L10j16j83L9j93J32j69K64k40r9L07J1PM4R0l95M43l36J94j29m5
3932a5K23m09K87k14k4R5qK16j13j03l9J96r6l8l6J88R1k63O2MK6M4M3k38J97
3957G6k1l3o1n1K68J1o9q8J29l05J44l2j20J43M1J73k95LK64l98K7L53l08KK74
3982A27k1m8j01J30l29J62L33j85q6P4k0K6j9R5q9L2N1rR9o5o1j44R0K49m10o7
$$ plain form
4008 -186 -130 88 -105 137 -6 -96 12 -35 18 157 -119 -64 9 -42 36 -120 35 -143 188 -164 -55 -47 2 114
4032 114 30 23 -79 22 51 39 -32 30 36 44 166 -36 -28 -41 -25 172 -67 1 109 -25 -15 -203 7 53 137 -61
4058 -61 -107 -82 88 194 115 89 51 284 -88 43 116 63 -93 -209 -92 -75 -148 300 190 -15 231 -83 -144 -40
4082 -40 189 -195 -164 41 43 35 -61 -54 -139 66 34 -170 -337 -83 24 37 -181 -58 -155 25 -21 272 172 -104 9
4107 9 -216 72 209 -28 115 90 30 82 43 24 -219 179 15 26 -66 7 -57 36 86 216 -125 -79 230 -254 -95
4132 -95 67 -49 -22 294 80 133 50 -2 -299 -66 100 -152 -183 39 207 147 -187 122 -15 65 -109 -65 59
4155 59 -149 -103 -47 -139 220 111 22 13 -75 -80 -110 64 46 -263 -160 191 27 58 29 101 51 26 29 -131 68 108 211
4182 211 -179 -247 369 -6 96 247 -104 51 -4 -118 225 101 -58 -46 -281 -42 207 60 31 137 -5
$$ packed form
4008a86N6K18j93K42j43r0J08m7N3J39k76N5P3n1P8j56J55j78L31l52J09QM9J12
4032A14q4pj02J01K9j2p1O2OQJ22k02Qj3J6J97k39O8J08j34J0j88K10M6Q4j98
4058f1m6K5J70J06p9k6l8K33l72J31P3n3j56j16J17J7p3M48j10k05K46l14o1J04
4082d0K29l84L1K05Kqr6Pq5K05l2k04j67K54J07J3k18J23r7J80m6K93j00k76J13
4107Ik25K88J37k37J43k5o0N2l9j9k43L98j64J1r2P3o4R3N0J30l41M6L09m84J59
4132i5J62j16K7L16k14N3q3n2k97K33J66k52l1K22J68o0l34L09j37Q0j74M4J24
4155E9k08M6N6r2L59j09q9rq8nl0J74j8l09J03L51j64L1k9P2n0k5Lj60J99M0J03
4182B11l90o8O16l75J02J51l51J55n5j14L43j24j59J2k35K39K49j47k9J06j42
$$ plain form
4203 -5 -162 44 -101 -56 -194 244 -9 45 -34 -36 -228 -233 255 -14 22 177 278 150 67 47 15 109 -33 -41 -27 37
4229 37 -4 -61 41 -101 -69 -4 -80 -61 24 96 20 172 146 12 -136 -175 -60 -106 60 92 -202 -64 -84 -87 136 -98
4255 -98 -80 51 72 46 50 133 50 15 -22 -6 239 289 187 156 149 -119 153 234 108 20 -23 68 -39 -203 190 -42
4281 -42 108 -61 -33 -21 156 -94 -9 -202 102 22 -75 -139 102 33 -27 -196 -193 94 -249 191 -41 46 -25 196
4305 196 41 -148 61 190 -63 169 55 -73 45 121 40 99 158 50 -136 -155 -99 31 -52 127 -88 -40 -8
4328 -8 -96 126 57 87 161 84 239 -30 -130 -62 -18 -205 44 -176 -150 121 403 -189 117 26 68 483 279 26
4352 26 -230 220 135 -148 -27 81 -137 10 -80 143 -10 -17 -34 -24 -152 21 -73 110 -104 -159 3 -91 86
4375 86 -200 -198 19 -190 149 -60 85 -20 -8 78 -55 -53 483 -94 -45 -166 -60 -57 -97 67 -33 150 106 -321
$$ packed form
4203ej57K06j45M5j38M38k53N4p9kj92nM88k69L6J55J01j28q3k0l2R4j42qJ4O4
4229C7m1n7J02j42L2O5p6J9Q5P2p6J52k6j34j48l9J15m6J66L2k94J38k0lK23k34
4255i8J8J31K1k6MQ3q3l5l7J6K45N0j02l1pk68K72Q1j26q8m3R1j07j64L93k32
4281d2J50j69K8J2J77k50Q5j93L04q0r7o4K41o9o0j69LK87l43M40k32Q7p1K21
4305A96j55j89K09J29k53K32j14j28J18P6q1N9N9j08j86j9N6J30q3J79k15M8L2
4328hq8K22o9L0P4p7J55k69j00O8M4j87K49k20K6K71K82n92L06r1M2M15k04k53
4352B6k56M50q5k83J21J08k18J47r0K23j53pj7J0j28J73r4J83k14n5J62r4J77
4375H6k86KK17k09L39k09J45j05J2Q6j33KN36n77M9j21J06Lm0J64j00J83m4m27
$$ plain form
4399 -321 -25 -111 124 286 13 -57 278 -152 23 112 -294 30 -203 -17 -117 184 239 20 122 41 112 -110
4421 -110 -29 15 29 45 179 -37 -10 40 -68 92 -251 -59 133 -33 95 0 55 -10 148 -59 -69 8 64 -202
4445 -202 -86 223 -233 133 -38 102 -10 17 121 -111 192 -29 -371 -82 104 87 118 -252 -193 -70 286
4466 286 -298 -219 3 75 -100 23 174 159 19 11 47 -86 -31 -253 80 -75 -45 246 -26 -83 -87 -13 -149 -81
4490 -81 117 -23 76 15 -136 61 250 123 -125 87 58 77 -118 102 8 -224 87 146 126 129 -195 -117 262 -14
4514 -14 -28 -51 -69 -11 130 385 58 -173 101 107 -167 7 -221 217 -127 -186 54 -19 48 -25 83 -136 -78 171
4538 171 -6 -117 -49 -233 53 -158 10 -9 197 114 -55 -103 17 -164 -151 80 85 20 -49 45 -21 -67 -107 -33 -126
4563 -126 138 155 -54 0 165 -148 193 155 300 -20 -196 107 -78 -122 23 123 45 -31 296 112 14 35 -55
$$ packed form
4399c21K96q6K35J62k73p0L35m30J75Q9m06L24k33J86j00L01N5k19J02q1P1k22
4421a10Q1M4J4J6J34k16K7N0j08J60l43J92J92j66J28r5N5o5J58k07j0P7N6k66
4445b02J16L09m56L66j71J40j12K7J04k32L03k21l42K89J86j7L1l70N9J23L56
4466B86n84P9K22P2j75J23J51j5j40qL6j33N5k22L33j55L0K91k72n7mP4j36O8
4490h1J98j40R9o1j51J97J89j27k48K12k9J9j95K20r4k32L11N9k0Ll24P8L79k76
4514a4j4k3j8N8J41K55l27k31K74Ok74J74k28M38l44n9K40p3O7p3J08k19N8K49
4538A71j77j11O8j84K86k11J68j9K06q3j69m8J20j81J3K31No5o9R4o6m6m0P4r3
4563a26K64J7k09N4J65l13L41l8J45l20j76L03j85m4J45J00p8p6L27j84r8K1r0
$$ plain form
4586 -55 -43 28 -33 91 -111 10 130 60 17 -9 115 37 -148 -156 -159 -29 75 204 256 -7 -63 38 23 -98 52
4611 52 73 -33 70 111 -274 117 -153 -159 321 -121 86 108 18 -42 27 -74 188 3 76 -9 18 -22 -175 -140 -37
4636 -37 -142 -5 33 113 86 -90 -113 11 -52 25 7 170 -131 -225 -118 -236 212 -86 -82 -72 142 -168 157 77
4660 77 -150 220 -77 -57 31 115 -232 8 -6 -34 -93 74 -270 -106 54 -55 -23 -8 95 102 -295 39 49 -27
4684 -27 163 38 123 13 -6 37 -54 -29 -137 -26 -123 -160 -84 46 -111 3 -285 81 153 -183 132 -78 -206
4707 -206 70 60 91 87 -6 131 -127 67 92 38 -85 173 56 95 -97 200 70 90 31 -201 18 -141 -215 -169
4731 -169 61 128 -28 11 75 213 -71 -6 42 91 -130 -387 92 322 203 304 -156 133 18 149 -155 39
4753 39 216 -122 152 174 151 -141 46 16 175 3 -255 -21 99 189 -41 -2 56 -15 -133 -52 105 28 194
$$ packed form
4586e5J2P1o1J24k02J21J20p0m3k6J24p8j85qlJ30J04J29N2k63n6J01j5j21J50
4611E2K1j06J03M1l85L91k70oM80m42K07K2r0o0O9j01K62j85P3q5K7m0j53L5J03
4636c7j05J37L8Q0k7j76k3J24o3P7j8J63l01r4J07j18M48k98MJ0K14l10L25q0
4660G7k27L70k97K0Q8Q4l47K40j4k8n9J67l44J64J60j09L2J5J03Pl97L34J0p6
4684b7J90j25Q5j10j9M3r1K5j08J11r7l7P6J30j57J14k88L66P2l36L15k10j28
4707b06K76j0L1mr3J37k58J94K5n4j23K58j17L9j92K97j30K0n9k32K19j59p4M6
4731a69K30O7j56L9O4J38k84O5M8M9k21k57M79K30j19J01m60K89j15J31l04J94
4753C9J77l38K74K2k3k92J87l0J59j72k58K34J20R0k30L9N8p1j18Q1J57p7J66
$$ plain form
4776 194 -187 96 -39 -153 -116 80 123 -129 207 -61 19 10 -109 28 -116 -376 251 -41 87 109 -127 1
4798 1 85 179 120 99 -24 35 76 -150 110 167 92 -23 -143 -118 -42 -8 226 -125 22 67 -185 -27 -215 113 22
4823 22 193 274 -82 103 88 -150 -100 -209 -67 270 -16 91 185 113 58 -20 -110 272 -176 255 -14 -12 279 91
4847 91 -95 98 -17 -166 -66 -279 -160 -141 99 53 88 299 10 325 14 36 116 76 -279 -107 169 -64
4869 -64 125 -52 -46 -56 -48 -237 -105 -141 79 30 -128 195 13 -200 17 -36 153 86 -13 7 -154 57 131 60 -13
4894 -13 -2 -155 12 -7 -131 -6 104 218 221 257 287 -26 54 136 -31 -115 148 217 41 -26 59 9 -74 29 97
4919 97 -119 243 101 -80 -66 127 226 -185 -56 -32 -84 226 249 207 -94 181 88 193 -84 24 171 78 -35
4942 -35 20 122 -77 -110 -35 -105 -183 -60 -27 22 -101 61 -21 116 10 -293 101 -43 -16 168 -169 -154 -29 -16
$$ packed form
4776A94l81K83j35j14L7J96M3k52L36k68Q0rj19J37j44k60O27k92J28K2k36J28
4798AQ4R4n9k1j23N9M1k26K60N7p5j15j20K5P6L4K34l51J47M5k52J58j88L28r1
4823B2J71Q1l56J85j5k38N0j09J42L37k86J07R4p2n5p8r0L82m48M31k69KK91j88
4847I1j86J93j15j49J00k13J19J9K40m6L5K11k89L15l11K2Q0m0l55J72K76k33
4869f4J89j77Oj0Qj89J32l6K20m9j58L23j82k13K17n3J89o7r9K0j61K11P4p1p3
4894a3J1j53J67j9j24J25J10J14LL6L0l13Q0Q2j67q4K63O9j76o7Q5n0q3J03O8
4919I7k16L62j42j81J4J93R9m11J29K4n2L10K3m2l01K75r3J05k77J08J47r3j13
4942c5N5J02j99l3P5p0p8J23L3M9j23J62q2J37j06l03L94j44K7J84l37J5J25J3
$$ plain form
4966 -16 -22 75 13 15 -170 204 -77 -10 16 -27 -20 317 31 154 142 -316 -176 -139 -87 163 -126 157 128 135 166 -217
4992 -217 109 -123 137 27 157 223 -176 265 110 -189 -214 32 -66 43 241 -93 -66 -37 -116 70 323 150
5014 150 -170 244 57 66 -192 65 164 126 -26 -87 234 36 129 168 -81 -190 197 -166 135 177 -231 209 173
5037 173 -85 48 -117 -11 282 -32 65 280 -81 57 -229 373 -112 217 -82 -60 153 -175 249 -232 -160
5058 -160 172 -1 -247 151 -95 -48 -81 120 -21 -114 -133 -175 -39 -121 -55 -140 -220 215 -140 -138 83 -135 377 177
5082 177 -52 115 -133 215 114 -61 -6 6 196 -15 190 -14 -182 97 -256 -197 73 16 -106 77 93 -98
5104 -98 108 96 186 -84 -125 288 62 -156 -56 238 -61 -38 137 -20 -29 46 68 141 110 90 -211 -132 -205 -200 12
5129 12 -222 46 123 -31 110 -101 -84 178 40 -53 256 233 -15 -265 179 238 141 56 17 -26 -96 76 21 -101
$$ packed form
4966a6oR7o2Kj85L74k81O7K6m3PL37k86J23j2m58J40L7N2K50k89K83k9PL1l83
4992b17L26k32K60j10J30O6l99M41j55k99k5K46r8J09J98l34K7K9p9J86K53j73
5014A50l20M14j87Rk58K57R9l8j52o1L21j98R3L9k49j09L87l63L01M2m08M40l6
5037A73k58J33j65J06K93l14R7K15l61J38k86O02m85L29k99K2K13l28M24m81P2
5058a60L32j73k46L98k46M7l3K01j41r3j9m2J36q2O6q5q0M35l55KK21k18N12k00
5082A77k29J67k48L48j01j75N5J2J90k11K05k04j68K79l53N9K70n7j22J83J6j91
5104i8K06j2R0k70m1M13k26k18J00K94k99K3J75j57rP5K2P3l1k0l01P9p3NK12
5129A2k34K68P7j54J41k11J7K62j38r3L09k3k48k50M44N9r7q5l9m3p0J72n5j22
$$ plain form
5153 -101 -88 -119 134 321 -27 215 114 24 62 -101 -187 -21 -96 -18 -148 80 84 -2 -59 -129 -71 9 1 257 -349
5178 -349 323 135 131 -42 10 -121 -108 207 45 182 -188 -118 -109 -61 227 102 73 224 -180 -41 -125 -44 -141 29
5202 29 -216 -73 76 -261 286 -240 -140 27 -92 82 122 -63 209 -101 -165 178 -50 -185 10 -117 149
5223 149 51 -64 -26 11 -109 142 188 126 115 5 43 -86 -27 173 -5 95 76 -46 207 -14 27 -259 12
5246 12 -113 -74 99 -56 -165 170 -135 -162 -101 -209 60 15 -233 -101 124 -59 174 -362 61 -10 93 -10
5268 -10 -12 51 -102 34 -207 -64 -80 110 103 -111 -155 -19 -266 39 215 -242 110 -22 -10 0 -54 46 12 -53
5292 -53 -296 -41 -16 258 165 44 119 -35 139 -89 0 -191 2 -124 -303 54 -16 -33 7 113 53 116 -56
5315 -56 191 137 87 -59 196 68 -188 -94 -69 74 79 -119 126 -60 -145 -125 2 184 -55 -1 -84 112 -84 -206
$$ packed form
5153a01J3l1K53J87l48K42j01r0L8j63q6J66p5P8j30K28Mq6n7p0N8Q0qK56o06
5178c49O72j88mj73N2j31J3L15j62J37l70P0RM8K88j25k9J51m04J39q4Q1r7J70
5202B9k45J43J49l37N47n26J00J67j19J74M0j85K72l10o4L43k28j35J95j27K66
5223A49r8j15L8L7j20K51M6o2j1j10L8j29N9K00j78J00j9j22K53k21M1k86K71
5246A2j25L9J73j55j09L35l05k7O1j08K69m5k48J32K25j83K33n36M23p1J03j03
5268a0kO3j53J36k41J43j6J90pk14m4J36k47L05J76m57L52j32J2J0n4J00l4o5
5292e3k43K55K5K74r3j21P5j54J74k28Q9j91J93j26j79L57p0j7M0J06o0O3j72
5315e6K47n4n0j46K55j28k56R4K5J43Nj98K45j86q5K0J27J82k39N4q3J96j96j22
$$ plain form
5339 -206 69 -16 3 -129 31 -233 -54 -87 -24 -107 77 90 -200 -58 12 -169 44 -41 -175 -75 21 45 -518
5362 -518 -138 -115 38 191 -121 93 166 14 87 -16 165 6 242 137 148 71 43 -153 -38 -38 368 -83 90
5385 90 -147 149 195 -239 -101 -42 -158 -193 146 221 -25 -59 -171 184 -73 211 64 -228 -32 154 208 77
5407 77 152 1 -21 52 23 76 -200 215 157 113 60 -8 -116 168 -131 132 -195 127 -94 -263 92 181 -78 -78
5431 -78 95 163 -108 142 130 -311 39 82 -10 -267 106 -372 13 308 32 -56 44 -166 93 166 153 -81 10
5454 10 -280 95 -182 -111 -3 155 233 -135 -52 -170 -44 47 74 108 -106 -136 74 -18 -101 96 57 -106 -70 -101
5478 -101 249 278 -35 -72 108 71 -43 66 -282 -223 13 -42 27 -48 31 -123 205 14 175 -180 -84 80 189
5501 189 39 -115 -49 -52 -114 35 -100 -94 -59 -2 168 -55 109 146 74 -204 118 -21 -11 -105 -72 -94 -175 21 20 -79
$$ packed form
5339b06K75q5J9j32J60k64J79l3O3q3J84J3k90J42P0j81K13q5j34J00R6K4n63
5362e18L80K3J53J53l12K14P3j52P3j03J81j59K36j05J1p7k8j96J15%M06m51J73
5385I0k37K96M6m34J38N9j16l5L39P5k46l4j12L55k57K84j47k92J96J86N4j31
5407G7P5j51k2P3k9N3k76M15n8m4n3o8j08K84k99K63l27L22k21j69L55Q9k59%
5431g8J73O8k71K50j2m41L50M3r2k57L73m78L85K95k76q8J00k10K59P3j3k34R1
5454A0k90L75k77P1J08J58P8l68Q3j18J26R1K7L4k14l0K10r2q3J97l9j63L6l1
5478a01L50K9l13l7J80l7j14J09l48N9K36n5O9p5P9j54L28j91J61l55R6J64J09
5501A89j50j54O6lo2J49j35OL5N7J70k23J64L7p2k78L22j39J0r4L3k2q1J96jr9
$$ plain form
5527 -79 39 28 319 78 -300 165 -21 147 111 -46 155 -149 -14 28 259 81 -49 -33 168 -126 115 59
5549 59 -26 205 261 5 -166 -44 107 -136 -271 -45 162 30 -131 -103 210 -94 77 -155 -161 -53 14 -160
5571 -160 -117 219 -1 28 -189 -214 106 -32 8 -138 141 -3 14 -95 -71 53 -105 58 36 -186 186 184 -119
5594 -119 -45 95 143 31 7 -46 -113 47 -204 -35 42 98 -139 255 1 -206 -3 -46 84 -101 79 137 -211
5617 -211 -33 88 36 -335 -203 92 -12 -183 136 92 -77 -56 13 -363 30 -226 -33 -184 -88 173 9 -105
5639 -105 234 266 39 -37 -87 177 75 285 70 1 -107 74 4 -4 52 -186 97 29 -167 44 124 65 -134 143
5663 143 41 101 475 136 82 69 -18 41 -242 60 -12 -35 20 -47 -7 -129 16 -9 -271 -116 34 73 142 -340
5687 -340 175 -64 158 39 81 118 -49 -1 40 84 -81 50 -215 92 -52 -51 -82 212 -91 199 -324 -144 132
$$ packed form
5527g9J18j1K91k41l78M65j86J68l6j57K01l04J35M2K31j78j30J6K01k94K41n6
5549E9q5K31N6k56j71J22J51k43j35K26K07j32j61K8L13l04J71k32oJ08O7j74
5571a60M3L36k20K9k17k5L20j38M0j46K79j44J7j09K4J24j58J63k2k22L72kl03
5594a19P4J40M8j12k4n3o7J60k51J69P7N6k37L94k54k07K03m3J30j85J80N8l48
5617b11J78J21n2l71J32K95j04j71L19m4j69K1O9l76L93k56J93j51R6K61j64j14
5639a05L39L2k27p6n0K64j02K10k15o9j08J81p0qN6k38K83o8j96K11Q0n9j99K77
5663A43j02O0L74l39n4j3q7N9k83L02p2k3N5o7M0j22J45k5k62J55J50L9O9m82
5687c40N15k39K22j19M2L7j67M8M1M4j65J31k65L07j44Jl1K94l03K90n23J80K76
$$ plain form
5710 132 -70 -74 -125 144 65 149 -29 113 12 -161 -210 -177 132 87 -37 -84 40 -146 18 44 136 -88 -137 48
5734 48 7 -63 -48 -84 -12 -188 -214 104 87 -163 -19 -38 -40 40 45 -53 210 93 -252 -100 -18 95 63 -153 47 -52
5760 -52 -102 -2 -134 74 42 245 205 38 65 218 -156 -114 -172 -162 -171 42 127 196 308 136 -214 -157 -51 -72 147
5785 147 95 140 127 -227 137 -83 -210 -64 139 -107 105 -70 -118 74 -78 -136 -122 102 107 -155 7 -42 78
5808 78 48 -271 -129 -34 -26 46 84 121 146 -36 86 -176 84 61 -66 -138 57 -89 -80 -201 194 64 161 310 49
5833 49 -73 -29 1 62 -142 -41 25 77 15 96 32 63 -57 101 -173 34 -76 -36 37 -83 152 31 112 -166
5857 -166 -74 140 -153 -61 61 229 -87 314 143 -15 175 53 -31 -197 -2 168 76 82 -24 49 16 -216 99
5880 99 14 -75 -28 -291 -33 -38 -31 104 90 21 -13 -85 -66 -195 203 -7 -115 -41 -301 -31 34 246 -40 19 -89
$$ packed form
5710A32k02mn1K69p9Q4j78J42j01j73m9L3L09m5j24m7J24j86J64K6R2k24m9J85
5734D8m1p0J5l6P2j76k6L18j7k50J44j9kQ0Nr8K63j17l45J52Q2J13l2k16K00r9
5760e2n0J00j32K08l2K03m0j67K7J53l74M2n8J0rK13Q5O9J12j72l50N7J06k1K19
5785A47n2M5j3l54L64k20j27J46K03k46K12j75m8J92j52n8J4K24Nk62J62m9J20
5808G8l0l19J42R5QP2L8L7K5j82J22k62K60k3j27p2J95j46Rj21L95j30R7J49k61
5833D9j22M4L0O1k04J01O6N2o2Q1o4L1j20J58k74K07j10M0P3j20K35j21Q1k78
5857a66R2K14k93R2J22J68l16M01j71j58J90j22q4j66J95J70r2Oj06P3l3k32L15
5880I9q5q9M7k63K58nPJ35j4o9l4p2J9j29L98k10j08P4k60K70O5K12k86N9j08
$$ plain form
5905 -89 41 -26 215 128 -35 -105 -65 22 16 140 -17 146 14 -104 -36 303 -211 28 114 20 21 -80 -101 227 32
5930 32 86 -66 -290 26 127 192 -181 -297 -251 -235 -101 -91 -92 26 34 -51 -158 206 -116 216 148 147 125 70 -132
5955 -132 84 -161 -99 -6 29 -14 10 -24 -156 -83 -80 141 9 129 -9 -278 -24 5 -22 -273 25 93 63 -31 72
5980 72 62 3 -60 -84 100 -49 -69 -65 -80 -45 7 182 230 -40 18 3 4 -3 -84 56 39 150 -14 64 126 175 -9 90
6008 90 186 7 12 -109 108 -67 281 -86 130 170 161 -32 -140 159 93 -175 -175 -70 -110 48 152 116 86 -142
6032 -142 -36 -180 -241 25 -2 114 129 -14 120 -51 52 44 102 -30 11 83 69 -74 -30 -225 -100 324 176
6055 176 35 56 183 -185 165 153 -29 17 -81 48 -60 162 -133 163 96 -267 53 -88 -126 -63 -98 55 163
6078 163 -211 -27 66 26 115 -44 -43 -5 -82 37 -120 -35 172 -31 294 320 -144 46 -178 -148 -147 -96 -81 88 -50
$$ packed form
5905h9J30o7K41q7j63p0M0Q7oJ24j57J63j32j18O8L39n14K39Q6r4Jj01k1L28j95
5930C2N4j52k24L16J01O5l73j16M6J6J34J0jJ18Qq5j07L64l22L32o8jk2n5k02
5955a32K16k45O2R3L5m3K4l4j32P3LK21j32J20j38k69K54K9k7k51K98O8l0r4J03
5980G2j0n9o3k4J84j49k0Mj5L5N2J75M8k70N8j5Jpq1J40j7J11j64P8O2M9j84R9
6008I0R6j79Nj21K17j75L48l67K16M0rj93j08K99o6k68%J05m0J58J04l6l0k28
6032a42J06j44o1K66k7J16J5j43J34j71J03qN8j32M1P2j4j43M4j95J25M24j48
6055A76j41K1J27l68L50j2j82M6r8J29j08K22k95K96o7l63L20j41l8O3l5J53J08
6078A63l74J84R3m0Q9j59JL8p7J19j57Q5K07k03L25K6m64J90k24L0JN1J5J69j38
$$ plain form
6103 -50 -137 88 180 182 -42 -188 2 337 299 -146 -7 199 94 62 158 220 31 -20 0 -176 178 29 127 -49
6127 -49 2 -29 15 -152 -29 -22 -22 -101 55 51 68 11 -119 342 -165 -81 120 -200 -14 46 101 -130 45 29 68 -17
6153 -17 230 -14 -37 -36 -133 71 192 149 11 70 -85 12 -73 -74 -75 -120 287 205 -199 289 80 74 -8 28 -43 63 -204
6180 -204 -109 -175 -142 448 -43 47 -104 155 88 -151 -184 151 -17 59 171 -170 19 -92 30 -88 -132 -134 -14
6203 -14 10 44 -163 3 -162 78 -57 155 -90 63 -220 -195 0 -147 -215 257 -410 -215 -196 68 6 137
6225 137 149 -49 -170 -249 -20 316 41 101 -2 -76 139 -124 -149 18 92 -12 -229 -304 56 76 -54 167 -69
6248 -69 -36 -99 -101 -97 113 261 87 25 -262 413 -15 -129 -116 42 115 -167 -68 -29 26 -159 15 -91 282 34
6272 34 176 -187 -38 52 -158 51 -5 -138 -140 -66 104 67 -361 5 84 -2 50 -66 -6 154 -164 -67 210 103
$$ packed form
6103e0q7K25R2Kk24j46J90L35l8m45J39K06j05l2R6O2j89n1K0j76L54j49R8j76
6127d9N1l1M4j67J23P%p9J56mJ7n7j30M61n07Q4K01l20J86O0N5k31J75j6L9q5
6153a7K47k44k3Jr7K04J21m3j38N9j55R7q5jjm5M07q2m04M88k09oq2L6p1J06k67
6180b04R5o6L3N90m91R0j51K59o7k39l3L35j68P6J12l41J89j11J22j18m4kJ20
6203a4K4L4k07J66j65K40j35K12k45J53k83K5J95j47o8M72o67J95J9K64o2J31
6225A37J2j98j21p9K29L36k75O0j03p4K15k63k5J67P4j04k17p5L60K0j30K21k36
6248f9L3o3kMK10J48j74o2k87O75m28j14J3J58P3k82R9L9N5j85J74j06L73k48
6272C4J42l63J49R0k10K09n6j33kP4J70l7m28L66P9q6N2j16O0J60l18R7K77j07
$$ plain form
6296 103 135 134 149 -45 -48 -76 -97 212 31 -56 100 -112 197 51 -66 -113 -60 107 23 -149 -136 -98 23 -34 -202
6321 -202 137 -40 -52 -7 -85 -151 113 -345 283 -74 23 8 161 184 164 117 -254 -94 -134 178 63 188 -167
6344 -167 26 76 -46 40 -25 25 329 -179 35 113 121 -182 -5 -300 -308 38 17 129 -33 -42 -153 301 -132 4
6368 4 -21 -146 -21 -97 242 181 -135 83 -94 93 -45 293 104 77 -243 181 156 173 232 -152 55 -89 -111
6391 -111 -16 46 41 -49 -67 60 0 90 47 147 -269 -132 -168 -179 40 338 288 -30 -11 5 -186 25 75 106 -199
6416 -199 92 -238 -162 26 -193 88 55 -23 -178 167 4 -25 10 -96 80 -17 -18 79 75 2 107 -42 -92 10
6440 10 131 -110 -16 16 14 34 -151 -76 -133 -176 183 -440 -173 -55 -98 32 154 -170 109 148 40 -6 268 -130
6464 -130 -51 154 -121 -298 -21 75 -95 -172 -68 82 -103 52 198 77 -118 -341 28 57 65 -19 361 85
$$ packed form
6296A03L2jJ5j94lk8k1L09j81q7J56k12L09j46j17m7N3J67q4j72J3L8J21n7j68
6321b02L39j77j2M5p8o6K64m58O28l57R7j5J53K3k0m7l71J60m0L12j15J25l55
6344a67J93N0j22Q6o5N0L04n08K14P8Ql03J77k95qL46k1J12j62rj11M54m33J36
6368Dk5j25J25p6L39o1l16K18j77J87j38L38j89k7l20M24k5J7N9l84K07j44k2
6391a11R5O2nr0j8J27o0R0m3J00m16J37l6j1K19K98n0l18J9J6j91K11N0L1l05
6416a99K91l30P6J88k19K81l3p8j55L45j63k9L5j06J76r7jR7mp3J05j49n0J02
6440A0J21k41R4L2kK0j85P5n7m3L59o23K67J18m3J30J22l24K79L9j08m6K74l98
6464a30P9K05k75j77K77R6j70p7J04J50j85J55J46j21j95k23L69K9Qq4L80k76
$$ plain form
6486 85 3 89 -61 170 -10 -108 -96 -188 165 137 -81 -394 113 7 142 -81 -35 196 -550 -138 -212 -46 71
6509 71 -69 -60 152 -102 -281 -220 0 -96 84 25 -168 48 49 -137 142 -53 -54 75 -47 140 -309 43 -17 -40
6533 -40 -84 -42 37 4 -165 -65 24 -129 -84 20 -59 29 -40 -121 -188 133 -180 -141 208 -15 -94 142 52 181 128
6558 128 65 105 185 -148 68 245 48 68 -153 -49 -250 88 149 101 201 17 -132 42 108 -173 176 -86
6580 -86 109 -14 249 115 171 80 -210 -153 113 -282 135 -125 -78 21 5 -188 -185 -213 30 -261 47 -156 -110 -5
6604 -5 15 -268 -63 148 -7 196 -120 146 -109 108 60 -18 301 -40 69 180 129 -239 113 121 166 -131 70
6627 70 35 -55 114 204 -12 125 -8 24 113 92 -5 -208 7 66 -26 15 261 -39 53 -101 84 -23 -57 -6 -17
6652 -17 -290 -291 186 -88 134 167 212 28 207 173 -45 -139 210 63 74 -67 -134 68 -70 -102 -30 128 -70 -54
$$ packed form
6486H5q2Q6j50K31j80r8J2r2L53k8k18l13N07j06J35k23M6K31p46M12p4J66J17
6509G1j40RK12k54j79O1K20r6J80n9j93K16Jj86K79j95jJ29j22J87m49L52o0k3
6533d0m4M2P9l3j69J00Q9j53M5J04p9Q8o9q1o7L21l13L9L49k23p9K36r0J29n3
6558A28o3M0Q0l33K16J77j97K0k21J04k01L38O1m8J00j84j49J74O6k81L49k62
6580h6J95j23K63j34N6r1k90N7K66l95M17k60M7R9j6j93Lk8K43k91L08k03M6J05
6604eK0k83K05K11j55K03l16K66k55K17m8p8L19l41J09J11n1l68L52QM5k97K01
6627G0l5r0J69R0k16J37j33L2Q9k1r7k03K15N9r2M1K46l00R2j54J85j07l4N1j1
6652a7k73jM77k74K22L3M5j84J79l4k18r4L49j47J1j41o7K02j38l2P2J58j98J6
$$ plain form
6676 -54 -64 126 -135 80 201 -93 -220 -84 -124 58 137 41 -38 -22 274 195 135 -17 -134 -2 65 22 104 -173
6700 -173 -127 -12 -249 -114 287 -175 162 -186 207 -32 66 -147 -79 -126 -159 135 120 40 115 300 -84 -39 -5
6723 -5 188 127 18 -140 -36 -120 154 31 257 -11 37 81 -17 35 -235 39 -45 -146 -27 69 -76 268 -203
6746 -203 -31 -112 -7 -32 -109 -24 108 -45 -148 223 -91 -74 -3 -66 -88 68 40 -155 166 107 -110 151 38
6769 38 66 -24 160 158 11 63 -79 -156 -113 46 -63 -210 -134 36 199 31 130 -46 95 336 -208 -7 70 -125
6793 -125 -20 44 105 38 -134 -70 -27 72 -30 26 64 -75 -3 -29 -285 -125 -25 -14 171 45 -2 -203 283 -124
6817 -124 -169 -140 -77 311 206 -70 -26 97 87 82 185 -62 169 143 -147 -57 -13 -52 -8 65 -212 -252 -16 104 24
6842 24 -3 46 117 61 14 -61 -177 93 -13 50 337 18 62 37 165 11 101 -241 192 -195 -76 -223 -21 116
$$ packed form
6676e4j0J90k61K15J21k94j27J36m0J82P9r6p9J6K96p9o0j52j17J32O7m3Q2k77
6700a73M6J15k37J35M01m62L37l48L93k39R8k13O8m7l3K94j5q0P5J85l84M5L4
6723eJ93o1j09j58J04q4K74j23K26k68M8M4r8N2k70K74q4j01J19R6j45L44m71
6746b03J72q1J05k5p7Q5J32j53j03L71l14J7P1o3k2J56k8j95L21n9k17K61j13
6769C8K8r0J84kj47N2j42p7M3J59j09j47P6J70J63j68R9j76J41K41n44K01P7j95
6793a25J05O4O1o7j72O4M3R9j02N6L8j39P2k6k56J60J00J1J85j26m7k01M86m07
6817a24m5K9O3L88j05k76M4J23j0nJ03k47K31k6k90R0M4l9M4P3k77m0K36J20q0
6842B4k7M9P1n6m7p5j16K70j06O3K87l19M4k5J28j54R0l42M33l87J19j47K02J37
$$ plain form
6866 116 165 -78 171 11 -120 -143 -65 46 118 122 -73 -25 31 10 -15 105 -50 21 230 104 113 -113 -70 -242 -244
6891 -244 -70 -75 23 50 121 5 -91 -44 122 -238 -101 83 -196 -110 -154 -7 154 25 -208 -112 29 -119 -69 -152
6915 -152 -224 59 113 94 209 -48 -259 -44 -247 272 126 -30 169 -74 60 39 -9 -150 -114 18 79 -357
6937 -357 -47 -83 129 -55 63 108 -162 67 241 -118 -2 275 203 -25 -176 -30 28 108 13 -67 261 -92
6959 -92 11 231 -13 -69 -159 -193 -11 2 200 52 -12 -187 -151 138 -132 -31 -9 -134 -115 -40 -259 -175 117 -128
6983 -128 -93 229 -38 -178 218 -222 -127 -292 108 -8 -89 -126 54 146 46 -175 169 -326 -22 66 -39 -4
7005 -4 -82 255 153 176 165 40 -119 -143 -5 50 -64 -268 -12 -45 27 -79 -66 10 9 -44 189 68 48 -106 55
7030 55 77 -118 264 -163 38 145 -39 68 92 -124 51 -105 105 -106 -64 -2 -217 183 56 -8 -157 139
$$ packed form
6866A16M9k43K49j60j31k3P8J11P2Mj95M8N6k1k5J20j55P1K09j26Rk26M3j72k
6891b44J74nR8K7P1j16r6M7J66l60J37J84k79Q6m4J47J61j29k33R6J41j48N0q3
6915a52p2K83N4j9J15k57k11K15k03N19j46j56J99k43J34k1m8j41L6J32O1m36
6937c57L10l6K12j84J18M5k70K29J74l59J16K77p2k28j51J46N8Q0r5q0L28l53
6959i2J03K20k44n6r0l4J82J3J98j48o4j75L6K89k70J01K2j25J9P5k19Q4K92k45
6983a28L5L22k67j40L96m40R5j65M00j16q1l7J80R2j00k21L44m95L04Q8j05L5
7005dp8L37j02K3j1j25j59k4J38N5j14k04K56l3P2j06J3P6jn3K33j21k0j54J61
7030E5K2j95L82m27K01J07j84J07K4k16J75j56K10k11M2O2k15M00j27o4j49K96
$$ plain form
7052 139 60 -111 -42 217 119 -76 53 -109 122 46 136 208 218 -195 -52 -8 -73 18 16 -21 100 19 -247 157 -51
7077 -51 7 -267 136 -206 -31 -29 192 99 -57 37 -35 -166 75 183 216 275 12 102 -97 11 -86 129 -91 -30
7101 -30 66 106 -213 101 -30 -8 -174 18 -155 158 131 143 229 -60 -244 146 93 -41 163 -71 86 346 -41
7124 -41 51 52 -10 -165 -58 78 -22 -76 41 -79 69 12 -11 -26 -8 -204 37 188 -259 -50 -22 -39 250 45
7148 45 -17 -93 -254 97 -237 -244 -391 -37 -194 -37 -28 65 -176 41 -161 193 131 -233 -72 51 256 111 21
7171 21 -82 -105 147 -144 182 -96 -33 188 -99 -184 -248 82 -37 100 122 -136 33 -192 109 306 6 48
7193 48 -107 -294 241 -50 87 -47 -69 27 -56 206 139 73 -32 106 -44 -27 -177 123 3 13 54 150 -19
7216 -19 78 17 -136 125 18 -137 206 75 -110 -177 128 -130 106 10 -18 -19 29 35 -12 117 -81 126 115 -42
$$ packed form
7052A39p9j71O9K59r8j95J29j62K31p6R0P2J0m13J43M4o5R1kl7J21q1k66M04k08
7077e1N8k74M03l42J75KK21r3j56R4p2j31K41J08L3N9k63R0j99J08r7K15k20O1
7101c0R6M0l19L14j31K2j66J92j73L13k7J2Q6k89j84L90n3j34K04k34J57K60l87
7124d1R2Jo2j55J07J36j00n4J17j20J48n7k3j5J8j96K41J51m47K09K8j7K89k05
7148D5o2p6j61L51l34pj47L54j57J57RR3k41K17k02L54o2l64J61J23K05j45r0
7171B1j03k3K52k91L26k78O3K21k87q5o4L30j19J37K2k58J69k25L01J97l00M2
7193D8j55j87N35k91J37j34k2R6q3K62o7o6j05J38j50J7j50L00j20J0M1R6j69
7216a9R7o1j53K61j07j55L43j31j85o7L05k58K36r6k8jM8Om7J29j98K07j1j57
$$ plain form
7240 -42 59 180 75 -49 -149 -25 -159 -73 7 104 52 -38 -77 -35 15 129 -78 -100 200 38 36 311 279 -8
7264 -8 -7 -60 -44 53 -19 -104 60 279 -71 -19 293 204 118 30 -188 80 27 127 58 -47 215 109 129 143 -135 -104
7290 -104 84 -133 85 19 -168 -249 -223 156 -215 129 -173 -75 77 -136 113 107 -462 -37 114 -219 -89 -130
7312 -130 -175 -33 -249 -58 305 -104 116 -31 33 -96 -136 -14 -188 12 131 12 32 46 -74 -195 -87 213
7334 213 -68 132 -13 98 142 -143 -48 -19 -92 33 103 134 87 137 123 -108 -105 36 -46 96 -79 -190 -136 -129 113
7359 113 14 52 -50 -8 83 53 159 -110 -4 173 -55 192 170 -25 -88 127 -126 162 149 230 205 17 -29 -79
7383 -79 -88 -93 -37 79 20 -43 -25 63 74 -15 93 30 -64 66 118 -368 -31 186 407 -72 -200 -52 -178 74 -50
7408 -50 -44 99 105 107 -172 25 33 -136 -29 -298 243 -212 119 -196 -26 84 -69 11 22 -102 -68 -207 -64 -148
$$ packed form
7240d2J01J21j05j24j00J24j34Q6Q0R7n2r0l9M2N0J14k07k2L00j62kK75l2k87
7264hJn3J6R7p2q5J64K19l50N2L12q9q6q8k18K68n3J00o9j05K62j06K0J4k78L1
7290a04J88k17K18o6j87q1K6L79l71L44l02R8J52k13K49on69M25J51l33J30m1
7312a30m5J42k16J91L63m09K20j47O4j29m0J22j74K00J19j19K0J4j20j21J08L00
7334B13k81K00j45J11M4k85R5K9p3J25P0L1m7N0j4k31LJ41q2J42j75j11N4PK42
7359A13r9L8j02M2R1l0J06k69J06J77k28K47k2j95o3K15k53K88j3Q1k5j88m6n0
7383g9rnN6J16n9o3J8Q8J1q9J08o3r4J30N2m86L37K17K21m79j28J48j26K52j24
7408e0OJ43OKk79J97Qj69J07k69N41m55L31l15J70J10j53Q0J1j24L4j39J43q4
$$ plain form
7432 -148 20 145 91 -128 137 92 -164 -50 -108 -135 227 215 -269 272 110 233 288 -249 52 -168 50 -141
7454 -141 -157 -180 16 209 45 132 -42 124 178 -87 -171 183 -206 -199 84 140 201 -76 -113 98 -59 245 130
7477 130 66 276 110 13 18 -176 59 -23 148 -7 -136 -205 58 222 -38 -183 26 -123 -193 -10 6 253 2
7500 2 -110 -79 -39 7 -184 -84 -176 160 57 296 -3 -188 -126 -29 -216 207 41 105 177 205 -50 186 -25 118
7524 118 216 -164 -55 108 130 -64 150 222 139 -92 146 -1 -73 -255 13 -36 61 -42 69 386 104 -53
7546 -53 158 86 -39 -143 118 -231 82 19 -6 59 49 126 -75 307 7 95 11 -244 -69 -17 46 120 -43 -132
7570 -132 1 245 184 -60 -49 77 61 110 262 189 151 -298 126 -52 -184 0 -218 53 106 -95 81 -40
7592 -40 -121 149 11 150 -174 -39 -155 195 49 115 -33 83 -160 -160 172 -70 89 148 138 151 20 -53 319
$$ packed form
7432a48J68J25n4k19K65m5k56J14n8k7L62j2m84N41j62J23N5n37L01k20K18j91
7454a41j6k3J96J93j64Q7j74J66N4k65q4L54l89PK83N6O1k77l7K11j57L04j15
7477A30o4K10j66r7Nj94K35q2J71j55j29o9K63J64k60j45K09j49p0J83J6K47k51
7500Bj12L1M0M6j91J00r2L36j03K39k99j85O2R7j87M23j66O4P2K8k55K36k11J43
7524A18R8l80J09J63K2j94K14P2q3k31K38j47p2j82K68m9R7j03J11L17k82j57
7546e3K11p2j25j04K61l49L13o3k5O5j0P7k01L82l00Q8q4k55J75N2O3P4j63q9
7570a32J33K44o1k44J1J26j6M9J52p3l8m49M24j78j32J84k18K71N3k01J76j21
7592d0q1K70j38J39l24J35j16L50j46O6j48J16k43%L32k42J59N9j0J3j31p3L72
$$ plain form
7615 319 -92 -3 238 -203 83 -70 -111 2 -11 77 96 50 -213 21 -93 37 58 -126 28 -25 -16 175 6
7638 6 47 27 264 201 -144 -24 -194 -125 80 -269 25 266 150 -20 273 293 -40 64 29 -140 158 -39 -21
7661 -21 -122 108 167 -135 -26 79 96 65 263 221 -94 -150 72 -23 -113 9 139 159 15 -223 66 -153 -15
7684 -15 38 -158 -98 184 40 48 206 -41 -58 154 -130 60 -50 -20 100 10 107 45 83 213 -92 -61 121 -109
7708 -109 290 47 6 180 -268 -35 17 4 6 128 93 -39 13 163 -311 172 84 112 -181 -145 56 226 -19
7731 -19 156 -51 132 232 4 8 -19 -107 306 -167 89 -73 272 -10 -113 -159 -135 -57 -68 -133 -118 93 -174 84
7755 84 -36 -60 -140 148 -21 159 19 -124 -179 60 -26 -68 62 -202 -25 -68 -154 -72 122 89 31 348 216 -118
7779 -118 -182 -124 -15 -74 -115 6 -29 15 127 35 -44 -111 125 -21 104 -17 247 0 -104 -213 -93 65 -513
$$ packed form
7615C19m11Q9K41m41K86j53m1J13j3Q8J9m6k63K34j14J30K1j84J54n3RJ91j69
7638FM1k0K37o3l45J20j70O9K05l49K94K41j16j70K93K0l33J04l5j69K98j97J8
7661b1j01K30N9l02J09J05J7l1J98m2l15n6K22r5r0J22J30K0j44k38K89k19J38
7684a5N3j96O0K82j44QJ58k47j7K12k84J90j10L0J20r0R7o2L8J30l05L1J82k30
7708a09L99k43m1J74m48K33N2j3KJ22l5j32N2J50m74M83q8K8k93L6K01J70k45
7731a9J75k07J83J00k28Mk7q8M13m73K56j62L45k82j03m6K4P8j1o5J5K11k67K58
7755H4j20k4q0K88j69J80j40j43n5K39q6m2J30k64J77m3q6Q2J94l3n8L17j32l34
7779a18o4N8J09n9m1J21l5M4J12r2p9o7K36j46J25j21K64k47j04j09J20J58n78
$$ plain form
7802 -513 150 -144 156 8 78 -21 215 18 139 13 -164 72 -17 246 -229 -207 160 50 -82 29 50 -179
7824 -179 -164 -35 -40 -151 5 43 -170 7 99 -100 -29 110 -162 -60 179 191 -89 -97 -163 149 18 -120 51
7847 51 -224 -21 171 148 175 -126 -75 193 -4 76 -40 32 93 2 -77 92 -193 16 -189 -7 -69 -53 78 -54
7871 -54 15 0 80 -88 21 12 71 -16 217 63 31 145 0 194 320 191 -9 -7 -4 40 19 179 -120 103 77
7896 77 204 -105 74 -16 -236 -49 -10 -84 99 169 -73 -249 109 42 184 2 -81 196 -204 -26 202 305
7918 305 36 -89 47 122 29 -80 322 -177 -220 155 -66 75 -74 91 -11 139 -48 400 -113 -76 204
7939 204 187 51 2 -127 -190 -109 -58 181 119 -229 121 149 115 105 28 47 -84 -68 82 -145 -155 -171 11 170 -27
7964 -27 92 27 -143 220 -8 -57 -31 77 137 -34 143 -100 -233 32 55 -110 143 249 206 11 13 -38 284
$$ packed form
7802e13O63k94L00j48P0r9K36j97J21j26j77K36q9K63m75K2L67j10j32J11K1k29
7824a79J5J29nj11J56L8k13J77R2j99P1J39k72J02K39J2k80qo6L12j31j38J71
7847E1k75K03J92k3K7l01N1K68j97Q0j16P2O1r1p9J69k85K09k05J82o2J6J31j32
7871e4O9j5Q0j68J09rN9q7K33j54l2J14j45J94J26j29k00KLM4k1J60k99K23k6
7896G7J27l09J79r0k20J87L9p4J83P0k42j76L58o7J42j82q3K77m00J78K28J03
7918C05k69j25J36P5r3j09M02m99m3L75k21J41j49J65j02J50j87M48n13L7K80
7939B04j7j36m9j29o3Q1N1K39o2l48L50K8l4j0p7J9j31J6J50k27j0j6J82J59j97
7964b7J19o5j70L63k28m9K6J08O0j71J77k43j33K65K3j65K53J06m3j95Kn1L22
$$ plain form
7987 284 -17 212 27 55 84 -51 -11 82 107 44 121 -116 -113 138 10 192 287 -169 21 -128 -8 -191 -53
8010 -53 -10 117 -37 0 31 118 71 8 57 44 163 94 -38 -112 170 115 204 -83 -8 110 -134 135 -16 -105 -57
8035 -57 65 -75 19 51 140 64 -112 34 -105 -48 -66 19 -54 -6 38 132 -48 11 89 105 71 -56 82 36 -100 92
8061 92 5 -32 -222 -125 133 -106 166 369 185 218 -60 -159 108 117 261 138 -28 235 -1 61 52 -189 28 -230
8085 -230 6 89 134 3 88 -152 -215 120 34 -141 140 -161 83 -91 30 111 5 11 6 -131 33 -300 -123
8108 -123 282 -65 49 -40 118 -6 34 177 -85 1 67 -121 -235 -16 -243 -188 204 71 -283 39 -62 87
8130 87 85 69 -155 -206 193 148 107 -66 -12 -102 -32 35 120 -33 71 -142 -56 152 104 -41 190 -131 171 -31 -18
8155 -18 -211 80 232 -9 -19 -77 98 8 179 -1 -122 -157 74 -155 155 75 -79 -9 81 161 -117 165 -17
$$ packed form
7987B84l01K29j85K8K9j35M0R3K5o3P7k37LK51j28J82R5m56J90j49J20j83J38
8010e3M3J27j54L7L1Q7m7o3M9j3J19o9j32p4K82n5Q9k87P5J18k44K69j51q9M8
8035e7J22j40R4L2Q9p6j76J46j39N7j8Q5p3M8M4R4j80N9P8J6l4j27J38m6j36J92
8061I2q7l7j90R7K58k39K72K03j84L3k78r9K67RJ44j23j66K63k36O2rk41K17k58
8085b30K36Q3M5j31Q5k40o3L35q6j75K81l01K44j74J21Q1j06Onj37J64l33J77
8108a23M05l47J14q9J58j24M0J43k62Q6O6j88j14K19k27N5L92j33l54L22j01J49
8130H7kj6k24n1L99m5m1j73N4r0P0O7Q5j53J04k13Q6K08m8j45K31l21L02k02J3
8155a8j93K91J52k41j0n8J75r0J71j80j21l5K31k29L10q0j54P0R0Q0k78K82j82
$$ plain form
8178 -17 146 -117 -427 80 -37 60 -184 -42 74 -139 15 23 88
$$ packed form
8178a7J63k63l10N07j17R7k44J42J16k13J54QO5
8191H8
$$ Imaginary data points
##PAGE= N=2
##DATA TABLE= (X++(I..I)), XYDATA
$$ plain form
0 0 0 0 0 0 0 0 0 0 0 0 0 0 0 0 0 -8 8 -8 8 -8 16 -16 16 -24 24 -32 33 -40 48 -55 62 -70 80 -89 102 -113 128
37 128 -142 159 -179 198 -220 244 -269 300 -330 364 -402 442 -487 535 -591 651 -718 794 -883
56 -883 978 -1091 1224 -1381 1569 -1805 2104 -2499 3049 -3870 5221 -7848 14855 -73449 -188199
71 -188199 -31305 62598 49787 29775 72036 105720 119957 92317 74962 95962 109470 70168
83 70168 46641 56432 65329 53406 28252 -6240 -17684 -19300 -40788 -60565 -53117 -52062 -63471
96 -63471 -58973 -44772 -51034 -64182 -57412 -33909 -24306 -34369 -35791 -3605 32164 29785 6907
109 6907 12092 39579 42167 20480 20149 45434 50765 23799 7706 25340 40377 16876 -16736
122 -16736 -14683 6275 3592 -16259 -18616 -6014 -5750 -21911 -28681 -15079 -4990 -15417 -26240
$$ packed form
0@%%%%%%%%%%%%%%%qJ6j6J6j6K4l2L2m0M8n6O5p3Q8j03J17j32J50j69J91k15K41
37A28k70L01l38L77m18M64n13N69o30O94p66Q44r29J022j126J242j369J512j677
56h83J861k069K315k605K950l374L909m603N548o919R091j3069K2703q8304j14750
71a88199J56894R3903j2811k0012M2261L3684J4237k7640j7355K1000J3508l9302
83G0168k3527R791Q897j1923k5154l4492j1444j616k1488j9777P448J055j1409
96f3471M498J4201o262j3148O770K3503R603j0063j422L2186L5769k379k2878
109F907N185K7487K588k1687l31K5285N331k6966j6093J7634J5037k3501l3612
122a6736K053K0958k683j9851k357J2602K64j6161o770J3602J0089j0427j0823
$$ plain form
135 -26240 -13556 5092 2770 -11100 -8889 4977 5021 -7625 -5068 11158 14521 4897 2296 11535
149 11535 18190 9549 -5135 -809 17138 12408 -6912 -4215 13223 12074 -5254 -13368 -4073 5678
163 5678 -4119 -19319 -8655 12203 3347 -16823 -10596 5837 3270 -9528 -11534 272 9924
176 9924 3244 -5117 4610 14185 3526 -6670 1302 9949 5956 -1201 640 8841 10967 577
190 577 -6168 184 4272 -4953 -11838 -4434 3386 -1293 -9695 -7427 1251 410 -10252 -12079 98
205 98 6445 -1838 -6790 3637 12436 5033 -4686 613 10401 7737 -3013 -1814 9995 11566 -334
220 -334 -4955 4008 7308 -2499 -8359 -2404 3694 -596 -7656 -5388 1842 162 -7835 -7810 -395 1234
236 1234 -4326 -5843 -350 3800 721 -4100 -438 6262 4695 -1673 -592 6767 7760 904 -2323
$$ packed form
135b6240J2684J8648k322j3870K211J3866M4j2646K557J6226L363r624k601R239
149A1535O655q641j4684M326J7947m730j9320K697J7438j149j7328q114R295R751
163E678r797j5200J0664K0858q856k0170O227J6433k567j2798k006J1806R652
176I924o680q361R727R575j0659j0196P972Q647l993p157J841Q201K126j0390
190E77o745O352M088r225o885P404P820m679q402K268Q678q41j0662j827J2177
205I8O347q283m952J0427Q799p403r719N299R788k664j0750J199J1809J571j1900
220c34m621Q963L300r807n860N955O098m290p060K268P230j680p997K5P415J629
236A234n560j517N493M150l079m821L662O700j567o368J081P359R93o856l227
$$ plain form
251 -2323 3745 7448 1075 -3847 1378 6417 1409 -5298 -2825 2901 1063 -6447 -7033 833 2712
266 2712 -4528 -7274 -646 3339 -2854 -7133 -2440 3053 568 -4252 -1761 5098 4976 -1244 -2122 3095
282 3095 5389 1030 -1407 2525 5782 3398 -241 912 2903 1356 -1900 -2121 700 1693 -2097 -4113
298 -4113 -838 1866 -2306 -6319 -3488 768 -733 -4227 -2352 2501 1881 -2984 -2686 2753 3889 -1297
314 -1297 -3112 2334 6376 2311 -2203 528 4116 1952 -1741 -576 2812 2526 -1210 -1396 1718 2256
330 2256 -1805 -4132 -1212 1791 -25 -3096 -2302 856 601 -1860 -2379 -377 238 -1578 -1875 962
346 962 3260 862 -2192 -399 2939 1888 -1589 -1657 2023 2608 -112 -439 2073 2476 -1142 -2429 847
363 847 2972 281 -2437 -307 3255 1736 -1883 -2054 -78 172 -2470 -2432 302 836 -1129 -2344 -77
$$ packed form
251b323O068L703o373m922N225N039n008o707K473N726j838p510n86P866J879
266B712p240k746O628L985o193m279M693N493k485m820K491O859j22o220q78N217
282C095K294m359k437L932L257k384l639J153J991j547l256k21K821R93l790k016
298d113L275K704m172m013K831M256j501l494J875M853o20m865K98N439J136n186
314a297j815N446M042m065m514K731L588k164l693J165L388k86l736j86L114N38
330B256m061k327K920L003j816l071P94L158k55k461n19K002O15j816k97K837
346I62K298k398l054J793L338j051l477o8L680N85k720l27K512M03l618j287L276
363H47K125k691k718K130L562j519l619j71J976K50k642L8K734N34j965j215K267
$$ plain form
380 -77 1049 -812 -2915 -1809 945 1502 47 379 1921 2458 1260 175 971 1725 681 -441 630
397 630 3123 2285 -743 -1129 853 1132 -1713 -2989 -977 260 -1162 -2429 -362 1114 -1243 -3832
413 -3832 -1939 913 332 -1678 -945 1659 2112 989 290 1688 1979 635 137 1527 2698 1445 -317
430 -317 634 1633 815 -1092 -1716 -813 -155 -991 -2046 -1145 -742 -1321 -2204 -1760 0 -186 -1785 -968 947
449 947 2253 544 -736 668 2073 1203 -335 1052 2721 1829 30 749 2019 830 -1110 -1470
465 -1470 217 675 -673 -1432 -700 536 -1001 -1972 -1019 -547 -1514 -1497 -651 432 386 28 -331 685 867
484 867 -196 -692 334 1126 849 945 1028 1190 1403 242 -808 367 1133 -419 -1073 399 1422 412
502 412 -909 -534 -1 -102 -1227 -1642 -99 383 -767 -1072 591 485 -805 -1353 -733 290 67 -721
$$ packed form
380g7J126j861k103J106K754N57j455L32J542N37j198j085P96P54j044j122J071
397F30K493q38l028l86J982K79k845j276K012J237j422j267K067J476k357k589
413c832J893K852n81k010P33K604M53j123o99J398K91j344m98J390J171j253j762
430c17R51R99q18j907o24R03O58q36j055R01M03n79q83M44J760j86j599Q17J915
449I47J306j709j280J404J405q70j538J387J669q92j799P19J270j189j940l60
465a470J687M58j348p59P32J236j537r71R53M72r67J7Q46J083m6l58l59J016J82
484H67j063m96J026P92k77R6Q3J62K13j161j050J175P66j552o54J472J023j010
502D12j321L75N33j01j125m15J543M82j150l05J663j06j290n48O20J023k23p88
$$ plain form
520 -721 -141 1166 627 -52 235 622 344 15 370 556 686 779 396 424 1335 947 -149 -349 -2 335
540 335 -336 -280 -317 -13 -729 -1121 -1097 -426 -353 -1479 -1298 -327 -67 -411 -591 355 647 -80 -132 777 1473 1128
562 1128 342 657 1229 933 212 356 934 699 -68 23 306 108 -561 -1043 -1089 -1053 -742 -970 -1276 -597 -450
583 -450 -613 -626 -763 -543 -145 170 -55 623 759 514 408 1211 1357 466 171 503 623 213 200 44 719
604 719 435 -457 -347 -63 -885 -1296 -350 -279 -581 -599 -234 -174 -260 -347 -534 -453 90 -247 255 570 496 784 931
627 931 611 -114 460 558 -66 5 632 511 410 67 -141 336 -49 -528 -239 8 -330 -270 -302 57 114 -557
649 -557 -325 -185 -329 -468 -359 -180 67 95 88 451 343 -10 89 188 286 187 373 206 123 489 459 240 -29
672 -29 228 -203 0 -550 -507 -66 -228 -377 -203 162 198 -420 -604 -238 -108 -373 -425 34 -102 0 -16 565
$$ packed form
520g21N80J307n39o79K87L87k78l29L55J86J30R3l83K8R11l88j096k00L47L37
540C35o71N6l7L04p16l92K4O71P3j126J81R71K60l44j80R46K92p27n2R09O96l45
562A128p86L15N72k96p21J44N78k35p67R1K83j98o69m82m6L6L11k28l06O79J47
583d50j63j3j37K20L98L15k25O78J36k45j06Q03J46q91k95L32J20m10j3j56O75
604G19k84q92J10K84q22m11R46P1l02j8L65O0q6q7j87Q1N43l37N02L15p4K88J47
627I31l20p25N74R8o24P1O27j21j01l43k08M77l85m79K89K47l38O0l2L59N7o71
649e57K32J40j44j39J09J79K47K8pL63j08l53R9R9R8r9J86j67q3L66l0k19k69
672b9K57m31K03n50M3M41j62j49J74L65L6o18j84L66J30k65n2M59j36J02j6N81
$$ plain form
694 565 264 -57 146 260 372 246 180 40 437 90 290 266 218 -140 -47 -103 -290 -353 -276 -225 -194 -134 -70 160
718 160 131 -375 -114 192 -261 -178 121 171 64 204 399 417 -44 -398 166 53 -206 -299 292 346 174 266 84
741 84 -216 -149 -335 -313 1 -258 -242 136 -77 160 125 -250 -339 -115 -381 -217 -136 -131 -56 273 238 329 117 -74
765 -74 -80 -239 77 167 219 -54 99 405 174 -254 -217 69 -191 -406 -148 28 -144 -129 -131 -16 11 -459 -513 -496
789 -496 -151 -218 37 139 51 507 169 152 -150 35 95 71 62 262 295 88 213 307 299 175 -21 46 167 -18
813 -18 -168 -84 -21 -43 -329 -62 29 -125 -308 -214 226 52 -99 0 193 88 104 -8 459 151 -111 16 -55
836 -55 163 52 -30 -70 30 -33 102 255 -57 -114 -44 -430 -187 -174 149 49 -65 340 256 -59 8 -274 -54
859 -54 -38 291 131 286 229 78 -79 -249 -93 -243 -212 -32 198 60 96 101 292 113 -1 -271 -82 97 -95
$$ packed form
694E65l01l21K03J14J12j26o6j40L97l47K00k4m8l58R3n6j87o3P7N1L1O0O4K30
718A60k9n06K61L06m53Q3K99N0j07J40J95J8m61l54N64j13k59r3N91N4j72R2j82
741H4l00O7j86K2L14k59J6L78k13K37l5l75q9K24k66J64Q1NP5L29l5R1k12j91
765g4oj59L16R0N2k73J53L06k31m28L7K86k60k15K58J76j72J5kJ15K7m70n4J7
789d96L45o7K55J02q8M56l38j7l02J85O0k4rK00L3k07J25R4qj24j96O7J21j85
813a8j50Q4O3k2k86K67R1j54j83R4M40j74j51R9J93j05J6j12M67l08k62J27p1
836e5K18j11q2m0J00o3J35J53l12n7P0l86K43J3L23j00j14M05q4l15O7k82K20
859e4J6L29j60J55n7j51j57j70J56j50L1J80K30j38L6NJ91j79j14k70J89J79j92
$$ plain form
882 -95 285 123 -226 143 208 -53 -24 14 -242 -278 -49 5 75 39 -79 132 -145 -260 -352 -229 -134 29 -128 4
906 4 234 -93 187 14 212 24 25 58 21 -204 -7 221 -99 196 -143 -28 -70 -126 -126 -249 -136 -116 -68 -21 82
931 82 -311 -91 152 -170 -79 -52 414 74 10 114 317 161 163 57 52 130 -96 28 -98 -86 -118 118 0 94
955 94 -100 -250 -144 -248 -533 -92 -88 27 97 143 113 248 239 30 313 126 -76 19 179 14 -48 106 121 -24
979 -24 -17 77 -61 -62 -316 -180 92 -137 -48 240 20 -366 -267 89 -46 -179 -158 227 400 187 -12 243 0
1002 0 -116 -91 34 165 -158 119 -99 160 -21 -22 198 175 -179 -222 -82 -49 -42 166 -58 20 143 166 -3 -64
1026 -64 58 -176 42 -102 -397 137 18 -192 75 209 -85 -231 -229 123 -44 -9 -175 242 329 -290 11 -208
1048 -208 214 -213 -215 -73 47 256 143 208 -1 8 -131 -118 128 -169 5 13 -115 -310 -46 95 -91 119 -38
$$ packed form
882i5L80j62l49L69O5k61K9L8k56l6K29N4P0l6j18K11k77j15r2J23R5J63j57J32
906DK30l27K80j73J98j88JL3l7k25J97K28l20K95l39J15m2n6%j23J13K0M8M7J03
931H2l93K20K43l22R1K7M66l40o4J04K03j56Kj06nP8k26J24j26J2l2K36j18R4
955I4j94j50J06j04k85M41MJ15P0M6l0J35rk09K83j87k02R5J60j65o2J54J5j45
979b4PR4j38jk54J36K72k29Q9K88k20l86R9L56j35j33K1L85J73k13j99K55k43
1002@j16K5J25J31l23K77k18K59j81jK20k3l54m3J40L3PK08k24P8J23K3j69o1
1026f4J22k34K18j44k95N34j19k10K67J34k94j46KL52j67L5j66M17Q7o19L01k19
1048b08M22m27kJ42J20K09j13O5k09Rj39J3K46k97J74Qj28j95K64J41j86K10j57
$$ plain form
1071 -38 -139 -85 -220 42 114 89 -13 97 244 94 32 19 114 313 148 293 146 -103 -101 -49 12 227 -121 -15
1095 -15 -94 30 97 -31 127 -4 172 147 -6 -55 -238 -89 -105 -217 78 215 -29 306 119 225 -48 -297
1117 -297 -202 -184 15 -257 16 137 224 176 64 106 -14 67 0 157 160 265 61 37 154 231 172 -235 -192 -387
1141 -387 16 90 162 71 -30 69 34 40 7 29 -174 -63 120 407 85 173 -114 -189 25 91 115 -206 -175 -47 189
1166 189 98 158 -66 66 -60 -252 -27 -140 115 -166 113 42 91 -31 -26 -62 66 -100 1 194 -33 4 139
1189 139 5 -76 104 -167 -53 -189 -20 44 -358 -125 -172 88 30 155 94 122 122 -101 -40 -158 -84 82 158 261
1213 261 28 -69 -122 1 -89 -71 -358 31 -126 21 -126 -128 177 -59 -99 10 -169 -163 -81 -53 313 114 6 272
1237 272 -146 -152 161 -200 -78 -286 -344 73 119 0 152 87 104 54 -140 -178 -42 80 -75 187 312 211 8
$$ packed form
1071c8j01N4j35K62P2k5j02J10J47j50o2j3R5J99j65J45j47k49KN2O1K15l48J06
1095a5p9J24O7j28J58j31J76k5j53m9j83J49j6j12K95J37k44L35j87J06k73k49
1117b97R5J8J99k72K73J21Q7m8j12M2j20Q1o7J57LJ05k04k4J17P7n9m07M3j95
1141c87M03P4P2r1j01R9l5Ol3K2k03J11J83K87l22Q8k87p5K14O6K4l21L1J28K36
1166A89r1O0k24J32j26j92K25j13K55k81K79p1M9j22Nl6J28j66J01J93k27L7J35
1189A39j34q1J80k71J14j36J69O4m02K33m7K60n8J25o1K8%k23O1j18P4J66P6J03
1213B61k33r7n3J23r0J8k87L89j57J47j47kL05k36m0J09j79OQ2K8L66j99j08K66
1237B72m18oL13l61J22k08n8M17M6j19J52o5J7n0j94l8J36J22j55K62J25j01k03
$$ plain form
1260 8 -6 167 -140 8 -195 20 -185 172 159 207 123 118 -17 -141 88 -290 -194 51 -17 -76 129 143 47 -99
1284 -99 -49 -175 -115 134 251 -64 326 165 175 96 67 259 2 71 20 119 -59 152 -104 -48 61 29 48 23
1308 23 185 -131 -162 -10 97 168 6 -180 2 123 -205 127 68 -98 51 -315 -181 112 -84 -21 5 -96
1330 -96 -82 -85 -482 -52 -374 84 -140 8 -90 60 -110 -53 -1 -109 -88 14 79 34 11 83 201 -16 147 -90
1354 -90 127 142 -340 -160 -129 164 62 -19 48 79 -120 -203 -164 33 -16 108 28 128 86 283 3 30 -23 -27 170
1379 170 -74 163 120 -36 -116 51 -13 -185 207 25 -113 174 -128 195 -24 100 3 56 168 -30 95 -131
1401 -131 -88 212 -16 -161 -9 -294 -240 13 -86 88 -244 -10 98 100 351 -13 164 142 -136 -140 -129 125 70
1424 70 -17 61 19 -53 -214 8 206 -219 -170 154 -118 47 -200 -189 -250 102 -73 -66 1 -168 -101 -7 -250 -227 37
$$ packed form
1260Hj4J73l07J48k03K15k05L57j3M8q4nj35j24K29l78R6K45o8n9K05J4r6j46
1284i9N0j26O0K49J17l15L90j61J0p9k9J92k57O9n1R9j78K11k56N6J09l2J9k5
1308B3J62l16l1J52J07P1j62j86J82J21l28L32n9j66J49l66J34K93j96O3K6j01
1330i6J4ll97M30l22M58k24J48r8J50j70N7N2j08K1J02O5m5k3P2J18k17J63k37
1354i0K17J5m82J80L1K93j02q1O7L1j99q3L9J97m9J24q0J00m2J97k80K7n3mJ97
1379A70k44K37m3j56q0J67o4j72L92j82j38K87l02L23k19J24r7N3J12j98J25k26
1401a31M3L00k28j45J52k85N4K53r9J74l32K34J08KK51l64J77k2k78mJ1K54n5
1424G0q7P8m2p2j61K22J98m25M9L24k72J65k47J1o1L52j75PO7j69O7R4k43K3K64
$$ plain form
1449 37 -39 16 146 158 -72 0 -140 -108 34 -194 175 -34 146 -27 153 -103 -116 234 -80 -115 23 -163 -116
1472 -116 120 -22 -94 21 -76 -83 -243 -29 -50 6 -54 79 -6 262 64 -57 -21 15 109 -34 3 71 0 184 38
1497 38 4 77 -2 66 199 234 -83 123 -41 28 -57 -79 -11 -5 39 -110 -28 115 84 159 39 52 -7 -23 44 -187 -25
1524 -25 48 -10 -132 8 205 84 -110 43 17 -176 -159 -213 69 -124 -51 -37 -91 -31 -11 -142 21 108 10 -155
1548 -155 114 -81 -81 178 17 109 -137 -155 24 -4 -49 93 28 246 -54 24 96 -1 76 -115 89 -192 27 -232
1572 -232 264 -72 137 73 -152 12 -61 -25 40 -107 -76 -52 197 185 -22 183 264 41 -110 -39 129 46 -129
1595 -129 -41 -79 -105 43 -12 39 -52 -89 340 141 -35 -114 -33 -27 106 76 222 -37 -19 -93 -301 -27 -189 90 162
1620 162 -73 -91 76 -141 26 98 20 -127 21 238 74 216 12 82 403 96 9 -129 8 -22 128 74
$$ packed form
1449C7p6N5J30J2k30P2j40L2J42k28L69k09J80j73J80k56j3L50l14l5J38j86M7
1472a16K36j42p2J15r7pj60K14k1N6o0J33q5K68j98j21L6L6R4j43L7O8p1J84j46
1497C8l4P3p9O8J33L5l17K06j64O9q5k2O8OM4j49Q2J43l1P5j20J3n9j6O7k31J62
1524b5P3n8j22J40J97j21j94J53k6j93J7n4K82j93P3J4n4O0K0j31J63Q7r8j65
1548a55K69j95%K59j61R2k46j8J79k8m5J42o5K18l00P8P2r7P7j91K04k81K19k59
1572b32M96l36K09o4k25J64p3L6O5j47L1K4K49j2k07K05Q1k23j51P1J68q3j75
1595a29Q8l8k6J48n5N1r1l7M29j99j76p9Q1OJ33l0J46k59J8p4k08K74j62K79P2
1620A62k35j8J67k17J67P2p8j47J48K17j64J42k04P0L21l07q7j38J37l0J50n4
$$ plain form
1642 74 72 305 -207 -170 6 29 -5 289 88 -121 -15 65 -45 -7 51 -223 -6 123 -46 108 -35 12 111 -20
1666 -20 -11 -120 160 -12 52 80 -23 -189 -119 67 -42 -44 125 1 26 -4 6 239 12 163 210 -78 -148 -76 161
1691 161 24 211 -156 152 113 -147 58 141 21 192 59 -70 104 -145 45 -213 -192 89 -164 -53 203
1712 203 101 72 -288 78 93 89 -151 8 149 170 88 60 62 29 -30 19 173 -129 18 -91 154 -89 -132 -135 239
1737 239 52 50 178 -84 136 173 118 141 -144 83 240 200 172 148 -143 102 -258 331 149 -174 -39 -120 83
1760 83 -35 172 153 2 -51 235 -176 -216 18 -19 86 131 8 13 -68 -24 -79 -40 33 -231 -16 -78 -45 70 98
1785 98 75 -94 268 -78 94 -219 -25 -93 -121 165 85 144 25 161 42 16 -177 24 55 -28 40 16 72 -130
1809 -130 -46 131 -113 -42 -232 -118 -87 158 -173 -33 -25 0 134 274 158 -93 -41 47 217 134 -198 -210 -122 -25
$$ packed form
1642G4kK33n12L7J76K3l4K94k01k09J06Q0j10L8N8k74K17J29j69J54j43M7R9j31
1666b0Rj09K80j72O4K8j03j66P0J86j09kJ69j24K5l0J0K33k27J51M7k88p0P2K37
1691A61j37J87l67L08l9k60K05Q3j20J71j33j29J74k49J90k58K1K81k53J11K56
1712B03j02k9l60L66J5mk40J59J41K1q2k8Kl3n9M9J54l02J47j09K45k43m3lL74
1737B39j87kJ28k62K20L7n5K3k85K27J57m0k8k4k91K45l60N89j82l23J35q1K03
1760H3j18K07j9j51n3K86m11m0K34l7J05M5j23Nq1M4n5L9P3k64K15o2L3J15K8
1785I8k3j69L62l46J72l13J94o8k8K86q0N9j19J36j19k6j93K01L1q3O8k4N6k02
1809a30Q4J77k44P1j90J14L1K45l31J40QK5J34J40j16k51N2Q8J70q3l32j2Q8R7
$$ plain form
1833 -25 -142 54 -34 -90 -69 -28 -36 -61 -55 -8 41 147 -179 7 -171 56 -80 0 -185 -145 -50 100 201 106 69 17
1859 17 -49 -17 27 151 -194 -119 -41 -7 145 68 148 377 173 -89 -163 21 -74 86 97 -21 -142 3 105 117
1883 117 -19 102 -78 17 -17 41 167 168 85 21 -68 188 -90 -205 6 -192 68 -42 57 87 24 102 93 -131 -108
1908 -108 101 -74 27 90 75 -49 162 151 -29 42 -199 -115 -216 -41 71 143 -111 359 -68 -252 86 -41
1930 -41 -11 -52 -31 7 245 38 67 79 83 -101 32 105 -213 -150 89 164 -44 94 215 -267 7 268 -99 113
1954 113 -6 8 209 96 -31 -22 -94 -81 90 -116 177 136 -83 242 -30 74 307 29 272 237 -49 74
1976 74 -115 145 30 -161 -72 30 85 -113 64 -102 -121 -79 220 -206 101 123 59 -80 67 -6 -16 60 122 195
2000 195 -64 -20 -150 -218 230 -73 0 353 -150 -115 18 -112 -11 80 39 -75 -92 236 -113 -86 26 -178 64
$$ packed form
1833b5j17J96q8n6K1M1qk5OM7M9J06l26J86j78K27j36Q0j85M0R5J50J01r5l7n2
1859A7o6L2M4J24l45P5P8L4J52p7Q0K29k04k62p4J84r5J60J1j18j21J45J02J2
1883A17j36J21j80R5l4N8J26Jq3o4q9K56k78j15K11j98K60j10R9L0o3P8rk24K3
1908a08K09j75J01O3j5j24K11j1j80P1k41Q4j01J75J12P2k54M70m27j84L38j27
1930d1L0m1K1L8K38k07K9J2Mj84J33P3l18O3K39P5k08J38J21m82K74K61l67K12
1954A13j19J4K01j13j27Rp2J3J71k06K93m1k19L25k72J04K33k78K43l5k86J23
1976G4j89K60j15j91Q9J02N5j98J77j66j9M2K99m26L07K2o4j39J47p3j0P6O2P3
2000A95k59M4j30o8M48l03P3L53n03L5J33j30J01R1m1j14j7L28l49K7J12k04K42
$$ plain form
2023 64 107 14 -105 1 -52 225 -157 224 -48 -133 145 -15 12 53 -39 -26 65 -85 38 -105 -95 -17 -31 14 -70
2048 -70 -45 12 83 345 -17 -198 -67 6 -171 -136 48 -261 36 -309 20 -48 11 225 15 -10 -237 -169 77
2071 77 139 -66 -166 183 36 95 239 -103 -148 62 117 -35 -5 -150 -8 57 -47 -113 -65 231 51 16 186
2094 186 206 -55 97 65 380 55 -117 340 -110 26 81 -301 -127 -106 142 -88 131 -44 -51 24 145 330
2116 330 -65 26 84 -118 -317 173 -123 17 49 3 53 -197 -134 95 -153 16 -326 162 22 -49 61 -181
2138 -181 -235 -86 114 84 -82 -111 50 23 -8 66 -66 -135 315 -97 91 -9 -40 -83 145 107 62 211 -18 169
2162 169 37 -163 -116 -23 128 -240 -166 7 42 38 -96 -75 34 91 -11 -171 341 -156 16 282 86 -207 116
2185 116 227 -91 7 200 82 82 176 -53 -77 99 158 4 30 51 181 89 110 57 -118 -35 -149 107 -41 -58
$$ packed form
2023F4M3r3j19J06n3K77l82L81k72q5K78j60K7M1r2J3R1j50J23j43J0P8j4M5q4
2048g0K5N7P1K62l62j81J31P3j77L5J84l09K97l45L29o8N9K14k10k5k27O8K46
2071G7O2k05j00L49j47N9J44l42m5K10N5j52L0j45J42O5j04o6M8K96j80l5J70
2094A86K0k61J52l2L15l25j72M57m50J36N5l82J74K1K48k30K19j75pP5J21J85
2116C30l95R1N8k02j99M90k96J40L2m6N0k50O3K29k48J69l42M88j40p1J10k42
2138a81n4J49K00l0j66k9J61k7l1P4j32o9M50m12J88j00l1m3K28l8m5J49k29J87
2162A69j32k00M7R3J51l68P4J73L5mj34K1J09N7j02j60N12m97J72K66j96k93L23
2185A16J11l18R8J93j18%R4k29k4J76N9j54K6K1J30r2K1n3j75Q3j14K56j48j7
$$ plain form
2209 -58 59 51 3 -7 -135 -165 -26 -5 -148 -13 -174 54 70 159 10 -1 62 -71 214 -149 275 97 14 -105
2233 -105 -16 -116 152 0 21 40 -144 -214 -283 190 -43 10 -200 94 -115 50 24 -48 61 96 -59 164 227
2256 227 62 -238 -198 116 100 169 191 281 341 124 -149 -57 -48 -9 98 65 81 7 -149 -156 -135 -112 -57 64 -80 19
2282 19 57 -21 67 146 81 -152 14 106 212 -184 -49 -120 -138 72 51 -143 -34 -69 22 33 -108 -28 -220 371 -29
2307 -29 -85 -79 -170 95 -271 -75 -75 -89 20 23 -47 174 -25 -85 -57 -89 -86 19 -308 37 27 169 -180 10 226 -175
2333 -175 13 -292 149 48 73 -173 161 267 -301 40 108 -229 -114 72 -65 167 -56 23 34 83 87 -141
2355 -141 -18 -331 55 -172 74 3 -32 -4 -242 92 146 -14 -45 181 -27 -191 -148 -4 225 1 97 -118
2377 -118 -59 -47 -13 17 163 -12 51 -94 43 140 218 -338 -275 -84 -47 181 -229 37 -121 256 -287 83 253
$$ packed form
2209e8J17qm8j0j28l0J39K1j43J35j61K28J6Q9j49j1O3j33K85l63M24j78q3j19
2233a05Q9j00K68j52K1J9j84p0o9M73k33N3k10K94k09J65k6p2J09L5j55K23O3
2256B27j65l00M0L14j6O9K2R0O0k17k73R2RL9J07l3J6p4j56pK1K3N5J21j44R9
2282A9L8p8Q8P9o5k33J66R2J06l96J35p1j8K10k1j94J09l5R1J1j41Q0j92N91m00
2307b9n6Or1K65l66J96%j4J09Lp0K21j99o0K8l2LJ05l27L45j0J42l49J90K16m01
2333a75J88l05M41j01K5k46L34J06n68L41O8l37J15J86j37K32k23P9J1M9Mk28
2355a41J23l13L86k27K46p1l5K8k38L34N4j60l1K26k08j64M3J44K29k24R6k15
2377a18N9J2L4L0J46j75O3j45J37R7P8n56O3J91L7K28m10K66j58L77n43L70J70
$$ plain form
2400 253 16 -37 50 80 133 -105 -94 -228 -28 -64 -95 157 -83 57 -12 80 150 -69 190 277 196 -171 -54 88
2424 88 70 197 108 175 53 141 -55 1 258 72 23 -183 94 208 192 1 150 76 -16 133 -230 27 -2 140
2448 140 31 182 -167 23 -185 -117 115 75 -43 123 49 -257 278 117 9 -113 -46 -41 109 -41 10 314
2470 314 -165 132 84 43 257 -99 1 44 90 17 -14 107 21 322 41 -7 -151 21 133 7 41 -91 78
2493 78 24 8 -19 -77 -38 154 115 38 53 -8 -341 0 151 336 20 -187 142 -63 -159 127 34 -22 -22 -43 299
2518 299 -169 -36 82 102 15 114 235 -25 119 -270 -57 -75 46 -81 -133 90 121 -246 -40 35 -323 20
2540 20 -171 -172 -61 118 8 139 -69 197 -116 -49 -43 -38 81 64 -211 206 97 83 -128 -58 221 51 349 -85
2564 -85 77 -57 -59 -246 -64 -308 14 282 -54 -1 74 11 -26 136 161 -62 -121 -38 -106 -39 -224 39 109 -178
$$ packed form
2400B53k37n3Q7L0N3k38J1j34K00l6l1K52k40J40o9R2P0k19K59Q7q1l67J17J42
2424H8j8J27q9O7j22Q8j96N6K57j86m9k06K77J14j6j91J49p4r2J49l63K57k9J42
2448A40j09J51l49J90k08O8K32m0j18J66p4l06N35j61j08j22O7NJ50j50N1L04
2470C14m79K97m8m1K14l56J00M3M6p3l1J21q6L01k81m8j44J72J12j26L4j32J69
2493G8n4j6k7n8L9J92l9p7J5o1l33L41J51J85l16k07L29k05r6K86r3n6%k1L42
2518B99m68J33J18K0q7R9J21k60J44l89K13j8J21j27n2K23L1l67K06P5l58L43
2540B0j91jJ11J79j10J31k08K66l13O7ONJ19j7k75M17j09j4k11P0K79j70K98m34
2564h5J62j34kj87J82k44L22K68l36N3P5o3l7J62K5k23n9Q3o8O7j85K63P0k87
$$ plain form
2588 -178 -57 174 -103 52 -13 -90 81 460 106 43 -68 -136 -104 -27 -156 -49 -189 80 197 111 51 34 -194
2611 -194 1 87 -62 3 74 21 239 12 323 141 71 -316 30 152 48 -290 -107 220 -137 112 -98 90
2633 90 131 337 -21 -165 99 138 187 1 -31 -210 -27 34 -202 138 -211 36 -63 -135 -33 -56 74 258 43
2656 43 255 68 136 -145 -160 -111 -107 127 -24 248 83 -57 -38 -74 -7 134 183 -15 206 98 -85 -261 160
2679 160 181 86 20 -42 -90 -7 -205 -11 -196 -109 -74 131 -61 -165 166 181 244 -114 126 19 -21 -169 133 -16
2703 -16 -144 -1 170 -157 124 87 -196 -195 92 -35 -69 109 -138 180 50 -32 -39 154 21 19 243 -178 48
2726 48 4 30 -24 -221 -15 -16 76 -183 -96 -102 -102 -87 48 -312 -251 10 -309 161 -90 -109 182 202 -5 -260 49
2751 49 35 13 -20 34 79 -215 -25 -110 -6 -16 25 -79 224 203 116 -217 -8 -66 -318 89 87 24 22 -1 156 140
$$ packed form
2588a78J21K31k77J55o5p7J71L79l54o3j11o8L2P7j29J07j40K69J17q6o0j7k28
2611a94J95Q6j49O5P1n3K18k27L11j82p0l87L46J22j04l38J83L27l57K49k10J88
2633I0M1K06l58j44K64L9M9j86l2j79J83O1k36L40l49K47r9p2J02k3J30J84k15
2656D3K12j87O8k81j5M9MK34j51K72j65j40J9l6O7J41M9j98K21j08j83j76M21
2679A60K1r5o6o2m8Q3j98J94j85Q7L5K05j92j04L31J5O3l58K40j07m0j48L02j49
2703a6j28J43J71l27K81l7k83JK87j27l4J78k47L18j30q2pJ93j33kK24m21K26
2726D8m4K6n4j97K06jR2k59Q7o%J5J35l60O1K61l19M70k51j9K91K0k07k55L09
2751D9j4k2l3N4M5k94J90q5J04j0M1j04L03k1q7l33K09n8k52M07ko3kk3J57j6
$$ plain form
2777 140 -112 -52 53 -120 201 237 24 -98 -61 -203 8 71 -90 -111 -12 125 -253 24 -242 -91 -15 -41 5
2800 5 -93 -14 20 31 -7 149 146 -123 75 -96 13 108 -32 -75 223 109 -140 -23 17 56 104 -187 -79 214 38
2825 38 -110 -320 7 -136 -83 -80 -44 259 -182 61 -13 -102 -24 151 -17 -232 80 -11 -193 -200 128 -33 19 -211
2849 -211 46 164 105 -181 124 -18 150 133 255 -106 -90 63 -202 -18 -84 -160 -69 27 -45 -121 -20 91 86 -34
2873 -34 8 105 -161 37 -68 31 171 -141 96 137 -97 46 -317 7 -106 9 1 -104 -70 100 179 44 173
2896 173 150 -27 -106 -54 -10 5 -95 111 402 94 -63 41 181 41 -259 -16 -175 -171 126 -69 23 48 -215
2919 -215 32 -37 -82 230 -87 55 133 190 190 202 -21 162 -127 305 46 -93 -47 120 304 30 140 183 15
2942 15 -262 137 225 257 267 156 278 44 -20 177 -94 -89 51 200 99 -85 -56 -221 28 53 183 43 -15
$$ packed form
2777A40k52O0J05j73L21L6k13j22L7j42K11O3j61k1R9J37l78K77k66J51P6k6M6
2800Er8P9L4J1l8J56lk69J98j71J09R5j40m3K98j14k49J17M0L9M8k91J08K93j76
2825C8j48k10L27j43N3LL6L03m41K43p4q9P8J75j68k15L12r1j82pL28j61N2k30
2849b11K57J18n9k86L05j42J68j7J22l61J6J53k65J84o6p6R1R6p2p6J01J11nj20
2873c4M2R7k66J98j05R9J40l12K37M1k34J43l63L24j13J15qj05L4J70P9j35J29
2896A73k3j77p9N2M4J5j00K06K91l08j57J04J40j40l00K43j59MK97j95R2K5k63
2919b15K47o9m5L12l17J42P8N7%J2k23J83k89M32k59j39M6J67J84k74J10M3j68
2942A5k77L99Q8L2J0j11J22k34o4J97k71NJ40J49j01j84K9j65K49K5J30j40n8
$$ plain form
2965 -15 2 -91 171 -21 10 -234 -3 55 106 -150 -118 178 -100 227 80 127 -199 -50 -135 -174 69 -10 26 81
2989 81 -59 -55 177 45 206 7 -33 260 -167 180 -138 -1 101 93 85 -115 -233 25 -248 44 172 -251 31
3012 31 27 -33 36 170 118 24 22 -147 -101 39 -6 43 81 -137 -96 44 189 60 10 68 0 238 -100 257 -107 214
3038 214 -20 40 38 -35 94 -16 -49 -48 -119 65 16 -51 86 -356 -5 -98 152 -220 317 -69 -159 4 -36 -96 -176
3063 -176 -88 -37 -76 66 55 123 -108 -30 -63 245 -70 46 124 135 -149 -10 185 7 64 288 -26 -78 -32 3
3087 3 -190 26 12 -135 -94 39 108 76 -147 55 -103 -270 100 19 -50 90 -77 57 -178 69 -42 69 -99
3110 -99 -34 324 45 -247 61 -68 81 -79 -34 -225 -63 117 -212 -244 121 61 161 -96 -121 5 32 16 -7
3133 -7 55 51 -17 -129 -222 -82 301 136 88 -203 -41 270 -139 -135 -21 -83 80 231 75 -53 195 137 -295 -1
$$ packed form
2965a5J7r3K62j92L1k44K31N8N1k56L2K96k78L27j47M7l26J49q5l9K43p9L6N5
2989H1j40MK32j32J61j99m0K93m27L47l18J37J02qqk00j18K58k73K92J28m23K82
3012C1mo0O9J34n2r4kj69M6J40m5M9L8k18M1J40J45j29n0N8o8K38l38L57l64L21
3038B14k34O0kp3J29j10l3Jp1J84m9o7J37m42L51r3K50l72N37l86r0J63m0o0q0
3063a76Q8N1l9J42j1O8k31P8l3L08l15J16P8J1k84J39J95j78N7K24l14n2M6L5
3087Cj93K16j4j47M1J33O9l2k23K02j58j67L70q1o9J40j67J34k35K47j11J11j68
3110i9O5L58k79k92L08j29J49j60M5j91J62J80l29l2L65o0J00k57k5J26K7j6k3
3133gO2mo8j12r3J40L83j65m8k91J62L11m09MJ14o2J63J51j56j28K48n8m32K94
$$ plain form
3157 -1 -86 309 -172 -41 -166 -130 12 67 87 171 145 -94 -24 -151 -25 127 -113 -354 -128 -123 -288 -193 22 -179
3181 -179 -8 -34 72 -75 -104 -39 91 -186 78 52 42 62 31 -65 153 42 92 69 70 -26 -118 -143 -73 42 164
3206 164 120 -76 -216 -331 205 52 -80 226 15 -152 117 104 -150 -156 85 249 91 12 -59 -79 142 229 -126
3229 -126 -52 -148 -220 102 57 113 31 -97 -153 240 -233 38 20 -219 -16 88 -69 -362 -75 84 -21 0 -43
3252 -43 88 204 -71 26 80 100 -14 32 103 -116 209 -24 213 63 -4 -57 256 -25 -8 -327 28 155 6
3275 6 76 26 10 -39 67 137 -53 162 -58 -5 47 -15 9 -40 -118 -80 -120 -127 -31 71 282 -115 -138 -141 -42 -55 154 -85
3303 -85 -84 -7 -54 -184 228 76 138 -130 -74 119 -30 184 213 76 204 -231 -88 24 -8 204 14 255 146
3326 146 -6 -49 31 -81 -66 156 -31 -252 -59 21 -78 37 -25 -51 1 17 -30 205 -38 151 8 -58 195 97
$$ packed form
3157aq5L95m81J31j25L6J42N5K0Q4k6k39P0j27J26J52k40k41K26Nj65R5K15k01
3181a79J71k6J06j47k9O5J30k77K64k6j0K0l1r6K18j11N0k3Jr6r2k5P0J15J22
3206A64m4j96j40j15N36j53j32L06k11j67K69j3k54oK41J64j58p9p1k0K21Q7l55
3229a26P4r6p2L22m5N6q2j28n6L93m73K71j8k39K03J04j57k93K87J59j05K1m3
3252d3J31J16k75R7N4K0j14M6P1k19L25k33K37j50o7n3L13k81J7l19L55J27j49
3275FP0n0j6m9J06P0j90K15k20N3N2o2K4m9p8L8m0pR6J02K11l97k3lR9j3K09k39
3303h5JP7m7j30M12j52O2k68N6J93j49K14K9j37J28m35J43J12l2K12j90K41j09
3326A46j52m3Q0j12J5K22j87k21J93Q0r9J15o2k6N2J6m7K35k43J89j43o6K53r8
$$ plain form
3350 97 -48 -105 -166 116 -114 91 22 -85 -232 -95 146 14 -45 -34 -56 -74 22 -7 -110 -34 -1 -74 66 -148
3374 -148 -16 25 138 1 -251 -85 122 3 -145 -146 40 137 -79 30 296 102 196 33 -212 -146 -235 187
3396 187 121 -325 -96 40 121 59 89 21 -130 34 -200 276 242 79 51 22 70 131 75 9 149 146 130 -1 -14
3421 -14 -103 -119 -19 -336 -136 178 -48 34 72 -66 -84 -45 -70 129 30 -47 -354 280 -112 166 44 11 -130 139
3445 139 -116 -149 34 110 129 -331 -78 -383 90 -39 88 -172 268 -49 52 -112 -181 -6 -42 34 -392 -193
3467 -193 84 -131 -63 -169 -72 -22 -219 336 37 -154 -76 -35 94 149 -39 -94 -313 -80 -40 121 250 162 -146
3490 -146 76 -127 -153 79 -133 156 40 -113 -134 -105 -152 43 122 195 -21 -42 13 -237 167 57 189 70 -47
3513 -47 -88 143 122 28 348 -68 16 -75 30 63 -208 -328 -145 -112 203 197 -129 -70 23 -57 -64 6 209 255 -90 -134
$$ packed form
3350I7j45n7o1K82k30K05o9j07j47J37K41j32n9J1k2j8R6k9j03P6L3p3J40k14
3374a48J32M1J13j37k52J66K07j19j48jJ86R7k16J09K66j94R4j63k45O6q9M22
3396A87o6m46K29J36Q1o2L0o8j51J64k34M76l4j63k8k9M8O1n6o6J40lj6j31j3
3421a4q9j6J00l17K00L14k26Q2L8j38j8L9k5J99r9p7l07O34l92K78j22l3j41K69
3445A39k55l3J83P6J9m60K53l05M73j29J27k60M40l17J01j64o9J75l6P6m26J99
3467a93K77k15O8j06R7N0j97N55k99j91P8M1J29N5j88n5k19K33M0J61J29q8l08
3490a46K22k03k6K32k12K89j16j53k1K9m7J95P9P3k16k1N5k50M04j10J32j19j17
3513d7m1K31k1r4L20m16Q4r1J05L3k71j20J83L3L15ol26N9R3q0pP0K03M6l45m4
$$ plain form
3539 -134 -132 140 46 -52 11 165 -21 -6 -91 28 88 4 -74 84 33 -80 237 258 -235 202 118 -66 68 -171
3563 -171 -347 46 31 117 -185 -102 -56 -143 201 6 -51 67 154 -132 -55 275 -35 100 -110 -18 113 -19 -171
3586 -171 -5 66 -201 163 -144 -92 236 124 32 16 -174 -10 30 129 25 -78 164 -235 6 -19 139 221 240
3609 240 44 63 -132 103 -143 117 51 -298 101 35 -115 298 16 -319 -45 82 -162 -107 -87 176 -186 156
3631 156 -96 -145 80 -394 -3 223 -55 -310 -182 -48 133 225 -6 -169 -20 -9 182 -20 -37 -73 -308 282
3653 282 -141 49 -55 -218 0 -82 -214 280 -88 -91 -87 64 59 5 -80 161 136 -236 -143 -280 325 74 64 229
3677 229 20 -57 -98 56 -271 -15 150 221 262 -86 14 203 -246 -224 -228 97 -123 2 -30 -148 -303 112 37
3700 37 0 -85 -185 9 -90 33 -96 112 -64 7 149 -189 -92 246 16 -22 -179 28 118 -180 22 303 -78
$$ packed form
3539a34KK72r4r8O3J54j86J5q5J19O0q4p8J58n1j13L17K1m93M37q4j84J34k39
3563a71j76L93j5Q6l02Q3M6q7L44j95n7J18Q7k86P7L30l10J35k10R2J31j32j52
3586a71J66P1k67L64l07N2L28j12r2j6j90J64M0R9j04j03K42l99K41k5J58Q2J9
3609B40j96J9j95K35k46K60o6l49L99o6j50M13k82l35K74J27k44N5K0K63l62L42
3631A56k52m9K25m74L91K26k78k55J28J34J81R2k31j63J49J1J91k02j7l6k35N90
3653B82m23J90j04j63K18q2j32M94l68lMJ51nn4q5K41k5l72R3j37O05k51j0J65
3677B29k09p7m1J54l27K56J65P1M1l48J00J89m49K2mL25k20J25l2j18j55M15p5
3700C7l7q5j00J94r9J23j29K08j76P1J42l38R7L38k30l8j57K07R0k98K02K81l81
$$ plain form
3723 -78 255 87 109 186 171 276 -110 118 101 48 -38 -149 139 29 -19 76 174 -45 152 224 -80 -47 -30 -174
3747 -174 -3 32 -155 28 -62 -91 -270 48 -48 49 -146 67 33 -283 -12 41 -67 59 19 10 102 98 31 -17 106
3772 106 -19 127 -103 132 159 6 141 123 -29 -2 122 112 110 -152 -121 211 231 -28 -72 78 -245 -30 97
3795 97 46 33 -147 80 -158 -106 -96 -38 -169 17 -37 185 147 -53 102 140 -42 -71 -80 -89 140 147 -23 -70 24 67
3821 67 -331 238 -117 -160 131 -29 149 51 16 -134 395 73 -109 138 237 187 109 64 -111 137 254 240 189
3844 189 23 64 -2 -166 59 -135 142 -202 11 372 27 77 -77 -212 128 102 165 189 112 113 128 35 123 -139
3868 -139 80 25 -153 119 -111 -53 17 -8 124 7 80 -145 246 -65 -84 -97 -115 0 35 142 -53 70 -197
3891 -197 16 -92 0 -185 155 -146 152 -94 -40 -326 -71 116 -54 242 -105 162 18 85 137 -64 -115 71
$$ packed form
3723g8L33j68K2P7j5J05l86K28j7n3q6j11K88j10m8R5R8k19J97P2l04L3J7j44
3747a74J71L5j87J83r0k9j79L18r6R7j95K13l4l16K71N3j08J26m0rR2mo7m8J23
3772A06j25J46k30K35K7j53J35j8j52K7J24j0kk62L1L32K0k59m4J50l23K15J27
3795I7n1j3j80K27k38N2J0N8j31J86n4K22l8k00J55L8j82k9rrK29Pj70m7R4M3
3821F7l98N69l55m3K91j60J78r8l5j50N29l22j82K47R9n0p8m5j75K48J17j4n1
3844A89j66M1o6j64K25j94K77l44K13L61l45N0j54j35L40k6O3K4p7JJ5r3Q8k62
3868a39K19n5j78K72k30N8P0k5J32j17P3k25L91l11j9j3j8J15L5J07j95J23k67
3891a97K13j08R2j85L40l01K98k46N4k86K55J87j70K96l47K67j44O7N2k01n1J86
$$ plain form
3913 71 89 -118 95 70 6 130 104 -41 248 250 -43 51 53 81 -16 -12 134 -78 53 46 -126 -146 229 -29 236 -1
3939 -1 -304 -107 -103 -55 -65 269 197 64 -98 101 238 -31 59 94 68 40 373 224 -57 -1 49 193 -1 -85 -202
3964 -202 -3 -186 -19 7 65 73 141 154 145 75 199 247 44 -52 -123 193 130 292 -137 -30 -12 -39 167 41 -65
3989 -65 -114 44 17 -162 -418 -225 115 68 64 -136 -20 -323 -5 -241 -4 1 -152 130 337 6 -119 -320 70
4012 70 208 -103 -5 140 45 315 -82 -29 -55 -284 25 87 -50 35 44 -317 39 -187 -171 164 -233 38 -77
4035 -77 63 29 -259 -19 -342 8 -23 -15 -197 34 -28 46 31 -9 -51 53 -239 -24 397 335 140 197 -242 -121
4059 -121 107 154 73 6 -153 18 -32 -59 191 -74 -19 136 -69 -144 -111 -103 -132 41 -104 -156 -62 -121 117 -21 -12
4084 -12 42 71 39 307 15 26 30 18 213 62 30 -178 32 -69 -18 -5 -150 -51 159 17 9 96 -272 -9 -160
$$ packed form
3913G1J8k07K13k5o4J24k6j45K89Kk93R4KK8r7MJ46k12J31pj72k0L75k58K65k37
3939al03J97MM8j0L34p2j33j62J99J37k69R0L5k6k8L33j49k81N6N0J44j94q4j17
3964b02J99j83J67K6N8QO8J3rp0J24M8k03r6p1L16o3J62m29J07J8k7K06j26j06
3989f5m9J58k7j79k56J93L40m7mk00J16l03L18k36K37Nj53K82K07l31j25k01L90
4012G0J38l11R8J45r5K70l97N3k6k29L09O2j37Q5Rl61L56k26J6L35l97K71j15
4035g7J40l4k88K40l23L50l1Qj82K31o2P4j5m0m2J04k92K15M21o2j95N7m39J21
4059a21K28M7q1o7j59J71n0k7K50k65N5J55k05p5L3Qk9J73j45n2R4n9K38j38R
4084a2N4K9l2K68k92J1Mj2J95j51l2k08K10j01N1J3j45R9K10j42qQ7l68K63j51
$$ plain form
4109 -160 -58 -36 6 41 139 191 5 -30 -113 -206 68 -106 56 35 -116 -155 -91 -71 -122 -218 -64 96 19 113 34 -316
4135 -316 -108 -61 -12 -21 184 -80 1 78 -230 -119 90 49 29 157 212 232 190 -7 -20 171 58 1 89 -116 -100
4160 -100 5 -43 -84 67 -86 -56 -256 12 -178 201 -343 209 70 85 80 44 114 89 -221 22 133 -205 -57
4183 -57 32 -217 263 -198 -69 -41 25 -148 -342 -148 24 99 163 -219 149 -209 -51 113 111 -34 17 176 -337
4206 -337 107 -167 199 163 234 -102 -23 107 3 -19 82 53 -113 -267 26 -200 -11 95 -120 196 -96 235
4228 235 -97 80 -167 165 75 67 -104 255 -14 104 -35 25 3 -208 -354 114 86 -118 -137 6 201 -163
4250 -163 -177 157 82 -143 63 163 -145 -130 253 -136 -95 -85 219 51 28 -221 241 371 41 -42 132 294
4272 294 88 79 -320 -150 11 41 89 103 -130 -13 -6 -31 207 -170 -144 -26 -38 -138 -228 29 106 154 170 -252 -25
$$ packed form
4109a60J02K2M2L5R8N2j86l5q3r3K74j74J62k1j51l9O4K0n1r6J54J60p7R4p9l50
4135c16K08M7M9rK05k64Q1P7l08J11K09m1k0J28N5K0m2j97j3J91j13n7Q8k05J6
4160a00J05m8m1J51j53L0k00K68j90L79n44N52j39J5nl6P0k5l10K43J11l38J48
4183e7Q9k49M80m61J29K8O6j73j94J94J72P5O4l82L68l58J58J64kj45N1J59n13
4206c37M44k74L66l6P1l36P9J30j04k2J01k9j66j54K93k26J89J06k15L16k92L31
4228B35l32J77k47L32r0qj71L59k69J18j39O0k2k11j46M68k8k04j9J43J95l64
4250a63j4L34p5k25K06J00l08J5L83l89M1J0L04j68k3k49M62J30l30q3J74J62
4272B94k06rl99J70J61L0M8J4k33J17Pk5K38l77K6J18j2j00r0K57P7M8J6m22K27
$$ plain form
4297 -25 130 -89 57 -3 25 79 21 -197 219 -14 239 -196 -22 -167 -8 -24 20 -191 134 12 110 203 -105
4320 -105 -141 -32 227 -42 6 193 -30 -352 -5 -137 -38 295 119 83 -56 -146 66 160 238 -63 -66 -45 95
4343 95 -26 -53 -66 61 77 -4 -281 49 -130 -29 -192 -66 -164 -180 119 -123 110 7 -170 23 -220 56
4365 56 77 0 -170 -233 120 -104 -14 -163 -13 -6 42 42 102 -145 -94 -195 -153 115 -107 -39 -73 -88 116 209 214 51
4391 51 90 -58 -221 156 76 -20 -72 -41 87 -310 104 173 -6 258 324 -146 157 74 -97 9 6 89 -114 74
4415 74 -37 -199 104 -161 44 11 87 -299 153 -41 -111 84 15 -92 -33 -1 90 -164 118 -4 19 -119 118
4438 118 296 39 -100 8 -63 -75 7 -76 -46 133 -155 47 167 57 -96 -89 -52 -65 122 13 62 27 -60 -84
4462 -84 23 93 207 183 33 96 65 -181 164 -84 23 -10 -101 -17 137 -144 -15 1 -83 313 189 237 -173 -103
$$ packed form
4297b5J55k19J46o0K8N4n8k18M16k33K53m35J74j45J59j6M4k11L25j22R8R3l08
4320a05l6J09K59k69M8J87k23l22L47j32R9L33j76l6j39r0K12R4P8l01lK1J40
4343I5j21k7j3J27J6q1k77L30j79J01j63J26r8j6K99k42K33j03j77J93k43K76
4365E6K1p7j70o3L53k24R0j49J50PM8%O0k47N1j01M2K68k22O8l4j5K04R3Nj63
4391E1L9j48j63L77q0r6n2L1J28l97M14O9j79K64O6m70L03q3j71J06lQ3k03J88
4415G4j11j62L03k65K05l3P6l86M52j94p0J95o9j07N9L2R1k54K82j22K3j38K37
4438A18J78k57j39J08p1j2Q2q3L0J79k88K02J20j10j53PL7j3J87j09M9l5q7k4
4462h4J07P0J14k4j50O3l1k46L45k48J07l3r1Q4J54k81J29J6q4L96j24M8m10P0
$$ plain form
4486 -103 -57 33 31 -16 -83 -72 108 179 -126 -12 -162 -106 -258 78 63 -217 106 -46 76 -103 -314 40 -43 186
4510 186 -65 206 -86 53 -13 34 -25 152 146 -232 -1 -40 52 146 47 10 -158 -2 -114 -97 -6 93 118 131 191
4535 191 83 -55 167 146 311 97 -149 50 -31 -127 17 -75 68 168 -225 -34 71 -115 -51 78 -90 -93
4557 -93 -151 220 8 212 -209 11 178 -80 231 92 -21 34 -73 -331 40 -12 -215 47 258 182 105 -84
4579 -84 113 18 92 8 -6 -163 170 -54 -145 48 57 80 125 -291 -69 204 -98 -36 -96 227 -11 152 -82 233
4603 233 -35 -219 -67 -29 -38 139 271 -38 318 60 128 236 -110 29 -228 -105 50 157 -308 -63 -116 -242
4625 -242 -46 -206 13 -124 21 -51 95 -218 -89 81 29 247 15 6 -96 -176 -15 -34 -136 93 117 206 148
4648 148 -99 56 166 92 110 -78 -25 130 -56 -157 120 136 -71 -133 -112 40 80 26 2 36 72 10 244 -133
$$ packed form
4486a03M6R0km7o7J1J80P1l05J14j50N6j52L36j5k80L23j52J22j79k11L54q3K29
4510A86k51K71k92J39o6M7n9J77ol78K31l9R2R4r9l7j68J56j12J7R1R9K5J3O0
4535A91j08j38K22k1J65k14k46J99q1r6J44r2J43J00l93J91J05j86O4J29j68l
4557i3n8L71k12K04m21K20J67k58L11j39j13N5j07k58L71n2k03K62K11p6p7j89
4579h4J97r5P4q4j4j57L33k24r1J93RK3M5m16K22K73l02O2o0L23k38J63k34L15
4603B33k68j84J52L8rJ77J32l09L56k58O8J08l46J39k57J23J55J07m65K45n3j26
4625b42J96j60K19j37J45p2J46l13J29J70n2K18k32rj02q0J61j9j02K29K4Q9n8
4648A48k47J55J10p4J8j88N3J55j86j01K77J6k07o2K1J52M0n4k4L4L6o2K34l77
$$ plain form
4672 -133 40 57 68 -65 25 192 43 -273 61 45 71 -14 92 -14 122 70 -274 17 -60 -54 -20 244 -3 209
4696 209 -109 -204 237 -91 -254 -142 -114 82 170 -4 -85 227 -394 196 191 -149 68 21 81 22 -128 -36 40 128
4720 128 -132 -95 -140 -100 -105 67 -223 18 -53 49 -182 -160 0 -82 -14 -49 -34 -40 -207 34 83 0 -9 -226 47 -6
4746 -6 26 -34 -30 28 -97 81 43 -81 21 197 126 -113 -26 -46 125 367 2 132 173 54 56 -230 -83 -197 322
4771 322 44 -78 -68 -347 -169 189 15 -209 -240 101 -63 -163 -24 -184 105 -108 -122 28 273 -228 123
4792 123 290 -229 152 247 69 -32 172 306 54 -225 -2 205 49 -41 -246 -71 164 116 -131 -212 92
4813 92 160 -43 -27 -34 -64 4 102 193 38 -50 108 21 -132 154 -203 145 -28 -166 178 71 81 84 25 -178 10
4838 10 160 52 -4 -229 47 218 84 -133 80 164 -70 -26 -220 -108 -95 -89 -101 -57 -69 53 14 145 117 -4
$$ packed form
4672a33J73J7J1j33R0J67j49l16L34j6K6q5J06j06J36n2l44K91p7OL4K64k47K12
4696B09l18r5M41l28j63J12K8J96Q8j74q1L12o21N90nl40K17m7O0n9j50R2P6Q8
4720A28k60L7m5M0nJ72k90K41p1J02k31K2J60q2O8l5J5oj67K41M9q3rk17K73n3
4746fL2o0MN8j25J78l8j24J02J76p1k39Q7k0J71K42l65J30M1j19Kk86J47j14N19
4771C22k78j22J0k79J78L58j74k24l1L41j64j00J39j60K89k13j4J50K45n01L51
4792A23J67n19L81R5j78j01K04J34k52k79K23K07j56r0k05J75K35m8k47q1L04
4813I2O8k03J6pl0O8R8R1j55q8J58q7j53K86l57L48j73j38L44j07J0Ln9k03J88
4838A0J50j08n6k25K76J71j34k17K13Q4k34M4j94J12J3Oj2M4j2J22l9J31k8j21
$$ plain form
4862 -4 118 -122 -71 -155 2 225 4 -6 75 63 61 103 -43 -24 70 -330 -105 39 -92 -96 87 -7 33 172 -4
4887 -4 65 88 148 -140 -145 -13 86 -182 203 -44 17 18 134 -120 77 -23 81 211 39 -15 100 127 -10 -112
4911 -112 39 -85 47 -117 189 176 27 10 1 95 -11 37 -65 115 156 -190 -159 -132 314 52 171 71 98
4934 98 243 -177 -256 94 44 -127 19 194 196 -75 222 -21 62 -71 300 -76 -53 73 4 -62 49 122 -19
4957 -19 428 78 -21 -140 -79 -2 154 185 -80 -185 -182 -192 -19 27 65 -144 105 -225 -136 58 -46 35 14 -187
4981 -187 -58 -48 -20 224 165 17 -84 27 -63 -107 72 77 -79 58 -43 -169 -1 57 -61 44 97 149 -110
5004 -110 -116 75 142 39 31 -69 1 -100 3 372 9 -115 163 396 205 107 -94 78 -84 75 29 -16 214
5027 214 36 93 438 80 -156 -16 -21 6 -26 -76 -65 -28 123 71 80 -18 392 0 82 -228 11 100 -144 163 26
$$ packed form
4862dJ22k40N1q4J57K23k21j0Q1j2kM2j46J9R4m00K25J44j31mJ83r4M0J39j76
4887dO9K3O0k88nJ32R9k68L85k47O1JJ16k54J97j00J04J30j72n4J15K7j37j02
4911a12J51j24J32j64L06j3j49j7rR4j06M8j02J80M1l46L1K7M46k62J19j00K7
4934I8J45m20p9L50n0j71J46J75Kk71K97k43Q3j33L71l76K3J26o9o6J11P3j41
4957a9M47l50r9j19O1P7J56L1k65j05Lj0J73M6L8k09K49l30Q9J94j04Q1k1k01
4981a87J29J0K8K44n9j48j01J11r0m4J79Nj56J37j01j26J68N8j18J05N3N2k59
5004a10oJ91O7j03qj00P0j01J03L69l63j24K78K33j91r8k01J72j62J59m6m5K30
5027B14j78N7L45l58k36J40nK7l2n0J1L7J51n2Rr8M10l92Q2l10K39Q9k44L07j37
$$ plain form
5052 26 -154 15 -100 -151 -46 -125 -39 -68 169 -157 23 -242 -157 125 134 47 -319 94 -147 -67 -107 4 48 53 104
5077 104 118 -59 -67 3 -93 -35 -237 -99 220 38 -233 -93 -99 -162 216 51 -106 -69 24 -56 12 41 -86 -189 -29
5102 -29 -211 0 -34 64 35 -7 86 44 235 -167 -171 -152 153 143 159 -98 45 154 -58 -30 200 -14 13 -2 70
5127 70 -71 -59 -95 111 -142 87 57 -80 159 -341 -65 36 10 -21 -176 -6 -261 3 -39 -128 218 170 119
5150 119 70 -16 134 4 42 -45 -147 257 -54 -95 85 152 -69 -50 166 -43 24 99 208 19 66 -183 -207 55
5174 55 71 32 -173 7 188 21 103 -283 -144 -190 -132 181 -64 178 -139 62 21 -30 112 181 12 -197 256
5197 256 -135 -21 -95 83 206 174 113 24 -138 125 303 -13 -80 101 33 -126 21 73 -59 -154 244 21 34
5220 34 -129 -189 -44 -191 -266 -151 92 2 68 -261 -131 -49 -318 121 -126 124 150 188 -78 -73 68 -39 121
$$ packed form
5052B6j80J69j15n1J05p9Q6k9K37l26J80k65Q5K82Rq7l66M13k41Q0m0J11M4NN1
5077A04J4j77qP0r6N8k02J38L19j82k71J40oo3L78j65j57L7R3q0O8K9j27j03J60
5102b9j82K11l4R8k9m2R3m2J91m02mJ9L05j0J6k57J43J09k12K8K30k14K7j5P2
5127G0j41J2l6K06k53K29l0j37K39n00K76J01k6l1j55J70k55K64m2q9L46m8n1
5150A19m9q6J50j30L8q7j02M04l11m1J80O7k21J9K16k09O7P5J09j89M7k49k4K62
5174E5J6l9k05J80J81j67Q2l86J39m6N8L13k45K42l17K01m1n1J42O9j69k09M53
5197B56l91J14p4J78J23l2o1q9j62K63J78l16o7J81o8j59J47N2j32r5L98k23J3
5220C4j63o0J45j47p5J15K43r0O6l29J30Q2k69M39k47K50K6L8k66NJ41j07J60
$$ plain form
5243 121 25 -56 115 94 287 -8 -29 6 60 78 94 188 263 244 79 167 145 -16 188 92 -16 98 49 168 33
5268 33 -14 -118 -103 -28 10 124 -6 -37 82 119 170 36 -60 -9 -61 72 -84 76 59 83 48 -42 -151 -57 106
5293 106 -141 -10 -179 -29 302 -108 -333 -122 -389 -202 -157 31 205 206 5 -143 -181 176 -240 116 240
5314 240 251 26 -12 84 84 6 25 115 113 -139 -265 -270 -200 170 -155 3 -151 -142 27 8 -32 242 60 83 186 195 -290
5341 -290 -182 -51 -96 -54 -46 -73 -48 18 -92 -106 289 -136 -121 93 -158 109 95 -178 111 23 -70 -141 55 -37 134
5366 134 -119 -110 -62 -91 -216 -219 16 -46 -71 -51 -10 277 -22 -152 31 123 -87 12 -182 -69 257 -282 -84 139
5390 139 -27 -187 -226 -20 67 -92 12 60 -125 75 43 13 44 -230 -38 234 -17 10 307 -96 -95 38 4
5413 4 11 -113 -79 0 70 349 -63 -113 -158 -16 -69 58 -167 -179 -128 -50 27 -88 57 198 -33 -41 259 -225 53
$$ packed form
5243A21r6q1J71k1J93k95k1L5N4J8J6R4P5j9j65Q8k2j61K04r6j08J14m9J19j35
5268C3m7j04J5P5L8J14j30l1J19L7N1j34r6N1n2J33j56J60j7K4l5r0j09R4J63
5293A06k47J31j69J50L31m10k25K11k67J87M5J88J74Jk01j48l8L57m16L56J24
5314B40J1k25l8R6%p8J9R0kk52j26nP0L70l25J58j54RJ69j9m0K74j82K3J03Rm85
5341b90J08J31m5M2Qk7K5O6j10j4L95m25J5K14k51K67j4k73K89q8r3p1J96r2J71
5366A34k53RM8k9j25lK35o2k5K0M1K87k99j30J83R2k10R9j94J13L26n39J98K23
5390A39j66j60l9K06Q7j59J04M8j85K00l2l0L1k74J92K72k51K7K97m03JJ33l4
5413DPj24L4P9P0K79m12n0m5J42n3J27k25j2N1P8P7j15J45J41k31qL00m84K78
$$ plain form
5438 53 -172 -18 149 62 264 -83 -45 -16 -90 15 19 -69 -147 -78 -339 -201 -30 78 119 -18 247 189 218 -108
5462 -108 -24 77 44 78 46 6 5 -3 -111 -74 -114 -172 119 283 94 69 -168 65 -156 39 -107 164 98 246 212
5487 212 140 183 180 79 32 91 125 -140 -55 263 93 59 -116 128 -20 -41 71 -5 70 103 -56 -157 -102 226 273
5512 273 -117 -99 -62 -217 66 8 -33 -154 -26 165 -59 138 31 18 85 184 -23 -300 -180 -69 -244 129
5534 129 -90 -90 104 172 -193 72 93 87 -35 25 123 35 -79 -99 7 -162 -88 99 75 -138 144 -94 -74 46
5558 46 241 212 -12 101 -81 -78 209 -49 -87 30 -398 25 -165 -195 200 141 -112 8 -297 -47 187 -166
5580 -166 86 152 47 94 -17 71 -43 3 -30 124 62 -58 140 -59 14 50 -147 65 224 92 -131 -163 -151
5603 -151 4 -76 -170 -182 -170 124 8 46 -68 -105 53 220 400 157 -192 151 -237 135 -120 47 22 -46 -40
$$ packed form
5438E3k25J54J67q7K02l47L8K9p4J05Mq8p8O9k61J38J71J08M1j37K65n8K9l26
5462a08Q4J01l3L4l2m0jqj08L7m0n8K91J64j89k5k37K33k21J95j46K71o6J48l4
5487B12p2M3lj01m7N9L4k65Q5L18j70l4j75K44j48k1J12p6P5L3j59j01N5L28M7
5512B73l90J8L7j55K83n8m1j21J28J91k24J97j07j3O7R9k07k77J20J11j75L73
5534A29k19%J94O8l65K65K1oj22O0R8q8j14k0J06j69P4J87k4k13K82k38K0J20
5558D6J95k9k24J13j82LK87k58l8J17m28M23j90l0L95n9k53J20l05K50K34l53
5580a66K52O6j05M7j11Q8j14M6l3J54o2j20J98j99P3L6j97K12J59j32k23l2J2
5603a51J55q0r4j2J2K94j16L8j14l7J58J67J80k43l49L43l88L72k55J67k5o8O
$$ plain form
5626 -40 -44 -37 141 -33 124 170 -97 108 107 -93 -83 188 -82 125 -1 -332 227 -104 0 49 -150 57 -60
5649 -60 24 -70 18 92 160 92 -171 -28 -52 -13 165 35 -4 -50 194 171 -66 223 51 -141 62 5 -209 -90
5673 -90 118 121 -164 145 93 -93 79 -119 103 19 -44 63 127 172 79 -157 -32 -38 -74 21 146 -177 -57 75
5697 75 -151 25 -50 -14 86 61 -84 375 6 -113 -165 -96 -39 1 -95 -190 -60 144 53 8 5 -32 0 7 38 129 -121
5724 -121 -155 280 -83 -211 77 -116 -97 309 -169 -95 -112 189 -206 -9 137 -84 67 8 -123 296 -190 -121
5746 -121 205 36 189 -45 111 255 -78 -52 61 80 11 -61 -71 179 63 -62 -64 44 -80 -95 154 -118 -2
5769 -2 67 14 -16 18 -137 -36 28 32 -22 -249 -147 -240 147 -36 46 119 51 16 102 -70 -109 119 28 -239 14 -67
5795 -67 149 -11 25 -137 -39 85 252 61 -54 141 -125 53 -56 -320 -169 -285 161 83 71 13 -197 162
$$ packed form
5626d0mPJ78j74J57M6k67K05jk00J0K71k70K07j26l31N59l31J04M9j99K07j17
5649f0Q4r4Q8P4O8o8k63J43k4L9J78j30l9m6K44k3k37K89j72j92K03n7k14J19
5673i0K08Lk85L09n2j86J72j98K22q4o3J07O4M5r3k36J25ol6R5J25l23J20J32
5697G5k26J76p5L6J00k5j45M59l69j19n2O9N7M0r6r5J30K04r1m5ll7L2PL1R1k50
5724a21l4M35l63j28K88j93J9M06m78P4j7L01l95J97J46k21J51n9j31M19m86O9
5746a21L26j69J53k34J56J44l33K6J13J9o9p2j0K50j16j25kJ08j24j5K49k72J16
5769bO9n3l0L4j55J01O4Mn4k27J02r3L87j83Q2P3o8l5Q6j72l9K28r1k67K53q1
5795f7K16j60L6j62R8J24J67j91j15J95k66J78j09k64J51j16M46p8j2n8k10L59
$$ plain form
5817 162 192 -80 90 66 27 -87 44 24 19 -76 64 196 -52 -49 241 -65 -43 144 170 -74 21 165 -170 65
5841 65 4 219 194 120 -100 -13 -70 12 85 8 128 215 84 -75 -104 -136 35 48 -153 -46 0 339 44 23 49
5866 49 -282 -122 179 -17 -108 -153 279 -110 103 174 -113 124 -65 22 96 -55 -75 -43 143 399 -19 257 -150
5889 -150 -104 -64 50 -21 35 195 383 -57 -124 -59 -99 228 124 149 -68 -64 312 -106 180 221 -149 197 -117 -24
5913 -24 -350 -100 30 71 -187 -154 181 91 240 15 -76 -196 -42 185 -141 43 -110 -32 72 156 87 -82 33
5936 33 110 68 -45 3 -32 -57 75 -155 116 -192 -87 8 58 -26 104 88 29 148 -64 29 -286 -119 -147 -129 164
5961 164 24 189 59 -116 27 177 -71 104 93 114 99 -24 -79 35 -174 279 111 137 -173 6 -180 104
5983 104 80 70 -56 -204 14 -152 45 -9 -209 -118 44 -63 62 -77 -152 187 -35 132 -146 86 210 -175
$$ packed form
5817A62L0k72J70k4l9j14J31k0nr5J40J32k48LK90l06K2J87K6k44R5J44l35K35
5841F5o1K15k5p4k20Q7n7Q2P3p7J20Q7j31j59k9l2J71J3k01J07M6L39k95k1K6
5866D9l31J60L01j96r1m5M32l89K13P1k87K37j89Q7P4j51k0L2J86K56m18K76m07
5889a50M6M0J14p1N6J60J88m40o7O5m0L27j04K5k17ML76m18K86M1l70L46l14R3
5913b4l26K50J30M1k58L3L35r0J49k25r1j20J54K27l26J84j53P8J04Q4o9j69J15
5936C3P7m2j13M8l5k5J32k30K71l08J05R5N0q4J30j6n9J19k12R3l15J67k8J8K93
5961A64j40J65j30j75J43J50k48J75j1K1j5j23n5J14k09M53j68K6l10J79j86K84
5983A04k4j0j26j48K18j66J97n4k00R1J62j07J25j39p5L39k22J67k78K32J24l85
$$ plain form
6005 -175 -35 1 27 120 99 -132 158 191 -78 -78 -109 -237 -22 86 7 -99 121 -219 -161 -351 67 136 31 94
6029 94 -142 -54 -56 -137 433 -259 -138 -92 301 -109 -167 -245 -167 -42 -264 127 -260 -121 153 -77 -98 -101 -158 169
6053 169 -272 -7 -215 -8 110 146 109 -148 33 -72 8 9 117 -101 -291 131 -225 341 32 -36 -66 -162 109
6076 109 -29 -151 -132 -156 -147 -44 -93 37 51 34 -20 12 2 25 196 111 -38 -188 -67 -100 67 46 26 90 -59
6101 -59 -21 66 198 -28 -147 132 169 -92 170 -83 437 -106 -157 38 184 -38 -39 -31 -56 1 86 -68 -315 34
6125 34 45 88 -157 -50 29 111 -53 -41 -78 208 -169 -162 144 368 65 -91 141 -27 -138 -45 -219 -245 -106 82
6149 82 -36 369 15 13 162 142 -101 168 -37 -58 -107 -141 -35 -174 145 -78 -73 44 110 -221 424 -113 -2
6172 -2 135 -75 -306 41 68 -168 -60 -87 -32 40 185 -56 132 -109 -142 -69 90 -112 -228 -161 -13 -87 -187
$$ packed form
6005a75J40L6K6R3k1k31K90L3k69%l1j28K15J08p9j06K20l40N8j90M18O9j05O3
6029I4k36Q8kq1N70o92J21M6L93m10n8p8P8J25k22L91l87J39K74k30k1ln7L27
6053A69m41K65k08K07J18L6l7k57J81j05Q0JJ08k18j90M22l56N66l09o8l0r6K71
6076A09j38j22J9k4RJ03m9J30J4j7n4L2j0K3J71q5j49j50J21l3J67k1k0O4j49
6101e9L8Q7J32k26j19K79L7k61K62k53N20n43n1J95J46k22jQk5N7Q5j54k47L49
6125C4J1M3k45J07P9Q2j64J2l7K86l77PL06K24l03j56K32j68j11R3j74k6J39J88
6149H2j18M05l54kJ49k0k43K69k05k1m9l4J06j39L19k23NJ17O6l31O45n37J11
6172bJ37k10k31L47K7k36J08k7N5P2J45k41J88k41l3P3J59k02j16O7J48p4j00
$$ plain form
6195 -187 143 273 52 86 -27 49 -7 -51 35 231 -65 -15 -57 -72 -33 38 21 94 -55 15 4 14 -58 -178 37
6220 37 -100 193 -175 26 -73 -80 -23 132 -166 81 -155 218 32 -163 45 118 56 190 81 -254 59 -232
6242 -232 -76 60 -194 62 -51 43 -219 196 -113 -219 -179 166 17 -213 37 -40 147 162 115 111 127 222 -83
6265 -83 -72 113 126 -208 -93 88 -147 -62 -388 100 -19 -156 -253 -92 -144 35 -55 -33 -138 174 -2 144 13
6288 13 -187 65 92 -31 -54 -101 -112 42 -60 85 13 -98 -75 241 -20 19 1 -187 -73 89 85 -48 -155 148
6312 148 -84 -73 49 66 127 62 101 184 -32 -77 -232 125 -41 -47 164 -46 -29 -103 -100 -96 -239 -66 -94 -178 -142 62
6338 62 188 18 19 -3 -190 44 24 -15 -85 135 101 -2 31 86 -130 -7 -26 41 174 -108 24 20 6 -171 -126
6363 -126 -182 73 -24 -40 -50 -2 31 86 126 -20 88 -11 171 -37 232 -93 -45 -63 -149 110 -56 -44 106 -68
$$ packed form
6195a87L30J30k21L4j13P6n6m4Q6J96k96N0m2j5L9P1j7P3j49P0j1J0p2j20K15
6220C7j37K93l68K01r9pN7J55k98K47k36L73j86j95K08P3o2J34j09l35L13k91
6242b32J56J36k54K56j13R4k62M15l09j06M0L45j49k30K50p7J87J5m7mJ6R5l05
6265h3J1J85J3l34J15J81k35Q5l26M88j19j37r7J61n2J79r0K2j05L12j76J46j31
6288A3k00K52K7j23k3m7j1J54j02J45p2j11K3L16k61L9j8j88J14J62mj33j07L03
6312A48k32J1J22J7O1o5L9Q3k16m5j55L57j66oK11k10J7p4LMj43J73k8q4L6K04
6338F2J26j70Jk2j87K34k0l9p0K20l4j03L3N5k16J23j9O7J33k82J32mj4j77M5
6363a26n6K55r7j6j0M8L3N5M0j46J08r9J82k08K69l25M8j8q6K59j66J2J50j74
$$ plain form
6387 -68 -48 -138 -191 -96 -80 144 33 60 -203 -140 114 -181 97 -82 110 216 8 -187 -73 -134 163 -130 67
6410 67 79 34 -132 236 38 85 -60 -205 -59 130 125 10 124 -154 -35 -70 14 17 189 59 -123 -48 105 -95
6434 -95 -111 -52 101 -46 69 -39 95 115 -81 47 -211 -72 -93 -87 -130 121 126 -172 -72 166 201 -136 -11 -37
6458 -37 -29 -215 -12 76 99 -94 209 92 167 118 -81 203 48 -133 -174 -72 121 201 -276 -94 -89 6 190 3
$$ packed form
6387f8K0r0n3R5J6K24j11K7k63O3K54k95K78j79J92J06k08j95J14o1K97k93J97
6410F7J2m5j66L68j98M7j45j45J46J89nj15J14k78J19l5Q4LJ72j30j82P5J53k00
6434i5j6N9J53j47J15j08J34K0j96J28k58J39k1Om3K51Nk98J00K38L5l37J25k6
6458c7Qj86K03Q8K3j93L03j17P5m9j99K84j55j81m1J02J93Q0m77J82NR5J84j87
$$ [...]
8191a76
##END NTUPLES=NMR FID
##END=
