##TITLE=1H_SR166Et_TFA
 DMSO-d6
 48 sc, 
 18.4.2023
##JCAMPDX= 6.0         $$ Bruker NMR JCAMP-DX V2.0
##DATA TYPE= NMR FID
##DATA CLASS= NTUPLES
##ORIGIN= UXNMR, Bruker Analytische Messtechnik GmbH
##OWNER= root
$$ XWIN-NMR		Version 3.5
$$ Tue Apr 18 13:49:56 2023 Russian Standard Time (UT+4h)  she@DPX200
##.OBSERVE FREQUENCY= 200.13135
##.OBSERVE NUCLEUS= ^1H
##.DELAY= (6, 6)
##.ACQUISITION MODE= SIMULTANEOUS
##.ACQUISITION SCHEME= undefined
##.AVERAGES= 48
##.DIGITISER RES= 18
##SPECTROMETER/DATA SYSTEM= spect
##.PULSE SEQUENCE= zg30
##.SOLVENT NAME= DMSO
##.SHIFT REFERENCE= (INTERNAL, DMSO, 0, 15.7039)
##AUDIT TRAIL= $$ (NUMBER, WHEN, WHO, WHERE, WHAT)
$$ ##TITLE= Audit trail, XWIN-NMR		Version 3.5
$$ ##JCAMPDX= 5.01
$$ ##ORIGIN= Bruker BioSpin GmbH
$$ ##OWNER= she
$$ F:/spectra/data/she/nmr/H-F/1/audita.txt
$$ ##AUDIT TRAIL=  $$ (NUMBER, WHEN, WHO, WHERE, WHAT)
(   1,<2023-04-18 13:49:03.78 +0400>,<she>,<DPX200>,
      <continue with go, POWCHK disabled, PULCHK disabled
       configuration hash MD5:
       00 E9 B6 7A A2 85 ED C7 34 08 36 98 17 FE 4E 26
       data hash MD5: 16K
       10 FD A4 05 AB A6 79 8D B1 C7 82 DF 34 74 0B 9F>)
$$ ##END=
$$ 
$$ hash MD5
$$ 95 2F DF 9B 7E 76 AE E3 F8 65 46 1A ED A4 60 0C
##$RELAX= 
##$RELAX= 
##$RELAX= 
##$RELAX= 
##$RELAX= 
##$RELAX= 
$$ Bruker specific parameters
$$ --------------------------
##$DU= <F:/spectra>
##$EXPNO= 1
##$NAME= <H-F>
##$PROCNO= 1
##$TYPE= <nmr>
##$USER= <she>
##$AMP= (0..31)
100 100 100 100 100 100 100 100 100 100 100 100 100 100 100 100 100 100 
100 100 100 100 100 100 100 100 100 100 100 100 100 100 
##$AQSEQ= 0
##$AQ_mod= 1
##$AUNM= <au_zg>
##$AUTOPOS= <>
##$BF1= 200.13
##$BF2= 200.13
##$BF3= 200.13
##$BF4= 200.13
##$BF5= 200.13
##$BF6= 200.13
##$BF7= 200.13
##$BF8= 200.13
##$BYTORDA= 1
##$CFDGTYP= 0
##$CFRGTYP= 5
##$CHEMSTR= <none>
##$CNST= (0..31)
1 1 145 1 1 1 1 1 1 1 1 1 1 1 1 1 1 1 1 1 1 1 1 1 1 1 1 1 1 1 1 1 
##$CPDPRG= <>
##$CPDPRG1= <>
##$CPDPRG2= <>
##$CPDPRG3= <>
##$CPDPRG4= <mlev>
##$CPDPRG5= <mlev>
##$CPDPRG6= <mlev>
##$CPDPRG7= <mlev>
##$CPDPRG8= <mlev>
##$CPDPRGB= <>
##$CPDPRGT= <>
##$D= (0..31)
0 1.2 0 0 0 0 0 0 0 0.06 0 0.03 0 0 0 0 0.0002 0 0 0 0 0 0 0 0 0 0 0 0 
0 0 0 
##$DATE= 1681811152
##$DBL= (0..7)
120 120 120 120 120 120 120 120 
##$DBP= (0..7)
150 150 150 150 150 150 150 150 
##$DBP07= 0
##$DBPNAM0= <>
##$DBPNAM1= <>
##$DBPNAM2= <>
##$DBPNAM3= <>
##$DBPNAM4= <>
##$DBPNAM5= <>
##$DBPNAM6= <>
##$DBPNAM7= <>
##$DBPOAL= (0..7)
0.5 0.5 0.5 0.5 0.5 0.5 0.5 0.5 
##$DBPOFFS= (0..7)
0 0 0 0 0 0 0 0 
##$DE= 6
##$DECBNUC= <off>
##$DECIM= 32
##$DECNUC= <off>
##$DECSTAT= 4
##$DIGMOD= 1
##$DIGTYP= 9
##$DL= (0..7)
0 120 120 120 120 120 120 120 
##$DP= (0..7)
150 150 150 150 150 150 150 150 
##$DP07= 0
##$DPNAME0= <>
##$DPNAME1= <>
##$DPNAME2= <>
##$DPNAME3= <>
##$DPNAME4= <>
##$DPNAME5= <>
##$DPNAME6= <>
##$DPNAME7= <>
##$DPOAL= (0..7)
0.5 0.5 0.5 0.5 0.5 0.5 0.5 0.5 
##$DPOFFS= (0..7)
0 0 0 0 0 0 0 0 
##$DQDMODE= 0
##$DR= 18
##$DS= 0
##$DSLIST= <SSSSSSSSSSSSSSS>
$$ [...]
##$SUBNAM2= <"">
##$SUBNAM3= <"">
##$SUBNAM4= <"">
##$SUBNAM5= <"">
##$SUBNAM6= <"">
##$SUBNAM7= <"">
##$SUBNAM8= <"">
##$SUBNAM9= <"">
##$SW= 18.05172834244
##$SWIBOX= (0..15)
0 0 2 0 0 0 0 0 0 0 0 0 0 0 0 0 
##$SW_h= 3612.71676300578
##$TD= 16384
##$TD0= 1
##$TE= 0
##$TE2= 300
##$TE3= 300
##$TEG= 300
##$TL= (0..7)
0 120 120 120 120 120 120 120 
##$TP= (0..7)
150 150 150 150 150 150 150 150 
##$TP07= 0
##$TPNAME0= <>
##$TPNAME1= <>
##$TPNAME2= <>
##$TPNAME3= <>
##$TPNAME4= <>
##$TPNAME5= <>
##$TPNAME6= <>
##$TPNAME7= <>
##$TPOAL= (0..7)
0.5 0.5 0.5 0.5 0.5 0.5 0.5 0.5 
##$TPOFFS= (0..7)
0 0 0 0 0 0 0 0 
##$TUNHIN= 0
##$TUNHOUT= 0
##$TUNXOUT= 0
##$USERA1= <user>
##$USERA2= <user>
##$USERA3= <user>
##$USERA4= <user>
##$USERA5= <user>
##$V9= 5
##$VALIST= <valist>
##$VCLIST= <CCCCCCCCCCCCCCC>
##$VD= 0
##$VDLIST= <DDDDDDDDDDDDDDD>
##$VPLIST= <PPPPPPPPPPPPPPP>
##$VTLIST= <TTTTTTTTTTTTTTT>
##$WBST= 1024
##$WBSW= 4
##$XGAIN= (0..3)
0 0 0 0 
##$XL= 0
##$YL= 0
##$YMAX_a= 844524
##$YMIN_a= -459960
##$ZGOPTNS= <>
##$ZL1= 120
##$ZL2= 120
##$ZL3= 120
##$ZL4= 120
##$ABSF1= 10
##$ABSF2= 0
##$ABSG= 5
##$ABSL= 3
##$ALPHA= 0
##$AQORDER= 0
##$ASSFAC= 0
##$ASSFACI= 0
##$ASSFACX= 0
##$ASSWID= 0
##$AUNMP= <proc_1d>
##$AZFE= 0.1
##$AZFW= 0.1
##$BCFW= 1
##$BC_mod= 2
##$BYTORDP= 1
##$COROFFS= 0
##$CY= 11.3945322036743
##$DATMOD= 1
##$DC= 2
##$DFILT= <>
##$DTYPP= 0
##$F1P= 15.7292609196834
##$F2P= 12.9074282941183
##$FCOR= 0.5
##$FTSIZE= 0
##$FT_mod= 4
##$GAMMA= 1
##$GB= 0.15
##$INTBC= 1
##$INTSCL= 1
##$ISEN= 128
##$LB= 0.24
##$LEV0= 0
##$LPBIN= 0
##$MAXI= 10000
##$MC2= 0
##$MEAN= 0
##$ME_mod= 0
##$MI= 1.114404
##$NCOEF= 0
##$NC_proc= 0
##$NLEV= 6
##$NOISF1= 3.799351
##$NOISF2= 2.8
##$NSP= 1
##$NTH_PI= 0
##$NZP= 0
##$OFFSET= 15.70392
##$PC= 1
##$PHC0= -19833.04
##$PHC1= 12.60081
##$PH_mod= 1
##$PKNL= yes
##$PPARMOD= 0
##$PSCAL= 0
##$PSIGN= 0
##$REVERSE= no
##$SF= 200.130013532006
##$SI= 16384
##$SIGF1= 3
##$SIGF2= 2
##$SINO= 400
##$SIOLD= 16384
##$SREGLST= <1H.CDCl3>
##$SSB= 0
##$STSI= 0
##$STSR= 0
##$SW_p= 3612.71676300578
##$SYMM= 0
##$S_DEV= 0
##$TDeff= 0
##$TDoff= 0
##$TI= <>
##$TILT= no
##$TM1= 0
##$TM2= 0
##$TOPLEV= 0
##$USERP1= <user>
##$USERP2= <user>
##$USERP3= <user>
##$USERP4= <user>
##$USERP5= <user>
##$WDW= 1
##$XDIM= 8192
##$YMAX_p= 0
##$YMIN_p= 0
$$ End of Bruker specific parameters
$$ ---------------------------------
##NTUPLES= NMR FID
##VAR_NAME=  TIME,          FID/REAL,        FID/IMAG
##SYMBOL=    X,             R,               I
##VAR_TYPE=  INDEPENDENT,   DEPENDENT,       DEPENDENT
##VAR_FORM=  AFFN,          ASDF,            ASDF
##VAR_DIM=   8192,          8192,            8192
##UNITS=     SECONDS,       ARBITRARY UNITS, ARBITRARY UNITS
##FACTOR=    0.0002768,     1,               1
##FIRST=     0,             0,               0
##LAST=      2.2672688,     0,               0
##MIN=       0,             -459960,         0
##MAX=       2.2672688,     844524,          0
$$ Real data points
##PAGE= N=1
##DATA TABLE= (X++(R..R)), XYDATA
0 0 0 0 0 0 0 0 0 0 0 0 0 0 -48 48 -48 48 -48 96 -96 97 -144 183 -192 240 -288 336 -384 432 -494 576 -665
31 -665 756 -855 961 -1095 1228 -1381 1540 -1719 1920 -2141 2379 -2640 2922 -3230 3566 -3943
47 -3943 4342 -4791 5276 -5809 6404 -7057 7790 -8605 9528 -10582 11783 -13186 14843
60 14843 -16827 19265 -22343 26355 -31861 39886 -52734 76759 -137350 651905 844524
71 844524 -200064 -126798 -17522 342423 576380 505541 88625 -146746 -354019 -162383
81 -162383 293450 372609 -138191 -459960 -428460 -178334 66063 65709 -222554 -338130 -276183
92 -276183 -189935 -29034 125909 -22587 -224071 -161305 52331 147591 106955 13053 18103
103 18103 100161 107767 61214 131481 200951 105251 -13990 37736 160667 162861 30106 -59634
115 -59634 2664 82685 23426 -78322 -65698 -12656 -51666 -110842 -88759 -39309 -42745 -93515
127 -93515 -117427 -58670 1547 -39698 -86874 -26767 33531 1512 -32386 5976 58488 62334
139 62334 18476 8923 73840 90216 17438 7619 77161 75313 11800 -11525 8999 41556 33682
152 33682 -34224 -51543 15225 15680 -57837 -53968 -61 -4697 -42303 -59607 -37145 13323 8474
165 8474 -57090 -47749 24888 18528 -26605 -7950 24919 24161 7963 -6559 11003 48210 28648
178 28648 -15945 5396 44126 21401 -8794 1783 20925 17205 -6825 -21747 3533 22377
190 22377 -10869 -36567 -7757 15988 -7700 -31088 -19264 6377 4000 -22655 -25265 5638
202 5638 15481 -12725 -24100 3458 21036 3977 -13675 -1889 20414 16443 -5547 -5805 18802
215 18802 22732 -2041 -9799 11368 19805 448 -12230 -1084 12253 3629 -14040 -10823 7536
228 7536 5576 -15701 -15825 3834 5993 -9748 -14084 -3032 7915 17 -13719 -4975 12446 6335
242 6335 -11505 -4823 11409 10162 -3176 -6523 5996 14134 2949 -9207 1626 14845 4935
255 4935 -8547 -2133 8383 5034 -5508 -8665 1128 6137 -3845 -11124 -1282 5814 -2777 -9447
269 -9447 -3669 5193 2061 -7288 -5288 5507 5838 -4332 -5444 4089 9042 -447 -6487 2508 9772
284 9772 3092 -5303 -1059 7697 5441 -4065 -4136 3667 5962 -1611 -6922 -67 4709 -825 -7352 -2772
300 -2772 3674 1003 -6452 -4216 2233 1910 -3125 -4040 2414 4733 -869 -4127 952 5182 1581 -4033
316 -4033 -502 5541 3393 -1752 -1596 3381 4407 -1506 -3424 1778 4072 -24 -3510 -588 3301
331 3301 660 -3366 -2591 1885 1578 -3259 -3379 345 1795 -1398 -3932 216 2641 -690 -3751 -238
347 -238 3506 2257 -1958 -1783 2893 3002 -810 -2198 1795 3307 133 -1750 720 2371 1061 -2197
363 -2197 -1359 2340 1341 -2056 -2372 858 1601 -1137 -2817 -565 1721 -745 -3086 -303 1713 609
379 609 -1765 -387 1738 1271 -1111 -1224 769 2395 -277 -1578 600 2028 -17 -1944 -842 1558
395 1558 714 -1372 -1270 1070 1820 -1082 -1802 538 1279 -196 -1193 -1037 316 152 -1904 -818 775
412 775 1056 -884 -1146 833 840 -238 -771 -47 816 639 -1140 -127 1414 495 -1187 -493 1015 57
430 57 -244 -617 19 1181 -253 -1270 -508 913 -118 -1113 -358 572 751 -552 -656 265 1563 27
448 27 -1445 62 1269 -313 -946 -197 415 1090 -80 -370 809 1207 -554 -782 281 1081 -20 -537
466 -537 -834 198 301 -1092 -1032 378 409 -628 -285 178 404 -407 -517 -73 49 889 -1004 -35 439
485 439 503 -421 -586 1185 733 -51 -82 120 723 413 -336 37 927 -158 -677 -115 -40 -37 -244 -1110 99
506 99 207 -349 -937 -314 263 -514 -763 43 229 125 321 -97 481 518 226 -579 875 534 -80 -169 632
527 632 343 596 327 95 405 514 -204 -742 13 -456 -1025 -514 -334 16 -87 19 -630 -161 517 -302
547 -302 -874 -11 -19 -128 -213 -519 178 347 18 -123 149 282 -206 388 855 170 208 -241 281 -28 387 213
569 213 133 233 285 -582 284 235 -435 -21 147 -87 -180 -63 -709 -167 657 204 -789 181 276 -190 278 50
591 50 -492 342 -332 -520 627 109 150 738 283 -215 223 -74 437 407 815 408 -123 241 -90 -43 -133 106
613 106 -77 84 -421 -384 -122 189 -72 576 -359 505 -274 109 95 472 273 144 -835 222 152 -398 257
634 257 -220 -42 -40 123 58 270 347 -447 709 -198 -298 81 286 376 704 -209 14 165 -15 256 -792
655 -792 -74 -216 520 -211 -408 358 440 -88 150 -478 -10 -375 -203 20 194 -61 -159 379 -381 -114 41
676 41 -178 231 -88 240 114 272 -284 -336 111 -518 131 -82 -232 -336 -332 229 -12 140 10 -253 -120 -115
698 -115 -174 -79 163 -300 -799 196 143 836 264 105 -147 -119 739 -340 155 724 -334 462 -606 372 43
719 43 30 14 57 -9 -166 247 116 519 41 278 -27 -578 237 259 -329 -491 247 -184 669 -171 22 -110
741 -110 746 72 -405 -660 -428 122 551 -424 182 135 -179 -51 -356 125 227 -33 85 -77 -310 -102 -102
762 -102 -335 -16 -117 451 519 -257 341 -185 715 -117 -165 318 22 243 193 -91 95 2 -13 106 476 -386
784 -386 -235 186 299 498 -121 -531 127 -378 -316 -136 89 -236 60 -125 -89 601 -263 55 127 -132 329
805 329 137 -50 582 100 178 199 -176 -123 -164 3 18 150 204 -399 -163 74 26 267 -242 379 219 -242 39
828 39 205 -53 -360 -1012 -304 -513 36 -220 -482 -286 449 -14 -145 310 -319 -334 -477 -382 -65 177 -585
849 -585 -176 136 448 -582 -151 -73 -31 -510 351 -6 -379 28 -92 30 -86 54 -639 -224 -110 193 -102
870 -102 2 439 -97 -13 147 215 -50 -480 -168 -428 -262 337 -20 166 -574 65 -158 37 491 190 332
891 332 149 -458 -261 323 155 -99 -148 -493 322 59 513 740 98 181 86 40 13 -59 -184 523 -153 12
913 12 -4 707 -119 -946 376 -92 -329 -25 -300 44 -209 373 -329 584 140 -337 170 -218 -233 544 -72
934 -72 -579 190 -439 368 -73 -210 -428 -133 -232 -687 -308 -484 -300 -51 -372 282 -342 500 -429 -115 60
955 60 247 263 -467 -142 -41 101 82 63 -241 25 460 -262 83 -73 -304 130 -140 96 95 831 -143 -11
977 -11 96 122 -485 -312 169 22 -8 -103 287 99 615 -534 280 64 408 -420 555 -54 534 -66 -213
998 -213 -6 625 117 795 119 -386 117 242 126 -53 -47 -629 223 -175 -32 -185 488 320 437 -368 313
1019 313 159 41 478 -476 51 32 -273 528 -70 46 237 -173 -22 293 -181 191 -32 57 114 -97 433
1040 433 -576 277 -170 683 -127 -76 -15 165 -225 -203 -123 -54 -124 345 -839 93 -326 364 23 -188 189
1061 189 287 315 412 511 71 68 -214 -128 305 487 -81 -916 -438 14 -228 -144 -30 -234 -7 475 -1 22 245
1084 245 312 101 415 353 513 -499 114 -539 -263 -77 -705 62 806 503 -340 194 -259 -254 8 -338 348
1105 348 -606 -268 62 650 -702 215 -61 -460 652 267 -67 456 228 485 407 181 -115 336 -286 -416
1125 -416 -265 -128 61 30 117 -79 294 -326 -794 -710 -152 -62 62 -425 204 -497 -311 768 -484 67 -372
1146 -372 591 62 -66 438 210 -376 138 160 -175 -276 125 -608 -190 -632 -95 206 48 -8 33 -798 396
1167 396 688 5 142 141 183 184 -10 -23 -271 -533 61 191 -61 -491 -282 -459 -342 73 -40 -82 327 64
1189 64 91 267 168 -124 -670 -60 -78 -19 -235 -284 -196 305 542 -529 56 60 222 12 8 541 -226 173 28
1212 28 -115 -421 -285 -800 50 54 216 409 136 -459 88 55 -357 348 520 -106 151 57 202 525 -162 361
1234 361 -82 -169 140 -465 294 27 -198 -329 345 111 -488 -455 -632 -109 -288 212 -398 148 -506 -265 -214
1255 -214 -537 -413 74 -400 -166 -182 764 6 -231 41 -338 242 67 160 -139 -258 -220 69 -274 639 367
1276 367 -496 -530 505 -386 104 -903 43 -677 82 -26 120 129 203 649 215 -240 -101 -403 508 35 -379
1297 -379 -504 342 -120 334 -332 -215 -152 184 206 -743 -447 -508 -440 -328 104 -110 54 -58 -262 252 132
1318 132 -143 -127 -159 -182 79 104 289 394 1007 -50 511 -525 242 146 31 -177 -338 -362 48 903 -528
1339 -528 365 -432 -99 -137 -162 -93 -587 278 -48 -100 94 84 39 -37 -192 71 -29 216 -234 478 397 228 355
1362 355 285 60 -135 727 329 170 150 -291 -62 -487 -293 -422 237 -17 -97 -348 78 489 -837 181
1382 181 155 -354 -126 -272 92 -383 341 374 643 -231 123 114 -746 -258 394 -677 -611 -244 -93 -10 528 308
1404 308 -642 -346 -341 -6 341 470 421 -212 13 -222 -448 -313 945 618 383 -86 -605 102 -211 359 -150
1425 -150 -424 -300 130 -396 -72 429 205 226 128 434 -383 -190 -574 -303 -329 180 98 -13 -557 235 228 113
1447 113 366 -313 219 -385 -1 -195 -327 128 -305 463 6 105 -6 -43 -785 -308 -750 43 -606 -155 -7
1468 -7 83 -81 616 -400 355 329 -771 212 243 549 -111 -232 -288 -208 425 262 323 -268 -222 -113 -738 -175
1490 -175 -275 -221 25 -424 154 -251 126 -120 -356 287 242 -376 -16 -380 11 -326 -3 -342 548 46 -522
1511 -522 367 152 -337 229 -200 275 119 353 630 79 466 81 387 177 96 -167 -74 9 -427 -185 -234
1532 -234 -238 488 66 -180 64 127 23 140 -227 -69 719 317 -43 119 -182 11 -235 -350 -125 -128 -40 -169
1554 -169 -575 120 -38 157 16 569 -19 -25 -60 337 192 81 163 -258 443 400 83 351 -88 -58 61 438
1576 438 -246 184 291 -102 420 622 -8 -56 -523 725 -120 171 -383 -200 -12 -77 223 -116 -164 -98 -177
1597 -177 232 -59 -328 -343 -184 21 122 -15 52 -2 416 -244 -46 7 24 242 -80 447 -365 -136 429 291
1619 291 140 321 -383 418 166 76 -43 -158 151 -329 -267 151 -231 -104 -81 -285 467 -37 -140 825 -101
1640 -101 82 -411 -153 -142 112 -350 -569 85 331 -451 86 -27 291 140 -142 -178 327 -279 -356 272 326
1661 326 326 129 -19 -248 264 559 4 -394 -144 -372 253 24 -502 -236 187 81 -38 -204 89 26 -384
1682 -384 218 -63 -45 53 -309 -382 -283 -218 353 -453 -187 543 -218 118 273 383 -275 76 347 89 -283 -339
1704 -339 -124 -32 417 -104 -292 336 -125 -761 -774 -289 326 70 -112 -427 557 333 73 -306 -96 -152 374
1725 374 -71 -112 -78 -199 -482 -2 206 -411 557 43 24 -276 118 148 -173 -116 183 -125 467 -303 611 86
1747 86 -330 63 158 273 480 -464 187 6 319 19 137 -214 -640 284 187 -130 331 -92 -309 -68 584
1768 584 420 -109 65 -335 -9 94 -436 732 -344 -256 -25 -116 35 -723 -213 18 -75 -82 501 -7 155
1789 155 -479 308 482 451 -34 -17 -67 -586 -418 104 -560 -37 367 -220 5 -481 29 -201 -549 472 88
1810 88 429 -182 309 61 282 131 208 -207 315 -95 375 -526 -374 -185 166 -272 575 -134 -203 279 177
1831 177 -213 -241 31 10 335 -359 -31 -675 205 -236 -312 437 -8 -172 -256 -685 223 -207 -543 30 -250
1852 -250 -429 -450 -199 -588 -234 -61 359 188 14 208 -470 254 405 -778 -184 492 -176 226 133 159 -37
1873 -37 -74 570 -355 454 174 -145 -165 153 -257 -728 -275 147 654 -397 165 182 296 224 -97 -362 125
1894 125 5 89 -215 323 189 29 -163 375 -388 -145 463 -159 -384 -237 703 -83 118 15 172 268 411
1915 411 312 59 128 154 -479 149 -273 -42 142 83 35 406 195 150 85 26 -477 419 20 269 -145 198 -87
1938 -87 255 -314 96 -129 -96 27 -950 -141 -126 395 -38 94 -254 612 102 -202 -357 -451 -38 157 147 68
1960 68 -114 -44 -199 -512 162 30 -187 113 -386 -118 453 -429 -110 -28 268 -317 -308 514 408 211 24 -331
1982 -331 -343 -265 -429 -58 -409 -402 -103 -314 318 77 -892 178 -31 -589 -187 -188 -179 -118 -54 -139 373 -170 544
2005 544 -410 71 165 72 -383 -513 -330 -477 119 -25 79 215 -736 92 -41 -480 -109 172 210 25 41
2026 41 47 -104 -259 426 411 296 -255 -691 -248 -114 -371 70 -287 147 -212 -40 246 134 537 61 -104
2047 -104 592 -123 874 185 -105 -276 518 639 -670 -393 176 16 -313 -388 -36 -145 108 -129 592 -470
2067 -470 -60 -519 114 525 -76 -188 -81 258 274 -103 136 261 543 343 146 393 -103 -676 -371 122
2087 122 -440 -63 -12 129 -536 130 -29 -350 -511 -422 -59 250 -287 114 224 36 -162 -280 -142 -362 8
2108 8 751 -207 -1191 -553 203 29 305 273 87 352 -71 181 239 -26 -187 211 -80 36 -56 367 123 -271
2130 -271 75 119 -588 -288 -543 -209 265 149 -657 -256 -683 367 -604 280 -68 93 116 -70 -611 -291
2150 -291 -280 433 -90 328 252 -29 419 274 202 -868 -164 -464 87 615 -63 177 -28 280 -376 -774 102
2171 102 -382 -326 169 724 231 278 97 -103 346 230 -311 9 293 692 -407 -124 142 166 -430 164 81
2192 81 -185 644 -185 30 410 152 -29 241 321 -25 -303 121 311 284 13 -383 42 153 139 202 509 -143
2214 -143 -27 173 226 -292 -17 -529 33 -765 -308 -617 -51 249 663 -202 -52 561 55 -54 -534 794
2234 794 -29 -140 -104 391 85 -28 -268 47 250 -460 -129 -287 125 -50 -177 -56 -579 158 679 -43
2254 -43 -84 -125 136 -76 -236 -262 -383 -341 -73 397 -44 78 -60 -90 318 -20 204 36 -67 -132 15 -648
2276 -648 125 127 -615 -275 323 181 -236 420 75 104 191 171 -80 492 -200 272 -209 -430 22 -90 167 585
2298 585 179 -468 66 -141 -108 380 -144 46 -549 9 -457 295 115 -58 61 -343 -69 -48 180 655 182
2319 182 59 -376 -215 -52 499 205 -469 382 -400 236 158 47 -132 -265 -33 -292 292 137 302 394 521
2340 521 -497 -543 -297 311 -422 -463 1009 -104 -204 -552 -32 338 312 -439 -202 -206 -180 74 483 -281 -94
2361 -94 11 -487 33 1 -19 399 89 -102 -316 203 160 -190 397 -324 -650 -680 -350 168 -46 -761 289
2382 289 -82 -421 -137 -447 -225 722 -474 300 -83 94 -81 370 -193 470 -3 -812 136 -166 25 -456
2402 -456 -384 78 -225 728 292 -225 -202 -206 -121 -492 634 -232 -771 -32 -66 383 370 -545 -121 -269 -391 410
2424 410 163 -49 96 -28 12 -307 -113 -22 571 239 -137 6 617 474 506 171 44 260 -161 450 153
2445 153 -293 160 -83 -111 169 -176 165 -110 417 148 287 -346 -338 262 -22 -173 492 -213 -179 600 -237
2466 -237 363 -55 -188 415 -713 -180 -150 -207 -11 -307 841 -356 159 -100 212 -101 -671 -355 -445 137
2486 137 -581 -342 -190 84 426 -265 -271 -299 -188 192 -488 75 271 -229 -476 -268 -311 319 184 -587 -1024
2507 -1024 -487 266 -470 6 -89 708 -133 -81 0 362 40 -172 91 327 -631 -159 489 139 456 93 -440
2528 -440 -193 184 36 494 411 -186 216 -437 222 40 -30 305 -66 112 -418 321 -988 192 31 307
2548 307 215 -202 6 81 195 303 61 -61 561 57 436 94 295 46 82 72 142 309 70 -138 -246 400
2570 400 116 546 157 57 -891 -36 136 258 223 99 22 406 158 396 146 -23 140 -113 63 -440 -654
2591 -654 -153 321 -50 53 549 -367 -239 678 313 -385 188 40 447 -426 236 -160 185 -200 260 -43
2611 -43 498 316 -11 -4 730 329 -6 109 83 439 121 -112 -88 9 -481 -140 -113 225 -295 -303 11 127 124 293
2635 293 -393 -275 -205 10 -119 -507 -412 193 165 -271 159 499 -54 -242 102 -691 -211 300 -373 166 163 89
2657 89 39 146 208 357 53 -46 -721 -4 114 -589 -266 122 312 -313 -445 321 260 319 -251 -112 -175 796
2679 796 -459 -477 -674 187 -121 -226 409 258 -259 577 -62 256 305 124 -180 93 61 142 231 356 334 315
2701 315 -487 -87 224 182 -47 -442 298 157 -261 -280 -174 -131 -99 4 -553 158 16 81 420 68 753 129
2723 129 287 51 -67 -37 -392 346 54 192 176 228 757 -420 292 127 151 -461 -178 -217 -31 180 99 -85
2745 -85 -232 281 -178 -275 65 -301 -182 454 485 320 -634 165 81 246 -544 -150 249 72 -151 343 -187
2766 -187 204 630 -110 96 161 172 54 21 616 434 -300 328 -107 -208 -397 143 -68 -331 -226 598 488
2787 488 371 -20 -181 122 110 167 -285 -179 276 477 -420 294 -195 229 -278 207 107 -317 -154 -444 282
2808 282 432 494 -78 51 -137 236 356 14 -586 -447 149 362 131 -41 201 -79 200 -133 633 -4
2828 -4 -754 203 356 189 26 268 651 -425 -254 145 -474 -493 574 -297 301 576 -18 147 445 -209
2848 -209 215 -157 51 -165 92 -88 69 -363 -226 -155 -349 118 -410 271 348 -443 -207 342 -526 -366 -96
2869 -96 553 564 -57 160 624 60 217 11 -599 -175 311 96 -631 -413 -75 179 -492 -95 147 165 -49
2890 -49 38 -62 -592 -313 474 -119 -205 30 237 98 -115 -249 603 -307 169 260 82 -98 206 165 25 9
2912 9 227 -168 310 -301 -44 336 -456 -116 167 120 -832 440 -26 -147 58 -336 420 238 1035 489 -577
2933 -577 -333 256 -650 602 199 -41 -154 386 -436 -117 -79 380 -582 -135 -477 651 30 -447 328 442
2953 442 132 42 -241 -16 37 148 -62 -85 -495 267 -172 -122 427 -115 234 -107 661 302 155 -211 27
2974 27 59 -146 217 292 145 3 -206 -741 146 -368 24 11 115 -25 478 -230 -328 73 -57 33 -92 368
2996 368 104 255 -19 -103 -99 200 213 -109 274 875 -164 15 -452 -251 -41 -198 280 231 -47 -243 -155 506
3018 506 318 408 186 254 -228 -370 -454 -209 327 -195 214 188 -27 370 167 129 -32 -304 303 -456 -26 273
3040 273 409 583 295 335 146 -72 -293 362 375 341 -373 6 364 436 -77 -114 131 607 -201 136 -214 263
3062 263 -21 -401 -309 -292 717 814 -108 117 -112 -26 -104 149 -56 -283 137 -252 -162 -111 12 541 82 270
3084 270 310 -234 590 -28 329 338 56 688 -261 -347 310 -551 218 -313 411 -245 512 0 211 -54 295
3105 295 -18 -7 -94 -235 -174 -594 -33 429 -10 -461 276 28 568 89 -644 -880 157 -238 -53 484 -276
3126 -276 29 100 4 -59 -100 -148 321 -165 521 833 -131 399 401 -361 -314 237 -194 597 428 32 -388 34 -16
3149 -16 -446 -266 -254 521 139 176 107 -212 701 577 -112 195 185 -60 -170 188 -197 -451 -531 -32 328 541
3171 541 -148 336 -93 -117 -27 -118 -307 -419 51 331 -84 -27 -411 145 -116 722 443 -119 244 70 191
3192 191 86 -20 -248 217 -325 311 -467 104 35 36 239 421 49 -236 196 142 102 -356 45 -411 -274 482
3214 482 -520 -170 -57 463 118 2 -399 384 325 -140 522 182 -103 63 -295 282 -69 -28 -60 -412 -135
3235 -135 -316 -220 61 431 -608 -134 -80 312 -401 120 339 309 -195 -125 113 251 278 -539 298 -101 -5 328
3257 328 -51 7 -15 167 504 160 -398 211 -431 -174 337 588 246 -304 248 -33 -299 294 -320 548 523
3278 523 -141 29 97 -157 -1032 224 -203 -78 -283 177 -302 75 -220 17 -40 -213 -400 -194 -620 44
3298 44 -141 -202 175 151 326 450 -135 -170 72 1 378 281 16 86 -354 -188 -235 186 1301 8 -305 -160
3320 -160 -104 51 465 -853 436 -223 579 148 -113 542 301 340 -261 225 -196 -387 -2 279 251 -454
3340 -454 -267 -440 -146 197 123 -852 171 -579 107 76 -97 -274 -91 -7 -23 -657 -199 181 -54 137 69
3361 69 48 345 274 277 492 6 459 75 -532 -387 22 -164 -75 -413 -425 -129 81 52 -87 46 64 64 -130 -264
3385 -264 -527 -141 -359 -137 270 182 246 537 -129 -488 -234 212 280 319 -238 408 140 -258 -11 39 -302 -46
3407 -46 424 247 136 53 393 71 -556 102 687 -158 -490 166 -96 119 106 91 -142 282 -540 653 197
3428 197 -156 -197 564 193 -383 -232 -406 100 360 -248 316 412 6 42 156 66 3 112 122 -126 -229 524
3450 524 -469 181 -117 636 -281 44 -401 234 190 -84 334 -306 -77 -26 96 43 782 -186 -297 147 -275
3471 -275 -398 182 111 28 -588 -295 382 357 209 -34 -368 323 275 -104 -363 109 -418 -696 -531 -96 -94 106
3493 106 -554 74 -131 398 -109 96 -439 -189 -468 295 -361 95 -175 -145 48 -142 -43 -226 173 -101 -17
3514 -17 134 478 809 126 73 -192 61 236 498 392 -16 -127 -771 171 -281 116 258 -146 534 -205 108
3535 108 401 -246 66 -284 -658 110 11 308 107 -65 -23 71 243 89 -684 -378 131 192 -68 -421 247
3556 247 -34 319 -766 294 560 205 -336 16 46 288 542 -314 24 -245 -42 -411 -144 -296 271 -254
3576 -254 319 43 -215 113 125 45 -505 -300 276 -99 587 292 -349 -36 598 -303 196 -681 268 656 49
3597 49 153 -392 -557 -167 330 52 1 15 73 -113 -285 -213 -113 -49 -253 321 310 -32 322 113 86 271 17
3620 17 551 155 432 28 76 -123 313 505 -258 99 301 -161 -616 480 764 -118 -8 181 199 -75 7
3641 7 195 338 209 -510 -248 198 350 -70 -150 352 -225 -80 -200 -35 -498 -29 -437 -419 -323 -491 13 -393
3663 -393 -82 -544 684 341 271 -622 251 -36 275 -245 -515 216 8 586 -67 181 530 113 250 284
3683 284 198 -18 -492 405 269 -262 440 -25 -12 -109 -634 241 284 367 -261 -260 -576 -13 225 -635 -312 -236 495
3706 495 505 -102 -372 24 55 634 -81 -223 -20 583 -861 382 -149 -244 286 -152 364 -350 384 143
3726 143 235 54 -102 -366 29 -117 15 -322 235 -550 572 -191 -101 -75 -239 16 418 117 58 -156 -89
3747 -89 -557 -365 -1 -659 -637 289 627 387 -173 7 -50 391 208 -243 166 -219 180 350 163 426 17
3768 17 10 453 -694 171 -646 76 109 455 88 758 373 -79 315 166 -153 268 -179 -269 197 12 -196
3789 -196 67 -630 -285 10 -570 132 99 498 657 232 -34 -164 294 -162 -476 -42 3 683 820 -268
3809 -268 46 -378 -220 390 568 410 31 165 349 773 151 47 -143 565 277 -688 -461 -51 -185 -100
3829 -100 -328 19 -176 559 532 -248 341 -27 -380 -139 1010 715 496 323 610 -287 134 -168 508 55
3849 55 -48 454 151 -136 76 -69 -200 390 437 431 -82 -452 -219 114 -249 550 -6 302 -249 393 -190
3870 -190 -108 294 -267 469 94 30 -226 216 276 291 -391 -221 385 196 390 76 114 261 -447 -296 23 -498
3892 -498 28 144 10 -493 -81 -173 -339 -174 219 -284 4 -488 149 119 -45 -404 160 -30 -100 79 200
3913 200 -207 -486 -518 -670 -73 -20 497 -61 563 -45 -331 8 335 159 -699 195 581 212 -518 450 -24
3934 -24 -49 624 259 -119 40 -481 -298 213 65 75 -298 -439 398 -160 442 -136 136 -71 364 -320 -301
3955 -301 390 -417 -485 141 -455 85 -247 218 431 -517 -449 -176 261 75 464 -15 273 334 -182 -52 -229
3976 -229 123 -218 3 -123 66 292 -515 1027 333 -724 442 218 259 273 -556 298 -33 372 -636
3995 -636 -219 61 -143 -39 155 -94 320 -287 54 -15 -250 -122 -700 210 -382 457 -380 -210 -497 -213
4015 -213 38 -432 316 337 476 -161 -221 425 -734 -40 -28 608 -315 -12 -574 48 -411 490 -739 -102
4035 -102 722 523 -436 314 517 99 106 -15 198 -142 -26 -3 -525 -146 515 -300 122 291 -128 -308 -86
4056 -86 -10 611 -92 -407 -435 191 -329 147 -38 -9 131 -119 535 13 -276 319 -720 -133 36 -184 548
4077 548 179 -250 -147 -107 -91 165 -337 -202 301 -257 219 346 -98 -204 -415 14 -166 91 -290 -370 -318
4098 -318 588 -174 141 256 -751 -20 38 -38 -400 -183 11 -150 320 352 -109 -229 88 -386 328 -48 -263
4119 -263 41 -50 -375 402 -330 -319 -115 74 401 539 -433 -271 111 418 -218 244 90 514 196 -21 0
4140 0 360 -64 -134 -1 222 219 43 326 -438 526 109 54 189 -85 -178 -383 -231 371 -364 95 325 220
4162 220 -192 -573 -520 -193 26 584 -179 44 224 -467 274 -324 328 -253 70 422 197 72 578 502 -551
4183 -551 -558 -120 522 692 -333 -870 -404 120 -27 -21 441 119 -178 -141 -237 -330 77 181 104 237 -126 -18
4205 -18 -263 442 63 501 163 -142 -243 -193 185 -25 179 214 -145 -149 -111 -145 -75 -521 15 -212 64 372 68
4228 68 546 -170 203 144 -56 841 290 405 224 -238 49 -265 -342 143 786 -11 302 -204 266 -223 262
4249 262 415 -171 310 394 394 162 212 -8 -286 359 330 -163 -75 353 5 -139 -411 -126 508 -105 250 -568
4271 -568 -168 381 -249 -228 -448 316 -5 -34 -367 -165 72 495 -353 294 330 -523 -321 -443 -76 -245 -123
4292 -123 517 61 -32 236 -310 404 -159 110 564 -522 52 -425 206 163 -4 10 72 -150 -63 349 78
4313 78 -347 -631 540 -337 37 271 -55 -177 -36 557 -129 460 191 -154 -418 -371 270 -738 -87 -696
4333 -696 -444 -304 -149 -466 176 -29 359 -35 31 -307 -502 210 47 439 625 188 280 -289 255 75 110
4354 110 381 -329 424 36 -295 -254 122 114 -276 437 39 -280 -55 134 -25 391 77 295 150 -267 188
4375 188 95 -377 96 -146 -505 -461 -227 -304 -70 383 368 -161 177 457 596 -77 -833 -14 322 -382 165
4396 165 -162 526 -532 82 -127 141 -16 63 -72 -479 517 -238 -83 48 511 473 309 345 -24 -530 -53
4417 -53 -201 -30 273 -156 -267 32 -270 -275 452 -356 -569 76 488 440 27 -464 252 -195 282 -2 -9 79
4439 79 -210 -533 24 -63 -373 -296 -362 42 729 -156 376 -347 226 -288 -469 21 336 77 -130 625 -109
4460 -109 -412 46 -412 264 474 -283 189 66 125 378 237 -141 242 68 113 176 386 128 51 174 322
4481 322 293 47 54 222 -129 142 83 242 -178 -166 -202 149 123 -145 122 89 -44 76 -270 -376 814 -50
4503 -50 -83 -184 153 -264 60 -276 -126 287 146 -217 -182 191 -467 -9 -555 552 124 44 467 563 70
4524 70 244 -98 321 -183 386 38 -80 -256 32 -146 307 -203 -588 467 -226 165 69 -628 495 -133
4544 -133 757 -199 -168 30 45 471 -165 232 159 -6 -264 22 -458 -115 -160 -27 52 68 -198 417 180 450
4566 450 77 384 -143 379 282 195 299 690 -336 -311 48 469 -268 -80 -337 45 61 -659 961 -197
4586 -197 -324 277 94 380 0 448 199 209 -555 423 -47 522 -253 358 -459 153 -71 672 -188 139
4606 139 -94 -259 -460 -250 -626 -384 4 227 835 -496 -253 -205 736 -29 -2 171 -258 -89 -47 -511 131
4627 131 -692 37 -674 -727 -32 -468 437 -23 -368 358 189 -207 134 -122 206 -506 -146 705 453 -160
4647 -160 585 -153 -265 -46 -100 337 -152 149 180 248 -845 -339 18 -48 -250 -598 22 -32 -197 -655 -424
4668 -424 -202 314 53 601 -208 -104 -173 -95 6 836 51 -199 27 -167 347 -139 -316 64 -554 -551 -157
4689 -157 333 -306 256 -111 -456 -43 52 247 129 256 260 616 37 114 -280 -178 -692 348 113 -59 272
4710 272 -28 -512 200 -355 82 386 296 111 311 181 -260 87 -43 -425 -167 -474 645 87 -569 336
4730 336 -195 1 165 440 133 189 -331 340 22 662 -894 157 -264 656 258 369 470 170 -77 -354
4750 -354 -235 -14 -353 29 -184 364 -72 -405 -386 162 343 -136 34 -293 -570 -273 -60 -376 -148 163
4770 163 -263 213 17 -262 -345 -135 396 470 224 -55 -223 494 142 223 -53 -92 344 417 319 18 747 149
4792 149 440 293 107 -405 89 -433 -304 92 383 75 121 -366 -219 -563 -192 483 638 276 -651 -118
4812 -118 589 82 -547 433 274 150 417 -234 18 38 -50 24 -193 -240 -174 336 -63 -35 -20 -65 -323 -144 -305
4835 -305 480 45 -523 346 99 81 372 -197 314 -25 210 -361 -404 -23 -243 -28 -399 -261 145 426 -575
4856 -575 506 -573 41 68 217 -287 -204 73 -183 447 106 -10 127 -242 253 -122 -290 -42 -136 -247
4876 -247 -3 288 -130 -16 -253 152 7 97 174 350 -287 -71 -302 589 -53 325 159 74 -183 171 -50
4897 -50 -296 -104 0 -76 931 246 453 -220 51 -8 -405 384 98 -352 118 395 194 542 -227 -202 -48
4918 -48 70 155 39 -269 -88 12 377 331 -224 135 232 -36 -306 -69 225 100 -575 -320 53 -525 -150
4939 -150 -21 220 -296 -213 -15 421 -279 -385 -117 -110 -442 -275 598 -47 -199 -278 74 -175 478 -27 305
4960 305 300 -644 -68 -395 43 163 -416 130 93 448 -367 -259 -39 363 276 300 36 318 98 -84 -243 -507
4982 -507 -207 -163 -237 699 -520 709 -384 285 -381 78 265 239 220 134 -161 48 675 140 85 58 -778
5003 -778 -48 -93 245 -311 368 435 654 268 274 -55 -867 -283 77 -115 -397 -112 84 -40 -407 -96 97
5024 97 106 22 247 267 -247 223 134 428 -163 -256 -152 356 -321 -427 77 -50 432 -62 -145 89 -175 79 -39
5047 -39 -403 -21 12 -231 -170 271 55 402 -147 -229 -525 -158 233 227 145 307 487 229 731 -328 40 -465
5069 -465 -374 50 117 378 -147 -304 -279 47 6 -150 -67 -396 -129 432 -269 -79 -202 -203 -135 -71 369 -310 -30
5092 -30 -229 83 171 -431 -939 -67 304 -30 -193 58 -343 -203 -451 -160 296 46 349 -282 275 -220 164
5113 164 -457 142 -459 -114 -135 -72 103 -60 320 -473 -445 -502 -77 539 568 -464 -175 375 332 189 -595 112
5135 112 34 149 -224 -298 -204 -302 -91 613 -336 -486 -81 -29 -292 -85 142 159 142 267 352 -74 -403 -104 161
5158 161 269 -80 517 -100 -126 424 0 282 251 -303 -366 20 486 -193 -536 -613 274 385 -144 217 7
5179 7 -77 69 249 -218 322 71 -419 -530 130 -47 -229 407 192 -247 -150 -727 -77 32 60 240 -58 264
5201 264 187 -231 -13 -239 124 22 -62 275 -79 -298 178 -268 35 113 -293 364 -544 -13 -336 170 312
5222 312 824 110 -2 -445 77 -229 -188 494 179 -827 -10 -142 -660 88 -418 -360 148 182 -629 192 -591
5243 -591 270 -83 201 298 156 12 242 -123 -270 -559 467 -238 237 -216 89 -45 155 464 -224 262
5263 262 -268 492 -50 -9 106 -310 6 136 -28 -87 96 -247 129 -93 4 -286 196 458 402 117 13
5284 13 201 -286 309 -316 -252 -100 77 56 -233 213 -63 227 246 -62 -247 -364 -617 113 468 -547 282
5305 282 -61 780 116 172 719 -513 244 397 103 -433 31 229 -367 -935 -583 698 431 -135 -69 -626
5325 -626 123 107 39 68 164 226 -104 97 -397 102 -698 -233 -419 -784 -131 -372 418 -267 525 93 -176 314
5347 314 330 -79 -160 -114 -26 -655 -278 -85 -123 324 -152 256 676 -1008 -357 -468 303 -435 104 -93 -257
5368 -257 208 308 -270 639 24 -590 379 -309 -112 326 -23 156 -544 -18 208 -40 157 -358 71 -137
5388 -137 -658 388 358 8 29 -318 40 25 94 -387 -547 -56 690 59 -24 -280 -380 -464 -770 -176 213 263
5410 263 12 270 240 -19 344 -152 486 -519 -80 -324 236 120 -288 192 -296 -53 228 -54 -152 407
5430 407 96 -12 -505 365 -345 55 -219 66 -85 70 -544 -94 56 -427 -431 298 -650 -53 -656 -667 112
5451 112 91 -131 -512 491 399 331 53 -254 -164 477 -192 98 225 489 35 362 411 423 8 -182 185 603
5473 603 92 -46 699 264 -215 -231 207 288 282 136 -25 -164 -575 -870 278 -182 89 317 41 -236 -100
5494 -100 100 -198 -32 -212 36 27 -429 -184 265 293 680 -125 203 -425 142 -340 -32 -184 -77 -155 -487
5515 -487 -90 226 5 -323 325 -319 53 35 517 643 -679 139 248 -338 -268 -341 -122 209 158 375 418
5536 418 -45 -271 -185 262 96 312 533 -400 -106 -125 73 -402 -512 701 289 -308 -414 99 -137 -78 -296
5557 -296 -326 -98 322 307 -270 -291 528 -564 372 -180 17 -119 209 -140 55 -383 -286 446 384 301 -302 -167
5579 -167 -266 -125 -287 171 138 -396 406 -73 -224 250 498 -501 166 -105 -193 -396 -753 348 -65 145 478
5600 478 -234 -341 322 -6 -275 202 156 -101 25 212 -154 -134 -332 55 -396 -567 -38 -77 268 -404 -6
5621 -6 323 -45 -877 -388 311 57 127 56 30 -354 -550 -180 -166 -149 -147 -55 47 74 22 -249 -513 -436 -205 -353
5645 -353 -30 5 259 181 -82 60 181 150 177 103 337 -173 -108 -428 -507 -37 561 -75 698 -191 434 569
5667 569 -85 819 124 -174 166 662 445 398 -264 -471 228 -212 72 17 272 -9 49 -447 234 -192 -58
5688 -58 39 398 273 143 -374 -398 -136 186 478 295 134 -97 17 -358 352 459 -148 3 563 -594 -390
5709 -390 394 -435 -105 151 58 -68 -153 366 -893 -526 -26 332 186 -189 951 76 227 506 757 -322
5729 -322 -133 63 -49 188 412 -141 -640 162 -103 290 -162 -132 295 67 179 -2 302 -335 101 215
5749 215 252 -368 260 -230 -200 160 -458 -124 79 -385 503 -272 242 -295 -132 -23 -399 918 45 -99
5769 -99 -321 -555 -573 612 197 405 -96 306 -88 306 -128 260 77 -253 -39 -465 256 -457 517 233
5789 233 -387 399 -582 242 217 592 81 -29 227 -414 59 377 299 -198 278 43 428 245 -45 87 -644
5810 -644 -161 283 20 764 -237 -84 365 37 318 303 152 187 633 53 428 -205 749 -145 -220 383 -300
5831 -300 -259 378 -85 -197 934 432 98 -487 -133 -7 -85 -364 -182 130 371 -159 -146 569 87 -307 237
5852 237 305 200 106 136 64 146 329 -96 -221 -456 -158 576 90 -153 300 100 76 -56 512 -20 -185 -181 40
5875 40 -193 -404 385 -137 434 -5 -285 -4 -111 -135 448 -721 -399 407 -5 393 -112 -44 634 -56 216
5896 216 147 -271 -246 23 -37 292 -441 111 511 548 -364 -406 -119 -266 43 -460 -117 -352 -160 -187 -572 -207
5918 -207 -207 131 -328 -564 873 -171 75 -288 219 155 204 105 -167 215 -187 97 -187 200 -7 516 -332
5939 -332 -315 -252 193 -159 -433 426 400 -216 643 -287 -118 -169 197 220 0 182 39 -23 -289 241 -564 162
5961 162 150 -718 682 265 -606 -320 352 283 338 -31 -102 -150 169 -298 -494 100 554 472 277 -118 -132 -236
5983 -236 132 662 133 611 -149 10 -735 -174 -488 -114 -228 215 -487 -27 142 -119 -142 -144 -140 115 -58 115
6005 115 -127 -358 156 -123 -90 28 -94 9 -9 -308 -388 -474 -84 72 317 855 422 -505 634 -65 -391
6026 -391 335 -23 -105 -280 194 -182 -81 -159 -319 45 -197 -18 -331 -173 -509 471 666 -27 -115 -548 169
6047 169 -78 150 564 -295 -219 -288 -172 -359 -479 317 198 377 -260 327 110 522 826 18 319 -189 326
6068 326 691 391 68 -403 128 361 636 315 18 -149 -439 262 -375 196 61 66 -608 484 167 408
6088 408 -77 -134 12 -420 298 -578 75 17 403 -244 246 23 69 406 -621 -371 -36 -415 25 397 244
6109 244 -928 -267 36 13 -160 59 298 99 379 -452 103 53 206 213 10 188 -415 -240 303 -109 27
6130 27 134 -145 -102 -154 452 91 -282 513 7 587 -229 194 -133 100 -285 -3 -437 -496 -261 -70 -248
6151 -248 -260 -174 166 -347 372 17 -340 -282 -151 -370 -292 449 221 412 412 117 245 -274 -40 -141 157 1027
6173 1027 263 -51 -160 -347 223 0 152 510 27 72 -242 261 -450 305 105 8 -60 -331 -61 -307 -432
6194 -432 -273 7 -72 484 -228 1 356 356 300 -313 -173 -355 183 456 -66 -210 -217 -961 264 -255 -179 -75
6216 -75 -165 -85 -452 -513 -204 -433 105 -686 182 -86 -317 58 -220 -13 143 131 303 332 -106 345 -230 -494
6238 -494 172 365 -475 -325 20 74 -134 -298 357 0 523 -206 240 -304 156 586 50 30 -468 -162 258
6259 258 -445 -344 -122 -402 -460 -97 4 -360 90 -291 777 -132 35 18 -95 -496 -281 161 209 -9 -186
6280 -186 315 118 433 351 103 391 342 -284 621 -317 123 -444 216 343 299 304 -12 566 153 84 114 -281
6302 -281 -238 -98 244 -343 120 55 -385 580 -20 -116 76 50 366 -639 106 -367 404 333 47 -6 -50 -71
6324 -71 -460 313 0 88 282 -143 -430 -7 47 362 -1 194 18 211 190 417 409 -485 240 -108 3 27
6346 27 -338 173 56 -368 -72 -593 192 -360 -222 308 802 -128 247 449 208 50 240 -84 116 -162
6366 -162 219 -104 -177 -399 -201 -192 -248 -525 370 -889 70 -567 180 345 -95 -163 -464 -251 -332 163 -8 128
6388 128 170 584 -159 77 -288 -376 336 341 -687 -112 -592 -5 -186 417 -223 13 -591 -579 -57 175 -391
6409 -391 237 150 -242 404 552 183 636 136 -161 -389 255 -48 -45 -392 -27 -290 -5 111 293 355 -593
6430 -593 709 325 -405 513 95 190 -299 -434 -138 -1 -373 288 290 -42 246 76 357 -245 356 -294 356
6451 356 398 75 -210 -394 191 203 -240 322 166 -447 358 39 -6 561 -35 -552 124 -316 -77 -404 61
6472 61 206 -662 -111 290 161 -59 -572 -563 114 31 -203 114 691 -158 -407 344 286 145 -396 -14 -64 119
6494 119 365 -501 589 94 24 38 -410 516 411 307 369 -105 -51 -513 289 419 187 -238 -363 138 -284
6515 -284 151 -265 -479 8 43 -741 237 0 614 337 614 -122 -142 -182 187 256 -435 283 345 341 -115 -21 -96
6538 -96 -36 4 -311 103 -156 -245 78 474 -541 -39 17 178 -348 228 559 -338 -369 -141 -308 102 554 -344
6560 -344 -4 -353 -231 361 582 362 -727 205 -160 -610 -555 -36 -82 75 -50 -369 287 306 379 -513 220
6581 220 174 -370 155 -115 -70 -174 -54 253 -46 402 505 -456 1121 170 -169 16 -221 -63 323 -534
6601 -534 20 703 -431 309 -463 174 -9 221 -190 230 109 373 36 -105 -145 -141 -189 -487 -659 -142 127
6622 127 377 -186 44 -491 -442 90 47 -16 -253 -38 96 -40 594 594 -418 113 -43 -293 -173 109 -274
6643 -274 -344 -2 23 -222 -32 236 -578 33 106 -562 -661 30 -527 -239 -616 -312 -157 142 -265 -239 55 -186
6665 -186 840 24 184 358 -191 -113 51 155 -46 159 129 730 12 -204 598 24 134 115 -130 -109 50
6686 50 435 18 548 -151 174 -174 -58 359 503 -246 270 -809 284 -232 -564 -261 -130 -393 301 155
6706 155 310 -59 509 -431 -249 450 -402 -117 447 140 -563 -106 -323 -180 -26 -171 140 -534 187 -313
6726 -313 197 79 -495 -391 53 32 116 183 -184 -408 -13 21 267 -364 -59 492 422 431 -251 -607 -157 404
6748 404 375 108 371 -172 -273 -662 340 174 13 317 58 540 -284 390 156 607 278 314 186 -328
6768 -328 7 -281 399 -215 -25 -86 409 391 363 -146 304 318 16 11 59 -66 73 131 -162 156 -678 -251 -85
6791 -85 556 145 -46 75 -19 -155 -99 66 -95 -787 264 2 179 129 136 371 0 -532 167 -110 182 -308
6813 -308 496 -614 140 -133 -385 -16 365 215 0 520 439 301 -333 128 -26 -110 -227 -366 91 83 -486
6834 -486 -358 -255 -44 308 954 333 -417 -232 -429 -260 -175 40 -412 161 -123 228 -168 -26 344 190
6854 190 -344 162 305 340 -29 342 284 -83 -406 -258 -102 -442 114 221 723 13 -548 268 -97 178 -247
6875 -247 42 -242 472 128 49 -319 -748 -426 24 347 127 -623 -369 -208 158 -2 -421 -42 -161 119
6895 119 -614 454 398 445 328 -139 -553 -474 -302 135 84 -182 -272 369 71 -118 -93 -114 310 -768 -344 6
6917 6 178 15 -128 -381 -128 42 -339 70 -63 -142 -449 135 197 353 -308 86 -477 -10 -58 17 329 67
6939 67 66 -208 243 95 -565 155 -409 171 -567 231 -312 707 113 -290 -479 73 155 3 2 -389 -217 238
6961 238 525 276 222 -243 -187 -731 301 235 365 -187 36 257 -226 -67 132 444 577 281 46 236 175
6982 175 210 -333 512 -241 -228 -319 -309 -565 12 -95 -395 -130 -321 173 -179 421 365 -56 -140 49 -65 -116
7004 -116 271 -252 158 486 108 103 196 258 140 623 155 -367 171 -101 -109 77 -68 107 -260 377 10 -759
7026 -759 -45 -78 119 502 -390 445 396 -10 -250 241 234 230 146 -122 185 -23 191 80 -673 -230 660 141
7048 141 181 222 -301 -668 -527 182 -663 -195 -207 -167 -89 -92 135 -124 88 -175 -268 -195 -828 -423 348 373 9
7071 9 498 -599 -136 160 458 -196 -217 131 -150 239 298 -298 -223 409 223 -215 59 -75 -389 430 113
7092 113 410 -136 -298 -280 211 213 -208 340 341 62 -144 -489 -429 -180 204 -591 -690 362 563 -105 -309 -194
7114 -194 -261 79 -261 -543 473 -169 -312 501 -603 470 512 -423 223 1 72 170 -768 407 253 132
7134 132 253 -77 197 403 -22 338 -32 286 327 207 239 -167 10 406 126 -323 332 277 211 -81 11 -55
7156 -55 -508 -36 -160 -354 410 -268 215 285 405 -170 115 338 310 -437 264 78 546 -87 -358 -437 50
7177 50 -262 -282 -140 -45 372 -110 -549 266 -204 362 -168 -22 -271 -291 -289 77 369 -93 196 -3 -440 130
7199 130 117 6 520 1 -16 119 -49 22 -83 200 113 -364 -202 142 220 -266 208 257 278 519 483 -394 -20
7222 -20 6 66 289 57 237 301 -757 -332 -43 -175 6 31 277 -494 -297 183 401 27 -482 217 207 370
7244 370 376 232 -467 553 312 309 236 -654 7 -128 -1143 60 15 120 -10 -81 144 -399 -159 -841 52
7265 52 -112 60 183 261 1227 3 144 195 127 235 -353 -196 -183 143 -379 -127 -253 313 116 108 -283 -525
7287 -525 -30 -62 304 -238 277 319 597 -45 -54 720 255 -364 -219 -227 -146 278 -197 -236 -286 -259 150 -376 -866
7310 -866 202 -220 -116 552 -170 316 -16 -225 571 137 622 -126 -339 -101 312 -353 595 91 -125 190
7330 190 -3 32 208 223 491 -303 233 -177 75 -186 -672 90 -435 -262 -247 -82 312 1030 204 -210 -6
7351 -6 -360 201 413 186 319 173 -351 -620 270 92 410 57 -622 -106 -476 -270 276 -393 -330 74 436
7372 436 192 -45 98 818 -287 548 -405 -121 111 -154 -21 851 217 105 -762 -414 -164 430 125 32
7392 32 -123 -370 676 128 -163 -190 334 -356 -98 169 572 -149 -339 284 232 860 114 -224 39 -69 -666
7413 -666 705 24 -123 -10 165 263 371 -378 -81 227 395 -504 -56 327 -431 243 196 -564 -374 -330 -401
7434 -401 535 -104 87 -224 -56 -197 974 -24 209 575 -36 -439 257 -167 -206 -196 530 -56 313 142
7454 142 -145 298 -142 574 -499 -234 871 -13 -451 -529 514 -74 106 293 -399 677 -509 34 -160
7473 -160 -53 19 -3 263 295 -226 324 -135 443 -244 -549 273 329 102 -315 -7 -168 -28 -647 -390 -280
7494 -280 574 -21 220 273 200 -180 334 -303 -303 856 271 -127 198 554 168 -237 -301 271 -26 -331 -2
7515 -2 -187 448 514 -397 -414 -200 179 352 86 -122 108 160 -143 -538 -273 7 364 146 266 135 -214 164
7537 164 33 127 -326 467 205 -60 222 62 102 -105 -199 -71 -527 170 138 559 -65 51 -19 -251 -404 464
7559 464 21 162 -115 257 301 10 -44 -325 -76 252 -556 -353 -27 -287 5 6 334 70 271 -316 -83
7580 -83 -63 -617 288 -830 -559 -261 -774 -135 -347 -540 -335 944 2 -340 243 -36 422 -385 -9 -314
7600 -314 0 52 -301 42 331 729 204 -457 -166 505 23 321 -52 -639 106 -265 217 -108 -376 -348 119
7621 119 -55 -34 23 -121 431 -300 174 -289 547 72 -267 -84 41 194 100 125 -62 -358 -62 -447 -174
7642 -174 -135 184 -265 -159 -144 121 -113 -219 -60 319 344 -19 82 -130 -590 396 13 -313 261 -818 242
7663 242 -159 780 -330 -95 105 -315 -642 -154 251 160 862 115 46 -94 -342 -146 335 -346 39 499
7683 499 192 -131 224 36 161 399 -486 -174 -121 -356 -583 291 305 -2 13 499 -2 13 79 169 -62 -217
7705 -217 446 111 74 -42 174 -62 230 -354 136 384 -332 -670 -220 165 376 224 337 -63 -80 -339 75
7726 75 640 101 -76 43 -110 239 312 312 -177 -485 41 4 86 -156 87 330 -447 262 -384 403 118 553
7748 553 343 9 -524 -424 363 -151 -384 -242 -120 -107 -129 -138 -493 -326 -427 -560 -304 399 41 262 46
7769 46 753 558 -294 -114 -189 160 24 -314 509 89 -189 185 366 -164 -21 -196 182 -81 46 -288 -19
7790 -19 -24 330 -460 -43 -141 -66 21 169 44 -62 327 -90 -174 55 362 67 71 4 -244 -277 26 65 168 435
7814 435 169 -454 229 -289 219 -189 -231 778 448 273 -599 -237 -134 -181 -184 -101 121 344 258 494 348 -518
7836 -518 353 310 132 -394 -570 674 175 -118 -245 -90 -467 627 189 80 282 -246 585 -16 -34 -328
7856 -328 279 -259 11 -20 293 -448 199 -142 -206 495 -131 -8 250 129 -175 136 -517 255 268 -517 -22
7877 -22 563 -375 658 -647 44 -307 5 -262 235 -216 227 175 397 -636 152 559 661 -444 477
7896 477 -59 -9 360 209 -22 51 583 -266 -163 -244 -77 627 -56 -94 171 -682 195 -74 -228 85 580
7917 580 548 -475 -157 21 -548 391 -123 453 -200 -2 409 -61 -516 78 -110 -68 72 -120 -327 127
7937 127 -60 -88 100 314 -834 -400 -610 127 58 -201 -143 173 92 -795 706 458 317 493 187 -375 383
7958 383 390 -658 -315 811 173 143 30 -372 -248 91 223 -24 204 -84 509 225 -140 272 245 95 107
7979 107 -743 -363 94 200 -314 74 -21 98 208 250 -63 94 -336 -382 -123 292 92 102 282 -177 -203 408
8001 408 -6 -122 46 69 -103 -115 251 818 -212 -8 12 -430 -231 -930 46 -779 185 -314 -493 275 354
8022 354 730 -134 34 445 99 -509 -25 98 518 335 -179 -281 -352 -135 -270 287 -4 -375 53 293
8042 293 -708 -187 1012 -735 -192 139 -483 -102 73 -356 260 407 344 -539 -104 -57 195 -387 55 222
8062 222 -305 -588 325 270 168 -304 -103 -263 -767 -214 -297 33 77 192 176 -168 -184 -203 568 -555 -173 -85
8084 -85 167 -78 -70 377 -447 85 -198 381 328 222 -176 1256 -437 -350 762 257 349 372 -1 37 57 -375
8106 -375 -1135 -24 10 -552 -120 -166 -46 233 -161 256 197 -261 60 -39 -150 27 -33 -3 -710 343 153
8127 153 -723 -221 201 -457 -547 -80 519 154 -18 -382 288 226 266 303 146 -111 346 117 -19 -92 300 443
8149 443 -78 188 491 -304 173 318 251 -436 -43 300 -222 -118 -190 -327 44 -6 -240 -13 288 134 -258
8170 -258 -259 10 -113 -1006 -153 -112 152 820 -215 -301 -429 -329 79 -515 365 -231 226 13 -74 -262 -202
8191b02
$$ Imaginary data points
##PAGE= N=2
##DATA TABLE= (X++(I..I)), XYDATA
0 0 0 0 0 0 0 0 0 0 0 0 0 0 0 0 0 0 48 -48 48 -48 48 -77 96 -96 118 -144 146 -192 216 -240 285 -322 365 -411
34 -411 464 -519 588 -654 737 -820 912 -1009 1122 -1240 1374 -1518 1671 -1845 2031 -2239
50 -2239 2467 -2722 2996 -3307 3653 -4051 4497 -5015 5613 -6322 7180 -8235 9564 -11317
64 -11317 13725 -17264 22986 -33750 60974 -274869 -271980 632162 556589 -138667 -443289 -81673
76 -81673 417812 733773 411791 -75451 -60661 231395 299455 341596 291475 47621 -106896
87 -106896 -28460 61489 151647 104345 -159642 -288934 -112525 -16998 -89057 -116336 -126125 -201294
99 -201294 -205644 -110249 -5749 4237 -118311 -217724 -81341 114707 85995 -59679 -57949 57086
111 57086 109728 70127 49565 102355 135437 69864 20504 98065 167848 89199 -19728 -2472
123 -2472 68863 67807 -2008 -57426 -40533 -2653 -35583 -81867 -45020 -16876 -80493 -119177
135 -119177 -59741 -745 -18791 -75473 -81816 -10207 29598 -23186 -33552 39214 47425 -7881
147 -7881 -1608 48839 72022 53378 1734 -1878 70959 77823 -4988 -13364 45447 38320 -9850
160 -9850 -21475 -3595 20796 5476 -55687 -49230 17747 3858 -58419 -44098 772 -5193 -26267
173 -26267 -31359 -13592 17975 4958 -33335 -10040 33844 12837 -17940 3661 30391 22316
185 22316 1138 -4383 20026 38015 7495 -17440 12675 34420 6889 -17064 -2383 18538
197 18538 8447 -18022 -20692 7848 13495 -17911 -30504 -4050 12646 -9330 -25588 -10501
209 -10501 9962 3538 -17383 -14077 10442 15418 -9259 -13230 10687 20299 995 -9853 5871
222 5871 19349 9940 -6310 -2072 15041 12379 -8148 -7165 12700 12143 -7182 -11570 950 8781
236 8781 -2538 -14198 -7030 8480 999 -16943 -10049 7907 3990 -11239 -10812 2292 9342 -1825
250 -1825 -11339 -302 14123 3644 -9102 -124 12255 6406 -3411 -3480 6572 9754 291 -7235
264 -7235 2803 9721 351 -8120 -1233 6220 814 -8830 -6066 3186 2582 -7689 -8406 2156 5343
279 5343 -4757 -9457 73 7753 851 -7192 -1036 8370 5118 -4781 -3209 6057 7066 -779 -3755
294 -3755 2423 6937 1139 -5482 -1140 5231 1808 -3786 -2956 3197 2056 -4150 -4629 686 2802 -2226
310 -2226 -5685 -179 3709 -961 -5304 -2380 4275 1999 -3937 -2647 3319 3457 -1590 -3309 2463
325 2463 4635 -149 -3016 976 4673 2013 -2236 -1392 3292 1942 -2648 -3267 1989 2969 -1624 -3910
341 -3910 561 2019 -1298 -3889 -767 2736 833 -3297 -1993 2143 1230 -2530 -1804 1291 2826 -174
357 -174 -2093 974 3716 1504 -1783 -90 3039 1656 -984 -1595 2088 1915 -797 -1446 397 1695
373 1695 -114 -2486 -425 1113 146 -1988 -652 1535 580 -1607 -1473 289 1448 -1040 -1645 319
389 319 1351 246 -2070 110 1823 1306 -1503 -647 2224 1737 -523 -1742 1035 1850 142 -780 -523
406 -523 1371 1036 -1302 -1256 1324 882 -1777 -1783 479 1243 -1007 -1379 -58 1148 128 -1121 -628 1406
424 1406 704 -936 -491 1446 726 -480 -323 144 1316 693 -1082 -472 1364 -143 -762 -213 631 -23
442 -23 -772 -358 403 656 -521 -1190 -252 674 -371 -811 -624 306 903 -335 -548 731 803 -540 -923
461 -923 771 1378 -140 -363 360 958 567 -601 -675 633 1086 -997 -626 397 167 -925 -898 -290 -79
480 -79 -502 -1378 -987 835 -251 -1094 -574 275 -83 -317 -83 1016 403 173 251 -542 1698 592 -352
499 -352 154 199 421 -67 -337 156 367 311 -999 -42 898 -522 -1003 -157 252 -661 -252 -770 -33 78
519 78 -867 -926 798 470 174 -78 195 -5 57 395 -527 433 1324 154 133 637 588 -277 -56 359 478
540 478 -464 169 -485 -162 618 -476 -52 245 -200 -474 -741 -282 -172 271 -614 -711 410 66 -290 208
560 208 262 -349 -249 -22 -163 568 175 -185 -116 655 -208 -596 -103 355 422 3 -242 -378 -51 683 287
581 287 -158 333 -794 -830 -124 217 -718 -399 -393 -971 214 237 -569 -188 -225 -288 654 683 340 -31 376 160
603 160 -5 456 352 46 653 667 205 361 169 -331 -239 442 -319 490 637 -412 -216 -395 -223 -266 536
624 536 832 116 -274 -320 -47 -181 -135 -59 72 -207 -109 -155 -259 -3 -55 -302 -41 -200 -186 -93 344 352 717 -93
648 -93 214 84 -142 92 27 4 265 302 379 -122 -292 -349 -39 167 154 183 330 -127 -520 -414 155 285 -283
671 -283 62 426 255 78 -171 147 227 544 -227 222 160 -168 147 -5 535 -361 -245 -636 86 -268 -476
692 -476 -51 366 -495 -223 113 0 594 315 -348 -136 -143 -325 381 -93 -155 36 278 -647 392 -257 153
713 153 -406 -121 354 952 412 630 -349 -344 281 83 -247 458 155 -208 576 179 -108 -15 519 -299 78
734 78 110 28 -202 282 121 104 404 -360 98 -252 182 -871 -433 -176 274 -274 -67 64 -360 -344 -82 -4
756 -4 -156 -439 183 -360 -132 -80 341 133 -138 -339 -397 176 497 -29 5 -141 -78 614 171 -54 441 468 71
779 71 -294 178 -376 334 365 -123 80 357 -515 202 196 -495 345 79 291 424 -613 49 575 67 -383
800 -383 44 -657 -54 284 128 -58 -387 484 646 25 -449 -197 31 309 605 549 -190 -34 237 -15 -275
821 -275 41 -246 116 471 -133 402 235 62 -138 -16 20 618 645 465 128 423 -251 331 319 -102 312
842 312 -106 -239 53 -8 103 534 -530 364 120 217 -47 23 72 -385 117 100 310 -508 -172 539 69 180
864 180 -38 186 -145 57 330 -544 -369 -103 174 399 -834 -223 -56 141 187 -46 189 -237 -227 -305 -72
885 -72 -11 -183 425 290 -570 -349 -189 352 -269 101 -147 -11 -19 119 205 -463 203 -259 -213 591 424 -81
907 -81 190 -178 11 -481 82 281 122 578 -252 -8 -27 -258 121 -139 -109 640 176 -184 -26 -427 -170
928 -170 -124 121 616 -180 -641 142 -62 -30 1 237 213 -259 583 112 -392 360 167 107 -444 186 490 111
950 111 448 -267 56 192 -121 -231 -529 -3 -284 -64 159 -540 -440 -55 204 -228 -127 145 8 153
970 153 435 -56 188 155 -17 -96 -318 -114 149 -323 117 457 -280 -146 -396 402 -39 393 300 -1 -162
991 -162 67 -922 247 245 176 -846 142 -668 -57 218 -23 363 -110 125 -489 268 -330 39 -39 241 -267
1012 -267 181 -105 362 67 -97 568 -94 274 54 -586 -49 -256 -291 367 638 -789 270 580 -592
1031 -592 -174 -21 198 468 665 -48 119 -236 -122 197 131 161 -930 -349 35 12 -630 -225 242 -561 243
1052 243 -250 -76 -20 120 386 145 476 173 439 -570 -97 -168 188 125 -199 -40 -239 6 -603 -225 -165
1073 -165 60 75 474 269 -87 577 527 548 -31 155 -207 -149 145 -265 129 59 -303 82 546 558 -174 -479
1095 -479 -132 -190 95 229 -143 384 318 6 -29 -441 -108 326 171 652 -288 -432 260 17 243 90 449
1116 449 -365 -67 23 -272 43 -322 63 667 -314 -551 72 -187 16 497 149 -198 -68 423 -170 -99 121
1137 121 -315 -217 41 -647 105 -171 -229 358 77 99 -344 283 224 203 -518 35 341 -207 472 59 -231 -26
1159 -26 -330 580 22 -244 489 -37 43 548 157 820 248 260 -757 570 13 166 211 -323 382 -63 343
1180 343 -232 357 438 281 579 -138 -484 158 -167 421 598 -225 -389 -489 -195 190 -294 -204 -175 19 -325
1201 -325 -391 -145 183 -441 406 91 -353 234 -602 -280 -88 23 335 127 584 212 -27 202 657 463
1221 463 375 421 -57 -501 -208 160 -71 286 -34 -287 -554 -84 -352 544 -10 763 466 515 57 -51 -78
1242 -78 172 -538 -657 -608 -107 -87 263 -338 506 -15 -132 348 100 8 568 -102 -227 367 -428 -146 43
1263 43 61 71 47 185 254 -162 733 -27 264 -624 -621 86 207 -102 -313 829 285 281 -84 33 -245 301 85
1286 85 -848 179 197 -560 -308 -312 -525 240 -117 48 121 16 127 -241 -536 -98 679 651 498 -149 -160 -433
1308 -433 -335 -292 243 -373 248 -340 -447 128 -34 22 133 -480 -80 77 -418 113 373 442 691 -152 -466
1329 -466 26 227 6 93 -74 324 711 277 -721 20 158 -379 -34 -283 40 -5 475 439 -272 123 142
1350 142 13 -438 -278 299 99 117 181 168 -104 -363 369 146 477 456 -178 -328 187 -9 235 -352 -302 -94
1372 -94 251 234 176 47 352 180 -409 301 -112 394 -7 225 353 180 -151 -203 194 -378 -109 -34 -4 542
1394 542 483 270 123 2 28 -296 414 563 142 -395 423 -150 -239 0 -55 -245 -37 -125 236 99 -338 -682
1416 -682 199 163 55 279 -28 249 243 295 198 420 -79 135 130 -109 414 151 12 18 84 285 9 460 -245
1439 -245 68 -383 113 -150 -806 -395 103 -61 -200 -432 187 452 -197 48 70 -23 -134 -2 527 351 31
1460 31 24 -102 117 58 323 75 59 -130 14 439 -321 226 236 604 -195 14 -86 517 -179 -130 250 -168
1482 -168 372 -264 -23 444 -40 327 132 183 456 62 22 126 -150 199 86 -79 -132 -38 492 -3 216
1503 216 -1 -124 -66 -315 31 89 62 -205 40 0 -118 -320 -133 -355 -225 158 85 151 -100 155 66 -277
1525 -277 80 -258 -857 42 -299 115 32 -23 308 -461 36 -577 495 162 -135 -195 18 -255 -202 -138 -195 -396
1547 -396 -169 -188 240 -266 -244 649 -179 -65 -330 -15 -17 -601 -63 29 7 -62 443 -260 41 387 -291 80
1569 80 -281 -457 387 216 -178 -129 433 -205 427 -167 -34 113 -33 217 353 101 -432 -227 -179 -528 -14
1590 -14 714 -35 -492 5 -386 -181 -262 -419 -466 -493 87 415 -783 239 522 357 117 399 -355 11 59
1611 59 -419 -298 -98 -64 -213 -512 -415 25 60 217 5 277 -253 46 54 173 143 -381 548 -26 -240 -339 78
1634 78 -419 -45 -77 1 174 331 146 332 -418 -300 74 -129 -395 -187 450 170 -443 -297 115 563 110
1655 110 -18 -199 11 -287 122 85 -251 402 330 -583 278 65 382 -326 -239 -209 -200 46 -243 -207 -203 -115 -486
1678 -486 -160 26 336 201 574 283 -140 -287 -81 -110 75 154 -82 315 -193 17 -367 69 387 251 279
1699 279 72 121 323 -64 -462 795 -208 60 -95 275 246 174 -359 -297 39 -282 391 572 -17 -38 -400
1720 -400 57 -47 -627 -289 -417 -102 -468 384 403 106 -146 20 308 172 338 178 196 -230 -268 454 465
1741 465 -20 -105 7 49 -2 100 218 45 -57 19 -818 -239 -96 -418 -586 100 71 -440 -238 361 183 589
1763 589 -64 224 439 414 136 -295 -431 -111 -41 -343 235 -36 -180 -265 -70 136 -16 -194 157 -310 114
1784 114 -150 -86 627 -13 -180 -174 291 228 1 -155 -106 -199 150 -364 166 -200 112 501 -76 -233 -118 -463
1806 -463 -305 -714 369 -424 -698 -334 334 99 352 315 885 170 396 255 303 -154 -169 -155 206 190 -121
1827 -121 8 -265 -152 -846 -170 188 259 327 -487 296 2 -512 330 339 -278 135 -25 -348 205 -196 -288 220
1849 220 361 388 -832 995 -362 485 60 -367 426 -479 756 31 226 -458 -192 343 389 83 244
1868 244 -254 292 -481 -107 -529 -204 180 89 145 -747 477 -360 -500 -368 719 -243 -54 5 -25 -454 -455
1889 -455 -302 -35 196 257 -539 -161 236 52 28 117 -289 60 634 116 -252 -115 875 72 -38 -38 193 -608
1911 -608 -167 265 -284 211 504 123 -185 -175 254 -5 226 -16 344 413 -553 68 -66 111 569 181 -589
1932 -589 125 320 503 81 -144 269 -396 241 -48 -203 438 78 -5 -101 -546 -217 -186 401 -271 498 -99
1953 -99 165 51 214 138 383 272 310 25 -188 206 65 -85 -208 60 199 88 -445 -361 -288 335 -78 209
1975 209 -21 -679 -467 -644 390 13 -25 458 -82 -86 60 466 -27 -296 32 -328 -220 -213 -680 233 254 327
1997 327 141 -6 5 233 269 -151 -377 288 -85 193 564 -93 113 -234 -229 -27 559 -88 63 -83 471
2018 471 185 -128 143 544 -140 491 74 -152 -256 -570 -89 -331 -2 48 -164 72 81 -387 -303 645 51
2039 51 -242 240 241 -543 -164 -119 143 -224 -520 84 -169 151 -273 281 -707 440 124 -14 593 221 182
2060 182 158 54 -652 284 -227 -413 438 -597 -152 -77 -280 256 -645 -53 -153 131 769 210 -538 -730
2080 -730 -11 -215 -72 -478 -473 -46 486 -582 -437 -205 -262 -47 -368 788 724 152 -327 -116 270 186 -385
2101 -385 -586 -29 -175 12 -217 -346 -92 130 -413 -298 -68 -498 200 415 74 -347 449 196 195 345 -173
2122 -173 -193 -133 426 -625 -208 -115 -124 535 -298 129 -195 -456 -460 -357 -365 -367 416 -519 -232 377 -544 220 273 199
2146 199 -406 -268 143 -472 364 124 -198 47 432 499 61 90 315 24 -180 -122 216 -224 -81 613 478
2167 478 -266 -668 273 -199 5 -430 372 -133 -19 -145 -68 204 237 -285 213 -134 476 -772 -471 -625
2187 -625 -129 170 -794 -356 266 -72 67 -374 -156 -304 319 -536 -116 475 -206 147 568 -10 -696 -367
2207 -367 -577 -409 161 -455 -657 -452 33 -202 717 -80 -35 425 -83 -470 -31 -127 -434 -53 437 129 196
2228 196 281 293 -138 18 99 -209 2 633 -437 68 -131 58 -394 83 -136 -268 29 22 -58 -226 -48 -43
2250 -43 48 -404 81 -54 -535 561 215 281 534 -119 111 688 158 -249 -112 -127 -84 -244 -246 316 -233 -216
2272 -216 534 -181 -518 263 -406 -170 -364 -234 158 146 -389 -601 -120 -192 -180 -146 -289 -277 473 -60 13 60
2294 60 -403 -105 594 -282 -1 -213 382 -72 439 115 13 209 14 -436 44 424 -21 -185 120 -391
2314 -391 273 191 170 733 226 -150 302 317 218 174 71 -585 508 178 -49 -8 -59 -123 92 -64 -120 439 -524
2337 -524 -11 610 165 -473 -61 -429 245 -86 539 -77 325 151 -61 -85 -345 367 80 370 354 700 127
2358 127 -158 -317 88 216 -189 449 -508 96 -830 -6 -227 -456 -267 773 58 33 -52 215 268 170 -531
2379 -531 58 -567 245 -461 -25 315 127 37 -485 10 -278 574 -197 123 -84 59 70 -172 235 -120 -124
2400 -124 -187 -67 -319 441 -130 -84 760 405 81 121 -395 -144 -10 -32 222 255 349 -387 -187 -35 67 -223
2422 -223 113 -464 -134 177 -267 27 157 -167 -234 487 12 -60 -445 -512 -212 -67 259 -642 -78 100 198
2443 198 55 -2 -180 -208 -643 46 -114 -333 -131 -434 59 -758 -506 -24 -368 195 134 -263 450 -273 -34
2464 -34 605 193 277 553 112 -249 -177 587 -562 -96 -327 86 -190 184 -95 -293 187 159 47 794 542
2485 542 487 520 56 19 -143 -37 -196 -298 306 -18 -148 -861 1 -265 -78 358 -298 -160 121 -173 -21
2506 -21 343 574 -455 -381 -141 85 138 -661 465 186 254 228 -286 107 407 -390 -15 -52 -188 145 -3
2527 -3 -47 183 81 308 443 -638 -139 566 -542 89 -20 641 356 -49 483 -564 353 -328 21 307
2547 307 -128 -524 -433 94 -502 500 322 232 -271 -219 -512 -189 -135 -235 299 300 380 -255 122 -69 258 264 417
2570 417 -1039 -314 308 523 130 77 -368 -556 128 298 -25 -365 282 -713 158 673 -393 80 -420 -181
2590 -181 126 -326 467 -197 -466 290 -76 398 82 -406 -432 492 -120 286 -92 -93 82 -354 245 -179 -472
2611 -472 104 -134 -147 567 343 -78 106 769 268 -249 -488 -27 55 313 -197 351 -116 168 -203 56 -249
2632 -249 296 608 186 -264 -321 49 -452 94 -158 -190 6 14 720 355 240 141 -344 8 -125 -551 106 -58
2654 -58 847 387 303 -10 11 -10 -18 -164 -134 -404 693 76 -305 -272 57 -250 360 230 -333 489 -392 -31
2676 -31 337 348 -212 -258 301 -133 55 640 -521 192 -82 73 22 -51 -51 53 91 1042 186 624 251 207 121
2699 121 410 190 310 -452 104 -575 -388 200 57 -32 461 -129 -170 36 119 -6 -25 285 182 -724 230
2720 230 783 -43 -504 522 -352 -477 -515 -313 -392 -127 318 -203 -311 -210 244 507 -211 -360 -273 -190 -7
2741 -7 218 74 251 213 219 -243 -38 -175 -542 531 -183 299 140 -696 12 54 581 377 304 -333 -355 16
2763 16 -872 319 117 363 -261 -142 170 -32 -308 211 186 -144 -206 46 -80 69 609 235 67 4 169
2784 169 471 -37 -502 261 -55 350 -441 -267 321 65 -14 336 -347 -11 55 678 403 385 -154 -391 -390 -509
2806 -509 271 360 262 -239 172 188 -285 87 -209 -107 -508 -452 113 -37 -458 225 -405 -7 -115 -107 -41 235
2828 235 389 -489 200 -297 426 261 170 -101 -310 -284 -570 -344 -57 -436 -301 108 -11 337 -128 -335 465
2849 465 -7 -585 -4 115 293 -150 157 113 -176 339 527 -168 21 29 -124 -815 33 139 141 -179 444 776
2871 776 -116 243 -400 -324 282 -61 418 78 129 304 -576 85 79 299 132 -53 -181 154 141 -170 -132 133
2893 133 -118 -214 -394 150 469 -782 -410 -35 -10 -40 -161 201 149 -394 55 -51 -113 -401 602 46 -504
2914 -504 16 250 -210 -499 541 -469 -130 29 344 17 -346 215 588 -52 365 236 134 -162 411
2933 411 -221 253 -191 -236 334 -362 -285 316 19 -325 114 181 -674 130 151 -85 -136 10 52 409 -335 -166
2955 -166 24 264 765 189 3 -83 -23 -436 168 617 -446 -183 155 -66 313 -43 461 -128 235 47
2975 47 -312 222 -215 -60 -348 544 -267 -135 -103 441 -5 -220 435 152 -286 -26 -268 -121 418 -61 267
2996 267 44 477 27 -205 157 -152 236 -184 682 -647 3 -211 -236 582 264 -330 74 -63 72 -287
3016 -287 -166 -43 5 -54 -31 106 636 364 -153 591 203 302 179 -474 -186 384 122 206 182 279 211 -114 254
3039 254 -398 146 -106 183 -270 -569 203 200 511 640 -573 228 -208 -685 607 52 -80 646 -156 -420
3059 -420 -159 23 -316 -45 284 100 440 -646 -366 -96 160 -36 655 542 300 272 102 60 -696 -73
3079 -73 36 -164 -425 29 -242 42 139 -381 185 -73 -649 -489 277 -1066 3 32 124 268 507 -112 -168
3100 -168 -111 -143 672 40 -92 -180 387 -293 -515 298 -139 109 -553 614 233 389 -592 307 357 -649 1
3121 1 12 65 -17 196 -148 393 -321 -81 386 444 -611 65 -75 -88 -268 547 2 330 328 174 181 -28 -669
3144 -669 -421 300 454 -58 -35 38 299 354 -412 601 -38 126 11 -228 -32 -30 510 -116 -234 468 210
3165 210 -335 32 246 -66 -358 -102 645 143 -204 -121 321 370 579 397 -230 130 578 -31 -768 161 -97
3186 -97 229 -113 52 520 27 85 -19 -342 12 -163 91 -309 -271 416 541 -108 119 -210 314 -227 185
3207 185 -404 12 133 116 437 -84 -54 701 -143 6 476 -461 -423 -7 -227 208 435 -89 57 429 18
3228 18 181 -73 -824 69 -484 -63 149 -204 223 1047 -235 141 -483 -134 539 319 251 249 -79 67 106
3249 106 -517 225 -319 122 -366 282 -100 -252 24 -91 164 248 -398 -373 254 -353 -543 388 443 -315 -138
3270 -138 -255 -137 262 -464 180 108 195 -63 64 -262 55 474 -244 288 -299 171 23 158 -315 82 472
3291 472 -477 444 184 -333 -37 -99 144 -180 973 -463 468 277 -373 274 83 -259 -827 258 -144
3310 -144 64 167 189 440 -148 162 97 -347 247 -480 -277 -44 -575 152 264 -112 -825 -479 362 -803
3330 -803 73 177 529 736 522 589 447 593 368 299 42 382 268 136 39 160 -369 190 770 102 -187
3351 -187 450 -573 34 -226 150 -40 -446 -106 -706 -69 601 232 309 308 53 297 390 234 -184 1119 464
3372 464 -162 837 -122 243 321 -94 -231 -60 -322 421 -240 -686 -308 -577 -119 64 119 368 -95 122 -157
3393 -157 641 -120 72 382 2 -64 184 115 -580 524 78 173 127 -454 159 271 67 -247 127 95 697
3414 697 445 207 -266 109 99 -221 -318 -31 -407 326 119 236 466 -124 204 141 126 -300 227 100 -373
3435 -373 -394 -483 -384 101 -745 -101 -359 17 577 -241 -174 -193 276 -763 354 188 145 -218 -376 397 -252
3456 -252 -19 771 418 245 -237 -247 210 342 291 -148 395 -424 196 119 -137 86 -278 196 386 -203 -79
3477 -79 365 -165 -482 -195 475 129 32 -54 -292 96 -112 16 -375 195 10 -399 -195 559 -747 416
3497 416 228 58 71 -198 -51 85 -2 265 -251 85 151 -460 -58 -134 -378 -338 173 5 373 -149 -273 26
3519 26 87 178 -131 665 -797 284 -104 134 571 -25 -399 -503 149 9 -99 421 -8 152 -128 -420
3539 -420 140 -147 79 76 -380 -80 -260 -531 105 76 -75 170 305 -222 -630 61 -357 -35 -435 -182 -2
3560 -2 -101 156 164 327 383 -337 52 388 704 -373 -460 123 28 212 -29 635 -102 338 1 1211 503 -342
3582 -342 -224 -140 -110 460 -179 262 256 -11 91 257 -67 -483 -39 55 68 103 30 254 263 145 -190 -113 -200 60
3606 60 201 -678 -255 -360 607 84 -156 -194 160 116 133 -170 -272 498 128 -451 -84 -124 326 -140 -270 -78
3628 -78 -91 498 384 -68 -244 575 438 63 302 289 78 -196 -183 -239 -702 -30 -268 27 33 -211 323 -206
3650 -206 15 -431 328 105 -281 -65 -448 -19 -708 652 -554 -34 222 144 554 -23 -2 403 85 98
3670 98 -656 -487 665 212 13 192 225 -263 -273 -140 146 -73 239 314 531 -307 300 72 183 98 -725
3691 -725 -48 -32 6 -335 308 373 134 -66 -121 426 -415 -234 253 202 79 -58 157 -407 707 -182 -138 366
3713 366 -384 -59 353 209 -189 -345 -161 -153 410 -42 -132 -467 -108 0 -174 41 -99 -540 -726 9 -590
3734 -590 -506 252 148 246 -297 673 37 -229 131 -230 -359 641 188 127 389 -407 230 -103 -162 -20 569
3755 569 330 -448 333 -108 316 -264 424 871 165 -502 508 95 -278 247 110 13 -118 476 230 274
3775 274 -68 280 197 109 73 -47 264 127 726 479 -219 65 281 -706 134 -28 436 25 -18 444 -287
3796 -287 -97 871 59 53 -82 -500 330 -95 -144 137 -39 -139 -459 312 -95 451 142 -112 77 -260 -68
3817 -68 -328 -604 110 642 -455 93 147 -280 24 253 170 14 -491 139 248 131 78 116 -297 -440 259
3838 259 32 269 632 180 674 81 -125 314 181 323 35 -32 70 293 173 129 70 -178 167 -184 230
3859 230 37 -782 -253 200 -346 -203 306 -333 -46 -46 -370 -174 -79 -168 54 90 -100 135 76 -32 484 167
3881 167 502 -558 489 81 213 -415 110 469 91 717 317 -398 18 414 -344 -172 -532 521 -290
3900 -290 182 137 374 712 -599 -157 -336 336 383 -575 -26 -438 -122 -35 -309 -51 -470 -311 242 -633 69
3921 69 168 382 15 51 239 -191 -97 150 -146 240 304 -5 423 294 -142 -462 275 -570 148 350 -116 -188
3943 -188 -93 298 78 -223 120 -398 131 223 -33 -151 -160 -40 243 211 230 180 -187 -353 239 361 267 589 94
3966 94 -170 264 -62 143 -50 160 -210 368 50 -395 -506 228 -37 339 -248 741 -254 -152 256 -320
3986 -320 -231 -15 189 -24 -79 228 147 -42 529 -68 124 -53 -371 72 163 -154 184 354 136 -341 401
4007 401 50 -102 245 6 220 -520 -109 -155 257 372 477 -513 176 -158 195 463 393 472 -431 -149 24
4028 24 173 -15 -281 -228 374 327 -820 -258 -47 54 10 152 20 -207 -371 -28 374 -185 -59 -394 -173
4049 -173 -141 604 -311 -378 785 103 -524 -593 446 -299 60 -291 -249 -246 9 427 -195 -74 76 -537 -125
4070 -125 177 -128 -64 -285 -174 462 70 168 392 -426 308 -154 103 293 -133 -168 37 9 -510 -294 -398
4091 -398 -770 -355 -246 -561 -37 -492 403 -398 -79 -486 198 183 -125 -151 173 -402 -264 137 -589 -224 305
4112 305 70 74 26 383 197 -338 350 34 -240 86 -256 -232 -920 -48 -160 567 235 -369 276 -24 -56 300
4134 300 169 -365 273 193 401 219 82 186 224 -115 -365 -403 441 337 -240 -457 -41 207 -66 223 -36
4155 -36 56 136 -173 -46 851 266 172 161 137 131 46 -401 61 -143 -294 -218 -230 342 364 -105 -217 588 -29 99
4179 99 329 104 434 -237 46 -87 -19 -127 94 345 517 0 112 112 5 352 42 308 -22 297 367 204
4201 204 546 544 120 -165 102 419 162 495 48 366 -115 318 -224 239 235 96 -185 211 -315 395 603
4222 603 173 492 -266 97 495 -171 -135 409 -136 -186 -289 11 -224 411 -86 -215 -571 59 79 33 -28 11
4244 11 -250 -47 -324 456 -316 -746 -232 588 295 248 173 610 -442 243 7 138 -299 64 0 22 81 -151
4266 -151 297 454 -16 -97 207 -330 -377 -194 101 568 -403 -76 -111 56 45 55 156 207 310 20 123 -459
4288 -459 -194 -217 58 337 -69 -331 -379 679 181 -670 203 160 -306 188 220 777 -321 844 97 -161
4308 -161 -215 -556 189 58 16 -715 308 336 1109 -163 249 -794 -273 -218 171 -249 -134 81 -116 92
4328 92 -254 -166 -164 -465 411 501 -272 346 590 214 -246 111 13 46 221 -275 -275 -56 224 -358 -49 160 -13
4351 -13 318 32 129 -33 31 -259 -276 206 100 -745 314 63 -77 458 -256 -135 -476 254 21 952 390
4372 390 689 -86 -488 70 243 440 -59 242 -3 366 -709 147 125 395 -286 -219 39 -536 546 -298
4392 -298 -64 470 -83 -31 -192 -355 455 -169 -828 329 149 219 -287 -62 -454 -305 -336 305 -209 -632 483
4413 483 -351 79 176 141 429 213 -53 149 303 50 -170 387 102 -176 -444 -36 228 419 201 76 -22
4434 -22 243 352 209 -21 -117 -65 238 -158 -323 439 -54 137 -350 -324 -116 569 -421 47 -777 -467 -334
4455 -334 -118 -496 -132 171 -276 -546 -539 154 346 123 516 53 -142 116 125 -93 -10 314 472 502 401 -55
4477 -55 108 197 -155 115 399 225 -385 -656 -116 378 -500 -208 -433 393 -41 143 101 -119 375 -220 600
4498 600 252 15 -365 32 35 -1145 218 15 -136 163 -405 -154 222 101 -58 -295 90 85 194 238 -9
4519 -9 134 505 -254 -200 325 -928 425 -298 -562 -192 -332 373 -109 140 -11 639 -61 -258 51 -273
4539 -273 98 36 -128 -98 -508 763 223 65 247 463 70 304 -6 173 673 -36 54 -31 491 -194 242
4560 242 -51 467 231 -90 -196 2 859 -484 244 17 185 45 -39 -138 196 386 241 -330 -22 39 277
4581 277 466 260 -335 285 166 655 70 -326 653 -168 227 -550 43 413 -355 -245 -967 -179 434 -180
4601 -180 586 -304 -459 382 282 95 -101 316 -26 73 -46 -222 -136 -12 -321 -141 -190 104 181 72 261
4622 261 -47 29 -256 -406 -403 -212 169 -200 -17 348 3 257 -459 269 -166 -97 12 -321 -30 -467 349
4643 349 -451 -253 159 -17 -391 -66 -493 -164 356 -138 -378 147 448 295 447 291 22 171 -721 89
4663 89 196 -70 -516 -166 -151 138 297 -697 -55 333 -269 -116 -160 -273 -32 199 223 242 -104 228 -22 733
4685 733 230 122 -13 465 -128 568 351 -229 260 -94 145 153 -676 374 -131 -615 30 435 -207 -53
4705 -53 257 -147 -259 200 -334 731 595 -585 -90 -177 197 25 527 -766 -136 40 46 94 151 -733 415
4726 415 -158 -38 -382 203 785 56 -8 -489 20 -27 -166 292 42 -171 -103 246 -146 359 229 -136 -256
4747 -256 -92 -269 -163 68 -159 290 -217 -418 330 -417 -314 252 382 -133 456 679 437 350 133 -66
4767 -66 265 -720 105 250 222 280 220 490 -247 -766 230 412 -105 -136 -355 138 -157 -292 -392 -14 -230 113
4789 113 -112 302 -105 433 187 -641 -3 11 -146 -345 583 157 -474 651 484 -129 304 374 229 -109
4809 -109 14 129 58 199 -92 -491 -3 -522 -22 100 325 0 256 -2 61 21 -181 137 169 54 10 -3
4831 -3 649 295 132 273 52 331 -655 167 -324 130 -260 302 -62 -2 -84 -260 68 316 185 -301 -622
4852 -622 -9 400 -165 78 182 389 -437 438 222 -166 263 455 116 352 655 303 10 -189 198 458
4872 458 367 404 5 86 -11 -257 294 -175 486 774 83 -16 -34 -196 -768 152 24 594 148 307 -589 294
4894 294 284 -206 -363 -61 438 -80 41 -241 208 488 169 1153 171 -322 103 250 -505 34 35 -158 430
4915 430 354 -22 61 482 -472 -58 -52 -196 -167 -371 -388 -99 -349 174 18 487 -159 48 -137 -439 547 -274
4937 -274 105 28 457 -225 -869 -567 76 211 -150 340 -72 243 -73 194 -57 88 -207 248 237 216 -103
4958 -103 338 77 -75 154 -198 -436 -174 -98 -305 -105 -49 632 649 242 122 -200 -123 822 -314 -91 475
4979 475 158 307 -103 332 -359 251 55 133 222 380 85 -222 -669 589 575 546 -593 278 202 -284 190
5000 190 -416 218 353 117 -305 7 -148 76 301 -281 -314 -402 351 -42 307 130 815 17 -137 -552 -48
5021 -48 -40 521 149 48 291 -199 498 -287 -108 32 -163 -147 35 -296 -174 308 65 98 -245 -143 286 -103
5043 -103 198 54 -113 713 69 -444 209 444 17 435 -356 -446 68 147 21 -321 -74 288 445 -208 -149
5064 -149 85 96 -107 -77 32 -466 -312 -416 -228 291 -14 -30 -166 -104 173 -45 280 575 613 -30 -411 207
5086 207 -141 299 448 -112 -53 -410 429 47 95 -365 -234 -348 353 162 -365 -276 362 2 1 76 138 401
5108 401 354 378 -230 58 -381 -149 165 -56 -140 326 -284 -192 308 -410 143 -213 -247 -376 565 -469 -39
5129 -39 153 40 -81 -276 368 217 38 -135 -414 -550 -120 -568 -25 -219 -491 -51 -170 117 -238 -90
5149 -90 651 508 24 -75 322 765 -743 47 353 -70 427 672 -101 -54 205 -180 176 31 179 414 249
5170 249 499 -58 -139 -68 175 -67 295 178 -192 -461 -425 -347 -149 -168 231 -69 351 350 45 78 -142 -286 -252
5193 -252 231 -376 -19 215 602 -424 -287 -281 295 294 -130 -181 6 -328 342 310 241 163 -266 -77 -5 -202 -127
5216 -127 -330 254 256 -193 -725 301 274 -284 508 -276 603 412 -228 721 418 -120 -81 -89 152 342 -132 358
5238 358 30 -34 524 -86 -227 -392 205 -449 480 -539 390 222 -216 -309 -401 -171 -198 -115 194 208 -358 14
5260 14 -640 201 39 -439 229 -426 -496 -291 -59 -184 -117 -261 136 384 0 278 529 151 -22 7 447
5281 447 73 -13 16 268 552 367 64 15 -444 -134 -126 63 511 268 594 281 260 -226 510 500 203 -215
5303 -215 65 96 91 294 -17 318 -317 -317 -59 437 48 -81 390 356 -847 -15 434 113 -350 366 -294 267
5325 267 154 53 500 191 -765 273 277 60 28 155 -85 782 81 -99 335 258 306 -67 236 -116 181
5346 181 620 44 218 -430 -252 582 -221 512 -25 9 66 -205 -196 -113 -37 272 -612 -177 -271 -143 779 -258
5368 -258 -429 174 485 -11 159 392 -259 200 -65 309 -33 450 -409 20 -450 244 106 215 -113 -364
5388 -364 330 12 -134 -371 119 328 -352 147 564 -59 90 380 -132 114 -295 80 -258 -276 -59 -581
5408 -581 578 -183 -73 -390 -485 -2 264 62 -59 83 -224 267 -178 -38 382 -208 -125 -567 248 -356
5428 -356 -414 -348 -102 -340 368 -88 133 127 -125 95 179 716 496 1109 -351 -411 658 60 -226 -406 174
5449 174 373 -227 94 -29 -269 517 7 -816 30 -686 19 606 -12 -324 157 -70 567 -596 -43 26
5469 26 -339 -201 -340 53 -90 251 504 -315 119 141 -449 618 547 36 186 140 217 -175 -137 174 -46 13
5491 13 -31 -376 76 54 -88 598 -172 694 308 -60 366 -184 -484 -277 -116 -292 -264 224 214 413 4 -272
5513 -272 577 -86 -481 93 117 -136 212 -62 -106 16 366 377 515 -375 524 438 733 6 64 -297 -185 -400
5535 -400 474 520 631 -200 -1 -51 327 -472 -264 -466 -223 391 -65 699 -360 -224 -424 -23 167 -584
5555 -584 274 -156 -231 256 -304 214 -38 -322 -143 186 51 425 -30 328 149 81 106 -323 -370 -295 -177 255
5577 255 -361 190 -127 339 -91 -404 389 90 502 -89 90 233 121 -115 303 671 -38 656 -73 435
5597 435 -284 -233 -50 -367 551 -31 -85 -252 421 15 748 650 293 311 -17 84 352 247 -58 137 -50
5618 -50 -13 -61 44 -154 -37 236 -318 432 -99 -289 -250 56 -77 -222 171 531 424 44 131 93 -547 -226
5640 -226 111 120 341 249 -167 225 408 206 65 -11 10 408 -31 63 -288 -249 -176 -56 -148 536 5 330 -317
5663 -317 291 573 157 -558 198 -36 -313 -126 -167 -387 45 31 -491 228 65 -744 408 -173 24 -355
5683 -355 32 31 -464 -184 92 161 21 49 37 164 125 -246 -434 -146 50 -108 -152 65 -249 -122 291 -81
5705 -81 -123 -372 380 -312 451 84 256 793 -528 220 -516 379 -57 141 -519 -550 -49 106 219 -219 251
5726 251 -2 -399 -151 119 -109 -664 298 -134 632 99 265 77 -83 27 -371 204 -120 -96 67 15 -507
5747 -507 -394 50 425 -509 -137 -339 -203 136 -37 475 354 20 292 -44 -182 -753 695 -298 -228 -158
5767 -158 6 -351 -293 558 207 237 -299 -23 391 -53 -349 -26 -230 216 -236 625 -206 171 -111 155 475
5788 475 -180 570 24 -315 -248 852 -540 172 -75 -25 -142 168 -156 -917 56 31 187 -96 93 -109
5808 -109 70 552 -165 71 -886 219 -1 296 -464 63 139 -49 100 231 489 -241 331 18 644 222
5828 222 -151 -126 -19 -114 -280 -399 800 -34 -123 86 191 -472 -311 -195 295 -199 -46 340 -123 24 -10
5849 -10 -298 -315 591 384 96 84 432 91 27 271 52 391 -417 -795 -218 243 182 -408 37 -368 491 163
5871 163 -155 -91 609 -321 157 266 -142 627 -46 67 -196 231 -528 -257 165 -221 49 349 433 -248 124
5892 124 266 207 -44 299 -55 143 98 422 227 262 -178 -275 -181 223 -22 -575 -255 119 266 -221 -422 211
5914 211 -179 296 -68 -48 472 -556 -8 -111 -322 125 116 -111 -498 185 -254 -245 52 -7 -19 -140 -55 -13 -201
5937 -201 -662 301 -320 -115 -245 6 -421 -344 660 -132 292 -345 150 -396 -275 96 244 11 288 85
5957 85 360 -38 63 164 122 -548 686 -339 -843 -233 -113 -428 18 502 127 129 -563 -422 195 -117 -76
5978 -76 66 -129 18 -141 -607 599 42 -108 -125 -166 -7 -27 -181 -103 -148 -571 -361 142 -296 -106 -349 78
6000 78 162 -503 309 32 319 155 -84 56 345 -390 -251 -248 201 249 -288 266 47 331 -258 290 88 -636
6022 -636 204 374 -219 -371 572 -285 -34 -525 937 -211 34 -200 144 -6 82 -105 304 -250 -17 395
6042 395 -105 -625 103 210 207 353 -174 -279 -547 -466 -444 -502 269 -517 553 9 -345 394 -256 -332 118 -44
6064 -44 253 -358 40 -130 -112 409 -170 -649 -709 199 228 41 -296 273 -317 -260 130 521 -10 146 -130 5
6086 5 -1 202 1081 278 494 236 513 73 -484 -214 -441 171 222 -32 -120 -425 -172 254 -131 -282 672 357
6108 357 67 -354 -76 -5 97 292 10 207 445 -257 -112 678 245 -450 25 -639 73 -219 -160 58 16
6129 16 285 -93 -224 1152 -602 -111 -51 -92 -43 -201 -340 -111 657 234 -192 122 -237 -462 -197 332 -64
6150 -64 -265 87 -198 373 454 -362 309 261 -39 298 -543 35 262 231 -284 -399 230 444 -407 -430 -316 -176
6172 -176 -175 -769 402 -152 -521 167 -826 -7 123 -501 -528 -363 -369 259 191 421 -374 -247 316 279 344 635
6194 635 370 325 -318 -290 -240 -250 519 50 127 123 -658 -604 -309 260 231 -531 -785 54 -232 382 270 -27 564
6217 564 -435 -320 286 -6 -203 160 -50 -138 -521 -728 294 123 15 371 483 -203 -457 794 369 349
6237 349 105 134 373 -490 495 -306 -41 350 48 -79 -93 -157 -438 -44 384 134 -96 131 -384 42 -200
6258 -200 21 -192 -203 443 -117 -305 -14 185 99 352 -224 -194 -293 -361 333 169 249 -146 33 172 -342 -81
6280 -81 -123 230 381 -599 -255 202 38 302 -67 116 -104 334 128 29 -265 -299 317 -125 -113 80 549 76
6302 76 116 262 80 345 507 -27 -196 227 -195 -75 -122 437 -541 16 193 -260 320 607 449 -288 -276
6323 -276 -28 126 -102 24 41 130 749 85 -310 -111 44 -474 346 -515 133 -278 183 -443 -121 406 -436
6344 -436 -139 -157 -51 545 255 -285 -61 -222 -473 318 831 -117 -215 108 150 -200 -199 233 203 -146 538 -306
6366 -306 -81 42 -380 -575 456 -252 -575 432 -453 186 223 -240 -112 -340 417 102 539 195 138 550
6386 550 -115 -52 -402 125 575 -372 -325 -156 -24 349 85 -256 -351 248 -233 41 -226 26 -72 -540 -334
6407 -334 -216 -194 142 -154 318 -116 -296 -626 -60 14 719 -230 -588 331 -398 233 -311 -406 213 82 275
6428 275 -316 -713 545 -459 673 -1 681 -962 -758 -112 -535 -244 -410 -8 323 -88 72 -389 -348
6447 -348 -201 -421 478 -295 298 -236 322 355 -9 448 179 -250 140 495 -83 -32 705 -42 -361 -436 -308
6468 -308 -103 -438 -177 42 -81 36 317 -221 70 -18 42 -82 -66 -170 20 101 -183 -288 42 -170 352
6489 352 224 -258 280 200 -3 -226 273 -162 -493 725 -235 387 413 -436 -552 -882 23 -198 127 398
6509 398 40 -418 -788 450 461 79 34 -294 -104 -317 -40 508 317 -437 568 459 462 52 320 135 -31
6530 -31 -356 -392 -17 -41 -240 -633 -433 -298 499 -368 -77 212 -173 -9 -95 -205 576 68 3 238 -14 260
6552 260 -281 450 -120 -331 -282 148 383 -249 230 58 109 760 55 292 -35 204 -1 -55 562 292 -196
6573 -196 -38 402 492 125 -262 122 575 26 -832 -477 -216 245 -469 97 65 4 310 -17 158 179 19
6594 19 -330 175 -332 -14 -173 -147 -245 -53 37 42 62 155 357 -620 -116 -273 335 -241 316 233 55 719 -440
6617 -440 441 129 223 561 -292 -146 -201 -559 -261 -212 -670 92 -51 79 -342 -188 -413 192 656 689 -92
6638 -92 -548 203 -601 406 155 -163 -310 -97 -45 560 87 325 173 -19 52 -115 343 28 61 -474 -175
6659 -175 -93 -10 271 -885 -114 -178 174 -112 -63 -290 186 -187 158 132 -412 -142 305 -251 179 73 -391
6680 -391 320 77 70 450 140 -215 -344 -461 332 -385 5 74 288 333 -97 -309 -334 -265 -497 -256 -102 -238
6702 -238 -136 66 62 94 102 155 266 -181 -158 -15 294 112 175 181 -24 -549 79 288 -473 -52 2 317 -375 -58
6726 -58 -343 293 844 -174 97 105 75 501 54 -36 -83 -95 238 -59 50 155 -96 108 276 -209 115 -189
6748 -189 -145 111 666 -252 450 88 288 -43 -49 14 -245 367 -74 89 -585 -50 338 -126 106 -454 477
6769 477 -71 -41 153 -248 -127 283 328 58 -289 -452 -117 8 308 -97 93 295 50 211 -325 -178 168
6790 168 -384 -801 -562 -120 -148 115 281 -675 -311 -457 -206 21 45 -369 -338 -460 -140 309 -335 247 -71
6811 -71 -270 -305 599 415 -468 32 -9 -781 -482 -123 244 -236 -230 82 -14 320 147 -214 -455 -352 212 -159
6833 -159 131 218 142 491 -34 111 398 -355 -433 13 47 192 -799 -587 -19 170 -511 75 407 -108 287
6854 287 -91 330 373 408 -439 241 -191 -217 404 303 55 -595 -713 -106 -33 318 219 -167 -159 270 34 298
6876 298 145 190 190 -51 -242 -198 -346 122 -174 292 -10 -633 -160 -315 129 -632 -38 71 395 194 430
6897 430 -185 169 -399 404 43 33 -140 -123 -14 247 37 290 572 -492 893 20 -307 88 -71 -142
6917 -142 85 -119 276 -445 259 -9 -309 -460 -94 -381 187 -271 196 89 496 119 192 -350 278 430
6937 430 284 326 -478 428 -355 144 179 -172 135 303 -311 -66 -371 -455 133 180 -51 199 108 479 193 118
6959 118 309 -45 -389 -752 -348 95 91 68 259 -206 -233 476 116 292 352 456 -483 -207 -520 -38 -169 150
6981 150 -377 16 152 152 -483 164 176 -49 -200 -280 435 -166 -438 75 174 -234 268 267 362 -88 -488 415 126
7004 126 -113 75 -606 247 329 317 94 -9 96 -438 45 -30 -212 -460 131 -12 -78 -275 229 -136 -741
7025 -741 239 -236 -31 472 51 -303 -71 201 -22 -75 -156 69 34 -285 -377 673 -818 367 -293 426
7045 426 203 -166 868 -208 1007 -38 -37 -155 299 -4 -243 102 167 -664 -78 210 22 18 -46 -137 -270
7066 -270 -67 49 371 -342 -98 -68 303 358 -169 21 275 -175 377 -14 162 58 -581 56 10 -218 -183
7087 -183 -259 537 110 -40 387 381 -48 -229 -36 251 -148 117 23 63 -245 46 199 461 -382 315 380 -166
7109 -166 -386 360 -671 434 -360 82 488 -101 350 -505 -435 96 -279 82 297 -252 -7 -182 151 -514
7129 -514 -4 73 794 428 125 -298 24 -157 -235 100 59 -3 560 74 844 -517 11 -325 115 -187 612
7150 612 160 -149 268 -663 -85 437 285 -11 -358 45 526 -421 -79 407 563 -519 554 -51 -12 -18
7170 -18 -697 -262 378 -370 68 -925 -185 -405 65 233 124 523 -191 389 89 271 -184 233 -235 -137 -71
7191 -71 80 135 1 -14 -10 166 592 523 118 -286 165 -25 -693 26 77 148 -410 -442 169 331 -286 -315 -93
7214 -93 -249 -582 -36 -228 -448 85 -469 42 -77 -198 84 292 334 221 -95 -662 211 458 -82 378 529
7235 529 -2 -3 -642 -416 531 44 -248 416 298 293 -44 -469 -140 399 39 -418 372 -119 -20 279 -144 -5
7257 -5 -72 -20 45 157 -251 -293 284 -157 -132 -10 -131 -193 543 404 406 193 319 -230 52 98 -231 -82 -194 39
7281 39 -131 637 622 176 -350 222 -291 70 -566 629 -561 159 384 -230 -521 -828 61 -69 172 -202
7301 -202 -115 168 379 52 165 -672 321 151 573 -323 307 -436 127 -17 -527 444 444 -454 131 293 252
7322 252 239 185 -319 37 822 48 -20 -409 -95 -31 87 461 -476 -424 -12 -33 306 406 -304 -186 388 88
7344 88 169 83 179 -340 155 496 24 -56 543 -457 247 -621 463 345 -475 -271 225 -259 159 -31 327
7365 327 -51 -315 -60 350 183 -103 308 52 40 -47 -220 -19 33 -181 -321 232 108 132 314 29 149
7386 149 114 156 -27 -760 421 251 -59 -55 -293 -378 -129 -167 359 66 34 107 254 -62 -77 69 340 224 681
7409 681 62 -89 -183 -128 -258 -321 -25 541 457 42 -560 -480 18 36 -239 305 293 -257 241 537 -459 -474 -256
7432 -256 -327 32 -396 -441 -59 -382 -407 -84 163 -304 93 -238 535 -48 4 -115 -5 -279 647 -163 26
7453 26 -218 707 7 -553 80 277 -339 -860 73 170 -287 -185 -318 144 -254 -202 -353 -244 -323 145 446
7474 446 643 -67 261 -290 42 -64 -94 -15 -250 352 103 -32 -300 -35 552 -38 134 16 -206 -106 132
7495 132 779 -14 -199 -102 639 -47 -487 77 -319 -279 24 -282 73 182 248 -36 295 308 55 90 -222 -107
7517 -107 414 168 449 -553 328 -224 39 -271 -93 -162 -237 -94 -34 577 -351 -39 -656 -70 432 -150 332
7538 332 230 169 302 -136 -295 -88 -63 439 461 -80 -212 220 412 -215 -119 -86 151 162 107 -103 -93 6 -80
7561 -80 -48 129 131 408 -44 49 204 734 -224 338 431 -110 -398 314 -160 -125 155 -285 153 -240 145 -162
7583 -162 -281 -201 -325 -27 650 -270 -199 -39 313 329 -222 427 -325 51 152 -37 -163 -510 24 -191 -258
7604 -258 372 295 765 342 466 429 -374 -206 221 -143 -172 -102 188 548 221 721 -315 -432 342 -71 -101
7625 -101 -311 -207 -51 -323 -433 -659 -492 -389 -80 -56 482 -256 -368 127 -443 -666 47 350 -864 -504
7645 -504 522 -11 322 274 152 335 375 -124 181 144 -532 270 201 -22 121 -212 512 165 -345 -18 204
7666 204 547 177 105 -229 250 -359 -90 29 93 84 439 -510 -227 -11 -162 -86 197 -279 -45 805 294 121
7688 121 -103 77 -401 176 -15 -477 -348 -47 -513 -91 -153 -165 143 474 -38 92 -54 440 -428 -102 45
7709 45 87 13 -438 508 -303 87 662 35 652 30 -552 -10 -210 -334 -32 -313 -128 -214 280 -313 -478
7730 -478 -249 -689 -142 55 -437 46 79 415 213 405 5 -99 -528 288 -194 -324 -214 148 -336 -244 -472
7751 -472 387 -54 324 -560 202 637 -697 -197 171 37 260 513 208 -234 454 224 202 106 881 -130
7771 -130 -190 181 -140 -122 24 151 -243 -108 -191 298 639 -153 -161 80 104 75 108 -323 -96 90 -77 -15 -703
7794 -703 177 122 276 14 -345 490 -150 -115 -327 -556 15 111 351 -29 -137 12 425 302 -150 -597 -208
7815 -208 -110 -675 20 127 123 -3 -167 165 72 -468 206 -3 -256 688 -398 152 8 -560 -168 -211 90
7836 90 247 -480 -34 95 580 -427 164 302 495 355 -456 416 -329 -180 308 187 76 179 100 124 370
7857 370 90 -220 -26 -415 -181 -173 255 -61 222 759 583 -91 -95 144 -418 -147 235 349 91 95 224 74
7879 74 -142 29 -211 277 273 -216 272 -154 -23 -523 -170 -61 83 -245 -380 67 -51 -452 -369 165 72 230
7901 230 425 225 -326 -86 -637 -55 114 491 715 197 -98 -75 34 -132 -135 158 -76 554 597 133 258
7922 258 -413 -131 -95 569 49 56 600 116 480 -50 -239 -713 548 81 -39 267 -120 207 12 62 -250
7943 -250 101 330 190 -512 626 -206 -138 531 34 -38 -206 -41 356 290 17 790 -65 210 313 -153 -15
7964 -15 203 170 -164 -600 -144 -189 -56 173 163 456 9 -134 -399 475 -63 -532 -77 307 67 166 -157 -36
7986 -36 195 900 435 39 -44 82 -515 -89 775 -83 -94 317 256 -137 -345 11 -398 310 85 -229 17
8007 17 107 -3 -390 167 316 -6 -259 -256 137 -96 227 109 -364 -279 314 68 188 -256 497 211 517 264
8029 264 347 267 -355 -96 263 -836 -101 -134 30 -647 -43 -113 56 155 84 283 -63 -29 -602 314 -169 -132
8051 -132 31 658 10 167 -359 301 29 -291 -103 -189 -187 738 222 -277 460 378 71 -433 -30 -98 260 -71
8073 -71 -169 -273 -74 -620 376 -150 -354 -328 -128 500 -463 -86 -550 520 216 149 412 474 -131 -311 313
8094 313 225 427 -106 325 637 -210 183 9 -163 -69 -183 145 190 -7 96 626 324 150 -180 217 -89
8115 -89 -55 603 101 -311 14 -47 178 -459 -287 -232 -209 157 -464 -224 3 163 -702 -253 -196 -4 657 -99
8137 -99 -498 327 148 152 169 -621 -229 254 -83 -104 -259 -435 -557 25 89 -667 410 79 58 223 -147 53
8159 53 -2 -20 -245 -229 415 192 149 251 -127 -495 -211 -210 110 26 -144 -427 144 -114 774 -875 264 158
8181 158 -126 152 -647 172 -658 282 283 521 236 -32
8191c2
##END NTUPLES=NMR FID
##END=
