##TITLE=1H_SR166Et
 DMSO-d6
 64 sc, 
 20.4.2023
##JCAMPDX= 6.0         $$ Bruker NMR JCAMP-DX V2.0
##DATA TYPE= NMR FID
##DATA CLASS= NTUPLES
##ORIGIN= UXNMR, Bruker Analytische Messtechnik GmbH
##OWNER= root
$$ XWIN-NMR		Version 3.5
$$ Thu Apr 20 14:44:59 2023 Russian Standard Time (UT+4h)  she@DPX200
##.OBSERVE FREQUENCY= 200.1316
##.OBSERVE NUCLEUS= ^1H
##.DELAY= (6, 6)
##.ACQUISITION MODE= SIMULTANEOUS
##.ACQUISITION SCHEME= undefined
##.AVERAGES= 64
##.DIGITISER RES= 18
##SPECTROMETER/DATA SYSTEM= spect
##.PULSE SEQUENCE= zg30
##.SOLVENT NAME= CDCl3
##.SHIFT REFERENCE= (INTERNAL, CDCl3, 0, 15.7039)
##AUDIT TRAIL= $$ (NUMBER, WHEN, WHO, WHERE, WHAT)
$$ ##TITLE= Audit trail, XWIN-NMR		Version 3.5
$$ ##JCAMPDX= 5.01
$$ ##ORIGIN= Bruker BioSpin GmbH
$$ ##OWNER= she
$$ F:/spectra/data/she/nmr/H-F/1/audita.txt
$$ ##AUDIT TRAIL=  $$ (NUMBER, WHEN, WHO, WHERE, WHAT)
(   1,<2023-04-20 14:44:12.07 +0400>,<she>,<DPX200>,
      <continue with go, POWCHK disabled, PULCHK disabled
       configuration hash MD5:
       00 E9 B6 7A A2 85 ED C7 34 08 36 98 17 FE 4E 26
       data hash MD5: 16K
       29 38 77 2B E6 B9 4A 13 63 45 DC 51 9C 1A 17 A4>)
$$ ##END=
$$ 
$$ hash MD5
$$ C0 B4 8F 35 A6 CA BF 90 C1 3A 25 A3 79 C2 BB 47
##$RELAX= 
##$RELAX= 
##$RELAX= 
##$RELAX= 
##$RELAX= 
##$RELAX= 
$$ Bruker specific parameters
$$ --------------------------
##$DU= <F:/spectra>
##$EXPNO= 1
##$NAME= <H-F>
##$PROCNO= 1
##$TYPE= <nmr>
##$USER= <she>
##$AMP= (0..31)
100 100 100 100 100 100 100 100 100 100 100 100 100 100 100 100 100 100 
100 100 100 100 100 100 100 100 100 100 100 100 100 100 
##$AQSEQ= 0
##$AQ_mod= 1
##$AUNM= <au_zg>
##$AUTOPOS= <>
##$BF1= 200.13
##$BF2= 200.13
##$BF3= 200.13
##$BF4= 200.13
##$BF5= 200.13
##$BF6= 200.13
##$BF7= 200.13
##$BF8= 200.13
##$BYTORDA= 1
##$CFDGTYP= 0
##$CFRGTYP= 5
##$CHEMSTR= <none>
##$CNST= (0..31)
1 1 145 1 1 1 1 1 1 1 1 1 1 1 1 1 1 1 1 1 1 1 1 1 1 1 1 1 1 1 1 1 
##$CPDPRG= <>
##$CPDPRG1= <>
##$CPDPRG2= <>
##$CPDPRG3= <>
##$CPDPRG4= <mlev>
##$CPDPRG5= <mlev>
##$CPDPRG6= <mlev>
##$CPDPRG7= <mlev>
##$CPDPRG8= <mlev>
##$CPDPRGB= <>
##$CPDPRGT= <>
##$D= (0..31)
0 1.2 0 0 0 0 0 0 0 0.06 0 0.03 0 0 0 0 0.0002 0 0 0 0 0 0 0 0 0 0 0 0 
0 0 0 
##$DATE= 1681987229
##$DBL= (0..7)
120 120 120 120 120 120 120 120 
##$DBP= (0..7)
150 150 150 150 150 150 150 150 
##$DBP07= 0
##$DBPNAM0= <>
##$DBPNAM1= <>
##$DBPNAM2= <>
##$DBPNAM3= <>
##$DBPNAM4= <>
##$DBPNAM5= <>
##$DBPNAM6= <>
##$DBPNAM7= <>
##$DBPOAL= (0..7)
0.5 0.5 0.5 0.5 0.5 0.5 0.5 0.5 
##$DBPOFFS= (0..7)
0 0 0 0 0 0 0 0 
##$DE= 6
##$DECBNUC= <off>
##$DECIM= 32
##$DECNUC= <off>
##$DECSTAT= 4
##$DIGMOD= 1
##$DIGTYP= 9
##$DL= (0..7)
0 120 120 120 120 120 120 120 
##$DP= (0..7)
150 150 150 150 150 150 150 150 
##$DP07= 0
##$DPNAME0= <>
##$DPNAME1= <>
##$DPNAME2= <>
##$DPNAME3= <>
##$DPNAME4= <>
##$DPNAME5= <>
##$DPNAME6= <>
##$DPNAME7= <>
##$DPOAL= (0..7)
0.5 0.5 0.5 0.5 0.5 0.5 0.5 0.5 
##$DPOFFS= (0..7)
0 0 0 0 0 0 0 0 
##$DQDMODE= 0
##$DR= 18
##$DS= 0
##$DSLIST= <SSSSSSSSSSSSSSS>
$$ [...]
##$SUBNAM2= <"">
##$SUBNAM3= <"">
##$SUBNAM4= <"">
##$SUBNAM5= <"">
##$SUBNAM6= <"">
##$SUBNAM7= <"">
##$SUBNAM8= <"">
##$SUBNAM9= <"">
##$SW= 18.0517057926174
##$SWIBOX= (0..15)
0 0 2 0 0 0 0 0 0 0 0 0 0 0 0 0 
##$SW_h= 3612.71676300578
##$TD= 16384
##$TD0= 1
##$TE= 0
##$TE2= 300
##$TE3= 300
##$TEG= 300
##$TL= (0..7)
0 120 120 120 120 120 120 120 
##$TP= (0..7)
150 150 150 150 150 150 150 150 
##$TP07= 0
##$TPNAME0= <>
##$TPNAME1= <>
##$TPNAME2= <>
##$TPNAME3= <>
##$TPNAME4= <>
##$TPNAME5= <>
##$TPNAME6= <>
##$TPNAME7= <>
##$TPOAL= (0..7)
0.5 0.5 0.5 0.5 0.5 0.5 0.5 0.5 
##$TPOFFS= (0..7)
0 0 0 0 0 0 0 0 
##$TUNHIN= 0
##$TUNHOUT= 0
##$TUNXOUT= 0
##$USERA1= <user>
##$USERA2= <user>
##$USERA3= <user>
##$USERA4= <user>
##$USERA5= <user>
##$V9= 5
##$VALIST= <valist>
##$VCLIST= <CCCCCCCCCCCCCCC>
##$VD= 0
##$VDLIST= <DDDDDDDDDDDDDDD>
##$VPLIST= <PPPPPPPPPPPPPPP>
##$VTLIST= <TTTTTTTTTTTTTTT>
##$WBST= 1024
##$WBSW= 4
##$XGAIN= (0..3)
0 0 0 0 
##$XL= 0
##$YL= 0
##$YMAX_a= 792573
##$YMIN_a= -1494615
##$ZGOPTNS= <>
##$ZL1= 120
##$ZL2= 120
##$ZL3= 120
##$ZL4= 120
##$ABSF1= 10
##$ABSF2= 0
##$ABSG= 5
##$ABSL= 3
##$ALPHA= 0
##$AQORDER= 0
##$ASSFAC= 0
##$ASSFACI= 0
##$ASSFACX= 0
##$ASSWID= 0
##$AUNMP= <proc_1d>
##$AZFE= 0.1
##$AZFW= 0.1
##$BCFW= 1
##$BC_mod= 2
##$BYTORDP= 1
##$COROFFS= 0
##$CY= 11.3945322036743
##$DATMOD= 1
##$DC= 2
##$DFILT= <>
##$DTYPP= 0
##$F1P= 15.7292609196834
##$F2P= 12.9074282941183
##$FCOR= 0.5
##$FTSIZE= 0
##$FT_mod= 4
##$GAMMA= 1
##$GB= 0.15
##$INTBC= 1
##$INTSCL= 1
##$ISEN= 128
##$LB= 0.24
##$LEV0= 0
##$LPBIN= 0
##$MAXI= 10000
##$MC2= 0
##$MEAN= 0
##$ME_mod= 0
##$MI= 1.114404
##$NCOEF= 0
##$NC_proc= 0
##$NLEV= 6
##$NOISF1= 3.799351
##$NOISF2= 2.8
##$NSP= 1
##$NTH_PI= 0
##$NZP= 0
##$OFFSET= 15.70392
##$PC= 1
##$PHC0= -19838.12
##$PHC1= 18.2008
##$PH_mod= 1
##$PKNL= yes
##$PPARMOD= 0
##$PSCAL= 0
##$PSIGN= 0
##$REVERSE= no
##$SF= 200.130013532006
##$SI= 16384
##$SIGF1= 3
##$SIGF2= 2
##$SINO= 400
##$SIOLD= 16384
##$SREGLST= <1H.CDCl3>
##$SSB= 0
##$STSI= 0
##$STSR= 0
##$SW_p= 3612.71676300578
##$SYMM= 0
##$S_DEV= 0
##$TDeff= 0
##$TDoff= 0
##$TI= <>
##$TILT= no
##$TM1= 0
##$TM2= 0
##$TOPLEV= 0
##$USERP1= <user>
##$USERP2= <user>
##$USERP3= <user>
##$USERP4= <user>
##$USERP5= <user>
##$WDW= 1
##$XDIM= 8192
##$YMAX_p= 0
##$YMIN_p= 0
$$ End of Bruker specific parameters
$$ ---------------------------------
##NTUPLES= NMR FID
##VAR_NAME=  TIME,          FID/REAL,        FID/IMAG
##SYMBOL=    X,             R,               I
##VAR_TYPE=  INDEPENDENT,   DEPENDENT,       DEPENDENT
##VAR_FORM=  AFFN,          ASDF,            ASDF
##VAR_DIM=   8192,          8192,            8192
##UNITS=     SECONDS,       ARBITRARY UNITS, ARBITRARY UNITS
##FACTOR=    0.0002768,     1,               1
##FIRST=     0,             0,               0
##LAST=      2.2672688,     0,               0
##MIN=       0,             -1494615,        0
##MAX=       2.2672688,     792573,          0
$$ Real data points
##PAGE= N=1
##DATA TABLE= (X++(R..R)), XYDATA
0 0 0 0 0 0 0 0 0 0 0 0 0 0 -64 64 -64 64 -115 128 -128 192 -192 256 -320 384 -448 512 -576 667 -768
29 -768 896 -1024 1153 -1325 1488 -1684 1907 -2139 2399 -2681 2990 -3333 3699 -4108 4555 -5037
45 -5037 5564 -6143 6773 -7471 8228 -9060 9982 -11000 12132 -13407 14836 -16452
57 -16452 18308 -20458 22987 -26010 29690 -34302 40267 -48310 59848 -77837 110182 -186924
69 -186924 792573 215553 -491435 628724 210881 39351 -296074 -258409 -383275 -411243
79 -411243 -206280 -551105 -669583 -74726 -241372 -312928 -154620 70736 190851 44513
89 44513 206190 361370 244311 399083 222455 190863 356426 93726 -10431 92500
99 92500 -56286 -166760 -153236 -117164 -291060 -294672 -52549 -213642 -301173 27294 16580
110 16580 -125083 54031 200912 83801 73606 259343 187698 60540 214165 155669 -23261
121 -23261 69567 67177 -95362 -114395 -42983 -91922 -205884 -124922 -83778 -184172 -72513
132 -72513 -27368 -119023 13500 97976 4740 21599 148237 136055 31539 127599 147578
143 147578 11289 98860 84486 -63642 -1024 29574 -62125 -127508 -49625 -7619 -162642
154 -162642 -91114 14282 -118467 -47562 42550 -36925 -17459 60989 75334 -13169 38971
165 38971 147012 2278 11628 116696 -385 -8403 41558 -6813 -36689 -19365 14773 -63672
177 -63672 -64016 29938 -58021 -64546 28830 -23480 -31500 25695 21569 -13875 12068 67161 -2776
190 -2776 -9642 78543 10335 -27083 42264 11918 -38223 -3456 16976 -41236 -40361 23412 -28954
203 -28954 -61374 17926 538 -46502 9242 28450 -17008 -2222 43135 6915 -14187 44307
215 44307 26796 -22676 25036 28239 -27229 -5038 19878 -20933 -27631 9854 -7521 -40461
227 -40461 922 5327 -38977 -2116 22268 -20366 -5689 29024 3486 -12761 22160 23004 -16582
240 -16582 15712 32254 -19176 -1992 28218 -13321 -19935 14650 3637 -28539 -697 13124
252 13124 -30211 -10664 19220 -17720 -14438 19201 2379 -14842 8280 17626 -9231 2261
264 2261 25372 -4201 -5663 23273 -1158 -14076 12155 5742 -17129 798 10191 -18564 -10993
277 -10993 12629 -11766 -18098 12781 4336 -17839 7977 15622 -12417 1374 22079 -2112 -6199
290 -6199 18187 7314 -10348 7315 11329 -11581 -3110 10921 -10480 -12019 7675 -7175 -16156
303 -16156 2452 1062 -12897 551 7927 -6876 -3015 13004 -1463 -6089 14460 8125 -7639
316 -7639 8330 11035 -9961 -1059 10667 -6294 -8268 7714 -623 -12945 76 3719 -10874
329 -10874 -2113 8587 -5111 -4335 9856 931 -6606 8030 7412 -4916 4301 7914 -5210 -1708
343 -1708 7936 -4345 -7110 6557 124 -11019 493 3679 -9698 -2789 6775 -4067 -4972 7660
357 7660 2013 -6638 4518 5963 -4144 1623 9389 -2856 -3133 8042 -558 -6117 3190 2676 -6948
372 -6948 -759 3248 -6113 -3790 4346 -4513 -5141 4862 1074 -5364 2477 4624 -4319 325 7678
387 7678 -1557 -1273 6757 702 -4377 3126 2714 -3497 -177 3873 -4089 -5055 4684 -1884 -7016 3202
403 3202 1131 -3656 990 2870 -2225 -1995 4249 -1245 -3123 5416 1120 -4095 2324 2576 -3180 -1657
419 -1657 3567 87 -4114 3090 -97 -5123 2421 1113 -3364 1026 2345 -2323 -2429 2677 909
434 909 -3276 3131 2430 -3019 2092 2263 -2487 653 2862 -422 -2192 2781 1968 -4742 287 2096
450 2096 -3660 -340 1342 -1729 -1925 1128 755 -3544 325 2336 -2175 909 4090 -1814 -58 3668
466 3668 75 -606 1399 1838 -1846 -956 1424 -3471 -1453 2316 -2945 -1984 1031 -32 -1874 -871
482 -871 1502 -2105 -882 4071 -585 -153 4022 600 -240 1833 3024 217 -1139 3332 -914 -2867
498 -2867 2491 -2728 -2725 1038 -1153 -1579 -697 389 -126 -2512 2468 818 -1250 4357 1238 -981 2263
515 2263 872 1305 220 1693 1700 -2582 1357 -622 -3197 1266 -725 -1867 -806 -675 -186 -1955 604
532 604 2017 -1641 2877 2408 -958 2539 1464 326 798 891 1261 -2387 470 1428 -3915 -232 -217
549 -217 -3001 -370 -502 -808 -1054 -624 917 -1222 450 3048 135 596 1880 -304 1895 208 178
566 178 206 -920 1403 -1592 -1583 751 -2109 -413 -399 -1393 -145 -472 507 -517 -499 2559 937 -395
584 -395 2825 624 -26 1427 0 1143 -1033 118 304 -2035 348 -1345 -2671 693 -1534 -845
600 -845 211 -431 1493 -555 477 1091 -315 2072 833 395 1172 -416 319 -422 -63 708 -1920
617 -1920 400 -314 -2149 -282 -555 -1101 -156 -975 226 -269 -704 818 -403 1018 888 -204 1151
634 1151 487 63 457 -1153 -77 -335 -1270 266 -1380 -997 -5 -1436 -355 -237 -19 176 524 -129
652 -129 -641 -487 1365 -164 681 838 -195 640 -312 69 -13 -492 -44 -9 -1350 97 -694 -851 -7
671 -7 -990 197 379 -286 883 197 429 298 176 1129 583 492 1144 383 -90 -417 -465 246 -1485 -115
691 -115 -786 -880 -139 -301 -50 301 -49 709 187 534 820 85 410 487 -309 727 127 488 -276 -672 159
712 159 -507 -490 -405 -11 -23 -588 -879 -1005 -132 599 -474 153 19 536 -169 692 316 371 435 -298 -39 447
734 447 432 121 -33 372 235 -393 529 -388 171 -415 177 -1103 -542 260 89 301 696 886 40 81 176
755 176 142 -436 -284 -135 -63 -730 355 -573 414 80 -206 95 135 384 401 155 253 -40 331 -58 294 178
777 178 92 -291 389 64 -344 262 169 513 -213 -435 109 -302 5 -67 -93 -546 489 629 -81 -283 25
798 25 696 490 -32 53 -185 -331 -145 564 -1038 -257 82 -462 -224 -30 -232 206 -167 132 -98 67 -281
819 -281 -35 268 340 -415 -295 -36 -186 150 655 -387 194 -236 -107 866 440 -691 11 197 613 155
839 155 47 -392 -257 -789 206 -154 -807 -208 176 -148 -573 489 -186 -215 -259 -588 -432 -162 180 -338 -1196
860 -1196 342 -224 -5 206 -120 50 -289 -407 642 473 -409 18 -139 19 -263 -94 -150 -104 238 -53
880 -53 163 -438 -399 -276 326 548 -458 908 -1003 45 -150 -58 57 -25 -14 -581 -288 378 528 39 658
901 658 455 -141 -673 419 -180 793 -61 405 -239 -304 583 -411 153 -519 -6 633 421 -445 -209 854
921 854 -814 130 899 -505 420 -87 -41 -205 -105 400 -51 44 263 -890 397 625 221 -830 -881 -221
941 -221 -106 -482 242 251 412 1056 338 -219 595 339 477 -338 -368 -126 -590 -52 354 54 -287 335 250 -329
963 -329 -179 -840 -245 -523 59 251 -177 628 457 166 701 875 222 98 175 357 -335 -136 505 33 77
984 77 411 -169 406 -393 -714 -139 336 -74 514 305 -308 93 310 699 -414 -263 506 465 242 270 -46
1005 -46 -196 -127 469 -463 717 447 -864 428 829 849 -163 429 672 -75 -476 -254 -454 34 34 -38 303
1026 303 -292 -103 48 645 456 -222 -159 -609 -405 -178 351 122 160 297 357 136 -224 213 391 -370 -239
1047 -239 -184 -403 0 -130 279 -4 -362 199 671 -219 565 -497 -390 -187 21 -434 -941 -38 -245 -313
1067 -313 306 -146 315 -31 -368 -525 -113 214 -133 368 525 554 -79 28 524 -539 -560 -109 -68 -216 232
1088 232 132 -315 465 473 -192 481 52 -35 355 36 -422 -502 259 -104 -790 -67 -164 -29 -411 -422 -327 552
1110 552 -50 352 225 -107 131 -665 237 300 48 636 150 -274 11 94 -395 -493 -186 -444 -25 486 354
1131 354 -330 43 -490 111 -603 -303 254 418 -267 -131 -42 331 54 2 -52 -264 -207 -341 -45 -298 -92
1152 -92 98 21 -80 609 35 -111 -535 -226 -431 -198 373 757 99 166 207 407 -156 202 -251 -105 -104 653
1174 653 286 -325 218 -534 -267 136 -1101 -337 267 -177 -253 -647 -113 94 450 478 392 -575 -498 -731 835
1195 835 748 -207 311 1 530 299 202 147 278 -581 257 -571 247 187 642 -129 -296 -88 39 -267 -756
1216 -756 -71 -622 -503 -533 89 -146 -478 -54 -370 -759 72 -269 7 -256 -270 -490 261 -1 -311 55 -421
1237 -421 -133 -492 -186 25 162 917 216 -7 -377 -310 1215 277 -14 237 -91 -97 37 57 -131 483 504
1258 504 -322 951 58 -329 -80 -127 -216 146 525 -176 450 -38 -375 393 -332 -409 -786 -422 -615 175 196
1279 196 -267 506 -636 -79 15 -86 82 -313 -164 604 -707 -8 752 -230 188 573 -601 314 121
1298 121 764 213 -225 456 158 -369 -263 97 -184 -252 0 247 459 -213 -127 205 492 338 153 118 218
1319 218 119 -90 239 -325 -720 247 567 224 69 -101 -209 310 558 -208 154 347 305 59 222 66 250
1340 250 -801 -268 -158 11 28 418 -94 244 22 877 787 33 477 93 575 -434 470 -107 356 -226
1360 -226 551 -142 429 -273 -522 635 227 -532 -437 -775 -286 352 283 -486 336 -449 -337 90 185 298 36
1381 36 98 64 -50 234 -75 47 187 -86 -285 210 65 -399 103 -71 29 -601 318 143 -99 -413 -286
1402 -286 127 -102 430 295 -14 582 160 108 268 -493 -716 -215 63 25 233 370 402 -108 104 -220 724
1423 724 227 -418 45 -354 53 700 142 -257 129 219 -310 873 499 203 46 -69 -95 105 717 -103
1443 -103 -97 -182 646 -53 47 -509 367 42 -696 -68 595 -157 -263 -96 163 63 427 280 -90 754 516
1464 516 175 323 329 764 -276 -236 427 32 -626 -699 -23 -272 677 -6 225 -466 151 662 202 135 -255
1485 -255 29 -236 -179 90 -556 2 248 16 -1119 117 642 465 -179 27 283 73 -469 -422 327 -255
1505 -255 91 144 -67 494 571 68 -234 -364 263 341 -175 -361 -348 -339 63 -313 303 -27 405 294 344 57
1527 57 -179 -93 26 61 505 522 -274 102 165 33 482 291 -112 279 -33 140 34 -58 365 89 504 514
1549 514 115 23 91 456 57 -265 77 1 -214 140 -393 -371 -319 772 74 -492 415 126 -114 -180 -613 207
1571 207 490 602 205 -216 79 -648 307 319 -818 -621 449 416 -155 -466 64 -588 -470 -409 174 531
1591 531 310 213 84 -414 -322 34 63 -370 220 46 -29 -234 249 587 -31 -45 530 7 -316 9 -294 14
1613 14 -58 396 -204 580 -353 290 -322 34 -89 -163 -156 53 569 164 319 47 479 -44 466 -248 700 -38
1635 -38 -175 -687 -583 63 -337 -253 451 -337 -236 166 146 -19 -103 -9 -340 -96 71 -178 19 2 -79 514
1657 514 -129 -153 -326 70 -192 5 303 -400 333 -93 405 -61 -693 -212 107 29 -150 -459 -875 -54 -697
1678 -697 -5 710 -48 -408 136 -279 332 -123 46 563 242 272 -667 348 -175 -322 -399 113 -120 191
1698 191 154 561 108 -92 -625 323 -80 -1529 589 11 -286 -51 231 -21 168 -161 -76 -378 140 -418
1718 -418 216 -590 -31 -26 369 -611 87 -590 -463 90 69 685 -28 -60 -505 -259 304 81 105 -235 -98 150
1740 150 752 464 178 -364 -123 481 258 98 -1070 159 -218 -36 -194 -29 -114 246 -207 -245 -625 102
1760 102 92 91 84 -38 -165 734 -116 179 578 -387 -30 183 431 -421 -416 414 -43 -83 118 -794 -99 175 -593
1783 -593 -69 514 -232 -1230 470 28 -45 -450 -46 -441 370 712 493 -428 -114 -54 -88 -322 215 111 970
1804 970 94 424 394 -468 -296 -195 -225 334 4 -912 -183 -479 -36 -700 -351 -589 455 -95 39 3 470
1825 470 437 -42 222 -66 486 202 41 71 -357 273 365 428 310 -217 -104 -578 -167 809 -398 250 -544
1846 -544 -242 16 -101 379 821 202 592 291 -76 -194 164 350 -263 -74 -118 -336 -54 -509 -297 -140
1866 -140 -2 168 26 773 -83 173 2 329 -189 717 402 5 -64 -24 -721 53 1042 -724 192 -529
1886 -529 -31 85 -583 -316 -24 237 47 31 -233 -455 -504 42 -319 20 -337 -218 -328 -573 298 -55 149
1907 149 46 2 192 881 -90 -311 -219 -276 66 286 164 -299 -26 -181 -201 -121 417 -226 55 103 -402 598
1929 598 -62 -94 347 202 135 109 -331 188 -247 -228 123 -304 589 -165 -556 272 -37 -8 -498 420 477 -574
1951 -574 24 71 -809 -274 41 282 791 76 -148 123 -198 -701 293 -281 -526 -1017 1141 737 -158 462
1971 462 -266 491 78 689 -649 -167 174 -308 -227 612 200 -91 15 -314 137 112 245 -174 754 62
1991 62 -25 -215 -871 533 156 154 -304 199 -578 612 -114 -53 -6 -392 12 -328 -31 -222 40 -277 -136
2012 -136 231 -203 60 -164 -808 -104 -365 -110 462 343 -194 177 205 100 186 -529 -133 507 585 -87 231
2033 231 49 360 1008 -67 -204 257 -123 -208 120 -340 422 -147 442 -869 -137 -457 -815 -76 -26 -496
2053 -496 250 -562 -478 -26 200 -540 -738 -159 -83 82 451 149 -318 235 -542 276 -1045 -332 -451 564
2073 564 -408 -578 -130 -473 246 -55 -127 417 501 -159 272 95 -174 239 -61 593 -458 -119 -98 -138 500
2094 500 -145 -222 566 -484 -506 -64 99 31 1318 10 236 -863 -221 -675 612 -1051 97 302 -60
2113 -60 508 559 245 -36 528 380 190 -19 262 -487 689 312 380 -37 309 515 116 -392 296 618 -671
2134 -671 -225 -181 581 -37 -246 -109 521 426 -756 590 -90 -75 255 61 67 -76 -60 357 -477 120 183 -441
2156 -441 562 470 407 -724 -218 -122 26 536 -413 230 436 -149 -284 -62 791 -167 -3 941 382 347 276
2177 276 303 -102 -338 404 -679 -12 -222 -202 92 277 -827 -436 249 -209 560 180 181 85 126 -33 -382
2198 -382 392 -560 -35 137 -86 380 -225 -15 20 13 624 -572 715 -951 570 -471 95 423 -426
2217 -426 45 417 -287 -471 334 11 -162 49 76 464 133 528 123 -225 395 -389 506 -79 154 -384
2237 -384 62 106 19 575 303 -468 -29 171 -22 -125 584 35 -420 -96 -432 -317 -435 444 522 226 -200
2258 -200 -262 457 -839 69 -64 -216 -151 -262 -51 -121 -561 557 19 92 672 -139 451 -495 16 -435 324
2279 324 214 107 -378 -70 255 -22 -12 413 -660 -182 -243 -165 271 441 -331 -176 255 -421 684 -184
2299 -184 -150 163 -490 646 -223 -25 350 -311 -361 -76 340 -306 209 -202 -773 -251 -139 -392 -352 178 53
2320 53 -104 -334 -398 -265 -426 26 -459 52 546 -477 32 -125 413 -451 -196 215 -141 349 331 -157 396
2341 396 144 42 -80 -314 947 51 -18 -17 -498 30 73 316 218 456 169 508 -733 -741 -128 -121 -435 241
2363 241 -144 -997 -327 -8 186 -70 -366 -213 -23 -468 33 58 -267 -507 -178 9 473 -190 -660 109
2383 109 43 57 -199 -803 -428 -58 428 702 21 -1294 -160 278 -241 309 76 5 -85 702 -118 400 377
2404 377 85 633 681 -60 531 356 -104 124 -544 258 369 173 302 -23 -146 -316 -344 -90 -131 -273 -578
2425 -578 318 55 -120 -338 -321 -607 229 111 216 653 5 58 225 -508 27 55 292 118 338 396 32
2446 32 -284 -1 -138 183 138 -494 228 -47 -39 493 -317 -139 70 -76 -154 -484 -257 46 -7 -66 -596 -7
2468 -7 -86 418 388 -177 -301 612 -635 38 -58 55 372 269 -130 -8 222 -679 -365 -633 -38 -107 806 649
2490 649 422 -99 126 254 -6 632 187 129 177 161 97 187 -339 -81 231 659 397 -491 312 -655 -239 416
2512 416 308 -66 -318 -312 -57 574 76 426 15 -763 205 -455 -519 -99 153 269 517 -74 763 -65 -311
2533 -311 -112 689 -67 -120 183 -14 -192 122 417 -157 385 -584 -278 364 -617 792 -476 274 202 485
2553 485 477 -434 104 218 -101 -352 -52 -425 -25 998 225 -358 409 -253 76 -115 575 102 61 -84 334
2574 334 -383 -222 -757 -715 63 254 365 390 -510 -299 122 191 -19 332 17 -26 19 328 -227 75 -157 305
2596 305 -123 863 -356 257 426 126 591 35 -89 -466 485 -380 -317 -40 219 53 -22 462 -75 -364
2616 -364 568 -150 -104 -194 716 344 85 -261 705 386 612 320 -256 -209 781 -108 289 -273 92 88 263 88
2638 88 -728 -394 74 1116 -87 -356 -167 707 -1 374 177 -136 574 377 162 463 23 196 718 -174
2658 -174 -551 994 -434 349 -281 -40 41 -399 -626 127 -795 -132 125 256 -195 273 -40 222 -341 -105
2678 -105 502 4 -334 -378 -79 -512 2 -203 83 319 -24 -166 36 -244 58 285 -673 56 50 617 173
2699 173 334 173 182 -122 -278 594 -272 -147 333 797 -138 134 164 -30 -452 37 74 -496 366 -216 -234 332
2721 332 -310 240 13 18 -619 -147 -131 -270 -29 186 -45 532 -209 44 107 193 -436 -334 155 398 -468 -235
2743 -235 517 216 77 372 598 -439 -204 -84 -359 40 759 161 -655 79 -37 -262 279 -422 -133 -42
2763 -42 -179 133 -154 327 -69 -143 -38 180 -139 319 455 794 -27 -214 382 -215 168 -137 10 295 -5
2784 -5 654 943 -108 290 226 -411 -69 -353 -548 -112 91 411 390 -45 142 -366 419 127 -593 -443 335
2805 335 -377 -165 27 -279 55 -108 376 -410 -71 149 -24 -485 209 203 697 -115 -203 -298 -169 725 319
2826 319 -725 178 328 -95 18 84 147 -54 -237 -224 -545 247 -415 -977 -68 1081 208 -699 -18 -525
2846 -525 -461 258 -67 605 299 388 -206 -166 903 40 333 -387 137 479 726 268 53 -198 666 -656
2866 -656 105 519 40 373 -212 65 -453 238 -396 -74 84 -674 457 577 292 -355 38 35 -126 -471
2886 -471 686 421 178 734 392 -345 7 -209 235 -107 220 -116 -277 667 373 -50 101 61 505 390
2906 390 437 512 123 683 -657 50 164 -191 -341 -420 161 621 217 -893 -226 442 -190 -383 21 419
2926 419 358 -335 170 -33 102 737 -163 69 -265 311 27 -798 -129 189 239 83 -80 35 538 4 209
2947 209 -20 -268 -101 -198 -61 112 -2 326 -551 -67 -342 -387 230 9 491 -812 -195 -22 152 76 -250
2968 -250 161 -650 -486 125 -340 -158 -580 419 -215 60 746 261 -429 -519 -634 389 -491 -272 88 -14
2988 -14 -385 -306 -368 36 358 -72 339 -679 24 866 -62 -358 422 628 -470 -130 -895 -630 85 291
3008 291 -191 -142 -227 -146 173 133 553 -47 201 41 427 -522 -107 -244 -238 54 207 574 130 181 116 -433 195
3031 195 -295 -224 -229 -487 338 238 398 473 29 -383 578 92 -657 -497 -37 -823 580 -682 -232 179 67
3052 67 369 577 466 543 -337 -511 107 422 408 70 320 -13 -106 -188 -226 -143 420 -454 217 -196 -858 -307
3074 -307 648 113 -256 -29 -257 143 303 -234 -372 688 -113 -385 215 98 162 -230 216 -643 415 449
3094 449 45 196 88 791 335 615 78 68 -644 -478 104 27 375 -21 -329 -492 -656 -469 -34 477 397
3115 397 -406 357 948 498 180 -81 -20 -273 78 628 -467 127 156 -276 -401 -803 101 30 -35 -419 14
3136 14 13 368 484 437 -318 -179 182 353 -324 -26 317 366 -188 -167 97 174 32 600 -294 -69 598 -388
3158 -388 165 -867 24 -334 62 -1134 220 629 412 38 210 154 -358 -222 134 621 -64 -159 134 659
3178 659 -108 -476 316 130 -29 41 -221 399 -88 -182 -597 -183 -420 130 230 -1 -451 60 400 -124 337
3199 337 4 -55 -60 302 -69 6 -9 446 22 451 84 -48 1 485 -97 187 -89 -411 -744 26 334 481
3221 481 -449 -266 -228 -395 200 -728 -51 -100 -91 374 -507 22 220 -85 -312 179 -405 444 248 -245 134
3242 134 -304 -110 298 495 268 -149 -148 -330 180 -93 -263 -367 -382 -54 -92 338 204 115 163 -410 1 -235
3264 -235 8 -10 -371 -305 -460 -178 -9 -50 251 540 -427 156 -71 -407 98 -184 121 -161 -252 328 99
3285 99 -289 68 275 629 -171 524 -197 -377 336 670 575 -756 -630 -142 -8 -126 375 -217 577 -348
3305 -348 -374 -11 189 52 25 -330 -111 -649 516 -387 16 -176 115 -89 -469 -98 19 703 422 98
3325 98 -164 -219 368 -105 -518 -34 -133 649 40 -242 -187 374 147 281 466 327 -216 -774 293 461 129
3346 129 230 383 -685 -31 -659 -210 154 518 -52 -164 209 56 -195 -224 39 -152 539 -144 361 -3
3366 -3 -427 -555 -434 -347 209 201 91 137 -281 51 367 -56 -170 -146 12 97 -86 228 201 263 -377 -33 63 252
3390 252 -30 926 469 551 202 275 -614 -129 -38 -994 29 359 284 320 -160 202 352 -389 240 -462 -264
3411 -264 -57 226 -64 387 534 -72 -259 -260 161 304 116 -204 894 -111 -168 -269 134 138 160 331 -33
3432 -33 -25 -280 360 -835 434 278 -124 -133 -841 -373 401 101 73 -109 -239 -271 -224 136 685 -229 170 -351
3454 -351 -285 299 -12 143 -231 -663 -179 -234 613 222 -465 310 245 27 -93 -142 -318 760 260 -680 -207
3475 -207 165 -691 343 -289 -341 -212 -357 941 -140 -259 -182 107 -70 -657 -533 208 419 -103 -229 -402
3495 -402 149 -442 -256 87 292 -4 -360 -178 -292 466 -319 -724 265 -30 48 971 137 545 -32 -271
3515 -271 -227 -412 93 -521 -1106 -310 -33 -563 -7 402 772 214 -385 212 -445 513 -22 -253 393 -274
3535 -274 -149 261 526 -344 -124 -190 642 150 -561 -111 137 -166 361 -73 -874 23 -461 36 -245 -279 -175
3556 -175 -80 -296 -193 -114 -42 -256 69 -361 494 -325 274 130 -414 -105 -193 -59 1 4 697 308 -219 438
3578 438 -177 13 -395 -96 -104 110 184 247 -842 220 27 203 -143 -413 387 -235 12 -199 308 -605 22
3599 22 -129 304 557 283 -2 -331 136 -257 -610 116 455 -296 -66 -622 -179 -314 -90 476 727 1055
3619 1055 194 -170 104 133 381 362 -225 -157 -860 -199 -308 34 201 -142 331 -109 91 411 35 -62 -212
3640 -212 768 206 161 -359 -767 -660 837 -26 -233 187 114 304 -371 257 35 177 -475 94 60 -5 162
3661 162 300 -375 -527 542 136 216 65 -38 258 -27 -74 162 -448 540 -608 -614 215 19 463 -34 -150
3682 -150 82 -259 464 51 -476 414 312 694 -148 253 -342 -17 -47 249 -157 49 -570 -459 -142 -232 -483
3703 -483 -580 274 377 361 588 -524 -194 -253 -236 696 -54 180 454 188 50 -191 301 -600 565 296 37
3724 37 -278 280 169 -56 -591 -345 -44 184 312 38 189 -354 454 -417 -163 175 683 647 -217 621 -22
3745 -22 -496 -62 -63 -277 -529 -393 76 263 -516 -426 -14 164 -766 -58 722 665 -412 -385 267 -615 -353 -280
3767 -280 -511 150 -140 -64 53 250 102 877 230 728 -104 8 -107 276 87 -546 -45 4 -278 -373 -124
3788 -124 309 -179 2 672 159 96 342 303 231 -422 -157 192 272 725 42 -123 720 -584 189 523 -286
3809 -286 212 348 348 -82 -408 -306 166 218 -83 -135 367 -271 -86 -691 503 -463 -234 -239 -14 -256 -227 623
3831 623 -127 -130 206 51 -79 -44 376 71 671 457 -102 -171 -345 355 474 443 -146 -444 -152 251 629 248
3853 248 274 103 -271 278 109 97 182 -191 -601 -77 328 -199 378 806 178 -250 -106 12 831 -220 62
3874 62 199 1078 418 112 123 25 757 -333 -452 288 540 -109 313 257 -150 -570 -764 73 263 306 54
3895 54 406 -61 70 -182 -528 -323 -242 43 -62 95 176 -361 -267 327 736 -131 188 223 489 -57 -597 148
3917 148 -295 -684 602 990 142 386 308 -406 22 -310 680 232 258 536 236 -600 401 230 -187 737
3937 737 -62 545 90 427 -708 -1147 -168 -440 -385 368 -101 115 189 -13 -315 -499 -558 -443 103 -68 -288
3958 -288 320 112 573 -69 131 -269 114 -54 -216 140 20 415 -135 -562 -313 -754 -266 166 761 -120
3978 -120 -263 -246 6 -16 -185 72 -96 486 88 -309 -387 924 -576 143 -36 -464 443 46 -405 -494 -381
3999 -381 -155 -235 471 -437 -308 280 631 837 69 57 -206 -31 349 -328 -29 599 -619 316 -99 53
4019 53 -89 -126 -317 -221 -861 -560 464 -293 -73 18 383 771 -6 -55 488 -56 -283 372 405 -717 -173
4040 -173 262 -353 452 -677 1030 708 -210 -191 401 -306 -919 210 434 98 536 659 127 35 -1146
4059 -1146 405 837 -123 -134 36 -379 381 176 382 330 -369 -361 244 17 -364 -336 99 486 542 -543 -286
4080 -286 212 38 97 22 8 136 -764 206 -235 -240 102 -81 -617 -118 -138 -355 -192 468 51 231 300 -134
4102 -134 37 31 -428 136 -317 105 -8 413 400 -100 451 39 162 -49 539 -499 424 -444 516 3 -99
4123 -99 421 -523 151 -99 275 -330 265 550 13 -22 -445 -28 -479 54 62 -5 769 139 647 504 -321 468
4145 468 -135 414 82 -249 383 197 -898 365 238 -460 -788 -486 648 -417 345 -361 875 -119
4163 -119 175 491 -334 -30 95 -229 -8 -237 -180 22 -829 -769 -564 -352 -87 50 -207 342 677 337 580
4184 580 -125 -383 -31 -7 746 476 52 120 -890 -8 38 204 66 121 239 -797 -344 147 -61 108 -247
4205 -247 -194 -540 -406 319 32 -77 -129 99 -303 -17 -367 80 668 -794 -176 -108 -186 -255 -387 277 325 299
4227 299 -818 -188 94 28 -765 -163 -50 -50 -271 522 214 668 -237 2 44 204 -506 -89 350 -261 -371
4248 -371 -206 -328 -1094 -526 314 -488 -300 -422 -12 -533 -533 -486 -39 602 -160 -292 478 79 83 -62 -54 728
4270 728 482 25 226 -149 -608 -497 -673 -126 -480 238 337 -332 635 133 15 -45 -206 -571 -385 263 170
4291 170 795 -292 -197 -713 269 132 4 -196 35 0 621 339 -221 -256 -61 119 74 53 502 6 -436
4312 -436 -207 334 732 372 103 414 -288 -298 299 97 69 142 269 -629 -94 151 326 209 -359 247 -257
4333 -257 -40 147 394 21 -39 245 -385 473 -44 -70 -739 212 -324 57 482 158 -217 -270 -115 409 159
4354 159 137 20 54 -313 16 588 -315 311 -174 -464 320 63 59 -48 -496 -742 81 160 353 758 383 174
4376 174 -429 378 209 527 -255 395 553 -328 60 -752 982 -540 96 -357 416 223 -284 190 320
4395 320 748 320 220 -345 -116 152 -882 -398 305 -720 474 -447 178 6 14 -811 -374 -608 -467 -554
4415 -554 557 290 217 250 30 -281 374 6 591 -816 -311 -88 6 208 -161 611 -600 862 788 -412
4435 -412 -462 48 307 332 -521 -209 -143 -99 67 710 863 -126 -125 190 -436 -456 -396 275 72 219 -135 247 -567
4458 -567 25 -179 -446 356 28 -18 55 -292 738 298 293 434 170 84 -151 144 86 154 528 156 -201 -914
4480 -914 -416 -142 51 135 497 322 -36 -100 165 -309 849 118 -350 375 309 842 -46 348 -257 -382 -494
4501 -494 470 -139 192 62 378 77 58 270 -263 -15 -221 -865 -255 95 -565 -218 -103 31 396 -108
4521 -108 7 57 -62 44 -345 361 -188 -618 39 -885 -217 -29 -78 87 80 216 705 -129 -942 13 -171
4542 -171 753 -689 -367 92 -1004 -674 -586 164 530 -218 -407 174 150 -195 274 -357 -199 -368 678 -82
4562 -82 -192 -33 -574 -692 -207 -386 154 811 -449 -133 311 -357 -341 195 95 205 -71 146 -1090 231
4582 231 255 -523 344 -37 -369 -259 18 -334 479 308 26 278 487 -154 -352 -431 -484 -39 300 -121 -37
4603 -37 -99 -306 139 -687 31 65 -299 -106 380 621 194 242 1177 -161 -373 -90 598 -686 51 314 268
4624 268 -665 -16 -250 27 23 -417 -419 -608 -190 229 377 466 231 29 -130 -23 94 439 314 50 -224 73
4646 73 -634 -464 241 -76 -47 -444 -151 50 -232 -409 -527 -357 -67 -123 -531 -237 -129 -67 401 243 345
4667 345 292 -245 385 -69 489 519 468 439 -161 -84 -463 -342 41 150 -885 -127 -160 -31 -399 -266 -29 -402
4689 -402 -481 -149 121 -300 927 59 -128 448 -725 -408 280 257 64 -229 54 -176 482 724 194 -355
4709 -355 -330 445 65 -448 146 70 241 -47 351 292 -605 520 -302 -58 -310 395 -410 -132 110 -514 423
4730 423 393 42 75 -173 -659 -137 556 369 -88 -353 -230 14 -504 -494 -553 -132 -268 -450 -59 293 199 336
4752 336 -220 293 375 353 -20 69 -56 -52 -329 -16 -549 -124 -747 287 -155 -525 -832 75 331 249 -241 -804
4774 -804 -71 -61 94 -403 539 -291 -504 338 -297 136 -245 1052 -166 -285 191 -316 -467 -117 -95 -254
4794 -254 118 -252 262 224 326 306 -262 477 -8 323 -148 -34 -306 470 269 -165 188 37 627 34 444
4815 444 730 -90 109 -42 -640 -204 783 347 374 -175 64 491 -66 -281 492 -195 -72 581 743 -868
4835 -868 -111 203 274 4 -420 0 370 241 91 110 236 -43 229 -218 51 -302 583 40 -172 -117 164
4856 164 -292 226 177 -115 25 267 93 -634 460 -27 378 -788 -17 343 277 327 185 -271 144 476
4876 476 169 16 -301 -352 211 -525 -25 -993 -553 -814 151 395 467 -153 438 -234 329 -106 642 -787
4896 -787 252 216 -396 320 -90 -21 -243 17 -354 195 137 -492 384 318 217 263 -444 -607 80 -119 -604
4917 -604 207 336 -292 -59 -496 -224 299 -100 -91 -58 469 -203 292 201 526 -156 -236 -104 8 100 -771 -106
4939 -106 94 431 546 144 132 952 -265 -27 303 -58 621 -17 -155 -129 84 186 77 -123 67 -530
4959 -530 -667 -392 265 191 85 105 438 309 1 -16 -49 -254 -163 87 323 18 327 163 -532 320 -95 -32
4981 -32 21 321 182 -155 416 261 -362 154 214 -188 -166 -38 236 10 -475 -64 145 335 -255 59 385
5002 385 -473 242 -324 76 -84 -170 -569 -501 -895 -62 133 277 4 59 74 275 19 603 -393 -39 392
5023 392 293 108 -166 195 2 -296 -354 139 -342 106 502 67 285 -195 33 356 -602 54 312 168 -173
5044 -173 -52 -149 -561 -504 -120 -334 104 -354 -178 -103 14 -556 -151 145 552 -237 -132 279 16 -197 173
5065 173 147 -59 414 -505 199 543 250 3 101 -105 -339 422 -301 111 -145 -570 -270 505 -239 47 -244
5086 -244 331 -136 -65 386 -65 362 324 -605 12 56 339 111 -6 148 -60 116 -166 -393 -431 54 1098
5107 1098 374 168 183 -100 166 -152 561 -337 460 541 -14 -443 -460 -226 327 -73 -259 228 -57 91 -135
5128 -135 -7 -23 645 -712 -69 626 47 -702 -278 498 868 487 169 -35 430 400 381 403 -200 -282 -676
5149 -676 -364 -181 -299 -126 -108 133 45 -455 176 514 -577 -60 71 -482 224 -738 -1046 556 222 171
5169 171 -106 -414 280 -94 36 -228 -285 -377 -182 -220 -455 287 -470 -115 340 -490 984 -92 6 68 -222
5190 -222 242 -319 -522 166 166 -619 208 279 -56 -301 -429 -565 -235 -484 411 -559 73 526 -193 232 -236
5211 -236 -389 950 -113 -119 -103 448 -380 -253 206 -378 406 521 94 -321 -109 448 76 -35 643 354
5231 354 -293 -79 148 23 226 306 590 950 115 80 294 363 -446 475 17 441 -446 68 586 80 239
5252 239 -227 -382 -515 18 -180 402 4 -541 8 220 122 -31 515 -706 -57 31 -34 -648 -473 -70 68
5273 68 312 -343 -5 275 243 383 -133 286 86 -591 5 -179 303 -453 91 255 -265 -82 -663 103 256
5294 256 81 -792 -272 94 137 431 276 51 -162 -84 1120 -300 -153 127 154 48 187 -616 98 -254
5314 -254 213 -21 481 174 57 -173 -488 476 -357 786 457 236 245 541 -402 -211 -390 105 856 -414
5334 -414 544 224 -74 -67 -196 -571 119 540 -146 410 -98 173 161 314 731 480 -47 732 -81 432 240
5355 240 183 540 -306 -142 -160 -96 -80 -58 403 -349 -456 170 457 1013 -353 65 134 -297 122 -541 -201 216
5377 216 281 -74 222 418 541 238 -347 -37 -638 -507 -454 -59 576 -192 -380 63 51 -182 33 80 -525
5398 -525 410 -928 325 315 317 410 -513 -45 -564 -663 660 -95 -66 752 -258 -352 -321 405 -498 -180 -93 -255
5420 -255 132 -415 -441 542 103 -59 -553 288 -365 -405 -321 96 574 283 346 -201 -304 94 280 -399 287
5441 287 -667 755 -127 418 653 -62 -890 -319 -218 -129 1185 -688 -229 180 -396 -3 -90 354 10 -445
5461 -445 -349 83 -7 3 50 873 67 217 627 -334 8 647 -362 -517 -172 -482 -601 -505 -830 -106 -208
5482 -208 581 -318 -235 -480 27 77 -258 196 309 108 15 89 385 -325 -228 176 157 -362 -174 -609 424 -184
5504 -184 -139 558 -614 -305 22 102 508 -108 -399 367 488 418 -265 187 -105 70 158 -162 -395 69 754
5525 754 385 264 -456 346 526 366 -516 115 256 -437 -235 12 403 850 -256 -73 254 80 53 -73
5545 -73 13 30 1022 849 59 59 -446 287 153 475 510 345 393 -236 362 156 -214 -436 -534 234 61 356 277
5568 277 -329 382 21 9 101 -236 414 201 -748 167 -517 317 400 -234 169 167 -70 -195 313 113 -745 -93
5590 -93 273 221 99 387 328 219 -267 285 472 -134 408 722 394 -416 -389 -84 98 -30 165 45 -718
5611 -718 -230 112 21 58 73 -223 117 384 390 -155 153 143 58 -68 -718 -114 417 -443 -107 431 413 499 -71
5634 -71 376 -1056 493 -347 561 -14 -7 677 -384 -116 48 636 -142 19 -68 -361 -191 -424 315 246 -159
5655 -159 -21 -534 -674 36 603 -192 -257 -363 366 376 295 -87 266 -272 -193 -123 -14 286 -467 25 583 79
5677 79 410 149 170 64 85 -111 34 636 244 -564 -288 430 61 -330 -237 176 -562 620 -5 255 310
5698 310 -170 712 -202 -113 143 264 231 -290 -220 596 194 -459 493 36 703 509 -161 -411 -297 -439 -18
5719 -18 289 366 -246 517 252 246 509 -589 492 105 -17 -309 185 -14 -284 -181 -83 443 -231 -331 -388
5740 -388 -151 -754 -98 -443 9 231 -279 461 -171 209 -133 78 69 579 -479 -40 -274 -59 76 317
5760 317 452 35 183 792 -918 -119 -570 64 360 -274 80 -83 -199 -335 484 -448 395 -256 13 -478
5780 -478 -120 -707 56 186 -255 390 -167 121 311 733 -328 -82 -38 594 -560 -89 31 275 -262 170
5800 170 216 -194 -11 88 397 122 66 191 206 398 -158 -1015 -19 -443 -181 150 -460 -418 -43 123 -406 508
5822 508 998 -195 -247 -236 -60 -44 137 17 325 301 129 -390 721 27 -474 603 334 -38 690 273
5842 273 -695 -44 213 316 363 290 -159 -92 252 -480 332 407 -165 -416 -257 92 -120 -60 308 64 168 99
5864 99 228 387 -400 120 314 17 367 -747 443 278 -81 -232 -256 6 -692 399 -355 334 157 463
5884 463 -154 -460 -107 397 -336 -419 12 -483 -199 71 219 24 -464 199 490 92 -226 359 -275 307
5904 307 486 504 -341 -156 124 2 122 513 352 204 413 226 -80 -206 475 -339 -520 203 -363 -582
5924 -582 -812 -319 44 136 133 293 45 -242 -131 -321 39 55 -460 18 -292 -244 -621 -402 404 93 -153 -31
5946 -31 303 260 457 129 -318 -195 31 -32 157 -38 376 276 -323 978 472 -243 -33 207 41 -233 671
5967 671 -120 31 253 -131 584 -407 -150 -88 350 430 -77 556 -300 -113 -150 358 839 -278 434 100 -313
5988 -313 -294 -539 665 -84 -95 -400 -159 620 -461 285 -825 -460 -313 -153 45 364 -166 335 -267 -733
6008 -733 485 112 678 483 -342 -392 -16 -242 -115 290 462 -145 -670 423 -260 401 201 248 -80 53
6028 53 565 160 -557 -311 20 686 -219 508 -114 -305 434 340 390 291 -46 -34 729 73 -311 -853 -283 367
6050 367 805 -120 446 63 388 829 -155 -334 393 -1078 -369 -39 16 -414 -474 12 205 -589 278 -464
6070 -464 311 268 -268 519 -245 26 354 791 37 -300 -241 -28 -232 -107 142 165 -396 -115 -407 270 246
6091 246 -373 451 -169 694 -298 -32 -581 47 -152 -111 51 -313 -236 -129 -278 -624 418 -264 -59 -221
6111 -221 -191 -110 -167 -154 227 -241 141 -66 24 -236 -388 -56 -662 -131 -38 208 -45 -131 -54 -434 -629 628
6133 628 -35 -283 26 -371 23 -281 95 -443 577 -23 469 368 495 -30 153 -92 -761 -632 247 122
6153 122 949 107 230 192 181 406 191 -518 -637 871 141 -344 60 9 -9 -504 266 48 -272 409 -600
6174 -600 325 107 -636 323 277 -128 -386 255 -164 207 382 -158 -35 223 121 433 -156 -166 587 93 -566
6195 -566 57 -549 -3 -243 -247 74 -668 -425 559 119 505 -137 128 523 159 -543 -646 419 275 109
6215 109 -242 52 -214 -147 229 -505 132 -233 -67 -45 -607 55 427 -374 -396 -180 -676 -297 -192 -304 -672
6236 -672 549 2 -55 -37 -402 162 -329 331 -257 -540 190 -202 -168 -163 183 -404 325 -145 189 -264 -181 -199
6258 -199 -351 76 -457 246 480 -706 157 49 -681 100 298 105 113 -224 127 -285 143 685 336 -103
6278 -103 510 -245 554 -232 360 169 352 -241 -702 541 285 297 448 335 -509 -26 -171 80 113 -241
6298 -241 171 297 -321 -178 504 84 178 400 253 -63 46 -164 -15 48 698 -48 230 505 203 316 478
6319 478 -352 478 390 43 321 -131 112 -200 -289 -259 13 152 285 -215 94 -31 -376 -947 263 2 -120
6340 -120 -129 216 302 -426 400 -255 537 2 -332 174 -277 87 -151 -125 162 307 -284 273 -220 599 -310
6361 -310 -260 -173 275 512 53 -93 762 851 377 168 -106 -585 181 498 802 254 39 110 -411 236 -133
6382 -133 -343 443 -225 -248 169 -369 -359 632 489 -349 486 415 -52 -260 71 277 -66 100 115 -291 62
6403 62 -219 -242 -742 245 126 108 -171 -17 81 538 -235 65 -246 647 171 -574 495 -73 -120 -185 143 -321
6425 -321 106 -472 -338 166 1080 -174 -311 110 114 360 -113 -385 -98 376 -271 -455 486 13 20 -427 508
6446 508 378 37 -627 -590 214 57 193 344 -462 540 -498 -216 -134 223 165 -202 -849 662 333 342 288
6467 288 -102 231 414 409 -413 443 -39 -326 -82 -419 41 -97 148 593 -150 -85 546 -112 188 -172 -493
6488 -493 17 157 -199 308 195 236 175 -496 492 -192 -314 67 553 83 -104 -70 -78 427 203 202 -54 -189
6510 -189 -150 -798 61 176 620 -244 -22 399 -56 280 -1 212 -287 282 55 -25 -56 410 461 -560 74
6531 74 82 421 290 319 -225 59 -169 -230 192 -655 -450 107 534 385 241 -96 -264 108 -353 579 -392 252
6553 252 -460 -348 277 336 231 157 -76 -224 -494 452 149 237 -16 -248 -202 -109 596 -429 364 256 600
6574 600 105 234 4 197 252 283 -186 300 -414 -388 -62 -362 -206 406 -542 -285 -238 -62 698 279 174
6595 174 -838 -353 406 140 -183 414 401 242 -36 150 -281 361 988 -37 262 -51 655 3 156 386
6615 386 214 -127 -317 -32 -334 -333 -53 280 -49 -146 298 241 -152 -60 519 52 -207 37 -692 27 270 -29
6637 -29 129 174 -41 -986 -563 272 135 -323 29 -287 -755 -409 786 28 721 216 574 -438 390 -29
6657 -29 403 142 -53 101 -419 310 200 -474 -239 -101 38 -515 -216 113 -708 -398 -149 178 37 -282
6677 -282 -67 124 -263 227 -131 340 344 143 251 271 -72 167 373 40 154 605 40 -36 -237 59 -532
6698 -532 346 -324 323 907 164 397 277 382 -44 103 204 395 -955 191 14 229 507 240 203 230
6718 230 345 -3 734 492 935 -291 -448 909 -470 -233 504 -640 534 365 -124 -138 -209 351 514
6737 514 -97 -243 390 225 -823 -299 -18 -864 784 80 -16 138 -469 530 -355 -738 -181 -665 467
6756 467 542 457 112 -363 144 210 193 -123 -231 300 3 -242 -381 -1152 -193 -14 405 -78 -41 230 -586 -528
6778 -528 -4 -367 -12 -990 -371 -465 670 306 -322 345 -188 -129 -321 -49 -860 -40 -103 -345 736 127
6798 127 5 -337 -307 134 -149 988 -400 -375 -104 -634 -77 -321 -530 429 52 -343 108 384 -29 -44
6818 -44 182 -72 -186 45 480 302 46 392 112 439 -361 -68 -399 25 -204 -637 347 -192 781 -37
6838 -37 197 -414 -30 -511 263 -244 459 -190 -400 725 -448 322 190 88 400 -173 -166 524 46 109 370
6859 370 -400 -440 -204 259 -101 131 105 103 404 -171 -627 -127 -411 70 79 447 -327 467 -49 91 -12 -145
6881 -145 649 211 74 180 -323 -998 716 -381 -423 323 239 -305 500 -644 -93 408 -206 164 -446 -57
6901 -57 126 -273 -537 443 257 -546 175 297 -354 461 -83 123 -614 848 -299 -396 -230 -746 -430 178
6921 178 -409 331 -589 182 87 -273 4 -461 430 26 0 -153 -286 367 -275 -64 122 53 -288 45 431
6942 431 3 -20 -148 -483 -462 -111 605 -297 520 -273 -412 -9 -7 584 457 -99 -488 183 -778 -669 157
6963 157 -567 -216 -402 -26 419 445 -153 25 523 -299 -245 -415 -679 -356 -164 629 -263 -170 74 497 351
6984 351 -271 186 112 142 155 247 -454 -639 311 -131 585 -260 -329 -124 -539 -89 -25 -123 -183 -597 550 -63
7006 -63 -142 593 107 159 -289 -605 -403 637 625 274 -235 195 385 337 627 467 -334 153 779 6 195
7027 195 -20 -46 401 217 103 -184 -220 113 434 -353 -543 -563 -196 -825 630 445 297 -90 -301 83 390
7048 390 -255 -460 327 -142 -108 345 345 106 -272 -278 70 -22 -291 509 229 -6 -581 -108 -772 -262 154 271
7070 271 -52 -214 -351 222 -237 156 129 -3 85 -343 767 128 -189 380 -36 319 39 98 -89 -734 -57
7091 -57 -258 513 -234 -46 -234 -298 163 847 -739 -422 -77 474 548 122 -936 498 32 -233 -196 -13
7111 -13 -50 463 157 801 675 73 -165 -172 -175 451 644 560 -68 445 564 -787 11 -249 -115 406 -33 -235
7133 -235 -89 677 -37 271 -172 71 64 -403 -135 -640 231 -203 216 100 -406 -123 -44 -842 341 341 -703
7154 -703 -383 -312 -57 -229 -453 748 447 -177 -415 -446 265 191 -75 -48 -569 -64 -102 -74 156 -448 -33 -825
7176 -825 684 -240 211 33 -43 101 764 -738 58 545 -207 182 1006 -268 -262 -259 631 -56 -245 360 334
7197 334 51 -324 -72 -263 -342 578 -289 225 636 111 135 -239 -180 -1258 195 -317 -219 169 -56 245 -15
7218 -15 -641 -26 329 904 61 0 -291 -1 -950 -348 -228 560 284 -415 772 75 537 225 127 -319 -346
7239 -346 -481 187 -401 -421 392 -401 450 234 150 295 -204 -73 -123 787 -261 -126 420 530 220 -374 432
7260 432 160 90 -581 578 285 103 -271 -202 -330 112 369 -1099 -186 268 35 366 175 319 599 86
7280 86 -321 -513 239 -153 -46 413 -149 12 -487 81 352 -372 621 312 364 -63 -24 448 -391 594 36
7301 36 -183 87 -276 -34 55 -655 172 339 -444 -212 -383 541 -132 212 -523 400 343 509 267 -837 330
7322 330 56 -516 -131 711 502 -101 4 -481 25 -489 -256 565 730 -162 315 509 30 640 763 -528
7342 -528 -300 122 -256 -244 -517 42 -238 36 -171 374 -217 -133 154 -111 -92 343 -239 272 98 -747 373
7363 373 -174 127 -331 107 365 133 239 -39 -372 -31 -640 -193 -347 -19 209 -293 886 435 -114 -559
7383 -559 296 -144 336 -33 -134 6 775 -120 -185 -352 1019 -128 -539 315 174 143 -76 -4 -71 -217 -135
7404 -135 422 -29 458 -47 167 178 -64 83 45 479 -401 0 76 129 239 238 -82 -198 418 91 624 -258
7426 -258 324 492 263 -552 547 1025 355 578 -597 -125 33 -418 -417 -248 791 193 592 414 -171 181
7446 181 -241 -264 66 -488 332 39 -308 -58 515 -190 -13 -458 -135 335 106 630 339 -264 439 602
7466 602 -163 352 118 139 -381 219 -114 773 206 149 -393 266 -370 218 -66 -92 -236 -263 396 200 281 92
7488 92 548 123 -200 427 515 -385 293 -529 -22 -189 -375 -202 -367 222 338 -849 107 39 214 -65 146
7509 146 -33 -230 184 186 -228 -217 -451 -443 -237 -253 540 -364 416 150 -77 310 -724 220 293 33 123 -153
7531 -153 -320 -272 59 569 169 -884 281 -710 62 -590 311 101 -155 -24 32 -476 -147 -175 -916 697
7551 697 -605 227 -137 -157 115 745 -614 547 263 -370 138 -566 56 -295 997 -184 130 -452 -526
7570 -526 219 -323 -364 738 181 -277 -4 88 159 -268 -835 419 93 235 346 584 192 182 392 319 -121
7591 -121 -218 196 -794 191 -57 -360 -337 263 -234 -561 54 124 -511 -54 -371 20 82 -137 327 -343 -579
7612 -579 -5 -88 365 465 -173 234 -25 -312 38 -298 -421 338 -300 -476 -104 89 -355 700 -67 -49
7632 -49 -117 559 -33 -201 402 -229 356 326 -21 -722 -579 -252 -169 -484 -272 -177 -208 404 -233 -177 -133 -67 -222
7655 -222 -757 -145 188 -392 359 331 203 -453 -396 -88 -72 207 6 31 -518 -104 158 142 -98 66 97 -840
7677 -840 567 -440 -542 -51 -347 73 420 379 -335 -405 848 175 356 -257 97 277 552 -180 -335 -809
7697 -809 137 223 -55 636 -61 166 -76 704 -191 -438 76 -292 -206 -279 365 209 -415 106 -612 -107 210
7718 210 249 -178 -647 347 549 -61 157 -721 -362 -240 528 -1044 180 197 7 -461 -204 746 652 -529
7738 -529 -21 -33 402 424 -318 22 -708 -780 -271 239 129 -169 110 -262 -557 667 -599 55 283 -403
7758 -403 -144 -218 279 -292 -362 155 -186 960 -439 17 -288 -76 -524 339 -406 366 -50 674 358 118
7778 118 241 -76 810 -116 -181 36 66 292 -36 582 98 -24 -309 -322 -67 -113 -893 -382 188 599 -554
7799 -554 454 94 -375 810 687 -6 351 -109 -529 56 45 426 637 -908 949 655 -9 371 67
7818 67 284 -253 -831 38 308 -114 606 -855 -348 -148 50 -165 -378 238 86 -194 -226 426 -310 590
7838 590 387 222 526 230 111 -591 604 -248 168 721 -342 521 482 -307 447 -313 -590 -22 6 -127
7858 -127 -6 -785 -269 -49 124 514 403 333 -157 739 574 -357 459 274 17 -30 -96 -79 496 174 254 3
7880 3 330 -290 -332 550 -86 161 12 170 415 567 208 694 77 -172 134 -446 121 821 60 115 -422
7901 -422 -112 86 157 -165 895 -406 112 202 440 532 -574 180 162 328 332 33 141 669 295 5 361
7922 361 -154 -166 -783 -420 449 602 433 -179 -646 23 21 399 -32 -299 189 -496 397 -19 2 -249 -331 -309
7944 -309 211 507 -605 450 -369 -246 586 296 -48 -85 -200 -342 38 192 96 -877 -380 -252 -407 22
7964 22 163 47 230 289 -191 262 384 63 -99 124 -1 -465 -111 -405 -174 256 -185 371 43 -148 -286
7985 -286 -715 -170 -460 -152 -35 146 163 446 110 -29 379 -160 -202 402 307 422 -20 222 -100 303 128
8006 128 -106 -430 -511 -95 144 -687 -314 -244 349 67 37 -560 96 270 -460 376 285 127 -212 351 -122
8027 -122 -186 215 -3 8 -847 -63 -81 -45 301 340 158 453 183 187 692 -448 81 377 -113 -126 -492 297
8049 297 104 -184 -440 127 -543 455 436 -435 -104 302 97 -608 -84 -756 -342 -109 40 -360 134 261
8069 261 4 282 385 473 -313 269 201 92 -761 13 85 189 -17 143 271 -77 483 -200 -195 177 344 -846
8091 -846 57 295 -64 -42 161 -618 -482 19 -292 -377 -962 322 -13 23 -163 -164 217 -292 -289 330 -66 -130
8113 -130 349 -258 496 296 -73 -627 494 -320 139 -153 -321 101 -121 471 -409 340 24 -64 182 206
8133 206 -535 81 546 411 761 -508 291 -475 297 366 -17 138 363 -26 244 559 820 -118 152 -100
8153 -100 153 384 291 198 63 925 -383 -518 -657 214 537 -103 177 47 142 -102 -275 47 -20 188 -337
8174 -337 -180 811 429 19 26 216 -827 638 17 -40 451 358 -814 -123 337 53 684
8191F84
$$ Imaginary data points
##PAGE= N=2
##DATA TABLE= (X++(I..I)), XYDATA
0 0 0 0 0 0 0 0 0 0 0 0 0 0 0 0 58 -64 64 -64 64 -64 128 -128 128 -192 192 -254 258 -320 376 -408 465
31 465 -530 606 -688 772 -863 970 -1085 1210 -1348 1495 -1659 1834 -2032 2247 -2473 2732
47 2732 -3006 3313 -3647 4018 -4428 4889 -5392 5968 -6616 7369 -8236 9256 -10472 11954
61 11954 -13804 16180 -19359 23832 -30580 41834 -63868 122556 -586398 -1494615 34817
72 34817 -136224 -632176 -635536 -534559 -347455 -338327 -95178 -130722 -296135 349524 343298
83 343298 68064 306821 433592 447646 246517 210396 372537 125096 102630 18054 -170049
94 -170049 -7318 -184353 -366201 -167852 -225246 -308634 -212559 -115119 -157527 -155590 110392
105 110392 79744 -70720 231531 284510 50661 162717 294939 131414 29242 153769
115 153769 97887 -106712 -16363 -7209 -215734 -144759 -66467 -206586 -199524 -75163 -69159 -141112
127 -141112 -57193 61160 -15841 45514 152605 48547 111517 208318 80846 46033 139043
138 139043 110827 -27336 2265 56758 -95372 -73242 -13969 -161951 -111994 -22733 -102952
149 -102952 -130921 -47067 31910 -73122 -52753 114403 6998 3490 137223 46303 23736
160 23736 97557 86452 3176 -969 101411 -12326 -82927 53326 -33887 -94547 -3398 -39017
172 -39017 -67449 -37058 -934 -37074 -59701 45087 5265 -47627 63294 34408 -12891 48176
184 48176 43176 694 9113 53596 4331 -40295 44255 5999 -67392 7045 3508 -57970 -22752
197 -22752 13522 -30340 -40322 27925 5236 -44838 30173 39494 -24252 18096 50328 -2151
209 -2151 -4085 40667 13017 -25305 22002 21216 -40051 -6423 18966 -40606 -27507 14041 -19848
222 -19848 -32337 8330 5289 -28937 2830 27018 -17268 2843 41617 -1413 -4427 34751
234 34751 12293 -13854 14330 23065 -17240 -4623 25006 -21920 -23091 20037 -13118 -29898
246 -29898 9491 7068 -26402 -5699 21007 -15765 -12008 29737 -143 -12487 25699 12935
258 12935 -12831 7436 20138 -5689 -6808 19906 -3486 -18208 12571 -1659 -24275 2787
270 2787 6091 -18430 -6301 11407 -11195 -12901 16643 1559 -14737 15946 16429 -12257 6099
283 6099 21572 -6497 -4720 20029 615 -14007 11278 5298 -17452 -3457 7810 -12344 -10934
296 -10934 8215 -6209 -14672 7291 1058 -12761 5823 9760 -4744 2301 13720 -926 -2828
309 -2828 13198 4198 -8404 9623 8126 -12627 -793 8239 -11007 -8107 8298 -4430 -12337
322 -12337 4328 1940 -12459 -118 9221 -5252 -847 11993 99 -5414 10198 4344 -7505
335 -7505 5719 8865 -6844 -837 7170 -6938 -6416 5245 -3432 -9140 4374 2678 -9652 -290
349 -290 7354 -5771 -2414 9164 182 -4184 7679 5371 -5347 1975 7908 -3435 -2306 7034
363 7034 -3443 -7216 4336 -1221 -9200 -18 3319 -6856 -3506 4185 -3422 -3606 5758 352 -4204
378 -4204 6307 4330 -4046 2085 6349 -2035 -1867 6563 -51 -4212 3987 492 -6567 555 2318
393 2318 -3840 -1114 3564 -1707 -5553 4676 1761 -5416 2857 4974 -3807 496 3047 -1469 -1856
408 -1856 3794 1034 -3761 3685 2142 -5830 729 3110 -3290 -1829 3190 -184 -3668 2106 1721
423 1721 -4124 1329 3115 -3213 434 3614 -577 -1873 1562 2099 -3555 668 4394 -2277 190
438 190 2796 -2456 -205 2745 -514 -3107 919 695 -4967 -1417 2670 -3045 -1532 3520 -1313 -1404
454 -1404 1243 1486 -1264 -118 4666 -1343 -962 4905 -1441 -1601 2835 -418 -2290 -311 140 -1851
470 -1851 -3325 1125 -2484 -2375 3385 -610 -1871 1940 858 -207 102 3223 907 -998 4346 96
486 96 -1798 3024 -320 -2138 634 595 -680 -2630 745 241 -4398 1607 -304 -3855 2147 1334 -879
503 -879 453 756 2295 -176 1738 2139 -1755 2867 1042 -2140 1100 164 -1196 -1068 -1605 323 -3515
520 -3515 -628 630 -3452 342 1219 -2522 377 997 949 261 921 3729 -1131 1162 2914 -1658 -183
537 -183 778 -1421 -561 -766 23 -1656 -2208 1561 -2902 -1910 1199 -807 519 1478 -448 1018 886
554 886 1934 472 95 2982 -353 -1085 1229 -1886 -747 -520 -1089 -994 -1451 -101 -2190 -1773 1155
571 1155 -364 -624 1494 -433 86 681 532 1373 -206 1436 1140 -1624 1683 -428 -2522 237 -1109
588 -1109 -917 -745 -702 -449 -1833 -368 781 -1394 1066 139 -26 1505 -234 1370 496 61 1496
605 1496 638 748 309 -1986 582 -235 -1654 -125 -736 -348 -1372 -851 53 -1566 181 1154 -1021
622 -1021 1174 362 369 101 -208 704 506 410 940 -249 254 508 -1551 410 -74 -136 152 -2141 69
641 69 -346 -1617 755 -528 -140 927 403 1308 602 450 705 -441 366 262 -558 903 309 -602 -137
660 -137 -1096 79 -5 -352 -44 -1196 617 225 -716 982 193 -33 101 277 1089 15 298 270 -589
679 -589 30 -167 -381 133 -159 -259 107 -65 868 -1001 -593 1072 -608 -148 255 775 861 678 200 1121
699 1121 -2 899 -759 293 454 -447 -750 235 -762 -753 57 41 -23 -756 595 184 -163 169 908 513
719 513 -474 739 381 -447 -92 380 -473 3 -92 -279 582 -83 304 -99 -229 -120 -105 -76 250 -395 575
740 575 -852 -260 1109 924 182 275 923 192 -461 38 92 280 -301 -83 607 -130 220 -29 -1143 -485
760 -485 275 -272 -594 344 -120 129 85 -224 201 21 -5 -691 -47 -333 -231 128 276 141 -22 606 225
781 225 -350 -302 236 -6 1163 -254 595 -295 -421 -548 -12 45 562 -232 316 -208 -352 -86 -424 -549
801 -549 -212 200 -257 -13 -307 -322 -328 62 -251 987 -422 145 -300 289 20 276 301 -259 587 176 358
822 358 -373 508 138 -569 -771 -202 -216 -921 -7 -238 -753 114 110 -289 -110 494 -380 -323 443 -449 140 -712
844 -712 461 -671 -364 252 386 173 470 -59 -365 -270 -13 239 517 -152 -39 167 -16 292 -26 485
864 485 326 -133 212 966 -336 270 -467 -242 245 -91 235 213 732 144 -29 54 -221 -839 -125 -136 -88
885 -88 -960 -571 487 -805 -179 -73 -321 -92 -106 -548 314 221 -219 52 458 140 -50 -380 -154 -356 462
906 462 77 254 -185 222 279 -285 53 51 -174 -65 -296 -227 -286 -52 -621 424 -247 304 -247 -36 109 -209
928 -209 268 -17 389 -604 215 -362 -281 -154 -39 -95 174 477 169 115 599 -393 286 61 -253 565 -59
949 -59 -43 309 -1225 118 -48 -519 254 189 -230 -125 621 679 -174 74 -52 30 338 213 221 132 208 388 -153
972 -153 -280 148 -88 -485 -218 -206 632 -476 184 208 -12 -293 -328 -159 -293 -14 -506 -292 43 16 163
993 163 -397 -160 320 7 102 -736 4 244 33 234 809 -795 -119 -353 -397 199 858 304 -161 -171 -339
1014 -339 -346 314 -428 -597 528 39 -59 -82 -184 -18 -185 205 -82 492 -295 299 302 -225 -868 -257 -786 -684
1036 -684 -297 -616 285 83 169 -39 -384 367 -236 -271 116 75 23 -511 -461 443 -127 -481 49 164 232 -545
1058 -545 -100 339 -183 -147 519 -5 -234 -157 -233 207 459 -380 -791 17 -8 -560 -316 188 154 670 292 -19
1080 -19 634 -1083 89 -177 -76 81 441 198 -26 773 432 -254 24 194 80 550 580 -921 -111 -811
1100 -811 618 -662 -130 382 -185 -438 -370 -620 -51 721 -269 -191 -50 -40 -360 -471 430 -481 575 -162
1120 -162 -605 -34 -85 -632 -38 239 -71 -179 -293 309 -773 -256 131 8 101 377 107 243 198 513 -114
1141 -114 -256 273 -239 307 384 229 -276 249 403 -67 -49 51 -341 862 100 113 95 -497 -30 -496 111
1162 111 -456 -103 314 241 417 -57 542 -277 -478 -118 -502 202 64 -437 363 -54 4 -2 -317 -97 365
1183 365 -639 196 -302 -317 -369 105 64 -760 -177 191 -419 -114 -218 -432 676 81 609 -221 510 182
1203 182 -39 207 -128 454 222 100 117 123 11 38 83 120 755 389 114 -71 -47 -343 145 109 77 -664 -657 512
1227 512 -243 -231 -189 484 188 -286 803 -6 -154 -300 316 571 450 354 634 592 550 -2 233 -560 -28
1248 -28 -133 324 -239 243 -10 -460 -534 -253 -348 323 540 -322 -84 -433 467 185 -306 1206 -375 -219
1268 -219 -29 -449 140 185 353 -103 768 -760 751 757 -184 2 97 -110 211 -99 -977 290 -316 427
1288 427 725 -442 -660 -262 546 -589 -164 633 138 -136 676 -14 -244 -486 70 -309 -195 -102 563 158
1308 158 24 358 -229 217 494 -37 5 250 -37 361 -78 -118 6 375 428 -224 522 -166 678 -322 239
1329 239 711 171 81 569 1022 79 -326 460 255 260 494 72 294 -48 164 -452 304 258 109 49 -77 387
1351 387 103 194 -365 117 581 139 -311 371 219 -459 -101 128 -287 -208 -443 39 -246 11 55 414 -389
1372 -389 136 -185 174 366 122 -614 45 1077 78 -80 -571 120 154 -355 306 -189 478 -78 226 -39
1392 -39 -75 482 -58 -616 -717 -294 -259 84 9 155 -145 -124 122 719 -2 -470 -253 -186 -554 -85 159 19
1414 19 -211 389 -942 162 338 -258 51 -203 672 -125 -529 -164 -91 -50 -29 27 -140 -280 -168 755 203
1435 203 -185 -151 150 -25 284 -96 -205 -138 -71 -53 292 -388 -219 -199 -400 768 -465 459 127 437 180
1456 180 -459 448 -325 912 -188 -133 304 486 461 38 24 87 135 368 780 416 -470 -307 -265 -93 -788
1477 -788 375 46 404 -34 -399 202 -12 -15 -16 -1059 -848 -443 124 -8 -268 -115 -414 -55 -305 195 -440
1498 -440 -97 448 -451 98 -885 -147 214 -177 203 294 301 -266 -93 -140 -150 -22 -80 -464 295 -354 -280 -101
1520 -101 337 -51 531 375 -330 188 365 -196 141 16 47 555 -387 107 171 267 -345 -326 -1058 -99 -87 -200
1542 -200 67 -307 -440 -613 255 784 -127 -308 543 -209 -15 -117 934 35 -258 2 99 -293 101 264
1562 264 335 -70 3 557 -261 -176 23 109 497 -288 -136 -498 407 -170 422 -15 -118 -65 -254 -142 125 -499
1584 -499 556 -25 -544 32 681 294 478 336 23 392 404 -375 -59 -269 25 -110 151 125 622 234
1604 234 -647 909 -318 84 97 82 835 683 269 -83 333 104 -188 -187 510 -106 -277 -236 561 -213 40
1625 40 570 340 125 -342 -20 319 -212 106 -94 43 -22 -408 313 -464 -157 -250 318 269 -338 -59 462
1646 462 -87 -299 -456 -327 -732 -9 -311 -116 59 235 -116 -129 -426 -67 400 689 -330 274 213 -178
1666 -178 -136 34 380 -10 442 395 -453 -280 100 43 504 -47 313 342 -456 768 592 -306 -330 -152 -107 67
1688 67 -171 -382 -339 291 28 -817 319 -300 93 422 413 98 -49 -22 -209 -209 100 125 512 -652 -52 -696
1710 -696 109 -525 242 229 32 -298 333 162 -164 588 273 311 310 160 597 2 90 173 -99 -838 -749 31
1732 31 509 308 -85 -221 -642 -186 99 -198 15 -451 237 77 93 -130 -67 -593 -182 170 -423 490 398
1753 398 -268 831 -275 -337 -237 -190 -144 -233 396 -75 296 152 -162 -153 -352 -287 -468 -189 -162 80 44 33 -273
1776 -273 189 43 166 675 -645 -545 -373 -273 289 524 3 -270 -362 -128 138 622 515 96 -86 477
1796 477 -64 -206 -511 -226 837 -244 -153 286 47 -562 547 110 691 234 -181 44 -375 273 -347
1815 -347 99 -47 -335 -681 347 964 53 122 -1031 197 527 335 -233 -565 130 -458 586 -615 -106
1834 -106 -186 3 -401 182 525 14 334 97 365 -117 341 -498 233 185 -78 659 174 -267 -34 584 164
1855 164 -614 512 530 -193 -392 -113 439 -52 816 515 99 673 -298 -138 -311 -610 -443 -655 -561 -54
1875 -54 -387 688 -749 -65 508 -425 514 808 67 324 -91 39 497 299 -201 271 97 82 -630 396
1895 396 125 259 261 252 391 201 518 -113 365 -94 -240 49 318 -316 104 498 -310 -523 -206 -438 -80
1916 -80 -24 -25 321 -66 -84 191 -21 -480 -365 -253 -349 -200 -463 245 -379 -54 -224 35 -207 -302 -354 -289 -83
1939 -83 456 -66 -152 -124 -538 -268 -91 524 491 -13 -360 255 464 -91 -98 -164 531 534 -130 409 348 0 -150
1962 -150 -87 156 41 168 -9 -241 -257 250 -680 619 -361 -113 574 -531 405 -7 413 -292 -84 514
1982 514 789 469 519 488 -497 96 117 -341 -367 317 -44 -216 693 -235 372 -121 -579 277 -612 168 -559
2003 -559 8 -430 -95 547 183 169 321 216 131 427 -427 -639 -453 -728 -160 -1309 -773 -609 357 221
2023 221 -444 -112 123 -234 -180 -122 204 -415 296 382 -359 -43 343 276 439 -697 -190 828 -7 147 -618
2044 -618 -416 -412 573 901 -656 -407 102 95 374 0 108 417 -352 -107 -35 656 -174 -131 -354 348 462 -261
2066 -261 -163 -173 569 -303 147 386 -23 -483 162 102 37 -272 -68 -169 -662 229 387 -86 -475 32 257
2087 257 50 -513 430 -419 -51 171 239 185 -265 27 97 -444 -333 -516 325 -243 -408 -160 -45 183 261
2108 261 -166 314 -52 328 142 297 -161 169 -365 4 442 476 215 350 -463 -441 535 324 317 -668 -270
2129 -270 -251 -490 341 1 -7 -31 343 -287 -556 204 -528 5 -508 -703 280 -408 396 -176 1088 -118 310
2150 310 209 -170 166 582 -214 -105 554 324 126 30 -416 338 489 -543 256 474 430 187 -121 167
2170 167 212 745 -286 -377 868 96 -50 -32 -98 156 -34 -200 -116 297 -67 95 130 405 -400 567 563 290
2192 290 895 -139 160 -1024 -17 -161 692 -410 194 101 -128 729 -23 -251 226 -139 -401 -559 400
2211 400 -9 671 -951 -102 -133 -574 -249 -368 -16 153 -454 444 -58 -967 145 393 -311 275 -261 1212
2231 1212 -705 -155 337 -364 126 -468 485 -273 365 -338 310 -263 -190 180 -558 -236 243 72 311 246
2251 246 -293 134 -583 576 23 68 -53 -22 11 -95 26 -25 -225 68 -210 -112 295 51 -121 -516 -567 579
2273 579 141 282 -510 -173 285 -284 66 -321 194 110 -42 -357 723 -204 106 -376 -506 -286 -100 -463
2293 -463 -326 210 378 -109 511 -215 -73 156 325 362 -1163 69 -337 193 -93 -165 -347 -201 252 57
2313 57 322 -324 -30 543 -486 401 -562 184 340 180 675 -315 -33 127 -442 44 -438 -794 223 465
2333 465 -402 -208 -182 211 644 39 176 -607 -401 -199 533 217 106 -292 -501 340 264 -547 495 -227
2353 -227 486 -482 -150 27 -1071 399 -85 -377 -120 221 -372 -598 -24 52 432 -505 782 -1054 -150
2372 -150 -490 427 661 1006 436 -394 464 -106 -729 -591 251 -242 60 -163 205 -83 -135 -93 95 363 -223
2393 -223 -477 7 65 -312 -596 153 801 404 82 309 32 340 -312 -554 144 244 -22 -484 -296 216
2413 216 -125 -326 362 -415 257 27 -59 434 -47 1101 -698 -198 199 -110 -279 -707 195 -671 -302 423
2433 423 -14 853 -255 -330 806 -550 150 -185 573 64 399 -197 -16 162 -246 79 -340 578 121
2452 121 -410 595 -49 69 705 -254 303 -198 -823 466 -33 -683 84 163 -38 -610 -54 -267 -311 19
2472 19 -181 54 35 -235 -144 -37 -100 -400 -377 -240 148 -294 -149 201 -303 98 -60 -277 528 337 -396 -81
2494 -81 242 128 759 40 -293 45 -577 -634 -110 -170 -779 201 -483 -53 163 402 57 219 -21 -484 353
2515 353 -114 196 -242 331 -104 166 -175 -276 285 297 -580 -448 267 378 92 445 -651 -76 -320 -355
2535 -355 -175 -197 -131 -538 -259 -365 -79 31 -503 258 762 -302 441 -233 -13 -782 -285 355 -226 583
2555 583 820 -385 407 55 265 213 -82 60 293 -332 344 -147 -637 -126 -280 -160 -122 -102 202 -78 423
2576 423 -517 -226 359 -130 -180 66 367 -418 -38 46 663 612 76 403 221 365 236 16 339 -32 -255
2597 -255 40 -215 -134 323 -371 -12 86 712 -423 188 -554 -90 519 80 195 -147 206 -275 -28 -277
2617 -277 -765 292 -275 -142 501 626 -40 99 -333 535 259 -519 -343 239 -114 148 253 -394 124 148
2637 148 -368 326 -343 35 -306 119 -78 162 103 -28 189 -797 -223 -92 -106 591 363 -130 71 -97 -693
2658 -693 -222 0 -97 -37 500 368 -26 47 -32 -834 94 458 38 -213 403 51 163 -275 9 -284 -88
2679 -88 8 402 553 -800 -143 -517 142 54 -238 -509 34 -208 557 763 -57 160 -391 17 -156 -126 312
2700 312 604 302 -375 261 661 401 -82 -302 -672 521 501 436 -400 -32 -300 85 295 -52 -109 -105 -96 -20
2722 -20 -957 96 -405 -582 -417 -153 -74 145 97 146 82 185 -158 275 348 63 491 -68 124 -295 580 -340
2744 -340 322 -236 -167 -348 -31 136 119 785 244 -370 118 -115 251 67 -144 -92 207 173 -389 -28 -623
2765 -623 274 157 -103 -818 204 -237 358 -222 552 -123 -446 333 -521 193 456 -426 450 -30 698 100
2785 100 -216 -303 -559 540 -140 -795 46 -64 387 251 -1322 -374 -724 -116 874 -753 -257 137 -613
2804 -613 -448 -232 266 -531 16 -99 465 275 -199 665 242 -145 88 -190 -452 -266 -111 12 -782 42
2824 42 -562 795 -566 257 -382 -332 485 2 466 344 70 192 1 471 276 -397 -255 209 -246 -545
2844 -545 918 -543 -179 -296 -638 -777 -225 -627 649 396 915 31 304 201 519 157 135 580 306
2863 306 891 -39 -145 352 -519 -176 -362 69 276 242 192 283 -375 -66 211 -677 -45 167 31 125 300
2884 300 -510 233 -100 -70 -452 2 -243 -659 -564 -222 384 264 152 26 -519 220 -210 298 409 363 455
2905 455 1116 398 380 -169 -468 161 594 253 -180 -205 -638 -130 -35 -202 534 416 -38 217 40 -25 189
2926 189 -71 15 -28 693 578 -16 227 218 -523 -100 -204 469 208 -580 256 -102 -233 55 580 111 -290
2947 -290 302 -140 249 -355 177 72 717 -45 -146 -83 -233 -310 47 144 634 -474 115 -217 -427 -75 -157
2968 -157 -79 312 313 26 -338 -490 -148 -174 -243 -156 338 118 668 8 155 -175 682 -327 -396 336 58 112
2990 112 865 -75 -299 -17 -511 -482 -28 -378 277 -12 -50 366 341 -254 218 -290 556 182 511 -314 -30
3011 -30 335 -29 -87 589 -3 -274 450 -489 -140 819 -431 265 -6 386 329 10 -415 137 -549 -455 -47
3032 -47 716 36 -329 -441 56 316 273 -200 -1059 161 44 -4 254 -163 293 -809 -844 94 -18 -71 -39
3053 -39 -237 -162 223 147 454 346 -303 241 -197 336 167 -53 501 -32 -285 720 -110 -90 60 552 289
3074 289 -39 1064 -56 -403 -630 28 312 -16 33 -56 213 324 -1098 -568 -720 -873 -581 161 -204 298
3094 298 -524 185 156 194 655 -233 623 173 273 -300 152 -457 -190 -720 -138 480 -537 -537 264 949 -59
3115 -59 264 762 -371 442 -221 115 299 -651 -285 -310 59 -2 -618 -500 -265 821 -203 -191 -718 99
3135 99 16 -591 197 -314 140 295 -243 207 65 339 -151 221 -991 -382 338 12 381 459 -278 -72 178
3156 178 -675 -306 -54 356 768 99 232 -238 373 -702 251 280 117 313 -241 -307 -153 687 -375 -381 -600
3177 -600 -279 -252 -184 -1070 -616 -556 320 -127 -328 262 -547 -82 -321 -105 425 101 -80 25 873 53 -283
3198 -283 317 -871 -446 -388 1040 41 906 -156 -187 -135 -33 277 283 -37 54 -627 39 -220 -106 -261 218
3219 218 74 -2 53 -491 408 241 92 85 616 -112 11 77 367 -167 -279 -584 152 -367 -907 469 93
3240 93 575 -86 -130 -237 181 156 -627 -27 -271 115 110 533 -278 46 286 274 -278 -419 -479 142 -364 -182
3262 -182 -124 476 -57 -51 -26 -283 246 12 -324 -70 437 -492 -455 -343 687 -323 -338 143 574 -111 -101 -276
3284 -276 131 402 210 -136 -413 -501 56 542 -164 303 -145 -433 366 -133 -11 -474 -139 -165 524 19 493
3305 493 -425 -491 763 -223 -147 -547 -48 195 273 -235 298 -738 -585 -90 540 309 -118 525 -229 88
3325 88 -174 -568 68 129 -192 46 203 1049 369 -64 144 105 -74 152 579 174 401 513 -595 -484 249
3346 249 678 -162 493 629 -281 -227 -61 -83 404 -17 -242 812 -770 553 -313 349 99 -32 420 -237
3366 -237 55 490 236 -353 -328 635 181 -385 41 205 -152 -286 -156 -394 10 -215 351 -60 95 -272
3386 -272 154 -48 247 -309 0 -108 -276 -466 -76 252 70 599 -106 287 -87 -705 -113 110 232 -407
3406 -407 937 98 -179 186 -325 371 406 827 9 -167 590 -868 -100 -48 -338 79 405 -112 -657 -160
3426 -160 195 1003 -16 146 41 21 -303 68 107 -161 268 170 26 243 438 -236 174 521 373 777 -402
3447 -402 682 -597 462 501 225 -277 -230 173 18 220 135 28 -307 122 -600 936 -191 445 307
3466 307 519 -109 -86 366 -389 227 -74 -663 -247 -653 92 -43 -161 -192 101 280 317 335 -89 58 166
3487 166 -816 -157 -239 293 394 370 360 -418 414 337 933 384 -326 -461 -2 318 -55 235 -49 552 353
3508 353 -176 -333 -197 -2 374 433 660 737 214 140 21 -374 443 -71 56 255 -287 -314 -302 312 228 -657
3530 -657 -269 -272 432 360 900 -381 -175 -462 -199 115 22 361 185 -202 -147 357 -164 -432 394 474 16 456
3552 456 -275 659 110 655 -424 561 -92 176 134 -550 -251 322 -21 -4 -43 91 400 43 652 105 370
3573 370 615 227 88 222 -210 418 140 -209 -26 107 -148 -125 -122 372 -33 288 482 -436 -314 -517 83
3594 83 -61 -306 -214 76 -480 471 -334 367 634 -113 -84 72 -674 -511 -265 -465 -170 240 -57 -17 261
3615 261 465 -264 -713 563 -215 -591 247 474 340 173 333 430 -173 138 -479 141 95 -66 -238 -159 -102
3636 -102 -292 569 -734 -347 530 -373 451 172 134 -36 -310 -94 463 -1327 315 321 -125 -534 108 22
3656 22 -11 351 -277 47 -363 561 -831 781 -285 567 -125 -1114 306 368 258 -267 6 -119 -446 283
3676 283 -279 -408 1025 170 -425 -434 -109 -375 -194 -63 204 332 -291 275 296 477 601 -81 -434 -67 272
3697 272 -360 -550 217 -338 861 214 -21 615 -424 -311 -411 -47 374 -389 -306 463 288 372 -437 159
3717 159 102 -249 116 -264 305 -48 22 422 24 803 255 634 199 6 328 -150 170 38 -471 -247 134
3738 134 108 -300 318 135 423 -198 109 392 374 44 -101 489 -224 -166 -149 -85 -51 491 266 714 -377 69
3760 69 -543 146 81 -683 -219 40 256 521 -352 39 -70 -124 -206 532 76 -553 -721 205 -205 -22 -312
3781 -312 -617 376 -36 462 -690 -82 -195 -522 -361 -700 155 229 565 458 -707 -661 -184 29 -378 -293
3801 -293 42 -273 -174 105 -366 640 546 -173 438 308 437 42 753 76 212 220 384 -835 279 600
3821 600 145 320 117 -106 218 -185 -12 -231 562 435 356 235 -28 21 111 452 91 686 645 -562 237
3842 237 72 -290 273 -107 772 -705 715 -152 329 510 595 525 326 -598 -40 -159 2 234 -499 157
3862 157 -246 -313 46 -846 207 -101 -600 99 -1271 169 277 101 -375 445 146 -508 -518 -101 96 566
3882 566 435 306 201 -142 137 -277 -272 -952 356 214 -236 -810 456 -299 -145 766 -445 -611 -41 -37
3902 -37 -88 126 -647 -390 299 -34 440 27 -244 50 -91 498 -169 348 73 439 200 204 -374 510 210
3923 210 426 -486 517 -630 -163 57 -293 -605 -624 -513 87 100 136 412 719 -260 332 105 552 349
3943 349 -5 469 247 -224 364 336 -30 -150 23 277 -250 260 -247 249 -290 -64 -32 -158 -329 578 -494
3964 -494 -165 -329 -213 50 641 -55 -887 849 183 160 -508 -300 -199 862 188 219 127 -319 214 35
3984 35 -495 -164 343 78 -41 69 369 557 -176 -22 -94 54 -665 344 -164 -660 559 -165 -93 -45 397
4005 397 -246 79 -99 -111 -149 385 95 49 181 -594 155 -241 26 -1 -645 -313 -751 -564 -691 49 -250
4026 -250 -201 254 158 324 -89 294 350 -38 543 102 206 -318 -462 -203 -137 -305 -159 353 453 -1103 -51
4047 -51 49 208 249 17 50 -67 -216 257 359 -282 -531 -399 -99 591 -129 -14 548 -670 -21 314 -513
4068 -513 -343 -355 -167 64 273 -536 -436 21 -713 -543 198 339 91 -300 52 -159 -45 71 118 49 -222
4089 -222 383 -28 88 -147 187 307 -241 685 492 -385 -193 342 -322 -437 -391 170 -222 -559 614 241
4109 241 -318 229 342 55 12 287 -221 113 -62 328 413 166 507 44 235 377 524 -477 70 -462
4129 -462 -13 400 243 -198 -231 -195 -271 19 425 26 657 -257 -225 -205 333 -467 -987 -594 204 -578 -394 226
4151 226 -105 -38 -518 -246 -639 67 -292 381 -175 252 196 318 -642 513 541 167 -191 -222 600 310 -326
4172 -326 -75 -133 156 -206 545 -551 -32 -75 -634 533 290 -327 -759 40 -462 283 -45 122 -393 170
4192 170 40 856 392 -717 -55 343 -439 -480 411 238 700 -649 430 121 -302 888 566 -325 -516
4211 -516 -8 -86 -109 -173 -60 -194 -23 -304 -374 -124 273 158 20 276 -689 -864 178 -196 -326 498 -94
4232 -94 254 -189 -521 -513 -229 -415 -323 176 -203 -219 -353 -157 -886 137 -31 -326 -436 612 1014 -31 676
4253 676 -323 -117 584 -354 -348 43 359 -745 -316 12 -500 -525 -262 -126 192 -31 -58 -431 566 -114 -710
4274 -710 -225 83 -148 592 -29 -298 -186 92 499 459 172 1089 543 -445 15 88 409 -290 -261 -808 -244
4295 -244 -191 80 -485 -31 -462 663 105 545 230 85 -29 -3 -15 81 28 514 46 -84 149 664 619 -107
4317 -107 609 99 513 150 -152 -241 270 67 -8 -145 141 75 -389 286 612 465 322 201 15 405 573
4338 573 566 108 51 225 302 -129 -166 255 375 539 -31 180 -139 -27 304 249 -569 164 -109 -642 482 24
4360 24 888 -123 -263 193 521 135 38 191 87 -1179 -613 179 239 101 -278 -363 46 -51 -124 229 342
4381 342 -196 757 -251 -1359 109 -297 -370 62 558 80 270 71 130 245 -59 -150 -512 419 549 -773
4401 -773 -19 -354 -77 85 52 400 -60 163 -580 74 53 403 -235 -154 166 229 -415 435 -210 -70 -51 -447
4423 -447 -286 -104 -48 70 373 -15 -22 386 -63 -326 68 -13 408 585 -265 -556 447 -657 389 37
4443 37 -459 -270 -122 -83 -181 701 265 -128 205 -93 184 -308 -296 -581 687 -150 17 -629 9 47 -144
4464 -144 60 -109 -513 -72 313 -40 290 -81 365 -534 425 -1177 491 192 -667 91 -79 -806 -357
4483 -357 365 -185 -149 -1012 -29 391 268 103 -433 706 -354 -471 408 484 881 406 -449 359 79 -637
4503 -637 538 283 -15 -468 -219 312 -158 -404 345 86 -180 189 -708 20 -218 86 699 546 295 51
4523 51 267 -471 11 -71 -85 741 -61 669 -123 182 116 -555 615 136 -114 298 73 3 259 -342 -98
4544 -98 49 319 -458 440 64 168 -280 504 80 -713 704 216 94 -172 270 696 887 -312 -36 -9
4564 -9 151 -195 783 -49 331 -558 -802 141 -218 -407 372 184 -39 -348 565 372 -197 88 -382 186 -496
4585 -496 202 -284 224 -28 -118 302 248 -277 550 -345 284 214 -533 465 218 -247 -329 -64 -480 -887 270
4606 270 73 57 594 175 23 432 -341 -201 -514 -237 652 -812 -252 -26 -173 88 570 -213 -266 90
4626 90 515 103 53 -572 241 111 -216 -65 193 549 -557 101 199 -39 226 -375 -53 -368 -195 20 -388
4647 -388 125 165 -402 -230 43 -411 -223 -173 192 -306 95 159 511 709 -145 1073 -172 -279 47 516
4667 516 211 132 339 -145 12 310 281 109 109 -16 193 -121 -337 20 254 -319 -1 138 -761 -333 68
4688 68 -405 338 -574 254 321 6 -105 -464 -152 -595 -376 -263 -446 345 -557 205 -202 7 622 -722
4708 -722 140 -162 255 -105 -17 -608 -43 -96 135 27 -513 352 484 -744 185 404 17 13 -371 -56 -328
4729 -328 688 462 -336 -390 -47 154 815 131 542 -911 -410 633 263 654 -204 521 156 951 -430
4748 -430 -493 248 -434 -215 719 -26 -422 -569 -21 -933 -49 -316 -437 -230 673 222 263 52 -462 365 334
4769 334 -504 476 274 141 357 -991 -149 178 79 114 495 192 64 739 300 814 -464 -261 -257 503 -474
4790 -474 -267 286 176 -538 -28 663 421 -278 282 167 333 266 -142 1064 -194 323 -210 -532 -66 397
4810 397 -214 -102 222 525 -65 -20 0 226 -66 -91 629 246 -126 550 113 697 -278 -244 500 16 -375
4831 -375 656 -359 -228 -61 -131 -268 -55 -722 -72 248 226 -659 281 75 -230 -231 -643 -304 -361 57 381
4852 381 -859 142 -164 -414 291 -77 336 541 39 697 -451 -978 -43 -30 -227 611 125 488 -14
4871 -14 -491 394 -97 6 -600 24 609 -24 -180 17 -439 -646 -568 436 224 263 -327 540 -17 736 -171
4892 -171 -77 -275 31 -594 -271 64 -672 -91 594 -177 143 -7 693 299 -37 -305 -400 389 302 -342 -365
4913 -365 848 29 308 -116 -174 -245 -113 -360 -109 -120 535 5 448 -363 -390 66 -106 -168 532 136 304
4934 304 -674 -570 192 -598 -562 -59 -451 339 127 -762 257 235 -377 698 135 112 -373 -293 -230 464 -354
4955 -354 -280 116 133 662 -104 83 197 420 -49 769 353 21 143 369 -142 -152 -465 -188 184 317 -134
4976 -134 340 -547 185 -646 329 45 -204 -11 -325 465 264 -148 -369 -29 -455 948 -326 593 318
4995 318 -198 -26 -222 572 166 -238 376 -19 -513 -25 -502 -826 478 -56 265 -379 112 124 -463 48
5015 48 -625 150 41 443 -178 -423 595 -21 93 -230 -156 408 -246 -58 -182 -248 -497 -399 -261 252 281
5036 281 -37 452 170 206 -184 180 -94 -327 68 317 557 422 -322 -208 53 -132 -99 -548 -248 210 372
5057 372 568 375 -39 -1 440 75 -498 -220 -414 -1103 -127 -257 168 -34 36 -303 -369 422 261 -39 -213
5078 -213 213 -117 462 -496 -576 355 784 -236 88 -370 -102 627 202 -401 -195 75 271 512 -211 557
5098 557 39 427 796 -38 250 64 81 -208 22 -134 714 454 51 -67 98 -125 -528 -231 -484 223
5118 223 490 -636 351 519 -83 287 -744 -337 -452 240 203 -663 209 855 -724 154 -524 -428 -376 531
5138 531 334 -431 261 -141 -209 -93 144 10 559 -50 361 112 -32 -582 -59 150 -248 120 -139 274
5158 274 -135 484 208 185 279 -239 -767 584 -218 13 -642 302 564 -144 -247 -168 376 152 -126 160 42
5179 42 -76 238 -337 -56 -33 353 -225 103 372 -285 -398 489 300 480 -125 -64 -71 -486 41 428 -673
5200 -673 115 874 -873 54 -129 172 -75 -14 419 -117 269 581 -433 -65 228 -720 -167 43 316 510
5220 510 -91 696 358 -434 -409 -112 432 419 528 101 -514 -403 -612 -56 959 545 -365 567 445 481 -277
5241 -277 218 -143 532 -90 -86 -335 -428 -199 373 238 418 -114 413 -206 101 429 -761 318 371 246 358
5262 358 552 -165 -68 -417 247 647 -8 -167 296 -283 -436 83 -462 -295 165 -395 -573 481 273 7
5282 7 -306 -150 557 -144 166 -178 -284 502 493 7 -519 164 209 -113 64 251 -362 75 -839 -463 61 292
5304 292 189 427 -406 122 806 43 -180 646 -276 -25 337 -252 -437 295 -220 -541 148 259 -20 131
5324 131 9 843 -23 288 -81 451 -277 -572 125 -108 246 696 86 -105 -581 470 -77 -587 57 -614
5344 -614 -11 168 674 127 -505 -203 200 -277 69 616 17 -382 403 554 146 -573 37 1229 175
5363 175 361 -262 -155 185 -269 -516 184 -51 28 162 77 660 778 772 -98 736 -230 -470 -329 492 121
5384 121 -1094 217 -252 195 -264 -231 575 271 -11 672 602 208 264 -497 53 0 293 483 -338 -150 -124
5405 -124 1030 -346 -730 -82 304 478 396 580 -101 33 300 119 -140 69 -392 -117 181 826 217 -184
5425 -184 198 382 611 57 374 -266 -146 -145 659 -131 131 -120 26 -367 548 208 -84 -329 -160 535 52
5446 52 366 -76 -84 706 703 -197 86 -172 498 -193 -302 231 866 91 -256 107 79 -307 -423 -370 -320 -22 -137
5469 -137 -569 543 -259 -207 210 640 281 236 75 73 13 -681 1055 -603 -132 156 -58 313 40 230 300
5490 300 396 -769 38 -546 -57 172 76 370 182 75 42 -42 -390 291 273 -535 -411 262 -601 308 31
5511 31 98 616 211 -131 -138 -436 146 939 -27 -291 751 394 184 -164 -443 563 135 -399 -88 121 -305
5532 -305 253 730 341 619 237 289 -617 -490 13 -123 -20 -228 -120 -344 -10 30 475 -351 214 -195 661
5553 661 -570 -225 -886 20 10 -232 -105 -603 13 464 27 -192 365 -415 -393 327 562 -1176 -613 -224
5573 -224 -245 18 -228 -509 133 778 -658 389 -4 -714 -164 -836 -304 -372 -434 -439 -224 -146 32 89 111 431
5595 431 -346 -143 -304 -44 -73 263 213 50 -692 239 -314 -712 260 63 114 444 549 628 123 185 -149 395
5617 395 -172 592 225 -262 218 566 -234 380 345 -401 54 174 -445 -149 352 -312 -458 559 -273 -81
5637 -81 -602 226 118 232 457 -88 -258 150 113 566 675 -605 -133 -126 200 -395 -230 428 -305 -323 -94
5658 -94 -832 -299 -315 375 122 -384 -32 301 9 386 -543 361 -164 -400 142 522 -176 -10 590 -241 -817
5679 -817 -174 11 53 238 -641 85 -224 72 444 -131 315 50 -209 443 118 -399 300 -132 -240 106
5699 106 187 -147 -1038 -167 234 -626 218 -144 198 4 84 -51 -19 -743 -153 -549 619 914 -193 275
5719 275 569 -273 -278 471 735 -73 217 326 273 -201 -320 -229 -30 -531 -706 304 459 -306 -179 -416 -306
5740 -306 -142 269 -303 -514 437 -252 161 391 -267 -10 276 75 123 491 414 -276 -428 87 408 -296 355
5761 355 -68 -390 897 384 -345 5 -424 213 -553 -541 -442 613 -448 -190 697 -132 -110 9 -36 -285
5781 -285 -360 470 96 5 720 -373 -92 1255 53 -391 -162 -128 -395 566 271 134 457 -268 -41 20
5801 20 8 -230 199 -170 467 531 -249 317 226 74 -1310 -157 294 723 634 251 -842 60 94 126 -574
5822 -574 369 -716 -50 -716 263 124 479 -281 26 473 -338 611 -140 455 382 594 -157 56 111 76 -205
5843 -205 -70 266 635 -420 12 -177 -72 -697 -413 66 216 -158 213 204 -235 -377 43 -535 -708 190
5863 190 -100 -357 72 -173 298 -259 -389 86 27 -220 -20 -846 636 404 133 47 183 -471 -184 8
5883 8 -61 -570 302 -257 136 199 212 241 -187 85 -364 278 -247 -103 109 -594 -192 423 -116 -108 182 51 66
5906 66 -152 -177 -576 208 -256 298 35 475 -51 223 0 -167 -107 -747 -288 -154 50 -181 -619 -496 -433
5927 -433 -104 -312 -790 -367 155 784 135 781 56 617 312 56 50 220 -109 111 -221 -292 245 483 -135
5948 -135 374 -243 -414 -135 109 -94 277 118 -631 -185 -28 139 276 -291 -151 408 430 1 78 214 -474
5969 -474 -177 -207 236 -113 478 110 184 353 -212 -54 -43 -796 -149 -1188 -417 499 48 -50 442 -197 -436
5990 -436 -297 -96 -421 -143 211 -353 -403 277 -226 144 711 23 17 -163 -540 -365 175 -333 -11 159 412
6011 412 -513 271 367 -179 477 122 -284 -77 -319 -503 -26 55 45 -295 -272 6 -301 -126 -338 201 -175
6032 -175 -690 -352 -102 208 30 -362 -177 214 -122 525 -243 -359 698 169 369 -626 -160 38 244 -321
6052 -321 -8 -384 437 -273 -161 252 -20 12 895 -50 -443 72 84 -221 447 89 236 399 -309 203 -206
6073 -206 -159 33 478 26 -54 256 -361 -245 -507 -256 63 -589 -241 277 313 -73 20 286 -149 580 113
6094 113 -111 -80 -15 -104 123 -348 -260 -106 -146 56 -346 -66 249 131 115 865 -322 338 -133 32 211 38
6116 38 636 452 666 260 268 54 426 181 530 -308 144 -131 252 2 -443 -200 148 -196 685 392 246
6137 246 -329 339 -14 654 690 -318 -377 -575 352 481 146 785 199 389 251 690 -30 60 149 -99 569
6158 569 -38 -225 -114 89 -184 321 -287 55 -630 243 -397 1095 -104 -253 -87 445 315 -175 398
6177 398 -413 -382 707 10 160 -375 -112 -112 177 -165 -201 -44 -734 113 -775 631 1018 -354 358 -510
6197 -510 -301 69 765 -46 -132 762 -697 -140 -432 -137 192 80 -90 -348 -123 -132 168 -356 413 -258 -514
6218 -514 -109 221 -376 -198 -852 -414 543 -283 -257 -633 335 -92 530 -199 -288 -310 567 147 -25 -3 -84 227
6240 227 72 -71 -26 -147 -8 -317 -389 78 -731 494 -711 -383 -650 -322 550 -90 861 254 -707 -455
6260 -455 177 519 856 493 -404 161 -786 416 224 29 -203 42 -30 -272 35 -284 -176 -369 1 59
6280 59 337 -484 584 14 -468 -389 -579 -223 136 589 451 -54 58 -121 -12 -365 -201 285 -83 -283
6300 -283 -320 -269 -232 78 583 2 411 105 -462 100 604 -64 -481 455 476 -411 -18 -199 135 518 545 -663
6322 -663 319 -282 -825 245 664 734 -53 335 136 -14 -102 134 672 377 533 -148 26 -282 95 306
6342 306 81 395 34 575 105 447 -568 423 253 -173 261 597 -504 -639 -3 74 -194 -257 -41 32
6362 32 -481 139 104 -314 665 -348 239 636 173 43 169 571 -67 -127 102 -611 271 277 557 -455 -335
6383 -335 -651 -250 -180 623 -306 167 -139 -275 202 164 53 -36 317 427 643 -616 82 -418 488 -540
6403 -540 9 151 -257 962 -101 178 -351 288 -370 -202 -690 -55 744 467 -225 -455 -251 45 -287
6422 -287 291 -720 -65 458 -297 -41 524 415 85 318 -196 553 363 170 -439 238 183 231 291 -154 44
6443 44 -395 156 -1 462 56 643 -261 -395 -434 -323 -217 673 -317 -233 0 -223 1 624 228 -555 273
6464 273 173 7 -243 -412 -373 -3 208 -691 188 637 48 -333 288 668 308 333 564 281 -285 214 5
6485 5 334 371 -655 -452 678 -237 40 -321 -119 817 -62 -508 -131 -59 210 76 3 505 -665 -186 397
6506 397 192 416 511 258 -318 329 -91 -64 647 -298 212 235 264 39 148 134 729 -66 -122 26 271 -801
6528 -801 326 303 132 771 -98 5 2 -192 161 -297 -175 -355 362 519 1059 284 171 -172 -466 203 -349
6549 -349 -341 178 17 376 -233 5 -45 557 574 -460 269 367 170 -347 81 270 -38 359 -221 575 -47
6570 -47 -522 586 146 166 -225 201 553 275 7 -268 -549 113 203 218 93 63 218 -452 -148 401 407 298
6592 298 256 -658 -521 43 300 58 -229 177 -66 202 511 214 -115 143 479 -497 366 -26 274 -142
6612 -142 176 -97 0 -28 -772 513 -405 -278 609 -427 492 12 817 443 130 350 -233 500 -355 252
6632 252 -51 176 -144 672 272 93 122 227 189 293 162 -7 237 72 -660 -537 372 -248 215 439 -267
6653 -267 108 -322 439 -772 -685 97 298 792 46 -327 213 50 -268 -181 -227 44 143 89 360 -343 -176
6674 -176 -205 180 278 11 263 -217 202 443 672 -245 -155 277 -404 404 207 84 -323 -225 -107 -397 260
6695 260 577 -111 122 -17 -482 -109 -115 520 -591 266 -94 -440 -374 551 -311 -286 470 -162 -311 -190 -722
6716 -722 -494 541 13 129 55 -76 455 -430 203 -541 -105 -395 272 -273 438 156 647 -273 174 159
6736 159 -119 66 33 768 -20 -369 -94 -195 125 51 368 388 -418 -248 252 -392 -340 314 249 7 244 585
6758 585 235 43 33 649 -74 178 431 -17 -332 -38 -83 -13 409 -546 -243 38 161 115 -549 228 -110
6779 -110 19 404 11 -375 500 59 -510 -396 547 -208 139 -323 408 -177 40 95 -214 -519 -17 26 69
6800 69 -41 -302 324 495 -542 -425 -28 348 62 217 -370 780 443 197 160 290 376 -205 80 -166
6820 -166 -21 -3 243 776 227 111 -11 -362 -41 -82 350 -6 -256 0 -113 -526 278 -433 160 -94 552
6841 552 -422 76 -40 -547 533 37 339 -449 38 -299 -50 98 -194 -32 193 -111 233 29 -32 460
6861 460 409 -164 104 682 -268 774 -202 37 -255 -94 -18 -468 522 -93 258 -465 -219 146 -99 -324
6881 -324 507 49 -236 -356 -445 -737 -227 250 -380 -158 78 -220 -270 -67 546 -376 -565 -514 -631 -188 68
6902 68 -347 -330 -296 789 -251 338 -691 -480 251 -167 8 -873 3 407 -262 -104 -54 795 28 -106
6922 -106 -259 -46 -96 -761 -302 273 -282 -672 519 -354 160 -501 -303 383 306 323 744 -135 -319 82 522
6943 522 472 23 383 209 -395 102 315 304 -389 -402 76 -138 -451 237 679 -151 -342 388 785 -12 561
6964 561 -416 49 -379 162 509 -113 104 -81 265 29 4 171 694 -119 239 -262 23 181 -103 121
6984 121 -312 57 -628 136 -269 -454 -227 -193 -548 289 -882 276 133 -103 -404 424 456 -315 -358 35
7004 35 581 -48 564 -197 508 151 -697 731 260 -347 -96 -559 790 -301 -377 -5 434 389 265 596
7024 596 -411 400 1 636 158 -384 -427 447 179 282 -203 90 420 530 188 -403 396 131 263 -494
7044 -494 144 -292 40 -32 -30 935 -20 445 136 474 -586 -75 -127 -343 6 -463 -161 -74 166 324 45
7065 45 -66 547 616 84 -1 -369 -37 -333 13 -237 -659 -7 644 497 33 -540 -536 -120 -78 61 529 228
7087 228 75 433 -157 -283 -384 45 -196 299 -616 -64 -613 14 714 -325 -217 48 -205 244 -176 -512
7107 -512 104 127 256 152 96 -588 91 -188 -91 -447 -108 3 366 -276 -139 -188 -241 322 395 763 -36 -491
7129 -491 51 -131 -546 -159 31 -432 282 -119 -509 -66 26 -248 37 180 -126 -7 -358 -431 -373 574 399
7150 399 -273 -830 744 159 85 397 -239 -105 53 586 184 52 -245 287 -308 -52 -113 -46 334 276 -479
7171 -479 -116 -330 -232 -222 -256 -134 76 241 -730 11 -99 -90 -218 -67 545 7 -140 -487 -200 -452 340 -28
7193 -28 -221 496 -800 -389 11 389 46 -62 -216 96 31 -276 197 -332 -421 -202 -306 209 -338 432 202
7214 202 -61 -144 204 -143 -143 78 3 -251 -66 -170 107 451 -195 -802 78 430 -379 323 275 -278 127 -57
7236 -57 358 319 -286 -229 70 140 -2 218 127 -861 372 -181 -381 255 750 -268 -174 -430 102 229 739
7257 739 370 -454 65 214 -298 298 -472 -145 -143 287 111 -262 292 -13 -62 -74 271 -175 601 -467 -216
7278 -216 332 -304 208 -419 349 -527 115 335 -60 228 384 775 -241 -443 95 522 -80 -170 546 155
7298 155 171 -113 -141 201 -573 -696 477 460 34 839 80 -181 -431 -53 -282 175 -55 -209 172 254 186
7319 186 -245 -100 284 -71 -13 81 155 452 113 599 630 -519 -403 830 -413 126 -458 851 139 -54
7339 -54 25 158 -280 202 -117 -184 295 199 238 37 138 252 388 -366 228 -212 -548 379 277 -262 -56 -154
7361 -154 221 315 194 100 -221 406 648 232 105 73 -452 655 457 -127 482 282 200 87 -407 -61 672
7382 672 253 -36 -36 -41 -2 -506 76 -302 524 272 132 185 -125 337 -753 31 -355 -345 -206 -305 282 -94
7404 -94 432 460 220 -209 501 -315 618 734 219 -376 243 275 -62 -237 -198 -301 -366 -289 -629 348 562 40
7426 40 980 49 267 174 -42 53 518 374 -25 -604 147 43 322 -499 323 -321 -309 -6 -815 242 267
7447 267 -62 387 -36 -59 327 144 351 272 -228 4 -105 -272 -655 -85 -153 -337 -115 99 -123 463 -594
7468 -594 46 438 -355 -589 210 209 50 -385 23 422 -153 -544 -478 449 -5 -467 442 105 -69 -192 223
7489 223 -15 -803 680 -339 -370 -455 -553 -548 73 -35 -42 -689 79 129 -417 -384 -563 46 -157 116 -4 -134
7511 -134 73 -395 -554 284 -130 222 -209 -71 304 -269 -198 528 -427 -441 -60 -29 118 -57 24 -147 296
7532 296 -304 347 -394 18 -90 120 -247 260 420 -321 224 -257 321 -615 -339 -75 -59 125 -277 138
7552 138 -865 308 -300 -370 -285 340 -420 -167 -134 -190 252 -254 146 298 -387 300 -13 640 -492 42
7572 42 201 133 31 -1220 -254 -47 287 233 -399 173 376 -484 -481 104 -385 -200 205 110 795 683 730 474
7594 474 76 -11 -297 19 105 84 172 -746 730 -160 94 -310 -1 -510 -465 118 -389 -59 -62 -228 248 2
7616 2 429 -562 -502 474 -411 -230 128 65 292 700 97 -480 -386 87 -2 -321 2 -165 -453 384 29 75
7638 75 -353 -106 79 135 -375 121 629 -443 -430 -17 292 14 -343 55 316 -632 23 -487 -124 306 208
7659 208 -142 604 -247 110 -78 223 520 -237 -129 -352 -206 -102 -379 224 249 -476 -756 494 125 -170
7679 -170 6 83 229 -593 250 -544 447 308 364 -550 343 851 -172 -310 52 292 142 -328 -367 6 -294
7700 -294 501 49 -8 154 -687 269 111 197 -113 -210 -212 -33 -41 -46 -140 -482 66 -61 566 -484 350 442 -274
7723 -274 -312 -128 -225 303 597 295 -34 -713 131 138 -361 -418 -431 -492 484 -260 84 118 339 267 -69 -90 -366
7746 -366 2 440 213 -421 -535 158 -777 218 -70 -131 -16 -736 24 328 -614 -59 170 287 -450 179
7766 179 -171 97 -244 -570 -613 190 504 -294 -88 -406 288 -347 371 -466 556 -729 -556 -102 -83 398
7786 398 -539 354 -191 23 419 -337 197 398 66 -221 17 212 -649 -73 269 -521 -289 -113 -762 48
7806 48 72 725 813 194 482 514 -88 -500 -486 -270 -402 186 404 -197 -439 -520 -325 -22 -297 994 -9
7827 -9 208 75 -3 -171 -154 -341 -252 34 -125 270 -741 451 121 -300 -400 97 471 -268 -187 62 276
7848 276 112 -486 -516 -266 250 -151 -155 -344 -555 -7 -64 292 302 -298 679 -325 -552 -83 -264 -836 259
7869 259 622 509 -148 -673 1175 -174 -120 247 421 -742 251 -328 -109 -57 212 70 631 376 -200 -45
7889 -45 185 -89 186 658 275 -374 -477 4 168 -412 -609 550 -119 -354 625 417 -268 167 353 -227
7909 -227 -4 -724 287 -122 -67 86 -9 -305 -122 499 -269 42 -2 178 -33 -262 163 -100 -565 -275 -191
7930 -191 711 -53 -477 475 352 -305 259 -538 -182 -24 654 412 -31 212 -39 -290 -443 -368 -276 -40 66
7951 66 -166 -64 137 -139 692 320 -281 -567 -330 -374 143 183 226 339 -49 -323 171 252 -64 -43 99 -22
7973 -22 159 457 -307 -219 -418 221 -674 277 326 242 -426 -288 99 101 215 -246 -177 300 -429 -45 450 -370
7995 -370 318 706 -276 -218 511 321 610 94 -417 -169 100 214 198 -11 9 352 -314 68 -68 -339 -463
8016 -463 500 753 -353 -102 -74 -66 -730 519 -388 377 -507 -506 -251 -96 -94 -27 159 186 -748 294 -450 165
8038 165 -191 63 480 -224 329 -327 -239 -210 366 280 -469 8 -273 144 -336 -214 -364 -300 -306 -34 239 133
8060 133 -146 -469 -87 565 295 647 -393 806 -51 206 -15 67 200 -239 257 959 92 -686 192 -56
8080 -56 329 278 -420 235 94 160 -157 87 797 195 912 -178 121 -108 820 -285 271 -608 -88 634
8100 634 -468 -361 -264 -243 624 429 88 -38 -112 -250 -334 -21 -63 9 288 424 59 59 -312 502 -187 -44
8122 -44 -236 -451 -72 13 -436 -450 -158 280 -198 -87 -51 -17 -230 -35 144 812 -119 -280 -8 74 -280 164
8144 164 171 -390 334 327 31 -469 -35 -505 239 -158 -394 -504 -668 -972 -213 225 -90 -5 50 -138 -562 -110
8166 -110 31 332 133 -162 -117 -374 45 373 92 815 -395 -43 35 261 654 760 -141 -43 -281 200 194
8187 194 -40 216 348 -99
8191i9
##END NTUPLES=NMR FID
##END=
