##TITLE=1H_SR166
 DMSO-d6
 64 sc, 
 20.4.2023
##JCAMPDX= 6.0         $$ Bruker NMR JCAMP-DX V2.0
##DATA TYPE= NMR FID
##DATA CLASS= NTUPLES
##ORIGIN= UXNMR, Bruker Analytische Messtechnik GmbH
##OWNER= root
$$ XWIN-NMR		Version 3.5
$$ Thu Apr 20 14:30:40 2023 Russian Standard Time (UT+4h)  she@DPX200
##.OBSERVE FREQUENCY= 200.1316
##.OBSERVE NUCLEUS= ^1H
##.DELAY= (6, 6)
##.ACQUISITION MODE= SIMULTANEOUS
##.ACQUISITION SCHEME= undefined
##.AVERAGES= 64
##.DIGITISER RES= 18
##SPECTROMETER/DATA SYSTEM= spect
##.PULSE SEQUENCE= zg30
##.SOLVENT NAME= CDCl3
##.SHIFT REFERENCE= (INTERNAL, CDCl3, 0, 15.7039)
##AUDIT TRAIL= $$ (NUMBER, WHEN, WHO, WHERE, WHAT)
$$ ##TITLE= Audit trail, XWIN-NMR		Version 3.5
$$ ##JCAMPDX= 5.01
$$ ##ORIGIN= Bruker BioSpin GmbH
$$ ##OWNER= she
$$ F:/spectra/data/she/nmr/H-F/1/audita.txt
$$ ##AUDIT TRAIL=  $$ (NUMBER, WHEN, WHO, WHERE, WHAT)
(   1,<2023-04-20 14:29:43.67 +0400>,<she>,<DPX200>,
      <continue with go, POWCHK disabled, PULCHK disabled
       configuration hash MD5:
       00 E9 B6 7A A2 85 ED C7 34 08 36 98 17 FE 4E 26
       data hash MD5: 16K
       B5 81 5A 93 21 6E A1 10 53 BA 3A 19 55 0D 71 F7>)
$$ ##END=
$$ 
$$ hash MD5
$$ 37 CC 56 61 54 7C 27 AF 97 98 F3 42 7C D5 F0 6B
##$RELAX= 
##$RELAX= 
##$RELAX= 
##$RELAX= 
##$RELAX= 
##$RELAX= 
$$ Bruker specific parameters
$$ --------------------------
##$DU= <F:/spectra>
##$EXPNO= 1
##$NAME= <H-F>
##$PROCNO= 1
##$TYPE= <nmr>
##$USER= <she>
##$AMP= (0..31)
100 100 100 100 100 100 100 100 100 100 100 100 100 100 100 100 100 100 
100 100 100 100 100 100 100 100 100 100 100 100 100 100 
##$AQSEQ= 0
##$AQ_mod= 1
##$AUNM= <au_zg>
##$AUTOPOS= <>
##$BF1= 200.13
##$BF2= 200.13
##$BF3= 200.13
##$BF4= 200.13
##$BF5= 200.13
##$BF6= 200.13
##$BF7= 200.13
##$BF8= 200.13
##$BYTORDA= 1
##$CFDGTYP= 0
##$CFRGTYP= 5
##$CHEMSTR= <none>
##$CNST= (0..31)
1 1 145 1 1 1 1 1 1 1 1 1 1 1 1 1 1 1 1 1 1 1 1 1 1 1 1 1 1 1 1 1 
##$CPDPRG= <>
##$CPDPRG1= <>
##$CPDPRG2= <>
##$CPDPRG3= <>
##$CPDPRG4= <mlev>
##$CPDPRG5= <mlev>
##$CPDPRG6= <mlev>
##$CPDPRG7= <mlev>
##$CPDPRG8= <mlev>
##$CPDPRGB= <>
##$CPDPRGT= <>
##$D= (0..31)
0 1.2 0 0 0 0 0 0 0 0.06 0 0.03 0 0 0 0 0.0002 0 0 0 0 0 0 0 0 0 0 0 0 
0 0 0 
##$DATE= 1681986336
##$DBL= (0..7)
120 120 120 120 120 120 120 120 
##$DBP= (0..7)
150 150 150 150 150 150 150 150 
##$DBP07= 0
##$DBPNAM0= <>
##$DBPNAM1= <>
##$DBPNAM2= <>
##$DBPNAM3= <>
##$DBPNAM4= <>
##$DBPNAM5= <>
##$DBPNAM6= <>
##$DBPNAM7= <>
##$DBPOAL= (0..7)
0.5 0.5 0.5 0.5 0.5 0.5 0.5 0.5 
##$DBPOFFS= (0..7)
0 0 0 0 0 0 0 0 
##$DE= 6
##$DECBNUC= <off>
##$DECIM= 32
##$DECNUC= <off>
##$DECSTAT= 4
##$DIGMOD= 1
##$DIGTYP= 9
##$DL= (0..7)
0 120 120 120 120 120 120 120 
##$DP= (0..7)
150 150 150 150 150 150 150 150 
##$DP07= 0
##$DPNAME0= <>
##$DPNAME1= <>
##$DPNAME2= <>
##$DPNAME3= <>
##$DPNAME4= <>
##$DPNAME5= <>
##$DPNAME6= <>
##$DPNAME7= <>
##$DPOAL= (0..7)
0.5 0.5 0.5 0.5 0.5 0.5 0.5 0.5 
##$DPOFFS= (0..7)
0 0 0 0 0 0 0 0 
##$DQDMODE= 0
##$DR= 18
##$DS= 0
##$DSLIST= <SSSSSSSSSSSSSSS>
$$ [...]
##$SUBNAM2= <"">
##$SUBNAM3= <"">
##$SUBNAM4= <"">
##$SUBNAM5= <"">
##$SUBNAM6= <"">
##$SUBNAM7= <"">
##$SUBNAM8= <"">
##$SUBNAM9= <"">
##$SW= 18.0517057926174
##$SWIBOX= (0..15)
0 0 2 0 0 0 0 0 0 0 0 0 0 0 0 0 
##$SW_h= 3612.71676300578
##$TD= 16384
##$TD0= 1
##$TE= 0
##$TE2= 300
##$TE3= 300
##$TEG= 300
##$TL= (0..7)
0 120 120 120 120 120 120 120 
##$TP= (0..7)
150 150 150 150 150 150 150 150 
##$TP07= 0
##$TPNAME0= <>
##$TPNAME1= <>
##$TPNAME2= <>
##$TPNAME3= <>
##$TPNAME4= <>
##$TPNAME5= <>
##$TPNAME6= <>
##$TPNAME7= <>
##$TPOAL= (0..7)
0.5 0.5 0.5 0.5 0.5 0.5 0.5 0.5 
##$TPOFFS= (0..7)
0 0 0 0 0 0 0 0 
##$TUNHIN= 0
##$TUNHOUT= 0
##$TUNXOUT= 0
##$USERA1= <user>
##$USERA2= <user>
##$USERA3= <user>
##$USERA4= <user>
##$USERA5= <user>
##$V9= 5
##$VALIST= <valist>
##$VCLIST= <CCCCCCCCCCCCCCC>
##$VD= 0
##$VDLIST= <DDDDDDDDDDDDDDD>
##$VPLIST= <PPPPPPPPPPPPPPP>
##$VTLIST= <TTTTTTTTTTTTTTT>
##$WBST= 1024
##$WBSW= 4
##$XGAIN= (0..3)
0 0 0 0 
##$XL= 0
##$YL= 0
##$YMAX_a= 634848
##$YMIN_a= -1112418
##$ZGOPTNS= <>
##$ZL1= 120
##$ZL2= 120
##$ZL3= 120
##$ZL4= 120
##$ABSF1= 10
##$ABSF2= 0
##$ABSG= 5
##$ABSL= 3
##$ALPHA= 0
##$AQORDER= 0
##$ASSFAC= 0
##$ASSFACI= 0
##$ASSFACX= 0
##$ASSWID= 0
##$AUNMP= <proc_1d>
##$AZFE= 0.1
##$AZFW= 0.1
##$BCFW= 1
##$BC_mod= 2
##$BYTORDP= 1
##$COROFFS= 0
##$CY= 11.3945322036743
##$DATMOD= 1
##$DC= 2
##$DFILT= <>
##$DTYPP= 0
##$F1P= 15.7292609196834
##$F2P= 12.9074282941183
##$FCOR= 0.5
##$FTSIZE= 0
##$FT_mod= 4
##$GAMMA= 1
##$GB= 0.15
##$INTBC= 1
##$INTSCL= 1
##$ISEN= 128
##$LB= 0.24
##$LEV0= 0
##$LPBIN= 0
##$MAXI= 10000
##$MC2= 0
##$MEAN= 0
##$ME_mod= 0
##$MI= 1.114404
##$NCOEF= 0
##$NC_proc= 0
##$NLEV= 6
##$NOISF1= 3.799351
##$NOISF2= 2.8
##$NSP= 1
##$NTH_PI= 0
##$NZP= 0
##$OFFSET= 15.70392
##$PC= 1
##$PHC0= -19831.26
##$PHC1= 9.400814
##$PH_mod= 1
##$PKNL= yes
##$PPARMOD= 0
##$PSCAL= 0
##$PSIGN= 0
##$REVERSE= no
##$SF= 200.130013532006
##$SI= 16384
##$SIGF1= 3
##$SIGF2= 2
##$SINO= 400
##$SIOLD= 16384
##$SREGLST= <1H.CDCl3>
##$SSB= 0
##$STSI= 0
##$STSR= 0
##$SW_p= 3612.71676300578
##$SYMM= 0
##$S_DEV= 0
##$TDeff= 0
##$TDoff= 0
##$TI= <>
##$TILT= no
##$TM1= 0
##$TM2= 0
##$TOPLEV= 0
##$USERP1= <user>
##$USERP2= <user>
##$USERP3= <user>
##$USERP4= <user>
##$USERP5= <user>
##$WDW= 1
##$XDIM= 8192
##$YMAX_p= 0
##$YMIN_p= 0
$$ End of Bruker specific parameters
$$ ---------------------------------
##NTUPLES= NMR FID
##VAR_NAME=  TIME,          FID/REAL,        FID/IMAG
##SYMBOL=    X,             R,               I
##VAR_TYPE=  INDEPENDENT,   DEPENDENT,       DEPENDENT
##VAR_FORM=  AFFN,          ASDF,            ASDF
##VAR_DIM=   8192,          8192,            8192
##UNITS=     SECONDS,       ARBITRARY UNITS, ARBITRARY UNITS
##FACTOR=    0.0002768,     1,               1
##FIRST=     0,             0,               0
##LAST=      2.2672688,     0,               0
##MIN=       0,             -1112418,        0
##MAX=       2.2672688,     634848,          0
$$ Real data points
##PAGE= N=1
##DATA TABLE= (X++(R..R)), XYDATA
$$ [...]
2417D50m28p3J68L52m23n04JK72r2N5O16m83k30J44m36O93j2j92l61Q31p48N17
2439A17p86P42n03Q78m14m59N06J33M74j077Q47o81M32l27L32L08l56L27l88l29
2459b24k04P92p6p18L69j65P9k09J048n95o2q66M86L53J004r46m25Q81q2q50M57
2480D7J05n51P58J7r68p8P52q0k82P72l13J85j73K83m67qP40o0p75j209J440J42
2502B77J02j74o43K85K52m88P18l71k27L82l21j67M67M30m26l87j40M97L14j09
2522B71K37j90k54l79O58K89o21o59K06K74Q01r80P78k02q28O68mk38J48M79m18
2543C6K91j269J130j67o47P60q9L11l36n74R15p83L79m43J119j263J169j002R07
2562D44p36O62O4j166R44l25n22N62k30K02l54N16L04o59j12P6K8j8J39Q86n23
$$ y = [450, 22, -51, 117, 469, 46, -458, -457, -185, -277, -222, 394, -89, -319, -175, -611, 82, 70, -122, -483, 348, -400, 117, -669, 73, -430, 448, 34, -425, 81, 214, 688, -389, 458, -223, 209, -118, 214, 522, 166, 493, 105, -224, -428, 364, 288, -430, -61, -226, -147, -356, 692, 97, 35, -831, -345, 8, 1012, 66, -359, 522, 440, -410, 47, 152, -399, 359, 376, -592, -670, 82, 2, -280, 492, 179, 364, 191, 474, 7, -1, 739, 679, -96, -1305, 135, 277, 379, 205, -438, -153, 99, -389, 329, -42, -269, 113, -208, -375, 92, 522, 96, -291, -431, 66, 380, 271, 508, 318, 64, -315, 343, 632, 11, -648, -442, -168, 633, -347, 431, 229, -599, 69, 65, -173, -25, 454, 36, 327, -942, 188, 21, -626, 134, 45, 356, 20, -554, 361, -422, -43, -486, 633, -630, 539, -463, 444, -292, 370, 434, -732, 212, -113, -635, -73, -303, -101, -455, 61, 365, -294, -406, -330, -302, -320, -181, 705, 182]
2583A82j089J172m46J55q78M75L77O87o73l48L08k33M9M05P84n46j60L03m29k40
2603a45N2l57L77M04r97N31M63j350N79J75K67L95p85J075q45M43m56N67q4r22
2623f13J028k70j39l58K03r8L87jo49P40L17r15J66j1J084j516O70L40k70J88
2643B83M8k01l05m18P32j002P63M2l69rJ087q15j52O36n40l08R97j17j232J077
2663A97M2n57L4M92L0l7m61q0J27O18r47L70o1J48M06o92Q9L90j044P78N87o25
2685a96j52J88m33K95M13M6n31K75L90r75O08n2j86N06m6l14N27k35l47R2L3q
2707a02L78m77k10K24L19m77m04J092k34N19m09l30o8j27L03j40Q03p01k26J032
2727G65l82m6j44j60L2k66n55N03L37K90m33j13O44l21j64j29n7L41k63O20l74
$$ y = [182, -907, 265, -181, -26, -904, -429, -52, 635, -38, -386, -78, -311, -262, 143, 927, 381, 221, 524, 95, -145, -93, -450, -73, 331, -666, -135, 328, -1022, -443, -268, -1, 394, -391, 684, -161, 282, -174, 393, 309, -613, 415, 145, 6, -352, -149, -247, 140, 139, -510, 230, 547, -368, -202, -213, 871, -645, 25, 365, 95, 283, 331, 130, -175, -593, 139, -863, -100, -58, -427, -436, 651, -164, -316, 320, -220, -528, 469, 352, -880, 197, 239, -318, -284, 208, 238, 201, -260, -340, -213, 405, -542, -172, -233, -85, 321, -371, -282, 108, -936, -158, 429, -196, -348, -160, -593, -298, 115, 161, -370, -95, 295, -680, -72, -124, -310, 196, 150, -164, 363, 128, -219, -127, -94, -102, 276, -201, -411, -187, 132, -345, -749, 343, 109, 628, 219, -111, -179, -306, -3, -143, 660, -41, -267, 765, 383, 337, 193, 33, 65, -201, -756, -253, 84, 374, -59, -172, 472, 151, -13, -142, -199, 142, -121, 499, 125]
2748A25q73M93N50k02L56K76j070N6o1N78m76L16K83n2j22k65j59m05J018m27
2768f1l50J170p07L98M29j005j11O41j040O12L40n16j54L61k02j53o04R23P48
2787G19J10o70Ko1p9K62Mj6L29n27j067N19L45Q9O1J34j3L63r52K59J54o3o35
2810g33L15j78J002l73j97P7M25j79O00n29p54M1N25k99l7P13k69j03L08p71J42
2831b74J19M82M9l62o8l31P3J65k70l03Q64K11p46P34l11R1o68N50Q25j012l25
2852e07P61q9K7o9j07l55M95M82o99Q2n64R47n79K6m46N65j01N68q92L10K36n55
2874d64L82J66N8k89M4J43K02n57M61n79L58k29L13o23L97J36j08o63O40L66l96
2895b42J034j000M35m46N5K98n60L2R78j557J772j203J61m45Q20K07k68K53r02
$$ y = [125, -748, -255, 295, 93, 449, 725, -345, -289, -350, 228, -248, 68, 351, 299, 177, -88, -247, -652, 366, -61, -411, 759, 52, 450, 879, -126, -237, 404, -636, -24, 316, -200, -354, 7, -195, -348, -952, -29, 719, 829, 159, 161, 100, 21, 283, 287, 271, 600, 73, -994, -475, -130, -41, 20, 154, 141, 504, -448, -189, -35, -98, -733, -418, -596, 406, 33, -164, -87, 338, 159, 759, 230, -524, -483, 42, -257, -294, 419, 150, 47, 355, -416, -274, -155, 327, 376, 14, -54, -385, -312, -147, -417, -720, 144, 355, -391, 343, 32, 123, -545, 5, 830, -182, -507, 254, 165, 192, 123, 16, -339, 156, 638, -61, 21, -543, 404, -175, -149, -595, -30, -131, 437, -455, -145, 91, -464, -82, 84, 142, -147, -103, 40, 242, -315, 146, -433, -75, -304, 9, -614, -217, -81, -189, -852, -212, 154, -242, 792, -208, 227, -219, -164, 134, -426, -394, 584, -973, 799, -404, -243, -688, 132, 339, 71, 324, -578]
2914e78j46R19l67j86L33K22n49K32O34n73M46n11n3L98m02J9L44J42L59q50J66
2935aJ8m51N19o41N97l13O3j73P98N1m88N01n28R3K97m80M40n26kK4O88k97m76
2958b87j68L4J30M76m44J151p87K75Q3n31N35n62l62q8R07J16o81K94J23j84K76
2979C06p99J014j89m08k41M94J02q96M79M70J13r98N34N1j83J67l37L97J02r48
2999g70R46o31J63q3N47j50o93J442r41N26k31k98J65J93J33m32Q44p06j076J212
3019A60n60J395r97m30K72P61r6p27L29j66O79l77p83L06O20n69j23M66p93R60
3039C27o98O83o52N27q6j11j66K8k32J088p28l85J037o07J4M1L26m57K31J01l5
3060B46k75o30M92N38o12N44p16M90K93n56M15k89P75r64J75N87m14l92j41J89
$$ y = [-578, -724, 195, -172, -358, -25, 197, -352, -120, 514, -59, 387, -124, -177, 221, -181, -162, 182, 324, 683, -167, -1, 17, -434, 85, -556, 41, -272, -209, -382, 416, 467, -21, 480, -48, 45, 342, -138, 302, -224, -226, -202, 486, 189, -287, -455, -421, -291, 185, -259, 892, 105, 380, 463, -68, 467, -95, -457, -545, 362, 478, -203, 91, 214, 30, 306, -493, 521, 332, -76, -317, 177, 279, -617, -138, 332, 445, -553, -19, 32, -151, 16, -321, 76, 178, -770, 176, -455, -292, -375, 172, 22, -671, 771, -170, 356, 125, -173, -8, 185, 318, -114, 730, 24, -1052, 160, -400, 995, -2, -432, -160, 601, 505, -222, 107, -59, 620, 243, -540, -234, 386, -183, -306, 160, -633, 327, -371, 312, -340, 187, 101, -10, -176, -148, -380, 708, -20, -405, 632, 25, 39, 80, 406, -51, 180, 281, 246, -29, -659, -167, 371, -241, 303, -413, 77, 370, -186, 229, -60, 715, -249, -74, 513, 99, -293, -434, -245]
3080b45L10j96K13K21n43N35o48L19L98N3l68K8K2k58M43j126J723o39j118J467
3100E91m39M91r75m4L27n3J24M6m60Q21j48j009P84j30K74o45J37K65J62K40k05
3121A54L07q06O42j70k6j66J3K79j93m0m09K32qJ54r6M34p38L39L06k05J63k28
3143f2n5J21O12o49RR5n39L19n38l1J086o27L95k80L13L02M3m92J83j94o5m06
3165d60K92J79N22j003n8J06k68P29k51r3K08J74K4k82m82J188m44p07R24K91
3185E89n44j46J19p40N67n9m27K39N69J28o84N24m42R4k36R48L81j024k9K46N39
3206F12k17l48J32J93j071P45L80k38p36N99l97l35K23J27O27j47N1p20P93r29
3226f56J63N53J79k90l14N52n71J161j66p64J93KM7J52j20j69J39q34L82K77j78
$$ y = [-245, 65, -131, 82, 303, -240, 295, -353, -34, 364, 417, 49, 77, 99, -159, 284, -842, 881, 242, -876, 591, 152, 643, -332, -376, -49, -102, 22, 68, -392, 429, 281, -728, 56, -74, 200, -445, -308, -43, 119, 359, 154, 461, -345, 297, 127, 101, -65, -52, 227, 34, -6, -415, -183, -191, -37, -133, 301, -437, -98, 208, 3, 166, -62, -117, 4, 616, -33, -24, 71, -468, -149, -687, -718, 368, -259, 136, -144, 169, 471, 514, 22, 205, 11, -54, -460, -168, 11, 533, -470, -528, -422, -690, 39, -212, -305, -97, 77, 101, -181, -663, 525, 81, -626, 298, 589, 45, -101, 18, -722, -155, -214, -641, -402, 167, 295, -389, 135, -307, -213, -449, 499, 880, -144, -173, 73, 612, 395, 47, 179, 372, -699, 46, 426, 188, -548, 51, -346, -681, -458, -331, 296, 149, 200, -520, 273, -656, -493, 60, 239, -51, -365, 187, -384, 777, 611, -153, 40, 42, 89, 241, 121, -48, 91, -743, -361, -84, -262]
3247b62o3L78n4R8l2l0J54K32p13K96O0m80J113o51q32O92l60N19M02j175j03
3268h11R89l85N47j020L12M27k48P36j148O6J097p57j47L07P56m75j29M62j92
3287C87q44L96K92l07L91o89N49j77p4o8K95k74P71m22n34Q1q29J338k24j71P34
3308F21n77L16o11P8O5N12k71K71p17L66p5J71o32L8O04K63m96n06O52o85N45
3329f8k22j20R68j096N74Q18j189P45r21R37l52N52j065J92K1k10N63m44J00n5
3349b72O8n60N3J192p69q3L81n16k25M75p2m13L84N1M86r14Q69j36N7J4M33j465
3371i62P80L75j15n48Q56k79k42k77O12K09q54M87j42m63Q93j019j5M51K86n12
3391d79L18O27p62Q2L55J2j142J364r97J051m32J45j54k90K1l20r8k99J224o5
$$ y = [-262, -325, 53, -1, 97, 65, 35, 189, 421, -292, 4, 64, -416, 697, 46, -786, -94, -454, 65, 467, -708, -811, 178, -207, 340, -680, -368, 59, -189, 547, -601, -535, 562, -195, -342, -35, 721, 246, 117, 579, 387, -457, -61, 231, -76, 315, -374, 175, -2, -76, -144, 151, -123, 648, 226, -308, -227, -1056, 282, 58, -113, 621, 44, 360, -251, -173, -108, 404, 133, 404, -313, 53, -22, 149, -483, -445, 159, 422, -74, -580, 72, -613, -68, -290, -410, 558, -538, 36, 854, -335, 410, -511, 426, 74, 626, -439, -247, -226, -436, 127, -317, -217, -272, -204, -764, -711, 481, -288, -371, 10, -506, -731, -256, -328, -741, -357, -306, 180, -734, 135, -1, 56, 70, 503, -962, -182, 193, 78, -470, 386, 107, -135, -412, 200, 409, -445, 42, -100, -563, 330, -689, -704, -253, 33, -479, -161, 466, -296, -214, 141, 153, -989, 375, -622, 429, -3, 142, -12, -302, -281, -601, -699, -998, 226, 161]
3411A61p15O42l70L91j02K37k02k94P51r80J65K52L84p41M40l5J55k65N18o48
3431b56k11O33K8n17J58M27p78N69J59m48o7Po1r22Q78O13r1L33j26l76l42M01
3453A1N8m55O19k51r8j16J86J66L7K50j14j91l18p9O04k6J29o78N00M03J20o20
3475A37L22m40k8K22m61K68p33J486j249P89m77PO89m17J57l70J09K33n96N7j26
3496d21K97L9j61M7l62K12N80K79j130N59N81p64N04j03k56L19Q9j35l76P35J12
3517F45j12j75o04M31J57p34j67N37K26M0j43n81n03J573j352J631j549M66M1
3536a73k12N60k60O74l43L31q99N30j005R14n48M41n73N05q07L42M77l61K00k56
3556d63K90J75K89k01j28k13P29n34k89M91o47L71K85o16j51O72l15n9L44L24
$$ y = [161, -554, 88, -282, 109, 7, 244, 42, -252, 499, -481, -316, -64, 320, -421, 19, -16, 139, -126, 392, -256, -467, 166, 194, -323, -165, 262, -516, 53, 212, -236, -303, -296, -357, -1279, -401, 212, 121, 454, 328, -48, -390, 11, 69, -386, 233, -18, -116, -232, -46, 120, 157, 407, 293, 102, -216, -295, 309, 283, 412, -266, 234, 637, 757, 137, 459, 19, -9, 213, -248, 20, -713, 773, -476, 313, -164, -157, 532, 115, 272, -98, 11, 244, -352, -295, -421, -124, -85, -246, -199, -561, -349, 231, 510, -620, -61, 520, -244, 260, 157, -99, 220, 309, 174, -202, 533, 645, 533, 358, -246, 185, 342, -392, -559, -22, 204, 244, 101, -480, -983, 590, -762, 869, -680, -214, -173, -385, 175, -85, 589, 246, 577, -322, 208, -797, 117, -431, 10, -563, -58, -865, -523, -46, -407, -207, -463, -173, 2, 291, 90, -38, -251, 478, -56, -345, 146, -501, -130, 155, -461, -612, 60, -255, -314, 30, 354]
3576C54k05m21k85K91M22o00R35l0n6q81P49M29j06r82L30K37n63J6J88J300j048
3597G4n60R75o87j20l47L19K40N15k18N18j419R31l88J98l0j20L02q09Q96R3l04
3618E9k57P4L22j31l01M34m37N87K34n49L82j196Q04k11R99q66k97J34P05o16
3638a27j32J117p68J24o35M42K55O0J64q72J053q51L85j30j82j6J255j234l06
3657c98k65N63o89J114o56M96ok41R60o63n62K15L59m17J9j73P68K17j000K14
3677a45N40q77O54N0m96K3N48p52O6R67j054K57J17L26l75M4N21j053M20N64n45
3698b00K54j52P2J043j273M44R8o40N25O70j437O95N1m31J40p9O37K88j045P45
3718D05m2r9r1o31J56L95N1Q21o50p71P58m65j65J80M56j81l58J44o8K53k3n60
$$ y = [354, 149, -272, -557, -266, 156, -444, 491, 461, 405, -476, 273, 702, 596, -386, -56, 181, -382, -366, -178, 1122, 74, -486, 489, -198, -318, -665, -346, -106, 409, 191, 709, -710, 221, -167, 31, 1, -119, 183, -626, 270, 363, 59, -198, -124, 198, 67, -234, 200, -237, 350, 584, 35, 417, -779, 25, -186, 813, -53, -350, -216, 489, -127, -259, 858, 90, 214, -421, 21, 276, 336, 500, -372, 681, -170, 215, 85, -97, -113, 1142, -92, -398, -663, -100, -789, 325, -331, 165, 159, -82, 878, 215, -347, -132, 227, -190, -171, -344, 424, 641, -359, -145, 395, -482, 172, 222, -274, -251, 297, -455, -389, 578, -476, -219, -102, 224, -151, -107, 414, -639, -219, 345, -200, 54, -98, -26, 1017, -256, 188, 286, -354, 171, 841, -596, 99, 150, -281, -141, -220, 417, 705, -340, 405, 363, 264, 173, -458, -302, 93, 144, 965, 315, -456, 302, -163, -328, -148, 308, 127, -231, -87, -155, 98, 75, -485]
3740d85P4L72m01N62Nj51J41k11L29j065JR03j01p93Q41M13k15j65mo57L51m2
3762b98M68L65l39n05N86Q40j435J81J81K51L80q47J77K79m06n3L10O01j121J165
3782G80n65L04n35r1K51n74K87K10j56j60Q31j089P39J61o76O28m08J25K83l62
3802a7j26K02k0j0l54K25L52L12n76q9j64P80k29l84R3M51m78K52k51l00K61j46
3824b16N24l12K25L5N32l20m15M93l16l29K47J16p11K22R8J80k00k28L89N80p85
3845a91oM05P27r21j16L77J33j79k66P30j235M65J87k32P43j106K39N2M02p02
3865d94m5J73k2N67N28j246O42j85J89l1l56J073j276O98p40M72n79J087L87n94
3885B48m34m40Q18k93L94k24J31l26k6O43R7L13j026r56N10K70K25J05o6L01m97
$$ y = [-485, -411, -39, -440, 122, 127, -24, 117, -94, 235, -830, -829, 74, -27, -820, 21, 434, 219, 54, 50, -607, -256, -298, 170, 535, 196, -309, 277, 1117, -318, -137, 44, 295, 675, -172, 5, 284, -122, -175, 135, 736, -385, 780, 215, 519, -16, -107, 144, -430, -143, 67, -89, -249, 582, -507, 232, 393, -283, 345, -63, 62, 345, -17, -143, 59, 39, 29, -325, -100, 252, 564, -12, -101, -265, 515, 286, -98, -5, 446, -32, 220, -31, -331, -70, -216, 308, -4, 221, 256, 788, 468, 53, 546, 230, -99, 148, 264, -447, -225, -127, 53, -147, -375, 14, 594, -191, -197, 208, 935, 14, -102, 275, 408, 229, -37, 693, -542, -77, 110, -122, 621, -485, -246, -194, 208, -494, -539, -366, -388, 179, 707, -539, 103, -82, 107, 76, -280, 793, -483, 215, -525, -53, -632, 455, 842, 248, -186, -626, 192, -101, 293, 69, 200, -126, -152, 491, 588, 901, -125, -1081, -571, -301, -76, 29, -37, 264, -233]
3906b33j19J059o98P47p74k7k62L59K30k85k46l18M32q0j14m6N02j074O80o24
3926h91jJ086l24K86m86J95O51j312J042k31m20N42K92k48q96N48K62K13k88M6
3946F6K24N2o52Q94m39R4r62J012lk64J9j82M62L07m19j5k17M53p30M70M3m13
3968b00l61L50K82n17N85J14l9p31R08l21O6L8J06j80n23L74K76k74L22o26l66
3989g17M54K10L50p04K7M04n12J64k44R30p66N54r95J164p04L80L89k47m8n12
4009d23J045L15j322O35q0Q6k12L77n40L84k72o15J75Q20O0k89k75l98Q14k56
4029B9K60j00L04q39M42n29R34l44j6m52M29j74r3N73j004M83J96l26P55n51J54
4050A31K62L77l12m51M36p11L97J10k75L23o59R13n81K85m34K10j44J0J31j60
$$ y = [-233, -352, 707, 9, 756, -18, -45, -307, 52, 282, -3, -249, -567, -135, -215, -329, -375, 127, -947, -267, -891, -892, 194, -130, 156, -330, -135, 516, -796, 246, 15, -405, 137, 429, 181, -715, -167, 95, 308, 20, 66, 290, 342, -310, 584, 145, 239, -723, 289, 286, 22, 41, -141, 321, 628, 209, 194, -23, 430, -300, 170, 213, -200, -561, -211, 71, -446, 139, 253, 214, -517, 391, 70, 136, 174, 280, 100, -423, -49, 227, -47, 275, -351, -717, -263, -53, 297, -407, -380, 24, -488, -324, -568, 362, -404, 150, -845, 319, -385, -5, 384, 137, 89, -423, 622, 937, -385, 250, 170, 256, 44, 421, -119, 265, -7, -622, -447, 373, 433, 144, -131, -529, 285, 29, 289, 189, 493, -346, 96, -433, 501, 157, 141, -311, 118, -56, -149, 424, -580, -97, 99, -227, 528, -23, 131, 393, 770, 458, 7, 443, -268, 129, 239, -36, 287, -372, 541, -40, 245, -189, 21, -123, -113, 18, -142]
4070a42M54m09k33J54K98o8Q9q22J449l85J90K07p62K89o25N19m85J96p54P46
4090i4m2n3O56p34j13J25R06l22l46p00J284m42k57k4m63P93M46k69j026R21o99
4111d53M97m10L08J95L53o87L05m58Q19r6l61j8k43O18J25k03j207K44R48j61
4131A15j26L13k91N01m66L85l45m51N45j67N27k89K33l70j047J269n04J84k10
4150a94q7j06M18o70Q44k07l40J63M26k78l77O3L50J78n37O12L9m68l80j03M06
4171b48J66J72Rj51l87O46L80m58j87O60r30K4k51J231O9q01j33Q68j010Q02n15
4192d4L86j2n55L50K49l87k58P55l88q2L10q34J030o63R5L80m81l28L29Q16p52
4213h4L86p83J52J81K07o99P26k63K37l06o83Q06m5M61j35L0o23L35k65l1J513
$$ y = [-142, 312, -97, -330, -176, 122, 54, 143, -679, 770, 385, 575, 782, 20, 309, -316, 203, -282, -86, -840, -94, -136, -189, 467, -267, -380, -255, 651, 329, -17, -717, 567, 125, -132, -156, -619, 174, 620, 351, -675, 246, -453, 44, -366, -58, 137, 490, -197, 108, -350, 469, 373, 12, -6, -249, 369, 494, 291, -916, -672, 276, 115, -11, 302, 11, 512, 46, 431, 86, -365, 180, 13, 540, 251, 484, 114, -933, 336, -168, 16, -194, -281, -387, 31, -639, 205, -2, -342, -179, 247, -31, -408, -345, 5, 183, -354, 258, 297, -171, -551, -654, -248, -82, 90, 99, -52, -439, 207, 587, 129, -58, 602, -328, -304, -555, 676, 745, -56, -189, 679, -331, 471, -44, 342, 330, -225, 125, 374, -13, -271, 484, 96, 14, 324, -510, 520, -143, -48, 332, -149, -477, -148, 668, -84, 302, -481, -329, -148, 59, -640, 86, -177, 60, -246, -929, -123, -168, 293, 158, 188, -435, -100, -365, -396, 1117]
4234A117r29K00k96l60M63J85l64M20k11n39O76M46j176L16m35M54N22n58K18
4253A49l55M11P8o15n4m18O52k48l56j38M00L88j06J2k5n42O24N30j28n88N24
4274A95L22j068Q78l84o6N2N9n62M81M34Q31j157K92Lj81p5K93l04J90j13l54
4295b34p31R30m27M63m9q32J679j115L64J45J16j33k23R2k16R45j428O39LJ61
4315A49K37Q3j245k50J054L86j401J209n07M30j76k52J53l3M00K21m82q8j67N57
4335B78K78O9o95J54O0o87J55rL28qn51M99J98J61r20K43J32m34J170J31J63j293
4357e78J796j029r9k19L84L08m40k88R2k17m3L87j09j09l10L89J51l71J04l44
4377e45K19L96J67m87P24q80n24P77M61l92O28q46M48K21J78q15l22P47M37k22
$$ y = [1117, 188, 388, 92, -268, 195, 380, 16, 436, 225, -314, 362, 808, -368, -52, -487, -33, 489, -69, 149, -206, 205, 283, -332, -386, -804, -152, -400, -756, -894, -494, -106, -212, -200, -225, -767, -143, 387, 259, -329, 195, 517, -551, 327, -57, -123, -71, -12, -574, -93, 341, 1172, 15, 307, 310, 129, 54, 347, 43, 233, 120, -234, -965, -35, -462, 1, -48, -880, 799, -316, 48, 193, 309, 176, -47, 45, -171, 774, -654, -15, -12, 149, 386, 469, -776, -1026, 28, 414, -987, 222, -285, 145, -31, -283, -130, -163, 237, 458, -24, -112, -279, 278, 556, 625, -70, 84, 144, -543, -388, -397, -69, -77, -628, -129, 69, 230, -690, -447, -315, -749, 421, 552, 715, -578, 1218, 189, 90, -129, 255, 563, 123, -165, -73, -290, -333, 54, -55, -164, -474, -85, 66, -305, -201, -545, -326, 70, 237, -250, 474, -406, -930, -153, 308, -84, 544, -302, 146, 367, 545, -270, -592, 155, 592, 370]
4397C70k54m52N13n6p0M12n21l92O87l17K63K84p89Q86j73m11J40j245P99oLm4
4419c73M59PM43o47k89J027r42L27M24L2m39L63l23m19l59P88K13k60K16R9j228
4440h81J315j076O35K70m58K10J41J65m96N28r6p54k90J129O2k53K38j51J78l57
4460E9j11N38o22J64j30K94o74J56K43L42L2j60m58K93N3l70M34K64n85o93R43
4481A2l0P1j40K1k34L42l00N02k29k05j97L66j92O15m63N4j02R27m25k37m50P37
4503D43o24K13j043R69p29R00M25p87M34m23N56p98J461j272J39p85Q76J94K25
4522C74l83L09p72L48o6n1O48j026J67L89O13m73N49r29Km35J046Kj76q41P90
4543H5K11p6L21l35L7r0m96R65m61l30K44j82J8j02L63m27J87O84m02L0k19j74
$$ y = [370, 116, -336, 177, 121, 51, 463, -58, -450, 237, -80, 183, 467, -322, 564, 391, -20, 120, -1125, -326, -332, -329, -373, 86, 93, 536, -111, -400, 627, -315, 12, 436, 468, 29, 392, 69, -350, -709, 79, 292, 32, 248, 347, -881, 434, -642, -7, 263, -195, 15, 156, 321, -175, 353, 257, -497, -787, 342, 404, 151, 389, 238, 416, 59, -52, 486, -136, 28, -102, 192, -482, -326, -83, 259, 291, 131, -327, -34, 19, -351, 83, 347, -238, -931, 12, -18, 53, -87, -66, -300, 42, -258, 244, 15, -190, -387, -21, -213, 402, -61, -7, -109, 818, 393, 156, -294, 443, -181, 32, -1011, -42, -771, 129, 554, -233, 201, -222, 334, -464, 997, -275, -136, -921, -45, 149, 374, -9, 300, -472, -124, -190, -241, 407, -619, -452, -63, 550, 77, 626, -303, -301, -736, 310, 312, 136, -705, 85, 296, 220, 541, 206, 243, 153, -343, 622, 161, -169, 75, -107, -89, -191, 172, -255, -68, 616, 214, 244, 25, -149]
4565a49L17n63J161q52MR23m30m30JL50m63N13K74j016K51l09N94n59M76k37L02
4586A58j18J38L61p64M04p80O68m12N78p05P50n14j56O19J16J09o07jM08k21J65
4607A96p2p36J209p65M65k2p1l74o6L08M27n59j13M20L17q79M16k90L57m11M03
4628A60K02m66o24J84M90j05l23O32P4m2l23L88o12J25J17j15K80o8K89L47q99
4649b89M86k89q8j41m50P76J131j669M17m93O99K67k34N83q63J91K74n6q72R74
4669C54o24N54o5K67j145J088n19k11M97n78O9K36N68k64r46N47K94l67M13Q0
4689B48m85J68m25K36Q8M82l62o33O59j72L9O44p17N06N0q77K17M14Kj83l41J187
4711G45l98o00Q49n62n17J628m37j132Q53k02R3j91L36K28j188L74m75J423j014
$$ y = [-149, 168, -395, 766, -86, -82, 841, 411, -19, -18, 332, -131, 382, 656, -360, -109, -418, 176, -383, 93, -144, 158, 40, 178, 539, -225, 179, -601, 67, -345, 233, -472, 278, -236, -392, 227, 343, 452, -155, -156, 252, 31, 196, 124, -612, 597, -168, 297, 275, 204, -170, -236, 72, 499, -60, -173, 247, 564, -315, 101, -189, 168, -243, 160, 362, -104, -728, -544, -54, -159, -482, 150, 224, 182, -141, 247, -365, -240, -123, -238, 42, -26, 263, 610, -289, 197, -92, -180, -321, -771, 5, 1136, -533, -116, -609, 90, 357, 123, 706, -157, 34, 308, 252, -620, 354, -270, 284, 219, 486, -659, 429, -90, -301, 196, -382, -313, -77, 491, 227, -719, -172, 122, -245, 168, 248, -237, -69, -494, -258, -170, 312, -50, -683, -24, -196, -157, 487, -230, 276, 326, -551, -334, 80, 82, -101, -442, 745, 347, -253, 596, 34, -483, 1145, 708, -424, 429, 227, 320, 129, 465, 693, -495, -121, -596, 827, -187]
4730a87R3O34j20k57J91j78j7n1j18j83k36P60n45J54J76r4M56P2p27k10N14k2
4752A05j52j47M72q41Q04l04O0R9K6o83k06R97l79M3J56J15k49q8M6m1K38l77
4774c06L67l15pN46q90N71j92j44J27N57L95o02l14R3L30m52R89j064N7K21j08
4795a41J30k81K00N92p68k26l79R42K96K04l49r8j4Q47l20p86L16n70P02K56m17
4816A36k03J71j38K02n0K16m98O10o96L04l13J8k42L97K50q1k44j16L83k30L80
4837B56m53k5K70K82J73r03P67q34J74K37J47M9J34l39k89L59J84N67r52J38O6
4858Hq4J6rJ003j58r76k09j29O28j27oL48l32n0p07J001p50J001q14m2J40M95
4880B47o49P67J70j162J086j24k57O64r05M30o89L90M77l68j123J324l85l48Q40
$$ y = [-187, -94, 540, 420, 163, 354, 176, 159, 108, -10, -193, -429, 331, -214, -60, 116, 22, 478, 550, -177, -387, 127, 105, -47, -194, 278, -563, 241, -63, -3, 96, 122, -561, -767, 230, -149, -106, 50, 165, -84, -172, -126, -167, 71, -306, 61, -254, -261, 285, -605, -34, -226, -370, -243, 314, 709, 107, -207, -114, 216, -236, 753, -311, -254, -33, -141, -11, -292, -92, 500, -268, -494, -873, 69, 365, 569, 220, 122, 108, 955, 635, -151, 165, -405, 297, 553, 136, -67, 104, -34, 168, 118, 334, -164, 446, -250, 54, -259, -241, -483, -86, 164, 83, -161, -277, 106, -124, 256, -197, -222, 48, 330, 503, -400, 367, -467, -293, -56, 91, 140, 274, -65, -354, 5, 189, 756, -196, -58, 8, -76, -60, -69, 934, 776, -200, -409, -538, 90, -37, -43, 305, -27, -77, -784, 217, -533, 468, -346, -388, -248, 247, -402, 365, 535, -627, 459, 335, 78, 742, -163, 267, -422, -32, 445, 77, -1046, 278, -107, -455, 385]
4899C85n35P19k15m03Q20o43j46o5j38L82L03N59l80l43k67K68M8M70l11o18O6
4920d4j85N27m82j93L30m41J12l65O11j25L0L16K77o32N65L72n24M4l78K6k12
4941c71k20J372j184O46m20j57k44K58J12j74N7J185p01p55M76P5j9j10J69N83
4961E78r87L92j67p49J330p57N80o23N39j77O10m21r15K59J008j2r20N46k16M69
4981C67l5m01Kn31R29n5n77K8Q22p43O6N20n60K11P10q4q20L02J147r82j99K48
5003C65q02R10j01k46m32N79j149P66j49M67r4j24k06k52R2J98L52L4m59qk21
5024d80O32m75l1k17P56l59L24M86q31J62p20K66J117n95L45p55M24L66J7n70
5044a38M41n13n05M37K90p34Q76M3j73l82J69j95M53M46n57k33P39m35l38M37
$$ y = [385, -150, 569, 354, -49, 771, 128, -18, -83, -221, 161, 464, 1023, 643, 300, 33, 301, 349, 819, 508, -110, -44, -229, 298, -184, -377, -47, -488, -376, -741, -130, -255, -225, 91, 368, -264, 301, 673, 149, 193, -185, -159, -371, -591, 781, -403, 243, -177, -334, -578, -320, -208, -382, -325, 860, 159, -596, -120, -45, -64, -174, -5, 578, -409, -17, -184, -933, 397, -360, 220, -403, 136, -41, 569, 148, -767, -508, 500, 488, -432, 114, -102, 367, 332, -69, -67, -598, 331, 276, -301, -273, 549, -194, -128, 392, -168, 43, 753, 669, -151, 151, 1298, 316, 117, 365, -437, 473, 372, 126, -306, 273, -876, -110, -259, 208, 114, -10, -216, -468, -376, -178, 174, 208, -251, -259, -480, 152, -323, -354, -571, 185, -174, 150, 636, -195, -33, -753, -487, 630, 35, 380, -375, 49, 415, 432, -138, 303, -210, -715, -278, 12, -722, 154, 197, 24, -358, -189, -384, 69, 515, -42, -275, 464, 29, -309, 128]
5064A28j36m68P83j09k80j3l88O64p23Q75m28n33R6Q32k15j38q5j12L26J37r81
5085g68N74K13j21K83r22O45n95M79j42O4M6L82L1o31l63R59j61j02L83j205R62
5106A1l98J166j258N30J09Kj25J0m1q9J0k30M55Q5k97L23r36R57k75L84p99M57
5128E1n49M48l39J37J80pn71O64Q3p3n57n26J017K3O43q18Q16q63N96o49J35l56
5150e15M71p09M05M7m11P70l74L68M14L45j094R0q5O05l47l11k54O13p04N39J50
5171A3k32P05m3j58m37j22n39J776p84J86r04N71L00l55K75n43M61P0M7K55m61
5192H1L7L37m13R47j344P86r9j152Q46lK70j96o0J29j06N96q01k31O88m45m6j78
5214c57Q88J28o93Q3j007R96n30J030J66p50o8K26l50J28j4L06m56o92J222k47
$$ y = [128, -8, -476, 307, 198, -82, -95, -483, 181, -542, 333, -95, -628, -532, 300, 85, -53, -138, -250, 76, 213, -768, -194, 19, -102, 181, -741, -96, -691, -212, -354, -290, -244, 138, 169, -462, -825, 134, -27, -129, 254, -951, 11, -387, 779, -479, 51, 160, 162, 37, 47, 6, -83, -73, -303, 152, 237, -60, 263, -673, 284, 9, 393, -406, 51, -498, -50, -389, -252, -72, -79, -650, 14, 97, 24, -533, -1059, -42, -19, 624, -194, 622, -241, 355, -294, -159, -515, -44, -753, -348, -301, -712, 58, -316, 52, 466, 811, -283, -193, -278, 327, -20, -331, -585, 28, -676, -137, 13, -219, 486, 443, 285, -152, -274, -813, 963, 179, 365, -539, 32, 332, -23, 252, -291, 170, 240, 287, 542, 81, 118, 455, 42, 989, -355, 431, 332, -820, 26, 23, 293, 97, 37, 166, 60, 656, -145, -376, 312, -133, -179, -357, 531, 659, -34, 49, -958, 38, -492, 538, 704, -46, -114, 112, -238, -110, -124, 182, -274, -966, 256, 9]
5234IK27o57Q73mj22l55J82m8J43N98l87o39K52O32j002l3L59k88K99j63J89J69
5256B34m28L02n8m24K6L35n4L46m55N21n48J08l68k00M14L78J8l70J51j26P78
5277E80j037R58o97j35R47r72L59m2m71P59L45j069N15k74N08K37o63l49R13J9
5297D31o77J197j275M40r8p0j85R52m89o97J95k27N7N55k03n11O69N71q86J8k19
5318d52N97n84Q31j71k29K86j70l60q32J168m82J44l16R61q7o98N52k76l6L47
5338A93p09J19O52j41J50n90N21q5mk00O0k17M57J98n71M1j24N79m04l93O21o6
5360H7J81m86m92L45O26o52P10m51j95r40J079J93J04j8l99M77k96J56j17J29
5380D1l75j33M36l55L16N5j8K23k69N25r28N83j68j84P13l01RK80O4q98M70j85
$$ y = [9, 236, -421, 452, 448, 326, -29, 153, 105, 248, 846, 459, -180, 72, 704, -298, -331, 28, -260, 39, -124, 65, 234, -194, 108, 50, -374, -348, -13, -67, 279, -176, 345, -203, -95, -463, -663, -249, 129, 147, -223, -72, -198, 580, -457, 501, -196, -331, 616, -356, 3, -39, -510, 249, 594, -475, 40, -234, 274, 511, -152, -501, 412, 431, -246, 951, -324, 116, 18, -52, -237, 715, 226, -471, -276, -503, -446, 109, -94, -605, 64, 635, -251, -233, -452, 145, -439, 392, 221, -8, 278, 108, -252, -1084, 84, -398, -254, -570, 391, 304, -394, 158, -118, -154, 193, -516, -397, 255, 114, 264, -326, 195, 110, 106, -94, -34, -251, 206, 404, -167, -126, -250, 329, -75, -468, 153, 87, 268, -218, -710, -365, 261, -391, 319, -132, -327, -1267, -188, 5, 109, 91, -308, 169, -127, 29, -88, 41, -334, -467, -31, -386, -70, -15, -33, 190, -79, 446, -482, 101, -67, -251, 462, 161, 170, 450, 514, -384, 86, -99]
5402i9J26j81O82l64k46L96q46L82N36p42k07o9K42P72q57M42j87m42L2Q23o45
5423d52L08M47l00K30n31R04l37o4m15Q09q03L73j65Q5Q3l77J67j69J112p23n63
5444c81L85J55J40l69J23N7j54q0K40l98K4K92l71l60P00q43O58K88n97O85p1
5465A23p5l39P64j85J45q42N63q70L84k11K28P78l20q9Q3J7J38n07O61j97m03
5486a54j97L31J99J6L35n81O16j654L69N38N07J3j45L49N8q68J47j17K79M80p61
5507b40P63l34o1o3j17N7K37O9l00P6j30J9J223j291O66l4j094O00m61k60L85
5528b90O88p68J37q3J78R6o24L72k63O66J25p16M83j67p6O75n03k99J051o01Q2
5549A63m22O06q96Q2J154o64q19P43k78R7L03l17m70J215m22O3m74L86n00M15
$$ y = [-99, 27, -154, 528, 164, -82, 314, -532, -150, 386, -356, -563, -632, -390, 382, -475, -33, -220, -662, -630, 193, -452, -144, 303, 3, 233, -298, 606, 269, 205, -210, 599, -204, 169, 4, 89, 172, -205, -38, -207, 905, 182, -381, 4, 159, 299, -70, 53, 110, -44, -124, 116, -282, -258, 34, -337, -697, 3, -840, -182, 106, -491, 194, 123, 48, -291, 473, 288, 433, -409, 154, -716, -332, -543, -315, 463, 143, 54, 137, 154, 292, -215, 446, 249, -154, -351, -20, 179, 195, 530, -51, 565, -1089, -720, -182, 325, 338, 193, 542, 600, -268, -121, -238, 41, 521, -240, 523, 189, 128, 65, -52, 5, 242, 311, 11, 87, -43, -24, 1199, -92, 574, 540, -554, 46, -415, -675, -290, 398, -370, -233, -316, -138, -42, -666, -294, -557, 109, 234, -482, 1, -166, -242, 433, -70, -369, 682, 81, 163, -259, 347, -549, -467, 687, 23, -796, -53, -331, -234, 69, -248, -718, 497, 75, 138, -336, 50, -450, -35]
5569c5J7m60L87RM57n59L66m10M47j90q43J418q86K14K90l9m13O0K61p28O62J02
5591A27J22j72Lj20K45j38J121j305K19M71n87J88j37K66o08k76L86k78L15M10
5611B52m14N49q04Q62o36L7n0l24R2M23l17Q88l1o15k23R98m87mo7j57N32k24
5633B80o7L09l47J30k25j29L92o06M19O56p10N47j208N4O29k88M59j56k25j90
5653b76J64N58m90O18q63J118n63q72Q55k23K56k33N4L4k88l47O85j32M00p62
5673c07L19k53J36o9M08j32L87l64m16N4M92p99K14J50M53m35l5J65K25m94j56
5694d57R32o29P31m22m32l3Rj87N48K43K11l31n60j3J613p70o70K83j98O01j473
5715a004O29k47O65l82P63k15o8q99P34J14k27o7j30Q62j66n6k89m80r3K86L00
$$ y = [-35, -18, -478, -91, -82, 375, -184, 182, -228, 219, 29, -814, 604, -282, -68, 222, 183, -230, -170, 91, -637, 25, 127, 249, 77, 80, -40, 205, 67, 1188, -117, 102, 573, -14, 174, 37, 303, -305, -581, -195, -473, -158, 252, -162, 387, -417, 445, -191, -154, -204, -528, -436, -13, -330, 558, 527, -88, -311, 687, 200, 196, 129, -28, 504, 280, 213, 522, 175, 305, 80, -49, 343, -263, 156, 812, 102, 649, -559, -505, 124, -164, 295, 139, -86, -276, -112, 446, -44, 574, -289, 829, 266, -606, 249, 26, 282, 49, 103, 137, -151, -498, 187, 55, 455, -307, 12, -241, -105, -174, 234, 102, 489, 125, -291, -237, 255, -544, -330, -180, 273, -162, -197, -32, 193, -301, -457, 475, -154, 577, 155, -277, -310, -301, -488, 60, 303, 514, 183, -377, -390, 1223, 453, -217, 66, -132, 469, -1004, -375, -622, 43, -339, 424, 209, 141, -758, -24, 90, -137, -204, -334, 528, 362, 306, 17, -463, -556, -270, 30]
5736C0l65K47o7j06M87l38k53k14L38J08K56j00N94o30L72K86q61l7J012r46m07
5757e94O66k72M43k15k63J33q95J686k91L3n31O27J06m51J55J47j077L67L51l82
5777b57k35P11j8j12o6O84p29n3m35M81J09j93P60o8p15k06L37J50m17O70l07
5798I1q70J092o28N76q25Q95o16M59Q8q07M17n8r7J96O17p73j49M66l95L84l02
5819b39O91j259J316m80l2o6n54N48L32n53P44j059J253n73p1j75m90O18r14J044
5839H1M01m02K33M18j24r72J62k94K74J9L67O01j030p4Q74M04j250Q6k1L30N8
5860A41n42R14p90J59j54r2P52n79L85j69%j07J74k45L94l3m19M28M70m98M42
5881F31l64J51j63n22M30m43O00l0M5p41K43N57j91r6l07N2n61J147m8n85M56
$$ y = [30, -335, -88, -155, -261, 226, -112, -365, -579, -241, -133, 123, 23, 617, -13, 359, 645, -216, -253, 759, -187, -594, 72, -200, 243, 28, -235, -102, -997, 689, 398, 431, -100, 527, 633, 182, 337, 484, -593, -226, 125, -257, -492, 219, 201, 89, 23, 707, -22, -75, -510, -29, 80, -113, 647, 579, -136, -342, -5, 145, -272, 398, 91, -779, 313, -315, 261, -564, 331, -285, 174, 262, -545, -128, -186, -283, -87, 530, -243, -392, 74, -321, 63, -239, 452, -807, 509, 29, -3, -69, -623, -75, 257, -296, 448, -611, 642, 69, -2, -177, -667, -49, -963, 81, 482, 80, 313, 731, 607, -365, -203, -497, -223, -204, 163, 764, -266, -340, 534, 938, -312, -226, -247, 83, 141, -401, 513, -277, -118, -272, -364, 388, -191, 194, 25, 25, -82, 92, -153, 241, 208, -211, 217, 687, 189, 631, 267, 418, 255, -267, 163, -280, 320, 290, 335, -406, -163, 394, 203, 107, -200, -148, -709, 438, 390, -195, 261]
5902B61l46j0M10k10n54Q98o05k67J73K97P2j60J47n66O37l40l63M71K6r8J51
5923B4J79J45m92P3k90l91L09L42P8K79l88o5L59k77O38j282J088J45j068N08
5943h6j75J73q0j7L45o30O64j68k66k21L78M31m63n76R34m11M01n67K85j7k19
5964b85P55k71l42K64l02K46l42L02r94J179m78O24J1o83K22J51Pj9k85N81L62
5985G03o9q24J33O61o15R30J51p51k89K06m39P99q42N1L04Q70j554N50j63j06
6005b94j3k00MM8M34r6j03l76j87P94P15Rp89L06k11k03K58k08J39l82M34M75
6027E54j05j097P77P0l6j49K7m31P31J07p35M94M5K01l88O8m05O14K55n60o8j04
6049a35K15N33j546N10n2O93j02q47K47Q96k05j01J89m05J67O3J83r43K8Q61k38
$$ y = [261, -85, -95, 315, 105, -449, 449, -156, -423, -250, 47, 119, -41, 106, -460, 177, -163, -526, -55, -29, -127, 24, 203, 348, -144, -71, -361, -752, -443, -101, -23, 256, -132, -197, 162, -115, 523, -759, 329, 474, -594, -86, -261, -88, -168, -185, 160, -470, 194, 26, -240, -461, -83, 348, -115, -691, 243, -168, 233, -334, -49, -66, -285, 470, 199, -143, 121, -181, 65, -277, 25, -969, 210, -268, 356, 367, -316, -94, 57, 64, 45, -240, 341, 703, 634, -190, -57, 604, -11, 919, 1070, 319, 30, 236, -203, 596, -246, -195, 109, 979, -575, -25, -188, -294, -307, -507, -503, -455, -21, -117, -220, -596, -783, 11, 726, 735, -54, 252, 41, -162, 96, -112, 27, -355, 79, 554, 449, -648, 129, 199, 163, 14, 41, -390, 341, 448, -287, 207, 252, 453, 65, 133, -272, 342, 597, 37, -31, -135, 80, 613, -933, -423, -475, 218, 116, -731, -484, 412, 207, 106, 295, -110, 57, 120, 303, -640, -612, 249, 11]
6070A1K10q79R23m85K09l13M04j54Om5m7P63n72n76N92p8N45r5l98m87O5M64L67
6093D30l2j21k33N0m30J40k1l0Q44p57L25n84O2Q05p12P0j65P31m00k93O00k86
6115gM17o02Q18j230m7J156p43j27K63M43r5m72J17J32J12N2M22j49k98j38o4
6136d0P02p49k6K61k25M34l93j57M6O47o66O00p54n16J239J81m77n70L68m95M11
6157a79j97M04M1L24q6o60O02L0k18Q11k49j051J86L37J9j71j79K61l54J07j37
6178c59R29n75j36N88q45P56L93o30m46J74K07O02o32l97M72q32J325o29K72J04
6198C41o65Q41m28j95n20J84K69J165r04l89l25J012n98O01kk36q0J16j97l14
6218c24K86L63m79P7k27N03O49p78M03n86L18n85M45J33m3l02M39P3o5k36O4k64
$$ y = [11, 221, -658, 265, -220, -11, -324, 80, -74, -68, -113, -160, 603, 31, -545, 47, -31, 514, 419, 21, -466, -401, 63, 430, 398, 277, 44, 94, -336, -196, -217, -247, 597, -160, 165, -419, -357, 448, -264, -194, -359, 372, -28, -321, 279, -7, 410, -192, 626, -604, -651, 505, -238, -365, -102, 341, 246, -226, -109, 23, 135, 187, 609, 460, 162, 24, -40, 662, -87, -113, 148, -77, 357, -36, -193, -147, 500, -166, 434, -320, -836, 403, 584, 107, -463, -95, -590, -179, -376, 28, 69, 393, 307, -353, 249, 279, 61, 872, 623, -428, -242, 95, 114, -57, -236, 25, -329, -222, -359, 570, -5, -141, 447, -398, 358, 751, 121, -325, -151, 56, 658, 26, -371, 101, -731, 594, -35, 237, 341, -324, 517, 89, -106, -626, -442, -173, 992, 88, -301, -626, 386, -212, 389, 387, 151, 71, 187, -10, -324, -38, 325, -154, -77, -304, 199, 848, 70, 473, -113, 205, -380, 65, 198, 155, -147, 292, 365, 300, 64, 128, -136]
6240a36M87K2p84M48N74o24j02J25K1J03L26r76K66M27m29k39Q89o02M22k31K28
6261B15m74K56o18K18J87m06J434r41Q32q85l2N26n23K72j69N5p6l37m38N52j22
6282d74N17j37k34j12P51m31L39l63n22N73J45J17N5o39R21k83J81J29J86n28
6302A91Q31j413L39N02n19P8R5o50R21k12k76o9L0j59J04M59o32O87r1m68P66
6323E14q44M88M47j542M73J72K44M0N6l57P14n50O52n4p16L69j23M31n77o97N26
6344c34P91o03L53o32L56k36j33L53j49M13j5Q36p94j62o70M57K55J10K46n80
6364a38j34J90L5k91K23J172j273O18O01j079J08K27o87M46O27k53j39k23j00
6383g0q2p63O79K75K51k29J39K19J43r27l04O29J24K33p07K68J31O3j59M23L2
$$ y = [-136, 351, 373, -411, 37, 611, -13, -115, 10, 31, 134, 460, -516, -250, 177, -252, -491, 398, -204, 218, -13, 215, -259, -3, -621, -403, -216, -622, 812, -129, 703, -182, -214, 312, -211, 61, -108, -53, -129, -466, -904, -352, -474, 43, -94, -328, -440, 311, -120, 219, -144, -666, -93, 52, 169, 224, -415, 506, 223, 404, 533, 719, 191, 1022, -391, -52, 450, -69, 9, 104, -546, 375, 163, -113, -182, -152, -311, -207, 252, -380, 307, 216, -252, 514, -330, 158, 605, -937, -464, -292, -48, -8, 48, -309, 405, -145, 507, 453, -263, 106, -17, 414, -163, -860, -334, 457, -146, 207, -425, -69, -305, -438, -85, -234, 179, 164, 1000, 206, 44, -626, -169, 86, 196, 442, -138, -272, -82, -47, -338, -115, 1057, -216, 402, 1003, -76, 32, 259, -428, 18, 645, 392, 253, 30, -70, -152, -915, -236, 39, 290, 61, 200, 419, 562, -365, -669, -40, 84, 317, -390, -122, 9, 72, -87, 336, 368]
6404C68r73Q44l89Q72r38j49L74o18L01M86j78l21P29m51k24J86J5l42J64r2M92
6425A56o95j28Q93k99J76j63K22j5l85J85K79p6r93J251k35j29j36M45m77l83
6445e07P3j40P65R64r81L68q89K1L49l41J38Q24r16J162j210k94J194m91j96Q85
6465G78q19j56n6N32o30K87M13n69Q90r35K99K84k51q8j57j40k22Q21K86j206
6485f39P61K2j2j23m64O34K9J61j99J111j160n46k04L89J9l1N56k66L26q42k37
6506g15P64J35q00J102o7n04j01L12j97L49p89M74J22j82K28L47k32p07P09o52
6526d04K96l07J84P9p01Q86N8k31J65j75K75K39o89K29L8j95M72k23o7Q60j627
6547h38Q98j86n47P17P98m20o87K88L90m07j53P52q08Q44q56r7O80j84j84J49
$$ y = [368, -605, 239, -150, 722, -216, -365, 9, -609, -308, 178, 0, -321, 408, -43, -267, -81, -66, -408, -244, -336, 156, -539, -667, 226, -73, 103, -60, 162, 147, -238, -53, 226, 150, -843, 408, 173, 44, -92, 353, -124, -507, -434, -574, 191, 1155, 174, 542, -347, -326, 23, -318, -180, 644, -272, 890, -320, -614, 580, 89, -107, 778, -41, -197, -253, 279, -351, -64, 349, -220, 670, -265, 34, 318, 67, -21, -178, -318, -540, 281, 567, -639, 122, 144, 132, 9, -455, 179, 208, 369, 170, 1281, 121, -425, -629, -240, -221, -252, 304, 38, 364, -478, -715, 49, 184, -616, 486, 419, -85, -186, 126, -71, 278, -511, -37, 85, -97, 131, 478, 246, -461, 248, -404, -108, -415, -231, -152, -853, 33, 91, -140, 25, -150, 125, 364, -325, -96, -58, -253, 219, -4, -71, 789, -838, 60, -126, -673, 44, 842, 422, -265, 23, 413, 6, -147, 605, -203, 641, -215, -312, 368, 184, 0, 149]
6567A49n60O62m26q8j68O39j61J79j10K52m23L69o7J94q18O17k3K69k90l07K01
6588I0l58j05K73M6M8L53m52L66o82n79P44P89j21m67l21K8L31k77L55K56k09
6609A08o96N39L67q68mM56K66%j23K97o22l79J002n90K66q64J388m88p98R13q72
6630g02J080p53J69Pj47K25L49l87o30R60J79k47P2m74N69m49L25k6j09n08L82
6651a15Q1K41n24L35R37r02n26M83N52n51J4j67n83K93N97l9P89j197L6pL91n08
6673c70l48M61J28o30N67Q21q79P29k21K45R1l8o19L86m29K99O06n63n77N29J31
6694C19j066J499n48q66K94k99M74R18o74O2Q5J68J44n87p3J99o1M50n22O20j262
6715g26L97O8M84p41%P95N90q92j27P1O23q50r80J542k45M76p28L84n62Q60o60
$$ y = [149, -411, 251, -175, -263, -431, 208, 47, 226, 116, 368, -55, 314, 247, 441, -377, 240, 217, 486, 196, -111, 90, -268, -373, -100, -54, -6, 347, -105, 261, -421, -1000, -256, 533, 412, -55, -376, -348, -17, -294, 61, 317, 108, -588, -49, 318, -550, -554, -98, 168, 168, 45, 342, -280, -659, 343, -247, 19, -845, 543, 55, -743, 170, -702, 378, -375, -206, -199, -346, -121, 228, -159, -789, 171, 350, 103, 175, -299, 270, -179, 146, 120, 11, -497, -115, -34, 207, -317, 18, 955, 53, -473, 10, 562, 11, 25, -142, -725, -432, 165, 126, 915, -282, -246, -253, 138, -370, -718, -257, -129, -759, -192, 629, -250, 479, 258, 503, 594, 556, -63, 323, -106, 193, 799, 236, -341, 188, 319, -747, 752, 204, -662, -368, -667, -193, 725, 51, 113, 198, 366, 510, -77, -150, 49, -12, 438, -84, 536, -726, -329, -261, 223, -518, -518, 277, 867, -25, -152, -81, 542, -308, -1288, 254, 9, 485, -243, 141, -421, 439, -221]
6736b21j40P93l47k41q1l05P55m04m1j42K78M61k94M01n86L05m18R74j549R24
6756A22J82o10N21j98j07L62k83k02J72j39k46M52j45OL21K39o39L30K28n06k55
6777c95N65Jj123m1P31P71o44M71p8m9j79r0R6M25o82J66j88l57J281n23j35o25
6799f02P00n8l99J284r35r1K71l7J10K47L00o74K64k82j11O07r46N70l88l47L38
6820a79P1q99O39J234j122n85J386kj84k54n63J126l69o06Q51J92r37J78K33J013
6840A223r37k41M80q65L67M00o4j46L01q37O3l01M9J80K0j40K1M2R41n20m3J80
6862A73j23j71k32R63N5k41n57N17j025O64m29Q57Qj72M16p87J93p9r9j69l88
6883f26P28J39o54P2L3O76K4M67r58l01N80j59l3p30J97O78M3l48R68j23j037
$$ y = [-221, -361, 432, 85, -156, -237, -542, 213, -191, -232, -374, -96, 365, 71, 472, -114, 191, -227, 747, -802, 122, 304, -306, 215, 17, -90, 272, -11, -213, -41, -180, -426, 26, -119, -113, 208, 447, -192, 138, 366, -140, -395, 170, 171, -952, -993, -262, 509, -135, 336, 258, 209, 30, -60, 36, 461, -221, -55, -243, -600, 681, 158, 23, -602, 98, 40, -359, 925, -10, -101, 170, 133, 243, 490, 790, 116, 380, 98, -13, 594, -352, 218, -170, -517, -179, -108, -1007, -368, 866, -256, -841, 545, 543, 359, 105, -458, 668, 299, -307, 544, 736, -201, -23, 210, 1223, 286, 45, 525, -340, 27, 427, 363, 217, 518, -319, -256, -557, -508, -328, -308, -448, -427, -385, 556, 36, -7, 173, 50, -121, -353, 610, 665, 424, -133, 384, -641, 23, -406, 451, 459, 287, 703, -84, 109, 30, -69, -238, -626, 102, 241, -413, -341, -308, 368, 392, 859, -99, -400, 180, 21, -12, -742, -545, 133, 176, -172, 796, 673, -364]
6904c64L15k7K71J54l75O03j237J057m05n9J82J7kl95Q2L84j75M94r49j46J020
6925D45l36R1m79L60j18J68J08k96M2K29j30Q8l22K96k08p2L69n35J93j23j25
6946c55O0M81j188Q90M24o97m24Q12L48o42P75m53p9l97J039l17n22N71m42j63
6966b79%O68j026N75J44N3J27n99N36m76l45J062n45MN0M96m31m4l64J71n4M44
6988A67l61J84m0O62j13l97q8j33J162j187J40J52M59p65n61J138n67j43K06J10
7008B5J43N6k91M69J84q89Q1N58R6p23K55O55q30N38N40o98q5j7l15O9m94M17
7030b56l68N96Q6O89l85l70j35P30n89m72P74J34m92l30P09r36j23N40L12m51
7050c37J85O29m59M49q47K86J25m80L75L52o17N74L41l53J028j455N32m57N38
$$ y = [-364, -49, -76, 195, 349, -26, 577, -660, 397, -8, -67, 115, 132, 130, -265, -183, 201, 26, 520, -429, -575, 445, 109, 200, -279, 81, -37, 131, 239, -57, -15, 214, 84, 172, -150, 146, -62, -134, 235, -300, -107, -230, -355, -295, 186, -1002, -112, 312, -385, -809, 3, 351, -291, 484, 31, -48, -445, 594, 277, -245, 326, -116, -279, -279, 389, -637, -62, 82, 135, 262, -337, 199, -277, -622, 440, -105, -101, -51, 445, 14, -30, -394, -223, -277, 167, -194, -10, -50, 612, 499, 102, 14, -119, 1043, -144, -4, 148, 607, -158, -719, 419, -148, -291, -85, 25, 168, 224, -67, 402, 586, -303, -222, 336, 432, -291, -36, 619, -211, 327, 867, 169, 84, 67, -248, -179, -673, -256, -624, -28, 58, 747, 362, -8, -143, 587, -2, -474, 300, 434, -58, -388, 321, -615, -738, -198, 114, -337, -152, 477, 18, 467, -380, -94, 31, -449, -74, 278, -339, 235, 576, 223, 1251, -204, 328, -129, 409]
7069D09q23K21M24J65j74l77k44J081j300J64Q5J262q08J6J04n16J9K85k16M22
7089A99k77L26n89L47m05K44k20N33o47O86k06L6j17j84N25m09Lj2q0Q5J78O49
7111F65n03o11R31q67j1N84J88r79L67R63p70M50p71J052p86j48l82O14l2O06
7131E60n2o61j10q8L68k80J81J77K58J01m57n63Q57J14l05n56k0J76J94J00K75
7152B69k11O1o75N28L83j99N00r62K47M90l00J71l05R3n53M03L09L83j672R80
7172f0M72q09M22M20n54m4Q35n27M02l38p32M41n82J357l46q55O9M28Q30l24m62
7193D3l33k12M28M05r45J112k37l16P4k56n4K28L86n94K75M92P0n57n4k31j20
7214c96L82k72N54k09j8l04j19M31k59q8K89J13k05J90k80L90L2K78n07j76J120
$$ y = [409, -414, -193, 231, 396, 222, -155, -399, 682, -618, -454, -369, 893, 85, 101, 205, -311, -292, -7, -223, 199, -78, 248, -341, 6, -399, -155, -375, 158, -489, 197, -9, 27, -90, -274, 251, -158, -155, -167, -247, -162, 16, 665, 162, -449, 482, -385, -396, 188, 376, -603, -236, 727, -43, 407, -364, 688, -98, -246, -628, -14, -46, 560, 508, -153, -263, -351, 17, -263, -82, 95, 353, 454, -3, -566, 291, 405, 100, -456, -476, -300, -106, -6, 269, 58, 119, -556, -28, 355, 156, 656, -306, -59, 431, 131, 302, -3, 90, -463, -60, 249, 632, -1040, -60, 412, -397, 25, 445, -109, -153, 682, 155, 557, 219, -513, -72, -654, 703, 357, -498, -429, -1, 829, 505, 43, -290, -502, -74, 331, -614, 498, 261, -55, 19, -237, -291, -63, 323, -271, 4, 496, 566, 9, -45, -276, -396, -14, -286, 268, 59, 41, -263, -382, 49, -210, -298, -9, 104, -101, 89, -191, 199, 231, 509, 2, -174, 946]
7235I46j330L38M0l41M15K24j16K7N05p10L16n87L6N64k02K47n91L97j52M54l95
7256H5p87J181m71L10Q5m32Q9O28j269j66J002P64m97l88kl55J90L4j16L50j22
7277A13m45L97o13k99P02K38Q9k68J65K33p03J008p44L62j15l52L44n45M86k22
7297a69K22j50M23n59J46K87l46m6j24Q1L89j28M04o86P76p49L95J86P08j012
7317D8m87M11k55K11l47K43K98J77r78O45o72J149q34N38q7N59k82j84J10nk28
7338C0K37m6j292J526m57J18l15l40N89q6K3l83L35L07q88Q73l11K22m51P3m6
7359b82J62m00L94j37J061p82n41O54J87j599O97Q51m99K43J55K74n94R53r26
7378a29O0k67n6j76J409j500Q18n7l41O03j4o2m61J13l2N77j490J175j43K70l67
$$ y = [946, -384, -46, -6, -347, 68, 292, 176, 203, 708, -2, 314, -273, -237, 327, 125, 372, -219, 178, 26, 480, 85, -702, 479, 8, 318, 403, -29, 60, 688, -581, -747, 255, 1019, 522, 134, 132, -223, -33, 1, -115, 235, 113, -332, 65, -548, -847, -145, 93, 182, -86, 79, 312, -391, 617, -127, 235, 120, -232, 112, -433, 53, -169, 53, -97, 326, -233, -87, 200, -146, -192, -316, -235, 154, 26, 430, -256, 520, -229, 166, 352, 1060, 48, -439, -28, -283, -72, -419, -176, 122, 299, -679, -34, -706, 443, -391, 147, 60, 619, 337, 153, 263, 258, 30, 267, 221, -1071, 455, -2, 116, -199, -539, 50, -36, -13, -396, -61, 246, -642, 231, -80, 142, -309, -236, -282, -120, -520, -126, -263, 798, 16, -525, 129, 316, -1283, -586, 265, -234, 9, 164, 438, -156, 797, -129, -69, -336, -392, -568, 841, -659, 159, 102, -239, 364, 350, 288, -173, -60, -92, 485, -1005, 170, 27, 297, -70]
7399g0n06N7J179o03M13l11k0K67k05J57n40K8L86p74R51r11n5R89n97L81m0o66
7421d90M50O74o47N35o66N13N27r28l30M2j28N12ml99L17J65r22R66Q3n16J064
7442H18o51j75K2j09n89P24l05M79J33k51j62M56m73L3J43L0J43r2k41K05J89
7463C27m71k04L15lL43n04J169q70o81Q68k32M68l68k30J90R7n20l77J051r97
7483f29K47J022k47j002P12L68m13r4L44o57K7k9J98N06J11j98p9l04Q1J030r70
7504B4N28n51r72J340k15Q7m88j8K20n44J403n61j003Q54j58l52K23O8K26m53
7524c42j51P2Q83K04o16J050r09m53K47J16j52N59r8L72j098O9j6O33k16p6k74
7545a96j90J98K07K78j16j028R36j93K09n08P00l39j10K6o98O93p29J086J6j21
$$ y = [-70, -576, -519, 660, 57, 470, 159, 139, 406, 201, 358, -182, -154, 232, -542, 409, -502, -557, 432, -165, 216, 176, -490, -40, 634, -13, 522, -144, 369, 896, -32, -362, -320, -448, 64, 60, -339, -22, 143, -779, 187, 270, -246, 818, 167, -8, 14, -95, -684, 40, -265, 214, 347, 96, -66, 390, -83, -50, 93, 123, 266, 174, -67, 138, 327, -144, -348, -33, -36, 307, -197, 972, 102, -579, 289, 57, 525, 157, -73, 117, 214, -306, -683, 368, -629, -382, 640, 393, -609, 103, 471, 58, -36, 308, -349, -322, -351, -153, 353, 464, 266, 187, -117, -36, 994, 24, 552, 1, -971, 369, 154, 241, -247, -265, -45, -589, 814, 253, -750, 104, -54, -406, -183, -115, 111, -342, -493, -421, 462, 666, 50, 1100, 191, -262, -15, 101, -51, 508, 410, 782, -316, -247, -263, 370, 154, 78, -196, -386, -188, 19, 297, 181, -847, 89, -104, 105, -403, 297, -42, -152, -126, -824, -131, -860, 226, 242, 121]
7565A21J67o78Q98m26J05m23n08Q34L4n59N87o7N7l29n0K79q4q4L27m57N61o60
7587c55q1Q38k38q7M65j153n3J093j69j19J27p04O91K25l64o42N34o64J202o54
7607a08n31R61p06J458j318M04Q59r75l09k21k77J232l14j42N3m24M72l24K16
7626FK26k02o74N40r2L4L84j09j33K68k26p0M21P12j363L37k21Q44r61L9J24K8
7648h8j8k39P78j05j63k70P6k49P8j35Q05l56J07O7l5k18L15m35k08j5N51m20
7670a77k90R51o99n48P26L2k58K79J9J4j9o2l00M55N1L25k76L57n94k89K94r71
7692i80J529m69m44j45J002o51O89j10q20Q75o7p66k00N21N96q08L14q3K02j22
7712F3n1K71o04M23r5N36p20K48r2K51o43m03K9L31M13O34r88N1J11k74N35K31
$$ y = [121, 288, -390, 508, 82, 187, -236, -744, 90, 124, -435, 152, 85, 142, -187, -237, 42, -42, -126, 201, -256, 305, -355, -436, 402, 164, 77, 542, -611, -664, 429, 260, 141, 268, -436, 255, 480, 116, -526, 8, -656, 546, -108, -639, 322, -384, 1074, -244, 160, 1019, 44, -265, -486, -763, 469, 155, 13, 66, -358, 114, -210, 6, 232, 30, -644, -104, -196, -162, 222, 113, -20, 248, 22, -48, 373, 1085, -278, 59, -162, 682, -279, -240, -116, -88, -106, -345, 433, 328, 165, -105, -29, -278, -200, -335, 470, 114, 221, 288, 253, 35, 350, -85, -293, -308, 243, -177, -467, 484, -215, -763, -37, -5, -263, 16, 35, 49, 30, -32, -332, 123, 174, 499, 223, 580, -14, -303, -9, -980, 549, 80, -364, -509, 493, -158, 531, 421, -399, 476, 409, -357, -557, -36, 560, -248, 66, -17, 185, 63, 12, 283, -321, 102, 7, 543, -177, 71, -21, 230, -413, -816, -787, -456, -43, 591, -397, -346, -235, -509, 26, 257]
7734B57j323J161j14k84M77n92o3L87n8M48k96K24r14M99N25J88K89q56K30M87
7754F72j020J06l52O2Q9K04l71M35K28j15P74j175R08m7o00M06J25l31Q3M31n89
7775g7l16l99M18L12M36K82r79Q03o68j46L1Q72J69l27NM8o11j20O06m61n88R68
7797B58p25N62O31o23N74j011K41l8M12J3o20N92r14N19L30q81P70P81j323K31
7817b21J36l41pN84L82l28j29R06j184m4L34o37J250j001l50Q29L46k20j54J43
7837B94n66J89K31j081J355J02r07O14k95k38L52P38m90n59O65l95j28j54O75
7856D02L22j120R7l31P49N33q96j70P80m54L71l77J96K32j257R50m94P41m60N83
7876C97L39n16P6p0L51m81j10M70l37n90J88J13o5J81m34J488j033J08Om97K81
$$ y = [257, -1066, 95, -19, -303, 174, -418, -481, -94, -152, 296, 0, 224, -690, -191, 334, 522, 811, -45, 185, 672, -348, -242, -594, -532, -443, -239, -610, -175, 53, -62, 712, -463, 445, 398, -202, 204, 329, -2, 81, 512, -77, -393, -792, -374, -62, 374, 656, -323, 480, -188, -334, -303, 569, 738, 411, 416, 464, -147, -267, 339, -122, -710, 258, -467, 95, 726, 103, 677, -334, -93, -131, 281, 294, -326, 266, -648, -129, 201, -680, 90, 871, -452, -221, -85, -426, -433, 151, 533, 205, 76, 982, -202, -246, 88, -549, 701, -300, -650, 179, 525, 305, 151, 294, -272, -83, 148, -933, 422, 524, -383, 231, -64, -302, 50, 788, 298, -261, 404, 9, -119, -273, 402, 724, -396, -299, -630, 119, 652, -244, -414, 366, -88, 283, -94, 102, 334, -923, 27, -467, 274, -186, 397, 736, 220, 296, 226, 577, 96, -14, 456, 119, -471, -283, -170, -235, -54, -488, 1000, -33, 75, 81, -416, -135]
7897a35j2l51J048p20p66J482m53P8L87n48m78M67N39o28n29M50P54r30P6Q08
7917E39j448O09K81l23L46m5J9L9q51J281m93k18L78o08P00l77J28q9L7N06j92
7938B19j024K36K01Q46j28n44k52K45r7K73M94l95o11J96P82l33j52m94L25O17
7958D04k66r33O34l38N37Om17O1M22J43o39K47l61K51K29Q9p5k15J00k4l08m1
7980d94N67j16J93m17m09K52R01n93J96j69O78j071K00O51o40R3R7k9k14J27l58
8001e55M96J93m99R15n30j43J4K24r60N56L41k49J6O19M60j133k6P19m09j26k88
8022c65P73l74l09j33P89m78M51O3n23M08l09l23M77K83k39n4Q9O34j309O5N29
8043A45q3n36M71k32J99p04K51J68N47j82j61l55J171J50o38j32q5m4N66j85l22
$$ y = [-135, -147, -498, 550, -170, -936, 546, 93, 171, 558, 10, -468, -1, 538, -90, -619, -169, 585, -345, -269, 539, -909, -300, -19, -342, 4, -41, -22, 17, -834, 447, -46, -264, 114, -494, 206, -171, -43, -132, -95, 411, 219, -805, -569, -368, 478, 350, -194, -446, -201, -298, -25, 469, 74, -537, -341, 441, 108, -44, -538, -213, 404, 138, -795, -161, -499, 38, 44, -373, -312, 110, 253, -386, -139, -500, -249, -20, 69, -6, -221, -121, -145, -453, -494, 73, -43, 150, -267, -676, -424, 477, -116, 80, -89, 589, -482, -282, 369, -271, -178, -81, -110, -324, -197, -555, -59, 134, -365, 550, 20, -123, -109, 115, -845, -289, 52, -197, -181, 438, 898, -235, -261, 458, 49, -77, -365, 408, 34, -275, -408, 381, -97, 354, 417, -106, 302, -7, -330, 147, 430, 191, 137, 226, 860, -449, -384, 145, 62, -474, -3, -235, -36, -740, -489, -321, 226, 44, -117, -472, 699, 849, 211, 79, -6, -50, 516, 331, 9]
8064IM41q88L93k41L44r8M66r50j65Q37J6n30N87l12JM25j69n43J56K13l03K90
8086b1N19o24m70O59j32k51O39k67m55N10m9N05m31J48j046P36J98L20k69k81
8106f2k84J56M72o01M99k47K14J62j54k41N83n98J47j03j25J95L17p71K46l9J26
8127a08M67j70p18R24k79Q0j91k60L96k79J32M94l85k69K60j71N2M05m20k98J04
8148b34Q8J09J00K9K3m64M93J93m07L68q73K33j46M91J88K53n00L67J15q05J62
8169b17K43N58q37R5K24k01O48j2q39O47P24p17j087M19N15m31j5N1O81m13l16
8190b80N94
$$ y = [9, 450, -438, -45, -286, 58, -40, 426, -524, -689, 148, 164, -366, 221, -91, -90, 335, 166, -377, -221, -8, -311, -21, 498, -126, -596, 63, -69, -320, 319, 52, -403, 107, 58, 563, 132, 280, -766, -30, 168, 488, 219, -62, -346, -190, 282, -319, 180, -67, 147, 309, 155, -86, 497, -101, 46, -57, -182, 13, 330, -441, -195, -234, -108, 359, 189, -529, 395, 116, 196, 5, -255, 141, -138, -6, 488, 103, -166, 94, -77, -25, 380, -40, -338, -234, -146, -37, 63, 92, 115, -349, 144, 337, -70, 298, -575, -342, -488, 3, 191, 444, -56, 311, 426, -379, -217, 26, 584, -253, -158, 66, -135, 513, 501, -338, 309, 1033, 316, -771, -352, 163, -268, -283, -232, 449, 36, -280, 314]
8191C14
$$ Imaginary data points
##PAGE= N=2
##DATA TABLE= (X++(I..I)), XYDATA
0@%%%%%%%%%%%%%%%%O4j28J28j28J28j35J99k56K56l20L84m39N03n73O58p26Q33
33D48r56J078j207J349j512J693j884K098k335K589k862L162l489L846m240M675
49B453n155N675o253O899p611Q406r314J0351j1542J2928j4560J6532j8964K2046
63A1891k6090L1635l9742N2749p6782J35165n18777o82467J019836j96375n40989
74h29946K50126K17437k07129R4614L46650M3511j2367L38901n3413j17205L33087
85D04266J54876k05816n8131O9260q9204j36386Q7533j19807k48709M4593p0155
96a67680j73918J45412M38k05892J03955J63935j20186N3283K98202o3748j78252
107a44451K88421J49959k29757Q8375J74000k24699l4014K23519j73704k03387
$$ y = [0, 0, 0, 0, 0, 0, 0, 0, 0, 0, 0, 0, 0, 0, 0, 0, 0, 64, -64, 64, -64, 64, -71, 128, -128, 128, -192, 192, -247, 256, -317, 341, -385, 448, -508, 570, -637, 712, -800, 893, -991, 1107, -1228, 1361, -1501, 1661, -1828, 2018, -2222, 2453, -2702, 2973, -3280, 3619, -3992, 4414, -4900, 5451, -6091, 6837, -7723, 8809, -10155, 11891, -14199, 17436, -22306, 30443, -46339, 88826, -429951, -1112418, -92582, -288957, -829946, -579820, -362383, -569512, -474898, -128248, -84737, -97104, 241797, 188384, 71179, 404266, 559142, 353326, 295195, 364455, 275251, 138865, 226398, 106591, -142118, -97525, -167680, -341598, -196186, -195748, -401640, -297685, -133750, -253936, -200653, 97549, 33801, -144451, 143970, 293929, 64172, 152547, 326547, 101848, 67834, 291353, 117649, -85738]
117h5738K05377l4445k96746J32532J63455k67805n9001K26500p2703r6806J92005
128F625l100j56470J60088J23577j57205L9205J68676j46395r9888K05875j3232
139A27756j81601R8051K5443j76569P3779J12116j41403m5076J18543n5516r6957
150a41434J61283M7681j98772Q3814J43135j61410K2576J87116j17998j21014
160i5023J62557L3206j63776R4101J04636k21192J1925K04522j45119q7779J69926
171F7984n3767j48909J20502R0286j50381N915J31506j15193l3005J77083n8204
182C3817j09287J18962K6025j09019O2483R8002j16965m7912J28410n3670r0884
193f0038J16680j0054j40857O5306P3431j13306k762J11670q1081p4050J42355
$$ y = [-85738, 119639, 85194, -211552, -79020, 84435, -183370, -242371, -15871, -88574, -185380, 6625, 3525, -152945, 7143, 130720, -26485, 12720, 181396, 35001, -64887, 140988, 127756, -53845, 44206, 69649, -106920, -33141, 78975, -62428, -107504, 11039, -44477, -141434, 19849, 67530, -131242, -47428, 95707, -65703, -43127, 143989, 25991, -95023, 67534, 100740, -63036, 31065, 135701, -85491, -73566, 130956, -14163, -101942, 67984, 14217, -134692, -14190, 76096, -74285, -68370, 63136, -52057, -85062, 92021, 33817, -75470, 43492, 69517, -39502, 22981, 120983, 4018, -43894, 84516, 30846, -60038, 56642, 46588, -94269, -28963, 44468, -68838, -71600, 40070, -41011, -115061, 27294]
204B7294L457j21525R7282O7570j26782L7949J25458r7421n1804J31673l8703
215E4448j11259J07543K8833j46306M3843R3246j18643k5441J13087o5369p7380
226a03398J11249J2733j02998O1712O6599r1453J4856J07336n8189n7337R3681
237E4791k141q1628O5871M1973j03597L212Q0850o6791m5819R0608k6256r7388
249h6315P3777M6500r5981K8519P8602q1622j7876J05415l0270o3556Q3294J1455
261E1942r1654N4314O4785r5376o251Q5360o7390n0040R2866j8213q8204N9900
273g961L5718q3649K2188P3407o6021k9121R1937j7531o5520O8532K9927p6166
285b4260K4789O1514n8173k2264O1750k2092n1273M5788J1252o6689K1273M7973
$$ y = [27294, 30751, -90774, 6508, 74078, -52704, -14755, 110703, 13282, -38522, 93151, 54448, -56811, 50732, 79565, -66741, -22898, 70348, -48295, -73736, 39351, -26018, -103398, 7851, 20584, -82414, -20702, 45897, -45556, -30700, 76636, 18447, -38890, 54791, 52650, -28978, 36893, 78866, -24731, -21519, 59331, -7460, -53279, 37329, 11073, -86315, -12538, 33962, -62019, -33500, 45102, -36520, -54396, 51019, 20749, -42807, 40487, 51942, -39712, 14602, 79387, -15989, -22240, 63120, -4270, -54310, 38556, 20343, -67861, -7961, 27757, -55892, -33704, 39703, -26318, -55439, 36498, 18967, -46553, 21979, 51906, -24260, 529, 62043, 3870, -18394, 43356, 21264, -30009, 15779, 27031, -39658, -18385, 29588]
297B9588o2045j1106O6552l9573m2941P5184M198o4435M3340L4546o0844K2037
309e499O6257n9730k8213P4396k8371n4998P0637J1102q5933K3178N0923n5820
321b2071p350N9592l8217m5576N7238J0684m7623L5430K8789o0817N461O6186
333D1726k9011l4205N0277m002n1547L3163L3593m5851n156L4522l4253j6891
345b7635N2703j1959n1314L8311K2332n3286J8202N1913m6863j8968N3492j6354
357A0574l0669M4173j736n1834L5957K8953n9506M974N1636m4993l0216N8965
369A6278m759n0597L0754K1175l9208J5769L5525l5781r022M4293j2517k9844
381a7934L9752J0421m7620J1242L7261k9953j4984K9744j6352k8239K5692R484
$$ y = [29588, -32457, -43563, 22989, -16584, -59525, 15659, 19857, -44578, -1238, 33308, -27536, -5499, 60758, 1028, -27185, 47211, 18840, -36158, 34479, 45581, -40352, -17174, 33749, -22071, -29421, 30171, -8046, -53622, 3616, 14300, -33323, 2107, 30896, -29921, -24460, 41726, 12715, -21490, 28787, 24785, -26762, 6401, 39994, -5857, -11013, 23509, -10744, -27635, 25068, 13109, -38205, 106, 22438, -30848, -12646, 39267, -7596, -26564, 26928, 10574, -20095, 24078, 22342, -29492, 6465, 35418, -24088, -19114, 32522, -12471, -42687, 16278, 11519, -39078, -8324, 12851, -26357, -10588, 24937, -10844, -19866, 24427, 11910, -17934, 21818, 32239, -15381, -4139, 33122, 3169, -11815, 17929, 1577, -26662, -970, 8514]
393H514l2656J1379K0209l7662K629N1610k4195l1346M3792M211l4968L1766K6389
406C9672l9967J415L3085k8537p515M4414k8166m1471L8147Q510m3440J6857K2000
419A5004l9816j0773L5881p517j8394K6250m242k8169K9168K4238k6760M114K7031
432B6015k0016j4233L4748P656l3362M301J5649k5595J503K5965k5540k0347K3769
445E13q445k3916K8017J2084l9371N287L5250j8691q241L6007j1139k4647L3023
458A5731P467k7324K0311J4389l3707J115L1465k0169k2902K6345n372k9735K0230
471b156J0873k7510M199J6717j2950l104J9607k514j8616J6925J4670k0479O005
484A667J9981k0440p576K1519k160j8824O983Q019k1194L655K2258k3542r467
$$ y = [8514, -24142, -12763, 7446, -30216, -27587, 24023, -172, -31518, 12274, 16485, -18483, 13283, 39672, -295, 1120, 34205, 5668, -1847, 42567, 14401, -27070, 11077, 19587, -23853, -6996, 15004, -24812, -35585, 296, -7221, -25615, 635, -3607, -31776, -2608, 21630, -5130, -1016, 26015, 5999, -8234, 26514, 34170, 808, 5109, 20758, -4837, -3334, 22631, -2909, -23256, 513, -7932, -31848, -3831, 8253, -31118, -25831, 9419, -9272, -17513, 18494, 7355, -17292, 15731, 23198, -4126, 16185, 30574, -3133, -2018, 29447, 9278, -13624, 12721, 7349, -22386, -2156, 8717, -18793, -14594, 2123, -10827, -13931, 5676, 3162, -15454, 1471, 16141, -4338, 1667, 21648, 1208, -6368, 15151, 12991, -5833, 1150, 9169, -12025, -8370, 13888, -9654, -19121]
497a9121K6453j5653j3252K9435J629k4694P408J9745j5915J66K4879j9420j6822
510a5162K8211m989j8187J8193K14k2691L084J6758r223o869J4639r671j3450
523a9143K0503R194j3234L762P534q217m36J5781p10j5312O351L294j4586N942
537G23J3535j7354j1171J0819l219j0099J3434L319k1215O415J7872j2547J366
550h122K1969j1461j1264K0443K267j1355J2754K529j7345L059J2816j2075p214
563b999J0316r469j1668J0458j188r906N364P75o103K683P087J771o178O473R113
578F529q076M228J0873p427k905R140j005p831K369O017j3652j812J3111j3274
592c715q097J2514r344o083J1666m72r022K527R968n205L22J3005p332l304J1955
$$ y = [-19121, 7332, -8321, -21573, 7862, 9491, -15203, -7795, 11950, -3965, -3799, 21080, 1660, -15162, 13049, 8060, -10127, 8066, 8280, -14411, -11327, 5431, -3792, -10661, 3978, -5693, -19143, 1360, 10554, -2680, 1082, 8616, 399, -37, 15744, 15034, -278, 6073, 9367, -5219, 723, 14258, -3096, -14267, -3448, -6667, -16766, -3332, -13, -21228, -14813, 3059, -9488, -8122, 13847, 2386, -8878, 11565, 13832, 2477, 15231, 17760, 415, 3474, 16290, 4215, -2999, 7317, -2152, -13820, -3362, -4550, -14456, -9092, -8317, -14420, -11737, -4650, -2879, -9057, -2584, 6529, -1547, 2681, 13554, 6127, 3222, 12362, 11357, 3526, 5895, 11912, -1740, -3552, 9559, -3715, -11812, 702, -8642, -14725, -3059, -3531, -12553, -10026, -58, -5263, -4941, 8064, 732, -2572, 9383]
607I383l024r63O575l799n895Q07M380j873o561J772k807o381M118J219k726j531
623g306n41J562j024N305N423o558M00P562m352L209P723n436p209M415L552o146
639E79J848M268j1968j911Q306n259j627O700n961o186Q317M212l459K215K280
654B354l341R73L753Q67J462j474l515j475K720j75l47l137j693L04k089l65O757
671A579l526n977M309J893j251M961J209m963K047L968l627J437O305n327n840
686b803Q047j770n493M107k86n022L6K697o86j292J594j492k389M382L4j586K130
703B08l55K173j663q29M486j137k119K571o87k348J170n80k518J869K402o683
719d040N58N427n520k686Q358l428n257O117O63k827L774J645m396J506M733m809
$$ y = [9383, 6359, 5396, 11971, 8172, 2277, 3084, 7464, 5591, -970, 802, -2005, -8386, -4268, -3049, -5775, -7306, -7847, -6285, -7309, -2004, 3419, -3139, -2739, 4823, 471, 3680, 11403, 5967, -1242, 3173, 6725, 579, 2427, 6695, -5273, -7184, 1122, -4137, -5764, 936, -5025, -11211, -2894, 1318, -2141, 74, 2354, -987, -14, 3739, 4606, 6068, 4594, 1079, -396, 2324, 2149, 1802, -1335, -3028, -2724, -4813, -5178, 1579, -1947, -7924, -3615, -1722, -2973, 1988, 3197, -1766, 281, 4249, 622, 2059, 8364, 3037, -2803, 5244, 3474, -2019, 2088, 1802, -3220, -3184, -487, -1173, -2465, -871, -2363, -4752, -370, -336, -1922, 208, -147, 2026, 363, -466, 4020, 2883, 764, 3335, 2648, 300, 1470, 890, -1628, 241, 2643, -4040, -3482, 1945, -3575, -6261, 2097, -1331, -6588, -471, 192, -2635, 1139, 2784, -1612, -106, 4627, -182]
735a82J42O270n572l466L535J191j378k96k119p18J53J15K632m2j649l45L7M58
753a234M642J809n172m46M441n323K879N641m754m638K296j236j430N540k480
768E35o751K896J852l383L494M987n810l302O761L37M51K968j752m227L706J604
784D366j543J203j35m842k774J965K726j899l207p54J405j934K224L611j722k555
800c865L319j12k62N439j827n118N447J682m713L097K022o213n2M738l746j657
816a821M679n506j802N100j45m063K325Q29k961J615K984j402j355J093K69O40
832D79J254n19j1l59K56J492j159k88O48k491m76M833m42m902K465J53l837K002
850i02L878m435j307L280l382L63O248l815m646L599J801k610L585K536n374o39
$$ y = [-182, -40, 6230, 658, -2808, 727, 1918, 540, 244, -1875, -2593, -2440, -2325, 307, 265, -1384, -1729, -1692, -1234, 3408, 5217, 45, -401, 4040, -1283, 1596, 7237, 2483, -2155, 141, -1095, -2525, 3015, 535, -6216, -3320, -1468, -4851, -1357, 3630, -2180, -5482, 1279, 1616, 2067, 5035, 3283, -944, 2762, 4366, 2823, 4026, 3891, -951, -3725, -1760, 966, -933, -4140, -4894, -3489, -5423, -3199, 412, -1310, -3865, -546, -658, -920, 4519, 2692, -2426, 3021, 4703, -10, 3087, 5109, -1104, -1156, 3582, -164, -1821, 2858, -2648, -4450, 650, 505, -3558, -1233, -404, -3365, -1750, 1234, -168, -1523, -430, -161, 479, 1733, 1214, 1203, 844, 1100, 2592, 1433, 1145, 1793, -698, -1174, 3659, 3217, -1685, 780, 933, -2904, -902, 2976, -1459, -2766, 514, -2868, -2505, 3743, -72, -4718, -1119, 682, -1928, 1657, 4193, -1181, -1820]
866a820M267o89L90J863l239k454L015K221j772j22q49k223o40J809K031j273
882E15l244M80q70R4N038j23n179n23L811k323J046N798m262m556N928J028k933
899b75M999p05n972J639M198l052J139J947n097j743M068k25l029J223p16l220
915d821K098J438k74j302J025M24l5N56L512k081j963L331Q56j953K156J748m388
932C27j5M767l772k966L624j775m001M039K91o088L125K600m559J177M233k943
948a936k486N972j313k297N223q45l323K618K645j501n30J319j032k975Q49K432
964B820k146p29p07j481j21K151O26l528j06L301l715O65N857j876m590L652J160
981A233k120K809K609o531R28M786m137K40N888m747m697M649L85k921K489J245
$$ y = [-1820, 2447, 1758, 2148, 4011, 772, -1682, 1333, 3554, 1782, 1660, 811, -1412, -2052, -243, 1788, 515, -2729, -2249, -3119, -3025, 2013, 1890, -3289, -3812, -1, -2324, -1278, 4520, 258, -4298, 1630, 2658, -275, 4724, 4019, -1953, -314, 3884, 832, 1971, 3918, -1179, -2922, 1146, 921, -2108, -885, -1601, -4821, -2723, -1285, -1559, -2861, -1836, -1412, -1447, -891, 2621, 540, -1423, 1908, 2764, 811, 2967, 4715, 327, 312, 5079, 1307, -1659, 1965, 190, -3811, 228, 519, -5569, -2444, 156, -4403, -3226, 1007, -1936, -4422, 1550, 237, -2060, 3163, 2318, -1005, 1613, 4258, 2757, 2227, 3546, 2514, -461, 388, 2820, 674, -55, -762, -2243, -2364, -213, 413, -3115, -3221, 80, -3635, -2970, 2887, 1011, -3579, 73, 1233, -887, 1922, 4531, -2000, -1072, 3714, -423, -183, 5705, 958, -3739, 910, 1295, -1626, 863, 2108]
997B108m210n95L137r66j52K024l349k261L301K171k561O89J893k503j675K327
1013f22L369j598k239K848r21k009M984j261k576K347j144l274K652L349m933
1028a028k949N716k936l145N575j361m094L193N22k735L619J985m506j45N616
1043C327k329k442N245r91k846J663P48j206k24m53l77j041J155P09l368Q59K096
1060E25k248j334L049N58l727J672L755k123k386M030k179q53M410k487k574M144
1076B232m79l691K740L018m579j756M260k285l48K317j954j122N63l07P5J967
1092F51L9l454k00L206L40j028N09N85k217j74K552J885j191j873po24J627K484
1110C110k568j477J112n30k260M747O24n125J5J933j060J517K108l074j354L524
$$ y = [2108, -2102, -2697, 440, -526, -678, 1346, -2003, -4264, -963, 1208, -1353, -664, 1229, -1274, -2949, -622, 2747, 1149, -1090, 1758, 837, -1172, 3812, 2551, -25, 2322, 1178, -2096, 556, 3905, -1028, -3977, 1739, -1197, -4342, 1233, -128, -4222, -1029, -507, -3242, 377, 2362, -2144, -2289, 3327, 998, -1444, 3801, 2810, -36, 1627, 2375, 1169, 945, 492, 115, -926, 229, 938, -2430, -1571, 525, -1723, -3057, -8, 550, -3177, -1505, 2250, 127, -2259, 1771, -408, -1261, 3149, 662, -1912, 2232, 1753, -1938, 802, 3820, -759, -2515, 1745, -540, -888, 1429, -525, -1647, -1084, -1391, -1316, 651, 690, -2764, -2964, 242, 582, -446, 63, 648, -1569, -1743, 809, 2694, 1503, -370, -377, -1001, 626, 3110, 542, -935, 177, -353, -2613, 2134, 2758, -2367, -2352, -419, -1479, 38, 2146, -928, -2282, 1242]
1126A242k371n2M264j806m034K049J874L17j170L75j006j94J36J20J145j97j408
1143g16j770K467j98J777j988q55J568p70m26K537K17l209J158Q61q18J620O0
1160A515k348n5K878k221j668M169l551n61K546k86q59J0n10K17Q46J184j945
1177f39k76J541j85m49J449r92j137J30O87J266n28q25l16n29m33R93J677j77
1195A257k257l4k95R95J901k746j301K379m46m20K426k73l683J955R07r74K036
1212A427O72k467p80K653m54p42J544j671j296J143N08N47l47j159n32o6O3J290
1230C33j51k136Q83M51j008J557J973k206p77J512j1l37K884k059k133K405J4
1247A194j682K017L68k315M17R19j269l75J486j854m31Q43L74j119J264R76j910
$$ y = [1242, -1129, -1181, 3083, 1277, -2757, -708, 1166, 1483, 313, 688, -318, -512, -376, -256, 889, 692, -716, -2486, -19, -217, 1560, -428, -1283, 285, -485, -911, 1626, 1843, -1366, -208, 653, -165, 1455, 1515, -833, -888, 1990, -231, -1899, 2270, -1281, -1842, 704, 418, -441, -431, -941, -724, 122, 1306, -639, -915, 626, 441, -8, 1441, 449, -688, -558, 129, 1395, 867, 42, -274, -803, -1236, -243, 1434, 1257, -1000, -1034, -1329, -334, 1567, -1179, -2480, -101, -547, -967, 1459, 1186, -2497, -542, 365, -609, 1427, 2099, -368, -1148, 1505, 1051, 309, 1853, 182, -1114, 29, 537, 1084, 737, -422, -954, -1020, -957, 333, 182, -1954, -1071, -620, -1628, -71, 1902, -304, -1081, 431, 420, 83, 2967, 908, -1225, 1180, 1194, -488, 1529, 1897, -418, -1, 918, -351, -726, 760, -1094, -1525, -682, -308, -1427, -163, 813, -1097]
1264a097o6R70P59j17j34Q21l47n1P76J30o69K6M51j056j09M79q37p16J978j667
1284d76j804K393L00j937J69J960k315O07J518j355M37J999j680q58K436K41k758
1301a123K196R26j239j26J27J23L21m17r78j21L02m34L42p93O3j57q56R69R85
1320A10j232l68P70O77o24J644M85j790J044K79j082K529P2k597j35K090j603
1337B69r89K266n78l258J476N21k06P62j08r94p57J587k78n8J112j366m73K64
1355h08J016P87l82n84R2l18m25J488K47k02l08j322o49K341J48j850Q66O17j634
1374h80r46L209p82j475O28l08l81J791o60j596P75J377k036J027J456r96j161
1391i58J166R03p60J56Q41j025K11M4L72n95J5m25j135M96J085q12k035J542J154
$$ y = [-1097, -1163, -193, 566, 449, 315, 1136, 789, 738, 1514, 1644, 975, 1001, 1452, 396, 287, 766, -71, -787, 1191, -476, -2280, 113, 413, -1524, -1355, 605, -1710, -1103, 415, -940, -503, 1496, -184, -1042, 1394, 1635, -1123, 1073, 1999, 760, 634, 761, 884, 1205, 788, -190, -311, -9, -443, -101, -894, -831, -988, -1844, -875, 110, -1122, -1490, -720, -43, -667, 977, 1462, -328, 716, 995, -87, 2442, 2514, -83, -218, 1872, 269, -720, 1546, 968, -2290, -814, -293, -499, 263, 155, -839, -1596, -9, -287, -345, 767, -599, -1072, -808, 208, 995, 613, 29, 121, -197, -622, 866, 1113, 911, 603, -719, -1368, 973, 1121, -729, 137, 754, -880, -1826, 1383, 601, -874, -246, -554, -935, 856, 196, -1400, -625, 752, -1284, -257, 1199, 203, -958, 208, 1111, 351, 507, 1348, 323, 534, 578, 950, 355, 370, -55, -1190, -694, 391, -421, -2456, -914, 240]
1410B40j359L83J632j386j155J930k78l60P17o61q57J932Q46k246M28K113j655
1427B64K3J429k236O8n10O67o83Q80O92k479J036J338j301J23N11J039j514l67
1445a020J444O14q71L6L77m68k09M78k10l90R50j425o80K633k26k639J070R42
1463D06j129P81J362k711k54J639j070K56K479j629k017K044O02j322J212L21
1479I70r49j42M37K03n46J031j416l81P87j22Q5n66Q18K42j510P32J413j239j142
1498a295M98N22N0M33r0j792J306J100j324M87J692j987n26J788Kk231K199p5
1516G57j593J137M46j659P76J208j974n69K186m36j437Q67k18m00J915k96q00
1533i0k40j3O42l2l62R53j468J49J127k90n64J14M71j870J222J22K93j382J247
$$ y = [240, -1119, -736, 896, -490, -1645, 285, 7, -353, 364, -297, -1154, 778, 1624, -622, -194, 1919, 264, 287, 1716, -520, -452, -962, -295, -978, -98, 594, -1885, -849, 489, -812, -689, -178, 861, -653, -1020, 424, 1038, 167, 203, 580, 112, -97, 381, 171, -219, 731, -694, -1374, 1259, 1033, -1606, -536, 406, -723, 58, 1420, -1291, -1545, 94, -976, -720, 1759, 130, -1887, 157, 759, -563, 649, 970, 21, -121, 316, 519, -27, 1004, -412, -793, -6, -128, -43, -609, 209, 451, -1059, -327, 1086, -153, -1295, -797, -275, -225, 208, 118, -1674, -368, 732, -592, -105, 1587, -400, -926, 862, 864, -1367, 832, 757, -836, 301, 747, -912, -136, 1072, -902, -1471, 715, 279, -1158, -291, -509, -909, 1006, 710, -90, -330, -343, 299, 267, -95, 858, -610, -461, 666, 376, -188, -74, 397, -1473, -251, -129, 164, -1218, 29]
1552B9R4j317J741K68j585K160j025j307J023J778k736k12J317m48l01J453q47
1569H5j305O94P11j486J622J56j269q4M41R55q75J086l30j049L08J097k61m04
1587I2Ll99r1M86J561j892L82K37j446P98J067n72j031J81J054j508Q01P22l99
1606D6j368J421k47l16J343o27j323J495N38j238L93J194j621L86O98q66j366
1623a458J999p37k20Q61n90J27o82J213q21j11l56L44j23Q34O9j62o54L60K70
1642A63r34L33J031j007M45j86M43r22J864j455l30J213q33q14J895k17j217M88
1660d0N31j510J098J170j944R70O18j746L71J244j21j813J140R90q10J52P04q93
1678A11r15J805q66j87p3M79m49j48N03J8k1J17o22r33J285P96j200K66q2q95
$$ y = [29, 123, -1194, 547, 815, -770, 1390, 365, -942, 81, 1859, -877, -1089, 228, -220, -521, 932, 85, -1220, -526, 185, -1301, 321, 477, -792, -876, -435, 520, -355, 731, 401, -648, -340, 757, 496, 92, 95, -304, -395, 91, 1652, -240, 142, 379, -1067, -269, 798, 226, -805, -624, 430, -1078, -277, 445, 46, -1322, 99, -148, -464, 879, 252, -1071, 424, 962, -276, 117, 1311, -310, 76, 774, -92, -1458, 541, -196, -416, 445, -145, -18, -700, 513, -308, -419, -775, -431, -554, 280, 349, 187, -467, -107, 163, -771, -438, 593, -414, 31, -155, 288, -634, 1230, -225, -555, 658, -175, -989, 906, 689, -528, -40, 491, -1019, 79, 1249, -695, 275, 893, -853, -482, 762, 641, -1172, -32, 958, 148, 300, 1004, 111, -804, 1001, 135, -52, -125, 354, -95, -243, 260, 278, 257, 374, -248, -1181, 104, 900, -300, -34, -116, -1011]
1698a011P16N94j18m79M17Q29k115K037J132k772J090J054j569p2J435j293n11
1715f36O36J03o18J249N69k734Q2K090j090j38J422j098j063J419O0n64L59O34
1733F82m57j295K145k19j845J390O11j445M2J236n51j959J927L97j779J394J45
1750D19k474J547J464k098J5K576j537j602K592m67j627J717M55k183J076K242
1766B115j515j825K675j092j839L246q47k801J786O47j303l97K372j557j255K611
1782A021q20p51Q78N95j941J98J716j573o61K062L88l531K439J458k543j6K114
1799A033q90j730L081r87k208J903L13k017P21K703k724o73K303q84j691K852
1815A105k93k169P13K555k973Q05J981l86l036K131N91j881J438R02j907M26J690
$$ y = [-1011, -295, 299, 181, -298, 119, 948, -1167, 870, 2002, -770, 320, 1374, -195, -267, 1168, -125, -636, 0, 103, -515, 734, 1303, -1431, -1349, 741, -349, -487, 935, -163, -1226, 193, 253, -311, 48, 682, 225, -1070, 1075, 856, -989, 401, 1012, -433, -391, 845, 294, -1665, 262, 659, -1120, 274, 419, -2055, -508, 956, -1142, -1127, 1449, -88, -1690, 902, 435, -1192, 525, 980, -1203, -127, 2115, 600, -1225, 1450, 358, -1481, 1765, 918, -1883, -97, 550, -753, -1150, 1222, -335, -1590, 1021, 201, -550, 328, 923, -1018, -820, 896, -677, -1338, 724, 1112, -2419, 20, 1478, -1065, -1081, 1033, 143, -1587, 1494, 507, -1701, 202, 515, -1502, -781, 1922, -802, -1475, 828, -56, -1747, 1105, 812, -1357, -644, 1911, -1062, -257, 1724, 1338, -1698, 433, 1024, -857, 581, 1483, -424, 2, 1692]
1832A692j442j416J993p8k707K260J424k279q69K938k689p45L342l02k935K059
1848B46M87k469J685J677j631q58L290k284k053K564J038k526N14K438l536O16
1864h02K096j326j398J869O20l155K238J557l751P41K836j523j856K619l36j564
1880a135J135K318k527j28J946j492j384L044j413k933L256L19k082p8L306l579
1896a427l40L276j427j953K303J54k101J364K687l743M73K123j159j837L254j50
1912A497l520K140J184k194J116J782k725j052K579O51k187J200M04k767J083
1927h09J868j704k58J921J57k420J515J174k418R99J916k406p99L062n00k728
1943a430J777J025l204J811J662k627q86L304j808j550K666L47k723J369K048
$$ y = [1692, 250, -1166, 827, 749, -1958, 302, 1726, -553, -1422, 1516, -1173, -1918, 1424, 1122, -1813, 246, 733, -1736, -51, 1626, -5, -863, 2427, 143, -1910, 654, 1692, -834, -320, 2118, -1418, -802, 1294, -32, -1430, 439, 1059, -2096, 142, 1699, -2052, -1311, 1525, 2, -1854, 765, 429, -1135, 0, 2318, -209, -337, 1609, 117, -1267, 1777, 364, -2569, 687, 1006, -1076, -1154, 2152, -1427, -1767, 1509, 82, -1871, 432, 586, -1515, -151, 2536, -1207, -734, 1389, 230, -1607, 1647, 1497, -2023, 117, 1301, -893, 223, 2005, -720, -1772, 807, 1458, -729, 471, 875, -1892, -809, 1059, -645, -903, 1018, 1175, -1245, 270, 1444, -974, 25, 1941, -465, -1264, 1798, 1298, -1430, 347, 1372, -1832, -21, 1641, -986, -1872, 1432, -376, -1926, 740, 1087, -1636, -267, 1781]
1958A781k308K10K274j842j057K122m62j792J972l52j474R14R03o20j716K526
1974A079j017j424J794j77j914R33K062k456q28L247p14j979K134K6k730K028
1990F4J165j658p45K926j889q49J796J79l334K788J299k928R71J827k024j250
2006a662K410o96j732K152k98j901J956O74j865j85J896r02n81R57M73k144P90
2023f58J587j139L0J788j861q44J532K1j708N01J973k166n12K962j174k373K590
2040E49J12j883J451L57j680L9J804j134j98J061J97j788J685j86j960J453J072
2057I51j375j03J989r08p02P61n00r66O39N48j45o39J301p17j057J091j47n91
2075e70N71m03j45M02J139m93j296J507q17r44J248J091j633K96J133j825j17
$$ y = [1781, -527, -317, 1957, 115, -942, 1180, 718, -1074, 898, 546, -928, -14, 889, 269, -1447, 1079, 62, -1362, 432, 255, -1659, -726, 1336, -1120, -1948, 1299, 585, -1394, 740, 766, -1964, 64, 1229, -429, -1174, 1752, -137, -986, 810, 989, -2345, 443, 1742, -1186, -215, 1612, -412, -1662, 748, 52, -1680, 472, 174, -1727, 229, 903, -962, -1147, 749, -153, -734, 223, 696, -1448, -658, 929, -210, -180, 1608, -253, -1097, 435, 456, -1252, -751, 1222, -944, -1456, 1506, 332, -2041, 549, 661, -1222, 229, 586, -1094, -1055, 749, -385, -583, 478, 675, -1113, 572, 386, -1574, -121, 951, -424, -527, 1462, 554, -148, 613, 113, -853, -214, 334, 189, -450, 851, 134, -923, 168, 21, -570, 1, -402, -547, -145, 994, 501, -795, 712, -105, -1049, 199, 1290, -343, -47, 1086, -739, -856]
2092h56J393o01o10J186r64l62R11M17n24m00J269j621k98J866m87m92K04J2p96
2111g53R12K95n64j46J050n79j095J236m9n60l77O26o17k42R75J16p10O72n14
2130c24k77K84R34j485Q08J021j072O42P3O8j271R96O10j611N0J510j113L0Q60
2149G33m31j164J551r70o96Q22j6OQ6L72j117Q84l43n96M92R62M7j346m9R53K94
2170D74j250J305l66q03L63M96K18j29k53M76j103J185k82r54N27j89q19P56M82
2189A34r75j40J232l14kJ065j158m72Q87M60j386Q16R16j616j8J415r86k25J492
2208A125j187o20J99O66n73m13J184m80p38J135j78r5P7L53j137QJ361q16rM08
2228B70O27j139N67K01n04k2L72J3j408J404j78j016J506k96r27j25Q23q29N72
$$ y = [-856, 537, -64, -674, 512, -452, -814, 97, 514, -10, -410, 859, -762, -1060, 806, 319, -173, 31, 43, -753, 159, 454, -110, -256, 794, 215, -880, 356, 307, -253, -630, -4, -621, -863, 112, 228, -482, 190, -324, -601, -317, 617, -868, -60, 961, -111, 531, 604, 672, -599, 397, 1007, -604, -554, 956, -157, -127, 733, 302, -862, 689, -281, -977, -155, -171, -165, -79, 293, -824, 60, -283, -879, -387, 575, 622, -724, -773, 180, 474, -776, 529, 163, -640, -277, 219, 437, 308, 55, 531, -572, 613, 331, -623, -96, -285, -1104, -348, 134, -841, -981, 251, -63, -65, 1000, -158, -630, 257, 717, -669, 147, 1063, -553, -571, 844, -142, -367, 1125, -62, -682, -483, 183, -390, -803, 381, -99, -837, 298, 120, 25, 102, 455, -682, -674, 687, -129, -138, 270, 897, -242, 325, 526, 22, 0, 372, 385, -1023, 381, 203, -813, 693, 397, -530, -655, 168, -661, -89]
2247h9N10r07n31J173j32j052J180M57j360n2J279p40k06J477j647KJ147M14j626
2266g03J120J60n16j101J221k8j078J366q93J0K12O97o40O8L69j3j211J503J29
2285F72j510J059L68j090k46J867j786l61J065N00j117L72Q42j063n48J826j348
2302d98n9Q63j79n24J86Q84n61n05P06o32K34M27R6n22K15K19l76m26O85n52M15
2323I6M78r64O0NJ115j035Q2K67j24l32N43k31L41l17M71j002N99L29q58L34M21
2344B78L8p93M88l51l34O95Q60j578J023L26l94j066J357r98n97J046L81k92o68
2363e79R05o05R0O02o50N1K47q4j8K4J69M3k30J14M99j141Q09n7p75M79J78m53
2385c82j17J228j046M18l04Np63J613q94m65Q77m59L43M24p77j74K64O20o10L31
$$ y = [-89, 421, -486, -1017, 156, 24, -1028, 152, 609, -751, -803, 476, -264, -470, 1007, -640, -638, 509, 923, -703, 417, 577, 61, -1040, 181, 153, -925, 441, -452, -442, -230, 467, -173, -105, 264, 251, -960, 543, 672, -838, 221, 589, -501, -747, 1120, -666, -1027, 38, 538, -579, -207, 635, -428, -976, 850, -498, -557, 306, 127, -397, -211, 673, 112, -393, 313, -319, -85, 342, 438, -84, 131, 350, -26, -452, 233, -319, 96, 574, -390, -330, -325, 790, -245, -163, 104, -20, -352, 191, -40, 301, -16, 455, -547, 52, 381, -477, -143, 278, 316, -477, 11, -340, -674, 21, 881, -697, 326, 652, 258, -808, 549, -449, -1046, 0, 381, 89, -579, 326, -279, -189, 413, -237, -186, 61, -23, -41, -17, 152, 195, -35, 79, 578, -563, 246, 189, -586, -107, 71, -382, -499, 729, -317, 101, -203, -198, -961, 652, -242, -707, 170, -289, 54, 478, -299, -473, -209, 411, -199, 132]
2405A32l27P27k45o33L77M67k35l32O1o72Q12K86k2m05l45R44j340J330n82o09
2425f11O76m21o3P48p5n07J072n0o37l92n22O19j35K42j90J63J7L24K10m67J10
2446A11k49j60L26L96r46O85J36L3n32o0O92l61J4J31r8m68L04M87m95k2N63p86
2468b99Q2L6N55o22K3N34n49K38n65N3n6J800m52l70k18N06r46L09p75J636n35
2489C85J54ln76m5K6J29K27K13n45k79L15k3n39O74n6k86J49J117p59o5k01l52
2511c40L14l67N58K02K69l32r5q72J359j158O47n73j78P31p6K70l31m17Q46n08
2531e1o2L67k30J066j382P19m79Q77r07k98O84p28K87R3P6j79k12m83R96p92K25
2552d13N83J19q12P34m22J8k20K58M3o8O14p74J96L00q03K51J66J08k21K77q4
$$ y = [132, -195, 532, 287, -346, 31, 498, 263, -69, -8, -680, 132, 418, 396, -9, -354, 590, -750, 580, -2, -611, 65, -356, -419, 329, 254, -253, 819, 769, 132, -260, -782, -163, -298, -56, -246, -83, -66, 258, 468, 1, 111, -138, -298, 28, 424, -522, 163, 299, 332, -200, -260, 432, 71, 85, 216, 118, -350, -46, 441, -54, -76, 487, -299, -217, -181, 374, -248, -225, 309, -240, -2, -567, -514, -570, 1230, 778, 408, 190, 696, -250, 59, -716, 920, 385, 539, 536, -40, -85, -59, 70, 297, 510, -35, -314, 1, -22, -561, 113, 57, -229, -80, 1037, 278, 213, 12, -340, -26, -393, 165, 367, 636, 304, 209, -663, 696, -462, 185, -388, -566, 165, 89, 359, 28, -389, 457, -51, -113, 254, 24, 1090, -292, 427, -52, 825, -82, -380, 304, -424, -137, -44, 32, -147, -359, -842, 154, -638, -413, 170, 289, -523, 211, -211, -193, -413, -155, -112, -180, 434, -340, -144, 156, -647, -396, -230, -122, -343, -66, -150]
2573a50K13o61O40M36j117J105k36k43K91l65N95o59O68j014N34J8k27q40M70
2592e42K61K30L16m37j06K74K15k84K58j41K08m35m68Q78R2j99m45J323p98j01
2612I9l5m71N69K24m66L82o42L06j36k34J428j464k65J284q03O16p22M6k16P64
2632B64j19N5K64l07O33j425J98P58L61j547P49L81j31k6r12l0R40l28K96o94
2652f20L81O05p7m54O31j108P93l62k69N9K35K52k03l40N34K1k16M78j64k72m7
2673a43J19N3k76N2J63k22j22K22m02L17P35m31L2%k54k64M6J050j442J115p42
2694c94j00Q48p23K4L66N75p17j74Q42k78o43l87O12K52n21K63J58m26K22j83
2714c84K53N26p36K66K66k9m99j02K22J50k30l29L79M12k59Q0L31k47o09R32r12
$$ y = [-150, 63, -598, 42, 478, -639, 466, 230, -13, 278, -87, 508, -151, 517, -497, 37, 55, -172, -1012, -542, -281, -51, 265, -172, -278, -4, 211, -73, 185, 44, 252, -183, -651, 227, 319, 120, -325, 998, 200, 99, 64, -407, 162, 386, -80, 302, -340, -34, -170, -404, 1024, -440, -705, 579, -224, 392, -330, -284, -500, 264, 145, 200, 464, 157, 790, -635, -437, 321, 682, -865, -116, 265, 134, 108, -804, -834, 106, -222, 74, -620, -239, 366, 289, -165, 466, -642, 151, -211, -480, -421, -186, 66, -137, -477, 57, 78, -138, 340, 176, -96, -143, -24, 29, -247, -195, -32, -254, -376, -154, -556, -239, 496, 65, 97, 97, -157, -421, -375, 675, -767, 348, -394, -494, 354, -369, -345, 21, 596, -121, -295, 547, 269, -374, -761, -149, 103, -418, -155, 3, -423, -201, -384, -131, 395, -341, -75, 191, 162, -337, -439, -217, -67, -297, -626, -247, 165, -94, -14, 317, 70, -539, 393, -519]
2735e19Q14l61m95L62J19l03P77K45j010Q97n13J74p1k71K48j48j22o1J22k5m3
2756a84N89q79j55O03j45m54Q20j50n1k2p97O05K81J00l25J6M13l94J1L11m33
2777b40j03J26M84n7R4J76k85K75j008Q63p41J390j060j45j49M36J02m08N53q83
2797e80K88J02P06j716J288j17J42k46R28m77o0m5o17J083p14M29o06L22p2J46
2817A84r46J65P77j04M7k94L51o25L56M39k74k14j30l30L71N79o44K86J71o18
2837d53N45K64m24K83n43M86o94M80j04J70J49p41J393j155J94NL13m96OL62m73
2858d33J31M45r36J126o90Q53p10o4j64O54k5k64M53K43l37o49M17j92J8j55P38
2879D59l89N58l28M5n79j49M63L85j96j058Q41J07Mk50J58o22M82K97j70j55K49
$$ y = [-519, 295, -66, -561, -199, -80, -383, 394, 639, -371, 526, 13, 187, 116, -155, 93, -55, -177, -238, -116, -141, -184, 405, -474, -629, -26, -171, -625, 195, 45, -6, -28, -825, -220, 61, 161, -164, -148, 265, -129, -118, 193, -240, -343, -217, 267, 210, 304, 480, 195, 470, -538, 325, -416, 974, -86, -231, -380, 56, 158, -250, 303, -580, -292, -190, 516, -1200, 88, -29, 113, -133, 795, 318, 258, 213, -404, 679, -35, 394, -212, 110, 38, 184, -762, -597, 180, 76, 123, -171, 180, -445, -89, 350, 76, -138, -268, -598, -227, 352, -292, -6, 165, -453, 92, 356, -68, 215, -328, 158, -536, -56, -160, 10, 159, -582, 811, -344, -150, -145, 168, -328, -322, 40, -433, -302, 143, -793, 333, -357, 496, -214, -278, -442, 212, 187, -77, 376, 619, 282, -367, 50, -142, -124, -279, 459, 70, 628, 300, 345, -234, -383, 80, 465, 269, -789, 52, 159, 163, -87, 71, -551, -69, 228, 58, -97, 152]
2900A52r16M53Q69o21L60l60q61Q83J3K4k23j90k31J38M72K6J72k85k79Q26k04
2921B18K43k64N6k37M5M53m78k63J40K05m28L08L14k38k79Q72m88n41m6P59n22
2942a71L97q28M23j31q7L2J78K27r6R21p13o38K66p5m43J249l81j45J42m82J155
2963H00j433P33k17j67J21L70l20L31L75o37M01J80j90n3Q6j85O47r68M01j41
2983A34m41l85J713j382M99l64L9J60m0m21M69O7K11j04j49p58O58o64P13q9J9
3004a15J50k21j48Q82r91N26L6K82l70l86M55j40J90O8l78J24m02j04N93m25M55
3025H1j88j26k79J095k37n91K93L10m17j56M07k49o6l27M98J14l10mK70O94j148
3046c36L65o35Q14m58K18PK16K50m12n4L69l92L55o94J026q48O72k07p60J80K46
$$ y = [152, -764, -311, 558, -63, 297, -63, -924, -41, -28, -4, -227, -417, -648, -510, -38, -12, 160, -125, -404, 422, 218, 461, 197, 253, 16, 61, 514, 36, -227, -87, 118, -310, -2, 312, 74, -205, 667, 179, -362, -408, 351, -171, 226, -602, -179, -310, -397, -365, -187, 40, -56, 865, 152, -486, -220, -295, -738, 511, 130, -15, 127, -355, 800, -633, 100, -117, -284, -163, 207, -113, 218, 593, -44, 357, 537, 347, 294, 380, 195, 842, -126, 275, 134, -307, -692, 1021, -361, 138, -226, -187, -27, -67, -488, -19, 48, 259, 155, 6, -752, -94, -758, -45, -134, -115, 35, -186, -334, 548, -443, 83, 119, 401, 31, -355, 100, -40, 150, 218, -160, -36, -438, -542, 51, -374, 81, -107, -233, -512, 583, 346, -245, 48, 358, -59, -215, 192, -57, -123, -450, 48, 162, -148, -152, 118, 812, -336, 29, -606, 208, -250, -32, -25, 191, 441, 29, -25, 344, -48, 307, -387, 639, -209, 463, 256, -504, -324, -78]
3067g8L16J61r85J258p4n08o30O93j46j2J46k35n14Q70N78l32j99q69M93l91M16
3088d2m36O26o16J011j001N24m16K13p72Q55p4M45r10K88j12J259o44k70O9j03
3108a06n21P43m69J127p24l19M25K99l41m4N16m14n66n16N02K31K16k5P65j152
3128c73Q27m97l7L4n82M66N46n68R95r06L53k86J87J19K80l95o08K20R86r99J65
3149g3L95k44L96j4r71Q71j72l12M98p68P35m86Q60n21M06j396Q21M82q41O94
3169C60k17L35q50O89l35n02N27q6L40M09p88j7J30n2k9J28K07n30N5P1J26o9
3191i8J08m57q7L03L40L10p45K48M29p59N43m60M38J96p47L61J4n6OM0o38J245
3213E34m46j66M47q22P99o61p0M35R4p54O06P3J69k6j15J26k76o36P45m51O36
$$ y = [-78, 238, 399, -586, 672, 598, 90, -540, 153, 7, -5, 141, -94, -608, 262, 840, 508, 309, -560, -67, -458, -42, -478, 148, -468, 543, -458, 66, -350, -137, -909, -54, -128, 317, -593, -305, -417, 842, 198, -72, -3, -106, -627, 116, -353, 774, 50, -269, 156, 455, 114, 70, 586, 172, -394, -910, -408, -177, 39, 14, 779, -373, 454, -43, -80, -46, -628, -162, 384, -184, 811, -95, 258, -28, 159, 278, 558, 163, -445, -225, 761, -238, -73, 322, 78, 474, 460, -511, 360, 188, -124, 374, -394, 341, -145, 715, 194, 600, -796, 25, 507, -334, 360, 143, 478, -372, 317, -18, -520, 7, -79, 261, 670, -118, -135, -5, -57, -86, 42, 249, -281, -226, -155, -29, -98, 10, -447, -534, -231, 109, 419, -326, -78, 351, -408, 135, -325, 113, 309, -438, -77, -63, -119, -113, -73, -711, 534, 88, -78, 369, -453, 346, -315, -385, 50, 144, -610, -4, 69, 238, 212, 97, 223, -53, -689, 56, -395, 241]
3234B41n3n13K06L86m71K9J60l70N29p71K73P48K06j252N23k38K58P14m79k60
3254a34Mj3M3L61l94M74q90L91j45O05m13M34m27N68o63k28M22J27J03o39K26
3275a88P22j67k71M6K62l88L02r0n07K16M07n30J7J24N55n87j14M2Q02r02J98
3296e1J11m19P76k86O4k34R5N27n44K57m84J9K67k04J11M00j042M85jp04J340
3317D83m98j15j63K71q4M77n61L59O3M2j003J031l04K77q72O64N02k2j300P98
3337D5k36P12j347J217o1o51J293q72K13l61l9R6l11k64Q29p92N15j54l91M89
3357g0M5n72M06J9p80Q45j2k83J248o63m77R46n70o31j60O65J22l85K66k30L17
3378D6l45J60n29K93L58l12Q78n91N9L28r6n41P44m96J62K23k48L32l98J57j65
$$ y = [241, 188, -325, -119, 267, -204, -175, -15, -385, 144, -627, -354, 394, 600, -652, -129, -367, -109, 605, 126, -134, -130, -143, -100, 261, -133, 341, -549, -158, -303, 302, -111, 323, -104, 464, -199, -427, -5, 122, 225, -414, -188, 534, 367, 96, 142, 404, 16, 318, 228, -279, -63, 344, -186, -169, -45, 510, -77, -191, -149, 653, -249, -51, 60, -359, 417, 131, 195, -39, 56, 583, 39, 296, -188, -169, 98, -106, 5, 405, -637, -152, -153, -857, 483, -15, -130, -293, -22, -106, 371, -190, 169, 232, 274, -729, 302, -2, 275, -597, 67, 569, 547, -753, 45, -191, 521, -826, 391, 330, -321, 972, 100, 313, -48, -87, 9, -302, -566, 263, -529, -14, -168, -559, -70, -25, -597, -191, -172, -952, -107, -119, -402, 846, 183, -294, 652, 82, -549, -709, -44, 78, -307, -41, -271, 46, -299, -139, -668, -375, -17, -329, 549, -42, 17, 345, 249, -292, 452, -44, 118, 341, 93, 425, 27, 184, 19]
3399A9J17j15p3n16N61k14o4l26J110j00l5o49M92o11L74J1o27L91L30M4l32m33
3421f46M82Q74j104M20j86L12r02J019j09j50J30q7n21L76K77Oj110R55L68n19
3441a15J73L38Q8p83k18O55O54j62j584N99Q78k48r8J26k00R7m45J20L6m6N53
3462D18l53n6Pj02Q5k0o8l6M5M64o95L42M5o79M76o13J442n72J29j10p2P6k2P92
3486I23q67K71o47k51J87N2P02k63K21n38K03J03J64J49n35k55M0J65K42N15J35
3507G16j097l9O92j38L37K35m50J48m79J2N51k89o01O76j92j10r7J34M18q11J065
3528F81o95l12l4M93l62J84l69J69M81L28j168O98J31n60R23j081Q24j57k54J24
3548D4n0j91n4L03n30J214l85m23j04J65M6pN82j1m11j26l61L40J29p75M06M38
$$ y = [19, 136, 21, -52, -568, -7, -221, -285, -611, 499, 399, 364, -285, 207, -404, -30, -19, -646, -255, 75, 119, -213, -646, -164, 710, -394, 26, -160, 152, -750, 269, 160, 10, 140, 53, -468, -92, 185, 191, -919, 36, 404, -115, 58, 396, 484, -299, -517, 138, 792, 630, -954, -355, 523, 275, 177, 303, 103, 200, -245, -125, -89, -135, 418, 65, 9, 16, -86, -1, -21, -89, -125, -80, 384, -311, 31, 76, -603, -127, -740, 702, 130, 259, 149, 77, 153, 131, 923, 56, 327, -320, -571, -384, -332, 370, 107, 328, -210, -7, 96, 260, 409, -126, -381, -341, -176, 66, 581, 716, -381, -420, 272, 134, 471, 706, 256, 404, -75, -63, 488, 199, -402, 274, 82, -28, -125, 9, 427, -384, 681, -14, -326, -360, 133, -229, -45, -414, -245, 236, 564, -604, 94, 225, -335, 588, -493, 331, 174, -80, 44, -6, -197, -251, 52, -478, 736, 351, -72, -176, -11, 35, 28, 610, 599, 188, 62, -299, 41, 170, -605, -199, 239]
3570B39k70K15m83q10J240k53n23Q19j0j40M76K16m64o55P24k06m89P19n86J52
3590h9l15o16P94ON64k43J0k68L53J19n48lJ048k54n48L03k23m29QM63l3j71K50
3613A78m88K06m08P93n72l95K29M28km78M96M78p24K02l9j64l00P44J11o45N57
3634B07K07p57l7O11K85p40K01l42M71M82r0o24M41n56o40P93m4M40K6n0r9j44
3656D1k95M48M12p66k07N48o6n77P02j94k30L82j9J09M3l64n1P18k35k71r6M9
3678H1j17m10M49L51o31p7P85k81m04K80N40o19pj29L66J21o17N9N37K54k71j81
3700G9K24l67P4k2N2n31K11K77l59K45J04n7K92j33j93M30l72k46M7k39N13l21
3722b92O32k35J60l15J90K96o93l2M02j43K32l1l07M21j97p47K77J028j007p3
$$ y = [239, -31, 184, -299, -1109, 131, -122, -645, 174, 164, 24, 500, 716, 252, -403, 321, 115, -374, 345, -241, -89, -404, -1020, -226, -220, 344, 101, 111, -157, 196, 315, -233, -236, 812, 558, 10, 313, 90, -339, -331, 132, 99, -72, 178, -310, -104, -512, 281, -291, -686, -457, -29, -31, -509, -13, 465, -259, -57, -96, -260, -560, 184, 295, -350, 207, 414, -343, -380, 231, 516, -224, -23, -365, 106, 588, 498, -126, 315, -241, -881, -88, -132, 308, 334, 284, 185, 41, -254, 194, 606, -160, -367, 181, 115, -462, 240, 46, -184, 198, 179, 288, 331, -33, -84, 634, 399, 128, 32, 81, -36, -446, 3, 354, -277, -354, 431, 150, -254, 26, 566, -53, -60, -189, 177, 298, -319, -260, 277, 531, 260, 79, 303, -64, 10, -12, 40, -491, -280, -3, -362, -117, -13, -70, 222, 89, -104, 326, -46, -292, -245, -484, 29, -292, 340, 105, 265, -50, 140, 436, -257, -289, 113, -30, 202, 171, -136, 285, 88, -659, -382, 646, -361, -434]
3742d34J85J19Q7m6l44R58m97J82O00o52r80R66L13o78L49K0m37j0l0P36k56K44
3764C95o91M17l87O07q30M85L24K18m78k23L58p9L9K65j37o77K11N69p9p96Q0
3785d09q6Q17N59p15l85P78k65q96Q68N49j638N33J03K6J20K6O4J10J4k17n34
3806e78O73k38p0j38J071p11m59pL95J60L37l99J26m93L77m58M47K21J77o00L54
3827A87N13q45M64K23n67m23K29N53o67j79O42o90N17K2L33k65l27L90k62l7J14
3848g5j42L48J74l42K26J73n07K56Q7n6r4K05N51p67m30j18j75J047k28j92pp69
3870h35J242j2l93J57j93M82n19K4K48J37r62O75l59J462q85k27M97n51k28M02
3890A62o86J143k06r55j72R03R1n56O18n03K78J41n22m77J199r20k07Q86p74N85
$$ y = [-434, -249, -130, -43, -89, -433, 525, 28, 210, 810, 158, -822, 144, 457, -221, 128, 148, -289, -299, -329, 407, 151, 395, -296, 121, -266, 341, -489, -4, 320, 538, 60, -163, 195, 116, 155, 420, 283, -394, -183, 386, 307, -489, -409, -495, 322, 881, 166, -219, 559, 294, -602, 266, 815, -823, -290, -187, -161, -41, -15, 49, 159, 173, -44, -578, 95, -143, -213, -351, 720, 9, -450, -457, -62, 98, 435, 36, 162, -331, 46, -412, 35, 256, 433, -167, 187, 700, -145, 319, 542, -25, -448, -219, 334, -333, -512, 130, -560, -43, -21, 312, 47, -280, 110, -152, -189, -75, -217, 131, 305, -37, 189, 362, -145, 111, 198, 142, 48, 253, 804, 37, -393, -511, -686, 361, 133, -59, -66, -835, 407, 395, 2, 159, -34, 448, -71, -47, 201, 338, -624, 51, -308, 1154, 269, 42, 539, -12, -240, 162, -524, 619, 413, -542, -714, 189, 280, -276, 342, -161, 117, 258, -264, -741, 458, -462, -669, 217, -557, 28]
3910B8J49L57n26p96O71p7k5P19m44N52o07L0K91r40M50M14k86R6j43J65j17M3
3932Dl05N96j71O3J5J37q61L75L68N23l04l92l35j61Q19r68J568j605N24M90k36
3953A44n79P29l02k50j54J597q36J15l41j11k57L93l08J059j301K14L69m7n64
3972d30M59NK38j023L42M01Q7J36m61N87l02N66l02l16J135j328P44o35K16oq51
3993g38R10K04m59K11o08J361p40m26R28j108j59m4N96O4pj30l50M2P60l07M03
4014D03m81K89L3m24N9n9J03P2o67O98k05j47N65P3j01r7k89k35N79n29J420j386
4036c26J50K7l48J91J10M87m58K00j56M19n11j53N79k69j69M43m98P73q71L07
4056g3n06k61J027r2j94M32K30m05l22J75K2L21p84k85Q16J10p1l33L83L64m82
$$ y = [28, 177, 534, 8, -788, -117, -194, -219, 500, 56, 608, 1, 31, 322, -618, -168, 246, -40, 56, -87, 78, -39, 4, -301, 295, 124, 187, 202, 339, -522, -147, 221, 744, 440, 48, -287, -448, 371, -597, 971, -634, -110, 380, 144, -435, 294, -8, -258, -412, 1185, 349, 464, 123, 12, -245, 148, -160, 899, -402, -188, 181, 134, -430, 29, 34, 272, -751, -409, -8, 79, 215, -246, 341, 39, 605, 303, -13, 1122, -206, 538, -97, 119, 113, -738, 172, 376, -83, 128, -480, 881, 141, -285, 643, -465, -624, -668, -72, -8, -15, -145, -495, -453, 307, 0, 403, -78, 211, 244, -180, -121, -180, -77, -5, -672, 26, -179, -326, 239, 312, 211, 114, -175, -410, 169, -360, 1060, -326, -176, -149, -497, -306, -196, 291, -167, 33, -123, 296, -215, -368, 211, -58, -227, 216, -282, 491, -380, -73, -579, -840, 187, 95, -99, 333, 563, 158, -164, 11, 33, 354, -430, -715, 101, 211, 140, -193, 190, 554, 72]
4077G2J19j041M9J224J07l95l19Q32m45n35O40r53M25L60n63O01k54N88n27m06
4097d21O8K21K73M42o40N2m60M19L66k98k50M5P4R3K11l99K73l71N16j138Q68
4118e6J48k15k89P0Q0o2L89K0m78P54j68J0n87J169j050N41l21L61R6o1M40m47
4140C44J0l15k24K98m02p7K67m37P63q9qj024Q86J0K74j032P21l00K2l0L46k11
4162b08N55O57j232K93K1M58j100K02O46l95K05j85j84K26L83n97j28J74K74M10
4182D75k77m14J7M23j097R98J62r52P30J3j91R3n1n6j80o58J258o03K79o27K76
4203c82k25N32k00K22L17j89l77l72M36P10q57K28l22N58R3K6Ll48N16r64O04
4224Ik11O8K7j6l25R51j259J016Jm5n72P23m88J35K48m38K76k37K35O69j246N57
$$ y = [72, 191, -850, -801, 423, 530, 135, -184, 648, 203, -332, 308, -645, -220, 140, -423, 178, -76, 512, -15, -421, -353, -132, 141, 583, -57, -5, -465, -46, 320, 22, -228, -183, -109, -16, 195, -204, 69, -302, 214, -924, -56, 92, -123, -412, -342, -262, -324, 65, 85, -393, 361, 193, 203, -384, 785, -265, 276, -45, 316, 412, 351, 791, 344, 354, 39, -185, 113, -289, -366, -99, -536, 227, 138, 130, -894, -8, 2, 276, -756, -35, -335, -313, -343, 3, -208, 347, 1004, -228, 65, 86, 544, -556, -354, 292, -103, 102, -83, -267, -41, 342, -255, -383, -209, 65, 475, 198, -216, -199, 224, -873, 125, 287, -665, 65, 78, -113, -20, -71, -127, -307, -965, 293, -310, -31, -658, -382, -607, -75, -275, -53, 264, 75, -302, -674, -238, 472, -385, -157, -479, 79, 172, 198, 201, -147, 369, -595, 9, -202, -134, -107, -123, -448, 503, -756, 260, 261, 216, -356, 367, -121, 14, 262, -176, 100, -137, 98, 767, -479, 78]
4246G8L28L08l94j75l88o95P23P1K85k2M35l85K46n60l13m75N42P89k81n07l3
4267d23P40o56M99l93K59j42j16L88k67J67l66O54J9O5j02n29J22K22K15j090
4287g34Q24Q24j091N91o36M07J04n47K33N12r6n81K97M35j179N56L67n43O27o69
4307b99O33l63k53J22k49m6q4J035k16m86o8P4j40n9K50K59K04l06l1%n49Q64
4329B92l64O86o36m13O16K41k83J03n1o33Q17l29k64J21j98K33k04Q7m74L87o46
4350i12R10K57j84lN71p26L96n15l7L46n5n80Q16k3n33K56J84m1J3l5N84j167
4372d78P21n77L73j60L13K40r43O64l93J76r69R50L75m96k69K66l41N28J5k51
4392b56M25m14M40j71j59L78kj13p5l8k97k87Q47M24j177L83o5j11L53p16Q66
$$ y = [78, 406, 714, 320, 145, -243, -938, -215, -144, 141, 119, 554, 169, 415, -145, -458, -933, -391, 398, 117, -390, -423, 317, -339, 160, -233, 26, -116, -232, 156, -111, 56, -310, 344, 363, 428, 326, -203, -81, 141, 356, -734, 90, 914, -177, 414, -222, 185, 289, -258, -25, 487, 391, -190, 107, 542, -637, -81, 286, -257, 370, -299, 334, -29, -282, -160, -409, -455, -539, 496, 280, -206, -274, -200, -340, -399, -149, 110, 314, 8, -23, -23, -572, 292, -72, 614, -22, -435, 181, 422, 139, 242, 191, -442, 375, 46, -218, -97, -295, -62, -266, -179, -653, -266, -912, -2, 255, 71, 68, 639, -87, 309, -206, -243, 103, 48, -532, 284, 261, -272, -16, 168, 127, 140, 105, 689, -478, 243, -334, 39, -121, 192, 432, -511, 153, -240, -64, -1033, -83, 292, -204, -473, -207, -548, -20, -5, -256, 169, -245, 195, 24, -135, 243, 241, 128, 53, 15, -282, -569, 278, 702, -475, -92, -157, -268, 85, -631, 235]
4413B35l6j34k77n0R4J93o10M59l33N14L19P2K23j364J256p94M7N67k74m49l9
4434c81j63J483o65k07k29J10L21m51L3Qn3J75J90j95L30j10r9q6o69m2L97Q92
4456E89k59l40J28K31k09P72j109l55Q56m06L36o94J71K04n70J050r86R48p55
4475c98M96J2k67J64m90L38n60R97l33M7K47j020R21Q09j103j11M95q69P16N6
4495A47j166J307j67K3K87j126L33n8M60Rl6j80m24Q65l82n8k3J51N3j33k60N89
4517B11n35K48L91k13o61R32o12K16J30j64J58l64k27Q81l65m17L07m6j26P06
4537D50j005P55q23Q01l64P73n27l95M59r04J035p87J272j428k4P98M00N8l42
4556B02J99j040M54N32m87k13l01P82j034O89P77n32m91P99n01M17Ol43p84O87
$$ y = [235, 199, 65, -212, -262, -168, 25, -585, -126, -459, 55, 374, 446, 669, -695, 561, -233, -186, 381, 107, -342, -381, -544, 939, 274, 67, -162, -52, 269, -182, -149, -141, -194, -19, 171, -24, 306, 196, 97, 11, -658, -700, -303, 589, 330, -10, 118, 349, 140, 912, -197, -552, 304, -102, 234, -460, -289, -85, -655, 395, -591, 357, -398, 98, 110, -157, 7, -483, -145, -705, 292, -41, 6, 253, -767, 154, 963, -140, -251, 244, -625, 91, 147, -1019, 288, 121, 144, 431, -695, -362, -420, 40, 49, 13, -167, -591, 274, -108, -166, -189, -38, 15, -118, -378, 211, -324, -76, 315, 102, -559, 373, -239, -23, 107, -57, 101, -263, -490, 391, 26, -391, -84, -130, -256, 450, -555, 200, -623, 178, -186, 587, 60, -335, 124, -780, 255, -532, 740, -688, -712, 86, 486, 544, 202, 401, -639, -185, 347, -140, -353, -654, 128, -906, -217, 560, 28, -463, 336, -165, 252, 258, -85, -869, -182]
4576a82K88k88M8J11r39N84k91P08J96m00M74j79m6j15m25R51l68O0n58P16o20
4597b75M20p5p92O26K80o46M62q7l55OJ82J89J66o34K56P09r4o6n49l36P53n56
4619d16O45q61J099K24o47o65J34P41m72N23PK62n64J58K5j3L77k70J74o89K21
4640gk10J37q01Q40k07m00O06m96J29Q22o32P45p6J6q49j9m9J74P09l04j50l72
4662c94L29Rj0M72l08M41k56O97r53M47k00o73j37L51L23k62J32L4k00K55j47
4683e0l53M81p51Q58n97J35L7N57o9q38L68j27L70J76m11L18l61j87L78l09P96
4704D21j19L26o5n65O46o53J54n3o25J56O62j47m18K34m32O92k26J35k00l58N38
4725A03L24n47k71J96K33N26j166M73r2L5p77P85L15L37n59j81K56j4J37r0O20
$$ y = [-182, 106, -182, -134, -23, -962, -378, -669, 39, 235, -165, 309, 130, 84, -31, -456, 495, 127, 187, -371, 345, -275, 145, 70, -722, -96, 184, -462, 0, -87, -442, -436, -254, -65, 101, -533, -277, 432, 338, 272, -277, -613, 140, -416, 229, -632, 467, 691, 44, -621, -487, 254, -218, 305, 312, 574, 10, 168, 193, 180, 557, 287, 461, -228, -7, -217, -80, -881, -41, -248, -648, -42, -538, -409, 413, -219, 526, 450, 466, -383, -402, -451, -277, 432, 128, -22, -394, -65, -56, -66, 406, 98, 539, 283, 980, 27, 474, 274, -399, -536, -185, 138, -124, 8, 42, -158, 97, -50, -403, 78, -673, 185, -412, -277, -240, 317, 248, -590, -222, -349, 21, 197, -214, 104, -257, -444, -66, -375, 421, 302, 628, 563, -2, 644, -9, 145, 92, -533, -377, 285, 138, -280, -46, -478, 214, -12, 123, -77, -435, 103, 427, -120, -391, -195, 38, 564, -602, -129, -221, -186, -963, -178, 137, 474, -85, -266, -10, -24, 113, 23, 643]
4746F43p20J06m86P69j68R7p00J93K69k3J31m2j73J75K09k10k07L89l72L49o72
4767d43L24K4JJ14j94M3M33j013P45K29p75J41j36Q16o8p46O25p48L51J95J31
4788D9M29k43k77N74m16M97l45m4N79q11QN61o63j49M74j28q35J097J25K34l4
4809F82q67k93L60K67n61N33o15R37l10K51n16O20n76n59N81J6q97P27p0L79O06
4830F95p61M67l83l29L8O49q74L62O08p4k3k69m15N26p23J285m88j15J86r7m13
4851a48L44L32l86j02J28O48j44m51n43M83m53N18O7l44l11M40k04KQ10q25K69
4872A30j13L4k15P55k56p49M78k71k3O14j505Q94K94k37K57K10l51L21o5M71p62
4893h9l65j7m29J077o75M56J69l77Q26l35o12N56l68Q34n43n94n7l9n7L53K47
$$ y = [643, -77, 29, -457, 312, 144, 241, -459, -266, 3, -20, 111, 69, -104, 71, 280, 70, -137, 252, -120, 229, -443, -119, -95, -94, 20, -174, -131, 302, -711, 34, 263, -512, -371, -507, 309, 241, -505, 120, -628, -277, -82, 49, 478, 235, -42, 532, 116, 613, 268, 224, 803, -8, 0, 561, -102, -251, 223, 95, -740, 357, 482, 716, 682, -185, -478, -118, 149, -412, 121, -494, 443, 133, 384, -132, 488, -88, -647, -66, -50, -947, -220, -290, 89, 695, -66, 401, 18, -311, -273, 376, -498, -136, 472, 398, 375, 106, -309, 217, -506, 779, 291, 176, 362, 265, -148, 196, 528, 142, 40, 168, 816, 672, 221, -322, 161, -292, 226, 293, -51, -362, 78, -126, -124, 686, -139, 130, 17, 51, -164, 591, 335, -414, 64, -207, -230, 384, -1121, -227, 67, -170, 87, 297, -54, 267, 202, 673, -89, -454, -471, -900, 177, -498, -42, 127, -250, 576, 241, -371, 185, -183, 651, 108, -486, -543, -582, -639, -286, -39]
4914c9L69K28k96l27p5L78p46J176r10M99n19n25R87k27r6M07Kj44j45n67P24
4935A54o4N30M50j439L95q1J59k08j24j5P72o72J45j13l50l04J360n90pr9k14
4956c15N59l27Q65k98m49M06J71l57k4l89M80p23M05o63J068j74m00N58o38K60
4976A5K61j22m63O4K17J59l2p59N46L16j09q95J86L28K15J24l00n91J078j92q1
4997c5mo08M79Q8J354j789N04L24m33kJ84l57L96m34P80n00n42N98K75k8m62K44
5019C2j95Q65m67m36M24j44j95J16j89K00j78P16l42k99Q6J46o29P64K62J89j038
5040c12P00o53K83J21o36P59k60L34k73l36N29l64j1L17n76J88m63J228o89J36
5060B2j23L47n89P13n57N57M8l33O15n12J52n84O04l36K00k28L57n68m07M02O11
$$ y = [-39, 330, 558, 262, -65, -140, 238, -508, 668, -242, 257, -262, -787, 200, -27, -123, 284, 286, 142, -3, -570, 154, 90, 620, 1070, -369, 26, -55, 104, -104, -228, -243, 529, -143, 2, -111, -461, -765, 595, 5, -2, -101, -315, 244, -83, 782, 484, 35, 441, 612, 255, 231, -158, 322, -401, 4, -659, 409, 235, -165, 393, -245, 15, 276, 154, -309, -245, -28, 131, 99, -660, -114, 202, 93, -802, -616, -288, -73, 51, -249, -840, 238, 46, -35, -39, -647, -168, -80, 1274, -515, -11, 313, -120, -122, 62, -295, 101, -333, 447, -53, -595, 3, 278, 250, -212, 32, -163, 702, 235, -201, 223, 79, -116, 0, -189, 11, -167, 549, 207, -92, -6, 140, -489, 275, 537, 726, -312, 388, -265, 18, 139, -497, 262, 2, 336, 63, -273, 256, -108, -119, 198, -378, -190, -653, 575, -114, 22, -101, 246, -343, 370, -187, 370, 418, 85, 700, 188, 340, -244, 360, 24, 224, -4, 353, -215, -622, -220, 391]
5081C91p77R4K08l62j06k91J035q11O60M59n53J36k25l62o3P8L22M15j87j24k05
5102b68L89k72N01k8q02N33l72O27K76P4r39J21K41J41o91L28J26k88J57K22M21
5123D97m56j24m8j06N34r71M74Q6L18m03N63j11j65N06k63q5k45N01Nl62K05r12
5145e62M72K97l82o8O96j8j009O86J86l75O23l79n64O76K60M40p02m95o63K40
5165f41N44k92P3N53n59J36L81n9l71M65M46k98j31N7o7k00P9N2M21q11M59J31
5187C68J40p79N52L63j72r95P9K88l79P23K99k56m98m5M17o52J19J128n80K35
5207C55m33K24k19L0O87o16n69k12P67p61Q41K3l69j03J066j094K35M77k13Q0
5227A96l63J95N07m28p22M4J9Q41p17K15q8M79p57O54j38j35J38n96q2M46O55
$$ y = [391, -386, -292, -84, -446, -552, -843, 192, -619, 41, 500, -53, 83, -142, -504, -567, -489, -167, 248, 61, -63, -268, 121, -151, 350, 322, -480, 53, -319, 308, 584, 658, -281, -160, 81, 222, -469, -141, -15, -303, -146, 76, 497, 41, -83, -131, -237, 297, -674, -200, -114, 204, -199, 364, 253, 88, 594, 331, 246, 1, 502, 507, 145, 350, -562, -90, 207, -175, -243, 453, 435, -574, 112, 298, -77, 546, 167, -397, 279, 539, 979, 277, -218, -881, -641, -97, -389, -316, 237, -322, -186, 195, 136, -235, 230, 676, 378, 247, 304, 237, 37, 116, 168, 589, -222, 237, 368, 508, -271, 281, 644, 472, -523, -444, -156, -535, 188, 487, 231, -267, -312, 105, -547, -428, 700, 120, 355, -78, 146, -73, -43, 644, 28, -541, -753, 14, -747, 94, 117, -252, -355, 711, -383, -148, 329, 116, 196, -167, 28, 535, 107, -615, -571, -552, 289, -428, -213, -301, 178, -579, 75, -63, -198, -60, -656, -738, -292, 363]
5248C63Mj39j33l59Q4L7p3L6r0L32l81L31N3r48R89p05L43Q47m72j06K44j34l57
5271b34J1J059j112K32m81M01M92n37M10q80N21O1K33n22N29M22n14m88L82k77
5291b92M77J93j158J092l23R8O4N6Mk84M27j081O02P13q82L02n36L39k76K72k39
5312d32L67K01o00N69n83J63O39j17N3N67l31j188L59l03p8J192j48n65J45M79
5332C89o58O04l20k02J59r6k3K67p30Q77k03l2J08m50j70N94j74n4l06R42n04
$$ y = [363, 367, 228, 95, -264, -180, -143, -216, -180, -270, 62, -319, 12, 65, -883, 106, -599, -256, 591, 119, 13, 257, 123, -234, -223, 836, -276, -44, -525, -124, 368, -169, 241, -639, -118, -57, 176, -346, 183, 605, 91, -397, -15, -292, 185, 378, -780, 312, -11, 87, 151, 207, 211, -73, 354, -727, -125, 588, -294, 8, -528, -189, -465, -193, -432, -65, 136, -464, 105, -478, -315, 324, 207, 260, 827, 496, -692, -333, -636, -714, 478, 330, -235, -90, 389, -269, 335, 15, -187, -28, -124, -147, 120, -610, 267, 64, 32, 140, -310, -480, 114, -60, -114, -420, 522, 18]
$$ [...]
8191a10
##END NTUPLES=NMR FID
##END=
