##TITLE=1H_SR164_k
 DMSO-d6
 64 sc, 
 9.2.2023
##JCAMPDX= 6.0         $$ Bruker NMR JCAMP-DX V2.0
##DATA TYPE= NMR FID
##DATA CLASS= NTUPLES
##ORIGIN= UXNMR, Bruker Analytische Messtechnik GmbH
##OWNER= root
$$ XWIN-NMR		Version 3.5
$$ Thu Feb  9 15:53:26 2023 Russian Standard Time (UT+4h)  she@DPX200
##.OBSERVE FREQUENCY= 200.13135
##.OBSERVE NUCLEUS= ^1H
##.DELAY= (6, 6)
##.ACQUISITION MODE= SIMULTANEOUS
##.ACQUISITION SCHEME= undefined
##.AVERAGES= 64
##.DIGITISER RES= 18
##SPECTROMETER/DATA SYSTEM= spect
##.PULSE SEQUENCE= zg30
##.SOLVENT NAME= DMSO
##.SHIFT REFERENCE= (INTERNAL, DMSO, 0, 15.7039)
##AUDIT TRAIL= $$ (NUMBER, WHEN, WHO, WHERE, WHAT)
$$ ##TITLE= Audit trail, XWIN-NMR		Version 3.5
$$ ##JCAMPDX= 5.01
$$ ##ORIGIN= Bruker BioSpin GmbH
$$ ##OWNER= she
$$ F:/spectra/data/she/nmr/H-F/1/audita.txt
$$ ##AUDIT TRAIL=  $$ (NUMBER, WHEN, WHO, WHERE, WHAT)
(   1,<2023-02-09 15:52:27.93 +0400>,<she>,<DPX200>,
      <continue with go, POWCHK disabled, PULCHK disabled
       configuration hash MD5:
       00 E9 B6 7A A2 85 ED C7 34 08 36 98 17 FE 4E 26
       data hash MD5: 16K
       D9 AB 1F 80 82 2F 99 89 A7 83 E3 B9 4F 25 6D 32>)
$$ ##END=
$$ 
$$ hash MD5
$$ 05 82 B9 09 55 6F E4 02 8F 57 F9 67 69 62 C0 D7
##$RELAX= 
##$RELAX= 
##$RELAX= 
##$RELAX= 
##$RELAX= 
##$RELAX= 
$$ Bruker specific parameters
$$ --------------------------
##$DU= <F:/spectra>
##$EXPNO= 1
##$NAME= <H-F>
##$PROCNO= 1
##$TYPE= <nmr>
##$USER= <she>
##$AMP= (0..31)
100 100 100 100 100 100 100 100 100 100 100 100 100 100 100 100 100 100 
100 100 100 100 100 100 100 100 100 100 100 100 100 100 
##$AQSEQ= 0
##$AQ_mod= 1
##$AUNM= <au_zg>
##$AUTOPOS= <>
##$BF1= 200.13
##$BF2= 200.13
##$BF3= 200.13
##$BF4= 200.13
##$BF5= 200.13
##$BF6= 200.13
##$BF7= 200.13
##$BF8= 200.13
##$BYTORDA= 1
##$CFDGTYP= 0
##$CFRGTYP= 5
##$CHEMSTR= <none>
##$CNST= (0..31)
1 1 145 1 1 1 1 1 1 1 1 1 1 1 1 1 1 1 1 1 1 1 1 1 1 1 1 1 1 1 1 1 
##$CPDPRG= <>
##$CPDPRG1= <>
##$CPDPRG2= <>
##$CPDPRG3= <>
##$CPDPRG4= <mlev>
##$CPDPRG5= <mlev>
##$CPDPRG6= <mlev>
##$CPDPRG7= <mlev>
##$CPDPRG8= <mlev>
##$CPDPRGB= <>
##$CPDPRGT= <>
##$D= (0..31)
0 1.2 0 0 0 0 0 0 0 0.06 0 0.03 0 0 0 0 0.0002 0 0 0 0 0 0 0 0 0 0 0 0 
0 0 0 
##$DATE= 1675943310
##$DBL= (0..7)
120 120 120 120 120 120 120 120 
##$DBP= (0..7)
150 150 150 150 150 150 150 150 
##$DBP07= 0
##$DBPNAM0= <>
##$DBPNAM1= <>
##$DBPNAM2= <>
##$DBPNAM3= <>
##$DBPNAM4= <>
##$DBPNAM5= <>
##$DBPNAM6= <>
##$DBPNAM7= <>
##$DBPOAL= (0..7)
0.5 0.5 0.5 0.5 0.5 0.5 0.5 0.5 
##$DBPOFFS= (0..7)
0 0 0 0 0 0 0 0 
##$DE= 6
##$DECBNUC= <off>
##$DECIM= 32
##$DECNUC= <off>
##$DECSTAT= 4
##$DIGMOD= 1
##$DIGTYP= 9
##$DL= (0..7)
0 120 120 120 120 120 120 120 
##$DP= (0..7)
150 150 150 150 150 150 150 150 
##$DP07= 0
##$DPNAME0= <>
##$DPNAME1= <>
##$DPNAME2= <>
##$DPNAME3= <>
##$DPNAME4= <>
##$DPNAME5= <>
##$DPNAME6= <>
##$DPNAME7= <>
##$DPOAL= (0..7)
0.5 0.5 0.5 0.5 0.5 0.5 0.5 0.5 
##$DPOFFS= (0..7)
0 0 0 0 0 0 0 0 
##$DQDMODE= 0
##$DR= 18
##$DS= 0
##$DSLIST= <SSSSSSSSSSSSSSS>
$$ [...]
##$SUBNAM2= <"">
##$SUBNAM3= <"">
##$SUBNAM4= <"">
##$SUBNAM5= <"">
##$SUBNAM6= <"">
##$SUBNAM7= <"">
##$SUBNAM8= <"">
##$SUBNAM9= <"">
##$SW= 18.05172834244
##$SWIBOX= (0..15)
0 0 2 0 0 0 0 0 0 0 0 0 0 0 0 0 
##$SW_h= 3612.71676300578
##$TD= 16384
##$TD0= 1
##$TE= 0
##$TE2= 300
##$TE3= 300
##$TEG= 300
##$TL= (0..7)
0 120 120 120 120 120 120 120 
##$TP= (0..7)
150 150 150 150 150 150 150 150 
##$TP07= 0
##$TPNAME0= <>
##$TPNAME1= <>
##$TPNAME2= <>
##$TPNAME3= <>
##$TPNAME4= <>
##$TPNAME5= <>
##$TPNAME6= <>
##$TPNAME7= <>
##$TPOAL= (0..7)
0.5 0.5 0.5 0.5 0.5 0.5 0.5 0.5 
##$TPOFFS= (0..7)
0 0 0 0 0 0 0 0 
##$TUNHIN= 0
##$TUNHOUT= 0
##$TUNXOUT= 0
##$USERA1= <user>
##$USERA2= <user>
##$USERA3= <user>
##$USERA4= <user>
##$USERA5= <user>
##$V9= 5
##$VALIST= <valist>
##$VCLIST= <CCCCCCCCCCCCCCC>
##$VD= 0
##$VDLIST= <DDDDDDDDDDDDDDD>
##$VPLIST= <PPPPPPPPPPPPPPP>
##$VTLIST= <TTTTTTTTTTTTTTT>
##$WBST= 1024
##$WBSW= 4
##$XGAIN= (0..3)
0 0 0 0 
##$XL= 0
##$YL= 0
##$YMAX_a= 611326
##$YMIN_a= -971946
##$ZGOPTNS= <>
##$ZL1= 120
##$ZL2= 120
##$ZL3= 120
##$ZL4= 120
##$ABSF1= 10
##$ABSF2= 0
##$ABSG= 5
##$ABSL= 3
##$ALPHA= 0
##$AQORDER= 0
##$ASSFAC= 0
##$ASSFACI= 0
##$ASSFACX= 0
##$ASSWID= 0
##$AUNMP= <proc_1d>
##$AZFE= 0.1
##$AZFW= 0.1
##$BCFW= 1
##$BC_mod= 2
##$BYTORDP= 1
##$COROFFS= 0
##$CY= 11.3945322036743
##$DATMOD= 1
##$DC= 2
##$DFILT= <>
##$DTYPP= 0
##$F1P= 2.36226072786647
##$F2P= -0.459571619588291
##$FCOR= 0.5
##$FTSIZE= 0
##$FT_mod= 4
##$GAMMA= 1
##$GB= 0.15
##$INTBC= 1
##$INTSCL= 1
##$ISEN= 128
##$LB= 0.24
##$LEV0= 0
##$LPBIN= 0
##$MAXI= 10000
##$MC2= 0
##$MEAN= 0
##$ME_mod= 0
##$MI= 1.114404
##$NCOEF= 0
##$NC_proc= 0
##$NLEV= 6
##$NOISF1= 3.799351
##$NOISF2= 2.8
##$NSP= 1
##$NTH_PI= 0
##$NZP= 0
##$OFFSET= 15.70392
##$PC= 1
##$PHC0= -19120.29
##$PHC1= 19.20078
##$PH_mod= 1
##$PKNL= yes
##$PPARMOD= 0
##$PSCAL= 0
##$PSIGN= 0
##$REVERSE= no
##$SF= 200.130013532006
##$SI= 16384
##$SIGF1= 3
##$SIGF2= 2
##$SINO= 400
##$SIOLD= 16384
##$SREGLST= <1H.CDCl3>
##$SSB= 0
##$STSI= 0
##$STSR= 0
##$SW_p= 3612.71676300578
##$SYMM= 0
##$S_DEV= 0
##$TDeff= 0
##$TDoff= 0
##$TI= <>
##$TILT= no
##$TM1= 0
##$TM2= 0
##$TOPLEV= 0
##$USERP1= <user>
##$USERP2= <user>
##$USERP3= <user>
##$USERP4= <user>
##$USERP5= <user>
##$WDW= 1
##$XDIM= 8192
##$YMAX_p= 0
##$YMIN_p= 0
$$ End of Bruker specific parameters
$$ ---------------------------------
##NTUPLES= NMR FID
##VAR_NAME=  TIME,          FID/REAL,        FID/IMAG
##SYMBOL=    X,             R,               I
##VAR_TYPE=  INDEPENDENT,   DEPENDENT,       DEPENDENT
##VAR_FORM=  AFFN,          ASDF,            ASDF
##VAR_DIM=   8192,          8192,            8192
##UNITS=     SECONDS,       ARBITRARY UNITS, ARBITRARY UNITS
##FACTOR=    0.0002768,     1,               1
##FIRST=     0,             0,               0
##LAST=      2.2672688,     0,               0
##MIN=       0,             -971946,         0
##MAX=       2.2672688,     611326,          0
$$ Real data points
##PAGE= N=1
##DATA TABLE= (X++(R..R)), XYDATA
$$ plain form
0 0 0 0 0 0 0 0 0 0 0 0 0 0 0 11 -64 64 -64 64 -89 128 -128 192 -192 256 -257 320 -384 448 -512 577 -644
31 -644 749 -839 963 -1087 1222 -1363 1535 -1718 1913 -2129 2366 -2624 2906 -3216 3551 -3922
47 -3922 4324 -4765 5249 -5784 6374 -7024 7752 -8560 9478 -10522 11715 -13105 14739
60 14739 -16700 19098 -22120 26061 -31423 39193 -51555 74327 -130560 597503 474526
71 474526 -384225 320958 611326 373547 81767 201686 176745 113553 5156 61992 86404
82 86404 -33826 -311513 -335912 -188337 -113732 -241167 -316004 -237082 -53989 -81755 -264295
93 -264295 -260462 -21527 10312 -137137 -97946 101018 121257 44267 71185 173436 222424
104 222424 187444 75447 52869 192972 247443 73965 -36611 57743 101699 -24292 -91365
$$ packed form
0@%%%%%%%%%%%%%J1p5J28j28J28j53K17k56L20l84M48n13N77p04Q32r60J089j221
31f44J393j588J802k050K309k585K898l253L631m042M495m990N530o122O767p473
47c922Q246r089J0014j1033J2158j3398J4776j6312J8038k0000K2237k4820K7844
60A4739l1439L5798m1218M8181n7484P0616r0748J25882k04887P28063j22977
71D74526q58751P05183K90368k37779k91780J19919k4941o3192j08397N6836K4412
82H6404j20230k77687k4399J47575P4605j27435p4837P8922J83093k7766j82540
93b64295L833K38935L1839j47449L9191J98964K0239p6990K6918J02251M8988
104B22424l4980j11997k2578J40103N4471j73478j10576R4354M3956j25991o7073
$$ plain form
115 -91365 -9357 51269 -36683 -153551 -112089 10975 -41427 -201343 -160699 11639 3279
126 3279 -116761 -72095 74150 83656 -44121 -100777 2066 99403 25950 -71710 29266
137 29266 181594 128976 -15686 -955 97725 68562 -54266 -79563 14465 65530 -5034
148 -5034 -64351 11855 89221 -3825 -135370 -95340 9051 -21019 -106709 -74042 32098 62613
160 62613 -3403 -45068 16117 73151 -2799 -89203 -16543 100433 73917 -11681 11213 98303
172 98303 97277 -780 -56533 6557 62464 -7675 -76108 -4712 73808 12008 -72367 -41814
184 -41814 25630 -826 -86597 -98224 -12869 29478 -41804 -86558 -10367 53467 -5114 -62046
196 -62046 -6247 61384 28720 -33500 -8815 70261 74913 13 -19374 55541 90537 20691
$$ packed form
115i1365Q2008O0626q7952j16868M1462J23064n2402j59916M0644J72338q360
126C279j20040M4666J46245R506j27777n6656J02843R7337p3453r7660J00976
137B9266J52328n2618j44662J4731R8680k9163j22828k5297R4028N1065p0564
148e034n9317P6206P7366r3046j31545M0030J04391l0070q5690L2667J06140L0515
160F2613o6016m1665O1185N7034p5950q6404P2660J16976k6516q5598K2894Q7090
172I8303j026r8057n5753O3090N5907p0139o8433P1396P8520o1800q4375L0553
184d1814O7444k6456q5771j1627Q5355M2347p1282m4754P6191O3834n8581n6932
196f2046N5799O7631l2664o2220K4685P9076M652p4900j9387P4915L4996o9846
$$ plain form
208 20691 -26047 22368 61375 12376 -46406 -27347 26464 15873 -45381 -48077 19502 32279
220 32279 -41327 -75978 -24986 8451 -34381 -68669 -25582 33253 23427 -23598 -14572 37500
232 37500 29184 -34489 -41506 22633 50868 11181 -10070 36553 76903 38661 -20794 -12829 30882
245 30882 15521 -35667 -28908 32084 44927 -6181 -29762 7397 24404 -27058 -70111 -38861
257 -38861 9829 -2503 -36194 -15546 31295 24791 -25670 -35058 2818 13647 -24410 -35766
269 -35766 11610 50862 25803 -9651 7783 43090 25225 -19673 -19898 21221 29185 -7580 -17148
282 -17148 20691 38228 -498 -31977 -8731 18880 -4438 -39387 -26609 9469 8107 -23665
294 -23665 -25385 8592 15909 -16136 -28641 1783 20630 -5936 -27627 -3968 28312 19550 -9688
$$ packed form
208B0691m6738M8415L9007m8999n8782J9059N3811j0591o1254k696O7579J2777
220C2279p3606l4651N0992L3437m2832l4288M3087N8835r826m7025R026N2072
232C7500q316o3673p017O4139K8235l9687k1251M6623M0350l8242n9455P965M3711
245C0882j5361n1188O759O0992J2843n1108k3581L7159J7007n1462m3053L1250
257c8861M8690j2332l3691K0648M6841o504n0461r388L7876J0829l8057j1356
269c5766M7376L9252k5059l5454J7434L5307j7865m4898k25M1119P964l6765r568
282a7148L7839J7537l8726l1479K3246K7611k3318l4949J2778L6078j362l1772
294b3665j720L3977P317l2045j2505L0424J8847k6566k1691K3659L2280q762k9238
$$ plain form
307 -9688 -1927 31306 32114 -2699 -14053 11964 20413 -8324 -22401 5093 29119 10533 -15633
320 -15633 -4423 18799 3737 -30931 -31121 -2265 4982 -15589 -17769 10289 23059 -1648 -23847
333 -23847 -9877 6779 -6922 -28769 -13470 21656 25509 2254 -273 23439 24834 -5277 -21955
346 -21955 -1794 15103 1602 -10069 7619 30857 18735 -8656 -11446 4949 1781 -22153
358 -22153 -25039 -414 13763 408 -9305 3265 13757 -3562 -25407 -18103 3168 927 -16020
371 -16020 -11250 14196 20663 1683 -7955 7711 15744 -205 -15386 -843 17644 9916 -6242
384 -6242 1270 20296 14859 -5893 -10088 4850 7849 -9433 -18620 -4216 10431 1131 -12295
397 -12295 -4768 10527 2617 -15889 -14163 2884 3671 -12783 -15071 5938 17715 6544 -4233
$$ packed form
307i688P761L3233Q08l4813j1354K6017Q449k8737j4077K7494K4026j8586k6166
320a5633J1210K3222j5062l4668j90K8856P247k0571k180K8058J2770k4707k2199
333b3847J3970J6656j3701k1847J5299L5126L853k3255k527K3712J395l0111j6678
346b1955K0161J6897j3501j1671J7688K3238j2122k7391k790J6395l168k3934
358b2153k886K4625J4177j3355r713J2570J0492j7319k1845P304K1271k241j6947
371a6020M770K5446O467j8980r638J5666Q033j5949j5181J4543J8487p728j6158
384f242P512J9026n437k0752m195J4938K999j7282r187J4404J4647r300j3426
397a2295P527J5295p910j8506J726J7047P87j6454k288K1009J1777j1171j0777
$$ plain form
410 -4233 6066 15644 3844 -11390 -6505 7823 6191 -4688 -1617 15934 17339 1264 -10887
423 -10887 -2436 3827 -7940 -18986 -9977 5329 4707 -6549 -3551 8592 4804 -12964 -17542 -4161
437 -4161 4075 -5370 -9477 6706 20253 12426 -1457 1316 9783 3809 -9107 -8631 5829 12010
451 12010 3731 -1285 9342 14367 542 -11909 -7834 1539 -3972 -12414 -7893 5187 7547 -3768
465 -3768 -7734 981 2931 -9802 -14593 -5036 4236 1233 -5259 708 11739 10324 -523 -3101
479 -3101 4952 5839 -4007 -5794 4702 11060 5336 -683 3076 10565 6908 -6039 -6854 966 192
494 192 -8697 -8900 1643 4934 -1215 -6625 -711 3748 -2622 -13454 -9607 913 728 -5431 -2185
509 -2185 8416 9557 3206 -1366 780 3251 -2065 -5717 967 10038 7570 1686 4031 9685 7307
$$ packed form
410d233J0299R578j1800j5234M885J4328j632j0879L071J7551J405j6075j2151
423a0887Q451O263j1767j1046R009J5306o22j1256K998J2143l788j7768m578J3381
437d161Q236r445m107J6183J3547p827j3883K773Q467n974j2916M76J4460O181
451A2010q279n016J0627N025j3825j2451M075R373n511q442M521J3080K360j1315
465c768l966Q715J950j2733m791R557R272l003o492N967J1031j415j0847k578
479c101Q053Q87r846j787J0496O358n724o019L759P489l657j2947q15P820p74
494A92q889k03J0543L291o149n410N914M459o370j0832L847J0520j85o159L246
509b185J0601J141o351m572K146K471n316l652O684R071k468n884K345N654k378
$$ plain form
524 7307 -2092 -8715 -5072 721 -3213 -6616 -440 7778 2173 -4156 -2540 -420 -4347 -10437 -9746
539 -9746 -2259 2373 434 -926 3824 8481 1888 -3288 -2216 6 -257 -842 341 7258 10926 4123
555 4123 510 5196 5896 -3434 -7535 -3776 -509 -633 -1596 -313 3054 2644 -2792 -4752 -2603 -2291
571 -2291 -6341 -6919 -2195 2102 2033 1297 820 5540 4805 -1215 -2834 2868 3053 -589 -52 4477 6624
588 6624 4317 1223 1238 1533 109 -5084 -6423 -2524 -789 -3154 -2731 563 2694 -372 -4518 -4012
604 -4012 -2478 -3622 -6222 -4151 1198 3387 2787 2764 4944 3862 787 -1802 -662 2379 1036 1498
620 1498 3114 6110 6333 3125 845 -1023 -1417 -3668 -5370 -3329 -1842 -63 15 843 762 -276 -3353
637 -3353 -5860 -3488 -2873 -3573 -3204 924 4548 4544 3377 2326 774 664 -618 -2056 -338 1482 1583
$$ packed form
524G307r399o623L643N793l934l403O176Q218n605o329J616K120l927o090O91
539i746P487M632j939j360M750M657o593n176J072K222k63n85J183O917L668o803
555D123l613M686P00r330m101L759L267j24r63J283L367m10n436j960K149L12
571b291m050n78M724M297o9p36m77M720p35o020j619N702J85l642N37M529K147
588F624k307l094J5K95j424n193j339L899J735k365M23L294K131l066m146N06
604d012J534j144k600K071N349K189o00k3K180j082l075k589J140L041j343M62
620A498J616K996K23l208k280j868l94k251j702K041J487J779P8Q28q1j038l077
637c353k507K372O15p00L69M128L624mj167j051j552j10j282j438J718J820J01
$$ plain form
654 1583 2383 4062 3440 2098 -357 -2208 -2661 -1433 -3567 -3780 -1274 1873 -331 -145 1307 -754
670 -754 -2121 -3480 -3353 -2980 -576 -1045 -452 3339 3853 2735 1310 1053 779 -639 -1135 -793 790 2088
688 2088 2255 754 3016 2757 255 -2171 -2645 -3024 -2029 -2571 -2423 1225 1188 244 -852 669 -242 -2536
706 -2536 -3468 -3150 -1107 113 1755 2143 3831 3421 1828 -539 -418 -120 -1508 -842 1 2070 2413
723 2413 1332 1230 1251 30 -2094 -3844 -2795 -1636 -1701 -1576 334 1440 1763 -194 -875 44 -2142
740 -2142 -2568 -2366 -481 1669 2087 1967 2380 2948 819 -630 -1730 -1052 -245 -1216 -688 1316 2394 2234
758 2234 591 1569 663 -1906 -2687 -2261 -1150 -666 -195 -53 1108 2470 385 -1296 -1528 -877 -1609 -2402
776 -2402 -275 1090 1990 1063 1259 1848 1266 -872 -2111 -1944 -1186 -1240 -596 573 2486 2131 667 147
$$ packed form
654A583Q00J679o22j342k455j851m53J228k134k13K506L147k204J86J452k061
670g54j367j359J27L73K404m69N93L791N14j118j425k57k74j418m96L42J583J298
688B088J67j501K262k59k502k426m74l79R95n42J48L648l7r44j096J521r11k294
706b536r32L18K043J220J642L88J688m10j593k367J21K98j388O66Q43K069L43
723B413j081j02K1j221k124j750J049J159o5J25J910J106L23j957o81R19k186
740b142m26K02J885K150M18j20M13N68k129j449j100O78Q07r71N28K004J078j60
758B234j643R78r06k569p81M26J111M84M71J42J161J362k085j681k32O51p32p93
776b402K127J365R00r27J96N89n82k138j239J67P58n4O44J169J913l55j464n20
$$ plain form
794 147 -49 -929 -1810 -2487 -908 561 841 673 1449 1633 1535 -436 -1779 -1131 -1318 -1509 -1303 694 2438
813 2438 1765 1162 605 609 -168 -1939 -2536 -1861 -74 -36 818 757 2362 1301 -243 -915 -901 -1054 -1837 -1905
833 -1905 -85 1289 640 490 1365 785 -25 -2116 -2237 -1822 -284 -470 586 2043 2058 1207 733 263
851 263 -569 -125 -1707 -960 -83 1041 725 1414 1644 966 -1361 -1588 -722 -972 -1549 -1704 842 964 1119
870 1119 559 695 914 60 -1284 -2109 -1877 -1450 96 147 933 1574 1490 14 -923 -736 -943 -1315 -1323 -307
890 -307 1105 1528 1115 1438 1449 1108 -473 -1639 -567 -721 -757 7 998 2356 1344 99 -232 -424 -1633
909 -1633 -1686 -1493 49 481 -252 485 1294 1300 3 -1434 -1866 -810 -700 -2265 -601 1404 1220 899 823
928 823 1381 123 -718 -1667 -1105 -246 -408 306 253 1917 1897 435 -370 -474 -605 -473 -1188 -519 425 1087
$$ packed form
794A47j96q80q81o77J579J469K80j68P76J84r8j971j343O48j87j91K06J997J744
813B438o73o03n57Mp77j771n97O75J787L8Q54o1J605j061j544o72J4j53p83o8
833a905J820J374o49j50Q75n80q10k091j21M15J538j86J056J457J5q51m74m70
851B63q32M44j582P47Q77J124l16O89K30o78k327k27Q66k50n77j55K546J22J55
870A119n60J36K19q54j344q25K32M27J546N1P86O41q4j476r37J87k07l72qJ016
890c07J412M23m13L23J1l41j581j166J072j54l6P64R91J358j012j245l31j92j209
909a633n3J93J542M32p33P37Q09Oj297j437m32J056J10j565J664K005j84l21p6
928H23N58j258q41r49N62Q59j62P14n3J664k0j462q05j04j31J32p15O69R44O62
$$ plain form
948 1087 -441 194 1283 663 -1901 -1993 -792 -807 -906 -494 1097 1268 1614 39 7 98 -686 -2074 -1243
967 -1243 -552 1456 -209 1044 1663 1278 -57 -511 -828 -728 -348 -1614 -652 554 1298 1210 -931 744
985 744 238 198 -1681 -1451 -435 -795 -148 1065 1585 1232 39 -1065 -364 -453 -1157 -792 -789 521 400 875
1005 875 1329 1368 1140 -870 -1132 -459 -55 -226 -725 231 1134 1521 -909 290 -123 -852 -1297 -1262 -255
1024 -255 148 -131 -197 818 1305 1263 -618 -489 166 -86 -948 -815 188 1136 795 327 975 1219 -18
1043 -18 -1240 -203 -28 -520 308 1196 1196 282 307 231 -531 -586 -1090 -1491 -596 91 181 101 -155 786 751 130
1065 130 -1370 -301 -346 -256 -9 -165 1167 502 622 352 906 -176 -570 -1189 -206 -304 437 -88 586 -324
1085 -324 461 -564 42 102 -1277 -1193 -327 -610 1320 483 -285 -29 31 390 -1373 -820 -808 737 -116 497
$$ packed form
948A087j528O35J089o20k564r2J201j5r9M12J591J71L46j575l2R1p84j388Q31
967a243O91K008j665J253O19l85j335m54l17J00L80j266R62J206P44q8k141J675
985G44n06m0j879K30J016l60O47J213N20l53j193j104P01q9p04L65LJ310j21M75
1005H75M54L9k28k010k62O73M04j71m99R56R03L87k430J199m13p29m45L5J007
1024b55M03k79o6J015M87m2j881J29O55k52q62J33J003R48l41m68O48K44j237
1043a8j222J037J75m92Q28Q88%r14K5p6p62n5n04m01Q95O87R0q0k56R41l5o21
1065A30j500J069m5R0K47j56J332o65J20k70N54j082l94o19R83r8P41n25O74r10
1085c24P85j025O06O0j379Q4Q66k83J930q37p68K56O0L59j763N53J2J545q53O13
$$ plain form
1105 497 1115 606 855 329 889 27 -488 -1605 -1085 242 -111 314 905 910 20 -627 -1492 -313 -508 -574
1125 -574 -982 125 368 700 687 573 410 -619 -703 -976 -467 -233 -172 819 1262 1242 539 535 49 -527 257
1146 257 -652 -1003 -743 1197 1507 -77 1019 1478 -415 -494 -1178 -200 -1214 307 54 848 1671 77
1164 77 -2 -411 -181 -904 -386 -41 -54 -56 623 -164 927 839 462 500 -16 -820 -431 -529 -61 136 319 123
1186 123 200 -250 447 -1247 -433 -230 -1071 -398 76 625 246 1490 -112 136 -929 -682 173 67 -464
1205 -464 155 246 159 983 37 -278 -428 -565 -933 -475 -471 12 835 404 1081 253 -498 -500 -619 -1032 -874 -471
1227 -471 420 486 499 580 440 862 -462 -1151 -544 121 -700 -120 893 -173 1133 695 -139 562 -28 -39
1247 -39 152 41 -868 89 954 960 129 741 428 -1120 -228 -671 -814 -451 -254 1 737 93 790 127 170
$$ packed form
1105D97O18n09K49n26N60q62n15j117N20J327l53M25N91Nq90o47q65J179j95o6
1125e74m08J107K43L32j3j14j63j029q4k73N09K34O1R91M43k0p03mm86n76P84
1146B57r09l51K60J940L10j584J096M59j893p9o84R78j014J521k53P94Q23j594
1164G7p9m09K30p23N18L45j3kO79p87J091q8l77L8n16q04L89r8M68J97J83j96
1186A23P7m50O97j694Q14K03q41O73M74N49l79J244j602K48j065K47Q55j06n31
1205d64O19R1q7Q24r46l15j50j37l68M58MM83Q23m31O77q28p51kj19m13J58M03
1227d71Q91O6J3Q1j40M22j324o89O07O65q21N80J013j066J306m38q34P01n90j1
1247c9J91j11r09R57Q65Oq31O12l13j548Q92m43j43L63J97K55P36o44O97o63M3
$$ plain form
1268 170 -591 -1195 -100 -755 -370 -226 1042 795 717 420 63 671 -25 -694 -294 224 480 -704 24
1287 24 185 511 5 -11 -745 0 -996 -46 -217 669 531 91 258 461 41 220 -727 -47 36 727 -228
1308 -228 -369 57 554 -512 -141 615 300 -192 -215 167 -110 20 301 211 259 215 -200 -596 -321 320 -404
1329 -404 -96 94 -121 -186 506 -87 474 179 97 -684 518 -53 95 86 1414 665 190 246 -3 -296 -583
1350 -583 -241 -452 786 314 -378 324 110 -800 157 -656 -372 309 -75 -161 523 7 500 -593 -957 -665
1370 -665 -794 -400 -682 376 1174 752 837 360 719 511 -86 -446 -486 -231 863 466 133 787 1002 57
1390 57 -37 -597 11 -700 -188 23 -500 152 -85 -342 311 775 -274 -316 -438 121 -278 -1219 840 -324
1410 -324 969 54 -40 291 -402 110 -629 202 254 155 427 -237 81 -80 -394 325 -1119 169 -805 249
$$ packed form
1268A70p61o04J095o55L85J44J268k47p8k97l57O08o96o69M00N18K56j184P28
1287B4J61L26n06j6p34P45r96R50j71Q86j38m40J67K03m20J79r47O80Q3O91r55
1308b28j41M26M97j066L71P56l15m92k3L82k77J30K81r0M8m4m15l96K75O41p24
1329d04L08J90k15o5O92n93N61k95q2p81J202n71J48rJ328p49m75N6k49k93k87
1350e83L42k11J238m72o92P02k14r10R57q13K84O81l84q6O84n16M93j093l64K92
1370f65j29L94k82J058P98m22Q5m77L59k08n97l60m0K55J094l97l33O54K15r45
1390E7r4n60O08p11N12K11n23O52k37k57O53M64j049m2j22N59l99r41K059j164
1410c24J293r15r4L31o93N12p39Q31N2r9K72o64L18j61l14P19j444J288r74J054
$$ plain form
1430 249 -192 -13 168 434 434 -1133 -723 -113 -264 -53 -309 -380 735 304 330 197 -136 -278 -355 216 -52
1451 -52 -219 53 -141 96 408 170 44 -756 -71 -31 -550 -702 -529 321 161 246 16 363 -668 -261 -888
1472 -888 -22 222 -586 -509 342 609 642 203 70 -617 802 -292 -378 72 -25 628 -206 200 961 248 -521
1493 -521 -199 -146 -276 -976 -945 31 -307 -152 551 -930 214 -238 -889 112 554 52 -316 40 15 542
1513 542 -215 -297 -430 124 -98 -509 -358 44 -67 -36 -189 357 -466 568 -746 -768 -93 -183 -432 687
1533 687 312 -112 -457 -474 31 228 25 166 -573 -591 426 -220 490 474 543 -619 -306 -417 -895 315
1553 315 -703 219 366 237 -184 369 -195 195 -184 -1123 -220 -207 547 -13 535 514 111 -342 63 529
1573 529 -201 -174 -344 422 -11 -335 -522 -183 65 -168 138 -54 166 -348 -573 504 0 318 551 972
$$ packed form
1430B49m41J79J81K66%j567M10O10j51K11k56p1J115m31K6j33l33j42p7N71k68
1451e2j67K72j94K37L12k38j26q00O85M0n19j52J73Q50j60Q5k30L47j031M07o27
1472h88Q66K44q08P7Q51K67L3m39j33o87J419j094q6M50r7O53q34M06P61p13p69
1493e21L22N3j30p00L1R76l38J55P03j481J144m52o51J001M42n02l68L56k5N27
1513E42p57q2j33N54k22m11J51M02j11L1j53N46q23J034j314k2O75r0k49J119
1533F87l75m24l45j7N05J97k03J41p39j8J017o46P10j6O9j162L13j11m78J210
1553C15j018R22J47j29m21N53n64L90l79r39R03J3P54n60N48k1m03m53M05M66
1573E29p30K7j70P66m33l24j87L39K48k33L06j92K20n14k25J077n04L18K33M21
$$ plain form
1593 972 6 -41 -11 -150 -489 279 209 -699 386 466 -293 207 -388 -13 -481 -1012 218 258 302 -469 -312
1614 -312 -46 149 -250 596 -450 -518 781 192 139 -514 -52 389 23 -54 -283 -672 376 -703 -440 337
1634 337 -8 -552 310 287 -189 -223 -133 -403 200 238 396 283 437 335 333 -179 -632 -538 -377 56 285 973
1656 973 810 -54 197 303 -130 -259 367 -964 -194 -349 52 71 -608 866 -74 -42 5 -511 -341 -591
1676 -591 390 -973 -22 298 276 -454 -185 -173 -694 263 575 -755 19 286 258 -379 494 517 -202 -384 -87
1697 -87 -488 -153 -697 217 -83 457 388 295 -574 -412 169 868 -330 -332 408 252 795 356 -125 132 -115
1718 -115 295 -837 -154 520 174 -683 526 287 634 -568 -358 -321 -673 -284 -307 -41 787 293 -95 775
1738 775 591 470 -580 -99 -440 647 360 537 -19 407 -69 -52 -224 87 103 -185 243 424 -217 173
$$ packed form
1593I72r66m7L0j39l39P68p0r08J085Q0p59N00n95L75m68n31J230M0M4p71J57
1614c12K66J95l99Q46j046o8J299n89n3o53M62M41l66p7k29l89J048j079K63P77
1634C37l45n44Q62k3m76l4R0k70O03L8J58j13J54j02kn12m53R4J61M33K29O88
1656I73j63q64K51J06m33j29O26j331P70j55M01J9o79J474r40L2M7n16J70k50
1676e91R81j363R51L20k2p30K69J2n21R57L12j330P74K67k8o37Q73K3p19j82K97
1697h7m01L35n44R14l00N40o9r3q69J62N81O99j198kP40j56N43m39m81K57k47
1718a15M10j132O83O74l46q57J209k39L47j202K10L7l52L89k3K66Q28m94l88Q70
1738G75j84j21j050M81l41J087k87J77n56M26m76J7j72L11J6k88M28J81o41L90
$$ plain form
1758 173 82 -23 383 -232 516 -579 284 -127 -83 -410 500 261 694 87 -132 -27 241 -388 -110 -1024
1778 -1024 -99 -117 -227 196 399 360 224 -361 -123 -386 -183 133 357 -173 -235 255 819 -257 19 -342
1798 -342 449 -92 -543 -417 568 237 76 -122 554 395 -644 -868 131 -547 -18 373 311 756 74 -503
1818 -503 -136 124 992 -869 -1046 484 486 270 514 -50 407 -82 -82 61 -273 272 -1099 -234 -1269 624
1838 624 335 -69 29 637 131 -317 -424 137 451 -380 115 245 39 -446 -1050 170 -45 -125 -313 -514
1858 -514 987 14 -217 -60 280 -30 316 -340 74 799 508 362 -848 331 299 158 830 322 8
1877 8 -1541 -630 -661 -258 -45 -254 702 374 -30 -419 306 377 324 506 -879 610 539 79 688 274 454
1898 454 -668 -151 558 65 -92 -205 -799 518 -50 -142 698 -385 -671 -743 -646 -39 201 677 461 354
$$ packed form
1758A73r1j05M06o15P48j095Q63m11M4l27R10k39M33o07k19J05K68o29K78r14
1778a024R25j8j10M23K03l9j36n85K38k63K03L16K24n30o2M90N64j076K76l61
1798c42P91n41m51J26R85l31j61j98O76j59j039k24R99o78N29L91o2M45o82n77
1818e03L67K60Q68j861j77J530Kk16K44n64M57m89%J43l34N45j371Q65j035J893
1838F24k89m04R8O08n06m48j07N61L14q31M95J30k06m85o04J220k15q0j88k01
1858e14J501r73k31J57L40l10L46o56M14P25k91j46j210J179l2j41O72n08l14
1877Hj549R11l1M03K13k09R56l28m04l89P25P1n3J82j385J489p1m60O09m14J80
1898D54j122N17P09m93j57j13n94J317n68r2Q40j083k86p2R7O07K40M76k16j07
$$ plain form
1918 354 609 978 -365 -114 -214 96 370 -127 127 613 578 -348 -215 222 123 200 -12 154 -393 -426 -569
1939 -569 -136 -416 -632 -908 -52 -500 -702 -512 -849 509 139 540 468 528 -456 318 -131 -239 -30 -372
1959 -372 -357 -357 -177 -59 -128 71 465 -473 -581 -739 47 522 19 -364 -596 -487 77 -339 -19 -200 -606
1980 -606 -50 70 17 236 523 505 338 348 90 -692 382 427 542 -302 -1200 686 533 -821 66 -47
2000 -47 -318 -490 -729 101 -992 484 -313 -1031 -157 195 708 -121 -131 -357 -904 -572 296 164 756 -155
2020 -155 141 390 566 -615 -250 -393 -410 -274 148 152 -320 840 -114 -258 -71 -153 -635 -12 305 -188 184
2041 184 -533 272 39 -537 752 -1014 288 -183 339 222 739 -131 -894 -176 -146 -628 -893 94 -27
2060 -27 -7 67 417 -8 242 39 -134 268 236 672 -875 33 -390 -329 -4 78 365 326 -1024 89 104 -172
$$ packed form
1918C54K55L69j343K51j00L10K74m97K54M86l5r26J33M37r9P7k12J66n47l3j43
1939e69M33k80k16k76Q56m48k02J90l37J358l70M01p2O0r84P74m49j08K09l42
1959c72J5%J80J18o9J99L94r38j08j58P86M75n03l83k32J09N64m16L20j81m06
1980f06N56J20n3K19K87j8j67J0k58p82J074M5J15q44q98J886j53j354Q87j13
2000d7k71j72k39Q30j093J476p97p18Q74L52N13q29j0k26n47L32Q68j32N92r11
2020a55K96K49J76j181L65j43j7J36M22Mm72J160r54j44J87q2m82O23L17m93L72
2041A84p17Q05k33n76J289j766J302m71N22j17N17q70p63P18L0m82k65R87j21
2060b7K0P4L50m25K50k03j73M02l2M36j547R08m23O1L25Q2K87l9j350J113J5k76
$$ plain form
2082 -172 -272 37 15 -413 415 -309 -528 369 11 520 -64 41 589 -38 -672 -263 418 -60 -171 -232 -602
2103 -602 734 722 -444 -422 93 -77 483 51 485 25 -317 -322 -393 29 -259 662 -457 176 -173 -94 -196
2124 -196 81 -559 -186 -20 -711 483 -290 -326 250 -154 -341 308 -525 -127 664 621 86 -588 -611 -521 60
2145 60 300 -165 -120 -510 -314 -120 -433 6 -310 -573 -202 -179 274 160 -644 183 -366 291 322 265 -238 -339
2167 -339 -334 -507 -48 -609 784 -509 -285 -293 23 765 387 91 -497 -348 -63 311 713 257 129 -579 340
2188 340 -131 -172 265 -368 -159 627 691 -344 254 604 85 69 551 -280 311 -174 -262 418 809 -359 -206
2209 -206 -366 -34 78 117 -164 27 -581 140 142 -64 240 370 38 357 -534 397 -147 -33 -180 -468 131
2230 131 -126 51 504 73 -702 -1030 248 48 175 12 8 115 53 -478 217 -36 -215 16 -68 516 -299
$$ packed form
2082a72j00L09k2m28Q28p24k19Q97l58N09n84J05N48o27o34M09O81m78j11o1l70
2103f02J336j2j166K2N15j70N60m32M34m60l42np1M22k88R21j119O33l49P9j02
2124a96K77o40L73J66o91J194p73l6N76m04j87O49q33L98P91m3n35o74k3R0N81
2145F0K40m65M5l90J96J94l13M39l16k63L71K3M53j14q04Q27n49O57L1n7n03j01
2167c39Nj73M59n61J393j293K24qL16P42l78k96n88J49K85L74M02m56j28p08R19
2188C40m71m1M37o33K09P86O4j035N98L50n19j6M82q31N91m85q8O80L91j168J53
2209b06j60L32J12L9k81J91o08P21Kk06L04J30l32L19q91R31n44J14j47k88N99
2230A31k57J77M53m31p75l28J278k00J27j63mJ07o2n31O95k53j79K31q4N84q15
$$ plain form
2251 -299 -525 -88 -533 -283 325 152 124 28 -542 431 -204 1 -1187 -38 376 386 513 456 -79 128 312
2272 312 152 -191 207 636 392 141 110 66 11 -617 357 -266 -395 -399 115 -466 -15 754 303 -141 566 244
2294 244 -79 269 145 703 222 -170 476 236 197 -574 -658 59 -99 928 335 396 415 310 379 381 -300 88
2316 88 -22 -177 41 209 -145 195 -610 109 229 -59 -329 -21 336 518 53 11 152 -309 355 -34 -525
2337 -525 47 566 -346 -849 366 -29 -454 584 -588 534 -22 -229 -211 212 -218 -188 134 -587 -85
2356 -85 -213 157 448 348 344 -63 -777 164 -368 -26 411 -21 474 -215 1 313 157 390 -467 715 63
2377 63 -69 153 -398 -93 232 532 -36 -835 -421 -16 105 -16 -499 -251 455 412 -60 41 213 248 558
2398 558 97 1022 -856 -269 -661 -219 -273 -227 -204 521 235 -236 327 -591 796 195 -124 13 275 484
$$ packed form
2251b99k26M37m45K50O08j73k8r6n70R73o35K05j188J149M14J0J27n7n35K07J84
2272C12j60l43L98M29k44k51l1m4n5o28R74o23j29mN14n81M51P69m51m44P07l22
2294B44l23L48j24N58m81l92O46k40l9p71q4P17j58J027n93O1J9j05O9Ko81L88
2316H8j10j55K18J68l54L40q05P19J20k88k70L08L57J82m65m2J41m61O64l89m91
2337e25N72N19r12n03J215l95m25J038j172J122n56k07J8M23m30L0L22p21N02
2356h5j28L70K91j00mm07p14R41n32L42M37m32M95o89K16L12j56K33q57J182o52
2377F3j32K22n51L05L25L00n68p99M14M05J21j21m83K48P06m3m72J01J72L5L10
2398E58m61R25j878N87l92M42n4M6K3P25k86m71N63r18J387o01l19J37K62K09
$$ plain form
2418 484 454 449 -349 143 571 -229 80 -331 -717 -81 -152 -452 -47 86 730 -605 185 439 -209 646 -16
2439 -16 401 64 605 695 793 654 441 121 -380 -372 445 -195 -568 -103 -80 634 348 497 448 4 -178 431
2461 431 -105 -331 291 -463 -191 -270 133 -405 489 -78 375 -19 -767 -88 -8 362 222 369 313 349 -433
2482 -433 -318 914 175 -270 -606 732 850 -148 591 -23 -247 338 199 -277 -172 -7 -551 -11 458
2501 458 245 -240 -422 485 200 -237 -44 -161 521 -500 -592 362 -132 -1010 -436 -251 -475 280 482 -82
2521 -82 -272 311 -206 418 -49 255 -281 583 -6 266 199 -67 -466 701 427 178 -343 -298 530 352 331
2542 331 -104 490 -176 117 568 736 -230 472 -285 -901 -210 764 -108 230 194 796 -234 35 232 -120
2562 -120 -374 -462 -678 -707 -54 -238 -403 -662 102 467 365 -651 204 -21 -303 -400 -412 73 -35 573 -227
$$ packed form
2418D84l0np98M92M28q00L09m11l86O36p1l00M05J33O44j335P90K54o48Q55o62
2439a6M17l37N41R0R8j39k13l20n01QQ17o40l73M65K3P14k86J49m9m44j82O09
2461D31n36k26O22p54K72p9M03n38Q94n67M53l94p48O79Q0L70j40J47n6L6p82
2482d33J15J232p39m45l36J338J18r98P39o14k24N85j39m76J05J65n44N40M69
2501D58k13m85j82R07k85m37J93j17O82j021r2R54m94q78N74J85k24P55K02n64
2521h2j90N83n17O24m67L04n36Q64n89K72o7k66l99J167k74k49n21M5Q28j78k1
2542C31m35N94o66K93M51J68r66P02p57o16O91R74q72L38l6O02j030K69J97l52
2562a20k54q8k16k9O53j84j65k59P64L65j02j016Q55k25k82r7j2M85j08O08q00
$$ plain form
2583 -227 90 140 -584 136 37 -336 -947 405 312 -211 184 -80 -753 91 -162 -500 -444 -477 219 -832 514
2604 514 69 -245 1025 -21 -96 -320 -60 -185 -574 197 -517 622 213 -349 468 -9 -575 -285 -486
2623 -486 -32 98 -671 215 272 -245 499 -105 -566 577 462 -386 -477 -237 -40 -451 175 406 93 235
2643 235 307 237 578 564 -157 357 237 584 -92 358 -26 -20 -412 49 -110 247 296 718 322 426 -137 -232
2665 -232 164 80 150 708 298 3 -241 -258 202 -213 663 347 -597 454 -599 -28 -298 -80 533 107
2685 107 -403 58 299 470 -193 198 832 411 471 162 18 -333 -72 -169 237 -711 35 -103 47 395 -238
2706 -238 73 25 275 -631 479 -412 290 -715 -556 -5 332 25 -203 149 -659 -564 -101 -344 -109 -520
2726 -520 -920 378 -984 107 244 -212 454 312 -680 451 -19 -912 233 420 35 -540 399 -150
$$ packed form
2583b27L17N0p24P20r9l73o11J352r3n23L95k64o73Q44k53l38N6l3O96j051J346
2604E14m45l14J270j046p5k24K60j25l89P71p14J139m09n62Q17m77n66K90k01
2623d86M54J30p69Q86N7n17P44o04m61J143j15q48r1K40J97m11O26K31l13J42
2643B35P2p0L41j4p21N14j20L47o76M50l84Ol92M61j59L57M9M22l96J04n63r5
2665b32L96q4P0N58m10k95k44j7M60m15Q76l16r44J051j053N71k70K18O13m26
2685A07n10M61K41J71o63L91O34m21O0l09j44l51K61r7M06r48P46j38J50L48o33
2706b38L11m8K50r06J110q91P02j005J59N51L37l07k28L52q08R5M63k43K35m11
2726e20m00J298j362J091J37m56O66j42r92J131m70q93J145J87l85n75R39n49
$$ plain form
2744 -150 -372 -108 -256 -642 -163 250 -85 -162 -235 -166 56 -636 772 588 -35 232 -52 -134 312 -194 405
2765 405 -266 497 -275 -1011 535 -569 39 137 73 -129 336 1190 497 62 380 -1002 303 76 -626
2784 -626 -50 -238 -166 341 476 1123 -179 -390 301 -82 386 -106 98 -408 194 -140 -747 417 198 94
2804 94 -571 -59 145 475 -269 -359 -144 7 -289 56 140 -208 -459 -440 366 41 50 27 -751 354 -17 118
2826 118 161 -471 -183 -855 55 446 -467 -228 551 328 -106 -385 137 679 92 -753 87 389 131 -189
2846 -189 -319 -204 -188 -226 392 224 -789 25 52 320 -420 -803 207 303 -121 -664 -436 -83 26 -547 -529
2867 -529 285 -603 -384 -14 -528 -272 -5 316 526 239 142 -590 -42 696 -325 54 436 228 132 181 -391
2888 -391 428 -345 343 -223 66 -89 61 1381 -37 -439 570 279 -366 -246 91 -219 198 -25 -243
$$ packed form
2744a50k22K64j48l86M79M13l35p7p3O9K22o92J408j84o23K67k84q2M46n06N99
2765D05o71P63p72p36J546j104O08R8o4k02M65Q54o93m35L18j382J305k27p02
2784f26N76j88P2N07J35O47j302k11O91l83M68m92K04n06O02l34o07J164k19j04
2804I4o65N12K04L30p44r0K15J51k96L45Q4l48k51J9Q06l25Rk3p78J105l71J35
2826A18M3o32K88o72R10L91r13K39P79k23m34k79N22N42n87q45Q40L02k58l20
2846a89j30J15J6l8O18j68j013Q14K7K68p40l83J010R6m24n43K28L53J09n73J8
2867e29Q14q88K19L70n14K56K67L21K10k87r7p32N48P38j021L79L82k08r6M9n72
2888c91Q19p73O88n66K89j55J50J320j418m02J009k91o45J20L37l10M17k23k18
$$ plain form
2907 -243 400 593 277 862 -488 -384 253 191 512 -218 -74 -425 260 -226 86 -261 -3 362 414 503 184
2928 184 273 505 -367 -732 -395 164 -43 -11 408 -60 -118 82 -249 -380 -133 3 -265 -83 34 -258 489
2949 489 302 -219 -271 59 66 -194 433 240 -234 -364 204 -47 121 131 358 843 -409 -431 376 -249 -74
2970 -74 76 -251 41 56 552 41 452 403 -492 -212 -464 -699 -421 311 -953 -928 465 -379 -596 5 -76
2991 -76 405 139 125 338 562 87 -596 315 -338 82 71 -373 568 -119 -577 -810 -248 -813 260 -410 101
3012 101 -166 481 -343 -28 62 -71 100 186 26 224 -349 -536 -485 -364 -125 -441 -559 210 292 59 517
3033 517 273 -139 642 120 -2 -363 7 -160 -354 -22 -32 47 -378 280 373 132 202 356 -257 77 16 102
3055 102 807 -146 415 -300 35 550 185 61 127 549 149 -73 -334 36 -52 -122 -258 189 153 136 466 30
$$ packed form
2907b43O43J93l16N85j350J04O37o2L21p30J44l51O85m86L12l47K58L65N2Q9l19
2928A84Q9K32q72l65L37N59k07L2M19m68n8K00l31j31K47J36k68J82J17k92P47
2949D89j87n21n2L30Pk60O27j93m74j30N68k51J68J0K27M85j252k2Q07o25J75
2970g4J50l27K92J5M96n11M11m9q95K80k52k35K78P32j264K5J393q44k17O01q1
2991g6M81k66j4K13K24m75o83R11o53M20j1m44R41o87m58k33N62n65J073o70N11
3012A01k67O47q24L15R0j33J71Q6j60J98n73j87N1J21K39l16j18P69Q2k33M58
3033E17k44m12P81n22j22l61L70j67j94L32j0P9m25O58R3k41P0J54o13L34o1Q6
3055A02P05r53N61p15L35N15l65j24O6M22m00k22k61L70q8p0j36M47l6j7L30m36
$$ plain form
3077 30 -343 1021 133 -219 95 -139 -12 -95 121 -75 -504 197 -227 34 101 33 305 668 -640 -190 -132
3098 -132 -440 -159 95 751 -122 25 224 343 637 834 293 -251 -64 -110 115 238 -352 304 3 34 -124
3119 -124 692 -830 5 36 835 -294 310 -284 171 119 940 -371 -256 -665 -319 -214 -191 166 -44 449
3139 449 444 192 -381 290 -148 -693 -98 405 -269 -581 -427 69 -450 -225 4 524 66 547 -242 409 945
3160 945 94 582 320 -192 164 -181 -89 -457 -407 -109 150 599 79 -251 196 -830 17 296 -585 295
3180 295 -53 321 237 -34 -157 345 -207 446 306 234 -402 321 103 -195 443 314 316 -184 -58 605 344
3201 344 211 449 -722 -417 -1 154 -341 254 324 143 118 222 534 268 61 -4 424 -136 -152 108 436
3222 436 -1384 377 32 -208 136 -825 338 -22 295 -382 -142 -461 256 -258 -381 -105 -753 -436 -145
$$ packed form
3077C0l73J364q88l52L14k34J27q3K16j96m29P01m24K61O7o8K72L63j308M50N8
3098a32l08K81K54O56q73J47J99J19K94J97n41n44J87m6K25J23n90O56l01L1j58
3119a24Q16j522Q35L1P99j129O04n94M55n2Q21j311J15m09L46J05K3L57k10M93
3139D49nk52n73O71m38n45N95N03o74l12J54M96n19K25K29N20m58M81p89O51N36
3160I45q51M88k62n12L56l45R2l68N0K98K59M49n20l30M47j026Q47K79q81Q80
3180B95l48L74q4k71j23N02n52O53j40p2o36P23k18k98O38j29Kn00J26O63k61
3201C44j33K38j171L05M16J55m95N95P0j81k5J04L12k66k07o5M28n60j6K60L28
3222D36j820J761l45k40L44r61J163l60L17o77K40l19P17n14j23K76o48L17K91
$$ plain form
3241 -145 368 -297 -61 -406 -555 65 -213 177 -160 740 235 100 254 121 179 -241 -538 -774 -226 -745
3261 -745 -308 -148 161 460 419 327 -609 -403 -145 440 72 -20 720 341 -173 -731 573 -98 3 639 187
3282 187 17 -215 -715 -633 -444 656 762 378 163 522 219 142 -309 -530 -275 416 -131 240 -95 -592
3302 -592 337 210 -254 193 -182 -74 -375 -155 -103 -331 -840 -696 105 430 -553 4 -246 -376 -70 -37 -381
3323 -381 540 461 -70 -137 -268 -102 716 -24 574 -751 121 821 -564 171 260 -134 625 157 473 43
3343 43 75 210 34 -129 -808 301 -341 197 -96 -587 56 169 270 -224 528 366 361 112 -210 -389 -821
3364 -821 16 -6 -495 -466 -364 -32 590 642 -272 -315 190 611 -635 298 1 -171 -205 165 -419 105 226
3385 226 -254 750 -350 332 438 -105 142 -709 340 -539 149 -18 -90 -98 529 676 -55 -769 565 -83
$$ packed form
3241a45N13o65K36l45j49O20k78L90l37R00n05j35J54j33N8m20k97k36N48n19
3261g45M37J60L09K99m1r2r36K06K58N85l68r2P40l79n14n58J304o71J01O36m52
3282A87j70k32n00Q2J89J100J06l84k15L59l03p7m51k21K55O91n47L71l35m97
3302e92R29j27m64M47l75J08l01K20N2k28n09J44Q01L25r83N57k50j30L06L3l44
3323c81R21p9n31o7j31J66Q18p40N98j325Q72P00j385P35Q9l94P59m68L16m30
3343D3L2J35j76j63o79J109o42N38k93m91O43J13J01m94P52j62nk49l22j79m32
3364h21Q37k2m89K9J02L32O22N2r14m3N05M21j246R33k97j72l4L70n84N24J21
3385B26m80J004j100O82J06n43K47q51J049q79O88j67p2qO27J47p31p14J334o48
$$ plain form
3405 -83 -211 57 -101 171 -52 -30 -109 88 109 -114 122 30 -393 -438 -212 86 -454 456 -341 599 283 188
3427 188 39 119 -408 376 49 251 10 225 -570 24 81 9 -311 -804 341 -745 165 -737 -50 230
3447 230 674 -824 526 367 -442 -688 575 185 -170 142 213 -148 -698 65 435 102 -700 19 713
3466 713 125 219 -345 -441 -193 -2 -610 -223 84 -109 -366 69 98 -141 -258 -225 624 266 26 -351 184
3487 184 -272 -385 787 304 14 252 403 -81 142 120 579 429 -350 624 858 56 -535 -415 -343 -372 789
3508 789 81 536 -451 -232 -168 305 -68 326 -103 -87 -548 -244 -249 -191 329 -688 131 -216 554 -522 -138
3529 -138 361 141 -532 -362 249 -601 -69 22 -281 571 -342 -842 119 -635 -102 -545 281 72 -116 31
3549 31 174 -673 -14 33 81 481 -238 -371 499 -301 145 241 -58 289 388 436 28 -143 235 -577 -180 -169
$$ packed form
3405h3j28K68j58K72k23K2p9J97K1k23K36r2m23m5K26K98n40R10p97R40l16r5
3427A88j49Q0n27P84l27K02k41K15p95N94N7p2l20m93J145j086R10r02O87K80
3447B30M44j498J350j59q09k46J263l90l55L12P1l61n50P63L70l33q02P19O94
3466G13n88R4n64r6K48J91o08L87L07j93k57M35K9k39j17L3Q49l58k40l77N35
3487A84m56j13J172m83k90K38J51m84K23k2M59j50p79R74K34q02n91J20P2k9J161
3508G89p08M55r87K19O4M73l73L94m29J6m61L04nN8N20j017Q19l47P70j076L84
3529a38M99k20o73J70O11q50N32R1l03Q52r13n00R61p54N33m43Q26k09j88J47
3549C1J43q47O59M7M8M00p19j33Q70q00M46R6k99L47R9M8m08j71L78q12L97J1
$$ plain form
3571 -169 172 -339 93 -587 -621 -140 -11 -56 -321 -724 87 -125 -306 60 -363 -156 35 -251 40 84 196
3592 196 444 -104 -412 359 -27 -307 -281 -363 -228 -140 379 -175 608 -392 -877 -500 246 -825 -446 125
3612 125 -728 -362 -188 658 -16 241 102 285 131 304 -133 784 276 61 423 -763 307 -297 101
3631 101 -178 -434 -511 -214 -500 567 8 75 391 202 -111 -575 -184 125 223 -75 80 -52 17 367 252
3652 252 -469 239 109 -587 -546 76 -420 546 4 -884 91 118 313 246 -349 119 -347 100 607 -66 -91
3673 -91 -131 -821 -547 -550 -595 113 -343 -759 -295 -132 274 -48 42 53 -138 -768 -276 -322 185 892 -76 -466 -9
3696 -9 1252 607 -993 -47 -376 -185 -594 84 -125 237 80 -285 -392 278 -85 -252 176 -719 -681 76
3716 76 -149 -338 -196 -226 27 208 699 265 389 170 -265 172 305 105 -502 89 271 -124 -234 -76 95
$$ packed form
3571a69L41n11M32o80l4M81J29m5k65m03Q11k12j81L66m23K07J91k86K91M4J12
3592A96K48n48l08P71l86k80K6q2J35Q8N19n54P83j000m85L77P46j071L79N71
3612A25q53L66J74Q46o74K57j39J83j54J73m37R17n08k15L62j186J070o04L98
3631A01k79k56p7K97k86J067n59O7L16j89l13m64L91L09R8k98J55j32O9L50j15
3652B52p21P08j30o96M1O22m96R66n42q88R75K7J95o7n95M68m66M47N07o73k5
3673i1m0o90K74lm5P08m56m16M64J63M06l22R0J1j91o30M92m6N07P07r68l90M57
3696iJ261o45j600R46l29J91m09O78k09L62j57l65j07O70l63j67M28q95L8P57
3716G6k25j89J42l0K53J81M91m34J24k19m35M37J33k00o07N91J82l95j10J58J71
$$ plain form
3737 95 -185 13 -172 -312 200 -24 -256 257 -521 -787 132 276 -437 503 408 161 328 132 661 -646
3757 -646 -32 -492 217 -848 -476 430 453 150 -321 119 -104 -71 -790 -105 -265 378 -181 -677 5 -306
3777 -306 -471 -127 386 241 94 -397 285 -699 107 -42 -125 -868 -247 -442 -18 -27 -202 -336 500 -187 -101
3798 -101 18 481 433 -496 169 367 -245 -825 -155 127 -274 528 -189 -403 228 -193 -695 -512 -86 624
3818 624 1025 -172 343 399 95 103 100 -715 350 -400 481 -456 201 62 -728 234 315 201 181 266 -369 -370 -508
3841 -508 -125 567 -7 371 215 295 128 898 -29 -766 261 -156 -605 -64 395 -455 -153 41 -581 219
3861 219 106 -5 -122 -193 296 -22 43 -243 19 282 13 -571 495 30 61 311 -38 -251 -512 212 128
3882 128 -116 93 725 412 -612 428 -129 574 -226 379 155 125 147 -112 -197 -120 -397 335 -468 -323 -286
$$ packed form
3737I5k80J98j85j40N12k24k32N13p78k66R19J44p13R40r5k47J67j96N29j307
3757f46O14m60P09j065L72R06K3l03m71M40k23L3p19O85j60O43n59m96O82l11
3777c06j65L44N13j45j47m91O82r84Q06j49q3p43O21j95M24rj75j34Q36o87Q6
3798a01J19M63m8r29O65J98o12n80O70K82m01Q02p17k14O31m21n02J83M26P10
3818F24M01j197N15N6l04Qlq15J065p50Q81r37O57j39p90R62Q1j14k0Q5o35jj38
3841e08L83O92n74L78j56Q0j67P70r27p37J027m17m49N41M59q50L02J94o22Q00
3861B19j13j11j17p1M89l18O5k86K62K63k69n84J066m65L1K50l49k13k61P24q4
3882A28k44K09O32l13j024J040n57P03q00O05k24l0K2k59q5P7k77P32q03J45L7
$$ plain form
3903 -286 -160 572 744 -164 -109 42 67 110 -440 -263 -274 315 518 502 23 -54 456 -240 -610 123 -325 -342
3925 -342 9 -177 177 283 -239 -16 67 -18 219 -479 47 761 -195 -90 -760 -287 -169 -404 -58 -47 244
3946 244 -13 -409 40 -222 -460 289 -159 691 535 -184 -381 846 473 232 428 -108 529 900 -335
3965 -335 806 -485 691 449 753 58 567 -1052 -44 415 213 -26 -219 -373 -231 -156 -153 108 -713
3984 -713 -104 -183 140 -751 -26 -223 362 -148 25 188 553 406 -301 388 -269 132 -63 -397 -269 -103
4004 -103 642 -173 -54 1048 -716 166 -123 -223 -37 -404 117 242 60 7 -277 623 375 -663 279
4023 279 526 -297 -818 878 -312 -229 -334 85 -255 235 440 -101 227 197 -396 251 -554 150 206 -611
4043 -611 -319 -258 -418 -544 -397 -897 534 112 23 -1011 -179 375 626 499 -246 1133 99 420 781
$$ packed form
3903b86J26P32J72r08N5J51K5M3n50J77j1N89K03j6m79p7N10o96l70P33m48j7
3925c42L51j86L54J06n22K23Q3q5K37o98N26P14r56J05o70M73J18k35L46J1K91
3946B44k57l96M49k62k38P49m48Q50j56p19j97J227l73k41J96n36O37L71j235
3965c35J141j291J176k42L04o95N09j619J008M59k02k39j93j54J42P5LK61q21
3984g13O09p9L23q91P25j97N85n10J73J63L65j47p07O89o57M01j95l34J28J66
4004a03P45q15J19J102j764Q82k89j00J86l67N21J25j82n3k84R00k48j038R42
4023B79K47q23n21J696j190Q3j05M19l40M90K05n41L28l0n93O47q05P04N6q17
4043f11K92O1j60j26J47n00J431m22q9j034Q32N54K51j27p45J379j034L21L61
$$ plain form
4062 781 934 75 329 -702 -245 -373 322 131 -334 371 -64 -353 -409 287 526 218 464 327 903 -573
4082 -573 -168 622 -174 -446 -187 14 -178 -663 -293 -70 226 -348 614 60 172 653 131 -158 -677 241
4102 241 344 37 47 270 -247 437 -195 -390 28 269 322 -396 -262 -363 -551 -726 -335 339 -420 399 -321
4123 -321 343 201 -129 -47 69 614 -88 2 -140 -78 -118 356 857 -43 460 -413 316 -997 -395 65 1048
4144 1048 43 273 -286 352 -553 85 -580 -128 -262 -226 224 85 230 -303 739 -438 -201 195 -368
4163 -368 -136 103 390 -63 6 -27 507 488 243 -179 363 -342 188 210 353 66 252 -29 23 -9 -111 339
4185 339 102 -304 264 -529 -338 142 -154 -651 327 -840 -575 588 223 -68 -414 -47 297 -5 -376
4204 -376 -104 -10 -762 -876 -550 414 751 -334 -447 319 -1135 682 -371 150 229 504 798 94 -536
$$ packed form
4062G81J53q59K54j031M57j28O95j91m65P05m35k89n6O96K39l08K46j37N76j476
4082e73M05P90p96k72K59K01j92m85L70K23K96n74R62n54J12M81n22k89n19R18
4102B41J03l07J0K23n17O84o32j95M18K41N3p18J34j01j88j75L91O74p59Q19p20
4123c21O64j42l30Q2J16N45p02R0j42O2m0M74N01r00N03q73P29j313O02M60R83
4144A048j005K30n59O38r05O38o65M52j34L6M50j39J45n33J042j177K37L96n63
4163c68K32K39K87m53O9l3N34j9k45m22N42p05N30K2J43k87J86k81N2l2j02M50
4185C39k37m06N68p93J91M80k96m97R78j167K65J163l65k91l46L67L44l02l71
4204c76K72R4p52j14L26R64L37j085j13P66j454J817j053N21P9K75K94p04o30
$$ plain form
4223 -536 207 -522 75 294 664 1038 271 -438 -46 97 -451 -70 163 462 95 -120 -49 276 -93 737
4243 737 -634 -577 98 702 422 381 343 400 128 305 -231 767 258 398 408 -123 -300 -340 -177 224 218 -14
4265 -14 125 -10 159 -140 210 40 796 -397 -77 -395 -84 -109 197 -555 350 531 200 -33 1063 67
4285 67 -291 -703 -578 225 357 -106 272 126 -534 -47 -199 -102 119 22 142 392 -9 40 547 200 113 451
4307 451 651 -590 367 -328 -458 -521 -260 295 102 -42 -243 -351 -681 379 -342 -907 -153 -5 213 320
4327 320 86 57 481 301 -5 -50 -436 115 339 315 412 104 575 9 238 563 103 276 -640 522 -71
4348 -71 125 -79 -255 97 -587 255 -404 -196 227 -171 -862 -39 78 -18 -1067 -315 264 281 615 -67 -757
4369 -757 201 420 -175 -198 190 437 -314 418 141 -204 286 58 74 -2 -692 -397 271 -242 177 469 -292
$$ packed form
4223e36P43p29N97K19L70L74p67p09L92J43n48L81K33K99l67k15P1L25l69Q30
4243G37j371N7O75O04k80m1l8N7k72J77n36R98n09J40J0n31j77m0J63M01ok32
4265a4J39j35J69k99L50j70P56j193L20l18L11k5L06p52R05J81l31k33J096r96
4285F7l58m12J25Q03J32m63L78j46o60M87j52R7K21r7J20K50m01M9N07l47q7L38
4307D51K00j241R57o95j30o3K61N55j93j44k01j08l30J060p21n65P54J48K18J07
4327C20k34k9M24j80l06m5l86N51K24k4R7l08M71n66K29L25m60J73r16J162n93
4348g1J96k04j76L52o84Q42o59K08M23l98o91Q23J17r6j049P52N79J7L34o82o90
4369g57R58K19n95k3L88K47p51P32k77l45M90k28J6p6o90K95O68n13M19K92p61
$$ plain form
4390 -292 181 -23 37 300 -337 106 -41 264 -258 188 -1193 -462 -146 -151 93 -703 -490 10 -87 -14 183
4411 183 299 225 608 -70 595 280 115 -720 -602 281 -483 -687 -85 -124 -420 -90 -493 257 -21 592 -102
4432 -102 -640 240 -100 -409 -255 -129 344 -427 -225 -222 124 -307 97 14 32 401 -22 64 382 301 42 -722
4454 -722 -428 250 373 -608 -519 113 157 35 301 116 262 51 73 29 92 248 -340 -408 350 712 -31 604
4476 604 -96 251 -630 -270 -898 -155 310 449 -183 -76 -84 -437 -297 -368 277 205 584 -539 379 174 -255
4497 -255 387 -825 93 193 -273 -902 -282 -195 220 345 -428 -57 -94 263 -213 42 107 -500 57 468 163
4518 163 -403 238 -109 -197 220 -225 766 477 411 -15 -284 -380 -183 -522 454 102 -530 -212 208 -531 81
4539 81 286 53 -208 308 387 311 324 -91 384 -961 -223 58 66 -75 194 -251 470 -919 204 200 910 -309
$$ packed form
4390b92M73k04O0K63o37M43j47L05n22M46j381P31L16nK44p96K13N00r7P3J97
4411A83J16p4L83o78O65l15j65q35J18Q83p64k04O02l9k96L30m03P50k78O13o94
4432a02n38Q80l40l09J54J26M73p71K02LL46m31M04q3J8L69m23Q6L18q1k59p64
4454g22K94O78J23r81Q9O32M4j22K66j85J46k11K2m4O3J56n88o8P58L62p43O35
4476F04p00L47q81L60o28P43M65J39o32J07ql53J40p1O45p2L79j123R18k05m29
4497b55O42j212R18J00m66o29O20Q7M15J25p73L71l7L57m76K55O5o07N57M11l05
4518A63n66O41l47q8M17m45R91k89o6m26k69r6J97l39R76l52o32L18M20p39O12
4539H1K05k33k61N16P9p6J3m15M75j345P38K81Qj41K69m45P21j389J123mP10j219
$$ plain form
4561 -309 -164 89 -159 -77 -322 95 -159 338 42 -50 69 312 141 -244 501 -68 265 -1 -2 -192 -175 -691
4583 -691 690 452 562 99 -321 -52 362 -378 -535 -195 307 -45 271 520 170 -185 130 457 -197 -261
4603 -261 267 23 -610 1009 608 61 628 -207 -660 -89 -731 75 249 -314 357 200 47 -457 774
4622 774 -159 591 260 134 -511 292 -460 164 -602 -666 -7 -501 750 -169 392 -419 -169 59 708 -1140
4642 -1140 -140 -176 731 -535 534 192 -444 -238 152 158 55 -150 274 413 -558 518 312 5 -306
4661 -306 223 -165 -262 38 -198 146 523 58 -325 14 348 -111 300 -453 -118 -371 -60 173 -489 489
4681 489 -6 816 -747 -136 840 -33 439 410 213 -857 -421 -342 -682 -212 -236 1180 -45 -216 -323 379
4701 379 347 352 -815 -397 13 230 -280 76 849 -270 -349 5 -235 -753 -535 -147 -935 -591 5 240 588
$$ packed form
4561c09J45K53k48Q2k45M17k54M97k96r2J19K43j71l85P45n69L33k66jj90J7n16
4583f91J381k38J10m63m20K69M14p40j57L40N02l52L16K49l50l55L15L27o54o4
4603b61N28k44o33J619m01n47N67q35m53N71o42Q06J74n63O71j57j53n04J231
4622G74r33P50l31j26o45Q03p52O24p66o4O59m94J251r19N61q11K50K28O49j848
4642a140J000l6R07j266J069l42o36K06L90Oj03k05M24J39r71J076k06l07l11
4661c06N29l88r7L00k36L44L77m65l83L39L34m59M11p53L35k53L11K33o62R78
4681D89m95Q22j563O11R76q73M72k9j97j070M36P9l40M70k4J416j225j71j07P02
4701C79l2Nj167M18M10K17n10L56P73j119p9L54k40n18K18L88p88L44N96K35L48
$$ plain form
4722 588 -416 150 645 -237 -430 753 -596 -418 512 268 220 80 511 -117 557 634 473 568 206 259
4742 259 -147 -249 126 489 525 -11 296 -367 -322 388 -592 -128 366 -207 138 -106 -358 -330 -467 193 -401
4763 -401 60 -79 -46 22 -593 464 -131 -275 438 -401 392 -719 -158 475 102 147 280 -154 265 -612
4783 -612 88 138 -18 678 232 734 89 -198 -12 525 83 88 -768 163 -56 49 239 302 746 -273 465
4804 465 -495 -383 -186 -326 78 1009 369 308 -60 42 248 -320 -383 -513 344 -222 -606 -241 306 -430 250
4825 250 222 597 -8 -631 544 508 744 63 210 713 -402 -290 -500 783 225 279 -13 -65 -446 -40
4845 -40 -99 3 -70 297 -64 -239 -301 242 -27 -625 182 -123 -285 -282 157 -125 -282 -757 189 278 290 529 -343
4868 -343 96 -400 241 202 -490 224 247 -136 225 -668 255 51 -186 478 235 -561 324 -129 223 223 -199
$$ packed form
4722E88j004N66M95q82j93J183j349J78R30k44m8j40M31o28O74P7j61R5l62N3
4742B59m06j02L75L63L6n36L07o63M5P10r80M64M94n73L45k44k52K8j37O60n94
4763d01M61j39L3O8o15J057n95j44P13q39P93j111N61O33l73M5J33m34M19q77
4783f12P00N0j56O96m46N02o45k87J86N37m42Nq56R31k19J05J90O3M44j019P38
4804D65r60J12J97j40M04R31o40o1l68J02K06n68o3j30Q57n66l84L65N47p36O80
4825B50k8L75o05o23J175l6K36o81J47N03j115J12k10J283n58N4k92n2l81M06
4845d0n9J02p3L67l61j75o2N43k69n98Q07l05j62LM39k82j57m75R46Q9J2K39q72
4868c43M39m96O41l9o92P14K3l83L61q93R23k04k37O64k43p96Q85m53L52%m22
$$ plain form
4889 -199 38 -246 -342 -49 131 424 151 168 117 -375 84 298 -481 303 -14 -309 -727 -672 -37 -32 463 31
4911 31 270 -473 631 233 295 -170 -234 208 -43 278 298 -12 322 -419 -481 -360 178 937 -617 -554 327
4932 327 220 -53 239 -112 -414 208 153 -261 -28 257 -69 -256 98 453 -779 72 -126 -103 378 -59
4952 -59 288 935 536 258 -179 -231 -270 -69 755 -204 -373 -165 -972 -962 104 -336 102 31 -597 -890 -622
4973 -622 170 58 -133 73 -22 181 -475 481 484 227 -95 160 598 -181 -72 220 -31 658 194 71 297
4994 297 69 -138 -309 7 81 504 -84 -51 328 -313 -220 43 -374 205 -612 -313 -350 -134 53 90 -155 -175
5016 -175 284 573 116 289 -57 -332 652 -298 530 -603 -191 166 208 -445 -319 504 690 69 -127 66
5036 66 -29 -208 1146 250 -904 -99 350 99 318 -323 508 -179 -764 -97 678 296 -220 -58 294 -3
$$ packed form
4889a99K37k84r6K93J80K93k73J7n1m92M59K14p79P84l17k95m18N5O35NM95m32
4911C1K39p43J104l98O2m65o4M42k51L21K0l10L34p41o2J21N38P59j554O3Q81
4932C27j07k73K92l51l02O22n5m14K33K85l26j87L54L55j232Q51j98K3M81m37
4952e9L47O47l99k78m37n2l9K01Q24r59j69K08q07J0J066m40M38p1o28k93K68
4973f22P92j12j91K06r5K03o56R56Lk57l22K55M38p79J09K92k51O89m64j23K26
4994B97k28k07j71L16P4M23n88L3L79o41R3K63m17N79q17K99l7K16J87L7k45k0
5016a75M59K89m57J73l46k75R84r50Q28j133M12L57M2o53J26Q23J86o21j96J93
5036F6r5j79J354q96j154Q05M49k51K19o41Q31o87n85O67P75l82n16J62L52k97
$$ plain form
5056 -3 -66 469 -85 67 -239 -357 252 -205 -665 -871 -418 294 -11 461 -9 5 665 404 -126 262 288 1129
5078 1129 -175 224 -549 -263 468 96 28 116 99 186 -33 -416 -34 -204 -172 -97 -57 300 91 279 -616 165
5100 165 311 -64 -18 36 -429 461 580 -117 220 -533 -238 121 -123 -369 -752 91 403 -556 640 364
5120 364 -142 -130 -23 -111 650 -160 323 500 482 760 -427 -167 45 491 -419 -433 -721 252 312 -58 -546
5141 -546 136 -190 181 -204 -465 -93 -281 155 -324 361 240 112 -312 852 302 85 -459 -180 437 703
5161 703 42 -128 -88 -192 113 -391 144 -222 63 -642 -114 975 -325 826 362 751 60 -31 90 174
5181 174 38 -722 -361 327 396 -346 253 179 -10 619 6 153 81 94 91 -355 646 -674 9 -102 -269
5202 -269 529 -27 394 221 -328 90 -367 64 738 225 351 248 29 -51 308 -58 274 -41 304 -522
$$ packed form
5056co3N35n54J52l06j18O09m57m60k06M53P12l05M72m70J4O60k61n30L88K6Q41
5078A129j304L99p73K86P31l72o8Q8j7Q7k19l83L82j70L2P5M0L57k09J88q95P81
5100A65J46l75M6N4m65Q90J19o97L37p53K95L59k44k46l83Q43L12r59J196k76
5120C64n06J2J07q8P61q10M83J77j8K78j187K60K12M46r10j4k88R73O0l70m88
5141e46O82l26L71l85k61L72j88M36m79O85j21j28m24J164n50k17n44K79O17K66
5161G03o61j70M0j04L05n04N35l66K85p05N28J089j300J151m64L89o91r1J21Q4
5181A74j36p60L61O88O9p42N99p4j89O29o13J47p2J3lm46J001j320O83j11j67
5202b69P98n56M21j73n49M18m57M31O74n13J26j03k19q0L59l66L32l15L45q26
$$ plain form
5222 -522 -10 263 -353 -93 -474 -296 -39 921 -536 -218 -286 -325 164 -176 101 343 -371 126 -203 72
5242 72 145 -325 -84 290 254 -234 -204 1019 526 -215 -860 -337 -540 275 675 -67 -283 44 -204 630 -81
5263 -81 -550 112 767 -182 255 -350 -444 -32 50 303 226 -100 172 -260 511 26 -120 -279 463 149 -428
5284 -428 113 161 -115 108 403 351 -572 625 205 -384 -585 -56 -773 493 471 -87 -34 369 410 -364 -102
5305 -102 438 272 -241 54 208 -268 -188 501 124 -187 -581 114 149 -238 -240 -393 -382 273 287 274 262 110 -529
5328 -529 -671 -315 382 -310 600 -496 26 6 -67 256 353 -294 -424 28 -363 94 -108 549 210 -38 409
5349 409 -114 -692 1035 413 247 -117 614 -239 -17 200 545 -226 126 84 38 -284 102 -23 -748 -340
5369 -340 343 62 100 -703 630 -138 -535 167 -59 718 -365 -149 -290 353 -244 -65 -122 687 4 -19
$$ packed form
5222e22N12K73o16K60l81J78K57R60j457L18o8l9M89l40K77K42p14M97l29K75
5242G2P3m70K41L74l6m88L0J223m93p41o45N23k03Q15M00p42k16L27k48Q34p11
5263h1m69O62O55r49M37o05r4M12Q2K53p7l26K72m32P71m85j46j59P42l14n77
5284d28N41M8k76K23K95n2r23J197m20n89k01N29p17J266k2n58N3M03M1p74K62
5305a02N40j66n13K95J54m76Q0O89l77l11l94O95L5l87kj53J1O55J4j3j2j52o39
5328e29j42L56O97o92R10j096N22k0p3L23R7o47j30M52l91M57k02O57l39k48M47
5349D09n23n78J727o22j66l64P31q53K22K17L45p71L52m2m6l22L86j25p25M08
5369c40O83k81L8q03J333p68l97P02k26P77j083K16j41O43n97J79n7Q09o83k3
$$ plain form
5389 -19 581 -262 -90 253 -492 -331 -521 179 329 640 -116 -32 -939 52 -165 -613 200 493 101 206 704
5410 704 -100 -122 -819 365 160 211 -301 256 -232 245 309 -514 -383 -178 292 -240 182 -66 338 756 167
5431 167 -35 325 -662 -122 317 169 216 60 -790 -142 -626 33 -625 53 -439 886 -342 37 248 587
5451 587 -298 42 29 29 160 -85 650 -196 -388 224 -83 190 -274 -688 145 -670 -317 -216 -118 1 -172
5472 -172 -394 -343 3 -85 -6 -477 -238 -474 -71 972 375 -133 41 37 263 573 344 236 17 -180 -34
5493 -34 -560 315 -442 468 428 99 -30 -939 -149 212 -78 -45 -284 90 164 -501 -570 171 634 -766 356
5514 356 223 5 -181 -181 -217 246 263 -97 -511 263 -163 125 175 37 51 -24 133 -149 -96 -505 356 -203 399
5537 399 80 103 -671 575 839 -530 332 -526 480 -655 -175 131 1 -391 506 -836 59 460 -516
$$ packed form
5389a9O00q43J72L43p45J61j90P00J50L11p56Q4r07R91k17m48Q13K93l92J05M98
5410G04q04k2o97J184k05N1n12N57m88M77O4q23J31K05M70n32M22k48M04M18n89
5431A67k02L60r87N40M39j48M7j56q50O48m84O59o58O78m92J325j228L79K11L39
5451E87q85L40j3%J31k45P35q46j92O12l07K73m64m14Q33q15L53J01R8J19j73
5472a72k22N1L46q8P9m71K39k36M03J043n97n08J74mK26L10k29j08k19j97J46
5493c4n26Q75p57R10m0l29j29r09P90L61k90L3k39L74P4o65o9P41M63j400J122
5514C56j33k18j86%l6M63J7l60m14P74m26K88N0j38J4p5J57k82N3m09Q61n59O02
5537C99l19K3p74J246K64j369Q62q58J006j135M80L06j30l92Q97j342Q95M01r76
$$ plain form
5556 -516 -2 -704 -168 173 -674 315 97 -214 -183 551 -709 -433 -275 -62 6 -322 -180 -111 23 -525 502
5577 502 336 286 267 -54 -27 187 415 45 -5 -221 414 -3 117 541 411 193 -14 -160 401 81 -559
5598 -559 11 -489 215 274 -669 -242 92 -441 -148 277 -219 -85 -288 134 -804 -165 504 145 -275 818
5618 818 -266 -135 -178 -90 -69 439 30 -198 -509 468 -13 75 -408 -514 365 149 0 141 15 -730 129
5639 129 -431 429 69 157 499 261 -753 5 -325 167 369 142 -63 88 588 -237 -15 -440 -72 193
5659 193 -214 -359 450 -118 -180 463 223 -189 -144 200 -126 191 -504 -343 -401 542 530 811 -32 -10 -241 -224
5681 -224 228 -898 710 21 410 -340 -118 -100 -372 111 907 144 -179 -243 -198 252 -157 -256 75 59 595
5702 595 -253 241 147 -44 -328 172 -448 -314 36 -420 -111 -1049 430 -317 3 160 563 416 -379 125
$$ packed form
5556e16N14p02N36L41q47R89k18l11L1P34j260K76J58K13O8l28J42O9J34n48J027
5577E02j66n0j9l21K7K14K28l70n0k16O35m17J20M24j30k18k07j46N61l20o40
5598e59N70n00P04N9r43M27L34n33K93M25m96J34k03M22r38O39O69l59m20J093
5618H18j084J31m3Q8K1N08m09k28l11R77m81Q8m83j06Q79k16j49J41j26p45Q59
5639A29n60Q60l60Q8L42k38j014P58l30M92K02k27k05J51N00q25K22m25L68K65
5659A93m07j45Q09n68o2O43k40m12M5L44l26L17o95J61n8R43j2K81q43K2k31J7
5681b24M52j126J608o89L89p50K22J8k72M83P96p63l23o4M5M50m09r9L31j6N36
5702E95q48M94r4j91k84N00o20J34L50m56L09r38J479p47L20J57M03j47p95N04
$$ plain form
5722 125 225 -284 36 -368 291 968 -390 -703 759 279 534 609 -124 141 864 -352 -79 229 436
5741 436 17 -275 262 -856 183 -233 -664 -27 473 -184 -100 344 -234 135 63 193 85 -683 47 292
5761 292 122 576 263 747 337 -170 -956 -949 -480 485 130 379 680 115 388 161 -198 142 -91 257 -316
5782 -316 392 -130 -624 542 -100 303 272 757 -782 -472 -248 -401 593 420 -470 18 -701 -496 -172 -250
5802 -250 43 -542 -404 -227 637 568 -431 -125 58 -302 501 -573 -127 96 698 622 856 -92 377 140
5822 140 557 -344 -531 443 -25 -365 -9 185 182 -26 114 517 660 390 -148 -285 -123 -208 -103 57 -101
5843 -101 -215 0 -167 115 -141 -302 -360 280 327 -39 -154 -411 -550 340 262 -300 289 266 -137 -408 248
5864 248 642 269 216 -837 -45 -167 440 413 357 18 -180 95 -658 246 124 -116 -193 -543 -36 -446 325
$$ packed form
5722A25J00n09L20m04O59O77j358l13J462m80K55P5p33K65P23j216K73L08K07
5741D36m19k92N37j118J039m16m31O37N00o57Q4M44n78L69p2J30j08p68P30K45
5761B92j70M54l13M84m10n07p86PM69R65l55K49L01n65K73k27l59L40k33L48n73
5782c16P08n22m94J166o42M03l1M85j539L10K24j53R94j73q90M88p19K05L24p8
5802b50K93n85J38J77Q64o9r99L06J83l60Q03j074M46K23O02p6K34r48M69k37
5822A40M17r01j87R74m68l40L56J94lk08J40M03J43k70n38j37J62q5J05J60j58
5843a01j14K15j67K82k56j61n8O40M7l66j15k57j39Q90p8n62N89k3m03k71O56
5864B48L94l73n3j053P92j22O07k7n6l39j98K75p53R04j22k40p7l50N07m10P71
$$ plain form
5885 325 402 -348 -74 -28 -11 346 63 399 218 -264 214 -689 253 155 473 168 -326 -798 -476 98 -360
5906 -360 624 -315 -426 77 41 -10 -526 164 833 -767 23 455 20 -854 -568 -56 -113 84 -755 46 -244
5927 -244 -212 272 249 149 -385 744 59 675 44 -256 -289 349 -755 254 -13 427 73 -423 -124 -74
5947 -74 -106 -385 658 452 -76 -75 82 83 -125 389 62 209 -166 337 351 378 275 -270 435 488 -205 1307
5969 1307 81 -23 -19 -91 59 -127 206 90 -877 13 -1205 184 -152 -431 174 63 -318 96 574 380
5989 380 174 -39 429 157 -174 -875 -709 -199 -295 350 -97 30 203 -445 -427 -428 344 69 -325 383 -321
6010 -321 557 -113 -125 31 359 537 310 -93 -755 -702 620 65 237 267 209 -27 -530 -255 -294 -335 246 130
6032 130 2 -247 -932 119 219 49 -171 583 88 46 -155 -218 -160 -308 596 323 320 440 -265 469 -35
$$ packed form
5885C25P7p50K74M6J7L57k83L36j81m82M78r03R42r8L18l05m94m72L22N74m58
5906c60R84r39j11N03l6n1n16O90O69j600P90M32m35q74K86N12n7J97q39Q01k90
5927b44L2M84k3j00n34J129o85O16o31l00l3O38j104J009k67M40l54m96K99N0
5947g4l2k79J043k06n28JJ57Jk08N14l27J47l75N03J4K7j03n45P05N3o93J512
5969A307j226j04Mp2J50j86L33j16r67Q90j218J389l36k79O05j11l81M14M78j94
5989C80k06k13M68k72l31p01J66N10r6O45m47J27J73o48J8jP72k75l94P08p04
6010c21Q78o70j2J56L28J78k27m03o62N3J322n55J72L0n8k36n03K75l9m1N81j16
6032A30j28k49o85J051J00j70k20P54m95m2k01o3N8j48R04k73lJ20p05P34n04
$$ plain form
6053 -35 371 -38 171 -127 570 92 63 259 -228 69 457 -677 44 92 -140 105 366 71 -249 -387 -1068
6074 -1068 315 -488 879 8 190 -85 167 -198 157 381 156 65 505 -693 -209 -330 -711 -327 126
6093 126 -305 -36 -547 -590 272 -545 350 292 253 904 -291 -760 -580 173 218 435 919 -101 -636 418
6113 418 486 500 -405 -489 480 -754 285 43 -55 -223 -367 -299 223 -329 -468 78 -328 157 465 312 65
6134 65 732 -569 -181 123 287 -49 322 -439 62 229 -35 49 25 -110 318 -565 -214 196 280 -166 -456
6155 -456 60 500 -368 -510 -95 454 328 537 619 -166 -70 286 -170 -237 160 229 452 -145 382 391 178 229
6177 229 -159 -17 256 -97 -1011 180 309 -1 18 -778 310 142 -232 704 443 376 447 386 202 259 -302
6198 -302 79 481 -228 950 354 -275 38 97 -170 -464 -692 357 135 735 533 -265 -269 -246 317 234 -328
$$ packed form
6053c5M06m09K09k98O97m78k9J96m87K97L88j134P21M8k32K45K61k95l20j38o81
6074a068J383q03J367q71J82k75K52l65L55K24k25r1M40j198M84j21l81L84M53
6093A26m31K69n11m3Q62q17Q95n8l9O51j195m69J80P53M5K17M84j020n35J054
6113D18O8J4r05q4R69j234J039k42r8j68j44O8N22n52j39N46m06M85L08j53k47
6134F5O67j301L88L04J64l36L71p61N01J67k64Q4k4j35M28q83L51M10Q4m46k90
6155d56N16M40q68j42M15N49j26K09Q2p85R6L56m56o7L97O9K23n97N27Rk13N1
6177B29l88J42K73l53r14J191J29l10J9p96J088j68l74R36k61o7P1o1j84N7n61
6198c02L81M02p09J178n96o29L13N9k67k94k28J049k22O00k02p98mK3N63q3n62
$$ plain form
6219 -328 368 396 -277 -649 -507 -258 -39 -99 -1069 319 -288 423 -95 -402 291 280 -183 313 375 130 1
6240 1 -393 55 -303 -590 -126 -375 -681 -253 111 -502 -585 91 -144 -98 -68 198 260 426 -228 -291 8 -130
6262 -130 -890 433 566 64 414 507 181 512 -187 68 776 -152 417 255 -529 62 -290 214 8 -132
6282 -132 -88 143 -232 -197 -146 -210 -228 210 464 354 -258 287 -359 280 -106 -740 -310 44 -287 -335 -895 -256
6304 -256 27 -65 491 233 174 -544 392 131 -681 350 242 201 -470 -204 -343 -238 -516 -139 -542 -125 -218
6325 -218 -495 573 753 -298 339 383 -216 -28 -225 347 351 -155 831 -865 127 -360 -390 485 301 -189
6345 -189 -573 -26 579 73 260 747 491 -309 47 10 -254 69 -47 345 -41 -253 20 193 -558 -178
6365 -178 618 147 479 -193 280 -261 188 32 -98 -485 -128 98 375 -136 106 -295 951 261 -131 341
$$ packed form
6219c28O96K8o73l72J42K49K19o0r70J388o07P11n18l07O93j1m63M96O2k45j29
6240Al94M48l58k87M64k49l06M28L64o13q3O76k35M6L0K66O2J66o54o3K99j38
6262a30p60J323J33n02L50R3l26L31o99K55P08r28N69j62p84N91l52N04k06j40
6282a32M4K31l75L5N1o4j8M38K54j10o12N45o46O39l86o34M30L54l31m8n60O39
6304b56K83r2N56k58n9p18R36k61q12J031j08m1o71K66j39J05k78L77m03M17r3
6325b18k77J068J80j051O37M4n99J88j97N72Mn06R86j696R92m87l0Q75j84m90
6345a89l84N47O05n06J87M87k56q00L56l7k64L23j16L92l86k12K73J73p51L80
6365a78P96m71L32o72M73n41M49j56j30l87L57K26K77n11K42m01J246o90l92M72
$$ plain form
6385 341 137 -260 230 -654 -576 -415 29 -478 -778 762 21 198 372 -7 -130 52 146 -282 463 -366
6405 -366 20 -216 -494 -351 -51 1064 122 410 -192 118 516 -282 -552 -718 240 -120 -679 31 91 -9
6425 -9 -326 68 50 291 -41 182 -792 -618 3 -85 -166 -667 -57 141 -114 -103 54 130 -45 -842 -502 -137
6447 -137 -540 371 -405 34 181 43 -391 -704 231 -155 -71 16 150 278 -261 188 276 -174 -223 0 244
6468 244 296 557 -219 177 105 122 230 -71 -33 -71 446 140 163 164 -448 1193 -141 -226 -10 57 -53 502 -85
6491 -85 -271 -866 80 738 288 -188 -608 -18 66 -170 0 319 101 -380 489 -226 -363 -128 413 565 -211
6512 -211 -143 454 750 591 596 -106 80 -269 -1403 380 -366 -61 -22 -615 -43 -119 727 186 3 205 109
6533 109 453 -401 -148 -456 -99 -152 -22 251 -541 36 -87 -456 -565 -611 -349 474 554 -255 83 -90 443
$$ packed form
6385C41k04l97M90q84P8J61M44n07l00J540p41J77J74l79j23J82R4m28P45q29
6405c66L86k36k78J43L00J115r42K88o02L10L98p98k70j66R58l60n59P10O0j00
6425il17L94j8K41l32K23r74J74O21q8q1n01O10J98k55J1J57P6j75p97L40L65
6447a37m03R11p76M39J47j38m34l13R35l86Q4Q7J34J28n39M49Q8m50m9K23K44
6468B44N2K61p76L96p2J7J08l01L8l8N17l06K3Jo12J641j334q5K16O7j10N55n87
6491h5j86n95R46O58m50m76m20N90Q4k36J70L19k18m81Q69p15j37K35N41J52p76
6512b11O8N97K96j59Np02J86l49j134J783p46L05L9n93N72p6Q46n41j83K02r6
6533A09L44q54K53l08L57n3J30K73p92N77j23l69j09m6K62Q23Q0q09L38j73N33
$$ plain form
6554 443 -400 526 -516 -314 -204 -321 288 -13 474 397 -135 -892 188 529 -175 -1132 -720 85 -314 -420
6574 -420 376 -119 -839 -103 -169 -84 87 -204 115 788 261 -79 -433 890 293 429 -7 38 95 -176 -683
6595 -683 -373 -939 -765 -292 499 -299 440 -130 37 -87 287 21 -631 -393 -85 64 -760 -417 461 -333
6615 -333 -461 -945 -91 -154 27 448 337 -136 -241 196 443 368 600 230 291 -332 -49 -77 -237 215 -307
6636 -307 292 748 -179 33 -436 -151 -152 340 395 -261 -143 212 171 346 -169 172 107 -554 126 188 -423 -823
6658 -823 217 -171 552 159 136 411 -438 -140 -419 244 -322 239 -217 331 434 -85 -419 68 10 -45 166
6679 166 -239 103 -179 46 -94 290 -479 -606 -193 209 -651 25 -288 2 -179 328 22 -341 -75 -27
6699 -27 896 -1113 -451 201 -438 -8 -172 357 101 -766 -267 24 306 -45 55 431 111 558 223 41
$$ packed form
6554D43q43R26j042K02J10j17O09l01M87p7n32p57J080L41p04r57M12Q05l99j06
6574d20P96m95p20P36o6Q5J71k91L19O73n27l40l54J323n97J36m36M5N7k71n07
6595f83L10n66J74M73P91p98P39n70J67j24L74k66o52K38L08J49q24L43Q78p94
6615c33j28m84Q54o3J81M21j11m73j05M37K47p5K32l70O1o23K83k8j60M52n22
6636c07N99M56r27K12m69K85jM92N5o56J18L55m1J75n15L41o5o61O80O2o11m00
6658h23J040l88P23l93k3K75q49K98k79O63n66N61m56N48J03n19l34M87n8n5K11
6679A66m05L42k82K25j40L84p69j27M13M02q60O76l13K90j81N07l06l63K66M8
6699b7R23k009O62O52o39M30j64N29k56q67M99K91K82l51J00L76l20M47l35j82
$$ plain form
6719 41 399 -113 -176 168 490 -9 126 12 401 -108 -122 66 -193 -592 -4 61 917 -152 782 5 112
6740 112 243 -418 -56 -180 -173 -315 -217 -244 204 474 -81 337 -543 -582 205 -128 81 186 -188 42 -544 -170
6762 -170 357 227 249 111 286 389 -28 140 -353 108 -122 -146 550 269 243 821 167 -576 -62 -649 240
6783 240 826 410 236 232 286 16 86 423 -152 -494 16 437 989 -212 -167 17 -416 751 -770 419
6803 419 -35 -25 478 36 502 -145 520 289 15 312 449 132 -3 -362 994 -795 -200 60 264 -252
6823 -252 -272 180 -339 326 411 263 115 435 487 -114 303 -229 505 292 562 -238 228 199 -263 -409 478
6844 478 -57 690 608 606 25 -112 138 -328 -402 -1093 -123 -501 -707 75 603 132 -162 -349 -1 32 785 -441
6866 -441 563 -358 -288 219 -206 45 -29 55 555 -182 12 252 -398 -1008 215 273 191 99 -541 4 -136
$$ packed form
6719D1L58n12o3L44L22m99J35j14L89n09j4J88k59l99N88O5Q56j069R34p77J07
6740A12J31o61L62j24Pj42R8k7M48K70n55M18q80l9P87l33K09J05l74K30n86L74
6762a70N27j30K2j38J75J03m17J68m93M61k30k4O96k81k6N78o54p43N14n87Q89
6783B40N86m16j74mN4k70P0L37n75l42N10M21N52j201M5J84m33J167j521J189
6803D19m54J0N03m42M66o47O65k31k74K97J37l17j35l59J356j789N95K60K04n16
6823b52k0M52n19O65Q5j48j48L20N2o01M17n32P34k13K70q00M66k9m62j46Q87
6844D78n35P47q2kn81j37K50m66p4o91R70l78k06P82N28m71k94j87L48L3P53j226
6866d41J004r21P0N07m25K51p4Q4N00p37J94K40o50o10J223N8q2r2o40N45j40
$$ plain form
6887 -136 -708 -436 489 -30 -41 420 352 685 -192 90 -2 -19 -205 83 -334 -351 1012 351 173 -522 80
6908 80 -203 266 623 262 -606 -32 -129 689 -420 223 -546 -146 295 -453 318 -472 348 -393 32 -311
6928 -311 734 54 -182 248 -514 -70 -17 612 -395 935 368 93 302 -288 -783 552 -515 -338 -252
6947 -252 -174 93 195 389 132 398 -477 225 -179 -56 384 -333 325 355 51 148 71 144 -139 461 50 480
6969 480 296 448 183 205 -499 -389 673 317 260 -560 315 -11 774 2 128 272 -365 -319 276 -324 -383
6990 -383 -654 -232 -345 322 -484 -791 -125 49 394 114 -253 78 618 54 26 -451 322 -413 -201 651
7010 651 -48 -95 168 -326 114 260 -97 391 -175 -372 -169 511 -155 -233 -72 116 556 -120 731 271 -181
7031 -181 -365 135 496 531 226 -347 -587 -34 165 -129 -263 -49 -75 -404 189 157 819 -74 471 61 -312
$$ packed form
6887a36n72K72R25n19j1M61o8L33q77K82r2j7j86K88m17j7J363o61j78o95O02
6908H0k83M69L57l61q68N74r7Q18j109O43p69M00M41p48P71p90Q20p41M25l43
6928c11J045o80k36M30p62M44N3O29j007J330n67k75K09n90m95J335j067J77Q6
6947b52P8K67J02J94k57K66q75P02m04J23M40p17O58L0l04R7p7P3k83O00m11M30
6969D80j84J52k65K2p04J10J062l56n7q20Q75l26P85p72J26J44o37M6N95o00n9
6990c83k71M22j13O67q06l07O66J74L45k80l67L31N40n64k8m77P73p35K12Q52
7010F51o99m7K63m94M40J46l57M88n66j97K03O80o66p8J61J88M40o76Q51m60m52
7031a81j84N00L61L5l05n73k40N53J99k94j34K14k6l29N93l2O62q93N45m10l73
$$ plain form
7052 -312 229 -12 77 742 -573 375 455 -380 -397 604 662 -137 -11 12 335 -617 203 -258 213 -148 -61
7073 -61 166 -242 269 351 -112 541 349 -222 -852 529 329 -133 -539 -132 548 -146 -429 457 -262 -1004
7093 -1004 111 224 -515 0 238 160 54 16 193 459 288 1000 218 388 -163 -414 24 156 211 -1022
7113 -1022 107 -357 -113 -208 -158 555 -234 -396 -582 -553 -118 61 107 726 -768 169 81 112 -46 110 -34
7134 -34 645 -187 -646 -26 -252 211 526 -248 117 21 740 -498 289 323 -227 146 130 197 -304 83 -409
7155 -409 -16 211 413 163 138 315 99 -844 181 -135 61 430 -287 -159 248 -109 -557 -116 81 244
7175 244 -297 -404 -236 262 508 153 165 206 281 -183 538 191 142 -394 1171 133 707 234 255 -80 -77 32
7197 32 -106 680 -362 -149 531 820 345 -662 -426 321 182 -181 -684 -255 -23 -372 70 -528 -519 485
$$ packed form
7052c12N41k41Q9O65j315R48Q0q35j7J001N8p99J26K3L23r52Q20m61M71l61Q7
7073f1K27m08N11Q2m63O53j92n71o30J381k00m62m06M07O80o94k83Q86p19p42
7093a004J115J13p39N15K38p8j06l8J77K66j71P12p82J70n51k51M38J32N5j233
7113a022J129m64K44r5N0P13p89j62j86K9M35J79M6O19j494R37q8L1j58J56j44
7134c4O79q32m59O20k26M63L15p74L65r6P19j238P87L4n50L73j6O7n01L87m92
7155d09L93K27K02k50k5J77k16r43J025l16J96L69p17J28M07l57m48M41J97J63
7175B44n41j07J68M98K46l55J2M1P5m64P21l47m9n36J565j038N74m73K1l35LJ09
7197C2j38P86j042K13O80K89m75j007K36P47j39l63n03M29K32l49M42n98RJ004
$$ plain form
7217 485 31 -296 296 154 175 32 -282 162 -620 720 570 -66 -313 166 536 327 155 627 130 88
7237 88 508 475 233 -878 -103 -34 80 135 -20 -333 -654 -1146 -702 -51 -450 -100 557 -306 -337 -511 -40
7258 -40 -410 653 214 -399 148 288 -583 90 134 -513 -25 206 -505 547 708 -13 -117 60 341 119
7278 119 349 32 346 227 185 131 664 -32 18 83 -215 -162 -47 395 359 302 167 612 -458 783 605 289
7300 289 561 422 91 199 -597 171 82 -645 762 -38 -29 4 331 490 292 71 -153 -492 -29 595 487
7321 487 -322 -225 33 4 -114 -407 -49 243 -479 366 -94 -115 497 346 467 278 178 -270 -741 777 359
7342 359 -139 -68 -626 22 -172 -325 -126 -41 -335 312 683 123 -333 46 378 688 264 -439 47 -216 -120
7363 -120 -241 740 13 101 -199 -96 69 1037 -20 -206 -227 -143 304 165 217 451 -926 -316 686 -408
$$ packed form
7217D85m54l27N92j42K1j43l14M44p82J340j50o36k47M79L70k09j72M72m97m2
7237H8M20l3k42j111P75O9J14N5j55l13l21m92M44O51l99L50O57q63l1j74M71
7258d0l70J063m39o13N47J40q71O73M4o47M88K31p11J052J61p21j04J77K81k22
7278A19K30l17L14j19m2n4N33o96N0O5k98N3J15M42l6n7j35M45j070J241j78l16
7300B89K72j39l31J08p96P68q9p27J407q00RL3L27J59j98k21k24l39M63O24j08
7321D87q09R7K58k9j18k93L58K92p22Q45m60k1O12j51J21j89j00m48m71J518m18
7342C59m98P1n58O48j94j53J99Q5k94O47L71n60m56L79L32L10m24p03M86k63R6
7363a20j21R81p27Q8l00J03J65R68j057j86k1Q4M47j39N2K34j377O10J002j094
$$ plain form
7383 -408 -27 211 -189 -549 -4 318 546 304 420 -456 -46 -523 -33 163 371 -329 -140 514 -56 780
7403 780 34 263 -667 150 216 -38 40 743 -110 -523 592 -828 466 607 -1 -13 38 985 -280 -11
7423 -11 -120 151 -75 355 110 105 -374 -178 -179 -402 46 -542 809 765 282 -471 744 -4 170 -73 180
7444 180 -607 -209 -686 26 560 -51 -109 16 -45 -312 620 -280 444 -528 621 -110 -286 -107 419 316
7464 316 -647 355 156 -3 -1132 -542 127 21 720 671 80 -121 336 443 -411 -479 302 436 644 1
7484 1 420 364 313 -20 1 422 773 -610 284 -854 552 -239 -471 135 253 263 -427 -276 -745 -24 344
7505 344 -387 545 69 72 -697 340 -12 -433 -177 -608 401 -1139 -333 -44 -344 760 83 -247 690
7524 690 -60 273 574 417 -204 515 -762 -9 143 528 -101 -315 261 -240 880 43 -205 -535 -45
$$ packed form
7383d08L81K38m00l60N45L22K28k42J16q76M10m77M90J96K08p00J89O54n70Q36
7403G80p46K29r30Q17O6k54P8P03q53m13J115j420J294J41o08j2N1R47j265K69
7423a1j09K71k26M30k45nm79J96jk23M48n88J351m4m83p53J215p48J74k43K53
7444A80p87L98m77P12N34o11n8J25o1k67R32r00P24r72J149p31j76J79N26j03
7464C16r63J002j99j59j129N90O69j06O99m9n91k01M57J07q54o8P81J34K08o43
7484AM19n6n1l33K1M21L51j383Q94j138J406p91k32O06J18J0o90J51m69P21L68
7505C44p31R32m76Lp69J037l52m21K56m31J009j540Q06K89l00J104o77l30R37
7524F90p50L33L01j57o21P19j277P53J52L85o29k14N76n01J120q37k48l30M90
$$ plain form
7543 -45 404 395 303 -101 -422 87 -37 130 -47 -1064 914 170 -559 200 -371 -191 -768 -628 -286 862
7563 862 30 182 278 -891 115 -17 708 104 -131 -118 215 -122 -201 -332 -1040 303 -385 61 440 -578
7583 -578 -627 -126 7 -340 270 249 -568 479 -247 427 1 48 -519 -441 -250 282 -73 -424 -26 -379 233
7604 233 60 31 334 -54 -141 93 105 -762 19 -145 154 1010 475 -157 242 -58 -24 391 -629 346 -46
7625 -46 8 215 816 101 -87 -286 -611 211 -487 300 569 232 -372 377 -284 448 788 6 285 -415 36
7646 36 -184 -786 168 -59 -574 256 69 511 -95 409 -53 -145 73 460 -352 -429 -559 319 312 392 345 -3
7668 -3 757 -393 823 142 578 569 -128 637 156 364 566 -122 -53 67 951 -556 411 84 -411 439 664
7689 664 172 -267 16 533 553 391 -226 340 39 -384 -186 -677 18 -404 -257 282 395 530 -855 429
$$ packed form
7543d5M49rr2m04l21N09j24J67j77j017J978p44p29P59n71J80n77J40L42J148
7563H62q32J52R6j169J006j32P25o04k35J3L33l37p9j31p08J343o88M46L79j018
7583e78m9N01J33l47O10k1q17J047p26O74m26M7n67P8J91N32l55l51L98l53O12
7604B33j73k9L03l88q7K34J2q67P81j64K99Q56n35o32L99l00L4M15j020R75l92
7625d6N4K07O01p15j88j99l25Q22o98P87K69l37o04P49o61P32L40p82K79p00M51
7646C6k20o02R54k27n15Q30j87M42o06N04m62r2K18L87q12p7j30Q78pQ0m7l48
7668cP60j150J216o81M36ro97P65m81K08K02o88O9J20Q84j507R67l27m95Q50K25
7689F64m92m39K83N17K0j62o17N66l01m23J98m91O95m22J47N39J13J35j385J284
$$ plain form
7709 429 258 160 -878 -687 868 120 -369 521 52 203 223 386 283 10 -30 -268 -221 -279 -182 -437 -169
7730 -169 -255 315 519 138 195 -424 -64 283 275 -241 -11 25 140 -1029 -888 146 114 -526 645 -531 -558
7751 -558 273 -428 308 -90 75 602 69 -1 189 376 -499 45 -64 51 -557 -29 -224 257 130 -138
7771 -138 -221 203 296 -78 -271 -11 697 -304 -224 354 -402 -154 -104 -438 572 -377 -538 7 523 -164 34
7792 34 165 -74 -160 212 445 -25 77 -430 635 -139 348 483 -154 -340 -322 196 -171 84 -96 -536 83
7813 83 25 322 -192 -524 -65 -271 314 177 -520 -522 -342 185 113 22 -65 -116 427 -229 -868 143 187 -450 -333
7836 -333 -387 107 445 89 -159 137 -288 12 615 -343 -249 -364 -281 572 -9 622 -281 502 -2 131 -301
7857 -301 266 -191 304 -263 -277 275 166 151 -183 8 -228 -520 272 565 -65 262 261 -490 -490 362 -239 175
$$ packed form
7709D29j71r8j038J91J555p48m89Q90m69J51K0J63j03k73m0k38M7n8R7k55K68
7730a69q6N70K04l81N7o19L60L47qn16K30L6J15j169J41J034l2o40J171j176k7
7751e58Q31p01P36l98J65N27n33p0J90J87q75N44j09J15o08N28j95M81j27k68
7771a38q3M24R3l74j93K60P08j001Q0N78p56K48N0l34J010r49j61N45N16o87J98
7792C4J31k39q6L72K33m70J02n07J065p74M87J35o37j86J8N18l67K55j80m40O19
7813H3n8K97n14l32M59k06N85j37o97kJ80N27p2r1q7n1N43o56o39J011M4o37J17
7836c33n4M94L38l56k48K96m25L00O03r58R4j15Q3Q53n81O31r03P83n04J33m32
7857c01N67m57M95n67j4N52j09j5l34J91k36k92P92K93o30L27jp51%Q52o01M14
$$ plain form
7879 175 86 366 -387 -146 523 -71 411 48 190 -81 211 -591 -591 -148 -290 -92 190 53 -626 25 916
7900 916 -267 16 192 141 -93 -160 -587 192 482 -44 110 -180 -525 -259 533 325 -426 476 1035 124
7920 124 16 -382 -214 -453 41 -387 111 -147 -219 -376 -476 249 130 194 620 -169 -80 342 -183 111 361
7941 361 68 132 112 1263 -337 -816 177 364 -830 -202 49 -208 -164 -955 390 259 -142 -241 152 211
7961 211 614 -419 -411 -381 -66 23 -244 761 89 -179 -166 433 475 -85 -173 230 79 -168 -624 46 -278 235
7983 235 -82 -29 291 707 671 29 -47 678 323 -149 387 472 -250 -42 -1062 486 238 98 48 -135 333
8004 333 -76 -483 -24 69 222 381 -48 140 1006 52 -374 199 474 -19 -285 -235 -281 60 -267 669 -318
8025 -318 255 -348 -27 -700 -417 -174 46 77 245 127 -150 475 -231 -143 342 -103 -857 577 72 -553
$$ packed form
7879A75q9K80p53K41O69n94M82l63J42k71K92q02%M43j42J98K82j37o79O51Q91
7900I16j183K83J76n1k34o7m27P79K90n26J54k90l45K66P92k08p51R02N59r11
7920A24j08l98J68k39M94m28M98k58p2j57j00P25j19O4M26p89Q9M22n25K94K50
7941C61k93O4k0J151j600m79R93J87j194O28K51k57M4p91J345j31m01r9L93N9
7961B11M03j033QL0L15Q9k67J005o72k68J3N99M2n60q8M03j51k47m56O70l24N13
7983B35l17N3L20M16l6o42p6P25l55m72N36Q5p22K08j020J548k48j40n0j83M68
8004C33m09m07M59R3J53J59m29J88Q66r54m26N73K75m93k66N0m6L41l27R36r87
8025c18N73o03L21o73K83K43K20L1J68j18k77O25p06Q8M85m45p54J434n05o25
$$ plain form
8045 -553 545 211 -487 251 26 380 111 -110 150 -200 -691 -465 -128 -239 -9 -65 -406 660 538 -270
8065 -270 -428 665 264 -464 -333 -504 -73 -275 -162 89 -1196 196 877 267 4 200 -218 459 -120
8084 -120 -588 42 -158 -151 595 -125 356 -442 -299 549 621 693 225 515 280 -428 -101 494 375 -90 290
8105 290 -126 -292 188 -306 230 -753 -223 -1 -627 304 -35 154 137 -860 -114 -439 -83 520 218 671
8125 671 -739 -596 62 -402 -454 232 -703 259 409 -619 -1050 -580 -322 270 304 85 156 -389 -506 484
8145 484 188 449 -331 -65 96 -882 -264 -173 -199 -14 -531 -375 129 424 790 -67 565 -847 -19 254
8165 254 -518 -120 -56 -304 -99 92 643 -451 -48 -519 -181 288 -109 495 231 42 258 -213 -177 664
8185 664 -774 21 -39 -77 71 9
$$ packed form
8045e53J098l34o98P38k25L54k69k21K60l50m91K26L37j11K30n6l41J066j22q08
8065b70j58J093m01p28J31j71M31k02J13K51j285J392O81o10k63J96m18O77n79
8084a20m68O30k00PP46p20M81p98J43Q48P2P2m68K90k35p08L27N95j19m65L80
8105B90m16j66M80m94N36r83N30K22o26R31l39J89j7r97P46l25L56O03l02M53
8125F71j410J43O58m64n2O86r35R62J50j028m31M70K58N92L4k19P1n45j17R90
8145D84k96K61p80K66J61r78O18R1k6J85n17J56N04K95L66q57O32j412Q28K73
8165B54p72L98O4k48K05J91N51j094M03m71L38M69l97O04k64j89K16m71L6Q41
8185F64j438P95o0l8J48o2
8191I
$$ Imaginary data points
##PAGE= N=2
##DATA TABLE= (X++(I..I)), XYDATA
$$ plain form
0 0 0 0 0 0 0 0 0 0 0 0 0 0 0 0 0 0 12 -64 64 -64 64 -64 103 -128 128 -146 192 -193 256 -263 320 -365 403
33 403 -455 518 -582 658 -735 818 -915 1014 -1131 1251 -1386 1534 -1691 1868 -2063 2269
49 2269 -2502 2755 -3035 3347 -3696 4087 -4525 5030 -5617 6293 -7101 8078 -9290 10833
63 10833 -12875 15721 -19966 26994 -40653 77137 -375809 -971946 -32277 516787 274756
74 274756 4929 223455 339092 290992 234923 309453 351588 262633 80826 127022 311883
85 311883 326637 116241 -23771 -1145 66773 -44073 -257633 -262316 -43817 -25978 -219314
96 -219314 -229874 -68075 -100270 -250854 -244862 -131910 -82622 -92310 -108457 -38800 139359 212680
108 212680 60111 -30819 94964 167915 58815 13881 126241 196213 113839 18400 62752
$$ packed form
0@%%%%%%%%%%%%%%%%J2p6J28j28J28j28J67k31K56k74L38l85M49n19N83o85P68
33D03q58R73j100J240j393J553j733J929k145K382k637K920l225L559l931M332
49B269m771N257n790O382p043P783q612R555j0647J1910j3394J5179j7368K0123
63A0833k3708K8596l5687M6960o7647J17790m52946n96137R39669N49064k42031
74B74756k69827K18526J15637m8100n6069P4530M2135q8955j81807M6196J84861
85C11883J4754k10396j40012K2626O7918j10846k13560m683K18499J7839j93336
96b19314j0560J61799l2195j50584N992J12952M9288r688j6147O9657J78159P3321
108B12680j52569r0930J25783P2951j09100m4934J12360O9972q2374r5439M4352
$$ plain form
119 62752 153132 69547 -110059 -95934 49083 15454 -128921 -92739 48533 33034 -105466
130 -105466 -144674 -40196 26778 -66086 -159669 -58338 90400 38896 -84635 -32176 102803
141 102803 83131 -30633 -34872 66194 101536 19139 -32478 45456 119237 35341 -72818
152 -72818 -12704 95832 43225 -72328 -58238 24765 16087 -69315 -98887 -24800 33251 -28879
164 -28879 -99319 -27918 70362 15875 -87505 -56431 43454 48561 -24206 -36504 53996 114268
176 114268 41972 -30781 29187 93511 20927 -60343 -8043 76999 55066 -19620 -17314 56223
188 56223 64164 -35303 -99481 -37403 15089 -47447 -96016 -26347 44757 2404 -65500 -45028
200 -45028 16057 -311 -75346 -77141 16918 64585 10615 -17507 47150 88120 30683 -26825
$$ packed form
119F2752R0380q3585j79606J4125J45017l3629j44375L6182J41272j5499j38500
130a05466l9208J04478O6974r2864r3583J01331J48738n1504j23531N2459J34979
141A02803j9672j13764m239J01066L5342q2397n1617P7934P3781q3896j08159
152g2818O0114J08536n2607j15553J4090Q3003q678q5402k9572P4087N8051o2130
164b8879p0440P1401R8280n4487j03380L1074R9885N107p2767j2298R0500O0272
176A14268p2296p2753N9968O4324p2584q1270N2300Q5042k1933p4686K306P3537
188E6223P941r9467o4178O2078N2492o2536m8569O9669P1104m2353o7904K0472
200d5028O1085j6368p5035j795R4059M7667n3970k8122O4657M0970n7437n7508
$$ plain form
212 -26825 -1744 49141 34590 -17001 -5571 66327 77787 2545 -31532 17812 36040 -26987
224 -26987 -70820 -30959 18953 20 -44540 -28148 24433 11571 -53819 -60386 -1712 14572
236 14572 -34412 -52712 3657 46020 15597 -28814 -3284 47339 32585 -20142 -12609 43112
248 43112 45752 -6746 -19354 31068 52883 9253 -26314 6764 41632 10275 -39236 -26985
260 -26985 14599 4550 -36975 -32874 14906 22846 -20582 -38597 -2453 18078 -19846 -53877
272 -53877 -23762 22807 15368 -17351 -4976 37477 36058 -8550 -23356 11880 25669 -7851
284 -7851 -22680 17294 52128 28878 -7321 1733 25663 8313 -32147 -34440 2656 13806 -11107
297 -11107 -16665 14603 26319 -9551 -40022 -22327 2871 -12170 -37675 -18927 22226 27896
$$ packed form
212b6825K5081N0885j4551n1591J1430P1898J1460p5242l4077M9344J8228o3027
224b6987m3833L9861M9912j8933m4560J6392N2581j2862o5390o567N8674J6284
236A4572m8984j8300N6369M2363l0423m4411K5530N0623j4754n2727P533N5721
248D3112K640n2498j2608N0422K1815m3630l5567L3078L4868l1357m9511J2251
260b6985M1584j0049m1525M101M7780P940m3428j8015L6144K0531l7924l4031
272e3877L0115M6569p439l2719J2375M2453j419m4608j4806L5236J3789l3520
284g851j4829L9974L4834k3250l6199R054K3930j7350m0460k293L7096J1150k4913
297a1107n558L1268J1716l5870l0471J7695K5198j5041k5505J8748M1153N670
$$ plain form
309 27896 -1588 -8133 18511 21806 -11698 -26880 2125 25588 9381 -8533 11813 38577
321 38577 23501 -12514 -12936 11627 9967 -17405 -21053 8083 21336 -1055 -17657 219 15254
334 15254 -5925 -29777 -20258 7524 3315 -22934 -20404 10572 16246 -7198 -15119 6358 19517
347 19517 165 -17725 -1476 19646 8586 -11659 -2143 24147 22325 -1797 -7876 11477 14447
360 14447 -6486 -17937 -1672 13281 2455 -11508 -16 19252 8224 -17346 -20044 -1072
372 -1072 -976 -19050 -21336 1910 15982 2240 -9217 2943 14784 -465 -21125 -11448 9267
385 9267 9119 -4572 1408 22223 24229 3712 -10050 -10 8441 -4425 -16658 -3853 15521
398 15521 10997 -3548 -1803 10808 4711 -17070 -23224 -5792 4240 -7729 -14296 2179 16012
$$ packed form
309B7896k9484o545K6644L295l3504j5182K9005K3463j6207j7914K0346K6764
321C8577j5076l6015m22K4563j660k7372l648K9136J3253k2391j6602J7876J5035
334A5254k1179k3852R519K7782m209k6249K530L0976N674k3444p921K1477J3159
347A9517j9352j7890J6249K1122j1060k0245R516K6290j822k4122o079J9353K970
360A4447k0933j1451J6265J4953j0826j3963J1492J9268j1028k5570k698J8972
372a072R6j8074k286K3246J4072j3742j1457J2160J1841j5249k0660R677K0715
385I267j48j3691N980K0815K006k0517j3762J0040Q451j2866j2233J2805J9374
398A5521m524j4545J745J2611o097k1781o154J7432J0032j1969o567J6475J3833
$$ plain form
411 16012 6509 -8362 -4243 6642 86 -13393 -8811 9466 15225 1779 -1608 11368 17911
424 17911 4057 -9897 -4024 7618 2713 -9315 -4059 9938 8428 -6836 -8406 2843 4781
437 4781 -10924 -19185 -7220 2762 -3380 -11530 -2907 11753 8023 -4148 -4318 6054 6772 -5286
451 -5286 -9105 3162 12990 4604 -1977 7542 17249 8193 -5597 -4460 4530 3045 -7992 -7988 4925
466 4925 10119 -32 -6600 1912 5181 -6623 -16707 -11692 -2319 -821 -6754 -4072 7698 8794
480 8794 -1939 -6329 -158 2074 -6730 -10767 -1067 10749 10111 2678 4177 12481 9632 -3929 -7148
495 -7148 1530 4054 -2454 -3551 5729 10679 5108 -5111 -4015 2022 -3794 -14138 -11825 -553
509 -553 2197 -2389 -3810 2548 5291 -1380 -8463 -4858 2151 -2574 -6828 285 8472 8769 3745 1715
$$ packed form
411A6012r503j4871M119J0885o556j3479M582J8277N759j3446l387J2976O543
424A7911j3854j3954N873J1642m905j2028N256J3997j510j5264j570J1249J938
437D781j5705q261J1965R982o142q150Q623J4660l730j2171j70J0372P18j2058
451e286l819J2267R828q386o581R519R707r056j3790J137Q990j485j1037MJ2913
466D925N194j0151o568Q512L269j1804j0084N015R373J498n933K682J1770J096
480H794j0733m390O171K232q804m037R700J1816o38p433J499Q304k849j3561l219
495g148Q678K524o508j097R280M950n571j0219J096O037n816j0344K313J1272
509e53K750m586j421O358K743o671p083L605P009m725m254P113Q187K97n024k030
$$ plain form
525 1715 4872 7268 1237 -5728 -1579 5574 450 -3653 2919 7739 3966 -1280 -3059 -161 -529
540 -529 -7288 -10475 -3969 2414 -1637 -4490 -705 3504 426 -3289 -4908 -2468 337 -3984 -4111 4929
556 4929 10818 3768 1890 5898 5761 1693 -3874 -3568 -59 513 -199 279 5445 6231 245 -3426 -3867
573 -3867 -3678 -6609 -8555 -6521 -335 3018 -600 -1054 3640 2433 -3825 -5302 -2331 509 -86 589
589 589 3938 7948 8014 2794 1338 2551 616 -3011 -3675 -406 1921 1200 -292 2040 3552 627
605 627 -5938 -6854 -3712 -3914 -5599 -4999 -275 1515 291 -946 295 811 -1606 -3841 -2720 775
621 775 2617 2356 1998 5569 6639 3491 1635 1403 771 -646 -1442 -889 822 1004 1331 820 955 1716
639 1716 -2460 -6067 -4244 -2797 -3443 -4141 -1871 1184 2917 1581 360 738 669 -2637 -2831 35 1571
$$ packed form
525A715L157K396o031o965M149P153n124m103O572M820l773n246j779K898l68
540e29o759l187O506O383m051k853L785M209l078l715j619K440K805m321j27R040
556D929N889p050j878M008j37m068n567L06L509N72p12M78N166P86n986l671m41
573c867J89k931j946K034O186L353l618m54M694j207o258j477K971K840n95O75
589E89L349M010O6n220j456J213j935l627o64L269K327p21j492K332J512k925
605F27o565r16L142k02j685O00M724J790j224j237J241N16k417k235J121L495
621G75J842k61l58L571J070l148j856k32o32j417p96N53J711J82L27n11J35P61
639A716m176l607J823J447o46o98K270L055J733j336j221L78o9l306j94K866J536
$$ plain form
656 1571 1759 2056 4169 4401 4535 1421 -704 -1173 -629 -1992 -2590 527 2445 1787 2353 581 221 -1163
674 -1163 -3649 -5944 -3797 -2792 -1946 -587 2014 2783 2024 974 -1078 -1465 -393 -1293 -1452 1825 3463
691 3463 2971 2751 3385 2768 932 -1891 -2428 -1453 -1701 -1655 -674 2285 3122 263 -1223 -961 -1818 -2237 -3315
710 -3315 -3859 -1753 330 1134 1440 1902 2335 -34 -1448 -901 -655 -1145 -1173 -276 2871 3643 2453 1902
728 1902 1585 1692 -1604 -2184 -2921 -1689 -1036 -402 400 1856 2060 597 -930 -989 -1754 -2143 -2479 -2371 742
747 742 1623 1691 1128 2406 876 -543 -2001 -1932 -939 -651 -181 1538 3454 2277 1078 1368 -142 -1000
765 -1000 -3161 -1973 -907 -72 96 877 1842 1733 602 -638 -2512 -1978 -1049 -2495 -1133 1151 1700
782 1700 1995 689 1712 806 -264 -2989 -1991 -616 18 -53 1355 1986 2981 1358 -672 -482 -862 -1577
$$ packed form
656A571J88K97K113K32J34l114k125m69N44j363n98L117J918o58N66j772l60j384
674a163k486k295K147J005Q46J359K601P69p59j050k052l87J072r00j59L277J638
691C463m92k20O34o17j836k823n37R75k48M6R81K959Q37k859j486K62q57m19j078
710c315n44K106K083Q04L06M62M33k369j414N47K46m90k8Q97L147P72j190n51
728A902l17J07l296n80p37J232O53O34Q02J456K04j463j527n9p65l89l36J08L113
747G42Q81O8n63J278j530j419j458O9R93K88M70J719J916j177j199K90j510q58
765a000k161J188J066Q35J68P81R65j09j131j240j874N34R29j446J362K284N49
782A700K95j306J023r06j070k725R98J375O34p1J408O31R95j623k030J90l80p15
$$ plain form
800 -1577 -2235 -1054 954 1121 973 599 813 1175 -674 -2499 -1625 -577 -820 -502 778 1839 2359 497
818 497 583 -382 -305 -1582 -2529 -404 -790 -107 578 1486 1589 1455 -521 -826 -1239 -921 -1662 -1539 -544 1523
838 1523 1176 1290 531 826 159 -1739 -1468 -1160 -579 246 -131 780 1902 759 298 -353 -394 -929 -2176
857 -2176 -1160 -20 1376 1160 1322 1377 1309 608 -1687 -900 -731 -1769 -1054 -344 1101 1122 958 74 -502
876 -502 -877 -1536 -1918 -1446 311 966 630 1012 1049 1816 226 -1673 -1424 -446 -1172 -1650 328 1136 1680
895 1680 1061 648 1434 133 -1146 -1475 -716 -96 -598 -459 1441 1731 1798 -217 -428 -361 -1245 -1516 -1365
914 -1365 -102 718 910 273 665 2437 88 -1904 -1670 -626 -1662 -660 -494 336 896 638 443 367
932 367 730 -569 -1111 -1471 -65 856 1021 455 1459 1689 1068 -664 100 26 -681 -1392 -105 1324 1574
$$ packed form
800a577o58J181K008J67j48l74K14L62j849j825Q74J048k43L18J280J061N20j862
818D97Q6r65P7j277r47K125l86O83O85R08J03j34j976l05m13L18p41J23R95K067
838A523l47J14p59K95o67j898K71L08N81Q25l77R11J122j143m61o51m1n35j247
857b176J016J140J396k16J62N5o8p01k295P87J69j038P15P10J445K1j64q84n76
876e02l75o59l82M72J757O55l36L82L7P67j590j899K49R78p26m78J978Q08N44
895A680o19m13P86j301j279l29P59O20n02J39J900K90O7k015k11O7q84k71J51
914a365J263Q20J92o37L92J772k349j992K34J044j036J002J66Q30N60k58j95p6
932C67L63j299n42l60J406R21J65n66J004K30o21j732P64p4p07p11J287J429K50
$$ plain form
951 1574 321 293 790 443 -806 -2341 -454 -501 -274 27 838 1642 995 -374 -349 -240 -262 -1421 -2034
970 -2034 -328 777 549 187 668 1995 722 -437 -1523 -595 -816 -1100 -261 49 1599 576 800
987 800 78 380 -552 -1809 -1298 -825 60 -567 267 1572 810 452 -10 -1491 8 -196 -1628 -875 729
1006 729 1711 639 1126 1131 238 372 -1334 -1030 -116 308 -104 641 1929 1473 1003 331 -139 -355 -909 -2078
1026 -2078 -280 449 188 -20 -258 1201 74 -628 -680 -148 -566 -535 -835 -34 1947 816 461 573 656
1045 656 3 -561 -1175 -426 570 113 583 1734 2341 416 -1036 60 -461 -266 -1238 -436 -91 218 1560
1064 1560 615 566 561 -450 -638 -355 -486 -651 149 328 2026 1291 797 27 212 95 -1653 -959 -19 -15
1084 -15 309 741 930 920 976 -208 -425 -500 -861 -1028 -805 620 397 434 251 -70 745 202 -1352 -518 -449
$$ packed form
951A574j253k8M97l47j249j535J887m7K27L01Q11Q04o47j369K5J09k2j159o13
970b034J706J105k28l62M81J327j273j159j086R28k21k84Q39L10J550j023K24
987H00p22L02r32j257N11M73Q85o27Q34J305p62l58m62j481J499k04j432P53J604
1006G29R82j072M87Nq93J34j706L04R14M24m12P45J288m56m70o72m70k16n54j169
1026b078J798P29k61k08k38J459j127p02n2N32m18L1l00Q01J981j131l55J12Q3
1045F56o53n64o14P49R96m57M70J151O07j925j452J096n21J95r72Q02L45L09J342
1064A560r45m9nj011j88K83j31j65Q00J79J698p35m94p70J85j17j748O94R40M
1084a5L24M32J89j0N6j184k17p5l61j67K23J425k23L7j83l21Q15n43j554Q34O9
$$ plain form
1105 -449 490 936 740 726 1182 676 336 -316 172 -529 -1312 -873 -438 1093 762 1138 7 668 -305 -578
1125 -578 -1109 -197 -655 -1089 402 271 97 1006 404 -808 -125 -528 -1230 -1108 251 -352 211 438 214
1144 214 732 406 327 -917 -367 -524 -1158 311 733 596 671 1401 416 477 -1074 -1009 -1473 -123 -240 189
1164 189 268 584 202 -423 25 -15 270 -1377 -928 -627 996 199 205 235 1192 284 -371 407 -736 -44 -69
1185 -69 133 586 1101 515 893 676 611 -1150 -1060 -646 106 20 -104 -207 214 1390 -440 -74 -1430 -485
1205 -485 -778 -941 -215 -143 337 995 541 629 533 199 -779 -521 -373 -390 422 1301 666 1063 243 -572 246
1226 246 -841 -589 -321 -46 461 -72 66 367 -88 308 734 -125 -1543 -1325 -366 -593 493 1311 131
1245 131 -564 160 45 67 -552 -994 -375 -497 227 871 883 429 568 -444 -15 449 -344 -829 -175 274
$$ packed form
1105d49R39M46j96j4M56n06l40o52M88p01p83M39M35J531l31L76j131O61r73k73
1125e78n31R12m58m34J491j31j74R09o02j212O83m03p02J22J359o03N63K27k24
1144B14N18l26p9j244N50j57o34J469M22j37P5P30r85O1j551O5m64J350j17M29
1164A89P9L16l82o25M48m0K85j647M49L01J623p97OL0R57r08o55P78j143O92k5
1185f9K02M53N15n86L78k17o5j761R0M14P52q6j24j03M21J176j830L66j356R45
1205d85k93j63P26P2M80O58m54Q8r6l34r78K58J48j7Q12Q79o35L97q20q15Q18
1226B46j087K52K68K75N07n33J38L01m55L96M26q59j418K18R59k27J086Q18j180
1245A31o95P24j15K2o19m42O19j22P24O44J2m54J39j012M29M64p93m85O54M49
$$ plain form
1265 274 654 882 -118 616 519 -536 -1500 -607 -412 -432 -329 128 159 236 -164 -176 658 60 -612 -160 263
1286 263 568 -69 311 152 478 67 -176 -553 -264 -159 -1244 273 -506 440 208 341 -423 1034 -907
1305 -907 -618 -1157 -155 140 70 -145 -212 759 481 -326 -518 -74 -528 451 -60 42 584 882 989 592
1325 592 113 332 1 289 -642 -118 55 -53 862 -53 403 646 658 442 -809 -620 -738 -712 -75 503
1345 503 95 569 991 8 22 -95 -351 1007 141 162 1315 1067 91 31 369 253 -175 -732 159 301
1365 301 -366 234 129 151 -95 -339 -861 -313 -499 -237 -825 191 112 -19 -437 447 133 279 -116 -128 -68
1386 -68 137 -50 -497 901 927 -101 176 169 -242 -94 91 -494 -343 -274 289 637 101 424 31 -166 -83
1407 -83 -222 -132 -322 -155 267 446 293 458 -327 -41 -129 -756 225 -366 -321 594 65 -71 539 813 392
$$ packed form
1265B74L80K28j000P34r7j055r64Q93J95k0J03M57L1P7m00j2Q34n98o72M52M23
1286B63L05o37L80j59L26m11k43l77K89J05j085J517p79R46k32J33p64J457j941
1305i07K89n39J002K95p0k15o7R71k78q07j92M44m54R79n11J02N42K98J07l97
1325E92m79K19l31K88r31N24J73j08R15r15M56K43J2k16j251J89j18K6O37N78
1345E03m08M74M22r83J4j17k56J358q66K1J153k48r76o0L38j16m28n57Q91J42
1365C01o67O00j05K2k46k44n22N48j86K62n88J016p9j31m18Q84l14J46l95j2O0
1386f8K05j87m47J398K6j028K77pm11J48J85n85J51O9N63L48n36L23l93j97Q3
1407h3j39R0j90J67M22J79j53J65p85K86q8o27R81n91M5R15n29j36O10K74m21
$$ plain form
1428 392 268 -356 262 383 -118 552 54 -409 -391 275 180 -309 -1429 -876 137 230 -371 -270 583 379
1448 379 436 95 252 88 -172 -875 411 256 -41 638 -30 221 85 745 692 197 -113 -858 -919 -284 472
1469 472 77 568 10 765 -725 -575 -240 -300 -214 188 91 589 317 14 60 -263 713 -294 -441 -643 -395
1490 -395 871 320 2 265 711 -54 -443 -1005 240 439 -172 64 461 28 -129 136 -161 -51 -865
1509 -865 -575 -499 250 -51 116 1096 532 542 76 -57 -1068 368 80 361 886 392 -64 -29 -15 447 180
1530 180 -1005 -436 -30 154 -37 170 -120 420 -213 -620 -634 167 90 364 -910 -342 -248 292 452 -284
1550 -284 174 444 -353 -48 16 -747 522 74 721 850 -259 533 723 -380 -141 7 -403 464 -377
1569 -377 -129 225 484 396 -372 -527 21 114 -281 383 -158 -56 361 -366 -151 -199 -662 -764 103 911 190
$$ packed form
1428C92j24o24O18J21n01O70m98m63J8O66r5m89j120N53J013R3o01J01Q53k04
1448C79N7l41J57j64k60p03J286j55k97O79o68K51j36O60n3m95l10p45o1O35P56
1469D72l95M91n58P55j490J50L35o0Q6M02r7M98k72l03M6l23R76j007j47k02K48
1490c95J266n51l18K63M46p65l89n62J245J99o11K36L97m33j57K65k97J10q14
1509h65K90P6P49l01J67R80n64J0m66j33j011J436k88K81N25m94m56L5J4M62k67
1530A80j185N69M06J84j91K07k90N40o33m07j4Q01p7K74j274N68R4N40J60p36
1550b84M58K70p97L05O4p63J269m48O47J29j109P92J90j103K39J48m10Q67q41
1569c77K48L54K59q8p68j55N48R3l95O64n41J02M17p27K15m8m63j02Q67Q08p21
$$ plain form
1590 190 -318 -182 251 495 582 -286 -302 -179 -343 282 -462 -95 110 -179 257 -11 307 -345 -206 -511 -565
1611 -565 -264 -101 136 136 277 536 581 818 -110 -124 -306 745 713 -486 412 196 -237 424 31 -65 -359
1632 -359 -267 -497 223 -158 -118 354 212 94 718 -443 -18 -307 -235 -9 -526 -285 303 -554 -421 394 396
1653 396 347 -517 -161 -767 1124 242 -118 310 -47 -178 616 169 -846 -741 -806 -281 589 -295 231 658
1673 658 612 -340 -503 -369 -303 -464 -303 -375 82 475 185 -209 354 -144 -523 -631 38 -41 -29 62 244 100
1695 100 868 210 444 -608 59 167 -396 286 640 -193 -49 810 -151 323 -402 -298 -513 791 -369
1714 -369 158 -132 -227 348 828 62 271 -606 -265 -360 -148 177 -326 458 311 1010 141 -65 -77 98 482
1735 482 -291 -131 442 180 -84 603 387 -29 304 -451 -582 213 -360 -123 567 500 102 -499 -103 -580
$$ packed form
1590A90n08J36M33K44Q7q68j6J23j64O25p44L67K05k89M36k68L18o52J39l05n4
1611e65L01J63K37%J41K59M5K37r28j4j82J051l2j199Q98k16m33O61l93r6k94
1632c59R2k30P20l81M0M72j42j18O24j161M25k89P2K26n17K41N88q57J33Q15K
1653C96m9q64L56o06J891q82l60M28l57j31P94m47j015J05o5N25Q70q84N26M27
1673F58m6r52j63J34O6j61J61p2M57L93k90l94N63m98l79j08O69p9J2R1J82j44
1695A00P68o58K34j052O67J08n63O82L54q33J44Q59r61M74p25J04k15J304j160
1714c69N27k90r5N75M80p66K09q77L41r5K12L25n03P84j47O99q69k06j2J75L84
1735D82p73J60N73k62k64O87k16m16L33p55j31P95n73K37O90o7l98o01L96m77
$$ plain form
1755 -580 -188 -690 -632 -54 822 -388 -857 290 621 162 -93 -584 -236 -316 226 -106 285 -85 -676 -348
1775 -348 147 519 -215 -467 -151 506 507 -449 -745 -689 -126 -46 -129 267 -183 -631 -591 443 105 -54 551 -255
1797 -255 444 -543 -764 309 181 -273 490 -19 -7 -42 672 -80 -8 -460 245 -296 -379 91 48 539 -302
1818 -302 610 -178 -195 -29 -71 -520 100 -23 235 -215 -251 100 -40 325 24 -433 401 53 439 76 -554
1839 -554 550 679 -1172 -307 382 94 -58 -70 -512 453 299 0 262 -463 785 281 -323 -634 568
1858 568 -5 -93 -26 94 255 -513 -45 -73 12 -1 -584 -358 524 185 -144 41 656 369 -582 -343 434 401
1880 401 81 -659 956 -37 862 -298 -220 765 -719 214 -680 -448 217 -142 245 456 210 -174 -382
1899 -382 580 -104 -688 -96 -176 31 81 87 -856 -71 531 -378 26 -151 -238 -28 -352 341 1164 1058 91 -354
$$ packed form
1755e80L92n02N8N78Q76j210m69J147L31m59k55m91L48q0N42l32L91l70n91L28
1775c48M95L72p34k52L16O57Jr56k96N6N63Q0q3L96m50m48M0J034l38j59O05q06
1797b55O99r87k21J073j28m54P63n09J2l5P14p52P2m52P05n41q3M70m3M91q41
1818c02R12p88j7J66m2m49O20j23K58m50l6L51j40L65l01m57Q34l48L86l63o30
1839e54J104J29j851Q65O89k88j52j2m42R65j54k99K62p25J248n04o04l11J202
1858E68n73q8O7J20J61p68M68k8Q5j3n83K26Q82l39l29J85O15k87r51K39P77l3
1880D01l20p40J615r93Q99j160P8R85j484R33q94K32O65l59L87K11k46l84k08
1899c82R62o84n84N92q0K07N0Or43P85O02r09M04j77q7K10l24O93Q23j06r67m45
$$ plain form
1921 -354 426 512 -397 -421 -68 -50 -356 -726 50 312 534 134 -177 -211 -735 -1043 -168 202 456 436 -68 288
1943 288 245 403 -664 809 -300 407 -326 492 -54 601 461 -504 102 651 31 -665 -369 -302 -324 -511
1963 -511 253 1204 316 -398 -296 167 -517 694 -218 -101 1077 846 -421 -2 -700 -76 -29 236 204 12
1983 12 -236 -421 183 3 134 106 158 229 400 -693 -1002 -174 445 -688 -52 444 -460 -2 -98 -276 -126
2004 -126 -147 -401 -487 248 211 -275 -180 360 619 -664 -966 -7 250 -3 -114 565 450 251 -184 -261 203
2025 203 416 -562 268 -61 -488 -233 118 255 782 321 145 121 85 -161 -23 10 777 405 -469 -75 -469
2046 -469 -296 -297 -190 -97 150 -583 -429 -676 -725 -233 -153 -203 -72 39 431 -222 462 -179 257 748 -446 -155
2068 -155 615 189 -390 130 -5 680 103 368 981 394 810 -544 408 -736 -212 254 -162 164 -419
$$ packed form
1921c54P80Q6r09k4L53J8l06l70P76K62K22m00l11l4n24l08Q75L70K54k0n04L56
1943B88m3J58j067J473j109P07p33Q18n46O55j40r65O06N49o20o96K96O7k2j87
1963e11P64R51q88p14J02M63o84J211r12J17J178k31j267M19o98O24M7K65l2j92
1983A2k48j85O04j80J31k8N2P1J71j093l09Q28O19j133O36M96r04M58r6j78J50
2004a26k1k54q6P35l7m86R5N40K59j283l02R59K57k53j11O79j15j99m35p7M64
2025B03K13r78Q30l29m27K55L51J37N27m61j76k4l6k46J38L3P67l72q74L94l94
2046d69J73jJ07R3K47p33J54k47m9M92Q0n0J31J11L92o53O84o41M36M91j194K91
2068a55P70m26n79N20j35O85n77K65O13n87M16j354R52j144N24M66m16L26n83
$$ plain form
2087 -419 197 -330 376 98 643 -281 -287 -860 404 162 683 1332 -618 -200 40 -334 783 353 -223 -348
2107 -348 -195 277 466 -384 -163 -58 382 119 -316 81 -309 231 121 -67 296 -359 67 441 -139 -12
2127 -12 619 370 65 -36 -47 262 -570 94 541 223 168 494 444 203 206 434 -168 139 180 -517 106 212
2149 212 -229 -132 -49 185 -278 622 455 -82 18 -511 -247 -524 -11 229 -150 128 -65 -435 -172 -549 186
2170 186 -20 -417 -819 548 -181 374 -233 498 -170 -17 -216 -270 -13 -323 -676 -310 303 -567 70 -451
2190 -451 -74 -362 521 54 -726 296 36 232 401 -267 229 579 24 -202 -254 -670 -226 569 -202 -711
2210 -711 -398 -285 -63 -297 -372 582 -284 189 -174 -248 -610 819 373 -10 463 -500 -189 -280 -325 -85 -272
2231 -272 -528 -414 272 101 82 367 -523 156 -211 204 430 -123 551 -555 328 209 -288 741 -65 -287
$$ packed form
2087d19O16n27P06k78N45r24on73J264k42N21O49j950M18K40l74J117m30n76j25
2107c48J53M72J89q50K21J05M40k63m35L97l90N40j10j88L63o55M26L74n80J27
2127a2O31k49l05j01j1L09q32O64M47l18n5L26n0k41LK28o02L07M1o97O23J06
2149B12m41R7Q3K34m63R00j67n37J00n29K64k77N13K40l79K78j93l70K63l77P35
2170A86k06l97m02J367p29N55o07P31o68J53j99n4K57l10l53L66O13q70O37n21
2190d51L77k88Q83m67p80J022k60J96J69o68M96L50n55k26n2m16M44P95p71n09
2210g11L13J13K22k34p5R54q66M73l63p4l62J429m46l83M73r63L11r1m5K40j87
2231b72k56J14O86j71j9K85q90O79l67M15K26n53O74j106Q83j19m97J029q06k22
$$ plain form
2251 -287 -179 191 188 107 265 -58 157 356 345 120 -469 -481 -631 639 -231 -267 1503 -150 -513 -255 -218
2272 -218 -221 -195 -390 168 0 -328 195 1056 205 -292 -7 656 -490 -10 726 -1077 -246 660 -96 -219
2292 -219 132 -4 -555 -605 -581 -857 290 272 -184 -188 -188 134 -221 -27 -233 564 -229 -281 -164 -382 428 325
2314 325 -236 641 143 439 115 51 138 -303 -279 460 -98 -311 -645 -91 -45 527 -503 138 233 -184 392
2335 392 50 -619 213 -157 90 -109 -287 -386 -180 -412 16 102 -102 31 58 -275 -540 -74 20 -393 -227
2356 -227 -310 -30 -62 -556 543 -129 300 501 -150 64 33 -178 815 -184 274 -68 187 164 -485 -21 145
2377 145 -673 -892 -157 390 308 100 -622 -349 751 -173 -487 491 420 -26 -111 -460 110 -171 -613 -830 49
2398 49 -156 -10 -785 -553 -198 -454 -19 -251 -532 168 -527 -273 520 -412 124 52 814 236 -885 370
$$ packed form
2251b87J08L70lq1J58l23K15J99j1k25n89j2j50J270q70l6J770j653l63K58L7
2272b18lK6j95N58j68l28N23Q61q51m97K85O63j146M80P36j803Q31R06p56j23
2292b19L51j36n51n0K4k76J147j8m56m%L22l55J94k06P97p93n2J17k18Q10j03
2314C25n61Q77m98K96l24o4Q7m41K4P39n58k13l34N54M6N72j030O41R5m17N76
2335C92l42o69Q32l70K47j99j78r9K06k32M28Q6k04J33K7l33k65M66R4m13J66
2356b27q3K80l2m94J099o72M29K01o51K14l1k11R93r99M58l42K55k3o49M64J66
2377A45q18k19P35N47q2k08p22K73J100r24l14R78p1m46q5l49N70k81m42k17Q79
2398D9k05J46p75K32L55k56M35k32k81P00o95K54P93r32N36p2P62n78j121J255
$$ plain form
2418 370 440 -452 320 138 574 70 -350 -279 -270 184 -361 569 -85 -343 -287 56 -16 -101 -182 -74 532 -59 204
2441 204 -122 -167 -389 119 -40 -45 190 222 345 -298 -1027 -461 446 489 -528 835 -817 62 -256 -641 705
2462 705 -8 -372 -548 -540 -11 -247 -915 -269 913 464 10 51 910 520 462 641 329 48 -89 945 -255
2483 -255 177 461 25 -249 151 -608 279 487 -15 223 41 27 -45 900 793 -642 -155 -475 -12 -386
2503 -386 353 -24 -72 417 337 229 -341 -255 -341 -40 300 267 -61 155 -431 229 111 -209 253 -514 -41 -161
2525 -161 -209 -51 -539 -988 345 310 294 245 -260 209 -297 -41 236 382 106 -783 126 322 52 553 429
2546 429 180 917 243 570 753 -214 79 -89 560 22 -172 -179 805 -238 197 -392 2 92 213 65 -37
2567 -37 381 234 459 372 218 458 -308 19 325 -392 91 310 70 -287 -219 212 -115 -334 -785 74 -135
$$ packed form
2418C70P0q92P72j82M36n04m20P1RM54n45R30o54k58N6L43p2q5q1J08O06n91K63
2441B04l26m5k22N08j59nK35L2J23o43p29N66R07M3j017J363j652Q79l18l85J346
2462G05p13l64j76QN29k36o68O46J182m49m54M1Q59l90n8J79l12k81j37J034j200
2483b55M32K84m36k74M00p59Q87K08n02K38j82j4p2R45j07j435M87l20M63l74
2503c86P39l77m8M89q0j08n70Q6q6L01L40l3l28K16n86O60j18l20M62p67M73j20
2525a61m8J58m88m49J333l5j6m9n05M69n06K56K77J46k76q89R09J96k70N01j24
2546D29k49P37o74L27J83r67K93j68O49n38j94pR84j043M35n89L94R0J21j48j02
2567c7M18j47K25q7j54K40p66L27L06p17M83K19k40l57O8M31l27k19m51Q59k09
$$ plain form
2588 -135 218 -647 -826 319 270 96 -87 -58 -124 -272 -40 -158 -167 -445 -586 202 -80 -253 621 372 -135
2609 -135 49 64 -518 515 -562 300 614 186 191 -1015 -125 -120 -76 472 769 -520 -195 50 31 -171 -270
2630 -270 -332 215 -144 -284 101 -34 462 -154 657 491 98 459 -473 484 -409 -396 157 -422 370 252 592
2651 592 -225 362 -78 50 56 644 -543 19 -181 -255 1034 17 338 57 -249 -4 15 251 94 3 -490
2672 -490 189 177 -98 -257 -14 156 -627 210 -278 -99 75 114 505 -26 -505 240 64 -717 429 -228
2692 -228 707 90 121 -65 -184 -361 -7 -420 -565 -401 -523 151 -72 -288 102 8 369 194 -944 -665
2712 -665 850 363 164 190 5 404 105 599 -193 -328 -113 292 -199 -772 -345 -330 -349 -78 730 -202 -712
2733 -712 -9 342 -198 2 298 241 267 199 -335 -108 -112 88 226 276 -243 37 80 182 -483 192 530 -370
$$ packed form
2588a35L53q65j79J145m9j74j83K9o6j48K32j18rk78j41P88k82j73Q74k49n07
2609a35J84J5n82J033j077Q62L14m28Nj206Q90NM4N48K97j289L25K45j9k02r9
2630b70o2N47l59j40L85j35M96o16Q11j66l93L61r32R57q93J3N53n79P92j18L40
2651E92q17N87m40J28ON88j187N62k00p4J289j017L21k81l06K45J9K36j57r1m93
2672d90O79j2k75j59K43J70p83Q37m88J79J74L9L91n31m79P45j76p81J146o57
2692b28R35o17L1j86j19j77L54m13j45J64j22O74k23k16L90r4L61j75j138K79
2712f65J515m87j99K6j85L99k99M94p92j35K15M05m91n73M27J5j9K71Q08r32n10
2733g12P03L51n40K00K96n7K6o8n34K27mK00J38N0n19K80M3J02o65O75L38r00
$$ plain form
2755 -370 -239 -315 -80 767 -479 529 -311 98 322 252 12 363 316 -19 -12 577 160 191 600 -431 -90
2776 -90 -42 -415 707 -167 -291 564 -228 -493 -612 173 203 428 -330 -370 213 275 -1105 -311 -269 98 -481
2797 -481 286 -283 615 638 -332 406 163 102 -453 -910 -67 87 71 -346 -105 -174 501 -42 -29 -10 488 398
$$ packed form
2755c70J31p6K35Q47j246J008q40M09K24p0k40L51m7l35PN89m17L1M09j031L41
2776i0M8l73J122q74j24Q55p92k65j19P85L0K25p58m0N83O2j380P94M2L67n79
2797d81P67n69Q98K3r70P38k43o1n55m57Q43J54j6m17K41o9O75n43J3J9M98r0
$$ [...]
8191a0
##END NTUPLES=NMR FID
##END=
