##TITLE=1H_SR163_k
 DMSO-d6
 8 sc, 
 9.2.2023
##JCAMPDX= 6.0         $$ Bruker NMR JCAMP-DX V2.0
##DATA TYPE= NMR FID
##DATA CLASS= NTUPLES
##ORIGIN= UXNMR, Bruker Analytische Messtechnik GmbH
##OWNER= root
$$ XWIN-NMR		Version 3.5
$$ Thu Feb  9 16:05:19 2023 Russian Standard Time (UT+4h)  she@DPX200
##.OBSERVE FREQUENCY= 200.13135
##.OBSERVE NUCLEUS= ^1H
##.DELAY= (6, 6)
##.ACQUISITION MODE= SIMULTANEOUS
##.ACQUISITION SCHEME= undefined
##.AVERAGES= 8
##.DIGITISER RES= 18
##SPECTROMETER/DATA SYSTEM= spect
##.PULSE SEQUENCE= zg30
##.SOLVENT NAME= DMSO
##.SHIFT REFERENCE= (INTERNAL, DMSO, 0, 15.7039)
##AUDIT TRAIL= $$ (NUMBER, WHEN, WHO, WHERE, WHAT)
$$ ##TITLE= Audit trail, XWIN-NMR		Version 3.5
$$ ##JCAMPDX= 5.01
$$ ##ORIGIN= Bruker BioSpin GmbH
$$ ##OWNER= she
$$ F:/spectra/data/she/nmr/H-F/1/audita.txt
$$ ##AUDIT TRAIL=  $$ (NUMBER, WHEN, WHO, WHERE, WHAT)
(   1,<2023-02-09 16:04:19.26 +0400>,<she>,<DPX200>,
      <created by zg, POWCHK disabled, PULCHK disabled
       configuration hash MD5:
       00 E9 B6 7A A2 85 ED C7 34 08 36 98 17 FE 4E 26
       data hash MD5: 16K
       71 EC 5D FA 13 57 31 C4 0E A4 58 1C 82 A4 2D 74>)
$$ ##END=
$$ 
$$ hash MD5
$$ 69 4F 8A D3 64 3A 10 3B FA 83 70 63 13 AF 7E F1
##$RELAX= 
##$RELAX= 
##$RELAX= 
##$RELAX= 
##$RELAX= 
##$RELAX= 
$$ Bruker specific parameters
$$ --------------------------
##$DU= <F:/spectra>
##$EXPNO= 1
##$NAME= <H-F>
##$PROCNO= 1
##$TYPE= <nmr>
##$USER= <she>
##$AMP= (0..31)
100 100 100 100 100 100 100 100 100 100 100 100 100 100 100 100 100 100 
100 100 100 100 100 100 100 100 100 100 100 100 100 100 
##$AQSEQ= 0
##$AQ_mod= 1
##$AUNM= <au_zg>
##$AUTOPOS= <>
##$BF1= 200.13
##$BF2= 200.13
##$BF3= 200.13
##$BF4= 200.13
##$BF5= 200.13
##$BF6= 200.13
##$BF7= 200.13
##$BF8= 200.13
##$BYTORDA= 1
##$CFDGTYP= 0
##$CFRGTYP= 5
##$CHEMSTR= <none>
##$CNST= (0..31)
1 1 145 1 1 1 1 1 1 1 1 1 1 1 1 1 1 1 1 1 1 1 1 1 1 1 1 1 1 1 1 1 
##$CPDPRG= <>
##$CPDPRG1= <>
##$CPDPRG2= <>
##$CPDPRG3= <>
##$CPDPRG4= <mlev>
##$CPDPRG5= <mlev>
##$CPDPRG6= <mlev>
##$CPDPRG7= <mlev>
##$CPDPRG8= <mlev>
##$CPDPRGB= <>
##$CPDPRGT= <>
##$D= (0..31)
0 1.2 0 0 0 0 0 0 0 0.06 0 0.03 0 0 0 0 0.0002 0 0 0 0 0 0 0 0 0 0 0 0 
0 0 0 
##$DATE= 1675944258
##$DBL= (0..7)
120 120 120 120 120 120 120 120 
##$DBP= (0..7)
150 150 150 150 150 150 150 150 
##$DBP07= 0
##$DBPNAM0= <>
##$DBPNAM1= <>
##$DBPNAM2= <>
##$DBPNAM3= <>
##$DBPNAM4= <>
##$DBPNAM5= <>
##$DBPNAM6= <>
##$DBPNAM7= <>
##$DBPOAL= (0..7)
0.5 0.5 0.5 0.5 0.5 0.5 0.5 0.5 
##$DBPOFFS= (0..7)
0 0 0 0 0 0 0 0 
##$DE= 6
##$DECBNUC= <off>
##$DECIM= 32
##$DECNUC= <off>
##$DECSTAT= 4
##$DIGMOD= 1
##$DIGTYP= 9
##$DL= (0..7)
0 120 120 120 120 120 120 120 
##$DP= (0..7)
150 150 150 150 150 150 150 150 
##$DP07= 0
##$DPNAME0= <>
##$DPNAME1= <>
##$DPNAME2= <>
##$DPNAME3= <>
##$DPNAME4= <>
##$DPNAME5= <>
##$DPNAME6= <>
##$DPNAME7= <>
##$DPOAL= (0..7)
0.5 0.5 0.5 0.5 0.5 0.5 0.5 0.5 
##$DPOFFS= (0..7)
0 0 0 0 0 0 0 0 
##$DQDMODE= 0
##$DR= 18
##$DS= 0
##$DSLIST= <SSSSSSSSSSSSSSS>
$$ [...]
##$SUBNAM2= <"">
##$SUBNAM3= <"">
##$SUBNAM4= <"">
##$SUBNAM5= <"">
##$SUBNAM6= <"">
##$SUBNAM7= <"">
##$SUBNAM8= <"">
##$SUBNAM9= <"">
##$SW= 18.05172834244
##$SWIBOX= (0..15)
0 0 2 0 0 0 0 0 0 0 0 0 0 0 0 0 
##$SW_h= 3612.71676300578
##$TD= 16384
##$TD0= 1
##$TE= 0
##$TE2= 300
##$TE3= 300
##$TEG= 300
##$TL= (0..7)
0 120 120 120 120 120 120 120 
##$TP= (0..7)
150 150 150 150 150 150 150 150 
##$TP07= 0
##$TPNAME0= <>
##$TPNAME1= <>
##$TPNAME2= <>
##$TPNAME3= <>
##$TPNAME4= <>
##$TPNAME5= <>
##$TPNAME6= <>
##$TPNAME7= <>
##$TPOAL= (0..7)
0.5 0.5 0.5 0.5 0.5 0.5 0.5 0.5 
##$TPOFFS= (0..7)
0 0 0 0 0 0 0 0 
##$TUNHIN= 0
##$TUNHOUT= 0
##$TUNXOUT= 0
##$USERA1= <user>
##$USERA2= <user>
##$USERA3= <user>
##$USERA4= <user>
##$USERA5= <user>
##$V9= 5
##$VALIST= <valist>
##$VCLIST= <CCCCCCCCCCCCCCC>
##$VD= 0
##$VDLIST= <DDDDDDDDDDDDDDD>
##$VPLIST= <PPPPPPPPPPPPPPP>
##$VTLIST= <TTTTTTTTTTTTTTT>
##$WBST= 1024
##$WBSW= 4
##$XGAIN= (0..3)
0 0 0 0 
##$XL= 0
##$YL= 0
##$YMAX_a= 116337
##$YMIN_a= -177246
##$ZGOPTNS= <>
##$ZL1= 120
##$ZL2= 120
##$ZL3= 120
##$ZL4= 120
##$ABSF1= 10
##$ABSF2= 0
##$ABSG= 5
##$ABSL= 3
##$ALPHA= 0
##$AQORDER= 0
##$ASSFAC= 0
##$ASSFACI= 0
##$ASSFACX= 0
##$ASSWID= 0
##$AUNMP= <proc_1d>
##$AZFE= 0.1
##$AZFW= 0.1
##$BCFW= 1
##$BC_mod= 2
##$BYTORDP= 1
##$COROFFS= 0
##$CY= 11.3945322036743
##$DATMOD= 1
##$DC= 2
##$DFILT= <>
##$DTYPP= 0
##$F1P= 2.36226072786647
##$F2P= -0.459571619588291
##$FCOR= 0.5
##$FTSIZE= 0
##$FT_mod= 4
##$GAMMA= 1
##$GB= 0.15
##$INTBC= 1
##$INTSCL= 1
##$ISEN= 128
##$LB= 0.24
##$LEV0= 0
##$LPBIN= 0
##$MAXI= 10000
##$MC2= 0
##$MEAN= 0
##$ME_mod= 0
##$MI= 1.114404
##$NCOEF= 0
##$NC_proc= 0
##$NLEV= 6
##$NOISF1= 3.799351
##$NOISF2= 2.8
##$NSP= 1
##$NTH_PI= 0
##$NZP= 0
##$OFFSET= 15.70392
##$PC= 1
##$PHC0= -19118.11
##$PHC1= 17.40078
##$PH_mod= 1
##$PKNL= yes
##$PPARMOD= 0
##$PSCAL= 0
##$PSIGN= 0
##$REVERSE= no
##$SF= 200.130013532006
##$SI= 16384
##$SIGF1= 3
##$SIGF2= 2
##$SINO= 400
##$SIOLD= 16384
##$SREGLST= <1H.CDCl3>
##$SSB= 0
##$STSI= 0
##$STSR= 0
##$SW_p= 3612.71676300578
##$SYMM= 0
##$S_DEV= 0
##$TDeff= 0
##$TDoff= 0
##$TI= <>
##$TILT= no
##$TM1= 0
##$TM2= 0
##$TOPLEV= 0
##$USERP1= <user>
##$USERP2= <user>
##$USERP3= <user>
##$USERP4= <user>
##$USERP5= <user>
##$WDW= 1
##$XDIM= 8192
##$YMAX_p= 0
##$YMIN_p= 0
$$ End of Bruker specific parameters
$$ ---------------------------------
##NTUPLES= NMR FID
##VAR_NAME=  TIME,          FID/REAL,        FID/IMAG
##SYMBOL=    X,             R,               I
##VAR_TYPE=  INDEPENDENT,   DEPENDENT,       DEPENDENT
##VAR_FORM=  AFFN,          ASDF,            ASDF
##VAR_DIM=   8192,          8192,            8192
##UNITS=     SECONDS,       ARBITRARY UNITS, ARBITRARY UNITS
##FACTOR=    0.0002768,     1,               1
##FIRST=     0,             0,               0
##LAST=      2.2672688,     0,               0
##MIN=       0,             -177246,         0
##MAX=       2.2672688,     116337,          0
$$ Real data points
##PAGE= N=1
##DATA TABLE= (X++(R..R)), XYDATA
$$ [...]
$$ plain form
1801 162 -21 -136 -247 -289 -222 93 47 25 -191 22 120 68 91 62 129 -93 -179 117 -131 -106 -155 -176 -5 -49 38
1826 38 217 63 -108 -83 93 -203 -153 145 114 -284 148 32 -4 -3 -268 151 86 191 181 14 245 30 -17
1849 -17 112 -31 -74 91 -17 147 67 -287 -115 59 -83 -43 -13 -36 -65 -275 -78 8 -46 118 -228 77 110
1872 110 24 147 43 -27 67 4 199 51 -227 97 -21 -162 84 196 -163 -9 38 6 59 -3 -203 -73 306
1895 306 -69 37 24 -13 96 -50 -128 -60 -28 -59 27 32 59 -54 -160 67 42 -40 72 -331 -95 -13 -13 -16 -69 108
1921 108 77 -41 65 10 86 -101 -39 -6 -62 -183 -179 -67 133 9 140 17 -104 234 -21 49 82 267 -80
1944 -80 -15 35 -57 -262 4 164 -409 -248 -5 -154 -247 296 222 16 237 91 -83 72 -10 -32 31 -63 7 25
1968 25 197 90 -90 -67 83 -250 -44 -202 -129 -43 17 52 51 132 -254 -18 -47 66 -128 109 175 -79 0 117
$$ packed form
1801A62j83j15j11m2O7L15m6k2k16K13R8n2K3k9O7k22q6K96k48K5m9k1J71m4Q7
1826C8J79j54j71K5J76k96N0K98l1l98M32j16l6Jk65M19o5J05j0j67K31k15m7
1849a7J29j43m3J65j08J64q0l54J72J74j42M0L0k3k9k10J97Q6n4J64l46L05L3
1872A10q6J23j04p0R4o3J95j48k78L24j18j41K46J12l59J54M7l2N3o2k00J30L79
1895C06l75J06j3l7J09j46p8O8L2l1Q6NK7j13j06K27k5q2J12m03K36Q2%ln3J77
1921A08l1j18J06n5P6j87O2L3n6j21MJ12K00j24J31j23j21L38k55P0L3J85l47
1944h0O5N0r2k05K66J60n73J61K43j49r3N43p4k06K21j46j74J55q2k2O3r4P0J8
1968B5J72j07j80K3J50l33K06j58P3Q6O0L5jQ1l86K36k9J13j94K37O6k54P9J17
$$ plain form
1992 117 82 -17 0 -140 -83 -76 163 -66 173 88 -30 122 95 50 -39 -74 -111 -221 111 -61 -88 75 -214 -6
2016 -6 -82 124 48 -158 39 -67 45 32 -155 -67 -193 -332 -44 -171 194 196 -84 301 51 -245 234 147 91
2039 91 51 -72 222 28 -75 133 130 47 124 -161 107 -150 -75 113 -90 -109 -184 -78 329 -238 -113 -35 144
2062 144 74 -67 -115 -87 34 45 -8 -45 -149 164 265 -32 88 -79 -110 -85 -103 15 234 347 -64 97 58
2085 58 -51 -82 111 103 -65 -70 -60 7 -55 114 -5 -180 -211 -139 15 33 196 -231 10 -212 -70 -136 17 219
2109 219 -137 -43 -174 13 86 33 -85 41 -211 -197 114 -109 -88 -25 64 180 11 59 333 -193 246 -22 75
2132 75 -197 59 -37 114 -45 71 3 24 80 -54 -26 84 -124 66 -50 -18 -123 61 118 17 -55 -213 108
2155 108 -120 -121 304 95 -62 78 133 27 110 30 -42 -292 189 -137 12 193 -26 458 -60 -164 121 -54
$$ packed form
1992A17l5r9J7j40N7PK39k29K39q5j18J52k7m5q9l5l7j10L32j72k7J63k89K08
2016fp6K06p6k06J97j06J12j3j87Q8j26j39K88j27L65Kk80L85k50k96M79q7n6
2039I1m0j23K94j94j03K08lq3P7k85K68k57P5J88k03j9p5J06M07n67J25P8J79
2062A44p0j41m8K8J21J1n3l7j04L13J01k97J20j67l1K5j8J18K19J13m11J61l9
2085E8j09l1J93qj68nJ0O7o2J69j19j75l1P2J54J8J63m27K41k22J42o6J53K02
2109B19l56R4j31J87P3n3j18J26k52J4L11k23K1O3Q9J16j69M8K74n26M39k68R7
2132G5k72K56r6J51j59J16o8K1N6j34K8J10k08J90j16L2j05J84N7j01p2j58L21
2155A08k28jM25k09j57J40N5j06Q3q0p2k50M81l26J49J81k19M84n18j04K85j75
$$ plain form
2177 -54 -83 -36 46 -237 -75 14 43 -205 -111 -49 7 -58 -18 -367 -84 -68 -58 -120 138 -78 -286 171 84 159 -29
2202 -29 146 -72 160 -50 55 217 10 222 -24 84 98 -38 196 -171 -39 126 19 -84 -143 380 33
2223 33 -114 62 -127 -61 7 29 41 -124 117 -77 35 39 -148 3 -52 57 -100 -123 -273 -16 59 -100 28
2246 28 -203 56 195 117 104 -270 117 -183 10 23 37 -159 -176 -150 98 67 -312 -129 8 175 -106 -190 -52
2269 -52 16 -34 119 44 -34 -184 -186 82 1 -53 18 -171 16 90 249 60 23 -335 260 65 -72 36 130 -180
2293 -180 -66 -54 -60 107 -36 106 -149 -194 -17 -10 92 -146 -4 -6 124 134 -184 4 110 -74 144 -29 -5
2316 -5 95 159 54 70 -28 28 16 91 131 -72 -78 -170 -22 52 -96 18 -54 264 207 231 -218 55 37 1 74 49 193
2343 193 271 164 -180 104 12 -133 60 -95 -85 -61 124 -21 -39 -136 -35 65 227 -48 -230 -74 -47 303
$$ packed form
2177e4k9M7Q2k83J62Q9K9k48R4O2N6o5M0l49K83J6J0o2K58k16k08M57q7P5j88
2202b9J75k18K32k10J05J62k07K12k46J08J4j36K34l67J32J65j07j03n9N23l47
2223C3j47J76j89O6O8K2J2j65K41j94J12Mj87J51n5J09j57k3j50K57P5j59J28
2246B8k31K59J39p8j3l74L87l00J93J3J4j96j7K6K48l1l79J83J37J67k81q4J38
2269e2O8n0J53p5p8j50kK68q1n4P1j89J87P4J59j89l7l58N95j95j37J08R4l10
2293a80J14J2oJ67j43J42k55m5J77PJ02k38J42kJ30J0l18J88J06j84K18j73K4
2316eJ00O4j05J6r8N6j2P5M0k03or2J48P4j48J14p2L18n7K4m49K73j8l6P3k5J44
2343A93P8j07l44K84r2j45J93j55J0K4J85j45j8r7J01J00J62k75j82J56K7L50
$$ plain form
2365 303 -8 68 -45 -11 69 6 -25 4 -82 60 6 -4 77 55 274 25 -22 -79 122 3 57 -132 -1 -200 166
2390 166 101 286 16 62 4 -116 122 7 -301 35 -120 153 147 93 114 208 -57 -64 -73 65 -51 86 17 -33 27
2415 27 219 141 127 -32 -136 268 62 2 -176 -159 106 -39 47 137 185 40 -115 56 -23 -16 -112 -51 139 322
2439 322 -72 288 -32 -75 135 64 58 73 -171 -46 -78 -165 86 84 102 -16 -33 135 296 -17 -32 -140 94 3
2463 3 -100 50 30 -172 -65 -227 -83 -243 128 186 -137 -23 -16 11 72 -75 198 38 -221 117 89 181 -13
2486 -13 93 156 122 35 -102 -210 -29 534 -162 -50 -26 -30 -97 -80 38 -218 -25 -15 192 143 -192 -167 -371 -20
2510 -20 115 124 -197 -60 161 -295 -220 100 20 67 152 8 -117 52 -122 15 -155 -154 51 29 51 69 152 -112
2534 -112 60 -85 -145 -260 -71 -123 -158 49 -120 145 -67 28 -67 173 45 -67 -151 183 26 28 76 -57 -33
$$ packed form
2365C03l11P6j13L4Q0o3l1K9q6J42n4j0Q1k2K19k49m7n7K01j19N4j89J31j99L66
2390A66o5J85k70M6n8j20K38j15l08L36j55K73on4K1R4k65prJ38j16J37o9n0O0
2415B7J92p8j4j59j04M04k06o0j78J7K65j45Q6R0M8j45j55J71p9Pr6O1J90J83
2439C22l94L60l20m3K10p1oJ5k44J25l2q7K51kJ8j18j7J68J61l13j5j08K34r1
2463Cj03J50k0k02J07j62J44j60L71N8l23J14PK7O1j47K73j60k59L38k8R2j94
2486a3J06O3l4q7j37j08J81N63o96J12K4mo7J7J18k56J93J0K07m9l35K5k04L51
2510b0J35Rl21J37K21m56P5L20q0M7Q5j44j25J69j74J37j70JK05k2K2J8Q3k64
2534a12J72j45o0j15J89n2l5K07j69K65k12R5r5K40j28j12q4L34j57KM8j33K4
$$ plain form
2557 -33 -10 -43 -16 218 83 386 -27 -37 -75 39 -178 1 32 -128 -72 35 71 192 -214 -93 -29 61 71 260
2581 260 45 -67 67 170 81 -26 149 10 44 -74 -2 14 -195 224 59 29 176 164 104 108 103 -101 98 108
2605 108 67 -42 142 -63 4 160 -77 -37 125 -41 113 35 -245 -85 -89 -193 109 0 207 -52 -221 -76
2627 -76 266 -172 -111 224 97 -128 369 -132 45 26 164 -118 -127 48 -216 231 -318 -115 -103 211 -141 -62
2649 -62 185 190 -48 -14 199 22 -30 -12 -102 4 180 30 74 112 -59 121 -271 -13 36 165 236 -76 9 -350
2673 -350 48 -78 -188 84 -44 -190 131 194 22 100 211 117 0 -1 -81 22 -59 -5 120 149 87 -2 -34 76
2697 76 -10 88 93 59 -157 70 -329 -36 173 -121 -357 -101 200 -51 -86 50 17 -115 115 -32 39 -29 122
2720 122 -191 -1 84 -54 79 197 -33 -1 111 -18 -110 275 -208 117 -254 46 -65 147 -118 65 -52
$$ packed form
2557c3K3l3K7K34j35L03m13j0l8J14k17J79L1j60N6J07L6J21m06J21O4R0J0J89
2581B60k15j12J34J03q9j07J75j39L4j18P2J6k09M19j65l0J47j2o0Mnk04J99J0
2605A08m1j09J84k05O7J56k37M0J62j66J54p8k80J60mj04L02j09K07k59j69J45
2627g6L42m38O1L35j27k25M97n01J77j9J38k82rJ75k64M47n49K03J2L14l52P9
2649f2K47Nk38L4K13j77n2J8r0J06J76j50M4L8j71J80l92K58M9J29P1l12Q5l59
2673c50L98j26j10K72j28j46L21O3j72P8J11r4j17jq0J03q1N4J25K9o2q9l2J10
2697G6q6R8Nl4k16K27l99K93K09k94k36K56L01k51l5J36l3j32K30j47P1o8J51
2720A22l13J90Q5j38J33J18k30L2J12j29r2L85m83L25l71L00j11K12k65J83j17
$$ plain form
2741 -52 122 -11 314 200 -68 61 -97 34 -150 -87 7 -92 -98 51 78 -129 154 -192 -33 -11 -125 -11 -187
2764 -187 -33 190 96 134 255 -62 29 -18 -207 18 -34 16 16 -44 -51 -30 -124 69 -17 -79 42 -130 -40 0 -111 -137
2790 -137 -157 -35 100 -19 30 285 54 275 48 -146 133 326 96 46 -31 -34 64 -42 32 46 -36 27 -143 307
2814 307 256 -38 43 -141 110 -12 -122 -102 -188 52 86 -92 8 -4 -159 180 85 -276 -148 -91 17 -75 88
2837 88 -81 111 375 -39 -24 77 157 -35 -95 -275 -62 69 -261 -124 -120 -243 -78 -19 -77 -96 -1 96 -29 166
2861 166 50 51 22 265 38 93 -41 -88 184 -22 -13 -55 39 276 -93 -254 134 41 153 -34 -129 -44 222 79
2885 79 -262 113 90 -87 -153 114 211 39 -223 12 -84 -90 -25 -33 -86 213 2 180 -112 123 182 174 48 -114 -128
2910 -128 -307 -103 -170 15 -40 125 137 82 -128 17 -152 -136 299 185 -82 101 -197 274 -119 -76 -80 -139 -8
$$ packed form
2741e2J74j33L25j14k68J29j58J31j84O3R4r9oJ49K7k07K83l46J59K2j14J14j76
2764a87J54K23r4L8J21l17R1m7j89K25n2N0%o0pK1r4J93q6o2J21j72R0M0j11k6
2790a37k0J22J35j19M9K55k31K21k27j94K79J93k30n0p7lR8j06P4J4q2O3j70M50
2814C07n1k94Q1j84K51j22j10K0q6K40L4j78J00j2j55L39r5l61J28N7J08r2J63
2837H8j69J92K64m14J5J01Q0j92o0j80K13J31l30J37Mj23J65N9n8j9R5R7j25J95
2861A66j16Jk9K43k27N5j34m7K72k06Rm2R4K37l69j61L88r3J12j87r5Q5K66j43
2885G9l41L75k3j77o6K67R7j72k62K35r6oO5qn3K99k11J78k92K35N9qj26j62j4
2910a28j79K04o7J85n5J65J2n5k10J45j69J6M35j14k67J83k98M71l93M3mn9J31
$$ plain form
2933 -8 -27 13 203 43 -143 87 -172 164 39 -40 102 110 -125 81 114 162 -22 -78 56 -271 -51 -77 170 64
2957 64 -254 159 -14 173 -21 42 -69 70 218 162 401 30 -110 63 -182 -89 -110 21 2 -31 -116 90 81
2980 81 -83 128 -233 98 -17 -103 63 103 33 -42 193 107 -122 -71 152 137 -1 18 -65 144 -130 283 -130
3003 -130 -164 -8 -24 112 75 85 8 -147 177 -114 64 -36 -64 156 77 135 -12 22 254 -54 -134 131 -98
3026 -98 48 -110 28 15 -213 44 78 -173 -325 144 -73 162 143 -143 171 -165 9 188 119 -164 -135 185
3048 185 -207 126 -122 -32 9 88 18 92 -131 -9 28 184 -68 -239 139 113 119 -113 -25 -147 231 -1 -117
3071 -117 -50 -52 -137 15 -243 -212 -15 -30 46 197 -146 -244 -31 -18 -192 230 -42 -2 22 -70 130 -177 -86 216
3095 216 1 -86 -25 -296 178 -74 -293 54 -145 -243 63 62 -136 -133 -11 87 183 -47 84 -180 52 -45 -17 26
$$ packed form
2933hj9M0J90j60j86K30k59L36j25p9J42Qk35K06L3M8j84n6J34l27K20k6K47j06
2957F4l18M13j73J87j94O3j11J39J48n6K39l71j40J73k45R3k1J31j9l3q5K06r
2980H1j64K11l61L31j15q6J66M0p0p5K35q6k29N1K23j5j38J9q3K09k74M13m13
3003a30l4J56j6J36l7J0p7j55L24k91J78j00k8K20p9N8j47L4K32l08q0K65k29
3026i8J46j58J38j3k28K57L4k51j52M69k17K35j9k86L14l36J74J79o9k83K9L20
3048A85l92L33k48R0M1P9p0P4k23J22L7J56k52j71L78k6Ok32Q8j22L78k32j16
3071a17O7kq5J52k58L1J97j5P6J51l43r8K13J3j74M22k72M0K4r2K00l07R1L02
3095B16k15q7O1k71M74k52k19L47j99r8L06jj98LJ22R8R6k30J31k64K32r7K8M3
$$ plain form
3119 26 -11 -44 40 208 221 22 -40 110 -66 -128 62 -112 76 -262 160 -48 7 35 57 47 35 178 94 -149
3143 -149 -241 -246 60 -83 33 190 -60 -45 -140 35 6 19 70 113 -104 -105 -90 60 203 43 289 -156 -36 -54
3167 -54 69 -306 -72 69 -27 14 -16 -124 -33 -26 456 4 79 216 56 115 173 247 -61 131 -50 5 1 -88 -119
3192 -119 -70 -15 94 -106 -118 -3 76 -71 20 115 108 -56 67 -421 257 -50 86 -78 -77 70 44 115 -33 -94
3216 -94 68 37 -137 148 71 200 -139 44 -101 -191 -291 123 -86 156 -291 102 -258 -14 283 -66 80
3237 80 -140 -24 174 -6 -184 117 62 25 58 -112 181 51 135 -115 202 -155 44 51 96 62 -244 109 -73
3260 -73 258 -24 -119 -25 88 112 -63 -106 -40 117 -36 61 6 50 180 -9 -143 96 -16 88 55 32 191 -98
3284 -98 -143 7 -236 -295 -141 -117 111 197 17 56 -15 -251 27 108 -6 -140 105 11 57 149 -12 -91 -155 247
$$ packed form
3119B6l7l3Q4J68J3j99o2J50j76o2J90j74J88l38M22k08N5K8K2j0j2J43q4k43
3143a49r2nL06j43J16J57k50J5r5J75k9J3N1M3k17jJ5J50J43j60K46m45J20j8
3167e4J23l75K34J41r6M1l0j08R1PM82m52P5J37j60N9N8P4l08J92j81N5mq9l1
3192a19M9N5J09k00j2J15P9j47R1R5pj64J23m88O78l07J36j64JJ47k6P1j48o1
3216i4J62l1j74K85p7J29l39J83j45r0j00M14k09K42m47L93l60K44K97l49J46
3237H0k20J16J98j80j78L01n5l7L3j70K93j30Q4k50L17l57J99PM5l4l06L53j82
3260g3L31k82r5R4J13K4j75m3O6J57j53R7n5M4J30j89j34K39j12J04l3k3J59k89
3284i8m5J50k43n9J54K4K28Q6j80L9p1k36K78Q1j14j34K45r4M6R2j61p9o4M02
$$ plain form
3308 247 -63 -57 150 53 64 160 183 1 123 72 -2 2 -52 -98 -48 -143 113 73 148 174 209 -16 159 -220 168 -13
3334 -13 -75 144 -146 14 -80 137 55 -332 84 19 -145 -84 167 45 -85 86 25 -104 -115 -138 219 -111 -145
3357 -145 92 -53 -147 -75 -144 43 -174 -71 -61 -195 176 49 -12 -205 132 -192 210 -64 156 -26 -157 -26
3379 -26 25 -74 98 92 -213 -236 124 76 -251 -180 312 -92 58 30 146 -153 -204 -171 108 120 -29 185 -91 -40
3403 -40 -34 53 -139 192 -149 -89 266 135 119 -14 -192 -22 -87 -101 -96 -87 -54 7 -68 92 31 50 -143 -4 56 142
3429 142 46 -105 319 -72 28 -171 -80 150 -231 34 120 -47 93 -117 80 -88 27 -102 -221 280 81
3450 81 -96 147 -11 -156 -193 -90 81 35 42 -81 130 25 39 70 89 227 -107 -135 -150 49 106 35 -82 -67
3474 -67 32 -135 170 -5 -46 81 81 152 163 46 -278 -119 51 -27 -301 -112 445 -169 -21 139 155 -208 -64
$$ packed form
3308B47l10OK07r7J1R6K3j82J22n1p4Mn4m6N0r5K56m0P5K6L5k25J75l79L88j81
3334a3o2K19k90J60r4K17q2l87M16o5j64O1K51j22j30J71o1j29j1k3L57l30l4
3357a45K37j45r4P2o9J87k17J03J0j34L71j27o1j93L37l24M02k74K20j82j31J31
3379b6N1r9J72ol05k3L60m8l27P1M92m04J50k8J16k99n1L3K79J2j49K14k76N1
3403d0OQ7j92L31l41O0L55j31j6j33j78J70o5j4NRL3O1p5J60o1J9j93J39O0Q6
3429A42r6j51M24l91J00j99R1K30l81K65Q6j67J40k10J97j68J15j29j19N01j99
3450H1j77K43j58j45l7J03J71m6Pj23K11j05J4L1J9J38l34k8j5J99N7p1j17J5
3474f7R9j67L05j75m1J27%P1J1j17l24J59J70p8k74J89N57o14J48J60J6l63J44
$$ plain form
3497 -64 414 -24 290 100 -11 48 -159 142 287 -188 -50 -37 -189 -75 68 148 13 169 -134 6 -55 130
3519 130 -119 60 130 -90 155 -169 -22 188 213 -136 84 298 92 -97 154 -161 73 -79 -204 82 42
3540 42 35 -176 271 7 174 180 200 -59 252 26 119 19 -184 -281 -175 -13 143 -7 -63 -3 -91 20 100 -14
3564 -14 116 -84 49 -122 -71 54 -275 90 -12 188 -17 -135 230 7 -12 108 45 55 -15 43 -5 -114 -61
3587 -61 -82 78 -115 94 35 135 -72 -103 -119 -130 -105 200 -71 37 -141 -15 81 -162 233 117 70 -56 -22
3610 -22 -199 94 245 -66 350 -87 -120 -25 37 -91 232 80 116 60 164 -60 0 -198 68 208 -248 -69
3632 -69 -76 50 80 -183 -204 -2 -277 203 6 5 -69 8 -187 -144 37 204 25 -32 45 199 193 -8 268 96 117
3657 117 -139 -34 -61 149 -48 -101 -13 -194 -41 -170 -222 77 -121 -37 109 -84 -54 63 41 304 -103 -296
$$ packed form
3497f4M78m38L14j90j11N9k07L01J45m75J38J3j52J14J43Q0j35J56l03J40o1J85
3519A30k49J79P0k20K45l24J47K10K5l49K20K14k06j89K51l15K34j52j25K86m0
3540D2pk11M47k64J67OK0k59L11k26R3j00k03r7J06J62J56j50n6O0q8J11Q0j14
3564a4J30k00J33j71N1J25l29L65j02K00k05j18L65k23j9J20o3J0p0N8m8j09N3
3587f1k1J60j93K09n9J00k07l1j6j1K5L05k71J08j78J26R6k43L95j16m7j26L4
3610b2j77K93J51l11M16m37l3R5O2j28L23j52L6n6J04k24O0j98K66J40m56J79
3632f9pJ26L0k63k1K02k75M80j97jp4P7j95M3J81J67j79n7P7J54ok01K76j72K1
3657A17k56J05k7K10j97n3Q8j81J53j29n2K99j98Q4J46j93L0J17k2K63m07j93
$$ plain form
3679 -296 -57 57 -266 178 -116 78 -234 63 160 -39 -178 -127 -102 -15 383 -36 167 12 72 71 147 55 146
3702 146 86 34 -436 222 57 -211 57 -221 136 72 66 -170 -198 -89 2 -110 48 -79 -4 15 142 -103 56
3725 56 141 -17 -74 -162 -80 227 211 71 -18 -1 144 102 11 26 42 -202 -61 -67 -47 -211 152 -7 66 -153 -165 64
3751 64 -104 -16 -54 -186 99 -7 -133 112 -125 -128 -5 -329 40 -40 26 -50 113 14 146 -22 -44 -106 -168 80
3775 80 -107 -141 -114 -323 -162 201 -57 -133 -54 -75 -51 96 151 70 -78 0 148 171 -291 -15 199 38 -184 -18
3799 -18 11 -132 -226 41 -165 -173 182 -188 40 -90 153 -46 -146 -118 42 83 -166 30 -148 183 -119 249
3821 249 344 -3 -24 -94 -71 -75 -15 -222 -181 299 -8 159 -89 -30 33 232 -283 -70 -78 31 -96 -135 110 -1
3845 -1 -127 252 272 24 23 139 -58 -185 -48 -175 7 -94 104 65 -56 -200 228 60 30 -60 -97 2 -51 204
$$ packed form
3679b96K39J14l23M44k94J94l12K97R7j99j39N1K5Q7L98m19K03j55O0jP6r2R1
3702A46o0n2m70O58j65k68K68k78L57o4ok36k8J09R1j12J58j27P5J9J27k45J59
3725E6Q5j58n7q8Q2L07j6j40q9J7J45m2r1J5J6k44J41oK0j64L63j59P3k19j2K29
3751F4j68Q8l8j32K85j06j26K45k37lJ23l24L69q0O6p6J63r9J32j68k2o2o2K48
3775H0j87l4K7k09J61L63k58p6P9k1K4J47N5q1j48P8J48K3m62K76K14j61k22J66
3799a8K9j43r4K67k06qL55l70K28j30K43j99j00K8J60M1k49J96j78L31l02L68
3821B49R5l47k1p0K3mO0k07M1M80l07J67k48N9O3J99n15K13qJ09j27l9K45j11
3845aj26L79K0k48jJ16j97j27J37j27J82j01J98l9j21j44M28j68l0r0l7R9n3K55
$$ plain form
3869 204 0 -103 -82 102 -45 -327 209 189 219 77 149 -36 78 118 -310 -141 92 29 1 -44 -248 79 172
3892 172 86 118 -328 70 -286 -173 30 -115 82 74 -300 -190 38 -221 183 -127 -120 -74 154 -96 -85 71 -141
3915 -141 -32 -2 76 -195 341 -229 202 439 243 249 -13 -145 -37 -105 -26 -135 -72 98 100 -6 -271 -119 206
3938 206 -174 120 -79 -184 219 59 -48 -82 -46 35 -76 0 279 21 -76 -24 109 42 -47 66 318 102 -21
3961 -21 -25 -138 190 37 75 -67 313 94 -119 -96 -33 104 311 -110 112 49 185 -91 -32 265 94 74 65 -168
3985 -168 -119 86 -158 -75 -315 121 -56 44 -146 73 107 -119 -179 -102 55 -238 132 45 -13 124 122 10 -8
4008 -8 57 13 -122 61 67 -64 71 113 28 -97 114 25 73 -72 -28 -29 185 102 -152 218 29 89 14 23 134 -82
4034 -82 111 -121 -92 -129 -138 4 -81 134 117 -123 178 148 97 -10 -80 -143 -96 -59 116 12 -101 122 -57 -36 152
$$ packed form
3869B04k04j03K1J84j47k82N36k0L0j42P2j85J14M0m28J69K33o3k8m5k04L27R3
3892A72q6L2m46L98l56J13K03j45J97ql74J10K28k59M04l10PM6K28k50J1J56k12
3915a41J09L0P8k71N36n70M31K37j96Ok62j32J08o8P9j09O3J70Kj06k65J52L25
3938B06l80K94j99j05M03j60j07l4L6Q1j11P6K79k58r7N2J33o7q9J13K52k16j23
3961b1mj13L28j53L8j42L80k19k13K3O3J37K07m21K22o3J36k76N9K97j71k0rk33
3985a68M9K05k44Q3k40M36j77J00j90K19L4k26o0P7J57k93L70q7n8J37kj12j8
4008hO5m4j35J83Oj31J35M2q5j25K11q9M8j45M4jK14q3k54L70j89O0p5RJ11k16
4034h2J93k32K9l7rJ42q5K15j7k40L01l0n1j07p0o3M7L7J75j04j13K23j79K1J88
$$ plain form
4059 152 -69 -458 11 56 37 267 -177 -188 -247 71 41 73 65 182 -16 92 -131 -155 109 73 232 60 145 90
4083 90 0 -104 235 -103 -42 143 53 60 32 -37 -49 16 43 -50 48 -59 -262 -173 32 -136 149 91 73 82 17 -232
4109 -232 -154 81 106 12 -28 159 -117 -19 -126 98 7 -7 -127 -163 -116 -19 153 -32 46 364 -243 -282 -30 -110
4133 -110 45 -82 74 36 223 250 -200 -230 74 -117 -72 88 59 27 27 -71 -58 42 -63 -75 -66 78 111 -167 80
4158 80 -169 -154 75 -60 -255 319 -153 -21 -36 -118 265 -172 50 209 -111 219 -97 -118 35 -85 78 101
4180 101 -126 -100 198 -213 -121 71 -121 -197 75 -126 -113 -39 35 -120 -30 109 -46 -2 90 -61 13 23 112 156
4204 156 -307 -129 -38 -127 -103 -56 -121 -129 260 4 -142 -66 -148 -235 51 47 69 87 149 101 43 -246 43 -37 -140 290
4230 290 73 -224 -228 -26 -50 -344 146 13 -48 118 -39 88 30 129 48 -64 26 -16 -29 24 27 -1 182 146 68
$$ packed form
4059A52k21l89M69M5j9K30m44j1n9L18l0L2qJ17j98J08k23k4K64l6J59j72Q5n5
4083I0r0j04L39l38O1J85r0Pk8o9j2O5K7r3R8j07k03Q9K05j68K85n8j8Ro5k49
4109b32P8K35K5r4m0J87k76R8j07K24r1j4j20l6M7R7J72j85P8L18o07l9K52q0
4133a10J55j27J56l8J87K7m50l0L04j91M5J60k9l2%r8J3J00j05j2RJ44L3k78K47
4158H0k49J5K29j35j95N74m72J32j5q2L83m37K22J59l20L30l16k1J53j20J63K3
4180A01k27K6K98m11R2J92j92p6K72k01J3P4P4j55R0J39j55M4R2j51P4J0Q9M4
4204A56m63J78R1q9K4M7o5qL89k56j46P6q2q7K86mK2J8O2m8n8k89K89q0j03M30
4230B90k17k97mK02k4k94M90j33o1J66j57J27n8R9q1j12R0m2j3N3Lk8J83l6p8
$$ plain form
4255 68 7 129 85 -267 101 41 83 74 -396 11 165 20 -55 58 -41 -176 65 300 128 -220 1 27 -92
4278 -92 1 -76 14 182 248 79 31 -26 216 80 -15 294 -254 190 64 128 41 168 -61 141 -162 -78 121 31
4302 31 15 29 -117 -48 160 -97 -51 -13 119 -7 -160 -165 -58 -48 199 144 108 136 -14 -289 -261 77 -131 -78 30
4327 30 50 -50 -78 -26 -98 -124 -135 -70 177 60 -273 -63 -158 -38 -143 14 -125 -97 -107 242 -104 -163 121 -47
4351 -47 -6 145 99 8 37 -89 -162 88 163 -106 43 -307 217 158 152 -55 -89 0 -247 279 109 -198 96 62
4375 62 -268 -119 238 87 -109 -118 239 -259 -178 -37 -265 -107 45 155 223 256 -25 -177 198 35 -64 72
4397 72 -80 50 240 -112 -156 -234 -46 19 -209 -330 -65 -119 -230 -208 190 142 124 -49 -270 -34 132 -57 -168
4420 -168 203 -25 -115 86 192 -107 36 53 -99 4 79 -68 197 89 79 18 223 -157 -8 -78 -69 -93 16
$$ packed form
4255F8o1J22m4l52L68o0M2rm70M07J54j45p5J13r9j35K41K35j72l48K21K6j19
4278i2R3p7R0J68O6j69m8n7K42j36r5L09n48M44j26O4q7J27k29K02l03Q4J99r0
4302C1j6J4j46O9K08k57M6L8J32j26j53nJ07J0K47n5l6K8j50k75K8L38k08N3J08
4327C0K0j00k8N2p2k6j1O5K47j17l33K10r5J20j05J57j39K8j0L49l46n9K84j68
4351d7M1J51m6r1K9j26p3K50P5k69J49l50N24n9ok07l4Q9k47N26j70l07K94l4
4375F2l30J49L57j51j96rL57m98Q1J41k28J58J52J10O8L3k81j52L75j63r9J36
4397G2j52J30J90l52m4p8J88O5k28j21K65n4j11K2L98m8j8j73k21K36J66j89j11
4420a68L71k28r0K01J06k99J43J7j52J03P5j47K65j08j0o1K05l80J49p0Rk4J09
$$ plain form
4443 16 -201 -121 103 10 206 -500 -123 243 -107 -102 45 -144 104 -96 -95 26 -6 -31 18 -47 4 70 -99 143
4467 143 -272 94 -184 157 53 117 228 -14 -268 124 74 -114 -164 -202 80 4 -231 43 190 85 84 -294
4489 -294 -117 58 -99 -35 50 120 -16 35 159 -50 6 205 -99 -87 -170 -61 -5 127 -75 -49 -90 -66 107 -136
4513 -136 -27 194 -42 -56 14 201 -79 -170 85 -115 -2 87 95 -22 -55 87 -11 -129 -166 61 -92 -24 -54 261
4537 261 92 -166 116 -164 189 -210 28 -141 27 27 -137 -81 78 49 257 -15 2 -105 93 -99 -7 -33
4559 -33 25 -15 12 -187 -2 242 -189 30 120 -84 -70 -114 38 -168 166 -298 -193 -159 -155 208 -128 10 27 204
4583 204 -6 28 -138 225 173 242 -55 203 -148 261 -46 124 177 -206 -59 105 58 231 -172 81 152 -3
4605 -3 -133 -150 -46 -140 7 48 73 -108 146 81 -123 -45 -52 96 -125 -47 164 108 144 92 47 -5 29 -84 150 -127
$$ packed form
4443A6k17Q0K24r3J96p06L77L66l50NJ47j89K48k00JJ21l2k5M9o5N1O6j69K42
4467A43m15L66k78L41j04O4J11k42k54L92n0j88n0l8K82p6k35K74J47j05jl78
4489b94J77J75j57O4Q5P0j36N1J24k09N6J99l04J2q3J09N6J32k02K6m1K4J73k43
4513a36J09K21k36j4P0J87k80r1K55k00J13Q9Qj17l3J42r8j18l7K27j53O8l0L15
4537B61j69k58K82k80L53l99K38j69J68%j64N6J59k9K08k72J7j07J98j92R2k6
4559c3N8m0K7j99J85K44m31K19R0k04J4m4J52k06L34m64J05L4ML63l36J38J7J77
4583B04k10L4j66L63n2O9k97K58l51M09l07J70N3l83J47J64m7J73m03K53P1j55
4605cj30j7J04r4J47M1K5j81K54o5k04P8pJ48k21P8K11n6L6n2m5n2L4j13K34k77
$$ plain form
4631 -127 -9 -150 29 137 -193 93 -72 77 122 -62 -154 0 52 -307 8 10 3 -36 -122 172 -98 -117 178
4654 178 0 99 123 -19 -107 -115 -142 121 49 -200 -369 -146 65 -140 -77 -35 17 437 -19 246 138 -177 -225 -40
4678 -40 -8 108 -287 264 -173 -137 53 209 102 84 11 -246 -113 -78 65 -28 -104 -125 -52 38 27 1 10 246 -33
4703 -33 -73 14 -142 -65 176 38 -102 -103 -17 127 -172 -191 86 144 161 -141 -10 -2 92 -35 167 290 73 -102
4727 -102 217 -184 -256 66 -44 83 32 232 -234 85 153 95 29 -146 -136 43 205 8 91 160 307 -209 -162
4750 -162 -128 170 -7 -24 -119 202 321 -136 63 -14 61 -220 162 36 149 -70 249 -236 124 -166 232 154
4772 154 -15 0 -48 -56 -121 -75 87 102 -8 92 -5 280 -138 157 120 -117 42 -62 -147 -262 87 -170 232
4795 232 320 -27 -73 -13 30 25 -105 -79 -32 19 98 -17 -4 -123 97 144 17 113 139 -77 -105 148 -258 23 -214
$$ packed form
4631a27J18j41J79J08l30K86j65J49M5j84r2J54N2l59L15Kpl9q6K94k70j9K95
4654A78j78R9K4j42q8qk7K63p2k49j69K23K11k05O3M2N2M20m56K65j08l15m8J85
4678d0L2J16l95N51m37L6J90J56j07j8p3k57J33L5J43r3p6k1P3R0j1k6RK36k79
4703c3m0Q7j56P7K41j38j40jQ6J44k99j9K77N8J7l02J31QR4j27K02J23k17j75
4727a02L19m01p2L22j10J27n1K00m66L19O8n8o6j75J0J79J62j97Q3O9J47n16M7
4750a62L4K98j77j7r5L21J19m57J99p7P5k81L82j26J13k19L19m85L60k90L98p8
4772A54j69J5m8qo5M6J62J5j10J00r7K85m18K95l7k37J59j04q5j15L49k57M02
4795B32Q8l47m6O0M3nj30K6M7N1P9j15J3j19K20M7j27R6K6k16k8K53m06K81k37
$$ plain form
4820 -214 12 42 -341 5 19 130 13 -38 190 -82 -61 111 -70 -107 -119 10 159 -198 -26 4 -212 -282 -61
4843 -61 -22 302 128 281 152 -53 -23 105 -96 18 100 308 58 -107 191 150 61 -140 -218 78 -209 -138 24
4866 24 -35 20 295 -22 -34 33 184 13 287 -92 0 -13 135 -74 -99 -88 14 136 -19 4 153 -360 39
4889 39 -76 -114 361 140 164 -63 100 -176 54 17 -125 83 -48 83 -71 -30 -33 -107 332 -33 -20 -73 112
4912 112 165 7 12 -36 119 -194 -70 -230 -238 -100 -164 84 7 -124 98 -77 39 34 269 12 -36 307 120 125
4936 125 -72 70 68 -165 -88 237 233 41 -20 -36 19 47 -61 -75 116 -221 -205 344 -37 -48 -54 178 -235 -55 -50
4961 -50 -59 28 69 -177 -83 332 -360 -240 -156 40 -43 -37 13 -131 -198 124 191 -256 -106 38 78 -102 207 77 151
4986 151 76 0 -49 -113 136 47 -173 -138 92 86 -295 -212 294 120 2 45 -86 -315 -225 118 125 -111 -8 -87 -66
$$ packed form
4820b14K26L0l83L46J4J11j17n1K28k72K1J72j81l7j2J29J49l57J72L0k16p0K21
4843f1L9L24j74J53j29k05L0J28k01J14Q2K08k50j65K98m1q9k01p8K96k87P1J62
4866B4n9N5K75l17j2O7J51j71K74l79R2j3J48k09k5J1J02J22j55K3J49n13L99
4889C9j15l8M75k21K4k27J63k76K30l7j42K08j31J31j54M1lp4M39l65J3n3J85
4912A12N3j58Nm8J55l13J24j60qJ38o4K48p7j31K22j75J16nK35k57m8L43j87N
4936A25j97J42kk33P7L25mj92o1j6N5K8j08j4J91l37J6N49l81j1oK32m13J80N
4961e0rQ7M1k46R4M15o92J20Q4J96q3ON0j44o7L22O7m47J50J44M0j80L09j30P4
4986A51p5p6m9o4K49q9k20L5K30ol81Q3N06j74j18M3j31k29R0L43Pk36J03p9K1
$$ plain form
5011 -66 193 29 -42 205 101 118 -74 223 -68 -234 250 -210 91 146 90 71 43 -65 66 130 -44 189 153
5034 153 -81 96 179 -27 158 104 146 -14 -108 -47 -138 -49 182 -20 -79 -109 56 198 -103 63 8 -68 35 -77
5058 -77 169 23 -53 104 178 -139 114 76 224 148 8 -28 331 -30 -5 34 43 -153 41 -149 -8 51 -71 36
5082 36 -162 -160 23 -3 -160 -23 43 81 -235 90 84 88 77 25 29 67 -115 200 -318 -192 47 -124 -358 19 64
5107 64 -129 -30 440 243 -42 111 -134 -54 80 -104 -67 -207 -13 157 47 21 195 -10 7 -138 -249 166
5129 166 171 170 -254 -64 -47 -172 -31 108 -137 -113 48 -75 -294 110 -16 2 -38 235 107 11 32 219 -138
5152 -138 -129 112 -22 251 -44 215 -65 159 -64 -92 10 181 237 -48 24 103 -13 -94 -107 -38 6 -207 169
5175 169 -94 64 12 116 -227 -113 -3 208 0 -170 191 -120 118 61 247 -86 -70 4 214 403 48
$$ packed form
5011f6K59j64p1K47j04J7j92K97k91j66M84m60L01N5n6j9k8j08J31O4j74K33l6
5034A53k34J77Q3k06J85n4M2j60r4O1r1Q9K31k02n9l0J65J42l01J66n5p6J03j12
5058g7K46j46p6J57P4l17K53l8J48p6j40l6L59l61K5L9Rj96J94j90J41N9j22J07
5082C6j98KJ83k6j57J37O6L8l16L25oMj1n2ML8j82L15n18J26K39j71k34L77M5
5107F4j93R9M70j97k85J53k45Q0J34j84L7j40J94J70j10k6J74k05J7j45j11M15
5129A66Njm24J90J7j25J41J39k45K4J61j23k19M04j26J8m0K73j28r6K1J87l57
5152a38RK41j34K73k95K59k80K24k23k8J02J71N6k85P2P9j16q1j3O9M4k13L76
5175A69k63J58n2J04l43J14J10K11k08j70L61l11K38n7J86l33J6P4K10J89l55
$$ plain form
5196 48 198 31 202 -307 -107 -222 -17 75 -1 -250 91 -11 17 87 -159 -76 -140 16 133 42 -106 35 100
5219 100 45 -127 -76 23 213 14 -56 -154 -24 203 224 155 76 -214 -340 319 -172 -8 -180 -59 314 27 97
5242 97 20 -115 -55 -227 -104 76 67 4 -146 -83 30 90 -15 -105 -235 -6 -127 -60 7 -161 179 -199 -55 -27
5266 -27 80 -34 -205 -193 -200 98 126 -5 -157 96 47 -95 219 -97 2 -69 -5 -65 101 292 -177 279 176
5289 176 24 -5 112 -43 -409 130 189 -11 -196 -14 -105 -179 43 -110 12 -140 -282 65 -75 36 189
5310 189 -13 4 41 -249 -202 -36 -217 -49 -81 26 149 -21 316 -125 -121 -5 -30 71 -70 57 -23 -169 -168
5333 -168 135 -79 -35 34 -83 -97 70 9 -22 -72 -134 -262 82 93 97 108 30 234 202 161 88 -227 -226 -58 92 85
5359 85 119 151 150 -18 284 -58 27 104 43 34 0 119 226 132 -121 -49 -6 86 -260 -127 73 -38 -217 -226 -134 204
$$ packed form
5196D8J50j67J71n09K00j15K05R2p6k49L41j02K8P0k46Q3o4J56J17r1j48J41O5
5219A00n5j72N1R9J90j99p0r8J30K27K1o9p9k90j26O59m91J64j72J21L73k87P0
5242I7p7j35O0j72J23J80ro3j50O3J13O0j05r0j30K29j21O7O7j68L40l78J44K8
5266b7J07j14j71J2pK98K8j31j52K53m9j42L14l16R9p1O4o0J66J91m69M56j03
5289A76j52k9J17j55l66N39N9k00j85J82r1p4K22j53J22j52j42L47j40J11J53
5310A89k02J7L7k90M7J66j81J68l2J07J23j70L37m41MJ16k5J01j41J27q0j46J
5333a68L03k14M4O9j17j4J67o1l1n0o2j28L44J1MJ1p8K04l2m1p3l15JJ68J50p
5359H5L4L2jj68L02l42Q5P7o1rl4J19J07r4k53P2M3R2l46J33K00j11j79rR2L38
$$ plain form
5385 204 -10 -56 -33 -234 -307 -108 139 -144 -74 -123 22 141 -74 -43 -57 -111 -149 -65 153 319 49 -70 -26 5
5409 5 -85 96 -182 -150 -120 -246 -3 40 -12 172 -54 -26 -34 -176 -254 20 71 -126 158 -20 -311 27 -205 103
5433 103 126 -240 -110 -131 147 -216 48 25 127 127 206 -26 -148 16 35 154 66 178 -93 37 139 -7 -183
5456 -183 253 212 -82 -176 8 242 191 -86 18 223 92 -78 4 -281 132 34 -24 -230 84 -13 -242 147
5478 147 -49 61 113 84 345 84 -213 -21 -7 69 123 54 87 5 280 78 14 201 -12 -191 -231 -108 79
5501 79 210 -128 119 -171 -48 63 -124 -33 -262 -90 -48 -19 130 229 8 -173 76 20 262 11 -122 -110
5523 -110 154 -60 -5 47 247 96 35 -108 -312 126 -83 -133 -37 23 160 -34 -12 115 183 18 -163 -228 -92
5546 -92 -10 -40 16 272 -48 117 235 143 -25 -54 -107 -167 -314 179 -115 276 13 96 141 134 -196 -154 359 89
$$ packed form
5385B04k14m6K3k01p3J99K47k83P0m9J45J19k15L1j4n4l8Q4K18J66k70j19M4L1
5409Er0J81k78L2L0j26K43M3n2J84k26K8qj42p8K74N1j97K84j78k91L38k32L08
5433A03K3l66J30k1K78l63K64k3J02%P9k32j22J64J9J19q8J12k71J30J02j46j76
5456a83M36m1k94r4J84K34n1k77J04K05j31j70Q2k85M13r8n8k06L14r7k29L89
5478A47j96J10N2k9K61k61k97J92J4P6N4o9L3q2K75k02o4J87k13j79m0J23J87
5501G9J31l38K47k90J23J11j87R1k29J72M2K9J49R9k21j81K49n6K42k51j33J2
5523a10K64k14N5N2K00j51o1j43k04M38k09n0R6O0J37j94K2J27O8j65j81o5J36
5546i2Q2l0N6K56l20J65J18r2j68k9n3o0j47M93k94L91k63Q3M5pl30M2N13k70
$$ plain form
5570 89 241 -60 98 -125 -195 -8 160 -36 -56 -77 59 -109 -49 -256 -180 146 -110 -149 -73 -7 199 235 8
5593 8 -240 117 -122 43 74 43 109 -87 -82 144 -81 -79 -144 73 85 -313 -61 -48 -149 -97 -178 -81 -144 -21 16 -57
5619 -57 43 189 -37 -58 -36 -9 -55 -70 179 214 124 87 84 -203 -45 159 -21 -197 217 58 10 189 -19 -179
5643 -179 -20 -129 89 -212 232 160 -117 -35 -79 15 -62 60 164 -27 -10 201 -40 72 -32 204 9 320
5665 320 64 -103 78 235 -67 94 -176 -108 91 -218 -117 20 105 -55 13 -148 21 -137 22 41 -278
5686 -278 -127 89 228 -51 -60 -177 -22 -82 -265 -181 101 85 244 177 -57 268 61 -149 124 -355 -170 108
5708 108 117 -123 -208 -53 60 -34 3 -21 -28 -30 -33 -100 68 -115 154 -73 112 264 -129 202 119 48 -22 190 -97
5733 -97 -105 -143 59 -87 196 37 279 -10 49 -114 46 50 -2 -4 -54 -164 -66 -179 73 -150 59 -139 0 106
$$ packed form
5570H9J52l01J58k23p0J87J68j96k0k1J36j68O0k07P6L26k56l9P6O6K06L6k27
5593Hk48L57k39J65L1l1O6j96NK26k25Ko5K17J2l98K52J3j01N2q1R7o3J23L7p3
5619e7J00J46k26k1K2K7m6j5K49L5r0l7lk87J58K04j80j76M14j59m8J79k08j60
5643a79J59j09K18l01M44p2k77Q2m4R4p7J22J04j91J7K11k41J12j04K36j95L11
5665C20k56j67J81J57l02J61k70O8J99l09J01J37Q5j60O8j61J69j58J59J9l19
5686b78J51K16J39k79rj17J55o0j83Q4K82j6J59o7k34L25k07k10K73m79J85K78
5708A08Rk40q5J55J13r4L7k4pklo7J68j83K69k27J85J52l93L31q3p1p0K12k87
5733i7ql8K02j46K83j59K42k89N9j63J60Mn2kn0j10R8j13K52k23K09j98J39J06
$$ plain form
5757 106 171 89 5 153 44 -12 -179 -48 -178 -204 -35 -200 -254 -203 -224 -60 -133 -164 -6 184 -74 35 -135
5780 -135 -18 80 34 -304 -69 195 18 147 -113 -26 76 197 291 36 154 -267 -96 -263 -287 28 -78 112
5802 112 6 -42 52 -59 154 -76 118 -178 4 -95 -96 -17 -82 -43 22 -75 223 -131 -34 59 108 109 -137 64 -177
5827 -177 -283 21 -73 160 202 -113 -56 219 -142 -212 20 54 43 -115 119 -86 57 -64 125 40 62 101 -135
5850 -135 -63 -199 -64 -42 -13 120 9 95 122 -194 48 53 -84 5 70 47 22 -52 54 39 119 246 330 -17 107
5875 107 64 195 -146 -124 -112 -14 -125 -94 -335 231 -147 -128 64 86 -34 43 275 -67 -168 168 -218 85 -222
5898 -222 -179 -163 -9 -86 19 30 -47 225 -114 -54 -210 95 116 -37 165 -91 -73 49 -75 180 215 -50 -7
5921 -7 201 159 -76 61 -92 -70 -51 37 136 -60 -97 57 -114 94 144 10 -135 113 -23 52 22 -138 -161 -117
$$ packed form
5757A06O5q2q4J48j09n6j67J31j30k6J69j65n4N1k1J64p3l1J58J90k58J09j70
5780a35J17R8m6l38K35K64j77J29k60Q7J02J21R4k55J18m21J71j67k4L15j06J90
5802A12j06m8R4j11K13k30J94k96J82r9jP9o5L9O5r7K98l54R7R3M9Jk46K01k41
5827a77j06L04r4K33M2l15N7K75l61p0K32L4j1j58K34k05J43j21J89q5K2L9k36
5850a35P2j36J35K2K9J33j11Q6K7l16K42Nj37Q9O5k3k5p4J06j5Q0J27Q4l47J24
5875A07m3J31l41K2J2R8j11L1k41N66l78J9J92K2j20P7K32l42j01L36l86L03l07
5898b22M3J6J54p7J05J1p7K72l39O0j56L05K1j53K02k56J8J22j24K55L5k65M3
5921gK08m2k35J37j53K2J9Q8R9j96l7J54j71K08N0j34j45K48j36P5l0j60k3M4
$$ plain form
5945 -117 -106 34 -3 -198 27 -146 -50 -80 -267 134 126 36 29 56 105 -261 26 -44 0 -144 3 6 -83 61 -76
5970 -76 177 -34 213 -144 -151 -112 85 121 -164 -55 -172 11 103 19 4 -78 160 -238 -95 198 -242 109 63
5993 63 123 -84 -172 83 220 41 105 -110 -253 -70 -40 -130 53 139 -59 -130 -98 -115 -119 86 -217 150 -114 -120 -212
6018 -212 -158 -148 79 -165 157 10 141 10 -105 178 -23 -139 -59 -42 133 -65 -215 220 61 -164 -118 -19
6040 -19 -193 -134 38 -161 -196 -93 -90 6 179 -310 -38 -109 -126 233 78 95 97 138 49 92 -88 -147 -118 23 192
6065 192 -10 -53 -96 -229 143 164 39 -406 -113 -147 181 -146 320 -36 -83 -46 -140 90 81 72 -172 109 -306 149
6089 149 156 119 283 41 162 -180 86 63 -71 253 -83 37 -6 63 -94 -141 -89 75 -94 -55 -18 -65 -37 99
6113 99 -119 -176 -197 68 -14 0 -30 94 -49 46 171 199 -101 122 86 -45 118 -7 216 -35 102 148 -127
$$ packed form
5945a17J1J40l7j95K25j73R6l0j87M01qr0pK7M9l66K87p0M4j44J47Lq9J44j37
5970g6K53k11K47l57pL9J97L6k85J09j17J83R2q4j5q2K38l98J43K93m40L51m6
5993F3O0k07q8K55J37j79O4k15j43J83L0r0J83Q6j98p1L2j7mK05l03L67k64or2
6018b12N4J0K27k44L22j47J31j31j15K83k01j16Q0J7J75j98j50M35j59k25M6R9
6040a9j74N9J72j99l5J03LR6J73m89K72p1j7L59j55J7KM1q9M3j80n9K9J41J69
6065A92k02m3m3j33L72K1j25m45K93l4L28l27M66l56m7L7r4K30rrk44K81m15M55
6089A49Pl7J64k42J21l42K66k3j34L24l36J20m3O9j57m7N2J64j69L9L7m7K8J36
6113I9k18n7k1K65q2J4l0J24j43R5J25K8l00K23l6j31J63j25K23k51J37M6k75
$$ plain form
6136 -127 51 -263 -91 -231 2 223 -64 -71 3 284 -3 217 55 -269 -296 -65 298 -21 212 57 -1 -154
6158 -154 36 95 -127 75 -89 -213 -340 -125 -16 -96 129 -101 96 40 -168 -82 154 -25 62 74 169 242 27
6181 27 -89 -46 -156 -323 44 -186 -205 197 -24 -106 -89 -278 -96 -135 -214 7 -93 -238 325 121 -26 112
6203 112 -148 -82 -63 174 -35 76 -190 -50 -52 -77 -4 -31 383 202 -114 4 20 179 89 59 178 49 148 153
6227 153 144 125 -176 -236 -89 -36 -123 133 87 16 -118 287 -1 61 -217 -32 -125 59 -235 -37 41 -14 174 0
6251 0 -115 19 -213 -3 76 105 156 -3 74 272 -43 4 -113 131 3 71 -53 -16 69 52 -32 -17 -234 113
6275 113 311 -114 141 65 88 130 179 32 -13 -89 -134 -122 -54 -60 215 30 184 -45 -130 140 -149 296 158 110
6299 110 -154 -66 -58 153 57 15 20 -116 63 21 -116 105 84 30 282 -67 -82 3 75 -19 132 51 -19 -327 204
$$ packed form
6136a27J78l14J72j40K33K21k87pP4K81k87K20j62l24k7K31L63l19K33j55n8j53
6158a54J90N9k22K02j64j24j27K15J09q0K25k30J97n6k08Q6K36j79Q7J2R5P3k15
6181B7j16M3j10j67L67k30j9M02k21q2J7j89J82l9p9K21j00j45N63k04j47J38
6203A12k60O6J9K37k09J11k66J40kk5P3k7M14j81l16J18J6J59r0l0J19j29R9N
6227A53rj9l01o0J47N3q7K56m6p1j34M05k88O2k78J85r3J84k94J98P8n5J88j74
6251@j15J34k32K10P9K9N1j59P7J98l15M7j17K44j28O8j24L7Q5j7q4J5k17L47
6275A13J98m25K55p6K3M2M9j47m5p6m5J2O8oK75j85J54k29q5K70k89M45j38m8
6299A10k64Q8QK11r6m2Nj36J79m2j37K21k1n4K52l49j5Q5P2r4J51q1p0l08N31
$$ plain form
6324 204 379 -65 -76 -155 -30 -145 86 -6 73 -159 93 49 -70 40 70 -97 -36 -127 41 -21 20 109 -97 36
6348 36 -68 18 -198 105 -141 225 88 145 233 17 -67 -51 36 -170 -173 -198 198 -71 56 70 -132 9 -37 -33 58
6373 58 -15 -32 125 -59 182 143 123 -122 -177 57 292 -177 102 118 -162 -169 -78 21 243 190 125 241 32 -108
6397 -108 -117 67 -177 -227 -26 -205 51 -247 71 74 88 -258 -341 87 291 -182 147 -183 130 -26 -149 174
6419 174 -91 355 -196 222 -224 -31 -142 -13 21 292 25 18 77 286 -85 -57 111 92 -54 -68 -55 -101 142
6442 142 -24 -26 202 111 -147 66 81 -89 40 -28 19 -93 -115 20 -134 22 46 204 42 15 106 -101 -8 175
6466 175 262 -25 -77 -143 114 59 160 -300 -27 37 144 -23 -83 40 -11 -5 -229 52 -164 -122 -72 -127 34 81
6490 81 84 -150 -116 -230 222 193 -25 282 24 -41 -134 -103 26 -195 -53 35 -150 72 4 32 -7 -22 97 53 105
$$ packed form
6324B04J75m44j1p9J25j15K31r2P9k32K52m4j19J10L0j67O1r1J68o2M1Q9k06J33
6348C6j04Q6k16L03k46L66j37N7Q8k16q4J6Q7k06lk5L96k69J27J4k02J41m6MR1
6373E8p3j7J57j84K41l9k0k45n5K34K35m69K79J6k80pR1R9K22n3o5J16k09j40
6397a08rJ84k44n0K01j79K56k98L18LJ4l46q3M28K04m73L29l30L13j56j23L23
6419A74k65M46n51M18m46J93j11J29L4K71k67pN9K09l71K8J68j9j46j4J3m6K43
6442A42j66kK28r1k58K13J5j70J29o8M7j12k2J35j54J56K4J58j62k7R1k07R3J83
6466A75Q7k87n2o6K57n5J01m60K73O4J07j67o0J23n1Ok24K81k16M2N0n5J61M7
6490H1Lk34L4j14M52k9k18L07k58o5r3L1J29k21J42Q8j85K22o8K8l9j5J19m4N2
$$ plain form
6515 105 -96 -168 -121 -114 255 -7 -18 169 229 62 7 31 139 -91 -8 100 -99 8 122 -103 -128 -40 -82 -130
6539 -130 196 -32 99 -37 -108 -122 -60 112 139 -35 115 5 83 11 -93 -67 123 89 163 32 90 -45 -73 -97
6563 -97 -125 -32 -144 346 -339 -2 48 -1 231 -153 -333 79 -129 165 186 -254 -22 -82 102 0 98 85 -114
6586 -114 307 91 -203 160 -41 111 150 -121 -56 -237 -2 -213 -59 -224 -236 -54 207 194 56 -1 -40 -263
6608 -263 118 353 -65 135 -248 -34 -30 13 119 38 57 -152 27 159 80 183 137 -90 119 86 -237 75 -73
6631 -73 -21 230 40 -74 -219 -123 79 77 -233 -142 -182 46 13 24 -30 -58 -226 227 20 -131 14 -62 -123 -83 77
6656 77 -93 -72 16 238 229 -19 -65 -125 -21 -156 -135 -11 184 88 25 207 -43 -31 17 -6 110 -40 118 0
6680 0 122 -99 -107 -164 45 27 -222 -372 -13 256 -173 -30 44 -16 -154 -9 78 100 -58 -70 -104 173 349 17
$$ packed form
6515A05k01p2M7PL69k62j1J87O0j67n5K4J08k30Q3J08j99J07J14k25k5Q8m2m8
6539a30L26k28J31j36p1j4O2J72K7j74J50j10P8p2j04K6J90l4P4j31N8j35k8k4
6563i7k8R3j12M90o85L37N0m9K32l84j80M12k08K94K1m40K32o0J84j02R8j3j99
6586a14M21k16k94L63k01J52L9k71O5j81K35k11J54j65j2J82K61j3j38n7l9k23
6608b63L81K35m18K00l83K14MM3J06q1J9k09J79J32p9J03m6k27K09l3l23L12j48
6631g3N2K51j90j14j45R6K02kl10R1m0K28l3J1n4k8j68M53k07j51J45p6o1M0J60
6656G7j70K1Q8K22rk48m6o0J04j35K1J24J95r6o3J82k50J2M8k3J16j50J58j18
6680@J22k21qn7K09j8k49j50L59K69m29J43P4o0j38J45Q7K2j58j2l4K77J76l32
$$ plain form
6704 17 -213 -87 -246 160 -132 -119 -189 -53 -165 -186 332 -78 41 -160 -316 -36 69 -44 24 43 -78 45
6726 45 -13 -162 -113 -82 131 -8 -106 140 -1 10 -214 -203 207 -34 85 -181 -34 -152 -106 -25 139 -258 101
6749 101 169 239 81 199 -27 -202 -47 -159 -73 95 183 -102 -54 474 36 79 140 18 305 -220 268 39
6771 39 -72 51 -102 74 -60 165 178 -153 -277 232 287 0 77 239 120 -96 -37 -59 -49 -135 116 -41 132
6794 132 -125 100 226 -45 268 -26 126 92 1 32 130 2 58 -103 -13 -168 -111 -22 125 92 163 65 -191 -123
6818 -123 -80 -153 -134 6 50 190 77 23 -8 9 -88 -141 -81 -25 -28 187 -184 224 120 0 21 -11 -202 -169 54
6843 54 16 78 -205 234 -77 -104 111 237 -161 193 153 82 16 -192 -115 -153 -191 -60 79 371 35 125 -239 40
6867 40 -277 -21 171 -174 -135 62 -205 -181 100 57 -41 14 -74 60 198 137 218 122 122 -120 -220 116 -95 45
$$ packed form
6704A7k30J26j59M06k92J3p0J36j12k1N18m10J19k01j56K80J05j13O8J9j21J23
6726D5n8j49M9L1K13j39r8K46j41J1k24J1M10k41J19k66J47j18M6Q1J64l97L59
6749A01O8P0j58J18k26j75J55j12Q6J68Q8k85M8N28m38M3O1j22K87n25M88k29
6771C9j11J23j53J76j34K25J3l31j24N09N5k87P7J62j19k16N9k2J0q6K51j57J73
6794A32k57K25J26k71L13k94J52l4r1L1R8j28N6j61R0j55N7Q9J47l3P1r8k56O8
6818a23M3p3J9J40M4J40j13n4l1J7r7n3O0N6lK15l71M08j04j20K1l2j91L3K23
6843E4l8O2k83M39l11k7K15J26l98L54m0p1o6k08P7l8l8J31J39K92l36R0l64K79
6867D0l17K56J92l45L9J97k67K4K81m3r8N5q8J34J38o1Q1r6%k42j00L36k11J40
$$ plain form
6891 45 -32 56 -96 -51 30 -287 -134 -74 66 152 123 249 261 151 -292 -8 -30 -264 113 170 -106 -4 103 -38
6915 -38 -44 193 -98 125 31 -5 41 270 -110 -8 -57 28 20 117 174 86 356 -301 -58 -80 -4 -273 -221 -31 41 119
6941 119 -37 112 -170 99 -34 -75 53 -99 -74 -159 134 -205 -77 32 -217 -201 105 95 -61 -61 -37 52 -8
6964 -8 -42 209 -36 57 87 118 32 304 96 -135 204 -281 30 -90 341 99 -173 161 8 -35 200 -83 -108
6987 -108 93 114 42 121 -80 49 101 -294 -189 141 -71 -202 88 -24 -219 71 10 -101 -186 1 99 192 94
7010 94 165 158 45 -149 -274 -251 35 118 52 195 -55 15 -39 148 -21 -110 -127 174 -104 18 33 -11 98 -65
7034 -65 -114 -127 -34 95 16 -13 109 163 -46 167 -133 -73 -82 141 72 176 19 136 -290 142 209 -23 -52 68
7058 68 14 202 -200 -59 -113 -26 77 4 -166 -41 49 46 -63 -44 233 30 64 124 6 -28 -150 -242 -90 -28 -136
$$ packed form
6891D5p7Q8j52M5Q1l17J53O0J40Q6k9J26J2j10m43K84k2k34L77N7k76J02J07j41
6915c8oK37k91K23r4l6M6K29l80J02m9Q5qR7N7q8K70o57K43k2P6k69N2J90P2P8
6941A19j56J49k82K69j33m1J28j52K5q5K93l39J28J09k49J6L06j0j56%K4Q9o0
6964hl4K51k45R3L0L1q6K72k08k31L39m85L11j20M31k42k72L34j53m3K35k83k5
6987a08K01K1p2P9k01J29N2l95J05L30k12j31K90j12j95K90o1j11q5J87R8R3r8
7010I4P1pj13j94j25K3K86Q3o6J43k50P0n4J87j69q9j7L01k78J22J5m4J09j63
7034f5m9j3R3J29p9k9J22N4k09K13l00O0rK23o9J04j57J17m26M32O7k32k9J20
7058F8n4J88m02J41n4Q7J03p3j70J25R0lj09J9K77k03L4O0j18l4j22r2J52O2j08
$$ plain form
7083 -136 -157 300 106 217 -25 183 -94 8 82 104 -118 -2 -341 120 155 57 -102 85 36 -117 -54 229
7105 229 56 38 55 26 -219 -104 289 -97 273 -207 -187 66 236 345 55 61 69 -12 -77 -58 259 -46 -168 47
7129 47 141 -3 -306 -277 55 -192 92 -14 -148 -186 117 -245 -122 235 -233 153 -45 19 49 -76 -145 59
7151 59 -243 -72 159 87 155 -22 -30 -30 202 12 292 173 -128 -74 -244 -129 -9 101 3 -176 186 -132 277
7174 277 -74 239 39 -40 154 183 -78 -258 -132 25 93 -84 -147 81 79 -25 161 -108 -192 -29 82 -237
7196 -237 124 99 -17 51 33 -40 123 -70 -111 71 22 -155 -110 -148 123 4 101 -182 156 -22 67 413 30
7219 30 2 -151 109 51 23 8 -196 26 108 253 22 -77 -34 -157 132 -142 74 -230 -27 -160 -47 -93 -93 -56
7243 -56 217 -139 -32 152 -145 81 -108 -50 62 -36 -99 -88 -70 232 -78 107 -47 -230 -44 130 229 -35
$$ packed form
7083a36k1M57j94J11k42K08k77J02P4K2k22J16l39M61L5r8j59J87m9j53O3K83
7105B29j73j8J7k9k45J15L93l86L70m80K0K53J70J09k90OQq1o5J9L17l05j22K15
7129D7R4j44l03K9L32k47K84j06j34l8L03l62J23L57m68L86j98O4L0j25o9K04
7151E9l02J71K31p2O8j77q%K32j90K80j19l01N4j70J15J20J10r8j79L62l18M09
7174B77l51L13k00p9J94K9k61j80J26J57O8j77o3K28kj04J86k69q4J63J11l19
7196b37L61k5j16O8j8p3J63j93m1J82m9j77M5l8K71j19R7k83L38j78Q9L46l83
7219C0k8j53K60n8k8j5k04K22Q2J45k31r9M3j23K89k74K16l04K03j33J13m6%L7
7243e6K73l56J07J84k97K26j89N8J12r8o3J1J8L02l10J85j54j83J86J74R9k64
$$ plain form
7265 -35 65 237 178 85 -146 106 30 42 -274 54 120 -3 42 57 -16 -156 -22 -139 -49 -200 308 -76 220
7288 220 -20 -337 -223 -80 199 -165 -60 -137 82 52 -48 94 4 -100 -161 117 124 94 -37 -302 210 52
7310 52 299 -186 95 -364 19 67 -73 130 10 56 -143 57 -185 60 40 102 -126 3 145 37 -214 -106
7332 -106 -35 -77 -112 77 -134 99 39 83 293 -69 -98 -242 108 -183 -38 86 -122 -36 56 -176 -46 318 162
7355 162 159 90 34 248 -34 -17 13 73 -49 -162 -8 91 184 79 171 -193 195 -27 -48 272 125 220 -250 -181
7379 -181 -130 296 -211 156 -10 -4 360 -76 8 -271 168 26 190 173 -57 332 -194 8 189 -58 -264 66
7401 66 260 -97 -167 -76 -4 271 -50 -176 40 111 43 156 -81 -95 -173 -28 -127 104 83 -115 56 -36 -231 -100
7425 -100 37 35 -246 121 -163 -275 1 -287 74 43 -134 -373 55 -60 -166 38 -100 344 -167 85 111
$$ packed form
7265c5J00J72n9r3k31K52p6J2l16L28O6j23M5J5p3j40J34j17R0j51N08l84K96
7288B20k40l17J14J43K79l64J05p7K19l0j00J42r0j04o1K78Pl0j31k65N12j58
7310E2K47m85K81m59L83M8j40K03j20M6j99K00k42K45k0O2k28J29J42j08k51J08
7332a06P1m2l5J89k11K33o0M4K10l62k9j44L50k91J45J24k08Q6R2k32J30L64j56
7355A62lo9n6K14k82J7L0O0j22j13J54R9R3j05R2l64L88k22k1L20j47R5m70O9
7379a81N1M26n07L67j66OL64m36Q4k79M39j42J64j7k30L89n26K02J81k47k06L30
7401F6J94l57p0R1P2K75l21j26K16P1o8J13k37j4p8J45r9K31k1j98J71r2j95J31
7425a00J37kk81L67k84j12K76k88L61l1j77k39M28j15j06K04j38M44n11K52K6
$$ plain form
7446 111 -7 -83 32 -102 121 -136 -171 -55 -54 -117 -54 164 -141 -84 -30 -45 21 -18 -74 -39 -37 -274 167 23 135
7471 135 17 31 -39 86 69 20 -199 -255 143 111 83 198 89 197 59 124 -131 109 139 -51 -177 112 -25
7494 -25 157 127 -216 305 -69 148 71 -62 -92 -184 74 43 14 -102 -107 -19 -76 114 169 67 13 -178 48 82 -102
7519 -102 -36 41 90 219 67 -149 70 61 212 231 12 56 -108 74 -72 -276 -136 -21 210 35 300 -179
7541 -179 33 -53 -10 76 -194 -275 112 -49 -36 93 -109 -49 -87 -101 67 -72 302 -35 -56 -78 -104 73 -32 -325
7565 -325 -182 -50 114 133 140 -293 -3 -30 91 79 130 -119 -158 126 -165 359 -77 -131 -66 -31 -138 -74 129 -77
7589 -77 -140 12 -10 121 106 -140 -20 234 -196 19 34 -175 150 279 64 257 -215 -33 67 -194 -33 271
7611 271 68 177 198 71 46 -116 -46 242 181 248 57 -187 -58 37 5 -166 72 -18 -176 75 -92 -83 195
$$ packed form
7446A11j18p6J15j34K23k57l5J16Jo3O3K18l05N7N4j5O6l9n6L5Kk37M41j44J12
7471A35j18J4p0J25j7m9k19n6L98l2k8J15j09J08j38O5k55K40L0j90j26K89j37
7494b5J82l0l43N21l74K17p7j33l0r2K58l1k9j16nQ8n7J90N5j02n4j91K26L4j84
7519a02O6P7M9J29j52k16K19rJ51J9k19M4j64J82j46k04J40J15K31j75K65m79
7541a79K12q6M3Q6k70q1L87j61J3J29k02O0l8j4J68j39L74l37k1k2k6J77j05k93
7565c25J43J32J64J9Pm33K90k7J21j2N1k49l9K84k91N24m36n4O5L5j07O4K03k06
7589g7o3J52k2J31j5k46J20K54m30K15J5k09L25J29k15J93m72J82J00k61J61L04
7611B71k03J09K1j27k5j62P0K88o1O7j91k44J29R5l2j71K38r0j58K51j67RK78
$$ plain form
7634 195 -383 92 -6 -94 252 -192 3 -67 -138 135 56 -5 176 315 -180 63 -129 -165 7 -36 -159 246 57
7657 57 -104 -283 -249 -29 88 21 108 54 164 -102 -47 89 152 59 0 129 -170 -54 -115 -56 43 -13 17 9 -81 -93
7683 -93 -76 -59 -162 -79 -188 19 400 -211 338 171 -111 97 -51 162 259 51 -176 86 -203 124 -211 13
7705 13 36 3 -113 191 -163 38 111 -201 128 -158 51 10 111 -166 -56 -20 -222 101 -35 -91 72 131 -86
7728 -86 -328 -63 79 253 -38 60 94 -307 152 262 59 -106 -49 -78 44 137 6 178 6 -163 185 -96
7750 -96 21 -9 -124 143 190 39 -51 183 76 258 45 -146 -46 54 -230 -105 94 -183 -56 -102 -56 61
7772 61 102 -29 39 -25 378 -110 117 -146 14 13 -52 88 65 21 21 4 253 -79 -27 94 -42 -87 12 -90 -136
7797 -136 -29 2 219 216 -193 78 71 195 56 117 39 -194 426 218 186 -26 1 -95 -35 61 -10 -80 -133 -216 41
$$ packed form
7634A95n78M75r8q8L46m44J95p0p1K73p9o1J81J39m95K43j92l6J72m3j23M05j89
7657E7j61j79L4K20J17o7Q7n4J10k66N5J36O3r3n9J29k99J16o1N9R9n6L0qr0j2
7683i3J7J7j03Q3j09K07L81o11N49j67k82K08j48K13R7k08k27K62k89L27l35K24
7705A3K3l3j16L04l54K01P3l12L29k86K09m1J01k77J10L6k02L23j36n6J63N9k17
7728h6k42K65J42J74k91R8L4m01M59J10k03j65N7k9J22R3j31J72j72j69L48k81
7750i6J17l0j15K67M7j51r0K34j07J82k13j91J00J00k84J25J99k77J27m6M6J17
7772F1M1j31O8o4M03m88K27k63J60jo5J40k3m4%j7K49l32N2J21j36m5R9j02m6
7797a36J07L1K17lm09K71pJ24j39O1p8k33O20k08l2k12K7r6O0R6p1p0n3q3K57
$$ plain form
7822 41 -246 -16 154 17 28 -254 -15 43 9 176 194 -129 172 121 -40 -248 125 -327 34 8 205 54
7844 54 191 26 -153 206 -37 -199 -111 -46 -29 -77 145 247 -99 143 -3 30 45 -189 218 -128 -289 51
7866 51 127 9 -204 -14 62 -70 86 -66 -50 27 10 66 -23 -67 -106 101 -181 177 -34 -8 101 104 117 -42 -17
7891 -17 52 -161 -203 71 -3 -52 -63 -74 -249 -108 205 161 195 -262 -14 135 -43 -26 -48 -179 -180 56 15 148 148
7916 148 -1 174 -154 -139 8 8 228 -75 21 21 -358 36 -92 -77 39 40 -93 -259 -23 93 33 53 5 73
7940 73 87 -170 -218 256 102 49 48 -32 -86 121 133 146 59 198 6 167 152 -140 -107 -185 -269 -51 -93 -319 -129
7965 -129 -88 -22 -97 102 -373 -320 -127 177 -66 0 -4 13 -2 173 -144 -2 -17 -65 -108 23 33 102 30 -208 294
7990 294 140 -182 290 46 -23 24 -62 -67 -179 -6 -104 131 56 22 -138 184 -35 183 -138 -30 125 -139 98
$$ packed form
7822D1k87K30J70j37J1k82K39N8l4J67J8l23L01n1j61k08L73m52L61k6J97j51
7844E4J37j65j79L59k43j62Q8O5J7m8K22J02l46K42j46L3J5k34M07l46j61L40
7866E1P6j18k13J90P6j32J56j52J6P7j7N6q9m4l9K07k82L58k11K6J09LJ3j59K5
7891a7O9k13m2K74p4m9j1j1j75J41L13m4L4m57K48J49j78J7k2j31jK36m1J33%
7916A48j49J75l28J5J47%K20l03R6%l79L94j28J5J16Jj33j66K36J16o0K0m8O8
7940G3J4k57m8M74j54n3jq0n4K07J2J3q7J39j92J61j5k92L3p8q4K18m2k26J90
7965a29M1O6p5J99m75N3J93L04k43O6mJ7j5J75l17J42j5m8m3J31J0O9p2k38N02
7990B94j54l22M72k44o9M7q6nj12J73r8K35p5l4j60L22k19K18l21J08J55k64K37
$$ plain form
8013 98 -209 252 -8 -35 -73 -106 98 -295 230 -58 -44 -159 -4 -63 -97 -101 -1 -55 -404 38 -15 99 293 -63
8037 -63 -49 -36 21 34 -96 18 -137 240 -70 -37 122 -94 54 79 137 7 51 272 -128 -51 -76 111 165 118
8061 118 262 299 -17 -76 -159 74 -179 -160 105 110 -50 -15 -28 69 -242 -157 -176 40 -96 202 -100 -218 284 8
8085 8 61 -187 -41 -59 -215 74 0 -57 -227 -102 41 -227 -83 -105 -188 147 -108 -105 121 -189 -137 -147 -21 -197
8109 -197 22 -101 -142 51 10 -124 -179 118 84 -186 -35 16 -117 -61 89 202 -365 -8 151 97 93 -256 8
8132 8 -122 96 -6 166 275 -167 -207 -104 73 54 -76 70 119 -140 -14 -103 214 154 -157 -4 -147 46
8154 46 -136 -118 -16 -38 -87 -49 -11 90 299 -199 -120 -156 49 0 -223 193 -7 61 -137 -251 -144 17 135
8177 135 -257 53 -174 -266 134 160 73 -144 -78 240 222 136 107 -2
$$ packed form
8013I8l07M61k60k7l8l3K04l93N25k88J4j15J55n9l4mJ00n4l49M42n3J14J94l56
8037f3J4J3N7J3j30J14j55L77l10L3J59k16J48K5N8j30M4K21m00P7k5J87N4m7
8061A18J44L7l16n9q3K33k53J9K65Nj60L5j3R7l11Q5j9K16j36K98l02j18N02k76
8085HN3k48J46j8j56K89p4n7j70J25J43k68J44k2q3L35k55LK26l10N2j0J26j76
8109a97K19j23m1J93m1j34n5K97l4k70J51N1j33N6J50J13n67L57J59n4ml49K64
8132Hj30K18j02J72J09m42m0J03J77j9j30J46M9k59J26q9L17o0l11J53j43J93
8154D6j82J8J02k2m9L8L8J01K09m98P9l6K05m9k23M16k00O8j98j14J07J61J18
8177A35l92L10k27r2M00K6q7k17O6L18j8q6k9j09
8191b
$$ Imaginary data points
##PAGE= N=2
##DATA TABLE= (X++(I..I)), XYDATA
$$ plain form
0 0 0 0 0 0 0 0 0 0 0 0 0 0 0 0 4 -8 8 -8 8 -10 16 -16 20 -24 26 -32 38 -41 48 -56 64 -73 84 -93 106 -119
36 -119 134 -150 167 -189 207 -231 256 -282 312 -346 380 -420 462 -509 562 -619 682 -753 833
55 833 -923 1026 -1144 1283 -1448 1649 -1895 2211 -2631 3213 -4083 5518 -8304 15701 -76015
70 -76015 -177246 23562 74987 -4219 9939 82191 74867 81169 70913 28500 43876 74122
82 74122 1207 -39808 15645 37672 2951 -5028 -25357 -45355 -25031 -39868 -91397 -59305
94 -59305 -9987 -45878 -55044 14906 29880 -10130 -6159 12475 5888 12223 13943 10199 46256
107 46256 68832 27788 19131 66547 52913 -14009 -23034 4023 -158 -15608 -20202 -19847 -8160
120 -8160 -8185 -35805 -44333 -26675 -35632 -53859 -33734 -5389 408 9529 19047 16766 27027 37058
$$ packed form
0@%%%%%%%%%%%%%%Mj2J6j6J6j8K6l2L6m4N0n8P0p9Q9j04J20j37J57j77J99k25
36a19K53k84L17l56L96m38M87n38N94o58P26q00Q82r71J071j181J301j435J586
55H33j756J949k170K427k731L097l544M106m842N844p296R601j3822K4005r1716
70g6015j01231K00808N1425p9206J4158P2252p324O302j0256m2413J5376L0246
82G4122p2915m1015N5453K2027l4721p979k0329j9998K0324j4837n1529L2092
94e9305M9318l5891r166O9950J4974m0010L971J8634o587O335J720l744L6057
107D6256K2576m1044q657M7416j3634o6922r025K7057m181j5450m594L55J1687
120h160k5k7620q528J7658q957j8227K0125K8345N797R121R518k281J0261J0031
$$ plain form
134 37058 15024 4699 32332 37258 10380 18759 48823 33700 -2558 -6151 -194 -13834 -32309
147 -32309 -40221 -33064 -16058 -16293 -31779 -22696 1094 -5469 -28300 -23252 -1877 6438 6265 10155
161 10155 21926 37519 36335 18998 16722 26640 14980 -5127 -1563 11974 9772 -1324 -5836
174 -5836 -3916 -2524 -15396 -30499 -27086 -16205 -20712 -25624 -11496 3913 2642 -3311 -1424 5680
188 5680 8522 2006 -765 12114 23694 18740 13114 20723 24838 13931 480 -2958 355 -2030
202 -2030 -11540 -13541 -4499 -2103 -12589 -17781 -12581 -10633 -17671 -22081 -13256 -669 2173 -1480 5200
217 5200 17615 17410 6809 6409 13869 14276 7767 5658 11192 16893 10638 -2032 -3052 3053 -5212
232 -5212 -18978 -17846 -8166 -7843 -13244 -13641 -6214 64 -4059 -12233 -7277 4370 3201 -2985 3342
$$ packed form
134C7058k2034j0325K7633M926k6878Q379L0064j5123l6258l593N957j3640j8475
147c2309p912P157J7006k35j5486R083K3790o563k2831N048K1375Q315j73L890
161A0155J1771J5593j184j7337k276R918j1660k0107L564J3537k202j1096m512
174e836J920J392j2872j5103L413J0881m507m912J4128J5409j271n953J887P104
188E680K842o516k771J2879J1580m954n626P609M115j0907j3451l438L313k385
202b030r510k001R042K396j0486n192N200J948p038m410Q825J2587K842l653O680
217E200J2415k05j0601m00P460M07o509k109N534N701o255j2670j020O105q265
232e212j3766J132R680L23n401l97P427O278m123q174M956J1647j169o186O327
$$ plain form
247 3342 15860 16976 10075 7439 11379 13544 6841 -2477 38 7982 4273 -5239 -3980 1533 -2376
262 -2376 -10948 -14526 -10949 -7798 -10223 -13011 -6351 2559 735 -3880 441 5869 3691 866 4122
277 4122 8451 9854 9689 8239 9809 10370 5778 -886 -807 380 -3638 -7099 -4582 -1924 -3775 -6980
293 -6980 -8099 -6395 -5957 -9115 -10041 -3941 1226 77 -81 5423 9301 5799 2181 4017 7236 6099
309 6099 2442 3597 8266 8068 2687 -313 1127 -63 -5733 -9224 -6805 -4216 -5087 -6883 -4704 -1310
325 -1310 -1810 -4517 -5806 -3073 -93 39 -742 3806 8987 8513 4760 5295 7737 5527 617 -481
341 -481 2882 3428 696 -1642 533 1299 -3809 -7750 -6422 -4968 -6871 -7545 -4525 -966 430 -359
357 -359 -178 2019 2770 591 -616 2523 5316 4457 3878 5681 6836 5040 1604 -989 -406 -303 -3135
$$ packed form
247C342J2518J116o901k636L940K165o703r318K515P944l709r512J259N513l909
262b376q572l578L577L151k425k788O660Q910j824m615M321N428k178k825L256
277D122M329J403j65j450J570N61m592o664P9J187m018l461K517K658j851l205
293f980j119J704M38l158r26O100N167j149j58N504L878l502l618J836L219j137
309F099l657J155M669j98n381l000J440j190n670l491K419K589q71j796K179L394
325a310n00k707j289K733K980J32p81M548N181m74l753N35K442k210m910j098
341d81L363N46k732k338K175P66n108l941J328J454j903o74L020L559J396p89
357c59J81K197P51k179j207L139K793q59n79J803J155j796l436k593N83J03k832
$$ plain form
374 -3135 -4830 -1629 927 -1971 -4131 -2781 -1839 -4137 -6142 -5139 -1893 -236 -821 482 3952 5081
390 5081 2472 1204 2887 3325 1723 1400 2240 4067 4500 2100 749 1088 -51 -3661 -5150 -3636
406 -3636 -2767 -3578 -3893 -2294 -874 -924 -2621 -3132 -1109 -166 -1267 -197 3227 4326 3331 3708 4267 4095
424 4095 2519 658 281 1172 1035 -330 -22 641 -122 -1961 -3089 -3137 -2903 -3494 -4009 -2265 -650 -357
442 -357 -250 398 873 359 200 320 1577 2665 2321 1928 3093 3987 2332 825 983 271 -1084 -994 -1114
461 -1114 -679 -681 -1644 -2155 -946 -1472 -3250 -3328 -1924 -1179 -1248 210 805 1438 1749 1278 682 2306 2364 805
481 805 1229 2424 1996 1685 1376 906 90 -500 -2023 -2120 -875 -1238 -2665 -2107 -744 -1426 -1956 -1520 -1371
500 -1371 -1198 -250 -224 430 2347 2113 753 1603 2748 1732 643 852 906 989 922 517 -123 361 -238 -1946
$$ packed form
374c135j695L201K556k898k160J350R42k298k005J003L246J657n85J303L470J129
390E081k609j268J683M38j602l23Q40J827M33k400j351L39j139l610j489J514
406c636Q69q11l15J599J420n0j697n11K023R43j101J070L424J099r95L77N59j72
424D095j576j861l77Q91j37j365L08O63p63j839j128m8K34n91n15J744J615K93
442c57J07O48M75n14j59J20J257J088l44l93J165Q94j655j507J58p12j355R0j20
461a114M35kr63n11J209n26j778p8J404P45o9J458N95O33L11m71n96J624N8j559
481H05M24J195m28l11l09m70q16n90j523r7J245l63j427N58J363o82n30M36J49
500a371J73R48K6O54J917k34j360Q50J145j016j089K09N4Q3o7m05o40M84n99j708
$$ plain form
520 -1946 -2294 -1276 -1937 -2301 -1688 -733 -185 -600 -410 -434 185 -174 -543 171 1571 1851 1094 1952 2270 1835
540 1835 848 585 119 -90 -63 -226 -464 335 -50 -1235 -1215 -582 -1489 -2472 -1775 -1132 -793 123 216 245 1177
561 1177 1368 201 158 1282 967 188 1504 1927 1529 1613 1109 18 -150 -545 -1861 -1944 -655 -847 -1436
580 -1436 -661 -159 -922 -682 -906 -1629 -752 -136 -278 -169 1554 1388 707 1588 1769 643 507 474 -4 665
600 665 1120 326 83 481 -350 -1125 -735 -1235 -2068 -1211 -950 -903 -442 301 -445 -349 794 103 -378 330 863
621 863 415 1283 1619 1006 1050 1473 211 46 214 -374 -758 -219 -146 -743 -434 -308 -640 -1071 -797 -1355 -1106
642 -1106 -311 -126 -110 340 448 529 589 490 290 479 799 555 714 1022 732 529 406 -4 -395 -613 -859
663 -859 -1217 -666 -385 -814 -622 -356 -738 -245 -415 -422 -319 388 335 484 805 753 647 888 652 326 188 506
$$ packed form
520a946l48J018o61l64O13R55N48m15J90k4O19l59l69P14J400K80p57Q58L18m35
540A835r87k63m66k09K7j63k38P99l85j185K0O33r07r83O97O43L39R16R3K9R32
561A177J91j167m3J124l15p79J316M23l98Q4n04j091j68l95j316q3J289j92n89
580a436P75N02p63K40k24p23Q77O16j42J09J723j66o81Q81J81j126j36l3m78O69
600F65M55p94k43L98q31p75L90n00q33Q57K61M7M61P43p46R6J143o91m81P08N33
621H63m48Q68L36o13M4M23j262j65J68n88l84N39P3n97L09J26l32m31K74n58K49
642a106P95J85J6M50J08Q1O0r9k00J89L20k44J59L08k90k03j23m10l91k18k46
663h59l58N51K81m29J92K66l82M93j70pJ03P07n3J49L21n2j06K41k36l26j38L18
$$ plain form
685 506 291 280 216 -336 -78 -113 -616 -822 -899 -727 -971 -673 -406 -227 -139 -328 -18 119 220 137 185 327 566
708 566 657 722 381 580 464 372 100 244 86 -95 -397 -353 -381 -323 -694 -649 -766 -673 -712 -291 -228 299 163 -227
732 -227 218 590 273 573 204 452 919 572 452 410 258 316 -62 -123 -309 -482 -559 -542 -625 -153 -260 -370
754 -370 -530 -395 -410 -260 77 -16 110 288 453 393 601 754 310 483 362 -59 285 -86 369 -147 -77 -349
776 -349 -209 -223 -592 -498 -492 -573 -403 -408 -480 -1 -45 -169 -235 191 45 258 239 652 471 877 408 179 176 153 -128
801 -128 -190 -166 -76 -219 -253 -158 -257 -250 -505 -265 -394 -413 -465 -105 -97 393 270 426 276 220 372 -31 249 569 13
826 13 373 293 329 254 172 -21 -178 -411 -479 -485 -534 -229 -185 -162 165 -48 -48 -76 -106 -165 27 150 126 4 356 164
852 164 275 9 77 -26 278 260 3 52 58 -14 -247 -398 -251 -238 -602 -380 -470 -131 -302 68 -7 186 77
$$ packed form
685E06k15j1o4n52K58l5n03k06p7J72k44K98K67J79Q8j89L10J37J01q3M8J42K39
708E66R1O5l41J99j16r2k72J44j58j81l02M4k8N8l71M5j17R3l9M21O3N27j36l90
732b27M45L72l17L00l69K48M67l47j20m2j52N8l78o1j86j73p7J7q3M72j07j10
754c70j60J35j5J50L37r3J26J78J65o0K08J53m44J73j21m21L44l71M55n16P0k72
776c49J40j4l69R4Oq1J70np2M79m4j24o6M26j46K13j9M13j81M06m69k29lk3k81
801a28o2K4R0j43l4R5r9Pk55K40j29j9n2L60QM90j23J56j50n6J52m03K80L20n56
826A3L60q0L6p5q2j93j57k33o8om9L05M4K3L27k13%k8l0n9J92J23k4j22L52j92
852A64J11k66O8j03L04j8k57M9Op2k33j51J47J3l64K22r0L39j71L70p5J93j09
$$ plain form
875 77 182 209 23 220 256 64 256 68 162 7 -61 -292 -5 53 -15 -200 -313 -35 -199 -170 -404 -274 -232
898 -232 -74 -92 -57 8 -14 -17 71 232 143 387 -44 347 227 403 103 -124 193 27 -152 -127 -7 -281 -2
921 -2 -198 -492 -502 29 -190 -189 -135 -49 183 -24 28 85 509 1 2 150 127 184 138 114 130 -93 -313 232 -17 -2
947 -2 -178 -379 -288 -186 -428 -295 -375 -187 50 319 -227 -149 -140 69 239 385 225 299 530 567 208 63 -65
970 -65 79 -98 -132 -20 -251 43 -169 -325 -55 -72 -333 -207 30 -1 25 17 -343 114 264 -145 -9 70 -162
993 -162 91 137 293 -31 223 140 25 112 -282 -351 36 -74 10 119 -414 62 -27 290 11 -264 -141 1
1015 1 188 -40 127 -105 -43 253 78 -31 83 -100 -30 357 135 -72 272 117 39 -227 -122 -396 -169 -234
1037 -234 -401 -232 -199 -8 139 104 167 131 211 90 -114 -140 25 279 148 -140 218 -19 58 54 -204 -23 -129
$$ packed form
875G7J05K7j86J97L6j92J92j88R4j55o8k31K87N8o8j85j13K78j64K9k34J30M2
898b32J58j8L5O5k2lQ8J61q9K44m31L91j20J76l00k27L17j66j79K5J20k74K79
921bj96k94j0N31k19JN4Q6K32k07N2N7M24n08JJ48k3N7m6k4J6k23k20N45k49J5
947bj76k01R1J02k42J33q0J88K37K69n46P8RK09J70J46j60P4K31L7l59j45j28
970f5J44j77l4J12k31K94k12j56K70j7k61J26K37l1K6ql60M57J50m09J36P9k32
993a62K53M6J56l24K54q3j15Q7l94o9L87j10Q4J09n33M76q9L17k79k75J23J42
1015AJ87k28J67k32O2K96j75j09J14j83P0L87k22k07L44j55p8k66J05k74K27o5
1037b34j67J69L3J91J47l5O3l6Q0j21k04k6J65K54j31k88L58k37P7mk58J81j06
$$ plain form
1060 -129 -160 -354 42 8 -264 38 -56 26 121 32 -56 -32 9 179 146 30 57 70 278 90 -41 -137 190 -27
1084 -27 42 426 147 275 111 -106 62 -12 -18 -313 129 -130 46 34 -91 -72 182 -194 -52 203 45 -92
1106 -92 261 45 246 -96 258 44 0 1 281 -115 -71 -4 -115 -31 -36 10 163 75 8 -27 22 -107 -200 146 -229
1131 -229 11 127 38 104 138 -19 -11 -204 290 -141 -67 37 -17 -240 -106 -372 -279 -155 -60 -71 318 69 -124
1154 -124 58 -489 72 67 338 96 70 -149 67 137 10 181 143 133 89 -170 185 88 -161 62 -18 -288 -64
1177 -64 165 55 66 84 -110 41 -158 -160 -101 -170 57 171 -150 132 -73 417 24 112 221 212 -15 -78 -176 -266
1201 -266 165 -40 194 -310 -140 -44 -116 -187 73 273 -209 162 -84 -66 41 -198 223 -223 -165 81 195 -57
1223 -57 119 -291 94 104 -309 135 35 -46 -51 -210 -24 -6 123 25 -284 177 -164 -22 -73 29 196 148 -246
$$ packed form
1060a29l1j94L96l4k72L02r4Q2R5q9q8K4M1J70l3j16K7J3K08j88j31r6L27k17
1084b7O9L84k79J28j64k17J68p4ok95M42k59J76j2j25J9K54l76J42K55j58j37
1106i2L53k16K01l42L54k14m4JK80l96M4O7j11Q4nM6J53q8o7l5M9j29r3L46l75
1131b29K40J16q9O6L4j57Qj93M94m31P4J04n4k23J34k66R3J24R5j1L89k49j93
1154a24J82n47N61nK71k42k6k19K16P0j27J71l8j0m4k59L55r7k49K23q0k70K24
1177f4K29j10J1J8j94J51j99kN9o9K27J14l21K82k05M90l93Q8J09rk27o3r8r0
1201b66M31k05K34n04J70R6p2p1K60K00m82L71k46J8J07k39M21m46N8K46J14k52
1223e7J76m10L85J0m13M44j00q1nj59J86J8J29r8l09M61l41J42n1J02J67m8l94
$$ plain form
1246 -246 76 251 118 67 100 24 -76 66 45 15 124 92 -189 -3 -149 -74 -102 -133 14 52 152 -208 28
1269 28 138 208 -273 269 135 -127 47 119 252 140 46 101 160 -63 209 137 50 -347 -127 -13 77 28 -126
1292 -126 -159 14 184 57 66 -94 -8 36 26 41 -243 60 -48 -26 -66 -218 153 -160 -204 -39 1 184 -62 -118
1316 -118 67 -150 188 -33 52 -168 75 -32 -174 -139 326 116 -246 459 -19 -69 -50 145 201 -240 23 127
1338 127 26 -102 43 46 -5 127 62 62 -314 301 111 -80 -5 -87 -102 24 105 -249 -49 -123 -63 58 -4 -236
1362 -236 -119 -238 120 159 -295 95 271 200 -23 -84 -155 110 156 31 113 -123 43 -13 -11 22 155 -22 23 13
1386 13 -117 32 155 -109 -64 -243 -66 -48 116 9 115 81 42 -180 2 -197 -199 58 -133 -88 -27 25 50 -65
1410 -65 -63 136 -42 110 -100 -65 -254 -256 21 -136 -55 -151 -147 -65 21 264 111 137 31 -159 129 -13 -18 77 37 12
$$ packed form
1246b46L22J75j33n1L3p6j00J42k1l0J09l2k81J86j46P5k8l1J47L8J00l60K36
1269B8J10P0m81N42j34k62J74P2J33j12r4N5N9k23K72p2q7l97K20J14R0m9j54
1292a26l3J73J70j27Rj60Q6M4j0J5k84L03j08K2m0j52L71l13m4J65M0J83k46n6
1316a18J85k17L38k21Q5k20K43j07j42L5M65k10l62P05m78n0J9J95N6m41K63J04
1338A27j01j28J45Ln1J32o5%l76O15j90j91P5q2j5J26Q1l54K00p4O0J21o2k32
1362b36J17j19L58L9m54L90J76p1k23o1p1K65M6j25Q2k36J66n6KL3J33j77M5j0
1386A3j30J49J23k64M5j79J77J8J64j07J06l4l9k22J82j99kK57j91M5O1N2K5j15
1410f5KJ99j78J52k10L5j89kK77j57Q1r6MQ2Q6K43j53K6j06j90K88j42nR5m0k5
$$ plain form
1436 12 -202 -256 -258 115 -286 -129 4 102 -117 -25 212 -14 105 -24 -86 -28 -90 24 -44 -78 -38 -98 -336 17
1460 17 129 -226 138 83 45 -372 144 -78 -74 34 128 37 33 -96 91 27 -9 107 -149 -74 260 -128 397 26
1484 26 17 -1 71 -213 241 32 -206 132 96 171 26 -67 -114 -110 197 -149 72 -58 101 199 -45 53 -181 -235 -62
1509 -62 18 164 166 -287 -18 24 -153 -31 65 76 29 -65 -158 -338 -50 -81 -61 -81 -19 -63 43 64 -91 -111 14 184
1535 184 -68 -166 12 -99 213 39 105 140 78 -307 -40 -77 132 -94 -44 8 103 67 10 -242 -117 -106 -66 -4
1559 -4 160 -85 -97 133 -32 61 38 9 12 -192 -113 -215 109 110 -64 119 -101 -288 -197 32 -150 166 260 200 342
1584 342 43 -70 -7 -20 -138 49 42 18 28 -62 157 141 80 217 -64 228 165 36 266 -192 118 -239 84
1607 84 -28 163 -46 -132 12 -238 -58 -48 -210 -58 -42 -57 32 46 -32 79 68 -166 -11 -108 -63 54 -54 158
$$ packed form
1436A2k14n4kL73m01J57J33R8k19R2K37k26J19j29o2N8o2J14o8l4M0o0k38L53
1460A7J12l55L64n5l8m17N16k22MJ08R4r1mj29J87o4l6J16k56P5L34l88N25l71
1484B6rj8P2k84M54k09k38L38l6P5j45r3m7ML07l46K21j30J59R8k44R8k34n4J73
1509f2Q0J46Km53K69M2j77J22R6J1m7r4r3j80K88l1K0k0O2m4J06K1j55k0J25J70
1535A84k52r8J78j11L12j74O6L5o2l85K67l7K09k26N0N2R5l6n7k52J25J1M0O2
1559dJ64k45j2K30j65R3k3k9Lk04P9j02L24Jj74J83k20j87R1K29j82L16R4o0J42
1584C42k99j13O3j3j18J87pk4J0r0K19j6o1J37k81K92o3j29K30m58L10l57L23
1607H4j12J91k09q6J44k50J80J0j62J52J6j5Q9J4p8J11j1k34J55r7M5J17j08K12
$$ plain form
1631 158 199 36 -138 1 90 -174 178 131 -231 14 93 -94 -62 -56 -28 0 -54 12 311 -202 124 -172 109 -87
1655 -87 36 -161 -186 54 96 49 -138 -60 8 10 169 82 10 -30 88 -63 -333 35 35 -35 -234 18 8 -1 35 -82
1681 -82 -178 73 -25 137 -32 144 27 -208 64 -165 -125 109 153 -147 184 -18 12 135 -64 69 -153 -166
1703 -166 54 -113 2 121 173 -180 -337 92 -144 -9 -103 -26 -134 -360 -11 -72 -63 17 -2 147 -46 61 -229
1726 -229 -69 -12 45 -55 -41 126 32 -83 98 -62 118 -192 88 141 -98 -90 -78 -142 34 -23 80 -73 -157 64
1750 64 -57 17 83 82 149 -107 -29 82 138 -174 -72 -154 6 -95 -252 25 -288 5 119 253 -224 -41 181
1773 181 206 106 31 36 -161 139 -78 -7 -44 226 -10 110 -49 123 -232 -87 -71 137 -153 43 -28 8 74
1796 74 203 114 44 22 -42 -161 -37 -110 76 83 7 117 -234 131 -144 67 172 175 62 -60 94 -18 134 6
$$ packed form
1631A58M1j63j74J39Q9k64L52m7l62K45P9j87L2OK8K8n4O6K99n13L26k96K81j96
1655h7J23j97k5K40M2m7j87P8O8KJ59q7p2m0J18j51k70L68%p0j99K52j0rL6j17
1681h2r6K51r8J62j69J76j17k35K72k29M0K34M4l00L31k02L0J23j99J33k22j3
1703a66K20j67J15J19N2l53j57M29k36J35r4P7j08k26L49o1RQ0j9J49j93J07k90
1726b29J60N7N7j00J4J67r4j15J81j60J80l10K80N3k39QJ2o4J76n7J03j53q4K21
1750F4j21P4O6jO7k56P8J11N6l12J02q2J60j01j57K77l13K93J14J34m77J83K22
1773A81K5j00p5Nj97L00k17P1l7K70k36J20j59J72l55J45J6K08k90J96p1L6O6
1796G4J29q9p0k2o4j19J24p3J86Pp6J10l51L65k75K11J05Lj13j22J54j12J52j28
$$ plain form
1820 6 -72 -34 -54 -116 -174 68 53 -68 -71 -38 9 -34 91 -116 -92 167 115 -62 73 -52 165 -54 -22 -205 44
1845 44 -74 14 -51 87 37 -32 -9 111 -28 -55 -65 -244 44 87 344 129 84 -14 -30 -41 193 104 328 21 85
1870 85 -96 -230 31 1 -83 -17 -70 -56 -56 -88 82 -186 -194 -20 -144 243 222 -6 153 -44 -113 89 -226 138
1894 138 235 -3 -33 -168 23 -161 -7 96 23 16 -216 82 -30 43 159 182 168 13 34 25 13 -128 -39 -91 -9
1919 -9 37 -107 -208 -281 76 -140 -169 170 -146 76 72 182 -122 7 -9 168 32 -148 13 -95 -181 -135 88
1942 88 199 -203 -119 -126 -7 3 -173 12 105 152 55 462 -151 -61 285 -241 -44 -80 -179 97 47 -225 -156 267
1966 267 156 9 98 110 -175 -113 -113 12 107 -226 -164 -90 135 -245 -46 293 121 -227 -12 -127 135 -65 262
1989 262 3 64 138 24 50 64 244 -253 -209 10 -161 75 -165 -287 5 92 -92 -166 -159 170 183 -73 50
$$ packed form
1820Fp8L8k0o2n8K42j5j21lL3M7m3J25k07K4K59n2j77J35j25K17k19L2j83K49
1845D4j18Q8o5J38n0o9K3J20j39k7j0j79K88M3K57k15m5r8j6j1K34q9K24l07O4
1870H5j81j34K61l0q4O6n3J4%l2J70k68qJ74j24L87k1k28J59j97o9K02l15L64
1894A38R7k38l0j35J91j84J54J03p3pk32K98j12P3J16K3j4j55K1rj2j41Q9n2Q2
1919iM6j44j01p3L57k16k9L39l16K22mJ10l04J29j6J77j36j80J61j08q6M6K23
1942H8J11m02Q4pJ19J0j76J85R3M7r7M07o13R0L46n26J97l6r9K76n0k72O9M23
1966B67j11j47Q9J2k85O2%J25R5l33O2P4K25l80J99L39j72l48K15j15K62k00L27
1989B62k59O1P4j14K6J4J80m97M4K19j71K36k40j22K92Q7j84p4PL29J3k56J23
$$ plain form
2012 50 45 -158 38 113 156 -66 153 -194 -155 35 -5 97 -152 34 97 -79 262 -128 145 115 162 -188 43
2035 43 134 160 -150 -191 72 -108 10 -111 -179 -43 20 24 -89 60 129 -234 177 -250 -42 -64 96 45 -37 -86
2059 -86 -112 -58 162 -19 221 -47 -196 -38 53 19 39 80 82 -9 -16 154 110 -250 -80 262 48 79 164 -122 159
2084 159 -27 326 37 21 82 -398 214 -146 82 1 -38 -87 17 95 174 210 -277 274 13 -234 -99 179 122
2107 122 -37 163 -202 123 -155 91 21 23 47 -54 -64 125 171 -26 2 -137 -167 27 39 115 -152 -88 -281 4
2131 4 281 -218 61 86 52 -130 124 223 37 -224 3 -199 -13 -30 -116 -63 -317 -3 178 -33 147 16 -199
2154 -199 -57 4 190 42 -221 116 154 32 -174 188 61 147 92 -184 19 -75 118 162 -190 42 -41 -75 -17
2177 -17 282 108 -143 -12 30 -155 51 149 -72 -51 32 263 -162 16 75 182 -9 -32 197 -185 -203 -22 204
$$ packed form
2012E0nk03J96P5M3k22K19l47L9J90m0J02k49J86O3j76L41l90K73l0M7l50K31
2035D3R1K6l10m1K63j80J18j21o8J36O3Mj13J49O9l63M11m27K08k2J60n1q2m9
2059h6k6N4K20j81K40k68j49J58R1l4K0M1Kr1pJ70m4l60J70L42k14L1Q5k86K81
2084A59j86L53k89j6O1m80O12l60K28q1l9m9J04P8P9L6m87N51k61k47J35K78n7
2107A22j59K00l65L25k78K46p0KK4j01j0J89M6j97K8j39l0J94J2P6k67O4j93K85
2131DK77m99K79K5l4j82K54R9j86k61K27k02J86j7q6N3k54L14J81k11J80j31k15
2154a99J42O1J86j48k63L37L8j22k06L62j27Q6n5k76K03r4J93M4l52K32q3l4N8
2177a7K99j74k51J31M2j85K06R8k21K1Q3K31m25J78N9J07j91k3K29l82j8J81K26
$$ plain form
2200 204 -280 84 -6 -100 -7 -44 10 119 64 -285 -137 218 68 48 -273 -44 -193 238 -71 7 140 -144 47
2223 47 185 -240 -57 2 2 -158 -143 -61 -177 37 61 197 -179 -72 189 -142 120 -170 11 115 -181 141
2245 141 36 9 53 -183 -126 -149 79 82 176 62 -207 202 13 37 -9 148 63 -68 140 -217 -78 75 -5 -16
2269 -16 -59 153 -61 9 24 88 -231 -58 18 31 -88 121 -83 -155 -26 170 -133 -147 -19 -43 17 -47 131 -68
2293 -68 5 126 194 137 -194 110 -43 121 -24 382 203 -181 -27 -124 58 196 136 144 -186 -70 -94 44 -168
2316 -168 48 156 -10 66 -141 23 189 -63 -56 -125 -79 -80 -89 183 -84 95 -128 -269 -262 26 -54 2 152 96 88
2341 88 -127 -96 -90 15 -288 -11 182 -165 -40 26 -165 -244 -3 -14 -40 -17 66 -36 125 -50 -103 -54 -62 -16 -272
2366 -272 -259 137 319 -108 184 -117 -80 -33 -117 95 -89 -121 -74 -109 -228 -95 -24 -121 52 -142 228 12 -269
$$ packed form
2200B04m84L64r0r4R3l7N4J09n5l49J48L55j50k0l21K29j49M31l09P8J33k84J91
2223D7J38m25J83N9%j60J5Q2j16K14K4J36l76J07K61l31K62k90J81J04k96L22
2245A41j05k7M4k36N7k3K28LR4j14k69M09j89K4m6J57q5j31K08l57J39J53q0j1
2269a6m3K12k14P0J5O4l19J73P6J3j19K09k04p2J29J96l03j4J28k4O0o4J78j99
2293f8P3J21O8n7l31L04j53J64j45M06j79l84J54r7J82J38o0Ql30J16k4J38k12
2316a68K16J08j66P6k07J64J66k52Po9M6jrK72k67J79k23j41PK88q0N6J50n6q
2341H8k15L1OJ05l03K77J93l47J25O6j91p9K41j1k6K3Q3j02J61j75n3M9qM6k56
2366b72J3L96J82m27K92l01L7M7q4K12j84l2M7l5j19J33P1r7J73j94L70k16k81
$$ plain form
2389 -269 49 61 -5 -52 -9 61 -140 73 48 -183 250 -60 -48 279 131 226 -198 -119 135 143 51 89 98 39 -126
2414 -126 -114 87 101 -45 144 -96 73 -46 -119 93 -151 23 19 -34 55 143 182 -30 71 -453 -62 224 -202
2437 -202 38 -114 87 234 -157 -7 150 -82 -66 94 7 -12 61 -20 15 -100 -69 88 19 -31 -149 -99 89
2460 89 42 0 -91 -114 121 -10 -5 -109 96 -1 40 106 -50 111 161 64 -106 117 -5 -194 146 -51 -116 -25 84
2485 84 148 -100 -254 122 -125 177 144 -158 -85 -199 152 -52 163 -60 -2 -88 -10 -169 10 112 -208 -23
2507 -23 -304 42 0 418 -188 10 -7 183 124 -116 -13 27 126 115 245 -9 136 -135 13 46 -381 -93 -159
2530 -159 41 48 -21 62 25 98 150 171 -14 -218 -25 40 -55 89 -250 59 -237 50 -356 149 -131 -265 67
2553 67 -10 -264 -103 40 -66 -342 148 53 4 31 90 -94 3 3 -46 165 38 57 17 147 -52 150 159 -29 -60
$$ packed form
2389b69L18J2o6m7M3P0k01K13k5k31M33l10J2L27j48R5m24P9K54Qr2L8Rn9j65
2414a26J2K01J4j46J89k40J69j19p3K12k44J74mn3Q9Q8L9k12J01n24L91K86m26
2437b02K40j52K01J47l91J50J57k32J6J60q7j9P3q1L5j15L1J57o9n0j18N0J88
2460H9m7m2r1k3K35j31Nj04K05r7M1O6j56J61N0r7j70K23j22j89L40j97o5R1J09
2485H4O4k48j54L76k47L02l3l02P3j14L51k04K15k23N8q6P8j59J79J02l20J85
2507b3k81L46m2M18o06J98j7J90n9k40J03M0R9j1J30k54J45k71J48L3m27K88o6
2530a59K00Po9Q3l7P3N2K1j85k04J93O5r5J44l39L09k96K87m06N05k80j34L32
2553F7p7k54J61J43j06k76M90r5m9K7N9j84R7%m9K11j27J9m0J30j99K02Rj88l1
$$ plain form
2578 -60 3 104 45 42 68 20 95 -158 -153 122 104 128 94 -77 -12 238 27 -36 -10 -55 -133 -32 55 -86 -160 14 -12
2605 -12 114 131 40 -368 -192 207 60 -167 182 -100 -74 102 -13 135 50 -140 -87 54 -68 193 143 44 177
2628 177 198 207 66 265 -103 -54 201 11 84 -189 -138 5 35 -168 -86 -14 12 -52 100 114 -123 59 108 -162
2652 -162 -159 246 115 96 -134 -87 46 77 160 -69 71 -45 -32 -124 -1 -117 -166 93 -165 20 -68 29 213 -151
2676 -151 -221 72 182 98 126 15 -205 -34 -39 -28 -61 162 26 25 80 207 -58 -2 147 104 128 29 271 45 178
2701 178 166 62 165 -40 267 66 -85 -118 173 44 -15 -178 16 72 26 129 -36 55 -123 -190 199 -10
2723 -10 3 173 27 52 37 113 -116 113 172 -1 66 79 -14 -31 -166 84 39 119 -121 -40 232 -5 -13 -49 85
2748 85 -114 -206 52 51 -153 -4 -214 28 -134 25 79 -36 113 -145 -68 -183 -39 -168 39 -51 -16 -62 35
$$ packed form
2578f0O3J01n9lK6m8P5k53NK75j8K4l4j71O5K50k11o3K6m5p8J01Q7j41p4J74k6
2605a2J26J7r1m08J76L99j47k27L49k82K6J76j15J48q5j90N3J41j22K61n0r9J33
2628A77K1Rj41J99l68M9K55j90P3k73N1J43L0k03Q2P2K6o4J52J4k37J82M9k70
2652a62LM05j31j9k30M7J33L1Q3k29J40j16J3r2J23j16m9K59k58J85q8R7J84l64
2676a51p0K93J10q4K8j11k20J71nJ1l3K23j36jN5J27k65N6J49m3K4r9K42k26J33
2701A78j2j04J03k05L07k01j51l3K91j29n9j63J94N6m6J03j65R1j78o7L89k09
2723a0J3J70j46K5j5P6k29K29N9j73O7J3r3j7j35K50m5Q0k40Q1K72k37ql6J34
2748H5j99r2K58jk04J49k10K42j62J59N4j15J49k58P7j15J44j29K07r0L5m6R7
$$ plain form
2771 35 -68 -61 -9 -4 11 -287 75 121 -205 70 111 139 36 116 92 80 10 113 316 -101 144 -99 29 -13 -46
2796 -46 -284 206 101 -106 -15 -212 65 -67 -192 95 72 -211 63 -151 -67 -3 -163 -50 313 153 -78 -7
2818 -7 -59 57 9 319 -101 194 73 292 -96 52 -89 -353 26 81 0 63 35 -233 -62 78 38 119 58 -122
2842 -122 -46 -100 27 112 -12 36 64 55 -34 176 -185 -90 -169 -79 85 70 25 -213 -34 8 49 -165 131 -309 -113
2867 -113 -51 151 -225 36 -90 -8 184 -139 52 72 26 -191 -12 -17 63 151 100 -120 101 154 -317 231 82
2890 82 105 -62 -240 386 -72 36 -59 68 -18 -107 74 -155 74 -5 -186 -52 -237 19 244 55 42 182
2912 182 143 -41 37 -315 -21 -55 162 -38 -114 -250 -148 -30 12 133 -102 -133 -341 -39 -41 147 -97 384 176
2935 176 41 227 -217 222 -381 36 -145 8 88 -145 -20 11 -103 68 106 -79 -30 121 90 48 -377 -108
$$ packed form
2771C5j03PN2NJ5k98L62M6l26K75M1K8j03Q0k4j2p0J03K03m17K45k43J28m2l3
2796d6k38M90j05k07R1j97K77j32j25K87k3k83K74k14Q4O4j60J13L63j60k31P1
2818gn2J16m8L10m20K95j21K19l88J48j41k64L79N5q1O3k8k68J71J40m0Q1o1j80
2842a22P6n4J27Q5j24M8K8rq9K10l61R5p9R0J64j5m5k38J79M2M1k14K96m40J96
2867a13O2K02l76K61j26Q2J92l23J91K0m6k17J79nQ0Q8n1k20K21N3m71N48j49
2890H2K3j67j78O26m58J08r5J27q6q9J81k29K29p9j81J34j85K56K25j89j3J40
2912A82l9j84P8l52K94l4K17k00p6j36J02J18M2J21k35l1k08L02kJ88k44M81k08
2935A76j35J86m44M39o03M17j81J53Q0k33J25L1j14J71L8j85M9J51l1m2m25K69
$$ plain form
2957 -108 139 32 160 50 -18 30 80 227 -23 44 120 61 -53 -108 -206 -249 -110 -35 350 -58 330 146 -24
2980 -24 -76 218 174 -217 -137 -46 -148 -153 17 30 -57 20 60 -27 -359 -3 95 -76 -12 298 -17 237 -26 139 35
3005 35 22 21 -121 40 31 77 -166 -154 -106 -105 -32 -87 -68 207 -110 320 181 116 -62 -176 -42 -87 197 -370 -116
3030 -116 -9 27 -187 -1 -28 53 194 -198 -102 123 86 6 -41 -8 62 20 198 153 -159 69 11 -140 89 64
3054 64 103 -27 54 -243 118 -83 46 -2 -94 160 108 41 4 25 153 -14 -99 -237 72 23 217 151 -317 119
3078 119 138 -19 39 44 -40 127 -15 46 -115 -226 95 -80 100 -9 -146 112 -22 111 79 67 -210 157 60
3101 60 -236 -129 -191 -121 153 -309 218 193 -81 -115 36 -287 -39 -255 -48 37 26 -65 26 -31 53 98 148 236 -6
3126 -6 172 -33 128 52 -145 -66 -89 -36 123 96 -218 54 -130 -96 73 -80 115 28 -34 -36 -1 -172 138 -31
$$ packed form
2957a08K47j07J28j10o8M8N0J47k50O7P6n9j14n5r8m3J39P5L85m08L88j84j70
2980b4n2K94m4l91Q0R1j02nJ70J3q7P7M0q7l32L56R8j71O4L10l15K54k63J65j04
3005C5j3jj42J61rM6k43J2M8JP3n5J9K75l17M30j39o5j78j14J34m5K84n67K54
3030a16J07L6k14J86k7Q1J41l92R6K25l7q0m7L3P0m2J78m5l12K28n8j51K29k5
3054F4L9j30Q1k97L61k01J29m8r2K54n2o7l7K1J28j67q5j38L09m9J94o6m68M36
3078A19J9j57N8Nq4J67j42O1j61j11L21j75J80j09j37K58j34J33l2j2k77L67r7
3101F0k96J07o2P0K74m62N27k5k74l4J51l23K48k16K07Q5j1r1R1n7Q4M5N0Q8k42
3126fJ78k05J61p6j97P9k3N3J59k7l14K72j84L4J69j53J95q7o2kL5j71L10j69
$$ plain form
3150 -31 80 -12 -36 117 -52 329 132 78 -132 -53 -29 23 105 20 -39 148 5 30 -264 -5 7 63 223 66
3174 66 -105 25 297 84 192 -317 -209 -146 -207 54 7 184 -63 -111 217 168 159 154 -75 -194 -133 -130 69 -16 -54
3199 -54 -48 -189 -63 -115 102 -320 -123 -45 -161 122 206 33 -59 198 -47 -215 106 -32 -33 -139 -96 -7 138 104
3223 104 45 176 -268 -58 -25 -151 138 -60 154 86 243 32 -8 -36 35 -192 45 38 -256 -121 -22 17 -134
3246 -134 -106 -241 -159 99 -103 -102 -35 -180 -22 -27 -81 -38 182 -90 -114 -281 -79 -64 -102 11 127 44 99 -86 34
3271 34 102 201 -99 62 -97 190 37 -189 152 40 -282 54 -81 -19 144 10 -85 -34 0 56 -76 -78 -108 -15
3295 -15 -157 56 139 -382 -47 335 65 140 -84 112 59 -40 14 -180 -81 126 152 11 -210 23 -52 -41 -46 18
3319 18 145 -171 176 68 50 -230 121 -183 -112 -105 110 284 178 327 244 -249 -108 38 -145 -139 -255 -14 -44
$$ packed form
3150c1J11r2k4J53j69L81j97n4k10P9K4N2Q2q5n9J87j43K5k94K59J2N6J60j57
3174F6j71J30K72k13J08n09J08O3o1K61m7J77k47m8L28m9rnk29j19O1LJ99q5l8
3199e4Oj41J26n2K17m22J97P8j16K83Q4j73r2K57k45j68L21j38jj06M3Q9J45l4
3223A04n9J31m44K10L3j26K89j98K14o8J57k11m0k8P1k27K37pk94J35R9L9j51
3246a34K8j35Q2K58k02JO7j45J58nn4M3K20k72k4j67K02J5l8J13J16q3N5j85J20
3271C4O8R9l00J61j59K87j53k26L41j12l22L36j35O2J63j34r5N1L4N6j32kl0R3
3295a5j42K13Q3n21L35L82k70P5k24J96n3r9N4j94R9K07K6j41k21K33p5J1nO4
3319A8J27l16L47j08j8k80L51l04P1PK15J74j06J49q3m93J41J46j83Oj16K41l0
$$ plain form
3342 -44 -81 -17 -60 -85 -166 111 90 164 243 42 -179 -188 147 29 -197 -218 12 23 105 -223 120 -61 90 238 -179
3367 -179 -366 -97 -131 61 -219 -98 -173 -210 219 54 65 91 -38 -136 -100 -149 355 125 125 -40 62 -20 -3 131
3391 131 63 -77 30 16 181 -150 -20 -75 23 147 -92 -39 109 -64 -165 52 110 -169 -11 107 -24 77
3413 77 17 57 -125 54 31 -22 238 -131 -8 108 58 -289 88 195 -121 -32 -49 2 9 -60 -150 217 -79 -79 17
3438 17 -161 38 183 33 80 91 -18 323 12 60 8 91 169 46 163 -111 -295 -59 67 50 50 90 38 -131
3462 -131 178 -114 14 19 -95 196 341 25 -146 176 -98 -132 181 -293 -189 -223 -150 48 21 138 -120 -46
3484 -46 -125 125 -275 -280 304 -68 -54 -118 13 110 -10 -363 -133 -103 -56 52 84 -127 74 -16 -16 -311 7 -181
3508 -181 -73 2 -159 -107 152 -27 -56 -237 18 147 16 206 94 20 -25 -88 17 58 -199 165 -251 56
$$ packed form
3342d4l7O4m3k5q1K77k1P4P9k01k21rL35j18k26k1K30J1Q2l28L43j81J51J48m17
3367a79j87K69l4J92k80J21p5l7M29j65J1K6j29r8L6m9N04k30%j65J02q2J7J34
3391A31o8j40J07j4J65l31J30n5R8J24k39N3J48j73j01K17N8k79J58J18j31J01
3413G7o0M0j82J79k3n3K60l69J23J16n0l47L77J07l16Q9j7N1Po9r0L67k96%R6
3438A7j78J99J45j50M7J1j09L41l11M8n2Q3P8j23J17k74j84K36J26j7%M0n2j69
3462a31L09k92J28Nj14K91J45l16j71L22k74l4L13m74J04l4P3J98k7J17k58P4
3484d6p9K50m00nN84l72J4o4J31R7j20l53K30L0M7J08L2k11K01r0%k95L18j88
3508a81J08P5j61N2K59j79k9j81K55J29j31J90j12p4m5o3J05M1k57L64m16L07
$$ plain form
3530 56 70 270 260 27 80 76 14 -69 -163 -15 239 -284 44 23 79 164 -142 -235 139 -13 -78 95 172 -10 -159
3555 -159 46 -17 -133 144 -120 8 -186 298 71 150 257 -12 47 103 108 56 163 -63 -230 175 77 91 -69
3578 -69 87 -262 -80 -26 56 103 -69 229 -95 -85 13 -28 -155 -85 -23 -52 -117 -27 201 18 200 58 9 99 -69
3603 -69 97 138 175 132 -95 33 174 -38 -178 20 189 24 -115 -12 79 -66 60 127 -283 0 -1 -120 -102
3626 -102 -59 -126 -131 -4 127 23 206 -75 222 26 -168 -13 -256 -114 -107 332 115 33 -172 25 -82 81
3648 81 32 -205 79 190 216 157 -72 -90 5 -117 -43 -124 35 -201 2 -207 -25 120 -187 -126 -312 -392 40
3671 40 141 -247 -28 201 -129 17 -54 69 302 -97 225 -24 100 73 -291 -14 93 43 34 93 9 201 -130
3694 -130 181 206 -167 -10 37 208 83 73 8 -71 -84 -30 -20 -82 27 -162 -72 -242 -146 -88 -91 -62 171 233 -63
$$ packed form
3530E6J4K00j0k33N3mo2q3r4J48K54n23L28k1N6Q5l06r3L74j52o5J73P7j82j49
3555a59K05o3j16K77k64J28j94M84k27P9J07k69N9N6Nn2J07k26j67M05r8J4j60
3578f9J56l49J82N4Q2M7j72K98l24J0R8m1j27P0O2k9o5R0K28j83J82j42m9R0j68
3603f9J66M1L7m3k27J28J41k12j40J98J69j65j39J03R1j45J26O7m10K83jj19J8
3626a02M3o7nJ27J31j04J83k81K97j96j94J55k43J42PM39k17q2k05J97j07J63
3648H1m9k37K84J11K6n9k29j8R5j22P4q1J59k36K03k09J82J45l07O1j86q0M32
3671D0J01l88K19K29l30J46p1J23K33l99L22k49J24k7l64K77J07n0rN9q4J92l31
3694a30L11K5l73J57M7J71j25j0o5p9j3N4J0o2J09j89R0j70R6N8lK9K33O2k96
$$ plain form
3719 -63 -175 88 253 133 -63 12 -83 282 -43 -45 -96 125 -95 -8 -186 -185 -157 -164 49 -96 -110 -81 141 323 -68
3744 -68 -76 24 16 -14 63 43 -232 -66 -108 -9 -117 16 82 -17 -152 -58 13 -114 163 180 -74 50 -89 -117 -74 -98
3770 -98 -150 9 62 29 165 110 113 46 196 200 -185 -31 51 202 12 -82 288 -235 -165 1 -32 -2 -64 -69 -181 76
3796 76 39 -179 -202 -149 154 -280 -261 -90 -40 1 47 9 -121 13 -22 -222 -22 -36 -117 -180 74 75 -257 41 223
3821 223 145 -95 212 15 31 -196 291 -45 -111 124 -215 74 -225 -61 -155 -79 -135 -90 2 -101 -93 49 -154
3844 -154 54 89 253 203 -47 101 59 -59 156 -139 274 91 3 -68 140 -144 161 -75 25 -138 -150 -82
3866 -82 123 319 -225 226 -337 -53 48 -45 -47 130 -113 0 100 -57 -53 18 -193 46 -116 -111 -78 49 69 142
3890 142 -204 29 -131 -107 -119 209 184 -265 -17 147 -115 185 167 -56 4 -124 149 60 75 -81 -29 -108 107
$$ packed form
3719f3j12K63J65j20j96P5r5L65l25kn1K21k20Q7j78JK8pK13j45j4K9K22J82l91
3744f8qJ00ql0P7k0k75J66m2R9j08J33O6r9j35R4P1j27K77J7k54J24j39k8M3k4
3770i8n2J59N3l3J36n5Lo7J50Ml85J54Q2J51j90r4L70n23P0J66l3L0o2nj12K57
3796G6l7k18k3N3L03m34J9J71N0M1M6l8j30J34l5k00K00j4q1o3K54Jl32K98J82
3821B23p8k40L07j97J6k27M87l36o6K35l39K89k99J64r4P6n6M5R2j03QJ42k03
3844a54K08L5J64n0k50J48m2j18K15k95M13j83q8p1K08k84L05k36J00j63j2O8
3866h2K05J96n44M51n63K84J01r3kJ77k43J13J00j57MP1k11K39j62NL3J27K0P3
3890A42l46K33j60K4j2L28k5m49K48J64k62L00j8k23O0j28K73q9J5j56N2p9K15
$$ plain form
3913 107 -383 -126 -128 53 90 221 73 55 194 12 255 28 126 135 -148 120 -124 -308 131 -170 -56 -47 -113
3936 -113 -154 148 -101 47 -331 -9 23 -75 5 98 27 -274 -263 169 317 -49 -75 -124 83 183 -66 -96 -194 202
3960 202 103 -114 67 -192 -23 -32 22 14 17 101 -293 -127 221 -110 -114 -247 54 -75 79 -350 -16 61 126 -52
3984 -52 -96 -61 -92 -253 41 -39 -111 219 -61 -270 25 200 -148 -154 -60 246 45 174 -256 -187 225 -28 -40 3
4008 3 -119 33 -119 -178 158 106 -27 85 -29 81 17 152 57 -101 25 57 87 173 -171 -109 -105 294 -123 9
4032 9 -218 90 -98 68 -22 67 -76 16 -22 62 -72 -42 36 50 12 -161 -49 10 -223 27 -201 29 164 -38
4056 -38 58 19 -57 331 167 122 399 49 281 -179 -56 -43 -128 -106 22 63 146 61 -174 -122 -427 -28 10 -53 -172
4081 -172 -83 -152 147 79 -60 -19 -20 206 -15 203 -136 -224 64 243 -279 -221 135 -21 -106 -304 -109 -260 -116
$$ packed form
3913A07m90K57kJ81L7J31j48j8J39j82K43k27R8Rk83K68k44j84M39l01J14Ro6
3936a13m1L02k49J48l78L22L2r8Q0R3p1l01J1M32J48l66k6m9K07J00k49l0r8L96
3960B02r9k17J81k59J69rN4qLQ4l94J66L48l31mj33L01j29J54m29L34P7O5j78
3984e2m4L5l1j61K94q0p2L30k80k09K95J75l48oR4L06k01J29m30O9M12k53j2M3
4008Cj22J52j52n9L36n2j33J12j14J10o4J35r5j58J26L2L0Q6l44O2ML99m17J32
4032Ik27L08j88J66r0Q9j43R2l8Q4j34L0P8J4l8j73J12N9k33K50k28K30J35k02
4056c8R6l9p6L88j64m5K77l50K32m60J23J3q5K2J28M1Q3q5k35N2l05L99L8o3j19
4081a72Q9o9K99o8j39M1jK26k21K18l39q8K88J79n22N8L56j56q5j98J95j51J44
$$ plain form
4104 -116 92 -57 -80 -148 64 88 88 198 102 238 -214 -128 44 225 -136 -63 175 48 -45 -246 -49 -81 67
4127 67 -134 238 -105 -217 148 133 -75 -25 363 8 -97 -168 -124 75 -341 -87 -95 -37 -12 96 -118 -60 13 -73
4151 -73 -132 140 116 118 187 -196 -190 35 24 236 -124 -9 -44 -15 -161 -301 -153 -211 135 -120 80 72 168 212 -48
4176 -48 137 32 -262 -58 -241 139 -135 -65 -202 181 -1 3 78 198 107 -223 -100 106 238 -175 79 263
4198 263 47 -173 183 183 140 -138 25 -34 -119 -7 58 233 19 150 143 347 152 27 -48 10 -20 -283 123 -52
4222 -52 115 -116 -174 41 18 92 -177 -13 -242 64 -335 123 200 -172 -156 130 -113 63 -104 29 195 -179
4244 -179 304 55 -40 -31 148 4 -82 -72 -55 -130 32 -48 147 -71 -69 87 16 5 94 -50 -186 186 -41 121
4268 121 199 -149 -85 80 -79 -35 143 45 -50 121 -11 10 -251 258 -214 200 -54 -71 45 67 120 -55 197
$$ packed form
4104a16K08j49k3o8K12K4%J10r6J36m52Q6J72J81l61P3K38j27r3k01J97l2J48
4127F7k01L72l43j12L65j5k08N0L88l55j05p1M4J99m16K54qN8K5J08k14N8P3q6
4151g3n9K72k4KO9l83OK25j1K12l60J15l5K9j46j40J48n8L46k55K00qR6M4k60
4176d8J85j05k94K04j83L80k74P0j37L83j82MP5J20r1l30J23K06J32m13K54J84
4198B63k16k20L56%m3k78J63n9q5J12O5J75k14J31pK04j95j25p5N8l0k63M06j75
4222e2J67k31n8K15k3P4k69J64k29L06l99M58P7l72J6K86k43J76j67J33J66l74
4244a79M83k49r5RJ79j44q6J0J7p5J62q0J95k18KJ56p1j1Q9j44j36L72k27J62
4268A21P8l48O4J65j59M4J78r8r5J71j32K1k61N09m72M14k54j7J16K2N3j75K52
$$ plain form
4291 197 -134 -85 -130 -137 24 -172 -41 271 -128 209 -146 47 -110 -320 176 -17 63 -217 173 184 10 143
4313 143 206 28 148 -154 -205 33 -101 83 68 182 -26 166 -159 -103 4 47 183 -147 246 -152 -120 77
4335 77 -108 18 94 -56 106 -56 -167 21 -185 -99 58 -69 -210 160 100 130 367 -34 97 -74 211 -91
4357 -91 137 -85 99 -104 210 51 71 12 35 -250 -75 -7 -23 -163 -113 148 -1 -28 160 64 -74 95 -47
4380 -47 192 -174 -52 25 -121 -109 -77 -144 115 22 292 179 -9 -5 160 240 105 198 43 73 -23 109 89 -115
4404 -115 49 37 214 92 -173 46 -28 10 -241 77 196 -5 76 150 -94 -47 -109 -247 -162 -68 -34 21 4 -39
4428 -39 156 -123 221 -64 -245 -150 346 -203 -251 112 323 -37 -21 -75 -451 -161 -30 32 50 77 -130 17 151
4451 151 -255 31 217 -15 149 54 110 -109 164 -158 -60 -67 -73 -22 -165 144 130 42 -127 -130 143 35 311 -87
$$ packed form
4291A97l31M9m5pJ61j96J31L12l99L37l55J93j57k10M96j93Q0k80L90J1j74J33
4313A43O3j78J20l02n1K38j34J84j5J14k08J92l25N6J07M3J36l30L93l98L2J97
4335G7j85J26P6j50J62j62j11J88k06Q6J57j27j41L70o0L0K37m01J31j71K85l02
4357i1K28k22J84k03L14j59K0n9K3k85J75O8j6j40N0K61j49k7J88r6j38J69j42
4380d7K39l66J22P7j46J2L2o7K59r3K70j13j88MJ65Q0j35R3j55L0r6J32k0k04
4404a15J64j2J77j22k65K19p4L8k51L18J19k01Q1P4k44M7o2j38Q5R4L4N5j7m3
4428c9J95k79L44k85j81R5M96n49m8L63K11l60J6n4l76K90J31O2J8K7k07J47J34
4451A51m06K86J86k32J64r5N6k19K73l22R8poN1j43L09j4q8j69lK73j08K76l98
$$ plain form
4475 -87 -18 -14 -36 250 64 17 -189 -136 117 -86 186 -149 122 122 -169 -87 79 123 119 -40 68 16 5 48 -57
4500 -57 150 -185 51 -232 -57 214 -26 -41 22 -76 -14 -267 -403 86 -338 -106 -68 -131 62 -194 -124 54 -41
4523 -41 96 -1 -123 58 81 132 209 34 -239 85 -51 -101 -44 29 -203 230 33 -58 -173 -103 -79 -24 100 -64
4547 -64 -93 -135 -44 -97 95 16 135 13 83 -119 -54 -257 -253 147 -3 -8 24 214 -108 -105 125 14 106 -8 184
4572 184 -125 -107 -93 -33 -142 -242 35 179 -99 -12 -12 -54 25 -107 61 -24 -125 2 -60 74 -51 -36 -71 101
4596 101 28 -21 -98 -119 -24 82 222 194 -172 66 -167 -43 -42 58 189 73 -198 -108 -33 -77 -68 124 -101 107
4620 107 -11 133 -270 -18 69 -13 42 -149 -206 -128 -14 -70 225 84 14 45 -171 17 89 -24 -222 -152 -81 -33
4644 -33 73 -163 -32 -23 -200 -102 -83 24 -91 -96 92 -70 -191 95 -86 -100 -160 -115 -18 178 161 -231 -138 -19
$$ packed form
4475h7O9Mk2K86j86m7k06N3K53k03K72l35K71%k91Q2J66M4mj59J08n2j1M3j05
4500e7K07l35K36k83J75K71k40j5O3r8O2k53j36M89m24K32L8o3J93k56P0J78r5
4523d1J37r7j22J81K3N1P7j75k73L24j36n0N7P3k32M33j97r1j15P0K4N5J24j64
4547f4k9m2R1n3J92p9J19j22P0k02O5k03MM00j50nL2J90l22LK30j11R2j14J92
4572A84l09J8J4O0j09j00K77J44k78Q7%m2P9j32J68q5j01J27o2J34j25J5l5J72
4596A01p3m9p7k1R5J06J40k8l66K38k33J24JJ00J31j16k71R0P5m4RJ92k25K08
4620A07j18J44m03K52Q7q2N5j91n7P8J14n6K95j41p0L1k16J88P2j13j98P0P1M8
4644c3J06k36J31Rj77R8J9J07j15nJ88j62j21K86j81j4o0M5R7J96j7l92R3J19
$$ plain form
4668 -19 -140 -138 58 -194 -108 87 149 -22 191 -11 -302 134 64 -104 70 -266 1 68 -44 104 -25 -151
4690 -151 -198 13 171 -56 94 -15 130 22 -10 70 -163 -14 -300 42 41 206 29 217 144 195 15 127
4712 127 -88 359 -53 123 140 1 46 -102 14 -163 10 11 111 -70 -39 -25 -91 -200 86 281 -93 59
4734 59 -66 -77 -95 171 124 9 -55 246 -221 -222 -30 -253 -114 32 114 112 -42 31 -34 -171 70 41 -279 152
4758 152 26 -115 -56 77 -52 -20 -12 17 -194 46 133 -151 34 -184 9 105 32 49 -34 -16 -47 136 -23 -399
4782 -399 -180 -61 -177 -231 91 -48 35 -12 129 115 -104 -107 218 -127 198 -139 -156 92 -45 221 -149 38
4804 38 8 -54 98 -74 -244 156 6 -224 10 -206 -37 -142 -85 -193 -67 -56 -187 39 125 -255 96 14
4826 14 -117 105 -2 -127 -41 -15 -19 -267 29 120 -121 -180 231 38 -122 -180 167 -144 19 90 60 -12 -342 112
$$ packed form
4668a9j21KJ96k52Q6J95O2j71K13k02k91M36p0j68J74l36K67O7j12J48j29j26
4690a51m7K11J58k27J50j09J45j08l2Q0k33J49k86L42jJ65j77J88p3N1j80J12
4712A27k15M47m12J76J7j39M5j48J16j77J73JJ00j81L1J4o6j09K86J95l74J52
4734E9j25j1j8K66m7j15o4L01m67jJ92k23J39J46Q2kj54P3o5j37K41k9l20M31
4758A52j26j41N9J33j29L2QK9k11K40Q7k84J85k18J93R6p3J7q3J8l1J83j59l76
4782c99K19J19j16n4L22j39Q3m7J41j4k19lL25l45L25l37j7K48j37K66l70J87
4804C8l0o2J52j72j70M00j50k30K34k16J69j05N7j08J26J1j31K26Q6l80L51q2
4826A4j31K22j07j25Q6K6mk48K96R1k41n9M11j93j60n8L47l11J63P1l0p2l30M54
$$ plain form
4850 112 -148 77 26 -21 -86 19 -83 102 376 48 -110 -125 -148 94 -130 89 -5 -34 -47 54 -10 15 19 111
4874 111 51 -114 72 -78 103 20 -1 197 50 46 10 -77 154 137 -75 140 194 -49 59 -158 -52 -95 -189 -117
4898 -117 38 -18 130 -366 125 -100 33 50 134 4 37 187 -2 -196 82 251 23 143 89 -186 -6 -91
4920 -91 160 -17 -247 -200 -71 166 -102 -15 -75 38 -134 103 18 77 133 64 -35 -78 65 54 -83 -45 168 -275
4944 -275 -49 -74 -20 299 55 -157 -102 -12 -17 314 120 -39 116 -97 -337 261 -68 -37 -245 -111 -12 37 -290
4967 -290 -105 -151 205 -54 117 -253 129 -130 -146 -164 -216 -112 -10 48 78 42 -50 26 -188 121 3 -82 -202
4990 -202 -57 51 246 1 -142 93 -109 -98 -70 208 -295 68 16 104 19 123 189 41 -25 -207 111 -34
5012 -34 -39 -41 146 66 -4 -39 -38 -303 -23 140 333 -133 79 -11 -42 300 140 143 -226 41 -17 -31 -114 -240 157 60
$$ packed form
4850A12k60K25n1m7o5J05j02J85K74l28j58j5k3K42k24K19r4k9j3J01o4K5MR2
4874A11o0j65J86j50J81q3k1J98j47ml6q7K31j7k12K15N4k43J08k17J06m3r4P2
4898a17J55n6J48m96M91k25J33J7Q4j30L3J50j89j94K78J69k28J20n4k75J80q5
4920i1K51j77k30M7J29K37k68Q7o0J13j72K37q5N9N6o9r9m3J43j1j37L8K13m43
4944b75K26k5N4L19k44k12N5R0nL31j94j59J55k13k40N98l29L1k08J34R9M9l27
4967b90J85m6L56k59J71l70L82k59j6j8n2J04J02N8L0l6r2P6k14L09j18q5j20
4990b02J45J08J95k45j43K35k02J1K8K78n03L63n2Q8q5J04O6j48o6j82L18j45
5012c4nkJ87q0p0l5Jk65K80J63J93m66K12r0l1L42j60Ll69K67n8j4q3j26L97r7
$$ plain form
5038 60 16 152 -216 106 -31 245 -63 -55 209 -1 114 213 211 -212 218 152 156 205 181 -7 152 196 -393 205
5062 205 -69 89 12 54 -51 182 -197 -199 110 118 -261 114 -235 57 -220 102 122 -243 -179 129 100 278 -33
5085 -33 117 98 8 94 -121 -200 -113 -10 -103 72 -7 -127 -344 -59 129 12 -343 -59 -35 86 168 105 -86 27
5109 27 -54 -244 26 -75 -11 -80 88 31 -69 167 85 87 -141 238 -45 218 -4 -20 205 133 9 100 133 -32
5133 -32 73 -240 -96 -5 139 -141 -10 76 178 124 101 274 -42 114 -4 -181 212 -255 -30 121 -119 9
5155 9 -126 22 204 14 204 -31 -68 -144 18 10 162 -87 -21 94 38 7 -55 209 108 -37 -97 44 83 -66
5179 -66 -78 105 145 29 -98 -15 -282 130 -103 -153 -27 78 -20 94 33 90 -23 97 -25 186 -198 111 71
5202 71 157 0 -51 211 -207 -8 -84 -240 177 -117 -134 121 -99 66 -86 161 -66 -75 -50 252 108 23 -15
$$ packed form
5038F0m4J36l68L22j37K76l08QK64k10J15R9km23M30o6MM9k4j88J59M4n89N98
5062B05k74J58p7M2j05K33l79kL09Ql79L75l49K92k77L22K0l65O4L08k9J78l11
5085c3J50j9r0Q6k15p9Q7J03r3J75p9j20k17K85J88j17l55K84K4J21Q2o3j91J13
5109B7q1j90K70j01O4o9J68n7j00K36q2Kk28L79k83K63k22j6K25p2j24R1L3j65
5133c2J05l13J44R1J44k80J31Q6J02n4k3J73l16J56j18j77L93m67K25J51k40J28
5155Ij35J48J82j90J90k35l7p6J62qJ52k49O6J15n6l1o2K64j01j45o0J41L9j49
5179f6j2J83M0j16j27Q3k67M12k33n0J26J05r8J14o1N7j13J20j22K11l84L09m0
5202G1Q6j57n1K62m18J99p6j56M17k94j7K55k20J65j52K47k27rK5L02j44q5l8
$$ plain form
5225 -15 144 97 -36 34 199 107 77 26 88 -41 198 124 -83 -48 -7 11 60 -22 -106 42 43 161 -78 65 -114
5250 -114 -46 75 -159 -21 -11 24 193 -19 -274 81 172 -101 13 17 69 -83 -68 229 -59 63 -13 -318 -43
5273 -43 -24 -337 -37 49 -233 -263 101 -128 -253 167 -53 -268 -61 166 -108 -83 -58 89 23 35 93 148 -118
5296 -118 -72 171 -60 -19 114 -19 90 56 -67 -81 228 82 -308 58 -104 -96 -258 -16 -27 94 97 -330 -136
5319 -136 254 21 226 119 124 -198 -54 8 -6 -56 -287 -118 -163 41 -62 -16 -22 -125 18 85 -74 -207 -204 164
5343 164 -72 -80 -165 -196 -25 83 6 -9 -76 65 116 -188 -34 -55 -148 -107 99 76 203 81 -110 37 222 -138
5367 -138 39 -112 123 -165 -193 -99 79 137 -10 -216 -68 112 -382 63 -84 -260 110 77 -45 -287 -159
5388 -159 173 90 104 -207 -316 -312 -130 -178 -96 -59 -98 -65 132 211 230 289 -194 35 152 112 26 0 92 -259 288
$$ packed form
5225a5J59m7j33P0J65r2l0n1O2j29K39p4k07L5M1J8M9q2q4J48JJ18k39J43j79
5250a14O8J21k34J38J0L5J69k12k55L55R1k73J14MN2j52J5K97k88J22p6l05K75
5273d3J9l13L00Q6k82l0L64k29j25M20k20k15K07K27k74K5K5J47o6J2N8N5k66
5296a18M6K43k31M1J33j33J09l4j23j4L09j46l90L66j62Qj62K42j1J21Lm27J94
5319a36L90k33K05j07Nl22J44O2j4n0k31J69m5K04j03M6oj03J43O7j59j33LL68
5343A64k36qq5l1J71J08p7j5o7J41N1l04J54k1r3M1K06k3J27j22j91J47J85l60
5367a38J77j51K35k88k8R4J78N8j47k06J48J80m94M45j47j76L70l3j22k42J28
5388a59L32q3J4l11j09MJ82m8Q2L7l9L3J97P9J9N9m83K29J17m0q6k6R2l51N47
$$ plain form
5413 288 -47 141 -129 -70 -9 89 377 -2 364 -218 212 -45 188 161 -53 -197 69 -19 221 -51 -128 31
5435 31 296 -97 -203 -236 59 81 91 264 -80 -134 -294 -104 91 34 -166 63 44 -28 -176 -213 56 15 -251
5458 -251 -113 123 -226 193 151 -27 -134 13 -189 185 -184 108 35 186 104 -53 119 238 -267 283 64
5479 64 107 -160 -384 -50 39 -274 -202 63 126 -36 267 375 38 105 194 75 -35 -186 143 -282 44 -60
5501 -60 162 37 53 35 244 -52 -156 32 377 -103 -119 -10 -86 -68 -52 -142 90 -12 -92 170 360 -155 -104
5524 -104 43 -22 48 5 -107 -99 37 113 17 -87 236 -49 84 -145 179 75 239 39 6 119 54 52 -225 -147
5548 -147 45 121 106 237 -161 -52 58 -83 20 215 89 140 37 311 115 104 -54 121 -15 -70 173 265
5570 265 68 -31 -409 -170 -31 -111 -5 -210 32 24 -240 -105 240 -87 488 67 -88 7 -67 4 -89 -215 -1
$$ packed form
5413B88l35J88k70N9O1R8K88l79L66n82M30k57K33k7k14j44K66q8K40k72p7J59
5435C1K65l93j06l3K95K2J0J73l44n4j60J90J95n7k00K29j9p2j48l7K69m1k66
5458b51J38K36l49M19m2j78j07J47k02L74l69K92p3J51q2j57J72J19n05N50k19
5479F4M3k67k24L34Q9l13P2K65O3j62L03J08l37O7Q9j19j10j51L29m25L26j04
5501f0K22j25J6j8K09k96j04J88L45m80j6J09p6J8J6r0K32j02q0K62J90n15N1
5524a04J47o5P0m3j12QJ36P6r6j04L23k85J33k29L24j04J64k00l3J13o5kk77P8
5548a47J92P6j5J31l98J09J10j41J03J95j26N1j03K74j96j1j58J75j36n5K43R2
5570B65j97r9l78K39J39q0J06k05K42qk64J35L45l27N75m21j55R5p4P1r3j26K14
$$ plain form
5593 -1 112 -140 128 60 8 -44 109 -29 -14 317 74 32 -131 272 -46 176 -111 -353 55 272 -204 -27
5615 -27 -195 -9 -215 -32 35 -221 -142 13 -55 -111 -128 -67 99 216 -75 -93 -13 6 229 -31 -93 -24 -10 -56 -34
5640 -34 -125 171 88 -41 -38 111 -15 -37 -13 128 1 -49 237 -245 -98 68 -64 172 39 -126 -140 127 104
5663 104 183 -273 -165 -63 145 -4 185 92 -13 -54 89 0 -38 -27 -265 -226 -146 -54 151 139 -40 311 -70
5686 -70 49 158 171 -59 217 -169 -91 -89 29 283 -39 -69 -267 -13 -24 46 85 -207 -32 -13 5 26 167 -49
5710 -49 134 -136 5 -117 163 -60 59 83 73 119 100 100 -251 -228 72 -5 -75 -38 116 261 -41 -47 -65 190 59
5735 59 99 -73 -33 10 61 -85 -5 -1 320 -19 -128 44 -262 -141 -135 -76 -172 50 63 153 -216 -1 3 306 -57
5760 -57 -313 38 -15 -186 -248 -108 -63 -64 75 128 137 -41 -117 -239 226 152 275 -25 160 106 -87 -7 -89 261 -59
$$ packed form
5593aJ13k52K68o8n2n2J53j38J5L31k43m2j63M03l18K22k87k42M08K17m76J77
5615b7j68J86k06J83O7k56P9J55o8n6j7O1J66J17k91j8Q0J9K23k60o2O9J4m6K2
5640c4r1K96q3j29LJ49j26k2K4J41j27n0K86m82J47J66j32K36j33j65j4K67k3
5663A04P9m56J08J02K08j49J89r3j05m1J43q9l8J1k38L9Q0R2K05j2j79L51l81
5686g0J19J09J3k30K76l86P8KJ18K54l22l0j98K54j1P0L9k92J75J9J8K1J41k16
5710d9J83k70J41j22K80k23J19K4j0M6j9%l51K3L00p7p0L7J54J45l02oj8K55j31
5735E9M0j72M0M3N1j46Q0ML21l39j09J72l06J21ON9r6K22J3R0l69K15ML03l63
5760e7k56L51n3j71o2J40M5jJ39N3Rj78p6j22M65p4J23l00J85n4j93Q0q2L50l20
$$ plain form
5785 -59 126 -52 -117 133 -164 76 46 -169 34 100 -258 209 61 -149 -58 209 2 -360 -85 -53 -98 -139 -11
5808 -11 3 114 49 -31 241 66 -49 169 -235 112 120 -39 176 -78 36 119 67 -183 -4 30 -45 165 137 -220
5832 -220 -34 -58 26 -164 -115 22 -85 216 -130 77 -336 38 304 -31 -35 -27 79 -163 71 -2 -132 87 -127
5855 -127 -49 234 31 117 34 196 11 -135 -23 74 -85 -46 -190 202 -223 87 131 -5 -5 -196 -8 -27 -102
5878 -102 169 -240 -61 154 49 -7 40 6 -30 6 -136 290 79 -73 69 -186 194 -58 232 -185 133 57
5900 57 -254 -61 -67 234 -48 4 -170 -27 -218 -175 -158 -252 -20 92 -155 -59 34 -143 -84 186 175 184 30 37 -50
5925 -50 -177 66 13 44 60 24 -45 -108 -5 -46 -31 -171 -32 46 131 -149 -263 241 25 181 267 81 -128 -98
5949 -98 -296 -191 281 -160 7 -331 65 67 30 209 -211 175 72 75 46 54 113 -16 -80 -150 38 -49 -41 49 116 -134
$$ packed form
5785e9J85j78o5K50k97K40l0k15K03O6l58M67j48k10R1K67k07l62K75L2m5m1J28
5808a1J4J11o5q0K72j75j15K18m04L47Qj59K15k54J14Q3n2k50J79L4p5K10k8l57
5832b20J86k4Q4j90M9J37j07L01l46K07m13L74K66l35mQJ06k42K34p3j30K19k14
5855a27P8K83k03Q6q3J62j85j46J12R7j59L9j44L92m25L10M4j36%j91J88j9p5
5878a02K71m09J79K15j05n6M7l4l6L6j42M26k11j52J42k55L80k52K90m17L18p6
5900E7l11J93oL01k82N2j74J43j91M3J7r4K32J12k47R6R3j77N9K70j1Rj54Pq7
5925e0j27K43n3L1J6l6o9o3J03m1J5j40J39P8Q5k80j14N04k16J56Q6j86k09L0
5949i8j98J05M72m41J67l38L96Kl7J79m20L86j03Lk9QN9j29o4p0J88q7QR0O7k50
$$ plain form
5975 -134 -4 -218 -105 244 42 -115 141 103 268 82 9 155 92 -60 155 73 -56 -91 -17 101 -76 -168
5997 -168 151 80 113 79 50 -243 -142 24 -40 197 -48 146 -124 -139 209 319 30 4 -49 43 -139 32 -104
6020 -104 180 31 -111 -98 49 130 -72 230 -50 139 -162 -42 -152 -179 109 53 60 28 143 102 -37 -42 263
6043 263 -39 -358 33 210 -183 -70 125 -314 48 334 -47 -12 -51 -98 -111 283 67 37 71 141 -91 -34 24
6066 24 346 -117 -79 -126 -84 114 -136 49 17 258 36 -149 -211 159 101 -96 -111 46 -248 128 97 -157 61
6089 61 -75 70 24 16 -141 -79 -8 -23 55 -21 130 -61 -122 -164 -50 -39 39 133 124 -108 -36 167 -170 -310 -25 -34
6115 -34 -47 56 66 -107 -5 215 -140 -50 -95 -124 -25 121 75 -128 107 290 63 82 157 140 -59 125 60 84
6139 84 -6 -178 297 -111 93 -255 154 -114 -129 -17 42 -10 332 138 27 -10 142 158 -130 106 -112 -64 -154
$$ packed form
5975a34J30k14J13L49k02j57K56l8J65j86p3J46o3j52K15q2j29l5P4J18j77r2
5997a68L19p1L3l4k9k93J01J66o4K37k45J94k70j5L48J10k89k6n3R2j82J71j36
6020a04K84j49j42J3J47Q1k02L02k80J89l01J20j10k7K88n6Pl2J15m1j39nL05
6043B63l02l19L91J77l93J13J95m39L62K86l81L5l9m7j3L94k16l0L4P0k32N7N8
6066B4L22m63L8m7M2J98k50J85l2K41k22j85o2L70n8j97j5J57k94L76l1k54K18
6089F1j36J45m6qj57O2P1j5P8p6J51j91o1m2J14J1P8R4rk32P2K03l37j40K85r
6115c4j3J03J0j73J02K20l55R0m5k9R9J46m6k03K35J83k27J9P5j7j99J84o5K4
6139H4r0j72M75m08K04l48M09k68j5J12N9n2L42j94j11l7J52J6k88K36k18M8r0
$$ plain form
6162 -154 141 -108 135 275 88 -113 -57 6 -62 -150 32 130 277 81 -195 -44 235 -77 91 120 191 -190
6184 -190 -6 171 47 -35 -14 70 -285 52 182 157 -301 -95 19 68 -49 9 154 29 -100 23 -28 128
6206 128 130 -1 -6 -131 17 13 59 -166 174 90 -31 -61 -201 -32 -35 -51 160 -215 -77 2 -154 198 -160 -193 140
6231 140 -193 169 48 5 -76 292 -45 -11 304 61 46 202 -48 47 -260 -113 16 -89 -62 259 82 -159
6253 -159 -59 -41 242 88 -64 -139 39 -182 -113 -12 -222 -351 28 -201 -26 -45 -151 -230 -20 -215 47 -121
6275 -121 30 242 -57 90 77 262 -249 -109 -98 -73 13 -71 -52 -166 140 78 -176 -7 -93 42 95 30 -38 -202
6299 -202 -47 71 21 -272 17 -17 166 12 -153 265 -57 -88 -158 236 137 122 100 75 37 -198 -51 -34 -48 -195
6323 -195 -24 131 -83 -181 157 190 -164 -58 5 133 90 -139 -296 -53 201 -87 9 -83 -43 -78 79 -234 89
$$ packed form
6162a54K95k49K43J40j87k01N6O3o8q8J82R8J47j96k76J51K79l12J68K9P1l81
6184a90J84J77j24q2K1Q4l55L37J30k5m58K06J14M9j17N8J45j25j29J23n1J56
6206A28Kj31nj25J48mM6k25L40q4j21l0j40J69lj6K11l75J38P9j56L52l58l3L33
6231A40l33L62j21m3q1L68l37L4L15k43j5J56k50R5l07J47J29j05K7L21j77k41
6253a59J00J8K83j54j52p5J78k21O9J01k10j29L79k29J75j9j06p9K10j95K62j68
6275a21J51K12k99J47j3J85n11J40J1K5Q6q4J9j14L06o2k54J69q6J35N3o5o8j64
6299b02J55J18n0k93K89l4J83j54j65M18l22l1p0L94r9j5k2k5l8k35J47J7j4j47
6323a95J71J55k14r8L38L3l54J06O3J28m3k29j57K43K54k88R6r2M0l5J57l13L23
$$ plain form
6346 89 67 -160 256 6 170 55 -43 -147 35 186 -165 86 162 -10 52 -170 -107 -335 -86 233 -219 -148
6368 -148 -29 -197 72 85 -313 -133 -128 27 170 -180 43 96 76 -125 178 18 -158 -83 2 97 -127 205 97
6391 97 40 -51 13 1 -221 -112 91 289 170 -265 12 -132 21 -94 401 41 257 -45 43 111 -95 -45 95
6414 95 -4 -102 203 234 -41 55 -74 -142 70 -27 -10 -49 -162 -103 237 -229 -32 132 119 -115 113 211 -33 -209
$$ packed form
6346H9k2k27M16k50J64j15r8j04J82J51l51K51P6j72O2k22O3k28K49L19m52P1
6368a48J19j68K69J3l98J80NJ55J43l50K23N3k0k01L03j60j76P5Q5R5k24L32j08
6391I7n7r1O4j2k22J09K03J98j19m35K77j44J53j15M95l60K16l02Q8O8k06N0J40
6414I5r9r8L05L1k75R6j29o8K12r7J7l9j13N9L40m66J97J64j3k34K28R8k44j76
$$ [...]
8191i5
##END NTUPLES=NMR FID
##END=
