##TITLE=1H_SR163_TFA
 aceton-d6
 8 sc, 
 29.9.2023
##JCAMPDX= 6.0         $$ Bruker NMR JCAMP-DX V2.0
##DATA TYPE= NMR FID
##DATA CLASS= NTUPLES
##ORIGIN= UXNMR, Bruker Analytische Messtechnik GmbH
##OWNER= root
$$ XWIN-NMR		Version 3.5
$$ Fri Sep 29 14:23:00 2023 Russian Standard Time (UT+4h)  she@DPX200
##.OBSERVE FREQUENCY= 200.13135
##.OBSERVE NUCLEUS= ^1H
##.DELAY= (6, 6)
##.ACQUISITION MODE= SIMULTANEOUS
##.ACQUISITION SCHEME= undefined
##.AVERAGES= 8
##.DIGITISER RES= 18
##SPECTROMETER/DATA SYSTEM= spect
##.PULSE SEQUENCE= zg30
##.SOLVENT NAME= CDCl3
##.SHIFT REFERENCE= (INTERNAL, CDCl3, 0, 15.7039)
##AUDIT TRAIL= $$ (NUMBER, WHEN, WHO, WHERE, WHAT)
$$ ##TITLE= Audit trail, XWIN-NMR		Version 3.5
$$ ##JCAMPDX= 5.01
$$ ##ORIGIN= Bruker BioSpin GmbH
$$ ##OWNER= she
$$ F:/spectra/data/she/nmr/H-F/1/audita.txt
$$ ##AUDIT TRAIL=  $$ (NUMBER, WHEN, WHO, WHERE, WHAT)
(   1,<2023-09-29 14:21:27.35 +0400>,<she>,<DPX200>,
      <created by zg, POWCHK disabled, PULCHK disabled
       configuration hash MD5:
       00 E9 B6 7A A2 85 ED C7 34 08 36 98 17 FE 4E 26
       data hash MD5: 16K
       73 53 43 29 79 5C 0F 9B 1A 7B 99 37 E6 73 18 AF>)
$$ ##END=
$$ 
$$ hash MD5
$$ 98 15 58 89 08 E4 9A 98 E7 A3 5E DC A9 5B 07 71
##$RELAX= 
##$RELAX= 
##$RELAX= 
##$RELAX= 
##$RELAX= 
##$RELAX= 
$$ Bruker specific parameters
$$ --------------------------
##$DU= <F:/spectra>
##$EXPNO= 1
##$NAME= <H-F>
##$PROCNO= 1
##$TYPE= <nmr>
##$USER= <she>
##$AMP= (0..31)
100 100 100 100 100 100 100 100 100 100 100 100 100 100 100 100 100 100 
100 100 100 100 100 100 100 100 100 100 100 100 100 100 
##$AQSEQ= 0
##$AQ_mod= 1
##$AUNM= <au_zg>
##$AUTOPOS= <>
##$BF1= 200.13
##$BF2= 200.13
##$BF3= 200.13
##$BF4= 200.13
##$BF5= 200.13
##$BF6= 200.13
##$BF7= 200.13
##$BF8= 200.13
##$BYTORDA= 1
##$CFDGTYP= 0
##$CFRGTYP= 5
##$CHEMSTR= <none>
##$CNST= (0..31)
1 1 145 1 1 1 1 1 1 1 1 1 1 1 1 1 1 1 1 1 1 1 1 1 1 1 1 1 1 1 1 1 
##$CPDPRG= <>
##$CPDPRG1= <>
##$CPDPRG2= <>
##$CPDPRG3= <>
##$CPDPRG4= <mlev>
##$CPDPRG5= <mlev>
##$CPDPRG6= <mlev>
##$CPDPRG7= <mlev>
##$CPDPRG8= <mlev>
##$CPDPRGB= <>
##$CPDPRGT= <>
##$D= (0..31)
0 1.2 0 0 0 0 0 0 0 0.06 0 0.03 0 0 0 0 0.0002 0 0 0 0 0 0 0 0 0 0 0 0 
0 0 0 
##$DATE= 1695982886
##$DBL= (0..7)
120 120 120 120 120 120 120 120 
##$DBP= (0..7)
150 150 150 150 150 150 150 150 
##$DBP07= 0
##$DBPNAM0= <>
##$DBPNAM1= <>
##$DBPNAM2= <>
##$DBPNAM3= <>
##$DBPNAM4= <>
##$DBPNAM5= <>
##$DBPNAM6= <>
##$DBPNAM7= <>
##$DBPOAL= (0..7)
0.5 0.5 0.5 0.5 0.5 0.5 0.5 0.5 
##$DBPOFFS= (0..7)
0 0 0 0 0 0 0 0 
##$DE= 6
##$DECBNUC= <off>
##$DECIM= 32
##$DECNUC= <off>
##$DECSTAT= 4
##$DIGMOD= 1
##$DIGTYP= 9
##$DL= (0..7)
0 120 120 120 120 120 120 120 
##$DP= (0..7)
150 150 150 150 150 150 150 150 
##$DP07= 0
##$DPNAME0= <>
##$DPNAME1= <>
##$DPNAME2= <>
##$DPNAME3= <>
##$DPNAME4= <>
##$DPNAME5= <>
##$DPNAME6= <>
##$DPNAME7= <>
##$DPOAL= (0..7)
0.5 0.5 0.5 0.5 0.5 0.5 0.5 0.5 
##$DPOFFS= (0..7)
0 0 0 0 0 0 0 0 
##$DQDMODE= 0
##$DR= 18
##$DS= 0
##$DSLIST= <SSSSSSSSSSSSSSS>
$$ [...]
##$SUBNAM2= <"">
##$SUBNAM3= <"">
##$SUBNAM4= <"">
##$SUBNAM5= <"">
##$SUBNAM6= <"">
##$SUBNAM7= <"">
##$SUBNAM8= <"">
##$SUBNAM9= <"">
##$SW= 18.05172834244
##$SWIBOX= (0..15)
0 0 2 0 0 0 0 0 0 0 0 0 0 0 0 0 
##$SW_h= 3612.71676300578
##$TD= 16384
##$TD0= 1
##$TE= 0
##$TE2= 300
##$TE3= 300
##$TEG= 300
##$TL= (0..7)
0 120 120 120 120 120 120 120 
##$TP= (0..7)
150 150 150 150 150 150 150 150 
##$TP07= 0
##$TPNAME0= <>
##$TPNAME1= <>
##$TPNAME2= <>
##$TPNAME3= <>
##$TPNAME4= <>
##$TPNAME5= <>
##$TPNAME6= <>
##$TPNAME7= <>
##$TPOAL= (0..7)
0.5 0.5 0.5 0.5 0.5 0.5 0.5 0.5 
##$TPOFFS= (0..7)
0 0 0 0 0 0 0 0 
##$TUNHIN= 0
##$TUNHOUT= 0
##$TUNXOUT= 0
##$USERA1= <user>
##$USERA2= <user>
##$USERA3= <user>
##$USERA4= <user>
##$USERA5= <user>
##$V9= 5
##$VALIST= <valist>
##$VCLIST= <CCCCCCCCCCCCCCC>
##$VD= 0
##$VDLIST= <DDDDDDDDDDDDDDD>
##$VPLIST= <PPPPPPPPPPPPPPP>
##$VTLIST= <TTTTTTTTTTTTTTT>
##$WBST= 1024
##$WBSW= 4
##$XGAIN= (0..3)
0 0 0 0 
##$XL= 0
##$YL= 0
##$YMAX_a= 270390
##$YMIN_a= -240833
##$ZGOPTNS= <>
##$ZL1= 120
##$ZL2= 120
##$ZL3= 120
##$ZL4= 120
##$ABSF1= 10
##$ABSF2= 0
##$ABSG= 5
##$ABSL= 3
##$ALPHA= 0
##$AQORDER= 0
##$ASSFAC= 0
##$ASSFACI= 0
##$ASSFACX= 0
##$ASSWID= 0
##$AUNMP= <proc_1d>
##$AZFE= 0.1
##$AZFW= 0.1
##$BCFW= 1
##$BC_mod= 2
##$BYTORDP= 1
##$COROFFS= 0
##$CY= 11.3945322036743
##$DATMOD= 1
##$DC= 2
##$DFILT= <>
##$DTYPP= 0
##$F1P= 15.7292609196834
##$F2P= 12.9074282941183
##$FCOR= 0.5
##$FTSIZE= 0
##$FT_mod= 4
##$GAMMA= 1
##$GB= 0.15
##$INTBC= 1
##$INTSCL= 1
##$ISEN= 128
##$LB= 0.24
##$LEV0= 0
##$LPBIN= 0
##$MAXI= 10000
##$MC2= 0
##$MEAN= 0
##$ME_mod= 0
##$MI= 1.114404
##$NCOEF= 0
##$NC_proc= 0
##$NLEV= 6
##$NOISF1= 3.799351
##$NOISF2= 2.8
##$NSP= 1
##$NTH_PI= 0
##$NZP= 0
##$OFFSET= 15.70392
##$PC= 1
##$PHC0= -21710.44
##$PHC1= 7.052711
##$PH_mod= 1
##$PKNL= yes
##$PPARMOD= 0
##$PSCAL= 0
##$PSIGN= 0
##$REVERSE= no
##$SF= 200.130013532006
##$SI= 16384
##$SIGF1= 3
##$SIGF2= 2
##$SINO= 400
##$SIOLD= 16384
##$SREGLST= <1H.CDCl3>
##$SSB= 0
##$STSI= 0
##$STSR= 0
##$SW_p= 3612.71676300578
##$SYMM= 0
##$S_DEV= 0
##$TDeff= 0
##$TDoff= 0
##$TI= <>
##$TILT= no
##$TM1= 0
##$TM2= 0
##$TOPLEV= 0
##$USERP1= <user>
##$USERP2= <user>
##$USERP3= <user>
##$USERP4= <user>
##$USERP5= <user>
##$WDW= 1
##$XDIM= 8192
##$YMAX_p= 0
##$YMIN_p= 0
$$ End of Bruker specific parameters
$$ ---------------------------------
##NTUPLES= NMR FID
##VAR_NAME=  TIME,          FID/REAL,        FID/IMAG
##SYMBOL=    X,             R,               I
##VAR_TYPE=  INDEPENDENT,   DEPENDENT,       DEPENDENT
##VAR_FORM=  AFFN,          ASDF,            ASDF
##VAR_DIM=   8192,          8192,            8192
##UNITS=     SECONDS,       ARBITRARY UNITS, ARBITRARY UNITS
##FACTOR=    0.0002768,     1,               1
##FIRST=     0,             0,               0
##LAST=      2.2672688,     0,               0
##MIN=       0,             -240833,         0
##MAX=       2.2672688,     270390,          0
$$ Real data points
##PAGE= N=1
##DATA TABLE= (X++(R..R)), XYDATA
$$ [...]
$$ plain form
1886 2765 109 -2292 647 2393 -322 -2409 789 2461 -1154 -2263 1302 1792 -1414 -2002 1575
1901 1575 1551 -1987 -1589 2121 1432 -1948 -941 1941 815 -2455 -807 2021 512 -2217 -48 2220
1917 2220 48 -2333 129 2132 -280 -2056 642 1750 -1000 -1758 949 1522 -902 -1555 1258 1521
1933 1521 -1557 -1049 1718 998 -1705 -1030 1575 495 -1942 -151 1740 423 -1739 -16 1985 187
1949 187 -1607 174 1889 -526 -1658 435 1531 -740 -1435 955 1496 -1268 -1196 1126 1243 -1013
1965 -1013 -952 1355 864 -1423 -523 1776 606 -1292 -358 1369 336 -1487 61 1394 -216 -1506
1981 -1506 202 1424 -138 -1415 593 1316 -762 -1347 582 1224 -751 -1073 717 785 -1000 -732 1044
1998 1044 506 -943 -449 1128 598 -1109 -256 1343 238 -1119 -100 1184 -54 -1112 136 1106
$$ packed form
1886B765k656k401K939J746k715k087L198J672l615j109L565M90l206n88L577
1901A575k4l538L98L710o89l380J007K882j126l270J648K828j509k729K169K268
1917B220k172k381K462K003k412j776K698J108k750p58K707N73k424o53K813K63
1933A521l078N08K767p20k703O75K605j080k437J791J891j317k162J723K001j798
1949A87j794J781J715k415j132K093J096k271o95K390N41k764P2K322J17k256
1965a013O1K307m91k287R00K299j170j898R34J727j033j823J548J333j610j290
1981a506J708J222j562j277K008P23k078n85J929O42j975l22J790O8j785K68J776
1998A044n38j449M94J577n30j707Q53J599j105j357J019J284j238j058J248R70
$$ plain form
2014 1106 -432 -981 402 1199 -561 -1163 410 695 -627 -928 381 726 -836 -767 712 400 -1061
2031 -1061 -459 1013 373 -809 -171 867 224 -829 -158 857 37 -1006 -120 971 -485 -494 327 894
2049 894 -213 -601 182 707 -453 -633 441 272 -490 -498 678 228 -624 -332 563 279 -498 -90 696
2068 696 289 -715 40 503 -171 -534 -96 438 -155 -811 304 503 -176 -337 84 185 -351 -288 270 203
2088 203 -532 39 312 174 -38 -188 341 407 -391 -101 557 27 -485 -54 355 -13 -433 -44 429 -26
2108 -26 -224 374 495 -253 -334 136 36 -240 53 327 135 -32 -267 436 102 -132 -209 432 296 -383 10
2129 10 -46 21 -191 45 339 -93 -202 -85 2 -110 -399 9 227 -307 -271 81 -43 -93 -176 254 299 -185 -75
2152 -75 483 -130 -169 -178 41 213 -343 -95 371 32 -198 -81 203 -266 -452 71 111 -165 -166 15 156 -185
$$ packed form
2014A106j538n49J383P97j760o02J573K85j322l01J309L45j562O9J479l12j461
2031a061O02J472o40j182O38J038o43j053O71J015q20j043Q86J091j456rQ21N67
2049H94j107l88P83N25j160j80J074j69p62qJ176m50q52K92Q95k84p77M08P86
2068F96m07j004P55M63o74l63M38N34n93o56J115J99o79j61M21J01n36O3N58o7
2088B03p35N71K73j38k12j50N29O6p98K90O58n30n12M31M09l68m20L89M73m55
2108b6j98N98J21p48q1M70j00k76K93K74j92j67k35P03l34k34p7O41j36o79L93
2129A0n6O7k12K36K94m32j09J17Q7j12k89M08K18n34L6L52j24n0q3M30M5m84J10
2152g5N58o13l9rK19J72n56K48M66l39k30J17K84m69j86N23M0k76jJ81J41l41
$$ plain form
2174 -185 -146 39 -47 43 188 220 81 -71 -16 117 -218 -78 -82 67 -109 -123 -61 110 -29 -60 -55 172 113 -183
2198 -183 147 -107 -41 -70 -74 196 -194 -102 70 128 203 -70 -155 -61 -52 -137 266 119 -129 -124 -70 102 -74 155 129
2223 129 129 -5 -53 121 -7 -85 -48 125 -84 23 -97 -26 34 31 -26 11 -68 115 -195 -131 -17 6 20 22 -105 -43
2249 -43 233 349 -77 76 -164 -335 80 -109 5 -303 -268 123 -139 -114 -83 285 -150 95 69 240 -21 -147
2271 -147 130 -210 -73 -210 -82 247 16 -75 -118 198 -163 130 -141 -114 -57 -103 85 67 172 105 -103 127
2293 127 73 -63 212 59 -8 21 -63 -119 86 -100 -66 10 -47 -22 126 -103 112 -62 95 94 -392 -106 -17 10
2317 10 49 -36 190 -49 -24 65 331 22 96 -293 98 24 -31 -40 146 -4 -70 34 -127 38 -38 369 -4 149
2341 149 48 244 -161 -232 226 -92 -28 -29 173 -21 202 96 101 -19 28 -36 -45 238 -190 -231 237 0 -118 128
$$ packed form
2174a85L9J85q6R0J45L2j39j52N5J33l35J40mJ49j76j4O2J71j39l1NK27n9k96
2198a83L30k54O6k9mK70l90R2J72N8P5k73q5R4Rq5M03j47k48NN4J72j76K29k6
2223A29%j34m8J74j28p8L7J73k09J07j20P1O0ln7L7p9J83l10O4J14K3J4Kj27O2
2249d3K76J16m26J53k40j71M15j89J14l08L5L91k62K5L1L68m35K45k6J71k61j26
2271a47K77l40J37j37J28L29k31r1m3L16l61K93k71K7N7m6J88j8J05o7k08K30
2293A27n4j36K75j53o7K9q4n6K05j86L4P6n7K5J48k29K15j74J57jm86K86Q9K7
2317A0L9q5K26k39K5Q9K66l09P4l89L91p4n5rJ86j50o6J04j61J65p6M07l73J53
2341A49j01J96m05p1M58l18O4jK02j94K23j06Nj20M7o4rK83m28m1M68k37j18K46
$$ plain form
2365 128 191 191 -124 -372 82 179 -243 -223 -134 91 -153 16 349 -17 153 -1 -21 200 -95 -176 -18 -152 105
2388 105 -70 60 -255 197 -137 16 182 -351 90 -81 -301 226 -168 20 -177 -225 65 48 -183 -37 2
2409 2 41 18 35 128 65 -74 73 205 -63 -91 -200 131 -142 -26 140 26 -233 -119 129 -103 78 67 99
2432 99 304 -150 -67 -7 25 -127 -146 178 31 -244 81 -25 -170 -211 -28 280 3 -62 -14 -45 -155 -59 297
2455 297 -141 -75 -43 -19 268 -281 0 289 -166 -245 -178 339 -6 -139 -52 317 -39 -233 -62 52 -20 -263
2477 -263 186 300 -290 -180 -8 407 -327 -188 152 74 -95 -220 190 188 56 -48 156 148 -187 -138 316 -44
2499 -44 -333 52 186 -269 -326 -88 -10 18 -288 204 341 43 -83 141 155 6 -180 404 220 -256 -139 121
2521 121 -65 56 -209 449 142 -162 -272 344 -21 -423 -159 -99 173 -151 53 283 37 -167 83 415
$$ packed form
2365A28O3%l15k48M54R7m22K0Q9K25k44J69L33l66J70j54k0K21k95q1J58j34K57
2388A05j75J30l15M52l34J53J66n33M41j71k20N27l94J88j97m8K90j7k31J46L9
2409BL9k3J7R3o3j39J47J32k68k8j09L31k73J16J66j14k59J14K48k32J81j1L2
2432I9K05m54Q3O0L2j52j9L24j47k75L25j06j45m1J83L08k77o5M8l1j10R6L56
2455B97m38O6L2K4K87n49K81K89m55p9O7N17l45j33Q7L69l56j94J71J14p2k43
2477b63M49J14n90J10J72M15p34J39L40p8j69j25M10kj32j04K04ql35M9M54l60
2499d4k89L85J34m55n7K38P8K8l06M92J37k98j26K24J4j49j86N84j84m76J17K60
2521A21j86J21k65O58l07l04j10O16l65m02K64O0K72l24K04K30k46k04K50L32
$$ plain form
2541 415 154 -358 318 70 -98 36 97 251 -230 -312 142 186 -47 -146 76 77 -124 -111 3 -175 -389 89
2563 89 170 -121 -243 -10 186 67 -212 -101 223 -251 -130 92 90 -374 -242 72 -20 11 -133 21 128 112
2585 112 67 291 133 -210 -89 169 -94 -84 226 254 117 -22 -28 210 -20 -92 -59 224 -437 -93 91 46 -205
2608 -205 8 219 128 -182 53 -21 -9 -164 -282 455 316 -233 -209 232 146 -189 7 120 -74 194 -31 -121
2630 -121 191 -346 -23 -26 -43 -62 -149 79 118 57 -88 250 -166 -320 77 68 -69 -295 -182 32 -361 131 178
2653 178 -46 -130 -58 299 -36 -160 141 -38 70 -169 161 -180 21 220 250 237 -98 17 -172 -49 -49 86
2675 86 -87 134 -113 -165 157 394 -143 -18 -69 -196 -148 -275 -119 275 -118 153 85 9 -66 -44 -68 -67 -209 -34
2699 -34 275 120 -204 53 -38 -209 -45 70 127 23 25 86 -47 -16 -84 115 -77 -142 -83 -173 -55 -231 31 97
$$ packed form
2541D15k61n12O76k48j68J34O1J54m81q2M54M4k33r9K22Jk01J3J14j78k14M78
2563H9Q1k91j22K33J96j19k79J11L24m74J21K22km64J32L14r2L1j44J54J07j6
2585A12m5K24j58l43J21K58k63J0L10K8j37j39oK38k30p2L3K83o61L44J84m5k51
2608b05K13K11r1l10K35p4J2j55j18P37j39n49K4M41q6l35J96J13j94K68k25r0
2630a21L12n37L23lj7j9q7K28L9o1j45L38m16j54L97rj37k26J13K14l93M92M7
2653A78k24q4P2L57l35j24L01j79J08k39L30l41K01J99L0j3l35J15j89J23%J35
2675H6j73K21k47n2L22K37n37J25n1j27M8j27J56L94l93K71o8p6p5K2k4Jj42J75
2699c4L09j55l24K57r1j71J64J15N7j04KO1j33L1o8J99j92o5N9r0J18j76K62O6
$$ plain form
2723 97 164 46 -343 -22 97 90 84 -77 49 152 -115 -120 173 -256 -53 63 180 -114 -170 37 -107 -236 103
2746 103 -26 -5 74 41 -162 -120 136 120 18 93 45 172 6 -163 74 -91 -24 59 292 54 27 11 -21 62
2770 62 153 19 -186 -15 -54 -65 -40 196 -140 -104 28 -292 107 -110 -33 -41 -310 -65 -36 -40 172 -11 -115 71
2794 71 36 88 43 -31 23 62 -123 -9 329 170 45 -51 184 62 -140 49 112 59 -78 -67 105 89 62 -261
2818 -261 -1 -37 -153 -5 -44 176 276 -21 -147 241 72 86 -451 -198 27 -147 153 -154 114 -13 -104
2839 -104 122 -187 -25 -246 -68 58 -89 -221 -183 268 -36 47 236 -262 34 -2 -64 -123 120 39 46 -67 402
2862 402 -9 -48 -13 50 7 -34 196 -163 43 -127 -68 90 -173 -112 -133 -50 38 -288 44 244 -9 -247 238
2885 238 216 -19 -1 57 -120 -84 -100 -198 -91 -84 -188 254 -177 8 153 -37 -126 -45 -98 -184 234 -123 140 62
$$ packed form
2723I7O7j18l89L21J19poj61J26J03k67nK93m29K03J16J17k94n6K07j44j29L39
2746A03j29K1P9l3k03M2K56j6j02P5m8J27j66j69K37j65O7Q3K33k38k7j6l2Q3
2770F2R1j34k05J71l9j1K5K36l36L6J32l20L99k17P7qk69K45K9mK12j83j04J86
2794G1l5N2m5p4N4L9j85J14L38j59j25r6K35j22k02J89O3n3j37J1J72j6k7l23
2818b61K60l6j16J48l9K20J00k97j26L88j69J4n37K53K25j74L00l07K68j27r1
2839a04K26l09J62k21J78J26j47j32L8M51l04Q3J89m98K96l6o2n9K43q1Pj13M69
2862D02m11l9L5O3m3m1K30l59K06j70N9J58k63O1k1Q3Q8l26L32K00k53k38M85
2885B38k2k35J8N8j77L6j6r8J07Pj04M42m31J85J45j90q9Q1n3q6M18l57K63p8
$$ plain form
2909 62 -40 -28 175 43 92 55 106 14 -79 -167 -7 -177 76 61 7 99 -91 -132 98 -156 64 177 85 -11 -141
2934 -141 -281 330 -85 -134 14 514 -211 -150 93 222 77 -138 -146 132 -54 -56 114 254 86 87 272 18 -74
2957 -74 221 238 257 -109 65 243 54 -231 131 154 129 -184 -3 370 -32 -369 145 169 -62 -329 118 290
2979 290 -263 -232 199 315 67 54 400 159 -356 -303 333 50 -467 -139 156 45 -95 -93 383 -123 -294 -238
3001 -238 340 60 -373 232 351 -74 -478 314 195 -167 -97 415 147 -203 -167 303 340 -313 -139 383 213
3022 213 -431 -90 302 53 -225 58 304 57 -243 58 282 -253 -461 41 414 -269 -188 230 382 4
3042 4 -329 273 187 -43 -268 389 -24 -552 -186 233 -45 -309 151 467 275 -519 -21 498 -79 -487 35
3063 35 185 -229 -424 95 619 -189 -193 351 502 -58 -149 144 119 -433 -171 565 207 -200 -227 284 183 -290
$$ packed form
2909F2j02J2K03j32M9l7N1r2r3q8J60j70K53j5n4R2j90m1K30k54K20J13r2r6j30
2934a41j40O11m15m9J48N00p25O1K43J29j45k15qK78j86kJ70J40j68JJ85k54r2
2957g4K95J7J9l66J74J78j89k85L62K3k5l13J81L73m02l37N14K4k31k67M47J72
2979B90n53L1M31J16k48j3L46k41n15N3O36k83n17L28K95j11j40KM76n06j71N6
3001b38N78k80m33O05J19m25m04P92j19l62P0N12k68l50L6M70L7o53J74N22j70
3022B13o44L41L92k49k78K83K46k47l00L01K24n35k08N02L73o83Q1M18J52l78
3042Dl33O02q6k30k25O57m13n28L66M19k78k64M60L16j92p94M98N19n77m08N22
3063C5J50m14j95N19N24q08mN44J51n60r1K93k5n52K62P36l58m07k7N11j01m73
$$ plain form
3085 -290 -114 471 95 -468 195 554 -144 -627 97 541 -116 -673 232 454 -150 -371 326 324 -250 -438 475
3106 475 455 -95 -481 285 112 -636 -140 467 95 -338 74 602 335 -666 205 402 -156 -579 -75 885
3126 885 -285 -634 345 421 -46 -431 305 553 -250 -556 404 334 -338 -373 741 480 -465 -389 584 90 -621
3147 -621 73 647 -49 -757 18 757 152 -749 -30 637 -229 -489 470 532 -34 -172 403 440 -437 -352 393
3168 393 476 -501 -356 710 536 -499 -162 623 53 -737 -121 913 -79 -850 -178 945 49 -773 284
3187 284 715 86 -746 246 804 -518 -861 388 538 -433 -545 698 250 -730 -182 622 478 -813 -316
3206 -316 528 326 -772 103 490 -268 -888 -171 889 -69 -745 407 848 -14 -398 205 661 -375 -816
3225 -816 523 649 -441 -605 476 495 -502 -434 997 314 -588 -238 843 16 -705 -19 931 140 -809
$$ packed form
3085b90J76N85l76n63O63L59o98m83P24M44o57n57R05K22o04k21O97kn74j88R13
3106D75k0n50l86P66j73p48M96O07l72m33M12N28k67j001Q71J97n58m23N04R60
3126H85j170l49R79P6m67l85P36K48q03l06R60p0o72l5J114k61r45P6R73m94p11
3147f21O94N74o96p08P75P39o05r01P19O67q66k60R59O2n66j38N75L7q77Q5P45
3168C93Q3r77J45J066j74j035L37P85n70p90O16J034r92p71O72J123q96q22J057
3187B84M31o29q32R92N58j322l43J249J50r71j12J243m48r80N48Q04j44j291M97
3206c16Q44k02j098Q75L87p58o20P17J060r58o76J152M41q62l84O03M56j036m41
3225h16J339J26j090j64J081J9r97O8J431o83r02L50J081q27p21O86R50p91r49
$$ plain form
3244 -809 35 708 -14 -828 208 744 -278 -769 321 632 -147 -577 378 718 -287 -233 696 369 -548
3263 -548 -468 583 332 -781 -285 586 62 -730 -109 812 33 -548 65 852 44 -800 364 609 -96
3282 -96 -1091 431 709 -334 -786 462 652 -606 -560 549 447 -805 -305 694 566 -559 -353 511
3300 511 322 -747 -189 620 5 -1003 130 835 -373 -1142 192 728 -186 -674 479 535 -582 -703
3318 -703 329 542 -386 -442 424 475 -855 -511 638 192 -769 -92 992 131 -756 -59 823 -5 -706
3337 -706 167 748 -175 -921 166 960 -264 -794 451 402 -525 -749 755 700 -461 -382 649 355 -637
3356 -637 -520 806 332 -528 -383 837 230 -975 -45 806 -30 -598 226 672 -93 -906 465 890 -269
3375 -269 -702 186 773 -234 -750 523 462 -528 -577 424 280 -614 -207 634 235 -557 -292 820 148
$$ packed form
3244h09Q44O73p22q14J036N36j022m91J090L11p79m30R55L40j005N4R29l27r17
3263e48Q0J051k51j113M96Q71n24p92O21R21p79n81O13P87q08q44J164K45p05
3282i6r95J522K78j043m52J248J90j258M6J109j02j252N00R99j28j125K06Q64
3300E11j89j069N58Q09o15j008J133P05j208p69J334N36r14m88J153N6j117j21
3318g03J032K13r28n6Q66N1j330L44J149m46r61O77J084q61q87O97Q82q28p01
3337g06Q73N81r23p46J087P94j224n30J245m9r27k24J504n5j161P9J031k94r92
3356f37J17J326m74q60J45J220o07j205R30Q51q36n68Q24M46p65q13J371M25j159
3375b69m33Q88N87j007n16J273o1r90m9J001j44q94M07Q41l99p92K65J112o72
$$ plain form
3394 148 -565 -266 757 106 -659 95 701 8 -606 200 814 -366 -550 423 588 -179 -364 408 552
3413 552 -597 -237 620 450 -733 -374 703 288 -370 -288 432 132 -609 3 683 -80 -949 64 766
3432 766 -167 -794 33 809 -210 -512 110 831 -219 -533 465 500 -383 -491 556 378 -614 -400 795
3451 795 76 -663 -269 504 81 -448 -171 613 151 -632 79 662 32 -656 75 442 -108 -410 186 473
3471 473 -669 -542 517 845 -391 -447 242 676 -497 -286 347 219 -783 -318 317 -42 -428 -186 488
3490 488 225 -396 -40 635 -298 -390 83 517 -8 -642 250 426 -50 -332 237 197 -552 -319 439 77 -208
3511 -208 -117 554 249 -647 -351 543 123 -491 -160 497 -153 -381 -43 471 -187 -370 141 217 66 -341 227
3532 227 391 -159 -252 290 168 -209 -365 366 59 -295 -171 767 185 -511 -321 556 102 -542 -2 576
$$ packed form
3394A48p13K99J023o51p65P54O06o93o14Q06O14j180j84R73J65p67j85P72J44
3413E52j149L60Q57j70j183L59J077m15o58Q2P20l00p41O12O80p63q69J013P02
3432G66r33o27Q27P76j019l02O22P21j050l14R98L5q83j08J047j78r92K14J195
3451G95p19p39L94P73m23n29K77P84m62p83P11N83o30o88P31L67n50l02N96K87
3471D73j142J27J059L28j236n6O89M34j173K11O33j28j002M65O35l59l86K42O74
3490D88k63o21L56O75r33r2M73M34n25o34Q92J76m76k82N69m0p49K33P58l62k85
3511b08R1O71l05q96K96Q94m20o14L31O57o50k28L38N14o58j83N11P6j51m07N68
3532B27J64n50r3N42j22l77j56P31l07l54J24R38n82o96J90Q77m54o44N40N78
$$ plain form
3552 576 103 -664 -118 242 47 -327 70 416 -274 -386 247 195 -396 -255 77 156 -167 -266 290 247 -275
3573 -275 -97 389 117 -440 -106 495 4 -354 -37 309 179 -431 -78 162 10 -473 84 25 -101 -296
3593 -296 -120 192 -268 -337 150 103 -52 -188 77 151 -211 -81 -2 136 -268 -314 332 212 -301 221 195 -135
3615 -135 -322 7 279 -151 -140 57 328 32 -380 128 389 -195 -380 94 -6 -171 -233 376 96 -159 -180
3636 -180 180 130 -302 -167 121 -67 -290 -54 112 108 -349 71 76 -89 -204 87 207 34 -417 87 444 -145
3658 -145 -92 53 -141 -197 146 -4 40 -149 -159 123 186 -96 95 187 25 -106 21 127 -170 -128 -40 173 156
3681 156 -153 -87 224 -150 -323 48 48 -345 -41 -91 -74 -13 -86 89 70 -65 -155 72 74 43 -68 -71 7 -290 147
3706 147 23 4 -155 108 -90 32 24 40 180 -99 46 -32 78 -34 -189 98 -13 18 -303 -11 -60 5 -62
$$ packed form
3552E76m73p67N46L60j95l74L97L46o90j12O33n2n91J41L32P9l23r9N56m3n22
3573b75J78M86k72n57L34O01m91l58L17L46j30o10L53K40j52m83N57n9j26j95
3593b96J76L12m60o9M87m7j55j36K65P4l62J30P9J38m04m6O46j20n13N22k6l30
3615a35j87L29K72m30J1J97K71k96m12N08K61n84j85M74j00j65o2O09k80k55k1
3636a80L60n0m32J35K88j88k23K36J66mm57M20Nj65j15K91J20j73m51N04L57n89
3658a45N3J45j94n6L43j50M4j89j0K82O3k82J91R2j62j31J27J06k97M2Q8K13j7
3681A56l09O6L11l74j73L71%l93L04n0J7O1p3J75j9j35r0K27Kl1j11lP8k97M37
3706A47j24j9j59K63j98J22qJ6J40k79J45p8J10j12j55K87j11L1l21K92m9O5o7
$$ plain form
3729 -62 187 -149 172 -73 120 18 9 54 90 -73 -129 185 1 -29 -243 -78 100 -328 -81 167 208 14 129
3752 129 -184 51 57 -200 -123 -27 133 -229 44 -245 -48 -140 122 -246 -155 -307 -44 -330 0 -200 -166 7
3774 7 17 213 -160 40 -256 3 -148 -85 81 251 -96 89 -20 -132 89 -123 -268 -4 -21 -236 -154 -56
3796 -56 -160 188 10 -19 136 -58 -88 -62 -62 -1 8 -250 -260 269 -110 55 -6 -151 -112 -93 21 -104 -183 17 92
3821 92 194 -131 40 -101 -98 43 -90 414 -249 -175 -24 149 -161 28 86 -155 -19 -34 -217 -81 10 -29 145
3844 145 274 -54 36 -10 236 8 -268 247 -169 -144 108 294 29 -53 -66 189 22 52 42 112 -39 19 102
3867 102 -18 133 -35 115 9 -83 -14 34 -42 -52 -280 7 -65 -34 -63 9 144 122 141 -43 169 -137 125 110
3891 110 -291 121 200 109 36 32 -135 130 -147 -102 -114 -59 114 19 145 -23 -16 132 -169 -145 -183 214 81 162 31
$$ packed form
3729f2K49l36L21k45J93j02rM5L6j63n6L14j84l0k14J65J78m28K47K48M1j94J15
3752A29l13K35Ok57P7R6J60l62K73k89J97r2K62l68R1j52K63k86L30k00L4J73
3774GJ0J96l73K00k96K59j51O3J66J70l47J85j09j12K21k12j45K64j7k15Q2R8
3796e6j04L48j78k9J55j94l0K6%O1Rk58j0N29l79J65o1j45L9J9J14j25p9K00P5
3821I2J02l25J71j41LJ41j33N04o63P4J51J73l10J89N8k41J36j5j83J36R1l9J74
3844A45J29l28R0m6K46k28k76N15m16K5K52J86k65q2j3K55j67L0j0P0j51N8Q3
3867A02j20J51j68J50j06r2O9M8p6j0k28K87p2L1k9P2J35k2J9j84K12l06K62j5
3891A10m01M12P9r1p3mj67K65k77M5j2N5J73r5J26j68PJ48l01K4l8L97j33Q1j31
$$ plain form
3916 31 51 277 -103 155 -185 -83 -114 -4 -110 104 -5 59 -114 -142 146 -109 87 -10 11 247 -296 203
3938 203 -35 5 177 48 200 -175 6 31 -215 152 -51 53 -147 -12 168 78 166 142 55 -15 210 -2
3960 -2 197 -64 -39 13 74 -116 -97 150 73 25 -261 -238 -205 -32 -119 -96 154 165 96 216 -219 15 15 69 50 268
3986 268 -81 -49 80 129 114 -190 -114 100 151 -18 -30 1 185 -54 47 28 -98 26 -12 5 -47 7 71 -78
4010 -78 -142 -90 119 -166 8 87 -106 92 222 281 -128 -21 18 -107 -77 65 285 -170 -180 209 66 65 188
4033 188 13 53 -9 -61 -13 -175 74 107 8 203 -91 99 11 -128 -52 -44 -207 -60 -52 50 -12 -73 82 356 67
4058 67 -39 -2 24 -1 -66 109 -168 166 103 -78 -259 76 148 -41 24 -7 64 -29 -373 220 237 -7 11 -43 56
4083 56 -97 88 96 200 -169 160 -2 -147 -7 -42 208 239 -36 120 -132 -97 -94 -86 177 -214 -191 2 -201 -82
$$ packed form
3916C1K0K26l80K58l40J02l1J10j06K14j09O4j73k8K88k55J96r7K1K36n43M99
3938B03k38M0J72j29J52l75J81K5k46L67k03J04k00J35J80r0Q8k4q7p0K25k12
3960bJ99k61K5N2O1j90J9K47p7m8k86K3L3J73q7K3K50J1o9J20m35K34%N4j9K18
3986B68l49L2J29M9j5l04P6K14N1j69j2L1J84k39J01j9j26J24l8J7n2N4O4j49
4010g8o4N2K09k85J74P9j93J98J30N9m09J07L9j25L0J42K20m55j0L89j43jJ23
4033A88j75M0o2n2M8j62K49L3r9J95k94J90q8j39P6Qj63J47QJ02o2o1J55K74k89
4058F7j06L7K6k5o5J75k77L34o3j81j81L35P2j89O5l1P1r3l44N93J7k44J8n4R9
4083E6j53J85QJ04l69L29j62j45J40l5K50L1k75J56k52L5LQK63l91K3J93k03J19
$$ plain form
4107 -82 -278 182 -202 60 -77 -104 -114 191 -73 -101 132 77 87 51 110 -98 -115 52 49 147 -184 56 -76 -264
4131 -264 109 -99 140 -61 68 39 -15 21 -44 178 82 -16 154 -122 -45 -139 2 -80 -41 -64 21 421 -46 -58
4155 -58 96 -30 -36 80 178 -263 -223 -183 90 -77 -273 56 -160 84 6 262 221 -1 -188 -166 121 24 27 123
4179 123 -62 -166 -35 -54 -98 127 9 -47 110 -127 249 -22 -22 159 -87 -51 -91 246 -53 -17 81 -114 -223
4202 -223 0 69 -37 21 91 163 21 7 -42 -74 -184 30 -81 -8 87 208 -246 -266 -237 -111 -23 -15 -6 -20 27 30 41
4229 41 139 89 -32 178 -232 -92 -325 -5 -82 0 54 326 -28 107 126 -142 0 -207 22 18 85 -70 44
4252 44 11 -47 124 -11 -44 21 162 -108 -66 146 -153 133 -146 -39 93 133 26 -41 -50 63 10 -2 32 107 -273
4277 -273 -15 169 -61 155 128 82 102 41 41 -39 100 138 -44 -69 -33 -140 92 51 -139 132 318 -184 100 -21
$$ packed form
4107h2j96M60l84K62j37k7j0L05k64k8K33n5J0l6N9k08j7J67lR8l31K40j32j88
4131b64L73k08K39k01J29k9n4L6o5K22r6r8J70k76P7r4J41q2L9k3Q5M00m67j2
4155e8J54j26oJ16R8m41M0M0K73j67j96L29k16K44p8K56m1k22j87K2K87r7LR6
4179A23j85j04J31j9m4K25j18n6J57k37L76k71%J81k46L6m0L37k99L6R8j95j09
4202b23K23O9j06N8P0P2j42j4m9l2j10K14j11P3R5J21m54k0K9J26Q8QRj4M7LJ1
4229D1R8n0j21K10m10J40k33L20p7Q2N4K72l54J35J9k68J42k07K29mO7j55J14
4252D4l3n8J71j35l3O5J41k70M2K12k99K86k79J07J32M0j07o7rJ13n3j2L4P5l80
4277b73K58J84k30K16k7m6K0o1%q0J39L8j82k5L6j07K32m1j90K71J86n02K84j21
$$ plain form
4301 -21 -30 80 88 -73 79 -254 -41 -180 17 184 -21 -67 -90 -134 156 -42 121 -2 -47 -84 -114 48 46 -20 180
4326 180 45 -77 69 38 -71 90 102 -178 -132 -122 -14 87 6 86 -95 -47 52 77 -7 -91 188 -142 -61 5
4350 5 157 30 9 -126 69 -199 249 138 115 -385 -80 -3 -57 -284 -21 67 164 -141 -64 -205 130 -141 15
4373 15 339 114 -190 -224 -192 -92 -13 -109 50 -26 86 -186 -3 -89 226 28 -281 30 15 -106 16 337 -2
4396 -2 101 -163 112 62 253 -84 -96 151 62 -318 96 154 7 65 210 328 161 0 -101 134 -221 50
4418 50 -144 9 -152 -21 -247 105 112 -4 -105 -101 40 -233 -134 -82 5 -79 -192 169 -104 -123 55 -69 -143 0
4442 0 -101 -184 -19 76 -138 69 -43 -211 -263 -136 144 130 -64 -55 -35 24 75 18 -109 -58 -118 -199 -24 -79 26
4467 26 -102 7 -60 -192 87 -136 -29 -189 136 -33 94 -206 -121 15 85 -17 -246 52 -128 84 -47
$$ packed form
4301b1rJ10Qj61J52l33K13j39J97J67k05m6k3m4K90j98J63j23m5l7l0J62ko6K00
4326A80j35j22J46l1j09J61J2k80M6J0J08J01q1Q0j81M8R9K5q4q4K79l30Q1O6
4350EJ52j27k1j35J95k68M48j11k3n00L05P7n4k27K63Q8R7l05P7j41L35k71J56
4373A5L24k25l04l4L2J00P9r6J59p6J12k72J83q6L15j98l09L11j5j21J22L21l39
4396bJ03k64K75n0J91l37j2K47q9l80M14N8j47N8J45J18j67j61j01K35l55K71
4418E0j94J53j61J31k26L52Pj16j01MJ41k73R9N2Q7q4j13L61k73j9J78j24p4J43
4442@j01q3J65R5k14K07j12j68n2J27K80j4j94RK0N9N1n7j27N1o0q1J75n5J05
4467B6j28J09o7j32K79k23J07j60L25j69J27l00Q5J36P0j02k29K98j80K12j31
$$ plain form
4488 -47 152 91 41 267 224 47 86 202 -35 -2 -107 -207 -192 2 201 163 14 -178 213 -40 -109 218 21
4511 21 5 -295 -96 78 96 -114 144 7 2 -12 72 32 -161 117 156 -119 54 76 180 -78 158 -52 193
4534 193 6 -60 -267 6 2 -147 93 79 -42 -81 -152 -72 -111 -53 6 -43 -174 -13 91 -110 9 12 13 56 -166
4559 -166 48 -47 105 -88 -52 11 -91 -103 283 44 130 194 -137 138 -87 214 -16 90 -39 156 -167 -126
4581 -126 -151 -4 55 51 -48 45 -58 -100 -160 32 18 41 -119 168 -15 -153 -64 102 -178 -3 51 13 -29 30 45
4606 45 -216 32 38 -14 89 -88 -113 -99 -146 5 -56 -158 24 -120 -110 230 -338 125 167 -56 -19 169 -199 -106
4630 -106 -19 -79 330 -143 -121 -113 22 169 79 -45 -58 -40 -42 84 142 140 93 -62 -48 -81 42 4 -47 -227 -53 252
4656 252 -147 -74 162 -8 -41 -327 -22 178 116 -121 -18 -220 -42 -35 -216 103 -28 50 -243 -11 -51 -86 15
$$ packed form
4488d7J99o1n0K26m3j77L9J16k37L3j05j00J5J94J99l8j49j92L91k53o9L27j97
4511B1j6l00J99J74J8k10K58j37nj4Q4m0j93K78L9k75J73K2J04k58K36k10K45
4534A93j87o6k07K73mj49K40j4j21l9p1Q0l9N8N9m9j31J61J04k01J19LJM3k22
4559a66K14r5J52j93L6O3j02j2L86k39Q6O4l31K75k25L01k30J06j29J95l23M1
4581a26k5J47N9mr9R3j03m2o0J92j4K3j60K87j83j38Q9J66k80J75N4l8m2N9J5
4606D5k61K48On2J03j77k5J4m7J51o1j02J82j44J0L40n68M63M2k23L7J88l68R3
4630a06Q7o0M09m73K2QJ35J47r0j24j3J8kJ26N8km7j55J4l3J23l8n1j80J74L05
4656B52l99P3K36j70l3k86L05K00o2k37J03k02J78Pj81L19j31P8k93K32m0l5J01
$$ plain form
4679 15 -76 19 48 92 156 -102 33 118 -17 -218 -354 233 185 21 -113 221 13 -278 218 54 -42 -128 113
4702 113 -49 274 -252 -70 -90 -255 -268 -181 98 -126 86 -29 212 -72 19 192 80 74 -72 -28 64 -135 -76
4725 -76 -33 -36 -39 171 218 -168 66 124 326 -48 -8 -20 -64 91 -114 -74 78 -246 -412 150 182 -161 -20 -158
4749 -158 -80 -214 -49 202 -222 32 97 -43 82 106 -192 163 -221 40 211 68 174 -79 -51 144 -74
4770 -74 -308 304 250 88 -56 312 135 206 155 304 211 -130 194 43 -314 -155 -73 -13 116 -49 -37 138 -220
4793 -220 -153 -44 29 -122 -171 -11 89 -260 54 56 241 -63 -166 100 168 -168 21 351 305 13 -63 40 160
4816 160 -197 -86 238 305 -121 200 168 319 28 325 208 234 -203 -43 7 -264 -132 -236 84 11 40 410
4838 410 150 -182 20 226 177 -15 273 91 -144 -95 -34 246 9 -216 97 118 -13 -333 27 299 189
$$ packed form
4679A5r1R5K9M4O4k58J35Q5j35k01j36N87m8j64j34L34k08k91M96j64r6q6K41
4702A13j62L23n26J82k0j65j3Q7K79k24K12j15K41k84R1J73j12oj46M4R2j99N9
4725g6M3llK10M7l86K34N8K02l74M0j2m4J55k05M0J52l24j66N62L2l43J41j38
4749a58P8j34J65K51m24K54O5j40J25K4k98L55l84K61J71j43J06k53K8J95k18
4770g4k34O12n4j62j44L68j77P1n1J49r3l41L24j51l57J59Q2O0J29j65J2J75l58
4793b20O7J09P3j51m9J60J00l49L14KJ85l04j03K66O8l36J89L30m6k92p6J03J20
4816A60l57J11L24O7m26L21l2J51k91K97j17K6m37J60N0k71J32j04L20p3K9L70
4838D10k60l32K02K06m9j92K88j82k35M9O1K80k37k25L13K1j31l20L60K72j10
$$ plain form
4859 189 -137 177 285 -50 -169 119 -96 -130 -84 156 203 -348 -117 324 24 138 -122 130 9 -284 -146
4880 -146 194 -38 -92 25 -4 -106 -230 57 40 6 -112 68 -47 247 -95 -52 -19 -29 -174 103 81 -185 -112
4903 -112 98 194 -126 -18 158 190 -2 172 58 -134 -214 -138 217 157 -45 -146 169 -47 -220 408 242 6
4925 6 5 73 34 65 -15 467 -37 -238 -220 182 -9 -75 -114 131 44 -148 117 254 -2 -190 -155 30 93 -37 122
4950 122 -7 -255 10 -126 77 -111 -32 -19 276 26 -125 201 76 -44 -275 103 98 -81 1 213 32 53
4972 53 106 290 46 -224 -149 87 -145 -144 -112 263 80 -90 151 -49 69 -95 -201 230 48 -83 199 14
4994 14 -155 -279 34 -172 -186 130 301 53 -226 -164 262 -138 -25 18 119 205 131 -141 213 77 146 150 51
5017 51 100 -289 -118 -63 -170 -136 94 261 -47 -40 -48 126 -19 142 -66 183 10 -217 106 84 12 281 44
$$ packed form
4859A89l26L14J08l35j19K88k15l4M6K40M7n51K31M41l00J14k60K52j21k93J38
4880a46L40k32n4J17k9j02j24K87j7l4j18J80j15K94l42M3L3j0j45K77k2k66P3
4903a12K10R6l20J08J76L2j92J74j14j92q0P6L55o0k02j01L15k16j73O28j66k36
4925FjO8l9L1q0M82n04k01J8M02j91o6l9K45q7j92K65J37k56j88L5J85O3j30J59
4950A22j29k48K65j36K03j88P9J3K95k50j51L26j25j20k31L78nj79Q2K12j81K1
4972E3N3J84k44k70P5K36k32JL2L75j83j70K41k00J18j64j06M31j82j31K82j85
4994A4j69j24L13k06j4L16J71k48k79O2M26m00J13M3J01Q6p4k72L54j36O9Mr9
5017E1M9l89J71N5j07L4K30J67l08PqJ74j45J61k08K49j73k27L23k2p2K69k37
$$ plain form
5040 44 -26 -156 -104 -14 -303 -231 8 -86 -33 -216 -106 147 22 29 251 379 119 -240 127 31 -222 -153 114 232
5064 232 -168 15 63 53 191 -27 73 -188 -8 87 81 -126 -283 183 207 -106 10 380 117 -32 -78 121
5086 121 117 118 92 -58 2 138 115 48 70 14 -193 28 139 -52 -100 -39 83 -14 128 50 -79 -92 -78 137 -155
5111 -155 -206 -50 252 5 164 -2 -53 -153 66 8 63 -128 -146 118 49 -265 80 52 2 -68 -126 24 -174
5134 -174 -29 -11 360 -70 -106 80 94 54 -98 84 36 -75 -49 29 -182 -37 151 74 286 67 94 7 96 139
5158 139 -76 47 35 70 -107 -28 -191 71 153 -300 -126 33 -31 -73 21 58 -115 -16 -27 218 -24 289 -14
5181 -14 -135 27 151 108 -119 64 49 10 133 124 -95 -196 34 113 89 28 46 -141 104 -205 46 25 -55 -234
5205 -234 235 135 -156 -103 -28 122 81 6 120 108 -6 -44 54 232 -192 23 116 38 -197 197 -92 -53 -50 87
$$ packed form
5040D4p0j30N2R0k89P2K39r4N3j83J10K53j25PK22J28k60l59L67r6k53O9K67J18
5064B32m00J83M8j0J38k18J00k61J80R5ok07j57M66K4l13J16L70k63j49m6J99
5086A21mJk6j50O0J36k3o7K2n6k07K21J11j91m8O1J22r7J42p8j29j3J4K15k92
5111a55n1J56L02k47J59j66n1j00K19n8N5j91j8K64o9l14L45k8n0p0n8J50j98
5134a74J45J8L71m30l6J86J4m0j52J82m8j11K6P8k11J45J88p7K12k19K7q7Q9M3
5158A39k15J23j2L5j77P9j63K62Q2m53J74J59o4m2R4L7j73R9j1K45k42L13l03
5181a4j21J62J24m3k27J83j5l9J23rk19j01K30P9k4o1J8j87K45l09K51k1q0j79
5205b34M69j00k91N3P5J50m1p5J14j2j14l8R8J78m24K15R3p8k35L94k89L9LJ37
$$ plain form
5229 87 133 -79 -83 -20 9 -205 38 -16 88 99 -148 67 93 -162 55 9 142 -4 -231 189 -82 -234 186
5252 186 184 -187 -28 93 -45 68 -97 13 -367 -119 120 83 -72 51 -161 23 89 -44 55 138 53 -106
5274 -106 -22 34 -137 61 41 128 232 87 54 -96 -31 128 1 -114 29 22 203 -186 -19 -184 -13 191 -29
5297 -29 -115 -75 365 -152 -141 48 119 -264 64 58 70 -128 -126 164 -53 12 -16 107 128 20 240 37 75 78 -33
5322 -33 -16 -55 89 -11 27 -32 199 -210 114 69 28 -67 47 -26 -141 9 138 -182 -104 192 240 274 -12 -220
5346 -220 -156 82 52 -18 120 -33 138 291 10 -100 126 -151 -20 122 74 167 106 105 -134 -182 -148 69 155 156
5370 156 46 204 45 -95 -159 -40 73 -95 151 -247 22 247 101 -133 -179 207 63 -186 66 391 -167
5391 -167 93 -115 -27 123 105 290 -67 87 -24 72 154 2 51 57 -212 68 281 18 161 -39 205 -8
$$ packed form
5229H7M6k12mO3K9k14K43n4J04J1k47K15K6k55K17m6J33j46k27M20k71j52M20
5252A86kl71J59J21j38J13j65J10l80K48K39l7j55J23k12J84O6j33R9Q3q5j59
5274a06Q4N6j71J98k0Q7J04j45l3j50O5J59j27j15J43pJ81l89J67j65J71K04k20
5297b9q6M0M40n17J1J89P1l83L28oJ2j98KK90k17O5k8J23K1j08K20k03L8Lj11
5322c3J7l9J44j00L8n9K31m09L24m5m1r5J14p3j15J50J29l20P8K96M8L4k86k08
5346b20O4K38l0p0J38j53J71J53k81j10K26k77J31J42m8R3o1jk39m8L4K17Q6J
5370A56j10J58j59j40o4J19J13j68K46l98K69K25j46k34m6L86j44k49K52L25n58
5391a67K60k08Q8J50j8J85l57J54j11R6Q2j52M9Ok69K80K13k63J43k00K44k13
$$ plain form
5413 -8 -86 159 147 -5 -4 7 -184 -176 -67 -32 -28 182 112 -193 64 -85 165 5 -64 -162 39 116 -10 22 43 45 -67
5440 -67 78 48 173 9 92 8 -1 -94 -76 -155 153 -217 7 -4 -143 -137 212 -17 -3 -49 122 160 19 -92 -110
5465 -110 208 -52 -105 116 -194 -85 102 -113 -102 108 190 115 -58 -302 51 -247 -29 -175 37 118 66 26
5487 26 0 29 31 -64 -82 85 73 52 74 80 39 11 -157 -95 -245 -214 -6 -257 -73 241 19 4 -22 82 -64 132
5513 132 -82 -56 -336 -120 224 372 -12 -167 141 38 127 45 -230 -85 -196 -14 52 310 269 -22 116 11
5535 11 -2 92 132 -24 138 -128 -27 21 -149 122 31 -290 82 24 41 60 -93 208 -73 107 -58 39 236
5558 236 -169 -89 -22 -158 70 145 -41 95 48 -5 50 143 -61 256 -263 -8 -23 -215 -148 161 -128 40 -270
5581 -270 136 213 -36 -89 -186 81 -138 210 -21 1 -127 -78 -107 -21 81 50 -48 210 122 -296 64 -54 67
$$ packed form
5413hp8K45j2j52JJ1j91QJ09L5MK10p0l05K57j49K50j60o9r8K01P7j26L2K1Kj12
5440f7J45l0J25j64Q3q4rr3J8p9L08l70K24j1j39OL49k29J4m6J71L8j41j11j8
5465a10L18k60n3K21l10J09J87k15J1K10Q2p5j73k44L53k98K18j46K12Q1n2m0
5487B6k6K9Kr5j8J67j2k1K2Om1k8j68O2j50L1K08k51J84L14k22j5k6J04j46J96
5513A32k14K6k80K16L44J48l84j55L08j03Q9q2k75J45j11J82O6K58m1k91J38j05
5535A1j3R4M0j56J62k66J01M8j70K71r1l21L72n8J7J9j53L01k81J80j65R7J97
5558B36m05Q0O7j36K28P5j86J36m7n3N5R3k04L17n19K55j5j92O7L09k89J68l10
5581b70M06P7k49n3r7K67k19L48k31K2j28M9k9Q6J02l1r8K58q8m18L60j18J21
$$ plain form
5604 67 -28 -11 5 -97 -16 -181 -120 126 4 233 5 22 -69 -25 61 -59 -29 -13 77 22 -31 -181 -200 75 152 7
5630 7 -6 113 -3 -193 48 -158 -311 -109 80 79 78 97 -3 -57 290 -81 28 73 -98 115 133 75 -158 211
5654 211 38 -35 -203 -91 6 -140 -15 -169 67 -138 -16 153 98 174 76 -103 -272 -152 13 247 -116 -194
5676 -194 -190 1 -39 -42 -102 13 27 21 -246 -17 -37 2 10 37 166 -281 107 89 68 -310 142 -45 -68 14 23 135 19
5703 19 210 264 -106 65 27 -46 16 151 -2 -120 -110 112 -142 -126 -137 385 230 -221 30 -88 169 -133 94
5726 94 119 18 -150 26 56 36 166 -15 79 261 71 74 -114 -101 -19 -87 -206 27 384 90 -232 230 0
5749 0 -6 -4 -42 -99 1 53 188 207 -90 -59 -223 45 50 178 225 -113 32 -192 -29 -20 -218 173 -209 -29 -2 -122
5775 -122 -85 -88 -75 56 42 36 -100 -51 41 28 86 33 23 -87 6 -103 309 -12 68 -244 -180 -139 78 -107 -61 -1
$$ packed form
5604F7r5J7J6j02Q1j65O1K46j22K29k28J7r1M4Q6j20L0J6R0n5n3j50j9K75P7j45
5630Gj3J19j16j90K41k06j53K02J89jjJ9j00n4L47l71J09M5j71K13J8n8k33L69
5654B11j73p3j68J12R7j46J25j54K36k05J22J69n5P6r8j79j69J20J65K34l63p8
5676a94MJ91m0lo0J15J4ok67K29k0L9QK7J29m47L88j8k1l78M52j87k3Q2RJ12j16
5703A9J91N4l70J71l8p3O2J35j53j18J0K22k54J6j1N22j55m51K51j18K57l02K27
5726I4K5j01j68J76L0k0J30j81R4J82j90Lj88J3Q2o8j19K33L57k94l22M62k30
5749@oKl8n7J00N2J35J9k97L1j64K68NJ28M7l38J45k24J63Rj98L91l82J80K7j20
5775a22L7lJ3J31j4oj36M9R2j3N8n3j0j10R3j09M12l21Q0l12O4M1K17j85M6O0
$$ plain form
5801 -1 -73 -204 9 131 -136 69 -282 45 -35 16 247 -170 14 -146 51 75 63 -234 243 95 -33 28 30
5824 30 144 86 -63 -35 -157 177 -55 -119 -103 41 26 -106 256 -51 -13 -11 -248 -84 285 -80 -60 -117 355 95
5848 95 -250 -36 96 46 0 301 86 -96 -21 94 80 -40 -68 -101 -66 -36 -138 156 42 140 298 -156 1
5871 1 90 61 105 -245 -192 26 -91 140 -90 7 124 -62 125 -164 -166 -169 -101 110 123 110 -38 -65 -100 36 -114
5896 -114 267 389 32 227 -220 -209 35 -143 87 -86 -205 -50 53 -133 -2 106 175 -37 -211 -317 -168
5917 -168 6 -67 -21 80 196 7 -105 -76 67 -96 23 -71 39 66 -4 102 136 30 54 93 35 3 -10 141
5941 141 139 -21 -13 136 217 133 79 -107 -190 14 -28 -60 108 -48 17 -108 -167 -75 -183 68 30 129 -77 20 11 -76
5967 -76 157 -180 -55 118 -120 128 302 10 -106 135 -25 241 -97 214 -45 -203 44 101 57 -153 -76
$$ packed form
5801ap2j31K13J22k67K05l51L27q0N1K31m17J84j60J97K4j2k97M77j48j28O1K
5824C0J14n8j49K8j22L34k32o4J6J44j5j32L62l07L8Kk37J64L69l65K0n7M72k60
5848I5l45K14J32n0m6L01k15j82P5J15j4j20k8l3L5L0j02K94j14R8J58m54J57
5871AQ9k9M4l50N3K18j17K31k30R7J17j86J87k89klO8K11J3j3j48k7l5J36j50
5896a14L81J22l57J95m47J1K44j78K30j73j19J55J03j86J31J08O9k12j74j06J49
5917a68J74p3M6J01J16j89j12K9J43j63J19r4J10K7p0J06L4j06K4L9n8l2j3J51
5941A41kj60QJ49Q1q4n4j86q3K04m2l2J68j56O5j25n9R2j08K51l8R9k06R7rq7
5967g6K33l37J25J73k38K48J74k92j16K41j60K66l38L11k59j58K47N7m4k10P7
$$ plain form
5988 -76 -288 3 109 34 36 9 -115 -56 -83 113 71 72 -257 -229 16 -82 -65 63 -143 40 -201 15 71 -95 99
6013 99 4 132 125 -36 37 -63 -98 47 63 36 62 55 -21 -130 127 -2 12 -21 -165 -122 -94 38 102 -358 -143 195
6039 195 67 -17 48 -46 -127 115 236 -54 -35 144 -297 -119 120 167 125 -2 -20 154 -56 -13 -127 157 -78
6062 -78 -172 23 -130 -85 90 -189 -128 -62 9 -49 10 -83 -116 -199 24 74 -54 -103 -211 -43 -24 86 167 -50 -67
6087 -67 -132 114 -116 -108 222 21 203 -172 -21 -16 126 118 -14 82 -281 -175 -65 143 188 233 232 -207 -71 58
6111 58 -41 -61 0 -95 -10 -17 165 -1 -105 -76 6 -110 -102 -79 229 -94 -76 -215 6 -88 -118 -49 13 -60 -18 92 -181
6138 -181 108 -38 -176 245 18 168 38 -1 -218 47 94 -18 180 167 13 -92 39 -135 -73 -147 -8 -26
6160 -26 51 -73 -49 -52 -72 114 102 75 -63 141 192 18 42 47 1 61 -99 120 157 202 -141 -219 -172 -182 26 -34 52
$$ packed form
5988g6k12K91J06p5Kk7j24N9k7J96m2Jl29K8K45r8J7J28k06J83k41K16N6j66J94
6013I9r5J28pj61P3j00l5J45J6k7K6pp6j09K57j29J4l3j44M3K8J32O4m60K15L38
6039A95j28q4O5r4q1K42J21k90J9J79m41J78K39M7m2j27j8J74k10M3j14K84k35
6062g8r4J95j53M5J75k79O1O6P1n8N9r3l3q3K23N0j28m9j08J68J9J10Q1k17j7
6087f7o5K46k30QL30k01J82l75J51NJ42qj32R6l63J06J10K08M5M5jm39J36J29
6111E8r9k0O1r5Q5pJ82j66j04K9Q2j16QK3L08l23J8j39K21r4l0O9O2p3M2J10k73
6138a81K89j46j38M21k27J50j30l9k17K65M7j12J98j3j54j05J31j74O2p4J39j8
6160b6P7j24K4lk0J86j2k7j38K04N1j74K4Nm6O0j60K19L7M5l43p8M7j0K08o0Q6
$$ plain form
6187 52 -19 -2 -22 33 12 -64 -27 -157 -125 131 94 -339 -272 187 -118 142 138 -54 81 -267 -12 106 115 -141 65
6212 65 20 27 -175 -30 51 -18 -84 -94 90 97 -209 -66 189 -80 -119 -175 72 -62 -174 59 -85 45 -54 64
6236 64 8 -43 217 -33 -399 -97 83 114 31 8 -110 39 177 -260 -148 60 -180 -54 184 -50 -82 91
6258 91 -26 216 -1 -215 78 77 159 110 294 -172 -104 95 -24 161 280 26 -106 67 24 1 -69 -76 100 -77
6282 -77 159 305 -210 -28 -42 30 -277 -238 -41 60 106 -34 -128 -119 -97 6 9 -45 -60 -179 -199 9 204 -65 174
6307 174 125 -106 -12 226 139 29 118 -28 41 178 -118 9 37 -122 -46 -49 31 88 -27 -57 111 -11 -42 -21 -327
6332 -327 246 88 -15 13 128 126 -77 93 185 253 -35 193 54 -59 195 -181 126 -5 172 124 158 47
6354 47 -18 -8 4 133 60 -47 -103 167 49 -24 97 -282 -46 274 -211 101 14 31 14 120 -158 20 9 69
$$ packed form
6187E2p1J7k0N5k1p6L7j30L2K56l7m33O7M59l05K60mj92J35l48K55J18Rk56K06
6212F5m5Pk02J45Q1o9o6j0J84Pl06J43K55k69l9n6K47j34j12K33j44J30r9J18
6236F4n6n1K60k50l66L02J80L1q3k3j18J49J38m37J12K08k40J26K38k34l2J73
6258I1j17K42k17k14K93jQ2m9J84m66O8J99j19J85J19k54j32J73m3k3p0pJ76j77
6282g7K36J46n15J82j4P2l07L9J97J01M6j40r4RK2J03Ln4j5j19k0K08J95k69K39
6307A74m9k31R4K38q7j10Q9j46O9J37k96J27K8j59P6lQ0N7j15l0J68j22l1K1l06
6332c27N73j58j03K8J15kk03J70R2O8k88K28j39j13K54l76L07j31J77m8L4j11
6354D7o5J0J2J29p3j07n6K70j18p3J21l79K36L20m85L12q7J7j7J06k78J78j1O0
$$ plain form
6378 69 228 -146 32 -9 175 128 -165 121 -71 8 309 57 -273 142 -190 -124 164 -73 -13 -61 -181 55
6400 55 -70 89 -104 -197 -11 -200 43 21 88 -214 -40 -56 35 51 -100 12 -6 47 150 -5 -188 -119 135
6423 135 107 -91 -32 -81 245 114 58 -37 -146 15 -57 -219 77 6 -116 32 50 -2 120 10 -6 -11 171 -75
6447 -75 23 -337 174 189 -11 -69 -133 42 -227 -140 105 -20 58 -73 -8 -161 -55 -93 116 61 129 61 -157 -1
6471 -1 166 145 -40 66 -84 -167 120 64 -100 -40 -158 100 111 247 -132 65 59 229 178 53 105 76 170 168 -94
6496 -94 -34 -41 90 61 -22 81 185 -54 -187 174 89 -114 91 -68 -97 63 -173 20 98 88 22 -7 11 -119
6520 -119 61 63 -82 -14 47 -160 303 107 -190 35 229 212 188 42 25 -49 -134 -100 -160 167 -112 79 160 -175
6544 -175 -5 68 25 183 -333 -191 227 70 -167 143 430 230 57 -173 -122 -176 82 165 -336 19 -85 96
$$ packed form
6378F9J59l74J78m1J84m7k93K86j92P9L01k52l30M15l32O6K88k37O0m8j20K36
6400E5j25J59j93r3J86j89K43k2O7l02J74j6R1J6j51J12j8N3J03j55j83O9K54
6423A35k8j98N9m9L26j31n6r5j09J61p2j62K96p1j22J48J8n2J22j10j6nJ82k46
6447g5R8l60N11J5k00n8o4J75k69Q7K45j25P8j31O5j53J06l8K09n5O8o8k18J56
6471aJ67k1j85J06j50q3K87n6j64O0j18K58J1J36l79J97oJ70n1j25N2k9R4kk62
6496i4O0pJ31k9q3J03J04k39j33L61q5k03K05j59k9J60k36J93P8j0o6k9J8j30
6520a19J80Kj45O8O1k07M63j96k97K25J94j7k4j46j7p4q5L4o0L27k79J91Q1l35
6544a75J70P3m3J58n16J42M18j57k37L10K87k00j73k30N1n4K58Q3n01L55j04J81
$$ plain form
6566 96 -108 -29 16 123 44 47 74 5 138 -356 -26 20 15 113 101 -7 -98 -22 11 -99 32 246 -27 57 -141 -123
6592 -123 -41 -19 -68 -267 -152 86 -66 -63 77 -212 -1 -312 84 134 50 -56 144 148 1 -16 -67 115 -237 35
6616 35 77 69 160 202 -81 -10 -26 50 200 -106 -96 116 42 -219 77 13 -1 -212 -38 -18 -198 70 -4 -101 161
6641 161 -49 -14 -33 22 -114 169 92 -149 85 -60 30 -65 9 -27 13 244 -110 -72 -170 -136 -96 181 21 -250
6665 -250 -37 -38 0 -105 -129 175 -211 -30 -120 7 -8 -120 -158 12 17 0 -105 31 -40 99 -130 108 -37 315
6689 315 157 -18 -188 -21 94 -22 -325 -16 336 81 -121 86 -124 -85 -29 -91 14 -78 48 -137 233
6710 233 -20 -6 31 200 -147 -79 -5 -128 22 160 265 21 134 86 -138 296 24 -219 -99 -66 0 -205
6732 -205 -131 -91 290 334 101 -19 -10 214 352 105 41 -195 160 178 -42 193 118 -73 -298 112 133 228 47
$$ packed form
6566I6k04P9M5J07p9LK7o9J33m94L30M6nR8j2j08r1P6L3j10J31K14k73Q4j98J8
6592a23Q2K2m9j99J15K38j52LJ40k89K11l11L96N0q4j06K00Mj47j7n1J82l52K72
6616C5M2qR1M2k83P1j6P6J50l06J0K12p4k61K96o4j4k11J74K0j80K68p4r7K62
6641A61k10L5j9N5j36K83p7k41K34j45R0r5P4l6M0K31l54L8r8L4M0K77j60k71
6665b50K13jL8j05k4L04l86J81r0J27j5j12l8J70Nj7j05J36p1J39k29K38j45L52
6689C15j58j75j70J67J15j16l03L09L52k55k02K07k10L9N6o2J05r2J26j85L70
6710B33k53J4L7J69l47O8P4j23J50J38J05k44J13m8k24M34k72k43J20L3O6k05
6732b05P4M0L81M4k33j20RK24J38k47o4k36L55J8k20K35p5j91k25M10K1R5j81
$$ plain form
6755 47 -66 120 257 -141 -218 38 -51 1 134 30 -125 -134 -56 55 76 -36 62 45 152 114 231 -161 -176 -25
6779 -25 -72 41 -51 -56 26 -157 53 -53 66 60 -63 -1 -147 -367 187 189 112 -97 154 96 104 447 -36 -72 174
6804 174 -83 -194 -50 -42 -143 57 108 -219 -88 123 -190 -161 128 307 -99 -255 -75 -100 -157 0 64 112 255
6827 255 -15 234 111 91 65 65 273 -86 141 59 62 111 43 87 -189 -68 -72 7 -133 89 -28 32 -90 -86 -18 63
6853 63 5 -75 -1 11 75 29 -7 -132 37 56 86 -74 38 9 74 121 16 -129 -14 43 -326 -135 -164 -23 -80
6878 -80 -61 -154 -101 -113 -158 349 -131 5 164 122 -53 265 -13 -10 -39 -174 153 -39 168 -127 -81 286 -113 -23
6902 -23 -109 -37 -43 77 25 -172 84 -111 69 56 383 68 141 -104 22 -84 151 101 -143 -97 -188 -259 155 -128
6926 -128 -106 189 29 -293 -82 42 290 -95 -103 181 -22 69 25 -79 33 87 32 -113 -88 78 -43 -21 53
$$ packed form
6755D7j13J86J37l98p7K56q9N2J33j04j55rP8J11K1j12R8j7J07l8J17l92j5J51
6779b5m7J13r2nQ2j83K10j06J19oj23O2j46k20N54Kp7k09K51n8QL43m83l6K46
6804A74k57j11J44Qj01K00N1l27J31K11l13K9K89J79m06j56J80k5n7J57O4M8J43
6827B55k70K49j23k0k6%K08l59K27q2LM9o8M4k76J21mP9j40K22j17O0j22MO8Q1
6853F3n8q0P4J2O4m6l6j25J69J9L0j60J12k9O5M7j05j45J15N7l69J91k9J41n7
6878h0J9r3N3j2m5N07m80J36J59m2j75L18k78Lk9j35L27j92K07k95M6L67l99R0
6902b3q6P2oJ20n2j97K56j95J80j3L27l15P3k45J26j06K35n0k44M6r1p1M14k83
6926a28K2K95j60l22K11J24K48l85qK84k03R1m4j04J12N4n5j45K5J66j21K2P4
$$ plain form
6949 53 333 -163 177 -115 -71 -11 -130 221 -11 -112 36 133 152 -140 -180 -37 164 295 -9 32 -47 -147 26
6972 26 -32 142 -85 -148 -30 14 26 -122 86 151 -15 -126 62 63 -84 30 -95 -31 -274 -104 121 -155 56
6995 56 -156 -230 280 -101 -47 363 -50 -55 -156 42 311 44 172 91 2 -75 -19 84 -261 107 -138 132 62
7018 62 160 -66 21 -66 144 99 120 -108 13 47 15 -20 -12 60 131 -162 142 268 0 -95 -108 111 194 -77 193
7043 193 121 177 283 243 104 -75 -248 142 -85 -135 -56 -74 177 207 96 97 212 -75 -202 22 -47 -122 -170 -129
7067 -129 -6 105 -25 -155 92 -160 235 -41 -34 -367 -78 -69 -75 72 -173 -88 -189 192 -177 8 27 134 -129
7090 -129 -31 40 231 4 -227 -43 -48 -91 45 88 -49 -95 13 -88 54 21 -31 -19 -56 30 82 -28 -133 141
7114 141 83 142 -240 -124 -142 203 373 7 30 188 -123 -233 -92 174 273 40 65 150 139 126 103 62 -63 -264
$$ packed form
6949E3K80m96L40k92M4O0j19L51k32j01J48R7J9k92m0J43K01J31l04M1p9j00J73
6972B6n8J74k27o3J18M4J2j48K08O5j66j11J88Jj47J14j25O4k43J70K25k76K11
6995E6k12p4N10l81N4M10m13nj01J98K69k67J28q1q9p7N6J03l45L68k45K70p0
7018F2R8k26Q7q7K10m5K1k28J21L4l2l5QP2P1k93L04J26k68r5j3K19Q3k71K70
7043A93p2N6J06m0j39j79j73L90k27n0P9j8K51L0j11JJ15k87j27K24o9p5m8M1
7067a29J23J11j30j30K47k52L95k76Pl33K89RoJ47k45Q5j01L81l69J85J9J07k63
7090a29R8P1J91k27k31J84nm3J36M3j37m6J08j01J42l3n2J2l7Q6N2j10j05K74
7114A41n8N9l82J16j8L45J70l66K3J58l11j10J41K66R9k33K5Q5j1j3k3m1j25k01
$$ plain form
7138 -264 228 227 -94 360 -25 58 95 121 154 -33 58 109 37 -1 -81 -53 -93 235 -10 248 -265 -20 41 -237 -233
7163 -233 70 105 22 -125 39 31 145 80 1 -48 15 20 15 -150 -32 -92 103 -143 62 78 -70 207 2 150 -29
7188 -29 48 -67 163 147 41 -17 -47 -298 212 92 -213 -85 262 156 -189 -105 -122 -8 196 -13 83 79 48 34
7212 34 -49 -165 180 -196 135 118 101 156 -30 32 -14 -51 -102 -92 29 -22 -259 53 -103 -159 59 15 -194 44
7236 44 2 -20 -128 72 1 100 34 129 159 67 193 134 -160 21 228 262 -267 283 -69 -97 227 124 177 -42
7260 -42 15 56 -16 6 28 -165 -13 -9 -54 213 220 108 -122 -192 66 -54 -41 -322 13 28 4 -21 49 251 -189 -97
7286 -97 -336 74 62 -110 76 -45 -13 -145 195 134 -111 -39 55 -279 173 51 -70 -73 -58 93 142 192 -284 47
7310 47 52 -84 -17 -69 139 99 32 109 194 209 3 -198 252 114 -111 90 78 166 105 40 21 69 -38 -33 184 -7
$$ packed form
7138b64M92jl21M54l85Q3L7K6L3j87R1N1p2l8q0K8m0L28k45K58n13K45O1k78M
7163b33L03L5q3j47J64qJ14o5p9m9O3Nnj65J18o0J95k46K05J6j48K77k05J48j79
7188b9P7j15K30j6j06n8l0k51N10j20l05J28L47j06l45Q4j7J14K04k09R6ml1j4
7212C4q3j16L45l76L31j7j7N5j86O2m6l7n1J0J21n1k37L12j56n6K18m4k09K38
7236D4m2k2j08K00p1R9o6R5L0r2J26n9k94J81K07L4n29N50l52k8L24j03N3k19
7260d2N7M1p2K2K2j93J52Mm5K67Pj12k30p0K58j20J3k81L35J5k4k5P0K02m40R2
7286i7k39M10j2j72J86j21L2j32L40o1k45P2R4l34M52j22j21lJ5J51M9N0m76L31
7310D7Nj36O7n2K08m0o7P7Q5J5k06k01M50j38k25K01j2Q8o1o5j9M8j07NK17j91
$$ plain form
7336 -7 -29 -160 8 -2 205 58 263 80 63 -28 73 -198 48 -44 174 224 -6 -47 -227 -49 57 259 -262
7359 -262 -45 -26 -181 -104 120 83 84 -39 87 -19 56 91 11 113 -101 -163 37 94 259 16 -37 27 -99 -19
7383 -19 98 -56 -69 16 11 -67 -217 21 4 -73 1 277 77 -225 -71 35 -102 -59 208 -192 171 296 201 373
7407 373 107 79 -109 173 -60 182 270 -42 175 -207 52 85 14 -46 -35 -128 176 -166 -91 3 -92 -72 101 -214
7431 -214 90 271 -124 -224 -110 -299 26 -53 125 202 -29 73 -75 -99 -120 -266 191 25 -39 -214 -41 -2
7453 -2 14 125 -141 173 128 108 -77 -144 -67 -92 121 113 -47 162 231 15 34 200 -78 25 59 -58 -126 -158 -100
7478 -100 -121 183 -28 19 118 -167 -116 -173 39 -92 -154 -8 -143 -218 75 139 -57 53 0 148 129 -23 -96 38
7502 38 -275 65 -195 146 175 -48 -105 -110 -73 85 10 7 208 29 -43 -268 -112 -75 126 -294 -26 135 15 -257
$$ packed form
7336gk2j31J68j0K07j47K05j83j7r1J01k71K46r2K18N0k30m1j80J78J06K02n21
7359b62K17J9j55P7K24l7Jj23J26j06P5L5q0J02k14o2K00N7J65k43n3O4j26Q0
7383a9J17j54j3Q5np8j50K38j7p7P4K76k00l02J54J06j37M3K67m00L63J25r5J72
7407C73k66k8j88K82k33K42Q8l12K17l82K59L3p1o0J1r3L04l42P5R4r5K0J73l15
7431b14L04J81l95j00J14j89L25p9J78P7k31J02j48k4k1j46M57j66o4j75J73L9
7453bJ6J11k66L14m5k0j85o7P7k5K13qj60K09O9k16J9J66k78J03L4j17o8l2N8
7478a00k1L04k11M7R9k85N1n7K12j31o2J46j35p5K93O4j96J10n3J48j9j52p3J34
7502C8l13L40k60L41K9k23n7nL7J58p5lK01j79p2k25J56L7K01m20K68J61j20k72
$$ plain form
7526 -257 -3 69 222 224 187 -63 175 66 -156 208 115 -130 170 62 -28 202 -153 -59 189 41 1 -53 -216
7549 -216 -157 -98 78 -218 122 235 -22 182 329 -81 -94 -45 113 -62 -57 72 -202 -57 -13 55 -109 50 52
7572 52 54 -50 70 -255 94 75 91 -20 -237 150 43 287 -54 40 6 196 48 38 -91 -95 190 157 74 -204
7596 -204 26 133 33 79 -225 156 81 -175 133 43 67 -152 2 126 -221 114 -87 66 -48 -133 117 -164
7618 -164 -14 198 -147 107 119 31 -5 -30 9 -259 122 -9 11 -190 190 206 21 195 205 -141 18 -97 171
7641 171 93 -84 -92 30 138 82 129 -116 -310 -62 -28 -62 31 -63 -158 125 -11 -108 11 40 -182 -132 144 100 -65
7666 -65 -176 84 -12 -153 117 23 194 123 -113 -39 3 -30 152 125 81 94 105 -197 14 34 -157 -226 26 65 -47
7691 -47 -48 -125 70 18 -65 70 72 51 -98 -93 36 -67 -175 54 185 -60 -148 7 -83 -130 -138 -30 101 55 275 -27
$$ packed form
7526b57K54P2J53Kl7k50K38j09k22L64r3k45L00j08r0K30l55R4K48j48m0n4j63
7549b16N9N9J76k96L40J13k57K04J47m10j3M9J58j75NJ29k74J45M4O8j64J59K
7572E2Kj04J20l25L49j9J6j11k17L87j07K44l41R4l4J90j48j0j29mK85l3q3k78
7596b04K30J07j00M6l04L81p5k56L08r0K4k19J54J24l47L35k01J53j14q5K50k81
7618a64J50K12l45K54J2q8l6k5L9k68L81j31K0k01L80J6j85J74J0l46J59j15K68
7641A71p8j77qJ22J08n6M7k45j94K48L4l4R3r4r5K83j36r7J19K9k22N0K76m4j65
7666f5j11K60r6j41K70r4J71p1k36P4M2l3J82k7m4J3J1l02K11K0j91o9K52L9j12
7691d7jp7J95n2q3J35Kk1j49NJ29j03j08K29J31k45q8J55r0m7qJ08J31m6K20l02
$$ plain form
7717 -27 -195 19 179 -1 89 20 276 -97 -117 26 125 -32 -159 -52 79 70 -236 -93 36 42 45 -10 -26 366
7741 366 214 -105 -164 -36 -40 -43 77 -20 326 -40 104 -113 13 79 -152 68 10 166 -28 -30 34 -129 -165 133
7765 133 12 233 -110 -103 -302 276 -159 -186 35 -142 217 -38 142 -85 73 -64 53 69 165 100 -36 151
7787 151 -265 51 -7 176 -127 25 -88 -125 28 -133 209 -157 232 189 -228 28 -36 98 -163 12 206
7808 206 -6 -160 -143 96 -91 -57 -200 140 26 -18 -131 -9 97 103 -82 -69 -120 -32 81 -64 28 202 -148
7831 -148 -8 10 45 -33 -14 -74 103 328 79 -68 -55 -97 39 -90 -194 -379 58 104 29 -114 -96 68 33 250
7855 250 75 21 -133 49 52 155 239 106 225 203 24 -47 131 212 4 157 92 -55 -214 -78 -146 -213 -61
7878 -61 -59 166 245 -111 -237 -22 100 -142 -20 20 -43 -33 365 -76 -77 141 41 80 -28 14 117 57 114 -56
$$ packed form
7717b7j68K14J60j80R0o9K56l73k0J43R9j57j27J07J31rl06J43J29OLn5j6L92
7741C66j52l19n9J28mlJ20r7L46l66J44k17J26O6k31K20n8J56j94kO4j63l6K98
7765A33j21K21l43Pj99N78m35k7K21j77L59k55J80k27J58j37J17J6R6o5j36J87
7787A51m16L16n8J83l03J52j13l7J53j61L42l66L89m3m17K56o4J34k61J75J94
7808B06k12j54J7K39j87L4j43L40j14m4j13J22J06Oj85J3n1Q8J13j45R2J74l50
7831a48J40J8L5p8J9o0J77K25k49j47J3m2J36j29j04j85M37M6p5j43J8J64l5K17
7855B50j75n4j54J82LJ03Q4j33J19k2j79p1J78Q1k08J53o5j47j59J36o8o7J52
7878f1KK25P9l56j26K15J22k42J22M0o3J0L98m41jK18j00L9j08M2J03o0N7j70
$$ plain form
7902 -56 6 34 63 252 210 111 -286 105 132 93 -76 -245 -210 -85 -79 66 152 29 -15 27 49 -111 -21 -61 21 -122
7928 -122 256 -414 45 -254 -57 54 3 -10 109 -72 108 -337 -54 -91 -45 -14 -84 -265 -31 -79 -295 152
7950 152 114 39 -64 60 -180 -351 -65 -97 26 -26 202 282 -145 -72 68 -11 284 50 150 9 -20 -66 -120
7973 -120 -200 30 99 222 217 127 138 96 -65 68 204 -203 174 -222 -266 -147 296 239 -107 -161 -70 -101 -93 148 -85
7998 -85 76 -81 -199 -85 -25 -166 126 80 -167 -145 -67 62 141 -181 75 20 -118 293 53 -143 -92 -8 -250
8021 -250 -92 -33 -74 -14 -303 45 -113 -87 0 56 14 107 60 -44 -362 -191 208 205 -196 189 249 -188 155 96
8045 96 262 144 40 71 -256 -5 196 -99 -40 119 308 4 -96 72 -272 214 64 -47 -65 160 236 -26
8067 -26 -57 -32 109 65 -13 180 212 121 -154 30 16 -118 -60 -65 -43 -99 -243 -92 -89 38 -4 -64 15 -75 131 -83
$$ packed form
7902e6O2K8K9J89m2r9l97L91K7l9j69j69L5J25OJ45Q6j23m4M2K2j60R0m0Q2j43
7928a22L78o70M59k99J97J11n1j3J19j81J80m45K83l7M6L1p0j81K34m8k16M47
7950A52l8p5j03J24k40j71K86l2J23n2K28Q0m27P3J40p9K95k34J00j41k9m6n4
7973a20q0K30O9J23nr0J1m2j61J33J36m07L77l96m4J19M43n7l46n4R1l1QK41k33
7998h5J61j57j18J14O0j41K92m6k47K2P8J29P9l22K56n5j38M11k40j96N1Q4k42
8021b50J58N9m1O0k89L48j58K6Q7N6m2R3m7j04l18J71L99lm01L85O0m37L43n9
8045I6J66j18j04L1l27K51K01k95N9J59J89l04j00J68l44M86j50j11j8K25P6k62
8067b6l1K5J41m4p8J93L2r1k75J84j4j34N8nK2n6j44J51LJ27m2o0P9r0K06k14
$$ plain form
8093 -83 -91 -72 239 -71 12 -176 -6 -24 85 130 -47 13 -179 10 69 -7 -192 -316 165 123 -2 44 140 -32
8117 -32 -175 -27 -132 47 175 -13 -4 -100 287 25 -154 37 73 28 55 50 -148 151 -141 -95 -113 -53 -113 118
8141 118 161 77 -73 188 15 -100 -64 -185 98 -10 41 80 -88 139 178 9 -117 133 -33 -281 52 -31
8163 -31 17 9 150 112 -25 -125 112 41 -29 -151 41 112 -46 2 -59 60 66 117 -49 105 10 145 -90 -26 -66
8188 -66 -58 -83 53
$$ packed form
8093h3qJ9L11l10Q3j88J70j8J09M5j77O0j92J89N9p6j85j24M81m2j25M6R6j72
8117c2j43J48j05J79J28j88Rr6L87k62j79J91L6m5K7nj98K99k92M6j8O0o0K31
8141A18M3q4j50K61j73j15L6j21K83j08N1L9j68K27L9j69j26K50j66k48L33q3
8163c1M8qJ41l8j37j00K37p1p0j22J92P1j58M8o1J19ON1j66J54r5J35k35O4m0
8188f6Qk5J36
8191E3
$$ Imaginary data points
##PAGE= N=2
##DATA TABLE= (X++(I..I)), XYDATA
$$ plain form
0 0 0 0 0 0 0 0 0 0 0 0 8 -8 8 -8 16 -16 24 -24 32 -40 48 -56 65 -80 96 -112 128 -147 169 -194 224 -256
32 -256 289 -327 369 -417 468 -524 583 -652 726 -806 894 -990 1095 -1210 1335 -1472 1622
49 1622 -1787 1967 -2168 2389 -2637 2912 -3225 3579 -3988 4462 -5022 5692 -6515 7551 -8898
64 -8898 10733 -13388 17575 -25175 43262 -177172 -26041 248156 -240833 -63618 164643
75 164643 -105303 -46735 115841 -126027 19841 130232 -146740 6251 211836 -128228
85 -128228 -55096 223132 -33111 -89499 130401 -39181 -56920 78443 -97809 -29704 148858
96 148858 -129193 -111822 173989 -57162 -173523 103950 2896 -129186 56080 8793
106 8793 -61762 77693 -12385 -43042 141794 -7992 -126083 125935 71134 -124358 49348
$$ packed form
0@%%%%%%%%%%Qj6J6j6K4l2M0m8N6p2Q8j04J21j45J76k08K40k75L16l63M18m80
32b56N45o16O96p86Q85r92J107j235J378j532J700j884K085k305K545k807L094
49A622l409L754m135M557n026N549o137O804p567Q450r484J0714j2207J4066j6449
64h898J9631k4121L0963m2750O8437k20434J51131K74197m88989J77215K28261
75A64643k69946N8568J62576k41868J45868J10391k76972J52991K05585l40064
85a28228P3132K78228k56243n6388K19900j69582j7739J35363j76252O8105J78562
96A48858k78051J7371K85811k31151j16361K77473j01054j32082J85266m7287
106H793p0555J39455r0078l0657J84836j49786j18091K52018n4801j95492J73706
$$ plain form
117 49348 84953 -50412 36840 15617 -60208 68699 -3367 -123595 59622 37037 -145189
128 -145189 16102 86440 -94127 -26858 71250 -33130 -15451 13901 -43676 46713 48125
139 48125 -83224 37602 115434 -62660 -24004 102980 -12957 -36902 39901 -15943 -1071
150 -1071 26732 -54405 10014 64651 -75114 -42377 83080 -38607 -90850 41729 20075
161 20075 -41176 6885 -3084 8312 49667 -31518 -23755 80743 -7694 -62844 63820 37287
173 37287 -52515 21647 42602 -9464 5343 -11054 -12332 34482 -28936 -59634 47084 20121
185 20121 -76022 3873 50352 -30198 -22999 12930 -6640 9123 -3786 -25567 39593 25241
197 25241 -46035 28022 61440 -37663 -21659 47262 2515 -22709 1184 1070 17119 2413
$$ packed form
117D9348L5605j35365Q7252k1223p5825J28907p2066j20228J83217k2585j82226
128a45189J61291P0338j80567O7269R8108j04380J7679K9352n7577R0389J412
139D8125j31349J20826P7832j78094L8656J26984j15937k3945P6803n5844J4872
150a071K7803q1137O4419N4637j39765L2737J25457j21687n2243J32579k1654
161B0075o1251M8061r969J1396M1355q1185P763J04498q8437n5150J26664k6533
173C7287q9802P4162K0955n2066J4807j6397j278M6814o3418l0698J06718k6963
185B0121r6143P9895M6479q0550P199L5929j9570J5763j2909k1781O5160j4352
197B5241p1276P4057L3418r9103J6004O8921m4747k5224K3893j14J6049j4706
$$ plain form
209 2413 -37097 13434 35227 -46630 -32168 39818 -10807 -43008 13706 12839 -9057 3208 -3507
222 -3507 13407 20686 -30638 -6450 50660 -9869 -39917 33077 30660 -20655 -3299 15007 4773
235 4773 -2247 -19771 -5506 22592 -18883 -33807 27657 14617 -39149 -1119 25066 -13847
247 -13847 -15829 1787 5646 10774 -12241 -11241 36636 15357 -33273 9887 34735 -16030 -17968
260 -17968 17123 5781 -9421 -3636 3588 13560 -3697 -25777 8744 19798 -29920 -20789 23394
273 23394 73 -21252 3343 13283 5512 -5563 -9829 15278 15449 -22214 -6450 29313 -772
286 -772 -18982 16433 16913 -12246 -6941 6907 5068 -5039 -18089 -723 19168 -10883 -21595
299 -21595 16589 11051 -21813 -5489 12626 -2135 -10361 -3194 9560 12399 -7286 -6179 20980
$$ packed form
209B413l9510N0531K1793q1857J4462P1986n0625l2201N6714q67k1896J2265o715
222c507J6914P279n1324K4188N7110o0529l0048P2994k417n1315J7356J8306j0234
235D773p020j7524J4265K8098m1475j4924O1464j3040n3766L8030K6185l8913
247a3847j982J7616L859N128k3015J000M7877k1279m8630M3160K4848n0765j938
260a7968L5091j1342j5202N785P224R972j7257k2080L4521J1054m9718R131M4183
273B3394k3321k1325K4595R940p771j1075m266K5107J71l7663J5764L5763l0085
286g72j8210L5415M80k9159N305J3848j839j0107j3050J7366J9891l0051j0712
299b1595L8184n538l2864J6324J8115j4761q226P167J2754K839j9685J107K7159
$$ plain form
312 20980 8036 -19361 3039 18487 -9433 -13636 8506 9512 -2066 -8409 -1710 12288 -2306
325 -2306 -19934 2492 10575 -16012 -10849 14219 3682 -10358 -493 8864 5341 -5602 -7351
338 -7351 9090 9039 -11921 -2340 18922 1539 -12868 5796 10399 -4479 -8657 -2352 4945 92
352 92 -11396 -82 12161 -6779 -13227 8790 6600 -13422 -7591 6933 3401 -4006 -2379 6645
366 6645 9260 -3457 -4290 11029 3756 -12384 -102 10066 -1821 -6139 2295 5118 867 -5662
380 -5662 -2745 5934 -3518 -12918 1155 8207 -6885 -7906 6547 4831 -4249 -2259 2682 3001 -2731
395 -2731 -3565 7270 6613 -6172 -789 10972 1684 -6722 -151 3882 -1287 -4673 -1471 4278 955
410 955 -6536 -411 7192 -3050 -9614 1403 2959 -5442 -2580 3803 2647 -360 -1048 4898 6543
$$ packed form
312B0980j2944k7397K2400J5448k7920m203K2142J006j1578o343O699J3998j4594
325b306j7628K2426Q083k6587N163K5068j0537j4040R865R357l523j0943j749
338g351J6441n1k0960R581K1262j7383j4407J8664M603j4878m178O305P297m853
352I2j1488J1314J2243j8940o448K2017k190k0022N831J4524l532p407J627R024
366F645K615j2717q33J5319p273j6140J2282J0168j1887m318Q434K823m251o529
380e662K917Q679r452r400J4073P052j5092j021J4453j716r080J990M941L19n732
395b731q34J0835o57j2785N383J1761r288q406O571M033n169l386L202N749l323
410I55p491O125P603j0242o564J1017J556q401K862O383j156l007o88N946J645
$$ plain form
425 6543 -3653 -4275 5929 4114 -4485 -905 5250 1819 -1687 765 2771 -881 -4661 -2394 2806
440 2806 -848 -6511 699 4148 -3176 -2657 2643 811 -2289 -2208 819 3903 181 -2957 3651 5988
456 5988 -407 -1016 3417 794 -3899 455 3091 -1092 -2598 881 3360 720 -4091 -1216 1961
471 1961 -2575 -4370 226 81 -1732 -743 524 2811 1705 -1790 104 3159 -95 -1393 2625 2447
487 2447 -2094 1066 4965 407 -2954 -161 1447 139 -2500 -1882 1106 -85 -1677 442 -211 -2253
503 -2253 -1325 -1080 -538 221 -389 31 1977 1854 295 1987 2984 -1391 -1628 2916 1449 -2493 -753
520 -753 1870 1437 716 -321 -31 -1377 -1879 312 -1129 -3301 -954 303 -853 -195 577 -460 -65
537 -65 1091 -322 -887 1887 1314 -1462 2283 3520 -267 -666 1281 209 -367 -167 7 -1298 -1186
$$ packed form
425F543j0196o22J0204j815q599L580O155l431l506K452K006l652l780K267N200
440B806l654n663P210L449p324N19N300j832l100Q1L027L084l722l138O608K337
456E988o395o09M433k623m693M354K636m183j506L479K479k640m811K875L177
471A961m536j795M596j45j813R89J267K287j106l495J894L055l254j298M018j78
487B447m541L160L899m558l361K793J608j308k639O18K988j191j592K119o53k042
503b253R28K45N42P59o10M20J946j23j559J692R97m375k37M544j467l942J740
520g53K623m33p21j037K90j346n02K191j441k172K347J257j156O58P72j037L95
537f5J156j413n65K774n73k776L745J237l787l99J947j072n76K00J74j305J12
$$ plain form
554 -1186 1592 950 -2487 -1743 -198 -1351 -1645 -1197 -1519 -1043 1021 1134 -88 1173 2309 -728 -184
571 -184 2479 25 -818 1078 610 698 1102 1377 322 -1295 -430 569 -1394 -2155 -890 -970 -272 -27 -908
590 -908 -1648 -680 962 -688 -1396 884 525 15 1976 1829 613 1316 702 136 143 658 486 -445 -16
609 -16 1330 586 -497 -580 -1063 -991 -429 -1045 -2025 -1676 -63 783 -429 208 470 -87 1009 1091 -647 560
629 560 914 523 921 1014 1254 544 17 613 415 79 -308 -1278 -428 161 -218 -601 -1381 -1443 -248 -329 -783
650 -783 -1131 -717 839 1317 282 695 1242 901 1044 766 226 294 -21 493 530 499 495 89 -12 -105 -672 -308
672 -308 -872 -2186 -846 507 -389 -1009 -721 181 991 53 -251 46 232 709 916 733 514 87 627
691 627 1264 -5 -76 -22 -138 -166 -592 324 382 -1120 -725 -42 -451 -949 -1590 -767 366 -69 81 981 136
$$ packed form
554a186K778o42l437P44J545j153k94M48l22M76K064J13j222J261J136l037N44
571a84K663k454q43J896m68Q8M04K75j055j617Q65R99j963p61J265q0O98K45q81
590i08p40R68J642j650p08K280l59n10J961j47j216P03o14n66PN15j72r31M29
609a6J346p44j083q3m83P2N62o16r80L49J613Q46j212O37K62n57J096Q2j738J207
629E60L54l91L98R3K40p10n27N96j98l36l87r70Q50N89l79l83p80o2J195q1m54
650g83l48M14J556M78j035M13N47l41J43k78n40O8l15N14L7l1mm06j01r3n67L64
672c08n64j314J340J353q96o20K88R02Q10r38l04K97J86M77K07j83k19m27N40
691F27O37j269p1N4j16k8m26R16N8j502L95O83m09m98o41Q23J133m35J50R00q45
$$ plain form
712 136 290 1058 1118 300 -1028 7 1079 343 -87 295 541 427 -106 -130 770 -740 -1714 -259 362
731 362 -635 -1050 -47 489 -394 -272 746 -74 -992 495 1027 498 -252 150 1301 733 -386 -299 136
750 136 -258 -471 -216 1072 -473 -1304 368 911 -535 -1283 -168 58 -1410 -968 1101 641 -972 120
768 120 1607 1121 -592 -524 884 485 -645 -148 541 -153 -485 218 994 -109 -1512 -578 972 -625
786 -625 -1256 9 474 -672 -941 657 653 -913 -1101 900 1001 -462 -343 1589 1237 -334 -55 1214
804 1214 -356 -1387 -346 1064 -156 -1607 -297 1157 199 -1129 -148 328 -664 -1601 120 592 -877
821 -877 -996 957 1565 50 -643 1204 897 -511 -251 1316 412 -1330 -561 1579 398 -1409 -538
838 -538 860 -185 -1361 -503 822 -375 -1010 459 1140 -784 -1157 114 1084 -253 -940 941 1412
$$ packed form
712A36J54P68O0q18j328J035J072p36m30L82K46j14n33k4R00j510r74J455O21
731C62r97m15J003N36q83J22J018q20r18J487N32n29p50M02J151n68j119Q7M35
750A36l94k13K55J288j545q31J672N43j446p48J115K26j468M42K069m60j613J092
768A20J487m86j713O8J408l99j130M97O89o94l32P03P76j103j403R34J550j597
786f25o31J265M65j146k69J598mj566j88K001J01j463J19J932l52j571K79J269
804A214j570j031J041J410j220j451J310J454r58j328R81M76r92r37J721M72j469
821h77j19J953O08j515o93J847l07j408K60J567r04j742P69K140j181j807Q71
838e38J398j045j176Q58J325j197o35J469O81j924l73J271R70j337o87J881M71
$$ plain form
855 1412 -92 -11 1693 1049 -1058 -853 1306 222 -1478 -989 744 143 -1056 -121 1001 -371 -1752
872 -1752 -43 1200 -661 -1694 -90 1086 105 -910 661 1230 -351 -162 1225 1139 -792 -576 1293
889 1293 1067 -993 -429 1104 295 -1228 -647 705 -39 -1607 -375 1474 -299 -1591 -475 914
905 914 -263 -1358 -55 1074 -538 -562 1380 1624 -226 -483 1192 1376 -1025 -681 742 372 -858
922 -858 -520 983 689 -1011 -479 783 92 -1464 -555 695 -76 -1147 -266 1063 -58 -1029 729
939 729 1231 -227 -762 717 1444 -218 -155 845 648 -344 -498 411 -1 -1025 -884 672 599 -763 -238
958 -238 518 211 -1147 -326 718 -573 -1828 375 1347 40 -608 844 1464 -59 -599 927 294
975 294 -690 -134 652 600 -517 -621 402 590 -663 -126 435 25 -983 -756 825 -94 -1386 -117
$$ packed form
855A412j504Q1J704o44k107K05K159j084j700M89J733o01j199R35J122j372j381
872a752J709J243j861j033J604J176r81j015J571N69j581J89J387q6j931K16J869
889A293k26k060N64J533q09j523N81J352p44j568J232J849j773j292J116J389
905I14j177j095J303J129j612k4J942K44j850k57J675J84k401L44J423l70j230
922h58L38J503k94j700N32J262o91j556R09J250p71j071Q81J329j121r71J758
939G29N02j458n35J479P27j662O3J000j97r92j54R09m12j024J41J556p3j362N25
958b38P56l07j358Q21J044j291j255K203R72j307o48J452O20j523n40J526o33
975B94r84N56P86n2j117j04J023J88j253N37N61m10j008K27J581r19j292J269
$$ plain form
993 -117 1086 62 -781 25 917 103 1 1133 851 -258 -145 639 355 -437 -638 -82 426 -383 -580
1012 -580 151 591 -152 -497 229 266 -1080 -671 431 49 -682 -299 541 199 -369 681 662 -391 -57
1031 -57 535 795 -116 -407 54 353 69 -284 -152 21 -145 -193 -24 485 -610 -564 432 -141 -582 -508 277
1052 277 39 -654 188 953 -81 -161 762 724 118 -154 -93 454 -116 127 389 -300 61 -68 281 141 -79
1073 -79 -432 175 417 -378 -600 -70 -63 -193 -335 524 -222 -193 70 748 376 66 186 295 79 95 741 -192
1095 -192 -357 -96 -152 47 165 -250 244 -120 93 -154 -290 -402 -313 -324 151 -282 -307 358 529 614 256 145
1117 145 -26 172 67 373 -34 -143 21 172 369 -114 -114 -23 46 -196 120 -184 -130 -179 -127 -112 -120 -462 -276
1140 -276 -432 -136 403 112 -32 400 498 498 447 29 -24 -95 112 97 -264 -102 10 -53 231 -55 -87 -62 -103 -43
$$ packed form
993a17J203j024q43Q06Q92q14j02J132k82j109J13P84k84p92k01N56N08q09j97
1012e80P31M40p43l45P26L7j346M09J102l82p31L83Q40l42n68J050j9j053L34
1031e7N92K60r11k91M61K99k84l53J32J73j66m8J69N09j095M6R96n73m41P4P85
1052B77k38o93Q42P65j034q0R23l8o06k72O1N47n70K43K62o89L61j29L49j40k20
1073g9l53O07K42p95k22N30Pj30j42Q59p46K9K63O78l72l10J20J09k16J6O46r33
1095a92j65K61n6J99J18m15M94l64K13k47j36j12Q9j1M75m33k5O65J71Q5l58j11
1117A45j71J98j05L06m07j09J64J51J97m83%R1O9k42L16l04N4m9N2J5ql42J86
1140b76j56K96N39k91j44M32R8%n1m18n3p1K07j5l61J62J12o3K84k86l2K5m1O0
$$ plain form
1164 -43 -267 -527 -426 -139 38 387 209 250 81 91 228 108 79 -137 -313 35 236 14 -176 -33 -67 -72
1186 -72 46 312 -161 -457 128 -349 -438 -238 -280 -346 -78 77 19 101 60 38 461 181 -130 -43 -129 183 83
1209 83 -83 16 -100 -110 -182 240 -238 -78 233 495 -470 -340 -261 -19 -210 70 343 114 26 36 381 66
1231 66 -167 221 151 167 -148 -2 165 -189 -158 165 380 -153 -453 -128 415 159 -441 214 83 -365 -281 48
1253 48 121 -533 -251 368 382 -30 -147 427 473 -301 -113 409 -97 -833 -218 355 -18 -484 -227 570 34
1274 34 -355 553 438 -195 -513 293 688 -403 -835 634 663 -515 -509 578 805 -233 -119 928 119
1293 119 -852 -433 690 346 -1001 -538 1034 134 -1076 89 990 -123 -843 126 844 -173 -1276
1310 -1276 259 909 -261 -916 418 875 -490 -425 1069 621 -1108 -527 1076 538 -1011 -701 1022
$$ packed form
1164d3k24k60J01K87J77L49j78M1j69J0J37j20k9k16j76L48K01k22j90J43l4n
1186g2J18K66m73k96N85m77q9K00m2o6K68J55n8Q2m1k2M23k80l11Q7q6L12j00
1209H3j66R9j16j0p2M22m78J60L11K62r65J30P9K42j91K80K73k29q8J0L45l15
1231F6k33L88p0J6l15J46J67l54L1L23K15n33l00L25N43k56o00O55j31m48Q4L29
1253D8P3o54K82O19J4m12j17N74M6p74J88N22n06p36O15N73l73m66K57P97n36
1274C4l89R08j15o33l18Q06L95j091m32J469K9j178OJ087K27j038J14J047q09
1293A19r71M19J123l44j347M63J572r00j210J165R01j113p20R69P18j017j103
1310a276J535O50j170o55J334M57j365O5J494m48j729N81J603n38j549L10J723
$$ plain form
1327 1022 181 -917 -61 1240 -68 -1176 150 1394 15 -1806 394 1118 -795 -1122 444 1017
1343 1017 -628 -1226 1030 1351 -1264 -795 1120 908 -1221 -1060 997 466 -1660 -522 1307 311 -1347
1360 -1347 -24 1510 167 -1792 -18 1549 -617 -1818 374 1483 -584 -1752 1173 2001 -883
1375 -883 -1369 1189 1709 -1207 -1670 1234 1281 -1828 -1047 1899 377 -1975 -632 1835 799 -2280 -331
1392 -331 2431 137 -1877 388 2001 -143 -1953 770 2117 -588 -1986 1234 2072 -1146 -1946 1005
1408 1005 1607 -1655 -1904 1817 966 -2305 -1185 1832 1379 -2160 -889 2546 490 -2220 -59 2269
1424 2269 -21 -2647 17 2689 -474 -2622 1067 2393 -1061 -2174 1453 2446 -1632 -2295 1605
1439 1605 1863 -2287 -2003 2113 1747 -2625 -1520 2834 1373 -2948 -756 2765 367 -2962 -86 2813
$$ packed form
1327A022q41j098Q56J301j308j108J326J244j379j821K200P24j913l27J566N73
1343A017j645n98K256L21k615M69J915k12k129J61K057n31k126J138J829r96j658
1360a347J323J534j343j959J774J567k166j201K192J109k067j168K925Q28k884
1375h83m86K558N20k916m63K904M7l109P81K946j522k352J343K467j036l079J949
1392c31K762k294k014K265J613k144j810K723J347k705j398L220Q38l218q00K951
1408A005O02l262k49L721q51l271J120L017m53l539J271L435k056k710K161K328
1424B269k290k626K664K672l163k148L689J326l454j113L627R93m078o63L900
1439A605K58m150K84M116l66m372J105M354j461m321K192L521k398l329K876K899
$$ plain form
1455 2813 29 -3165 418 3108 -653 -2536 1068 2716 -1157 -2850 1593 2709 -2168 -2466 1846
1470 1846 2195 -2329 -2390 2608 1787 -3036 -1476 2947 1233 -2986 -1122 3314 956 -3559 -146 3609
1486 3609 158 -3123 581 3618 -523 -3368 1070 3440 -1737 -3260 1628 2730 -2228 -2895 2226
1501 2226 2662 -2851 -2149 2989 1829 -3364 -1888 3335 1590 -3810 -1184 3995 616 -3537 -191
1516 -191 3865 384 -3777 411 3814 -741 -3824 871 3637 -1514 -3626 1782 3286 -2429 -3237
1531 -3237 2695 2876 -3111 -2705 3190 2216 -3555 -2017 3781 1396 -3824 -761 3654 405 -3918 -50
1547 -50 4236 73 -4117 562 3579 -1045 -3957 1285 3813 -2023 -3995 2185 3352 -2594 -3074 2779
1563 2779 3191 -3150 -2600 3618 2138 -3843 -2136 3852 1423 -4109 -1276 4296 846 -4126 -3
$$ packed form
1455B813k784l194L583K690l761j883L604J648l873j693M443J116m877k98M312
1470A846L49m524o1M998q21m823J560M423j714m219J864M436k358m515L413L755
1486C609l451l281L704L037m141k845M438K370n177j523M888J102m958o67N121
1501B226M36n513P02N138j160n193J476N223j745n400K626N179l379m153L346
1516a91M056l481m161M188L403m555l083M695K766n151k112N408J504n715q08
1531c237N932J81n987M06N895r74n771J538N798k385n220L063M415l249m323L868
1547e0M286m163m190M679L017m624k912N242K528n836j972O180J167n946m80N853
1563B779M12o341N50O218j480n981J707N988k429n532K833N572l450m972M123
$$ plain form
1578 -3 4316 -3 -4283 366 4136 -990 -4442 1028 4106 -1847 -3747 1959 3511 -2218 -3313 2822
1594 2822 3197 -3230 -2727 3555 2286 -3837 -2283 4066 1770 -4176 -1005 4473 451 -4307 -149
1609 -149 4436 -148 -4645 632 4373 -1329 -4372 1408 4061 -1921 -4145 2422 3611 -2995 -3287
1624 -3287 2993 3097 -3465 -2899 3563 2725 -3421 -1995 4353 1441 -4056 -950 4254 827 -4405 -286
1640 -286 4493 -254 -4599 641 4311 -986 -4093 1743 4147 -2021 -3889 2011 3679 -2576 -3514
1655 -3514 2972 3139 -3341 -2737 3745 2365 -3761 -1617 4405 1564 -4500 -1034 4695 785 -4436
1670 -4436 -205 4484 -238 -4344 904 4577 -1504 -3964 1758 4267 -1821 -4004 2291 3671 -2929
1685 -2929 -3512 3247 2724 -3386 -2661 3912 2337 -3744 -1803 3950 1526 -4113 -835 4498 540 -4257
$$ packed form
1578cM319m319m280M649L770n126l452N470L078n953j900N706J552n729j095O135
1594B822L75o427N03O282j269o123J554O349k296n946L171N478m022m758M158
1609a49M585m584m497N277L741n702l043N780K653n982k224O567J189o606k92
1624c287O280J04o562N66O462q38o146J426O348k912n497L106N204l427n232M119
1640b86M779m747m345N240L670n297l107N836K404o168j868N900J668o255r38
1655c514O486J67o480O04O482j380o126K144O022k841o064L466N729l910n221
1670d436M231M689m722m106N248L673o081k460N722K509o088k183O295J380o600
1685b929n83O759n23o110P25O573j575o081J941N753k424n639L278N333l958m797
$$ plain form
1701 -4257 -194 4686 -417 -4455 515 4449 -1128 -4364 1481 3889 -2086 -3651 2760 3172 -2908
1716 -2908 -3122 3126 2571 -3307 -2595 3673 2269 -3750 -1527 4035 1060 -4133 -974 4158 335 -4137
1732 -4137 -89 4305 -399 -4067 649 4209 -1201 -4010 1737 3560 -2206 -3691 2185 3221 -2614
1747 -2614 -2980 3144 2865 -3473 -2281 3372 1927 -3715 -1776 3922 1006 -3989 -810 3832 443
1762 443 -3819 -173 3962 -401 -3933 739 3921 -1204 -3590 1558 3231 -1762 -3120 2359 3178
1777 3178 -2630 -2495 2752 2446 -3003 -2187 3396 1487 -3576 -1469 3661 1110 -3749 -718 3717 631
1793 631 -3800 157 3698 -646 -3497 806 3460 -831 -3212 1391 3416 -1781 -2771 2220 2626 -2181
1809 -2181 -2249 2562 2505 -2899 -1947 2882 1402 -2991 -1276 3006 912 -3396 -584 3548 240 -3265
$$ packed form
1701d257M063M880n103m038M970L934n577l236N845K408n975j565O411M12o080
1716b908k14O248n55n878P12O268j404o019K223N562k975n193L159N132l823m472
1732d137M048M394m704l668M716L560n410k809N747J823n766j485N876J036n835
1747b614l66O124k79o338J192N653j445n642J939N698k916m995L179M642l389
1762D43m262L646M135m363l532M672L182n125k386N148J673m993j358N479Q19
1777C178n808J35N247l06n449Q16N583j909n063K107N130k551m859L031M435l086
1793F31m431L957L541m344k851M303K654m291k381M603K025n197r90M991M06m807
1809b181o8M811n7n404R52M829j480m393J715M282k094m308K812M132l308l505
$$ plain form
1825 -3265 141 3250 -341 -3354 661 2996 -1141 -2849 1308 2630 -1594 -2426 1740 2554 -2056
1840 -2056 -1985 2446 1910 -2610 -1500 2862 1349 -2692 -1274 2995 776 -2953 -306 2828 -217 -3154
1856 -3154 138 2945 -344 -3173 849 2802 -964 -2707 959 2563 -1260 -2431 1832 2037 -2112
1871 -2112 -1746 1975 1631 -2095 -1512 2365 1301 -2503 -877 2386 719 -2270 -326 2696 177 -2910
1887 -2910 280 2486 -352 -2420 693 2560 -762 -2235 1197 2012 -1286 -1661 1544 1765 -1615 -1809
1903 -1809 1798 1596 -2051 -946 2264 926 -2138 -784 2168 611 -2335 -219 1893 -173 -2152
1918 -2152 188 2422 -200 -1977 618 2164 -749 -1769 995 1680 -1140 -1996 1142 1604 -1390 -1356
1934 -1356 1474 1087 -1572 -1044 1629 916 -1902 -547 2015 75 -1979 -116 2002 18 -1770 91
$$ packed form
1825c265L406L109l591l013M015K335m137j708M157J322m224q32M166Q14m610
1840b056P1M431n36m520J110M362j513m041J418M269k219l729K647L134l045k937
1856c154L292K807l289k829M022J953l766j743L666J604l823j171M263K05m149
1871b112L66L721l44l726N83L877j064l804J626L263j667k989J944L022k519l087
1887b910L190K206k838k068L113J867l322j473L432Q15l298l75L205K21l380j94
1903a809L607k02l647J105L210j338l064J354K952j557k946K116K112k066j979
1918b152K340K234k622j777K595J546k913j020K764O85k820q56L138M62k994L4
1934a356K830l87k659N28K673p13k818J355K562j940k054J863K118j984j788J861
$$ plain form
1950 91 1768 -418 -1821 541 1530 -878 -1712 761 1667 -911 -1370 941 1505 -957 -1058 1219 855
1967 855 -1476 -732 1377 354 -1377 -386 1391 377 -1331 -226 1495 -34 -1623 207 1426 -127
1983 -127 -1628 187 1490 -567 -1223 632 1061 -750 -721 783 1047 -1144 -740 1221 764 -1194 -630
2000 -630 1176 420 -932 -561 1317 184 -1222 -76 1219 103 -1262 313 1139 -113 -1164 399
2016 399 915 -728 -797 618 776 -600 -680 806 1022 -786 -636 787 550 -724 -451 912 599 -1287
2034 -1287 -413 689 233 -735 -228 1046 329 -950 -26 916 -47 -481 95 915 -453 -614 306 898
2052 898 -452 -602 494 503 -505 -574 635 53 -746 -692 650 227 -811 -185 627 288 -596 75 700
2071 700 -392 -556 53 527 -99 -420 329 637 -132 -346 219 488 -193 -384 307 173 -445 -392 288 417
$$ packed form
1950I1J677k186j403K362R89k408q34K473R06k578m59K311N64k462j01K277l64
1967H55k331P44K109j023j731R91J777j014j708J105J721j529j589J830J219j553
1983a27j501J815J303k057o56J855M29j811K9J504K64k191M04J961m57j958N64
2000f30J806p56j352L71J878j133j406J146J295j116j365J575Q26j252j051J563
2016C99N16j643o9J415J58j376q0J486K16j808J50J423k37j274K73J363l13j886
2034a287Q74J102m56r68N07J274p17j279R24R42r63m34N76Q20j368j61R20N92
2052H98j350j50J096Rj008o9J209n82p99N4J342m23j038O26Q12l39q84O71O25
2071G00j092j64O09M74o26l21P49L08p69k14N65K69o81j91O91j34o18N3O80J29
$$ plain form
2091 417 -401 -194 251 198 -371 34 732 76 -460 -173 554 214 -444 40 598 14 -559 486 371 -134
2111 -134 -251 114 240 -253 -463 256 -12 -474 -357 -62 335 -176 -25 342 -100 -227 152 155 55 -9 -225
2132 -225 260 -195 -270 162 251 23 -250 29 159 -221 -200 314 67 -43 -419 0 -67 -51 -68 143 154 -141
2154 -141 -109 105 -26 -354 -31 160 319 -182 97 71 6 -163 39 22 -30 -250 20 258 33 -20 169 -8
2176 -8 -280 -307 300 -65 -55 49 116 -212 -23 33 82 -67 -64 -233 240 124 8 196 59 38 1 -109 -42 60
2200 60 97 -209 264 20 111 -71 177 310 330 -22 269 -65 8 -101 -215 -31 -36 6 124 83 -217 43 44 7
2224 7 -110 170 -92 -308 -135 170 -38 -166 -84 -69 -38 -12 -145 122 12 -66 205 -107 -147 23 38 -82 -87 -164
2248 -164 -101 -158 90 -36 -59 -56 -197 166 -120 115 -132 87 93 37 -57 347 154 261 21 -3 -267 -115 125
$$ packed form
2091D17q18K07M45n3n69M05O98o56n36K87P27l40o58M84N58n84n73J045j15n05
2111a34j17L65J26m93k10P19k68m62J17K95L97n11J51L67m42j27L79Lj00o4k16
2132b25M85m55p5M32Q9k28k73K79J30l80K1N14k47j10l76M19o7J6j7K11J1k95
2154a41L2K14j31l28L23J91J59n01K79k6o5j69K02j7n2k20K70K38k25n3J89j77
2176hk72k7O07l65J0J04O7l28J89N6M9j49Lj69M73j16j16J88j37k1l7j10O7J02
2200F0L7l06M73k44R1j82K48J33K0l52K91l34P3j09j14J84nM2J18m1l00K60Jl7
2224Gj17K80k62k16J73L05k08j28Q2J5L1K6j33K67j10p8K71l12m0J70J5j20np7
2248a64O3n7K48j26k3Lj41L63k86K35k47K19On6r4M04j93J07k40k4k64J52K40
$$ plain form
2271 125 -191 -29 115 -53 -149 -94 -16 158 15 -68 -51 330 328 125 -51 -218 61 -128 -68 -186 -61 59 187
2294 187 -180 -47 288 160 -61 -12 138 -31 -315 -93 -112 74 -42 -119 165 23 -202 -21 125 283 200
2315 200 -220 86 52 -12 -112 -245 -265 -102 160 -107 239 215 -132 -48 -31 -284 0 62 -148 127 -149 155
2337 155 17 96 124 128 114 12 24 -113 167 -11 -63 -243 81 162 -326 -33 -26 -292 -57 55 148 -48 -36 222
2361 222 42 -75 -139 251 -338 -25 22 97 20 -55 115 -157 -48 167 -12 97 8 -195 -129 343 1 -59 -83
2384 -83 283 220 -156 179 -3 -283 116 100 41 96 -65 43 -73 -10 157 278 -43 -171 87 180 89 -192 -220
2407 -220 140 -23 -36 104 290 190 -3 -23 44 -78 -117 -20 162 -83 -117 72 175 118 -73 119 -44 -131 -42
2430 -42 171 68 -36 32 96 -137 138 230 47 154 -189 -128 268 -29 -211 -46 20 -118 -332 -121 305 146
$$ packed form
2271A25l16J62J44j68r6N5P8J74j43q3J7L81kk03j76j67K79j89O0j18J25J20J28
2294A87l67J33L35j28k21M9J50j69k84K22j9J86j16p7K84j42k25J81J46J58q3
2315B00m20L06l4o4j00j33k0J63K62k67L46k4l47Q4J7k53K84O2k10K75k76L04
2337A55j38P9K8Mj4j02J2j37K80j78n2j80L24Q1m88K93Pk66K35J12R3j96J2K58
2361B22j80j17o4L90n89L13M7P5p7p5J70k72J09K15j79J09q9k03O6M72l42o0k4
2384h3L66o3l76L35j82k80L99j6n9N5j61J08j16O3J67J21l21j28K58R3r1k81k8
2407b20L60j63j3J40J86j00j93k0O7j22l9R7J82k45l4J89J03n7j91J92j63q7Q9
2430d2K13j03j04O8O4k33K75R2j83J07l43O1L96k97j82J65O6j38k14K11M26j59
$$ plain form
2452 146 -48 159 157 -195 143 472 360 -5 -64 116 239 -301 80 -237 77 -49 -13 315 116 -254 -49
2473 -49 88 -22 -250 163 35 -295 -131 98 79 -24 -176 353 173 -251 -163 85 182 -55 -132 66 -49 -183
2495 -183 -210 438 217 -187 -108 141 -60 -36 121 134 -178 -26 184 307 -271 -198 129 209 32 -62 227 181 -281
2518 -281 -5 33 -92 -34 -101 200 253 -151 232 204 -153 55 -158 66 182 -252 215 65 -286 -97 122 9
2540 9 6 -150 13 301 -179 -115 161 168 248 -13 64 75 -416 171 331 -113 -317 80 201 119 -402 -111 18 -114
2564 -114 27 68 31 -93 -218 -55 277 -172 -58 115 175 -167 52 -101 108 23 -168 158 99 -90 -56 265
2586 265 -122 -336 -240 211 -71 -102 82 -183 -88 -295 151 358 -152 118 81 211 -234 -90 123 176 -124 -148
2608 -148 44 70 -111 -125 -68 127 -262 -313 236 38 93 81 -103 -234 69 145 237 74 -59 -43 39 -94 186
$$ packed form
2452A46j94K07kl52L38L29j12l65n9J80J23n40L81l17L14j26L6L28j99l70K05
2473d9J37j10k28M13j28l30J64K29j9j03j52N29j80m24Q8K48R7k37p7J98j15j34
2495a83k7O48k21m04P9K49k01K4J57J3l12J52K10J23n78P3L27Q0j77r4K89m6m62
2518b81K76L8j25N8o7L01N3m04L83k8l57K08k13K24J16m34M67j50l51J89K19j13
2540Ilj56J63K88m80O4K76PQ0k61P7J1m91N87J60m44k04L97J21q2n21K91J29j32
2564a14J41M1l7j24j25J63L32m49J14J73O0l42K19j53K09q5j91L26n9j89L4L21
2586B65l87k14R6M51k82l1J84k65R5k07M46K07n10K70l7J30m45J44K13N3l00k4
2608a48J92K6j81j4N7J95l89n1N49j98N5j2j84j31L03P6R2j63j33J6Q2j33K80
$$ plain form
2631 186 72 192 -38 65 87 -69 -160 187 -6 130 -60 -50 172 211 158 -63 177 88 -112 -132 13 105 -215
2654 -215 -6 -118 3 -2 24 230 72 81 66 -48 -156 -168 132 107 -86 10 -12 13 -103 -137 80 78 -31 -348 -101
2679 -101 24 -79 162 3 162 46 -29 -86 147 92 266 198 20 -284 -137 -48 -162 -182 -169 117 152 49 86
2702 86 -96 55 -159 80 8 70 16 -41 239 -112 20 135 123 -74 87 -4 -117 64 -13 -3 -52 11 -117 -12
2726 -12 -67 30 54 28 -30 46 253 234 -78 165 -170 -44 -60 -51 70 89 90 -90 -15 -108 -83 337 80 68 -120 116
2752 116 -147 -111 -6 221 -103 -17 -64 -88 214 12 -160 66 140 48 -100 -39 -63 -249 75 36 12 -34 -34 79
2776 79 99 117 37 118 -44 -3 257 128 -121 -78 -79 93 -177 163 -185 56 26 -170 118 -60 258 120 -15
2799 -15 18 -89 15 -73 35 227 -202 39 -25 -365 -148 4 40 -26 -39 0 155 -82 -112 49 43 73 -200 -104
$$ packed form
2631A86j14J20k30J03K2j56r1L47j93J36j90J0K22L9n3k21K40q9k00k0J45R2l20
2654b15K09j12J21nK6K06j58Rj5j14j08j2L00k5j93R6k2K5j16l4K17kj09l17K47
2679a01J25j03K41j59J59j16p5n7K33n5J74o8j78l04J47Q9j14k0J3K86L5j03L7
2702H6j82J51k14K39p2O2n4n7K80l51J32J15j2j97J61r1j13J81p7J0m9O3j28J05
2726a2n5R7K4k6n8P6K07j9l12K43l35J26j6RJ21J9Jj80P5r3K5M20k57j2j88K36
2752A16k63L6J05K27l24Q6m7k4L02k02j72K26P4r2j48O1k4j86L24l9k4m6%J13
2776G9K0J8q0Q1j62M1K60j29k49M3jJ72k70L40l48K41l0j96K88j78L18j38j35
2799a5L3j07J04q8J08J92m29K41o4l40K17J52L6o6j3L9J55k37l0J61oL0k73R6
$$ plain form
2823 -104 43 104 120 115 -165 177 52 228 67 -223 47 202 -96 -212 143 -3 48 48 -108 445 -20 -85 93
2846 93 -30 -10 109 142 157 127 -138 -130 -150 56 67 105 215 -177 -171 195 -65 -66 -61 -207 -63 220 113 -16 -172
2871 -172 99 147 -154 -17 139 -380 -159 -193 -29 -16 166 -256 88 -62 -67 -200 -7 230 -35 -207 24 -88
2893 -88 35 -91 -29 94 -80 -126 134 101 -101 -221 192 49 -89 -43 39 135 -49 -20 87 164 -246 89 -145
2916 -145 243 -61 -52 50 -134 -202 201 -3 61 -282 137 -146 -253 78 130 -42 -226 -114 74 58 -138 41
2938 41 182 -52 -2 -13 62 25 -182 229 127 -37 86 21 72 -237 -296 239 199 -205 -149 15 -16 -273 201 187
2962 187 110 -249 187 187 -28 -28 -135 93 -49 -250 268 208 133 -217 54 85 -32 -333 85 318 -243 -266 310
2985 310 249 -250 228 242 344 -224 96 255 226 -328 -165 376 108 -375 -161 247 -156 -226 194 188 -35 -158
$$ packed form
2823a04J47O1J6nk80L42j25J76j61k90K70J55k98j16L55j46N1%j56N53m65o5J78
2846I3j23K0J19L3J5l0k65Qk0K06J1L8J10l92OL66k60jNj46J44K83j07j29j56
2871a72K71M8l01J37J56n19K21l4J64J3J82m22L44j50nj33J93K37k65j72K31j12
2893h8J23j26O2J23j74m6K60l3k02j20M13j43j38M6Q2R6j84K9J07P7m10L35k34
2916a45L88l04RJ02j84o8M03k04O4l43M19k83j07L31N2j72j84J12J88j6j96J79
2938D1J41k34N0j1P5l7k07M11j02j64J23o5N1l09n9N35m0m04N6J64l1k57M74j4
2962A87p7l59M36%k15%j07K28j42k01N18o0p5l50K71L1j17l01M18K33n61k3N76
2985C10o1m99M78J4J02n68L20J59k9n54J63N41k68m83K14M08m03p0M20ok23j23
$$ plain form
3007 -158 140 346 -158 -287 262 85 -317 -70 224 130 -243 -402 362 -50 -410 -209 257 104 -361 -95
3027 -95 397 -86 -573 504 3 -177 -355 128 378 -501 -305 149 366 -238 -157 499 363 -141 -321 318
3047 318 337 -397 -263 486 -99 -274 23 376 -118 -333 -34 340 -21 -435 -114 385 -196 -589 98 305
3067 305 -113 -429 333 342 -251 -340 363 323 -365 -156 337 211 -547 -139 282 247 -384 -152 365 5 -555 46
3089 46 632 -145 -650 257 642 -221 -541 418 398 -274 -164 201 546 -354 -357 329 368 -384 -347 523 253 -263
3111 -263 -436 515 256 -638 -366 583 106 -624 -182 805 93 -531 69 561 -162 -920 311 740 -368
3130 -368 -410 293 580 -179 -531 663 505 -354 -432 617 426 -409 -387 488 263 -619 -145 950 65 -822
3150 -822 46 597 -138 -658 413 644 -66 -543 498 634 -186 -727 254 831 -391 -354 709 492 -591
$$ packed form
3007a58K98K06n04j29N49j77m02K47K94r4l73j59P64m12l60K01M66j53m65K66
3027i5M92m83m87J077n01j80j78M83K50q79J96M54K17o04Q1O56j36n04j80O39
3047C18J9p34J34P49n85j75K97L53m94k15K99L74l61m14L21M99n81l93O87K07
3067C05m18l16P62Rn93q9P03m0o88K09M93j26p58M08M21l5o31K32N17l60n60O01
3089D6N86p77n05R07L85q63l20R59k0o72J10L65L45r00lO86L9p52L7Q70k70n16
3111b63j73R51k59q94K72R49m77p30M42R87p12o24O00M92p23p58J231M29j108
3130c68m2P03K87p59l52J194j58q59p8J049j91q35K2Q75k25q82M74J095q85q87
3150h22Q68N51p35n20J071K31p10m77J041J36q20n41R81N77j222L7J063k17j083
$$ plain form
3169 -591 -357 753 226 -659 -303 651 69 -568 -30 615 -31 -656 -100 557 32 -611 91 776 -284
3188 -284 -829 250 590 -246 -783 339 655 -619 -753 657 423 -368 -290 924 297 -564 21 779 367
3207 367 -794 77 648 136 -850 -139 860 -87 -1028 82 620 -199 -575 464 542 -203 -646 282 650
3226 650 -637 -843 676 625 -518 -461 554 626 -638 -188 737 352 -736 69 897 207 -786 -117 801
3245 801 -196 -506 300 749 -368 -910 394 716 -673 -590 380 765 -637 -436 475 426 -706 -740 668
3264 668 143 -651 -474 630 160 -816 -413 818 -45 -797 203 699 -172 -676 125 766 -12 -876 316
3283 316 518 -439 -791 257 583 -676 -672 364 612 -665 -465 850 422 -731 -185 646 242 -974
3301 -974 -141 1125 -117 -599 -206 902 124 -812 315 800 -199 -927 328 893 -368 -808 430 498
$$ packed form
3169e91K34J110n27q85L56R54n82o37N38O45o46o25N56O57n25o43P02O85j060
3188b84n45J079L40q36n37J122L16j274j34J410k34p91P8J214o27q61N85P58m12
3207C67j161Q71N71n12r86P11R99r47r41J110N38q19l76J039P8p45m43R28L68
3226F50j287k06J519n1j143N7J015P2j264M50R25l85j088Q05Q28o90r93O69R18
3245H01r97l10Q06M49j117n42J304L22j389Q3R70L85j402K01R11m9j132l4J408
3264F68n25p94J77J104m70r76M03J231q63p52J000M96q71n04Q01O41p78q64J192
3283C16K02r57l52J048L26j259MJ036K48j277K00J315m28j153N46Q31m04j216
3301i74Q33J266j242m82L93J108p78r36J127M85r99p28J255N65j261m40J238O8
$$ plain form
3319 498 -464 -672 653 228 -523 -364 594 450 -709 -67 863 238 -641 -228 870 315 -911 -73 846
3338 846 -54 -651 1 757 -202 -777 375 589 -356 -606 456 527 -587 -484 474 432 -882 -529 788
3357 788 370 -487 -236 777 256 -687 -107 450 140 -692 204 556 -121 -742 209 559 -231 -893 157
3376 157 735 -9 -586 232 480 -463 -563 371 375 -642 -238 465 313 -680 -205 685 58 -547 -24 747
3396 747 118 -897 -156 856 -177 -448 34 874 -285 -439 358 416 -299 -428 389 156 -466 -512 364
3415 364 262 -552 -345 802 349 -599 -357 725 87 -385 -201 781 81 -889 -29 682 -274 -563 137
3434 137 522 -283 -518 270 620 -379 -719 188 428 -362 -470 514 422 -447 -236 524 255 -496 -262 402
3454 402 172 -636 -174 714 -11 -572 159 545 -210 -438 -57 421 -160 -635 430 479 -266 -434 183 404
$$ packed form
3319D98r62k08J325m25p51J59R58j44j159O42R30o25q79M13J098n55j226Q38R19
3338H46r00n97O52P56r59n75J152K14r45k50J062P1j114J03R58m2j314L53J317
3357G88m18q57K51J013n21r43N80N57l10q32Q96L52o77o21R51L50p90o62J050
3376A57N78p44n77Q18K48r43j00R34Mj017M04P03j52r93M75Q90o27o05N23P71
3396G47o29j015P41J012j033k71M82Q40j159j54P97N8p15j29Q17k33o22m6Q76
3415C64j02q14K07J147m53r48K42J082o38m72J84R82p00r70Q60P11r56k89P00
3434A37L85q05k35P88L50r99l40R07K40p90j08R84r2q69K11P60k69p51K34O64
3454D02k30q08M62Q88p25n61P31L86p55k28L81M78n81m75J065M9p45j68O17K21
$$ plain form
3474 404 -518 -477 496 316 -281 -499 519 275 -411 -228 393 60 -844 17 436 46 -605 -123 532 -20
3494 -20 -665 364 559 -181 -529 184 720 -176 -465 118 497 -336 -214 420 204 -281 -292 422 372 -275 -82
3515 -82 483 28 -516 -109 442 144 -440 -12 376 -106 -448 260 469 -20 -333 150 593 144 -310 398
3535 398 514 -297 -468 283 331 -208 -102 408 -166 -307 -355 258 181 -247 -63 385 55 -384 -148 342 -20
3556 -20 -116 162 384 85 -246 -60 349 107 -234 41 329 -90 -177 349 69 -355 -344 453 117 -244 -95
3577 -95 29 -26 -331 -95 80 -5 -394 97 353 -34 36 105 319 113 -198 272 117 -62 -432 224 207 -89
3599 -89 -304 254 218 -427 -260 242 152 87 -149 124 330 -95 -43 486 -89 -381 -155 390 39 -159 76 163
3621 163 120 -138 -21 192 -139 -347 321 416 -75 -475 -78 94 -353 -73 154 262 39 164 111 -73 -195
$$ packed form
3474D04r22M1R73j80n97k18J018k44o86J83O21l33r04Q61M19l90o51M82O55n52
3494b0o45J029J95p40l48P13N36q96k89N83L79q33J22O34k16m85j1P14n0o47J93
3515h2N65m55n44M07N51k98n84M28L88m82l42P08K09m89l13M83M43m49m54P08
3535C98J16q11j71P51M8n39J06N10n74j41m8O13p7m28J84M48l30m39K36M90l62
3556b0r6K78K22k99l31J86M09k42l41K75K88m19q7N26k80m24J1P97l36l61J49
3577i5J24n5l05K36J75q5l89M91K56l87P0O9K14k06l11M70j55j79l70O56j7k96
3599h9k15N58l6o45J67N02r0o5k36K73K06m25N2N29n75k92K26N45l51j98K35Q7
3621A63m3k58J17K13l31k08O68R5m91m00L97J72m47K80K27J08k23J25n3j84j22
$$ plain form
3642 -195 -357 111 59 -88 -21 227 148 -35 -122 143 -164 -237 325 112 157 29 222 -128 -33 -102 72 -134 -78
3665 -78 191 189 184 -221 10 25 59 -57 -115 214 -21 -335 16 -65 -62 -145 27 196 -161 -226 277 2 39 -93 117
3690 117 44 -92 -246 299 91 -32 -174 -297 -150 -194 143 185 124 -96 -106 151 -6 -111 -44 125 -47 47
3712 47 177 132 99 -64 -46 30 -207 -84 -116 -12 79 -86 0 49 14 -167 202 171 3 56 122 -77 -4 -57 288
3737 288 221 -362 -51 135 -72 -96 -150 54 50 28 -28 135 178 -286 -57 133 109 -35 21 36 57 -53 34 177
3761 177 -32 -129 301 -96 -183 -165 -70 116 -319 -68 -223 294 15 62 89 58 28 -344 191 -128 65 106 1
3784 1 69 -14 38 -58 -93 -232 43 -64 -10 200 24 179 284 118 -52 182 7 -177 -6 -324 -24 -52 -72
3807 -72 121 25 143 26 -13 215 103 -220 -114 287 -156 60 -62 -56 219 32 -7 -23 94 85 -88 75 -87
$$ packed form
3642a95j62M68n2j47O7K48p9j83q7K65l07p3N62k13M5j28J93l50R5o9J74k06N6
3665g8K69knm05K31J5L4j16n8L29k35l14L51q1Lq3J72J69l57o5N03k75L7j32K10
3690A17p3j36j54N45k08j23j42j23J47m4L37M2o1k20j0K57j57j05O7J69j72R4
3712D7J30m5l3j63J8P6k37J23l2J04R1j65Q6M9l5j81L69l1j68N3O6j99P3n3L45
3737B88o7n83L11J86k07k4n4K04mk2n6J63M3m64K29J90k4j44N6J5K1j10Q7J43
3761A77k09r7M30l97q7J8R5J86m35K51j55N17k79M7K7l1l0l72N35l19J93M1j05
3784AO8q3N2r6l5j39K75j07N4K10j76J55J05j66j70K34j75j84J71l18L00k8k0
3807g2J93r6J18j17l9K28j12l23J06M01m43K16j22OK75j87l9j6J17rj73J63j62
$$ plain form
3830 -87 -65 148 -140 -36 114 75 -195 -61 -35 127 -63 -25 117 -50 -192 3 57 -54 -32 -15 14 -136 138
3853 138 7 -132 67 -44 42 74 173 -177 -76 359 126 76 -152 -48 -109 167 -158 205 119 22 -21 4 -89
3876 -89 -47 -96 12 -12 -5 37 40 78 -192 -121 -143 -173 -35 -123 -157 -89 343 -197 -13 7 4 3 33 -92 -70 63 -37 -107
3904 -107 -74 -22 -200 -55 -149 -244 78 119 70 -29 144 42 36 -30 -61 -72 356 26 -48 82 78 -42 78 6 84 80
3930 80 3 -170 -4 -111 -97 -66 -134 99 -97 140 121 249 -61 223 16 67 -29 -39 66 -70 -287 117 27
3953 27 -36 178 -19 -44 338 -89 -148 32 -198 89 68 163 -169 -106 -122 33 -74 93 192 -17 -7 50 99 64
3977 64 135 -157 72 207 -133 -59 -11 61 36 -69 -22 -381 -156 -81 -38 6 25 8 -8 -37 55 18 -93 -55 -70 -153
4003 -153 17 -27 -175 -44 84 -58 -137 -214 -60 25 -25 61 -74 75 108 9 -169 -14 -223 179 50 134 -88
$$ packed form
3830h7K2K13k88J04J50l9k70J34K6J62j90L8J42j67j42J95N4j11K2J7K9j50K74
3853A38j31j39J99j11Q6L2R9l50J01M35k33n0k28J04o1K76l25L63q6r7m3K5r3
3876h9M2m9J08k4PM2LL8k70P1k2l0J38q8l4O8M32n40J84K0ljL0j25K2J33j00p0
3904a07L3N2j78J45r4r5L22M1m9r9J73j02oo6l1j1M28l30p4J30mj20J20p2P8m
3930H0p7j73J66j07J4L1o8K33j96K37j9J28l10K84k07N1r6j0J05j36k17M04r0
3953B7o3K14j97k5L82m27n9J80k30K87k1R5l32O3j6J55j07J67R9k09J0N7M9l5
3977F4P1k92K29J35l40P4M8P2k5j05M7l59K25P5M3M4J9j7j6k9R2l7j11L8j5q3
4003a53J70m4j48J31J28j42p9p7J54Q5n0Q6j35J49L3r9j78J55k09M02j29Q4k22
$$ plain form
4026 -88 82 140 -35 -70 120 102 -41 -60 130 -14 -86 22 58 255 -22 58 23 52 -22 0 -159 7 99 149 45
4051 45 -92 -89 -85 90 -183 67 201 113 -121 132 10 57 -12 215 206 61 140 -1 98 198 -52 43 203 205 -176
4076 -176 -300 -26 18 119 115 -82 112 -71 -14 60 37 161 -26 -12 39 -64 180 -86 246 116 -79 156 26
4099 26 -118 48 -89 -131 -263 220 180 -146 -14 180 9 295 -30 151 159 -102 137 -51 28 -355 15 -114
4121 -114 -10 37 62 -87 -82 108 229 -13 -99 71 26 40 -155 -117 306 304 201 -49 205 -43 -60 -33 -14 98
4145 98 147 93 -41 -132 -19 -84 246 147 68 -121 7 -26 -118 62 52 -108 -317 -5 -107 -160 -84 -58 -156 -28 263
4170 263 213 -260 -165 -160 116 -224 -149 -40 -178 -96 -64 -100 -73 -79 73 -99 257 -154 -138 97 126 -105 -103 142 124
4195 124 -140 150 -37 -27 -32 9 259 0 -177 163 -21 -22 -44 -4 151 -97 -66 223 189 -168 -31 13 -171 -263
$$ packed form
4026h8J70N8j75l5J90j8j43j9J90j44p2J08L6J97k77Q0l5K9p4K2j59J66R2N0j04
4051D5j37LMJ75k73K50J34q8k34K53j22M7o9K27rj45P9j41R9J00k50R5J60Kl81
4076a76j24K74M4J01mj97J94j83N7P4k3J24j87J4N1j03K44k66L32j30j95K35j30
4099B6j44J66j37m2j32M83m0l26J32J94j71K86l25J81Qk61K39j88P9l83L70j29
4121a14J04M7K5j49NJ90J21k42q6J70m5J4j95L8M23kj03k50K54k48j7K7J9J12
4145I8M9n4j34r1J13o5L30r9p9j89J28l3r2J80j0j60k09L12j02n3P6K6r8J28K91
4170B63n0m73R5NK76l40P5J09j38Q2L2l6K7oJ52j72L56m11J6K35K9k31KK45j8
4195A24k64K90j87J0nM1K50k59j77L40j84jk2M0J55k48L1K89l4l57J37M4j84r2
$$ plain form
4219 -263 -91 250 38 -46 91 188 -123 -194 45 145 383 -111 -72 78 99 -90 190 57 -66 -111 189 -262
4241 -262 -12 112 -164 251 124 -140 -11 112 -111 111 75 -52 -112 -363 -207 -121 18 -49 2 -289 30 -70
4263 -70 -3 -193 150 -60 62 34 -33 0 -149 5 188 -42 -208 -60 -67 -256 -220 13 -51 -62 174 34 141
4286 141 -4 206 -166 -216 136 123 -73 44 128 120 -58 153 -80 -218 -153 -206 83 -138 7 79 2 -25 -217
4309 -217 -70 145 13 -109 -103 46 130 -123 288 41 22 -90 50 91 163 195 222 10 222 -91 -117 155 5
4332 5 -131 -63 78 -220 -290 253 -133 9 -76 49 101 -113 339 -145 -164 -89 155 115 5 -106 114 287 36
4355 36 -140 -93 379 41 -218 -138 218 -137 85 43 -27 283 -28 -198 138 -84 190 -39 46 10 80 -229 -140
4378 -140 55 -185 160 128 -51 -141 -270 13 -36 9 -36 -284 35 51 108 -133 -51 -30 -37 240 -190 -25 -276 -114
$$ packed form
4219b63J72L41k12q4J37R7l11p1K39J00K38m94L9J50K1j89K80j33j23m5L00m51
4241b62K50J24k76M15j27k64J29J23k23K22l6j27o0k51J56Q6J39o7N1k91L19j00
4263g0O7j90L43k10J22k8o7L3j49J54J83k30j66J48pj89L6K33o4j1K36j40J07
4286A41j45K10l72n0L52j3j96J17Q4qj78K11k33j38O5n3K89k21J45P2p7k7j92
4309b17J47K15j32j22OJ49Q4k53M11k47j9j12J40M1P2L2K7k12K12l13k6K72j50
4332Ej36O8J41k98p0N43l86J42q5J25N2k14M52m84j9P5K44m0j10j11K20J73k51
4355C6j76M7M72l38k59Q0L56l55K22m2p0L10l11j70L36k22K74k29Q5l6P0l09Q9
4378a40J95k40L45l2j79r0j29K83m9M5m5k48L19J6N7k41Q2K1pK77m30J65k51J62
$$ plain form
4402 -114 14 238 -19 -111 -77 12 -16 136 -4 -27 138 0 -121 136 -183 -2 40 203 115 -110 36 -143
4424 -143 -16 -5 -8 -17 31 55 140 -111 -15 126 -102 24 246 31 -149 -214 72 252 -128 -10 77 31 -28 -16 6
4449 6 -58 35 15 -54 -13 3 57 244 -214 91 43 -79 177 -71 12 -61 40 -49 -191 61 -40 17 -154 40 234
4474 234 -6 -86 -98 -121 42 136 9 -340 -204 58 -2 -123 67 -31 58 -54 44 28 14 71 -243 -258 -154 -62
4498 -62 -83 236 175 137 -122 39 -63 -62 -65 113 168 50 -286 150 91 -22 -113 -67 -35 -173 79 90 7 146 262
4523 262 121 181 22 230 -48 -26 108 -73 258 99 46 241 167 34 254 -140 20 -82 85 319 -5
4544 -5 32 38 171 84 -23 204 237 278 38 254 213 198 11 -35 -96 -3 72 49 16 118 -24 162 86 -83 -2 -47
4570 -47 67 -283 -18 33 -63 88 -81 -269 79 -101 -13 134 -90 -40 82 36 -46 142 -28 199 -95 84
$$ packed form
4402a14J28K24k57r2L4Q9k8J52j40k3J65j38j21K57l19J81M2J63q8k25J46j79
4424a43J27J1lrM8K4Q5k51R6J41k28J26K22k15j80o5K86J80l80J18Q7m6n9J2K2
4449Fo4R3k0o9M1J6N4J87m58L05m8j22K56k48Q3p3J01q9j42K52j01N7j71J94J94
4474B34k40q0j2k3J63R4j27l49J36K62o0j21J90r8Q9j12R8j6j4N7l14j5J04R2
4498f2k1L19o1l8k59J61j02JlJ78N5j18l36M36n9j13r1M6L2j38K52J1q3J39J16
4523B62j41O0j59K08k78K2J34j81L31j59n3J95p4j33K20l94J60j02J67K34l24
4544eL7OJ33q7j07K27L3M1k40K16m1j5j87m6o1R3P5k3l3J02j42J86p6j69Q1m5
4570d7J14l50K65N1r6J51j69j88L48j80Q8J47k24N0J22m6q2J88j70K27k94J79
$$ plain form
4592 84 61 397 -248 -89 62 49 -174 55 86 -79 -28 125 -106 32 -92 129 255 -69 -12 88 -22 -54
4614 -54 236 -150 -139 -176 21 -36 -85 96 -160 -182 -27 -91 -22 47 -163 -205 -51 22 147 65 76 27 -95 -139 223
4639 223 126 -99 -254 53 110 45 -114 -30 -64 80 -196 106 -66 -77 91 50 -18 101 20 0 -97 -45 -145 73
4663 73 12 -233 -108 -146 -79 -325 39 -17 -191 -140 -80 95 145 -197 -78 231 -97 58 83 133 -138 82 215
4686 215 -3 16 166 148 184 -24 18 -3 165 -66 104 -56 183 -24 210 189 63 29 143 4 -64 -89 -200
4709 -200 399 18 -127 228 -155 -48 53 -54 89 -291 67 86 225 -38 -262 143 76 143 51 -68 231
4730 231 -12 243 135 -14 276 235 82 13 -135 113 31 10 -130 413 5 -155 51 58 192 -248 -149 56
4752 56 -17 12 -148 0 174 -196 127 158 117 135 -227 40 87 -88 50 192 -1 -309 36 31 -130 66 70 -90
$$ packed form
4592H4k3L36o45J59J51j3k23K29L1j65N1J53k31J38j24K21J26l24N7J00j10l2
4614e4K90l86J1l7J97n7m9J81k56k2J55o4O9O9k10m2J54P3J25q2J1m9j22m4L62
4639B23r7k25j55L07N7o5j59Q4l4J44k76L02j72j1J68m1o8J19q1k0r7N2j00K18
4663G3o1k45J25l8O7k46L64n6j74N1O0J75N0l42J19L09l28J55K5N0k71K20J33
4686B15k18J9J50j8L6k08M2k1J68k31J70j60K39k07K34k1j26l4J14j39o8k5j11
4709b00N99l81j45L55l83J07J01j07J43l80L58J9J39k63k24M05o7O7r2j19K99
4730B31k43K55j08j49K90m1j53o9j48K48q2k1j40N43m08j60K06PJ34m40R9K05
4752E6p3K9j60J48J74l70L23L1m1J8l62K67M7j75J38J42j93l08L45nj61J96Mj60
$$ plain form
4776 -90 -367 61 46 99 -268 277 -18 359 -43 -40 232 132 -348 72 150 161 35 157 211 -44 -64 151 281
4799 281 -259 -91 0 78 -262 -99 100 77 108 -113 108 184 -58 -133 -138 -7 -527 -204 60 114 -254 14 37
4822 37 -201 -37 -22 130 -211 102 -232 -54 -102 -343 85 257 49 -289 -149 -230 -84 141 197 54 -199 79
4844 79 182 127 -349 186 173 111 -68 39 87 -254 -19 -36 243 10 -383 91 188 -79 -198 169 178 -224 -46
4867 -46 328 -9 173 -90 157 -18 25 6 61 69 -191 90 2 124 -182 -66 44 -20 -414 -16 394 8 -196
4890 -196 -1 114 -48 -154 216 -137 41 -276 80 294 -164 -18 48 -101 91 -4 270 194 8 -20 163
4911 163 46 -249 205 379 63 27 94 147 -197 -258 209 46 -83 -242 176 120 -160 -205 228 275 -184 -6
4933 -6 105 -141 -1 -134 -53 68 -21 -129 64 238 77 -241 -98 -102 -193 59 -22 -54 -154 88 220 328 -266
$$ packed form
4776i0k77M28j5N3l67N45k95L77m02LK72j00m80M20P8J1j26J22N4k55k0K15J30
4799B81n40J68R1P8l40J63J99k3L1k21K21P6k42p5nJ31n20L23K64N4l68K68K3
4822C7k38J64J5J52l41L13l34J78m8k41M28J72k08l38J40q1J46K25N6j43k53K78
4844G9J03n5m76N35j3o2j79J07M8l41K35j7K79k33l93M74R7k67j19L67Rm02J78
4867d6L74l37J82k63K47j75M3j9N5Qk60K81q8J22l06J16J10o4l94L98M10l86k04
4890a96J95J15j62j06L70l53J78l17L56K14m58J46O6j49J92r5K74p6j86k8J83
4911A63j17k95M54J74l16l6O7N3l44o1M67j63j29j59M18n6k80m5M33M7m59J78
4933fJ11k46J40j33Q1J21q9j08J93J74j61l18J43mr1K52q1l2j00K42J32J08n94
$$ plain form
4956 -266 -213 1 175 71 45 166 4 -165 250 181 55 -82 222 206 -223 104 -10 5 -170 -128 15 85
4978 85 -33 -21 100 -208 -52 -86 286 -64 -340 51 -185 -56 -150 73 170 -267 114 174 -29 -154 -206 221
5000 221 -33 -207 215 454 -55 -240 -64 16 -3 4 215 147 -158 -391 -56 136 -110 -119 -156 -110 -132 26 28 13
5024 13 -56 -179 -60 -145 -32 296 158 40 -64 46 130 46 -171 -29 149 -51 -61 -192 293 -210 90 200
5046 200 40 -155 -120 56 397 -97 240 -226 -23 -244 52 91 -176 -82 -133 97 35 239 -116 130 -42 -157
5068 -157 -143 286 -124 -221 -101 189 -186 -77 -128 99 -21 75 10 121 -180 -81 150 -104 -10 -139 -112 50 -40
5091 -40 58 129 54 -38 204 251 114 -176 -164 160 -1 -30 98 47 269 105 91 164 152 -181 -212 112 109 51 285
5116 285 49 118 96 -225 -13 -67 -50 145 121 62 -56 19 229 -15 26 384 31 -34 2 -138 -10 -30 27 91
$$ packed form
4956b66N3K14J74j04k6J21j62j69M15o9j26j37L04j6m29L27j14J5j75M2J43P0
4978H5j18J2J21l08J56l4L72l50k76L91k36J29r4K23R7m37L81O0k03j25n2M27
5000B21k54j74M22K39n09j85J76Q0j9PK11o8l05k33L35J92k46rl7M6k2J58Kj5
5024A3o9j23J19q5J13L28j38j18j04J10Q4q4k17J42J78k00j0j31M85n03L00J10
5046B00j60j95L5J76L41m94L37m66K03k21K96L9k67R4n1K30o2K04l55K46j72j15
5068a57J4M29m10r7J20K90l75J09n1K27j20R6o5J11l01R9K31k54R4j29K7J62r0
5091d0R8P1p5r2K42M7j37k90J2L24j61k9J28n1K22j64j4P3j2l33l1L24ln8K34
5116B85k36O9k2l21K12n4J7J95k4n9j18P5K10k44M1L58l53o5L6j40J28k0N7O4
$$ plain form
5140 91 -136 -62 122 184 134 -41 -203 -155 130 -323 244 225 -91 -107 -188 297 -109 135 -113 -50 167 236 330 -140
5164 -140 135 -34 140 -37 -33 124 -1 -162 120 -132 -187 77 -9 128 157 -14 -76 145 5 -169 -143 -118 -6
5187 -6 8 153 -125 -207 -98 -12 338 -111 -124 -157 -101 33 -209 133 -234 -57 28 47 29 -212 -110 27 171 114
5211 114 -236 27 292 -167 -50 -66 -71 -176 88 -17 -6 128 -63 -184 -115 -24 163 225 -355 141 66 -81 37
5234 37 -280 -46 -181 -158 4 111 -302 160 20 -12 58 138 -90 -61 65 33 -15 -95 93 -140 -44 -79 193 -138
5258 -138 -56 -90 22 129 -86 111 88 -44 -61 93 103 -93 -104 74 -222 340 106 -18 108 -55 183 -21
5280 -21 -111 -194 -26 311 -227 -71 9 350 -244 -142 103 95 16 -84 -92 220 178 -30 -142 44 205 -87 27
5303 27 284 -107 -55 -58 -41 -141 -122 68 -83 91 -102 -263 -63 24 181 113 -34 -70 76 -48 -116 -25 -181 -103
$$ packed form
5140I1k27P4J84O2n0j75j62M8K85m53N67j9l16j6q1M85m06K44k48O3K17O9R4m70
5164a40K75j69J74j77MJ57j25j61K82k52n5K64q6J37K9j71o2K21j40j74K6K5J12
5187fJ4J45k78q2J09Q6L50m49j3l3N6J34k42L42l67J77Q5J9j8k41J02J37J44n7
5211A14l50K63K65m59J17j6nj05K64j05J1J34j91j21O9R1J87O2n80M96p5j47J18
5234C7l17K34j35K3J62J07m13M62j40l2P0Q0k28K9J26l2m8q0J88k33R6l5K72l31
5258a38Q2l4J12J07k15J97k3j32j7J54J0j96j1J78k96N62k34j24J26j63K38k04
5280b1r0q3J68L37n38J56Q0L41n94J02K45qp9j00qL12m2k08j12J86J61k92J14
5303B7K57l91N2lJ7j00J9J90j51J74j93j61K00Q7J57o8j47l6J46j24o8R1j56P8
$$ plain form
5327 -103 36 -19 141 179 172 51 -13 32 -211 165 -251 204 186 124 93 23 -75 -257 82 -272 15 -10 169 -133
5351 -133 151 73 93 22 106 0 72 -44 -89 183 16 76 -13 -1 -3 -2 -78 133 -155 -177 136 -129 33 68 171
5376 171 129 -167 -166 -24 -106 -268 254 124 -47 193 40 144 135 216 -55 -95 -77 42 -22 -61 15 -347 -195 -9
5400 -9 159 -188 -208 0 -127 -66 -16 183 -204 285 108 -17 108 4 -26 27 176 -14 -84 -46 -96 -2 10 -137
5424 -137 301 91 -55 74 -213 -63 268 250 148 -14 -45 -28 -159 -168 -213 5 -272 -26 -285 91 -117 -140
5446 -140 13 259 27 -24 -18 -5 -27 -28 202 -20 -182 109 -37 2 -64 -31 159 212 31 -91 46 101 -89 -101
5470 -101 250 -33 5 -122 78 17 39 -128 54 -185 72 -323 234 -303 136 44 -229 121 148 46 -24 280
5492 280 79 185 -10 -191 42 -32 -111 -80 183 135 31 80 -32 16 3 150 -25 305 -25 137 -179 -81 -1
$$ packed form
5327a03J39n5J60L8pj21o4M5k43L76m16M55j8o2l1p0r8j82L39l54K87k5J79l02
5351a33K84p8K0p1Q4j06P2j16m5K72j67O0q9J2kJp6K11k88k2L13k65J62L5J03
5376A71m2k96JJ42q2j62N22j30j71K40j53J04rQ1k71m0J8J19o4l9P6l62J52J86
5400iJ68l47k0K08j27O1N0J99l87M89j77j25J25j04l0N3J49j90p0L8n0R4J2j47
5424a37M38k10j46J29k87J50L31j8j02j62l1J7j31rm5K18k77K46k59L76k08k3
5446a40J53K46k32n1OJ3k2jK30k22j62K91j46L9o6L3J90N3j81j22J37N5j90j2
5470a01L51k83L8j27K00o1K2j67J82k39K57l95N57n37M39r2k73L50K7j02p0L04
5492B80k01J06j95j81K33p4p9L1K63m8j04M9j12M8j3J47j75L30l30J62l16R8Q0
$$ plain form
5515 -1 -236 67 20 -12 -50 -153 -209 -89 -91 118 -87 0 -4 56 161 203 12 27 -254 -306 -29 -146 232 -69 257
5540 257 29 -144 147 -91 392 100 -45 45 -177 -216 141 171 207 103 -77 64 123 -4 68 -35 -279 114
5562 114 68 175 63 25 134 -355 57 -62 23 13 45 124 -43 -59 -156 -179 46 21 161 89 51 34 5 -121 -272
5587 -272 -37 -6 -122 21 -11 -39 32 124 348 -84 145 -64 -163 1 58 -25 117 22 -189 -178 -39 -18 -283 18
5611 18 112 0 196 63 -119 185 -176 78 166 -248 125 137 6 -132 -51 -15 209 -5 -161 -113 -257 90
5633 90 148 -83 -147 82 -201 33 -130 -289 -3 -97 46 230 261 7 17 53 95 -86 288 4 30 159 -11
5656 -11 -58 28 -64 -241 -73 93 95 60 127 237 -95 -43 0 -28 200 57 86 131 -37 -15 86 -80 118 -440 166
5681 166 -214 -16 140 45 93 240 135 148 161 -221 -213 -6 -70 -280 82 -6 50 -59 144 -29 -138 131 59
$$ packed form
5515ak35L03m7l2l8j03n6J20kK09k05Q7mO0J05M2j91J5k81n2K77j17L78l01L26
5540B57k28j73K91k38M83k92j45R0k22l9L57L0L6j04j80J41N9j27P2j03k44L93
5562A14m6J07j12l8J09m89M12j19Q5j0L2P9j67j6r7k3K25k5J40p2l8j7k9j26j51
5587b72K35L1j16J43l2k8P1R2K24m32K29k09r9J64N7q3J42r5k11J1J39K1k65L01
5611A8R4j12J96j33j82L04l61K54Q8m14L73J2j31j38Q1L6K24k14j56M8j44L47
5633I0N8k31o4K29k83K34j63j59K86r4J43J84L1k54J0L6M2j81L74k84K6J29j70
5656a1m7Q6r2j77J68J66Kl5O7J10l32N2M3k8K28j43K9M5j68K2J01j66J98n58O06
5681A66l80J98J56r5M8J47j05J3J3l82QK07o4k10L62q8N6j09K03j73j09K69p2
$$ plain form
5704 59 -163 -2 -52 -6 -38 -84 -183 244 -82 160 -47 9 -222 -75 -32 -44 -44 110 132 17 -28 152 -137 -202 59
5729 59 -224 96 41 -109 -85 39 17 41 37 169 52 118 -65 74 -26 126 39 -119 44 39 -35 91 0 228
$$ packed form
5704E9k22J61n0M6l2m6r9M27l26K42k07N6k31J47M3j2%J54K2j15m5J80k89o5K61
5729E9k83L20n5j50K4J24k2K4mJ32j17O6j83J39j00J52q7j58J63np4J26r1K28
$$ [...]
8191b5
##END NTUPLES=NMR FID
##END=
