##TITLE=1H_SR159_oil_k
 CDCl3
 32 sc, 
 16.1.2023
##JCAMPDX= 6.0         $$ Bruker NMR JCAMP-DX V2.0
##DATA TYPE= NMR FID
##DATA CLASS= NTUPLES
##ORIGIN= UXNMR, Bruker Analytische Messtechnik GmbH
##OWNER= root
$$ XWIN-NMR		Version 3.5
$$ Mon Jan 16 15:37:55 2023 Russian Standard Time (UT+4h)  she@DPX200
##.OBSERVE FREQUENCY= 200.13135
##.OBSERVE NUCLEUS= ^1H
##.DELAY= (6, 6)
##.ACQUISITION MODE= SIMULTANEOUS
##.ACQUISITION SCHEME= undefined
##.AVERAGES= 8
##.DIGITISER RES= 18
##SPECTROMETER/DATA SYSTEM= spect
##.PULSE SEQUENCE= zg30
##.SOLVENT NAME= CDCl3
##.SHIFT REFERENCE= (INTERNAL, CDCl3, 0, 15.7039)
##AUDIT TRAIL= $$ (NUMBER, WHEN, WHO, WHERE, WHAT)
$$ ##TITLE= Audit trail, XWIN-NMR		Version 3.5
$$ ##JCAMPDX= 5.01
$$ ##ORIGIN= Bruker BioSpin GmbH
$$ ##OWNER= she
$$ F:/spectra/data/she/nmr/H-F/1/audita.txt
$$ ##AUDIT TRAIL=  $$ (NUMBER, WHEN, WHO, WHERE, WHAT)
(   1,<2023-01-16 15:37:01.76 +0400>,<she>,<DPX200>,
      <created by zg, POWCHK disabled, PULCHK disabled
       configuration hash MD5:
       00 E9 B6 7A A2 85 ED C7 34 08 36 98 17 FE 4E 26
       data hash MD5: 16K
       88 52 4F B5 CC 4C 07 00 82 75 CC E4 E6 FA 06 B7>)
$$ ##END=
$$ 
$$ hash MD5
$$ DC 80 A9 9F 6C AC F4 CA 80 3F 7D F4 2D 9B 50 1A
##$RELAX= 
##$RELAX= 
##$RELAX= 
##$RELAX= 
##$RELAX= 
##$RELAX= 
$$ Bruker specific parameters
$$ --------------------------
##$DU= <F:/spectra>
##$EXPNO= 1
##$NAME= <H-F>
##$PROCNO= 1
##$TYPE= <nmr>
##$USER= <she>
##$AMP= (0..31)
100 100 100 100 100 100 100 100 100 100 100 100 100 100 100 100 100 100 
100 100 100 100 100 100 100 100 100 100 100 100 100 100 
##$AQSEQ= 0
##$AQ_mod= 1
##$AUNM= <au_zg>
##$AUTOPOS= <>
##$BF1= 200.13
##$BF2= 200.13
##$BF3= 200.13
##$BF4= 200.13
##$BF5= 200.13
##$BF6= 200.13
##$BF7= 200.13
##$BF8= 200.13
##$BYTORDA= 1
##$CFDGTYP= 0
##$CFRGTYP= 5
##$CHEMSTR= <none>
##$CNST= (0..31)
1 1 145 1 1 1 1 1 1 1 1 1 1 1 1 1 1 1 1 1 1 1 1 1 1 1 1 1 1 1 1 1 
##$CPDPRG= <>
##$CPDPRG1= <>
##$CPDPRG2= <>
##$CPDPRG3= <>
##$CPDPRG4= <mlev>
##$CPDPRG5= <mlev>
##$CPDPRG6= <mlev>
##$CPDPRG7= <mlev>
##$CPDPRG8= <mlev>
##$CPDPRGB= <>
##$CPDPRGT= <>
##$D= (0..31)
0 1.2 0 0 0 0 0 0 0 0.06 0 0.03 0 0 0 0 0.0002 0 0 0 0 0 0 0 0 0 0 0 0 
0 0 0 
##$DATE= 1673869021
##$DBL= (0..7)
120 120 120 120 120 120 120 120 
##$DBP= (0..7)
150 150 150 150 150 150 150 150 
##$DBP07= 0
##$DBPNAM0= <>
##$DBPNAM1= <>
##$DBPNAM2= <>
##$DBPNAM3= <>
##$DBPNAM4= <>
##$DBPNAM5= <>
##$DBPNAM6= <>
##$DBPNAM7= <>
##$DBPOAL= (0..7)
0.5 0.5 0.5 0.5 0.5 0.5 0.5 0.5 
##$DBPOFFS= (0..7)
0 0 0 0 0 0 0 0 
##$DE= 6
##$DECBNUC= <off>
##$DECIM= 32
##$DECNUC= <off>
##$DECSTAT= 4
##$DIGMOD= 1
##$DIGTYP= 9
##$DL= (0..7)
0 120 120 120 120 120 120 120 
##$DP= (0..7)
150 150 150 150 150 150 150 150 
##$DP07= 0
##$DPNAME0= <>
##$DPNAME1= <>
##$DPNAME2= <>
##$DPNAME3= <>
##$DPNAME4= <>
##$DPNAME5= <>
##$DPNAME6= <>
##$DPNAME7= <>
##$DPOAL= (0..7)
0.5 0.5 0.5 0.5 0.5 0.5 0.5 0.5 
##$DPOFFS= (0..7)
0 0 0 0 0 0 0 0 
##$DQDMODE= 0
##$DR= 18
##$DS= 0
##$DSLIST= <SSSSSSSSSSSSSSS>
$$ [...]
##$SUBNAM2= <"">
##$SUBNAM3= <"">
##$SUBNAM4= <"">
##$SUBNAM5= <"">
##$SUBNAM6= <"">
##$SUBNAM7= <"">
##$SUBNAM8= <"">
##$SUBNAM9= <"">
##$SW= 18.05172834244
##$SWIBOX= (0..15)
0 0 2 0 0 0 0 0 0 0 0 0 0 0 0 0 
##$SW_h= 3612.71676300578
##$TD= 16384
##$TD0= 1
##$TE= 0
##$TE2= 300
##$TE3= 300
##$TEG= 300
##$TL= (0..7)
0 120 120 120 120 120 120 120 
##$TP= (0..7)
150 150 150 150 150 150 150 150 
##$TP07= 0
##$TPNAME0= <>
##$TPNAME1= <>
##$TPNAME2= <>
##$TPNAME3= <>
##$TPNAME4= <>
##$TPNAME5= <>
##$TPNAME6= <>
##$TPNAME7= <>
##$TPOAL= (0..7)
0.5 0.5 0.5 0.5 0.5 0.5 0.5 0.5 
##$TPOFFS= (0..7)
0 0 0 0 0 0 0 0 
##$TUNHIN= 0
##$TUNHOUT= 0
##$TUNXOUT= 0
##$USERA1= <user>
##$USERA2= <user>
##$USERA3= <user>
##$USERA4= <user>
##$USERA5= <user>
##$V9= 5
##$VALIST= <valist>
##$VCLIST= <CCCCCCCCCCCCCCC>
##$VD= 0
##$VDLIST= <DDDDDDDDDDDDDDD>
##$VPLIST= <PPPPPPPPPPPPPPP>
##$VTLIST= <TTTTTTTTTTTTTTT>
##$WBST= 1024
##$WBSW= 4
##$XGAIN= (0..3)
0 0 0 0 
##$XL= 0
##$YL= 0
##$YMAX_a= 128498
##$YMIN_a= -201079
##$ZGOPTNS= <>
##$ZL1= 120
##$ZL2= 120
##$ZL3= 120
##$ZL4= 120
##$ABSF1= 10
##$ABSF2= 0
##$ABSG= 5
##$ABSL= 3
##$ALPHA= 0
##$AQORDER= 0
##$ASSFAC= 0
##$ASSFACI= 0
##$ASSFACX= 0
##$ASSWID= 0
##$AUNMP= <proc_1d>
##$AZFE= 0.1
##$AZFW= 0.1
##$BCFW= 1
##$BC_mod= 2
##$BYTORDP= 1
##$COROFFS= 0
##$CY= 11.3945322036743
##$DATMOD= 1
##$DC= 2
##$DFILT= <>
##$DTYPP= 0
##$F1P= 2.36226072786647
##$F2P= -0.459571619588291
##$FCOR= 0.5
##$FTSIZE= 0
##$FT_mod= 4
##$GAMMA= 1
##$GB= 0.15
##$INTBC= 1
##$INTSCL= 1
##$ISEN= 128
##$LB= 0.24
##$LEV0= 0
##$LPBIN= 0
##$MAXI= 10000
##$MC2= 0
##$MEAN= 0
##$ME_mod= 0
##$MI= 1.114404
##$NCOEF= 0
##$NC_proc= 0
##$NLEV= 6
##$NOISF1= 3.799351
##$NOISF2= 2.8
##$NSP= 1
##$NTH_PI= 0
##$NZP= 0
##$OFFSET= 15.70392
##$PC= 1
##$PHC0= -19106.44
##$PHC1= 9.800732
##$PH_mod= 1
##$PKNL= yes
##$PPARMOD= 0
##$PSCAL= 0
##$PSIGN= 0
##$REVERSE= no
##$SF= 200.130013532006
##$SI= 16384
##$SIGF1= 3
##$SIGF2= 2
##$SINO= 400
##$SIOLD= 16384
##$SREGLST= <1H.CDCl3>
##$SSB= 0
##$STSI= 0
##$STSR= 0
##$SW_p= 3612.71676300578
##$SYMM= 0
##$S_DEV= 0
##$TDeff= 0
##$TDoff= 0
##$TI= <>
##$TILT= no
##$TM1= 0
##$TM2= 0
##$TOPLEV= 0
##$USERP1= <user>
##$USERP2= <user>
##$USERP3= <user>
##$USERP4= <user>
##$USERP5= <user>
##$WDW= 1
##$XDIM= 8192
##$YMAX_p= 0
##$YMIN_p= 0
$$ End of Bruker specific parameters
$$ ---------------------------------
##NTUPLES= NMR FID
##VAR_NAME=  TIME,          FID/REAL,        FID/IMAG
##SYMBOL=    X,             R,               I
##VAR_TYPE=  INDEPENDENT,   DEPENDENT,       DEPENDENT
##VAR_FORM=  AFFN,          ASDF,            ASDF
##VAR_DIM=   8192,          8192,            8192
##UNITS=     SECONDS,       ARBITRARY UNITS, ARBITRARY UNITS
##FACTOR=    0.0002768,     1,               1
##FIRST=     0,             0,               0
##LAST=      2.2672688,     0,               0
##MIN=       0,             -201079,         0
##MAX=       2.2672688,     128498,          0
$$ Real data points
##PAGE= N=1
##DATA TABLE= (X++(R..R)), XYDATA
$$ [...]
1776A13j75J88P6k12Q8M2j58j57K76J14k26K0J69k78l9J85J75j15n1j62J8rn4
$$ 113 -62 126 202 -10 78 120 -38 -195 81 195 -31 -11 158 -120 -159 26 201 86 35 -127 -109 -118 -172
1799a72J79k06J27j54M18q8j46o8K80m3j07K22k11j7K33l97Q1J87j23n8J45j03
$$ -172 7 -199 -72 -226 192 104 -42 -110 170 127 20 242 31 14 247 -150 -69 118 -5 -63 82 -21
1821b1p1K95k41j45J30j91J9pM7j4J61K1j24jK89k08J72l46J91J29P0O4k88K6
$$ -21 -92 203 -38 -183 -53 -244 -225 -232 -185 -199 -38 -17 -141 -142 147 -61 111 -235 -44 85 155 219 -69 -43
1845d3L2K30l70L58j75M3j72QJ21k3l12L76j34j38O3K17m9k49K4n9M17k22K13
$$ -43 -11 219 -151 207 32 75 -97 -89 32 9 -303 73 -61 -199 -136 81 32 -217 -193 -252 165 -57 156
1868A56K5k77m18O36M4j15p7k07K06L17k78N0K73k63O5k14L74l85O4p1p3J06M6
$$ 156 181 -96 -514 122 166 51 -26 -233 -27 290 12 62 335 72 137 -77 297 -88 -24 -95 -168 -62 -16
1891a6J52j52l39J74J11q2K64k9k68J95j5q5K53k09r5nJ07K19j37J28k21R0k33
$$ -16 136 -16 -355 -181 -70 -152 112 83 -185 10 -5 -90 163 -46 -141 -146 -39 180 43 171 -50 40 -193
1914a93N13j39k14O4j87j16K49O3l14L57j79j34J9J26k16L27rk93J18J56Nq8J26
$$ -193 320 181 -33 31 -156 -272 -23 40 -274 83 -96 -230 -211 -85 -301 26 17 -276 -158 -2 3 -85 41
1937D1OPjJ56k07N6N7j05r8J38k61L14l87K19R7J99j47k16l8K6n5K8O4m5o9K48
$$ 41 47 54 53 209 2 58 115 10 -88 50 -211 103 -284 -65 32 231 84 -132 -170 -144 -199 -171 -107 -152 -221 27
1963B7l49J62K07k46L7J52N6J53J6k64L25k55K88k65j44J5K61m74K87J29j62k2
$$ 27 -322 -160 47 -199 -162 -10 46 199 215 -49 276 21 309 44 -100 -85 176 -298 -11 118 -44 -66
1985f6N8r6K7K16m84K40K05k42J73KK8l03R4K30lK52k77N0L35k86k86j03M24J08
$$ -66 -8 -104 -77 139 -345 -105 100 -142 31 33 61 -242 -148 82 79 331 54 104 439 153 -133 -236 188 296
2009B96Pk74J63p7q6K96m43J11J57k61J73l5j11R1l23M03j83j41L78k88J0J71
$$ 296 303 29 192 115 29 325 -118 -7 150 -111 62 27 -84 7 -316 87 -96 -237 141 -147 -137 34
2031C4k27L50m7r0j10L14m2j34j6M07m73k86L42K14q7M6j67p3J57j60j58j65L62
$$ 34 -193 157 110 20 -90 224 182 48 32 439 -34 -320 22 236 149 195 28 -45 112 -48 -206 -371 -9
2054io4j72K65j1q4k80J58K18k07M04j36J44k68mL00Q4jk72j48L65k96JJ54J38
$$ -9 -73 -245 20 9 -75 -355 -197 21 -186 218 82 226 -42 -46 254 338 337 65 -83 282 -14 -13 141 279
2078B79l08O5N9j02N5l75K00LK33Rm96J92J46P4l07M78k38k16L48j60J29J45J29
$$ 279 -29 36 95 -7 48 -327 -127 -124 109 118 -378 -186 -40 34 -273 205 -33 -249 99 -61 68 213 342
2101C42l61J62o0k07J47P2j27j21J79J84k33K01j82k71K22k0j50J32j0j59K64
$$ 342 -19 143 83 -124 23 95 -32 -153 26 210 -23 178 -4 -275 -53 -73 -223 -91 -101 -260 4
2122DR8l31n4L40L9n1l18M96k30J74L0k42Q4K47l22j08M28l35K06k1j44n7j14
$$ 4 102 -229 -283 57 96 45 -273 223 -7 167 197 -45 39 286 -36 -144 284 -51 155 134 -10 -67 -181
2145a81J17k10L3J88k8Pj17K68Q0j42P4j96K8K05Mj76P3j01J00j18L78j63j80
$$ -181 -64 -274 -241 -53 -81 -74 -191 77 157 15 89 -107 -79 126 130 -46 27 -74 26 -92 286 123 -57
2168e7O9K1j1k01L30Mq4j51K08k03J22l2l12K13K83n08J20J85L4l2k44K10m02
$$ -57 12 33 22 -179 151 155 71 -80 128 -75 47 15 -297 -84 199 -309 -189 -4 30 -2 -246 -36 -438
2191d38M66J42l96M12N8k21n9K59p6l00K33J87l31J81j34N8k1J64j16j47O6j33
$$ -438 28 170 -226 186 244 23 -36 223 147 -153 80 267 -64 117 -17 41 20 184 68 -79 -13 -146
2213a46J01l8j7j15K59L6o4r0N9l1r9L5N0J03K08o0m24M23j6m5l75L96k46j11
$$ -146 -45 -83 -100 -215 44 80 16 -74 -15 -46 -145 -110 -60 43 251 191 -233 190 174 129 -246 150 -96 -207
2237b07L11j66Q9mJ27k67J25j13J69l80L22k81J34J1N8k34N49q2j73J9lR5k18
$$ -207 104 -62 27 23 150 -117 8 -105 64 -316 6 -275 -141 -130 -72 -306 243 161 -12 7 4 99 -119
2260a19J53J90j37n6q7K13j29j01j15K76K1j7K1j07k36K45j6l06N4o2J48J11j11
$$ -119 34 224 87 31 -56 157 28 -73 -188 88 109 92 113 6 -230 15 -1 -307 -253 -315 -167 -56 -167
2283a67J18P1j24lL60J33k63p7J38K0k69J04l34K02R2K50k94J17J89l54JJ79j70
$$ -167 -49 22 -102 -105 255 388 125 48 186 206 -63 41 -293 -91 1 251 -43 74 263 -91 -90 89 -81
2306h1J27j00K67k42j10R3Qk09K36k92L95J34m87K58J14N7q1o3J36r9j00l4J55
$$ -81 46 -54 213 -29 -139 -46 -38 -247 -11 -303 92 226 -261 -3 111 168 87 24 160 61 -39 -73 82
2329H2k20K15J15k57M01l38J19k43L26j80L3j28J5q2K75k59M07l68J1k41L73j20
$$ 82 -138 77 192 -65 336 -2 117 -126 200 20 53 -75 -60 -142 133 -126 281 -87 -76 -317 56 -64
2351f4M2K12k64K2K38k42J6J46K31k82l5J1m9J47O5j79j4k9p8N9J51M8j45j95
$$ -64 -22 190 -74 -52 186 -56 -40 106 337 55 20 31 -18 129 194 15 1 -28 -106 -47 104 152 7 -188
2375a88J84q7k30K2J35J64p5j35K15r2J17n5J35M0j59p2k0J18K08k14p2J46N2
$$ -188 -4 -91 -321 -299 -164 0 -75 -210 5 -87 30 -25 110 150 -9 -81 -101 17 225 11 -61 85 137
2398A37j46NJ79l97j57M39k09J08J0j3Q9j43Lj1j85K85J47m4p8K2j0P1k76LK78
$$ 137 -9 -4 175 -222 -379 60 -149 -41 -31 -44 45 -98 -95 -106 -291 -6 141 97 19 41 31 102 -174 -171 107
2423A07j97K54N9m5j37L9j6p8K65l78j8M73n26K09m1J98j44k27p5K08M4k62K49
$$ 107 -90 164 223 178 41 80 64 -14 251 -127 -145 328 -198 11 -30 168 24 -203 -278 -70 -26 -288 -39
2446c9JP1p3j90K77k06P5O8J06r5O1M1M3o8m9m5J90M0k7j25m2p1J34J55j73k20
$$ -39 -38 33 -40 -230 47 -159 -84 -16 90 -5 56 97 140 72 23 -22 168 208 181 56 14 -57 77 232 59 -161
2472a61R9N8j68K82j32m38L84p1K18j3N2j58j00O5J87j84J12n2R2m6J98Nj39l63
$$ -161 -62 -4 -172 110 -22 -460 -76 -147 71 58 110 -48 -148 -83 104 -80 32 -20 72 26 224 229 90 -273
2496b73Q4K53m8j65J16j22K06j60n5K98k89O08m62k47K41j06J31qJ10j27Q5j11
$$ -273 -189 64 16 -149 -33 -155 51 -109 -164 134 -155 453 -9 -256 -15 -121 10 2 112 -15 70 -41
2518d1j46K42j36q2J46J09J9o5J25j40j23K10R0j83J81m55J63l09N14k69K2L8
$$ -41 -187 55 -81 -163 -17 92 111 46 171 31 -92 118 208 25 206 -249 -86 -395 119 -150 -128 -90
2540i0J46o4p2l8K05k97J84J03jR5j57J26j31mj28m0K22K9PK8J05k42J53J4j20
$$ -90 56 -8 -80 -118 87 -210 -26 77 76 171 14 140 9 5 -123 -163 59 88 95 123 228 -14 139 153 33
2565C3q2L3J02p5J3j64R9J35j04j32J22J57j45l1o9P5Q4O2j89J67j15R7k16K72
$$ 33 -49 -16 86 11 24 -140 -41 94 -10 -142 -20 137 -8 -39 -108 -33 51 113 -76 91 -24 73 -143 129
2589A29o0n3j37N2R6J7l7n1O2L7r5j79K15j2n2J55p4n5k28M16m07J82r0K78k06
$$ 129 69 16 -121 -69 27 44 7 -44 18 55 -40 -219 -4 -16 -68 87 13 -42 -270 146 -261 -79 -169 109 -97
2614i7J84L3r6N4j25K44L0m0K43m75k18J61j9K8J85j07k08J38j3K60m59L97L2
$$ -97 87 120 24 78 -47 197 227 187 430 -45 -263 -102 -121 -93 92 -15 -223 -85 -98 162 -297 100 132
2637A32k6j61K41k57J20k0l00K48K01J30k22N4J38k29k42J62J7R3j93J61Kk42
$$ 132 106 -55 186 -71 49 29 -271 -23 178 308 86 140 278 49 -193 -31 -14 79 -114 47 49 -193
2659a93K87L9r3RLj77Q9RR5o2n0Q8r6j38K89j28j62J77j62L05k86K53k16L17k71
$$ -193 94 133 40 49 52 -125 -36 -27 68 6 -44 44 -52 -190 99 -29 -191 -14 -176 129 -157 96 -120 197 -74
2684g4K21k24M9rj02M3k3m0O5R0O6O3k12L7J13Q4j55m1j12N4j56K32L5j9L01m04
$$ -74 147 -77 -28 -37 -139 -96 -119 -159 -94 -4 62 125 -87 -50 63 147 -8 -49 -161 -107 -263 -31 4 -15 286 -118
2710a18K33k29K69J7k74pQ4M1L0j64KR7N3J3K79m09J23r5Q2l46N67j18k59J12
$$ -118 115 -114 155 172 -102 -109 -25 16 46 -118 -116 -19 34 47 326 -83 40 -55 27 -319 248 130 -129 -17
2734a7L3k11k5K84j46K89j64j43K7J73o4j18L5L07l91j8l9L56k63j4l5K27q7O4
$$ -17 16 -195 -220 64 -82 207 43 -100 -73 100 36 -82 -47 260 -131 -149 -188 168 -95 -109 -144 83 -4 60
2758F0J10j71j19K94j82l61K80k0O8K11j90K56k71J00j74nL80l46K72o8j05N3
$$ 60 170 -1 -120 174 -8 -369 -89 -109 -41 170 -20 236 -35 65 -109 -114 266 -80 192 124 19 72
2780G2p9n1J16J39j78j77L47K6j06K3J88n50K21J8l07J94R9K42k40M3r4O7k26
$$ 72 -7 -58 58 197 19 -158 189 215 109 132 320 -230 -9 9 -298 -104 -5 237 -3 40 -54 13 -213
2803b13K68J46k09K26n05J11L80L9k13N5j90J32O2N3m04N43l69J7J98k00M0J30
$$ -213 55 201 -8 218 -287 -176 204 243 30 85 -105 27 89 142 -262 281 -88 -71 127 -73 -33 97
2825I7j49j66M75k92J15j10j94J17l13K32M13m65j36M26R2j57p0N6J47k70J37
$$ 97 -52 -218 257 -35 80 -30 -224 -107 -420 -188 225 -240 -376 50 142 -15 -85 -29 118 -152 -15
2846a5p5J92j88J47R3l09M16r9k75l7K18J41m34J20K77J91l94J5j84J68j70L32
$$ -15 -90 102 -86 61 154 -155 261 162 -113 -150 68 209 -225 -105 172 363 -31 -16 -200 -32 -202 130
2868A30q9o3n4M64o32J34K08j55J97k54N24m04K15j59j6n8n5O0p8l5p4J42LK23
$$ 130 41 -22 -76 388 -244 -110 98 -57 140 -114 410 6 221 62 46 -12 -67 -7 -85 -120 -194 -52 -49 174
2892A74k06L14l22k82K31q0K78r4K17l31J37k51L81k63j29M82m9Q8j57j76m8o7
$$ 174 -32 282 -40 -322 -91 -171 107 13 230 -101 36 -215 166 -97 -226 256 207 295 138 -38 -86 -153
2914a53K18j2k42K35l2j96m2M12l64K1L34p1K07l87j64N77l05r3Q0k15L38k08
$$ -153 65 53 -189 46 14 -182 -224 188 -176 -155 179 108 315 -72 -236 341 36 -57 23 -192 146 -62
2936f2M6J46k10J53q3j95L72l56J65j60L51m3k41P2p5NJ60m0r3J61k89K29j37
$$ -62 -16 130 -80 73 -10 -205 167 -189 -24 -184 167 124 -117 -45 -120 -115 45 5 -88 73 -216 13 -124
2959a24n0N6M7k8L8j10R6K09k88J59N2j54Q8J87k61J59l5j60P0K09j51K5l3j99
$$ -124 -174 -118 -71 -99 -61 -171 -75 134 -154 5 57 -97 -9 178 -83 76 41 -119 -49 160 9 34 1 -198
2983a98J15J24m9J18j41p8j62J24J14K15k38J72J9m14L23j37R5j47J14m7K11r4
$$ -198 -83 41 -8 110 -31 -109 -271 -147 -33 182 -56 116 135 -279 44 -93 2 -145 -31 -78 133 39
3005C9k9Q8o8j05j9J98j24K40k21K23m42J00no2J63Rj3KK50k02j21QM18j42m35
$$ 39 10 98 30 -75 -94 104 -20 220 -1 222 -220 -120 -125 -187 -24 -15 -28 -26 224 22 -99 -91 327 185 -250
3030b50K48j55K41J53j58M7J32k54K48j83j24K10K7j03j14QL0M5j74L1K18j54
$$ -250 -2 -157 84 237 79 126 258 4 252 69 -55 155 182 79 -35 -27 3 48 -126 -95 123 -31
3052c1J58l46M07Q2k24j06L1O9j47n3l2K49j10J35p4J12k22K23j06n5J17j80J53
$$ -31 127 -219 188 270 46 -60 -29 40 -107 -160 -192 57 -53 82 8 120 -102 121 15 -40 77 -103 50
3075E0j41K51j20L0j65Q9l8no3k4J21j3k20J61J60J81j83K04m45J81P9J8k20N1
$$ 50 -91 160 40 70 -95 -6 -44 -49 -112 -136 -15 -28 -248 -87 73 254 71 275 -170 11 90 108 -112 -61
3099f1K28l24K9J17N5k34J91Pj39K72l8N6k12J94k26L5J65l16K70J0n1J18l30
$$ -61 167 -157 -128 -11 44 -190 1 8 -131 141 103 159 -53 141 -85 -50 115 -201 69 79 28 146 -184
3122a84J21J7K1R1l84K59J03k5j62K26q0j39L51l10J71Ql1J1r6L6L9r4N4K72l88
$$ -184 -63 -46 -25 66 -318 -59 44 19 -143 83 3 -136 215 -95 76 84 53 64 -32 4 43 -51 3 275 -113
3147a13o4M76l36N6j19K08k69m0K57Jj42J00q1J49N2l7l15K52q3J33j43r3l0j
$$ -113 -177 299 -37 19 -100 108 -161 -201 56 57 -85 15 -66 83 135 98 -217 35 -48 85 -58 -151 -181 -182
3171a82K62L1q5J8M7k44J08Q5j2O7k07L54m21K30J16m88L56j27J47j2j02K09k44
$$ -182 80 111 26 44 91 -153 -45 40 28 95 -112 242 -179 51 167 -321 35 -92 55 43 -59 150 -94
3194i4J24l42J85K26j87J05O7k02J30L1j26O0p2J60J3j14J12k15J47o9j32k9J79
$$ -94 30 -312 -127 99 -88 17 84 -118 12 43 -83 -23 -95 65 78 -36 76 -139 8 -61 -193 -222 -43
3217d3R4p0J06n6P3q3L6j21JJ76j56J70k61O0q8K60P7j88R7k9Q1r9j08Q0j59L1
$$ -43 51 -19 87 31 104 21 57 -64 -63 113 -43 127 -134 -74 -162 98 175 -13 84 55 136 37 -71 9 -150 -119
3243a19J41K15k94K00k2j66J06N3j81J28L7k72K81j54P4N1m8j24JM8o4L13m34
$$ -119 22 237 -57 143 121 -45 61 114 -67 61 98 -174 107 -47 27 78 30 -94 -93 -45 -109 204 -230
3266b30L44J06k88L09k63O0p8J09k82K80p7j65O3J94J10j38k3l71L67K33p5l12
$$ -230 114 220 -68 241 -22 38 -40 69 -213 67 -10 -175 -112 82 192 54 31 -340 27 260 185 -127
3288a27p2J38M00l41J19Nq8j38n6J05j99J65M0m2K20j06o8n6p0J69M2j14J03k11
$$ -127 -199 -61 339 -2 117 122 34 -104 -160 -55 -254 -89 -49 -91 129 23 -45 -101 -171 -2 40 -74 29 -182
3312a82K28k33M46j94Mj72r6K03j65M01k37M9j83J47K92l82J81j65L9M05n25J94
$$ -182 46 -187 259 65 69 -103 -199 4 -161 240 3 52 -131 16 308 -74 107 -58 -19 386 -139 55
3334E5k20K05k34K88k38j1L62j2k5qk77RL30r9k47K31n1r3J82l68L44Q7j37k21
$$ 55 -165 40 -194 94 -144 -155 207 195 170 162 -115 -106 224 125 -122 109 58 -35 147 -221 123 210 73 -148
3358a48L80m38L26k74Q7L00m35J69K7q9J0j21K41j05P0J92k54P3J64k06M7j97
$$ -148 232 -206 120 -154 -67 233 -202 -33 -6 -95 -85 -206 35 -70 0 192 -62 11 175 -31 16 -181
3380a81K90kL7l15J14K1N5j1J33n2l97N37k72Q8j05j11R0K86j3k95j79K54K4j23
$$ -181 109 107 144 -171 -57 -36 19 8 141 89 -308 229 -43 45 -60 -171 -81 205 192 -103 -282 -28 -4 -127
3404a27J23K05j28j7j25J22L7j17K36m01K19Q0k22J91M8o3l09K66r2J8j53K15
$$ -127 -4 201 73 56 -69 53 90 -27 209 -192 27 107 -115 76 124 61 -248 18 -74 -56 -209 6
3426Fj53M69m44Q4r3K34k10J53k09J39J85k78J39l75J21M42k01J7J55k92J00J73
$$ 6 -147 322 -122 -38 -131 103 -107 46 -163 -24 161 -117 22 -353 -232 210 9 26 181 -111 -11 162
3448A62J37l61Q7K7j12o6J51k21M4J29j21K62q0k58K25O3K2k65J27L09l64J32
$$ 162 299 -62 25 52 -60 -126 25 -196 -152 -23 -144 118 38 -220 5 68 90 -175 -48 261 -103 29
3470B9j91K65o1n5J68m0m60J87Q8O3k2j58Q3j31M16j85J21l26J10K38n8j59K48
$$ 29 -162 103 42 -13 155 115 -345 -158 -70 -7 -29 -187 -104 -235 181 -4 117 -209 -99 139 81 -78 170
3493A70j20J82k00k18O8M03j25j94j54J98M4O3K94q0k06k09J27J47l76J38N6j43
$$ 170 50 232 32 -186 -118 285 160 -34 -188 10 54 117 411 331 125 -84 43 190 -186 -48 8 -135
3515a35J37JJ50l7M3j72ljJ63j82M1Q3j75J10oj81J88k5J9j14J77J04l9J7j27
$$ -135 2 3 153 116 159 -13 -16 -17 146 -36 5 88 -87 23 17 -164 24 -1 18 -96 81 185 146 163 36
3540C6j66n9K30qpK97j63j56R8k28J97j82K16j43M1P7j2j33K82k93L35m11K29
$$ 36 -130 -189 41 33 26 323 160 4 102 -126 71 -111 105 -38 3 80 68 -65 217 -76 259 -152 77
3563G7j85K6L0k8J87r3M1r0K29l31M08k67L0j31J53Q9k01j19R9J71J51j54o3K48
$$ 77 -108 -82 -52 -80 107 14 55 -35 194 -137 271 4 34 -97 56 145 -56 -175 -76 95 246 92 29 277
3587B77j34Kj54k7R3J65j88P8k26P8j6o2K10k53L1K08l69L40m0N6j79O4J7J2J65
$$ 277 143 145 -9 -36 57 222 34 112 -114 -36 -52 -114 96 -157 -126 82 -287 53 13 69 -110 -46 -29 -17 148
3612A48o5m5K3JJ5j46K48j25L1K4J30j21p2j79L47jj54j03K5j69J63k13M15k42
$$ 148 83 38 61 62 77 -69 179 54 85 109 239 118 46 -133 214 213 59 -44 -19 -188 -25 -238 177 -65
3636f5J92j29K8j28kJ7L25j27j14K69O4j43k99rK83jj44o8K0j52m8L15j04lq4
$$ -65 127 -2 26 -102 -104 -87 238 111 -3 266 330 187 -112 -121 162 161 17 -51 -31 -183 -231 84 -20 -23 -107
3661a07J05n0Q7j20k2L42m11k5K56k40K86j45j47lJ23L7J37p0j52k01K63K05n4
$$ -107 -2 -52 35 -85 -107 235 -176 -201 55 -185 101 -44 -191 -194 -71 -34 103 33 -119 -320 -57 148 94
3684I4l9J22m49L14N0l18M07r0q4m2J47k32K26m9r5q2K10q1P6j69q4R2J12N1j98
$$ 94 55 177 -272 42 92 -226 181 91 7 -35 112 -120 106 57 -38 -120 90 9 85 -84 -168 -76 36 87 -111
3709a11J86j40M59l70l2P9n7Rll0j07N33k44k26j36K54OK14m42M7l3K25k18J0
$$ -111 75 -65 394 24 -8 71 14 23 20 -10 -117 416 172 -54 -190 64 70 284 -158 -111 -144 81 -137 -127
3733a27K34K25l90j24K77J0j35o4N0Q9j5j15n9K41Lpn4M5L2j60J66j13K73k87
$$ -127 107 332 -58 -182 95 105 -30 -94 -44 45 30 -85 -144 97 100 93 39 84 116 -44 122 9 282 -5
3757eJ68j64j43K5J10j5j49J21O6L9J6Ok47J14k48K47K71l22J89J35j90p0m8r1
$$ -5 163 -1 -144 -119 -9 -24 -173 -52 14 53 69 75 -172 -58 -306 -59 212 -110 79 214 24 -46 -94 -185
3781a85j7J98J21P9k41j52J71q3J09J30j09j02q2K17l1j1j6j01O7L8j21J58q6
$$ -185 -202 -4 117 196 -45 -197 -26 -109 0 130 21 -81 -163 54 23 12 -4 -105 -38 0 -121 37 -49
3804d9j2j60K13K18l13J30K3J47k39J44k49L3P6q5K72k98J82j71J29o4j88J21
$$ -49 -61 -221 -8 210 -103 27 50 197 -42 102 -147 -114 -38 -123 149 -149 33 -138 -9 -73 -261 -140
3826a40N2p5J75j39K11k09K26L7q3J65l69J99O0pk28J83r2K32k72Q5J92k60j14
$$ -140 -88 -163 12 -127 84 -125 101 138 55 220 -149 50 110 103 -125 58 -34 198 -74 11 203 -57 -171
3849a71L99o1q7p0p9p1K14R4m02J97O1K32l1L4k65j2K89l70j48L61m50L15J83
$$ -171 228 167 80 10 -69 -140 74 168 -234 -37 24 256 225 259 -6 -18 271 -99 -247 114 -336 -21 162
3872A62n5n1k04N2K70j55j56J81k48M54k85j46J85k39J67J11p4Q7j00Mr1J03K3
$$ 162 107 56 -148 -96 174 19 -137 44 -204 250 -35 -181 4 -235 -68 43 -31 56 -44 -40 -131 -28 -5
3895eJ46k28J32J02j6j71o0k7m8R1p1J37J41l58N03j41k26J06n7K86l07K8k3j12
$$ -5 141 -87 45 147 131 -40 -100 -127 -175 -84 -155 -18 123 -235 268 127 -99 7 -50 236 -71 -43 -66 -178
3919a78K42j32r5R4M8j07o5J36j18J92j31J2N4J00r0k71K29J80j68J81k02q7R6
$$ -178 64 -68 -163 -69 -21 -128 -193 -57 -175 17 -114 -102 -48 52 -38 -309 -80 100 -68 113 -89 -176 -80
3942h0K01K2k13j2K03l72J94j51J87P4j20L14k46J43jk78K6p5K48J04k98K43p1
$$ -80 121 143 -70 -82 121 -251 -57 -208 -21 53 -67 247 1 144 143 -135 -109 -184 64 168 -130 113 42
3965D2J26L5r8k65J77j08J07l17J06K63J69k95j35J1K24P1q9j7k0R3O6k58J9q9
$$ 42 168 203 105 -160 17 -91 16 -301 -195 68 237 -58 -193 -182 42 113 24 7 -13 80 146 -112 -93 -182
3989a82J85J35k89K75J06l50K52p2O2j95q5J68J76l16J80k34K21L7j27J96j12
$$ -182 3 138 -151 124 230 -120 132 60 122 -73 -158 10 186 -130 50 -184 37 74 -53 143 31
4010C1L3L2j94J72N9j35J27j74l7n9J64l9k4N3r7J06J57kj32j14O7K5KR0j44k78
$$ 31 64 96 -98 74 133 -2 125 -49 -86 -145 19 -20 -44 9 -88 18 175 173 41 -73 -6 19 21 111 -33 -311
4036c11L89K36p4j48j37P2J89l95K10J7r4J28j48J47o1j98K05j29J92j69R2L5
$$ -311 78 314 240 92 -45 27 216 -179 31 48 -46 82 -66 81 20 -178 27 -102 90 -79 13 48
4058D8j97k2K17p0J85qj67k33L42j8Jj20j63J65j3lK32j62L8j05P4o7J81j02l1
$$ 48 -149 -171 46 -24 161 153 -14 -247 95 77 78 -42 -205 -40 -53 -56 176 14 52 -53 21 -46 135 33 2
4083Bj22J89j20K01k64J70l39K51k1J10q9M6J52l25J89P6l8k67Q5J23Q5j93N2
$$ 2 -120 69 -51 150 -114 56 -283 -32 -53 57 -32 14 166 -159 30 106 68 -199 -114 9 94 -99 -47
4106d7J25j8L0j0l64L52J2P0j44J18J13m28K17j69P1J0j50L04P1k02M9L7k71J60
$$ -47 78 60 90 80 -284 68 80 150 6 124 237 -191 26 -143 -72 -62 -212 92 163 -39 10 47 -224 -64
4130f4J23K13k85N9j65l2j4M32l07r9K28k86N0J70r5J58j50J19N9nK0rQ7l45l4
$$ -64 59 272 -13 46 -119 -151 -165 267 -40 -139 89 -197 -147 23 -72 86 -64 55 114 109 129 120 207 -138 -172
4155a72K21J02j60k9k0q7M3J94j49R5L5k16K63l92L47p2J33J16l71J7K70r9n6
$$ -172 49 151 -9 -38 -58 -145 -102 92 -57 38 73 -143 120 -272 75 3 136 252 -119 -102 168 69 13
4178A3r3L2p6Q5K64l10J07k05J59j8J38n8n7J34k59M05o4k9q9j81j1P9k13L55
$$ 13 -80 -48 -124 -39 225 -85 22 -183 -24 -42 96 38 -19 115 -144 261 197 168 79 -102 -113 -34 -247 108
4202A08J00k33q2M6O3Kk83K83m1K38r0j48K03k49K17j37J53j02K48k25q4k27L85
$$ 108 208 -25 -107 -61 2 4 -279 4 -37 201 111 -37 166 -83 134 -3 150 48 296 71 -13 -240 145
4225A45n3j3m4k21J83L3K28k0j78o5K01j94J0O3j71O6P0L8o6M4k66K28o9J47j2
$$ 145 92 79 35 -186 -3 30 258 238 60 -5 196 2 12 75 -96 -30 40 78 12 56 -210 18 -51 96 84
4250H4k79K14K89J0m27K21j1j65L7K21L01n20J12j38l9J43j15K41j59K7q2j8J7
$$ 84 -195 19 308 318 -109 112 101 -64 -27 194 495 -25 87 -51 -90 53 -62 179 20 47 -35 -53 -36
4273c6L7r5P7j78J21J15l2k5o0K8q4L08l6k38J49o5J04r3K8P3LJ24k08R3k26J03
$$ -36 1 -94 -17 -195 -74 41 9 -16 -76 -48 -132 176 140 -98 51 -14 90 -3 25 98 101 225 17 110 -116 -13
4299a3K6j4j50R6K5P5m29M56P9q3m3j0K1n3N8k44K86k9L5kk73k3N3J18Q1p4R9
$$ -13 13 -1 -151 -55 -30 45 -384 72 151 68 25 15 36 -17 41 -203 83 54 89 87 -186 -209 -156 -38 43 -31 68
4326F8j40o7P4j9L39l72Q2J45j38L05l62J83o8l4N1q5k26L30J33k84j19K13J66
$$ 68 -72 -139 -65 -84 255 -117 -35 110 -28 277 -85 98 30 -4 47 -38 -264 66 199 -85 -204 9 175
4349A75k94n7K59l0q5J67j7Q7j30J15k07O7J08j25M7J3l06K42r1P5P5l34m5K09
$$ 175 -119 -176 83 53 -32 135 118 205 75 190 -17 50 158 33 80 93 -213 29 -62 13 88 -246 -291 -82
4373h2K70k80J15M0J80k92O9J38l05J42j60L37j55Q0J16j21n9j44Q7J43l65J31
$$ -82 188 -92 23 63 243 -49 20 158 -147 -5 -165 172 17 97 213 92 33 -111 -24 119 -246 -115
4395a15p7K19j83J07K81k55L1L44l58j04j0J64p6L04n82M55j03N6k89K15p4m7
$$ -115 -192 27 -156 -49 232 -23 8 352 -6 -110 -120 44 -32 272 -310 145 42 98 -191 24 -50 -97
4417i7K29O9k17k8Q3P7j34k57L89j73p9R1J49N1LJ12k18R8r8l04L20j39L11q9
$$ -97 132 201 -16 -44 39 116 -18 -275 114 -59 -138 -47 102 153 156 268 50 148 50 -254 66 -73 238 149
4441A49j07j66J87Q6j75k0O8N2J0l24K51k5k28L30j81J88j14n4p6J5K52Q0k14
$$ 149 42 -124 63 149 -26 -46 22 74 84 -240 11 -14 -242 88 -93 95 -19 -73 -149 -134 118 198 -16
4464a6J09l44L63Q0m57K62j76K64K9j39K09k36j30J88j55J60j5L5o4J8P3l77K92
$$ -16 93 -251 112 192 -265 -3 -179 85 114 -25 184 -52 -182 6 -149 11 -4 31 -33 -15 58 -319 -27
4487b7J32k71J93j7o7m4mQ3j3K62k80J74r5njn5O6P6Q2Jj79o2J77Q1l00N7P4p4
$$ -27 105 -166 27 10 -57 -101 -105 -22 -35 227 -53 121 26 21 20 -35 31 107 189 190 11 -51 126 207 -93 -36 38 -36
4515c6rn3J7J99J14l50R6R0n9k7j61K85k13q8J30Nm2K02j80R3J59j87p1L25l43
$$ -36 -45 -98 -81 118 232 -118 -22 68 9 -18 -179 106 -107 -195 -65 -60 -102 100 -80 13 172 -15 -86 239 -104
4540a04J69n0m5J52p2l19M76j59j13J57KQ5k30L95l88j74K41J21j20j58J37J29
$$ -104 65 15 -30 122 50 -269 207 48 -65 92 94 179 -51 344 -44 -218 23 144 24 -134 3 132
4562A32l03Q1k5j12K50J54j54P1l5j58L20k52j51K12j03J72Mj27K35k28l13K47
$$ 132 -171 -90 -115 -227 23 177 23 94 59 -99 221 -31 -182 30 -73 99 103 -24 211 -17 -330 -83
4584h3J9J97k91K00J8K6m9k18k1K48K10l18n2L3K46j39k46L8K26J47j10P5k05
$$ -83 -64 133 -158 42 60 86 37 -181 -202 46 256 -62 -114 -81 165 26 -220 -182 44 191 81 156 -49
4607d9J95k81Oq7O0J25n8P4J22j28m1R4m2j65K59k54K22j3M2k7k60K1J77Q8j1
$$ -49 146 -135 -129 -216 -156 -31 -89 -15 107 -21 -62 32 -10 -175 84 -170 52 39 81 54 -206 -185 -8 80 69
4632F9o8p6L8J03j81J84J3j32R5l31L55l3p5L1J16J31j33l52J99J96m5k5j16J87
$$ 69 1 -75 -37 66 -115 69 82 -50 45 -286 69 36 -39 -8 108 239 106 -246 -47 149 104 79 -37 150
4656A50k79k0J46l18M46j16o7K34j73p6rm0K08r2j76K06M5j13q7n2J51j82j17
$$ 150 -129 -149 -3 -321 125 9 -58 176 3 -73 -82 -122 86 -6 -182 24 69 -44 -131 -183 -32 -214 -331
4679c31K42n0L00p2rn7O6j53J39R6k02kkj02J78k95P4j1q6N12k73N8M1J15l83
$$ -331 -89 -139 161 89 80 23 89 -64 75 171 -31 -33 -35 -137 41 -254 -180 -191 -277 235 -38 20 61 176 -207
4704b07r5L53o4Q7l46J01J68M4J18j62j08J81j39j31K79j98K03n5M3l64K15P9
$$ -207 -302 51 -13 74 -272 -171 -3 41 159 -3 -111 70 -69 -200 79 -119 84 29 72 -292 -77 2
4726Bp6K66J3k47OJ67k59L4J64K58m72Q0j1K27q4j38K4O1J12n2j50K11k56ML5
$$ 2 -74 192 205 -42 -36 131 -128 -94 70 328 -144 -64 -75 152 68 -70 -46 15 127 75 -75 136 -120 -116 -81
4751h1J36K41l02J16j07k78L57p0L9m3k43n4K73r3L06l84L78m7k51J63j53j21
$$ -81 55 296 -6 110 3 -275 82 12 51 8 -235 -289 -16 -109 197 -187 191 144 -107 56 -97 -218
4773b18J33K30l54J37qJ93j35J02k36J21k94M16j50p6LJ91J18j93k34J67M1r1
$$ -218 -85 145 -209 -72 -80 113 -22 80 -156 -35 -329 87 -63 -139 -136 55 173 -20 -254 -87 -46 -137
4795a37K8NK38k37J08J00Q5k83k4J11J49m29K92M8J99j3r6l8k42l5j3N06m97J01
$$ -137 -109 -104 134 -103 5 105 190 -93 -117 -6 143 -286 6 54 253 240 144 106 -136 -171 -184 322 -175 -74
4819g4l6K76j08r9LR5j92M1P3M4j70M8K06j62K1j79J44j13J22PM4PJ02q4R3k70
$$ -74 -110 166 58 -41 -38 57 -135 -94 -21 23 -147 -99 107 -55 -34 -213 -69 -182 -60 -53 -9 -2 100 16 109 -161
4845a61J87O9k30K51k52N3J71k69K26J7m1L22j04q0p7J5k95R1K19J2n2M9k88R8
$$ -161 26 95 -135 116 -136 -83 88 -181 45 62 21 343 239 159 82 97 -198 -107 112 124 72 121 -167 -69
4869f9L3L7m9J18l5O6k03J63j4K8M9oj93p8j25K99J07j74P0L0P4k53Q8Mp2j04
$$ -69 -36 1 -48 70 35 101 -102 61 47 75 124 118 -75 -153 -278 21 128 -46 24 54 128 -125 -37 -33 -105 -209
4895b09P8R5q3J02J57j56J62k81K85k61M43m41O6J26j48k7L18l78K19m2k1j02
$$ -209 -131 -36 -119 -17 140 -16 146 -135 150 -111 332 -109 -43 83 -65 -92 226 -152 67 25 4 -98
4917i8J76J72j95L4j07N0j9k77J17J71l75L87J04k6j32R1J12j51K11l89J58J8
$$ -98 78 250 55 89 -18 32 13 -264 -147 24 -351 36 140 114 -18 73 185 34 245 -144 14 32
4939C2n1r7J77L4l32K12j94K70n0J6qr3j53L04J11p7j48M4k08K79j08K35k07J19
$$ 32 -19 -116 61 95 -237 -25 -219 51 1 17 9 -84 -237 67 178 101 -47 -3 -211 68 -40 195 -12 107
4963A07J10k61j1K71j70j51J44j94K70r9RJ82k90P3lp2N15p57K49J71N6pm1n5
$$ 107 217 -44 -55 216 46 -105 39 -155 115 16 25 207 -83 -10 -13 -85 430 -327 -78 93 149 142 101 46
4987D6k21K04j41J57l48N59l26K05k05LR7j77j15M56j00j19l5K18k67j32K11J14
$$ 46 -175 29 -112 45 -303 256 -70 135 -70 -67 30 -147 -262 194 94 -25 -60 158 -109 -241 -30 84
5009H4j78j8M16n02M12j36L4j8k6M2k2j45J98L6m66K12J55k55K93p1K2j23rr1
$$ 84 -94 -112 304 -198 214 78 112 94 68 110 88 -57 141 177 -289 -77 78 -177 116 45 67 -56 -65 -156
5033a56r6M91k36P5n5P2qk15K14J34m11ML38l27J87q9k6K53oo0r5J21p8Nj24J92
$$ -156 -252 239 3 78 23 95 87 -128 86 220 -191 -187 151 -176 11 -78 -104 149 143 83 -12 109 31 36 -88 104
5059A04L0l41N1L09l12J74K69m16M39k57k2J7J6r5J3N2m2q3L07l61K01j0k24K41
$$ 104 134 -207 -156 153 -159 15 284 -132 307 50 28 45 61 -34 -21 31 -11 -94 213 -148 53 43 -181 60
5083F0Q3o9rj19J35o1j17J67K7r7k9m4J71l06M96k49K18j03k7l46L27j83K4K31
$$ 60 143 74 65 -54 81 20 -97 70 97 0 -29 -73 98 -208 288 39 257 154 127 -219 108 -75 -51 180
5107A80l54l7K37m6L07l83J19Q0j59k2P0rk13L06p9J81n00K33K63q1q2j28J66
$$ 180 -174 -211 26 -20 287 -96 23 103 -56 -78 -8 -17 -230 76 -3 178 -322 -89 174 93 11 -117 49
5130D9r6N4q7R7p9j47M66l98Q7J58K07j43q9j78R2r2L6J3r1J56j56L6J76n9K8
$$ 49 -47 7 -80 17 -62 -209 257 -141 -54 104 311 168 79 -99 -7 -99 -63 -50 -141 15 -141 -105 71 12 40
5155D0n3q9J49k20O6J77o6l7o9L81k63j40NJ00K42j60P3p6Q8j28l8r2J43l4K5
$$ 40 -13 -102 47 -173 -107 70 4 -33 -102 279 16 -124 -119 -19 223 63 136 60 148 20 -18 -110 33 -1 24
5180B4k06L37j58j21LK78j54l06K56L09l61K38j91J28M1l4o2j9J75k05j4M7J64
$$ 24 -182 155 -3 -124 -121 157 3 -303 -47 262 -99 139 -52 76 117 83 21 2 177 -28 -42 5 169
5203A69j92k25M12j76j10K27k35K36j87L33j43j02M8rM6l95L34K09k92k92M14
$$ 169 -23 -248 164 -12 -122 105 -130 106 -81 252 109 7 55 46 92 -303 31 240 -52 -344 70
5224G0p0J99k72K85k56l62N47l94M73j77LNJ83j84k15J2m4K31R3nj27j80J3J71
$$ 70 0 199 -73 212 -44 -406 141 -253 220 43 46 51 234 50 -165 -153 -197 34 127 122 -5 -185 -172 -1
5248aK1q1K45m32L97j81L1k7q1J52q2K37j71j56J36O6M6k16J81k45L42k17j94
$$ -1 20 -61 184 -248 149 -32 -1 -28 -109 43 -39 198 27 -129 7 73 119 -97 84 -161 181 -36 -230
5271b30R1K22m2K9j8j37J39k58K65m3O5J35j85NJ35k20K65l98K36q5j74K37o3
$$ -230 -139 83 41 70 52 -85 54 -204 61 18 83 218 33 38 173 -47 218 -180 56 -29 -203 34 -29
5294b9J42J29k07k16K50j27M2J3O6r5j5J97l51M8K16J98l57k2k0ko5K03J12k16
$$ -29 113 242 35 -181 69 -58 -16 -3 63 -32 -47 150 -201 -153 63 261 -96 -118 -138 -140 -205 -2 110 -106
5318a06L15o3O4l00J18p0J20n0J89j66Q1k34J84Q0l29R0p0J67k71K93J01O2k98
$$ -106 209 146 210 -90 28 -42 78 28 217 51 132 -102 82 162 -167 -77 -147 20 -251 42 143 205 -93
5341i3J69j57j05o7L19k49K32k63L71m6j04P9j8j51K28j11k3Q0k8l43L53j70J11
$$ -93 76 -81 -186 -253 66 -183 49 -214 157 111 7 86 68 -83 145 34 11 91 63 -280 73 -97 14
5364A4j07J14J19r1K2k86J47J54Q6k70J48Q7N0k8k31J62j63J10o2q6J23j83J49
$$ 14 -93 21 140 49 71 -215 -68 86 172 -98 50 137 187 159 -72 90 -73 37 -25 -111 12 -171 -22
5387b2J48k82J98j61Q2J47j21OM1j41J80r4LJ58n63L61p7K64l86M51j78L5j1O9
$$ -22 126 -156 42 -119 -37 110 -11 -5 36 -105 75 -19 -16 142 -421 -60 -137 127 -259 192 14 49 38 107
5411A07r1J84k75l5k0n3L00j93L96k04R2l71K26L4j77j54J86L85n34K06J48l05
$$ 107 16 200 -75 -110 -130 -183 117 -76 320 116 208 -163 63 97 -80 -234 -48 337 -197 9 157 -148
5433a48J43N3q5J96j82j60L83j42l40K98o2K91j81J7K0j98J02o3K76k01j25J93
$$ -148 -5 48 -37 159 -23 -183 200 58 -282 16 -46 245 64 81 101 -97 5 -58 218 17 -108 85
5455H5k75K38n4j33J07j13o5J28k0m3K04q7J78j4j53J06q5J89k45J14j5L9j81
$$ 85 -190 48 -6 -139 -32 -145 -210 -82 -102 -145 59 -28 150 136 -17 89 4 193 -52 62 47 86 -95
5478i5j27K80J37j82j06P1k40L62m09L88j65j4J44k18PNJ36K77k10J24k75L60
$$ -95 -222 58 195 13 -93 -22 -262 100 -309 79 -86 -100 44 -174 -167 -162 -26 251 41 165 -110 250
5500B50j91J19j30j23J48j29L9J8j3p1J38L1J57q1j33j21O4N2nj92J59J73n2j12
$$ 250 59 178 48 -75 73 -56 -17 1 -12 -83 55 86 243 162 29 -92 -28 24 19 -173 -14 159 107 -5
5524el4J16p0L50o10P0P8L62j15l62J11KJ97O3j36J10j2L4K28j52j76r4RJ36R1
$$ -5 -39 77 7 357 -253 -183 -105 257 142 -220 -109 -107 90 153 17 127 115 149 377 225 49 -45 -36 100 191
5549A91r6j3j76R3r3j4K42l12K80q8j22J99j80J53q6j7R8N6O1j95L6K5m5J29o5
$$ 191 95 82 -94 -1 -94 -108 134 -178 102 14 -108 91 -89 64 -22 -39 59 115 176 -19 17 42 -3 126 61
5574F1J42k00J8q9Mk71K53J76p9l2m8%K48m0j64n3l1J54j03n0n6K41j1l9K30q1
$$ 61 203 3 21 -68 -64 -335 -82 94 15 -17 -65 -65 183 143 -21 -74 -105 49 -54 -104 -160 81 70 31 261 180
5600A80k17m2K8J41L2P4l44K23p3Kk6nj44K61r5JL4jo6N5J09j99QJ25O5j17J19
$$ 180 -37 -79 -51 90 122 196 -148 75 2 4 -22 -27 -171 90 -5 -4 30 29 -37 18 127 -72 -64 61 126 9 128
5627A28j88J29rK56j26j15k4j07K76k62L0m2K58R3m28J01J06O9L3k81K82j93j47
$$ 128 -60 69 60 316 190 75 51 -56 220 -42 -12 -54 204 297 -131 -30 76 145 178 -103 179 -14 -161
5650a61J94l0%k25M73j25k47q4K64O1n4p2J49n5j88j3Q5j02J25j8qJ10L0k90K14
$$ -161 33 3 3 -222 251 126 -121 -205 59 120 66 -6 143 88 -100 -113 -28 -130 -5 -23 -31 79 109 -181 33
5675C3j31O3J02j19n1m9j45J93QJ07J51k3j76p9J5Q2J42j7J67o4m49J21J34k15
$$ 33 -98 -35 67 -52 -103 -152 -297 -104 -96 11 162 139 -37 -116 -101 -19 123 106 273 209 -240 -119 15 -200
5699b00J88p1Q0M7J20J70j40n6l87J85Q1r6M7N7P4k11K05j03j99M19n5j35J1l2
$$ -200 -12 -83 -3 44 164 334 194 138 -249 -64 17 -79 -32 25 99 -112 93 -10 -209 210 155 20 31 -1
5723aj39J80r4L52k98J23mk98J27J02q0J44k60K43j52K8O6r8Q9L3J3Kj92PR1J98
$$ -1 -140 40 -54 298 0 123 119 -179 -52 50 -30 114 -146 97 -55 -27 39 -59 30 63 76 78 -114 -107 -16 182
5749A82j83L3j42J83j43q1P6Kj6K25K2l05J96j33m4M05k73L16k46q5J16L6j13
$$ 182 -1 32 -110 73 -70 -151 -75 -73 -89 136 158 -147 49 -84 -128 277 4 320 74 -11 105 141 28
5772B8r3p4J31P4j65K27j94J69r8r6J29j38J09J45l29K61j10N9k3K21k62j13K08
$$ 28 -65 -139 -8 66 -99 128 -66 103 5 -91 38 -100 9 154 -175 86 -24 35 12 233 -29 -142 66
5795F6n7J68k79K53j45n2o2K47j7k17l3K31k7k49L42k07J03k18K45j32j55N9K69
$$ 66 9 177 -102 151 6 -46 -108 139 122 -95 -128 103 76 -173 169 -38 65 -153 92 -40 -195 -136 133
5818A33k9Pj63JJ92j10l4k84L99k26J45k9p7P3J47N0j28j82K68j5l31p4K87L4
$$ 133 104 111 -52 -51 141 31 -3 -287 112 -114 31 2 -75 -2 145 195 67 -115 153 138 -193 -267 20 54
5842E4k31l3K65Q7q2j0j80L79j63j68j6Q8j27J31k7Q2k58J33J10j90J63j18R6
$$ 54 -177 -210 55 142 60 50 -130 249 86 -82 -98 -10 -137 -6 -33 49 -209 -76 34 -156 7 -111 -15
5865a5K71k7j33O9l61J51l40L15J91j43J07k4p0Q5m36J51Q8P8N0Q5m6k0j13n1
$$ -15 256 229 96 165 -196 -45 -385 -70 121 -22 85 61 -9 76 -360 -209 -121 -43 7 92 46 26 -87 -138
5889a38N47k84j33k3K08m60M05k00K13oj73J84j66j37J69J49k4j02JJ33j09N8
$$ -138 409 125 -8 -31 177 -283 122 -78 135 129 -44 140 -26 -163 6 155 131 29 30 163 54 112
5911A12m25L92n8Q8j99j21J50J27j67K79k48O7K3J86m30J41j22K69j05p0J69m3
$$ 112 -313 79 21 109 -90 -211 -61 66 -101 178 -70 -3 20 206 -224 -83 -205 64 -41 -111 58 15
5933A5j65L58j72nkR5R9N7l60j6o6K95r8Q7j69l9O2j52l3K56j21J36o5n7OJ12
$$ 15 -150 208 36 31 29 124 223 280 -80 -96 -162 133 35 122 -47 -86 -24 -176 -209 47 -74 62 -3 -60 -54 58
5959E8k0rj51qK85j15k6j23J31j41J1Q0j50kP1J75l0n4j49J45N2P7j23r8J17l8
$$ 58 38 29 -122 -130 155 40 14 -109 22 -119 -108 -28 -178 -180 -109 66 36 -18 -167 -22 30 107 -16 -114 3 -35
5985c5l9L63l53J4J37j42N1J21j21j56P0P1j45pJ82L03n15L23n8m8J61k37m1o3
$$ -35 -74 289 -64 -50 87 -55 -4 117 -4 -160 -90 -19 -164 -171 11 314 -201 122 64 16 177 -60 -101 -164
6009a64J74J46r8k96L08p3j22l4J95k7p5R8J65j84J2L06j30q5j60K05k80J56J03
$$ -164 10 156 58 -238 70 -3 -125 -159 36 9 -66 32 197 13 25 331 201 116 -44 161 -119 37 140
6032A40l3k34K09k16j4j14J28J19j34J49k8J3kj70J58j93j80L19OJ46J42m8j27
$$ 140 107 -127 82 -134 -148 -262 -134 -15 -149 0 -28 -15 -17 -187 -29 -222 -402 -83 -77 69 211 163 36
6055C6L2k52J78J54J23m15P1M0j26J72R2j82KP6p8L38l07jL0J99j4j76J7P0l27
$$ 36 68 -184 -6 148 271 -144 -73 -33 -159 13 105 -77 -75 1 -77 261 -46 -47 -17 182 168 -8 9 79 -248
6080b48L92j23r2j94J12K10l6n9J5n1r7J48J20L6m75L25M8Q9p1r9J27J58j20l44
$$ -248 144 21 -71 -265 -153 57 21 -38 -23 -74 -171 -23 97 133 -342 -17 31 120 49 -50 77 235 115 -229
6104b29mo0L91j86L35j41lj43K13k77J63o5K63l04J63n3J36m43K65k63L52n1j39
$$ -229 -233 -293 98 -88 247 106 103 -40 173 -104 59 -6 257 -47 116 63 199 -244 21 -242 110 59 -80
6127h0L34k20m1j25K54j21r0L09j88j39R0N3o6%j6K5J11j37K9P9k7j89J35K60
$$ -80 254 34 -7 -132 122 1 -89 220 32 -107 -17 36 -30 -30 -46 -21 90 -47 -18 61 34 -155 -20 240
6151B40j14k16qm9J14r2M8K0K22l16J37K05j90J66j94Q7j83j15L10k2R2L6k99
$$ 240 126 -90 -98 -147 -33 -125 -77 -57 165 -151 -14 191 1 167 -27 60 -123 -238 72 50 142 178 -121
6174a21K30j79R2Q2j96R3j1j99J82J53j9k62R5J49r8K97l74kK12k42L5l2o4m4
$$ -121 109 -70 22 104 -92 1 -10 -209 -27 126 107 -155 -60 89 -9 288 -86 -88 124 -118 -83 -115 -179 -223
6198b23J60Rn8N1j00K44l7j90P7j64L26j93J37M1L3j01J7r0J59q6K0n9J66j49
$$ -223 -63 -54 -112 -61 -161 83 46 -144 -67 -231 95 -98 39 80 113 12 29 -61 98 12 32 -27 139 -10
6222a0j71R2N4n3l2J72p3j91P5J87J40r9r3j81L62j61L0j87J94r4K18k67K64j92
$$ -10 -181 -89 -35 -88 -120 52 -21 -212 -137 50 190 91 -2 -183 179 18 48 -139 55 -39 179 -88 176 -16
6246a6j35K13j92M21l62k3K73j06N0l01J34K26l40K72m7p7n6L5K96j15N0j14k05
$$ -16 -151 62 -130 291 -71 -94 179 73 123 -178 -44 182 -158 114 67 -10 -66 -31 265 150 200 86 -119
6269a19m0M78n06J08Q3J97j73K06l10N6K48l50K57j05O7j34P6j48o3LJ93q3P3
$$ -119 -159 319 -187 -79 4 201 28 234 -76 -20 228 -122 135 30 97 -37 39 -109 -172 -169 24 -59 14
6292A4j58J89q3l4p8P7J28r8k60N83l09J87k4j87Q2n4K24l75K14l8k34K2J17M8
$$ 14 -144 45 -38 -72 -150 -73 55 -43 -303 280 -29 158 134 -53 29 -25 199 -176 38 0 -234 -212 -95 -47
6316d7j70M15k60k9j1K9nJ71J32k75n1K46j02j46r3P9M5J4J2K17N1l20J23LKJ07
$$ -47 -217 198 -62 -91 -102 -73 -78 93 225 -50 -101 145 43 -103 -196 -117 -72 -58 -46 171 222 -98 25 28 30 137
6342A37l0j80K41l15M12l29K75m39L25p7k5J71J21j64j83L1l1O7J40j09Q0m1j6
$$ 137 107 -73 168 -147 265 -64 211 -228 97 20 -5 166 287 123 -60 -29 -60 7 147 38 118 77 61
6365F1k82K52k38NL31o8mp6J43J67l44J8O0r5j49L04k77L05K09n84K36O4j3Q3
$$ 61 -221 31 -207 -202 129 61 57 -19 124 291 -53 -35 25 -70 -219 85 -192 113 322 -262 -26 38 25 108
6389A08k22K96k23J04K5R3k77j12L6L62K8n5O4k19n0K60l59L7J47k48K43K1P9
$$ 108 -114 182 -41 63 88 181 -96 -208 -172 190 218 163 227 8 -42 218 -141 -104 43 -205 38 59 138
6412A38j78j34L2J69l35L62oL7j91M23l70M6K20m22K25R5j75P6k20K82j81O3n
$$ 138 -40 -174 -142 27 -308 54 48 85 -106 317 -53 -7 213 -209 16 111 -64 12 -208 74 -107 -44 -49
6435d9j6p9L58k75M1M9j56L17j98k33o9K70m3K78R9m26J52J28k41K67k24J78l9
$$ -49 -65 -144 214 -61 -20 29 -127 190 -8 -241 -310 -40 -83 195 294 -132 20 148 -93 174 -50 128 89
6458H9l81K66j04P7K67j93P8j30L4J45l10K72j75K17k20R2k36J85p2J39r4O8J94
$$ 89 -292 -26 -130 -53 214 21 99 -31 3 148 -162 110 -65 152 -68 24 -212 -27 -99 40 -54 14 208
6481B08l19M0j5O1J53l87L02n6k56R5J94k27K08j05q9K4K22jj29l47M38j34J30
$$ 208 -111 -71 -86 -25 128 -259 43 -13 -269 -174 20 -207 1 -104 -193 -169 53 52 -77 -424 14 -120 10
6504A0j0R8M2l0j13q3o7J24J82k80K39o6j54L64j32l94K32o6K80j87J15j93J14
$$ 10 0 98 140 110 -3 -86 -153 -29 153 -127 112 46 -108 256 124 -270 -38 -104 176 -11 104 -89 25
6527B5j74K08o9K78j40O2k33O0Q7k04J19l8l9J29j0j57L1l1J64l66K22L1m0J04
$$ 25 -149 59 -10 268 128 190 -43 17 104 -100 19 -19 -58 71 61 -96 -65 -96 68 -298 -76 -45 -85 19
6551A9K12m1o4j75j24L06r7J86j01m29M79k32r6K65j92Q4q0K5K31l80L48j74K36
$$ 19 231 190 126 -49 -173 133 36 222 121 -308 171 -61 -157 108 -84 0 -80 -55 176 -204 144 -30 206
6574B06m32K68k68L35j52l0j43L9j26L00J68j18R4P2o8m1J05l74L81k86o1J83
$$ 206 -226 42 -226 109 -43 -73 -216 -177 -303 -3 165 47 141 213 145 104 209 -165 216 -70 -131 52
6596E2j29J34j34M1K54l4m6m9Kl48K70k6m0J8P5J13J21k30m7M9O6j74k27J63M6
$$ 52 -77 57 -77 -36 218 184 138 89 91 -257 13 -13 -53 -35 40 153 274 44 -3 46 112 -62 -289 -126 -80
6621h0qO3J77j39K04j54M2j60Kj83K54j3r6Q1p6j18K79K7j88kJ11K6kJ30l53K05
$$ -80 -88 -25 152 13 217 63 105 -55 -53 -236 18 5 -91 -10 -86 -204 75 102 -86 -88 23 49 47 177 -176 29
6647B9j3J79l81L69k0O8k34r0J25k27J96N2M7J0j03K6j61L86j63k68L23J2j56
$$ 29 16 195 -186 183 163 231 -3 -93 32 -195 1 53 100 110 7 33 -128 258 95 -173 150 162 6
6670Fn9j68J45k20J66J39n1m2J30P0r8p0p7K77j27P2q4J53j85J84m9m12K30o9
$$ 6 -53 -221 -76 -296 -130 9 -42 -84 46 116 18 -52 -129 148 21 93 9 162 -23 161 112 -300 -70 -139
6694a39J79l49K77K4P2j64nM08m09r4J42L7l4J82k66J81k00R2J86k26j4K95k81
$$ -139 40 -309 -32 -8 64 -100 -105 303 -106 -200 -58 -21 -55 127 -139 42 -158 -66 120 -106 -120 175 -106
6717a06J28J89j35j99M8k39L63k14R6m5j70J16K52l05n7N22k07r3p2J85J5m2j57
$$ -106 22 211 76 -123 -75 -314 49 -165 -69 -114 -284 -168 84 -221 -278 244 37 -56 -128 57 72 30 -127
6740a27J79j74J63p4K34q7l67M92m40K13K2j31K0J08K52k69J21N6k38R6j49J09
$$ -127 52 -122 41 -33 201 114 -253 239 -201 12 34 -97 -77 31 283 14 135 191 -47 49 -100 9
6762IJ41l43J50o3N7lJ9L03j21k10J79l16K13RN3j21j69J40q4J62n9J94l0o5J7
$$ 9 150 -193 -43 -106 -49 -52 -33 270 149 -61 118 -198 15 24 77 -44 -213 -73 -157 5 -54 140 110 45 62
6787F2N3j24J02j53Q7j2n9M8J55j77J84q5J17k26rK21p7j95K04j33N7N7N1m8J97
$$ 62 115 -9 93 -60 27 15 -44 4 159 -18 166 81 198 -28 -37 184 107 -88 116 -17 40 97 148 100 297
6812B97n26M93l23N0j12r7L25o3K0j53j19J64O8o9O6j9J47m2k60J88k24M64n69
$$ 297 -229 264 -59 -9 -121 -218 107 44 64 -89 -208 -44 24 -45 21 2 149 107 -153 35 -189 275 -294
6835b94M32Q5k11j40M3L12k09O7K38j43j24J60j38q6Qj46J25j64L11k78K72j15
$$ -294 138 223 12 -128 -85 227 18 85 323 180 56 216 78 -8 0 -146 -21 -185 126 -152 120 5
6857Ej00j57L34J31j70n8r7J98p9K55l27O7J78k87J10k3J39r7k60J36KJ40N5j52
$$ 5 -95 -252 82 213 43 -15 -112 86 7 262 -65 2 180 -107 3 -20 119 22 -238 -102 -100 40 95 -57
6881e7j26K90l32J16m7O3K31j67j35J83j50L55j65M8J26k01m4O5J52J7k1j58q7
$$ -57 -183 107 -225 -109 -156 -93 138 -29 -164 19 -131 224 59 107 233 32 -12 53 205 222 201 43 -44
6904d4Q7R7k5l10K0M18l03K88mj83j38R2K08l25M2N4j77Q0J61j04k9q2K31j3J21
$$ -44 43 140 115 -195 -175 243 -60 228 224 41 -97 -5 203 -122 -80 -26 -203 -123 38 -66 -95 -177 54 41 162
6929A62q6L8k0r4r0QkL4O6j74k8K08m4J30L44l79J23l7j39O4M8j26N5r4j92J13
$$ 162 76 114 94 0 -90 -82 -84 -50 16 -158 -186 22 -22 108 452 73 196 159 20 84 132 6 61 -33 -225 -112
6955a12j10L19j38O8L4L4K68j92k09Q7N0j01K46O9l23k18K70RM7n9J73k79K24
$$ -112 -222 97 -41 27 61 95 363 171 -38 49 99 -2 244 313 -10 -228 42 51 98 39 212 -67 157
6978A57l34K35j63L27l17K3l0J42L19o75K23J8k8R7M9J77p5j52M32l87Oj05p7
$$ 157 -177 58 -105 222 -95 -72 -102 40 359 -316 -93 -75 -103 -6 43 220 145 -7 425 38 44 -61 -138
7001a38j25J83J28N5M1kl82J47J2K72j79j30K71l77K77P3m1l2r6o0J19j29J17
$$ -138 -263 -80 48 103 144 142 -240 -93 -81 191 12 -118 153 -224 53 126 85 53 -43 -103 16 -113 4
7024Dj39R5O2o9J6n1j91L53j02j35J08J53p4r3n0J10L59k75j19P5L5l04K53Qk50
$$ 4 -135 -40 22 -47 -31 -82 -273 80 -22 -157 -49 104 30 -63 -113 -3 356 81 -38 37 72 -232 21 29 -221
7049b21n2K37K76o7n97N51j22k85J57l02M25j28J21J7j04K05Q1J22j11j73l1j61
$$ -221 -273 -36 240 173 -424 127 5 -280 -123 -425 0 -128 -7 10 -94 111 192 314 203 30 -1 -162
7071a62J38K17l3j69K73k91m9K12j51J08k62L88j92j56O7j48L50l95L24j24j04
$$ -162 -24 193 160 -9 264 -27 -76 136 -15 93 -169 219 27 -129 -62 -210 140 -255 69 -55 -159
7092a59J91o2j40K29m4J43l07nJ25l1K60j28k90K18j13J74N7l22P4P4M4K35k39
$$ -159 32 -30 -170 59 15 158 -149 -154 -29 -60 200 72 -218 0 -113 61 118 -204 -130 -56 -12 223 -16
7115a6L9J8O2J4m64M29j41j07O2J41p7J56n2M2J6rj32mJ20k30L79n85L20l0r9
$$ -16 23 41 103 117 -347 82 -59 -166 -104 37 -40 116 64 106 122 113 -19 -23 97 -133 246 -339 -19 -49 -148
7140a48K09J03k96L13j08j83J75j2k42M39k80N6Q7j82l9k31M12j38q6J52L9l04
$$ -148 61 164 -132 181 73 -110 65 53 -189 250 -30 26 113 -69 -108 -339 73 -65 -151 1 40 -264
7162b64K54K88l38m7k07M42j14J0R9j1j82q7K28n0j7j94P8L48k84o3j17L16N6
$$ -264 -10 278 -60 -107 -314 128 14 24 123 112 -70 -157 71 21 4 -190 -112 236 -48 -111 -228 88 144
7185A44K0o0m9J21k09j22m2K83j43l1O5p4J30J48k39m5J31k02lL12k51K16k61
$$ 144 164 104 55 176 -33 -155 -197 86 -57 -88 -23 -97 33 181 -58 -103 28 -174 -177 135 -116 100 -161
7208a61L26j9j64K84k87J00j60J90k69J32R0q5J57ko16M99N8j18j85o3K85J69
$$ -161 165 146 -18 266 -21 79 -81 109 -160 -28 62 -23 134 132 -484 15 73 -45 -230 -293 -8 161
7230A61j41O9j4J9o3K9N7l08K13r3L20l10k77L41p2n4J97oJ6l1j11j87K97K1k62
$$ 161 20 89 75 94 31 60 117 -191 22 -71 249 -61 -338 3 -69 -123 74 68 84 53 -58 -245 52 73 -189
7255a89K35L0k76L01m8j51J42j04J39j96oK70j75k6R5J62n2j86m6K56n4l64K09
$$ -189 46 76 -200 101 53 -98 44 -60 79 -117 -123 147 -28 -54 41 203 151 -35 -81 175 121 -243 -34
7278c4o4K4k61K24J57k55K33j32J43j27O5n5j35K42J67k18J15M3l33K45p4j75
$$ -34 -98 -74 -335 -111 46 -209 24 -108 35 -92 -27 -82 -217 25 192 -26 89 132 -201 44 -30 -205
7300b05K30K5k77J18R9K74k80k3m0J01j20M0J46O9j42K8o4J51k55l1k9J62j16
$$ -205 25 50 -227 -109 -10 264 -16 -39 -79 22 -98 -58 88 157 15 43 -21 130 -125 -156 -185 -23 -139
7323a39M7L63l38r1O4K0K20k46kL10k40oJ57k9l4J02n8Ll35N32k22n5k19M97K8
$$ -139 -92 271 -67 -158 -94 -74 146 -100 -102 208 -32 -38 119 90 56 158 100 103 -232 300 78 23 -196 301 329
7348C29m98K08o0l0r7j04k27O08j45j68O0o3J0P5J7K58j58r0n3pK10j06J70k87
$$ 329 -169 39 -21 -51 -148 -252 -479 129 -16 -184 -124 -187 -177 -102 -85 173 15 -75 -128 -135 75 -31 139 -148
7372a48Q2j72L52j79K31j66P3J26j79j57K39j16J66o3k10n7J48K10k32N5m9K81
$$ -148 -66 -238 114 -65 166 0 73 199 20 -137 102 -14 152 89 -121 -178 -30 180 -52 3 -46 235
7394B35l00K14O0n19L34J11M8l44J30L1L8m0n3J79j47N4j0o7J98k65K63j42k66
$$ 235 -65 149 209 -310 24 135 183 -161 -31 0 38 -2 -55 124 -23 31 21 -46 152 -113 150 8 -258
7417b58M73j77k3M2M2K9k69J48J24k2K6j51K85l42J94k30J38n2K88l94K34j54
$$ -258 215 38 15 57 99 128 -141 7 131 109 135 -16 269 -73 121 -109 29 -23 265 -129 105 -49
7439d9j10M95m03K33Q7o5m00K71NJ8j4p3j83K43j51J13l73N48j08j54j2j20O9
$$ -49 -159 336 -67 166 253 188 -212 59 64 82 68 -5 -188 55 -96 17 -356 192 84 -70 -82 -202 -133
7462a33O5j10K74m8J24j01j25m9O4j50J31r5R9J77j87P8j27L21m60K95m1j1J28
$$ -133 -68 -178 96 48 172 71 -54 -103 -39 -189 -58 -153 -54 123 -64 14 -113 208 -252 43 2 -9 119
7485A19m3k17L78j08j89O0k70K26p2K74p1l4L4l9pJ23o3j23pj47J61o6K89j00
$$ 119 76 -141 237 129 -60 0 -270 -44 -116 158 87 53 87 48 41 164 101 -22 -29 -176 -15 -81 208 108
7509A08j77L6L1n9m5M8n5o2J62M7n4M4k17J73K12r7j60K89j29k43J55j5L5p5J65
$$ 108 -69 -33 -2 -61 -106 -58 -113 -175 -13 34 -20 24 -193 -20 192 95 -65 224 95 -148 7 -8 27 -48 117
7534A17q2J17l83l5J50K26p7K3J59k91l9K72J56m77J76j58K3K97l41J88L8k09
$$ 117 35 152 -231 -266 -116 110 33 56 215 -76 -115 157 313 -164 12 -146 -123 174 -167 21 59 -150
7556a50r4K76N6j82L21k54o1K72k22J90l92K70j80r5L06J20l8j00l7J66r8N0m21
$$ -150 -244 32 88 -94 227 -27 -88 184 -38 152 -240 30 -150 -245 61 181 143 43 6 172 74 124 -297
7579b97M80k83m6K09j05J20j92K52k36J97n8j95o5J31K01k91nK11O5k9j02R8j38
$$ -297 183 -100 -146 63 -42 78 -114 138 -98 99 41 -154 -219 -88 113 -178 -183 28 93 64 -38 60 -78
7602g8L19l07l9k5J29o4L9p9L0l2l6K2L4R2l36J99K01m75N19j79n0oL69j74l30
$$ -78 241 -66 -105 -130 -1 -65 -26 -105 -75 -107 -143 -121 -87 5 -331 -132 69 -406 113 -66 -116 -122 247 73 -257
7627b57L18J29l58K85l79J77J05L0k14M3J86J1j15K13k00J48J17j16m8j20K14
$$ -257 61 190 -168 117 -262 -85 20 50 -164 -121 65 76 -39 174 -26 122 239 123 75 -45 169
7648A69k41j0j24L54j96J36O7j69R0O3k00m9J92k64J03n8K10l6J20l73J77O5J01
$$ 169 -72 -82 -206 148 -48 88 155 -14 76 139 -61 -110 82 -182 -79 -137 73 37 157 -216 -39 26 127
7671A27j36Mp4k4o1J34M0J1L01j01k17j63q9K83j33N0k59K38qJ36j16j42L82k80
$$ 127 -9 -5 -79 -103 -164 -30 10 21 322 221 4 -159 -248 35 -98 -48 -307 -69 -77 59 -57 -199 183 -97
7695i7J07Q7j26J59l2k45L57p8j19R6j86n4m3K30j69J80j66R6R6j00k19L49l47
$$ -97 10 97 -29 130 98 -147 210 132 13 109 -77 -131 -174 56 -113 67 -99 -3 93 -7 -226 123 -224
7718b24J05J59m1P4q6J34j9k42K74k5j35L1j32L16k4j89m1J47O3o8k9j1r6Rk7
$$ -224 -119 40 -1 73 -13 121 102 -140 134 109 -26 5 -127 189 165 -24 -65 82 145 77 48 37 -59 -50 -77
7743g7K7K11k44L81j51k04K46l23J72J46j43J04j71K1n5K17j50K0n0q0J82J68
$$ -77 -50 161 -83 298 147 -57 189 -134 38 184 41 145 -26 -5 -60 157 7 27 -23 -103 79 247
7765B47l41K67l24J42j93L65K3k32j5k9%JP0p6L02k44Q3k7K58j88J57k52J35j20
$$ 247 -94 173 -151 -9 -202 163 186 -46 -61 -90 -90 -89 -19 -95 207 -37 46 19 277 89 246 -6 129 9
7789IkJ62m82L46n6j7M7r7J94j69NP1j61L38Kk59J30j93j25L99P6k45L9%N8J37
$$ 9 7 169 -313 33 -23 -40 7 -90 104 -65 -60 11 -150 188 190 -69 61 -132 -257 142 218 -27 12 12 70 207
7815B07k32N0ll9K9J06p1j10J72k42J39j6o0J36Q2J14k17k13J49K2k05K28JJ35
$$ 207 -25 25 22 -17 12 118 47 -63 109 -133 6 -10 -70 66 148 262 45 -168 -19 3 -202 26 27 162
7839A62j23j31r8n2L92P5l04l5O3n9K04k06Kj00K32J70l99j3K09P1k17J12j6K55
$$ 162 39 -92 -190 -242 150 225 -79 -114 -51 -110 94 -112 -110 -210 22 192 -207 -220 -11 60 -157 -45 -61 194
7863A94l26J50r5mL70k30l71N33j98k39K49j31K5J09O0j70j36K21j03k16L85p7
$$ 194 -132 18 -77 -81 289 59 -312 221 23 -216 33 -98 -73 36 96 -74 -210 11 -92 -308 77 0
7885@k4m9K4J58k03K00j56K2J04L32j83J7m63P3K65n4p4k55J11K34n0l1Q1j15
$$ 0 -24 -73 -49 109 -94 106 -50 -28 76 408 225 242 -221 -148 117 63 -11 -266 -155 79 29 -2 79 -36
7909c6J80k18J98j79j21m1L29j61J37j54J74qM3r0j4l17L2K81m7k5q9J87k82J71
$$ -36 144 -74 124 -55 -176 -217 112 -49 88 -66 108 100 143 53 39 -278 -246 35 -12 -37 -126 61 -221 -50
7933e0l1j19L6P2j00O7N4k8rj53L53o7O9j78J20j1L4j13J32l86L21J5j93K19l6
$$ -50 -81 -200 -164 -92 -192 -125 -71 -99 -108 -261 92 25 94 -84 36 25 59 -54 78 -308 13 28 -165 54 18
7958A8l92L01K4j2L0J81j19l3P7k63K08P7J7j19Q5j24M8M2j7J32j78k09K60pJ6
$$ 18 -374 -73 -49 -61 -31 150 31 -2 75 -188 20 97 114 -5 80 -44 4 46 29 161 -17 -226 34 27 43
7983D3j04m5K90k87M7L81l13J39o4Q1J9j55P6j46K67q4J22k89K9j45K71l9K00
$$ 43 -61 -106 184 -103 -56 325 12 151 87 168 187 32 108 -38 229 145 267 -22 7 -138 133 94 294
8006B94k42k40L22j1l04J10m4k2L47l80K04J80l67K89k08J15j32Mm5J80l9q6P0
$$ 294 52 -188 134 123 -181 -71 -115 -137 210 -170 34 214 -153 136 -72 43 -89 -85 -130 50 11 -75 -5
8029el6N5pL3j16p8J79m0J08M8k13J86k41P1j45J98k0j51K52m0j05K08j61m4J66
$$ -5 -41 14 7 40 -76 -154 25 -15 93 141 -72 114 -127 -56 -201 -3 -23 -174 78 38 -67 141 -20 -64 102
8054A02k74L03j80Kqp8K87r3j89KN9j39J75J40N3j21J15m42J34L15k00M8K0o7
$$ 102 -172 131 -49 -47 -55 -133 154 61 -128 -126 -67 -206 -31 109 162 41 156 -286 -152 163 -37 11 31 -36
8078c6J37j87J4K82m32J86K49l03j08L51k93J99J79n25J81%R4N7pJ6j18k01O4
$$ -36 101 -86 -72 210 -222 -36 213 -90 -198 153 -140 59 238 -287 -106 -106 -12 45 38 54 -64 -265 -201
8101b01J77o6K29r4k56K82k31K35K05k51k64M41Ql34R1J90j75l2Q3j15J28k40
$$ -201 -24 -90 139 45 -211 71 -160 75 280 29 -235 206 214 -120 -29 161 -14 -46 37 -78 50 -190
8123a90K91k4J68j91j95L72l11K64k19J75j9k1k14j42J21K00q6k77K19J82l53
$$ -190 101 77 245 54 -141 231 -80 184 -35 140 121 100 -114 -256 -135 65 -21 -298 -79 103 -250
8144b50K28J36l1k61M32k80j3J38p1R5j09J44j42r9jJ78j11P6J75k10j13J65O6
$$ -250 -22 114 83 -178 254 -26 -39 99 28 123 14 158 16 -83 -84 94 -17 59 234 24 -89 76 142
8167A42k64q2K31K29j11l37n9M24k88O3K25k73J55l05J92Q0K4j34K89j14l33K64
$$ 142 -122 -204 27 256 145 -192 -251 173 -115 -52 173 -100 55 -250 -58 22 46 -88 201 87 -246 18
8189A8J5j0
$$ 18 33 23
8191B3
$$ Imaginary data points
##PAGE= N=2
##DATA TABLE= (X++(I..I)), XYDATA
0@%%%%%%%%%%%%%%%qJ6j6J6j6J8k6L2l4M2m8N6o6P4q6R8j12J28j44J60j79K03
$$ 0 0 0 0 0 0 0 0 0 0 0 0 0 0 0 0 -8 8 -8 8 -8 10 -16 16 -18 24 -24 32 -34 40 -46 52 -60 68 -76 84 -95 108
37A08k27K51k80L14l48L85m25M67n17N69o25O91p62Q39r26J021j127J248j383
$$ 108 -119 132 -148 166 -182 203 -222 245 -272 297 -328 363 -399 440 -486 535 -592 656 -727
56g27J538j717J925k174K477k852L330l967M851o159Q293j2324K2359q8043j27889
$$ -727 811 -906 1019 -1155 1322 -1530 1800 -2167 2684 -3475 4818 -7506 14853 -73190 -201079
71b01079K73015O227j26089J16908l140j32293J10722O6274r3855L8990L3860
$$ -201079 71936 78163 -47926 68982 65842 -66451 44271 110545 16690 55680 89540
82H9540j00963K6725N0287p2694K0595M7981r7552j2203O6934m5946o181L9495
$$ 89540 -11423 15302 65589 -7105 13490 61471 -36081 -48284 18650 -27296 -33477 6018
94F018p3832m843Q4004l8928l7530M7828k6720j0898P5397q187m4839K8847m777
$$ 6018 -67814 -72657 11347 -27581 -65111 -17283 -44003 -54901 20496 12309 -32530 -3683 -8460
107h460j668P2015r448o7388L2193J9106k8621M5388O658o7072K1511K3132n0858
$$ -8460 -10128 61887 52439 -14949 17244 36350 7729 53117 59775 -7297 14214 37346 -13512
120a3512K4039L3736n7550n497K6967m2990Q321N1204l9512l1902L4037p456n837
$$ -13512 10527 44263 -13287 -18784 8183 -34807 -26486 24718 -14794 -46696 -12659 -20115 -25952
133b5952L5918k2844k8535L8922N153j8088K8743n757k6446L1715R523k1275J9810
$$ -25952 9966 -12878 -41413 -2491 2662 -15426 13317 7560 -18886 12829 22352 1077 20887
146B0887l123k9197K4937J3420k5711J2767L743l5081J6748K6110l1592j656K1672
$$ 20887 17764 -11433 13504 26924 1213 13980 17723 -17358 -610 25500 -6092 -7748 13924
159A3924l1336m301L9019j8159k0626K6053j2340j7319L5287Q25k7452J5723L190
$$ 13924 -17412 -21713 17306 -853 -21479 4574 -7766 -25085 10202 11027 -16425 -702 2488
172B488j5933K4190P049l1243P946J7101j6154P433J5214k4835m729K1946r376
$$ 2488 -13445 10745 17794 -13449 -5503 11598 -4556 2877 18091 -6744 -11473 10473 1097
185A097n356J5711j4268j2647J8706k63r945J1441l529j4516J1891Q995p700J827
$$ 1097 -4259 11452 -2816 -15463 3243 2980 -6965 4476 947 -13569 -1678 7317 -383 1444
199A444L10p986P856P609p363Q74J438q506N517R164q925l332M258n834J079Q327
$$ 1444 1754 -6232 1624 9233 1870 2744 4182 -4324 1193 10357 1432 -1900 2358 -3476 -2397 5930
215E930o338n012M354m090p87Q955l791p430N308O88l325O359J426o221K922J829
$$ 5930 -408 -5420 -1066 -5156 -5943 3012 -779 -8209 -2901 -2213 -5538 821 2247 -3974 -1052 777
231G77k312O404J211p672L323M459n205K663M439o890j784N467l125q53L586n131
$$ 777 -1535 4869 6080 -1592 1731 6190 985 3648 8087 1197 -587 4880 1755 902 4488 -643
247f43k413M587k863k728M700k992n345N347J73l753M105K98m334L198K756k751
$$ -643 -3056 1531 -1332 -4060 640 -2352 -7697 -2350 -2177 -5930 -1825 -1527 -5861 -2663 93 -2658
263b658K886K681m504J736M555l467R90L589l185j687L704j720j303L301l024
$$ -2658 228 2909 -1595 141 4696 1229 2219 5808 2623 936 4640 2920 1617 4918 1894
278A894k981L350j260k477K670p82m684J945J821k734M16J31j771P78J721j89
$$ 1894 -1087 2263 1003 -1474 1196 414 -4270 -2325 -504 -3238 -2822 -2691 -4462 -3684 -1963 -2152
294b152R82J3j953K064K957j086n15K290j384n99K877Q48j010j081p28J90J310
$$ -2152 -1170 -1157 -3110 -1046 1911 825 310 2600 1216 617 3494 4342 3332 2251 1523 1713 3023
311C023o36j399J44k007j034K340O04k919j415N79K88M26N63n18r76M8J226J552
$$ 3023 2387 988 1132 -875 -1909 431 1035 -1884 -3299 -2720 -2432 -2006 -1443 -1961 -2937 -2889 -1663 -111
329a11P35o60q27O52J754N95m5l73j76m43P34J549o30j732o76M27N51N42j337
$$ -111 624 -36 -863 -211 1543 2138 2093 1720 1544 1101 1835 3384 2754 1022 346 773 1324 1866 529
348E29j522k10J31M2P53l20k478p90K192J070n57q37m39J49J062K152L04j576
$$ 529 -993 -1203 -1072 -1030 -277 -597 -3075 -3865 -1673 -603 -1160 -1997 -2436 -2287 -1225 927 1231 -345
366c45p02R62K297R80n12j384q6J4K99J112L70k789j823J809J083k61j072r72
$$ -345 -1047 -85 2212 3192 2680 1296 1210 1224 1523 2635 3005 216 -1607 202 1285 1024 -48 -1020
384a020j800O71K005L46j390j795P6R62J156R11n77j468J43J214J421J201n43
$$ -1020 -2820 -2149 -144 202 -1188 -2983 -2907 -1945 -789 122 -455 -1923 -1780 -566 855 2056 1513
401A513k753N62K929K41p40N87j952j205K429J401k036R5j605j796K637K609l106
$$ 1513 -1240 -678 2251 2492 1752 2339 387 -818 1611 3012 976 1071 -534 -2330 307 2916 -190
418a90j484P05j959J454L049j560l055J039N62J83K156J9k580L85Q47P66K204
$$ -190 -1674 -969 -2928 -1474 1575 15 -3040 -2001 -1439 -1256 900 919 -1661 -1276 -429 337 2541
435B541n05k773N28O78J163J332j471j874K88J79P75J804k102l265K425J111j392
$$ 2541 2036 -737 -209 469 1632 2964 1493 -381 -93 86 861 2665 563 -2702 -277 834 -558
452e58J545j03m637J517M035k505k26J941l685o13O341j442l674K913p04l588
$$ -558 987 884 -3753 -2236 1799 -706 -932 1009 -2676 -3289 3052 1610 -2064 849 145 -3443
468c443M844K510n524J33K799k440R51L452l686k233L052j70r10K564j350l509
$$ -3443 1401 3911 -1613 -1480 1319 -1121 -170 3282 -404 -2637 415 245 -665 1899 549 -2960
484b960K471J940j042p06P92p09j005J268J936r04k122P24J071j292J172J349
$$ -2960 -489 1451 409 -297 495 -214 -1219 49 1985 1081 -1041 -317 754 -538 634 1983
500A983k324r35K427j481l74K732k110k899L422R01l881K524J825m428R30M098
$$ 1983 -341 -1276 1151 -330 -704 2028 -82 -2981 441 1342 -2539 -15 1810 -2618 -1688 2410
516B410k800j569L972k619k161M907m90l042K705Ol727K922L093l056q66J368
$$ 2410 -390 -1959 2013 -606 -2767 2140 1650 -1392 1313 1319 -2408 514 3607 551 -315 1053
532A053k102M58K981n17k102n39l24L43J792j70j569j431j73J482J224n06l19
$$ 1053 -1049 -591 2390 1873 -229 -768 -1092 -749 1043 873 -696 -2127 -2300 -818 406 -100 -419
549d19q25j191K442J893k402j45J450j266k57L457j355l223K480J135k405K431
$$ -419 -1244 -2435 7 1900 -502 -647 803 -463 -720 2737 1382 -1841 639 1774 -631 1800
565A800J46l802Q61K791j938K59J502l338p80L730p65k089K101r08j977K372J93
$$ 1800 1946 -1856 -995 1796 -142 117 1619 -1719 -2499 1231 466 -1623 478 -430 -2407 -35 158
582A58j763J978L51k141J051R95j504J338J163j848M71L39j124J435J459k093
$$ 158 -1605 373 724 -1417 -366 629 -875 463 1626 -222 249 588 -536 899 2358 265
598B65p1L35j758J588K022l127m13K160k132n1L062j939k458K707m39j111L122
$$ 265 194 529 -1229 359 2381 -746 -1159 1001 -1131 -1182 1880 -59 -2517 190 -249 -1360 1762
615A762j677l566L762J499l419K529J296m944J956M058l145l20K221l516K71M584
$$ 1762 85 -3481 281 1780 -1639 890 2186 -2758 -802 3256 111 -209 2012 -1504 -1233 3351
631C351k641k425L284j938k404M743J8m249J992J097k970K146J539l533Q26K327
$$ 3351 710 -1715 1569 -369 -2773 1970 1988 -2261 -269 828 -2142 4 1543 -1990 -1164 1163
647A163k096J46J909j994l68L062j030j954J949l10q71J513K8r59K33n45R5P20
$$ 1163 -933 -787 1122 -872 -1240 1822 792 -1162 787 477 -394 1119 1147 188 421 -124 -29 691
665F91k5j185J3J66N14K68n94p94N02n35J90J855j342j725K087K39j251J734o
$$ 691 666 -519 -506 -340 174 442 -152 -946 -444 -979 -789 1066 -276 -2001 86 325 -926 808 802
684H02k442J100J933j481N78J085k470J69K728j071r30J496j539j166K054L18
$$ 802 -1640 -540 1393 -88 490 1575 -895 -726 2002 931 1 1497 -42 -1208 846 1164
700A164j415M42l77r81Q58P84p19l29j84l36M95R47k55k82l86Q2Q04O6M05K15
$$ 1164 -251 191 -186 -1167 -309 475 -244 -573 -757 -1093 -598 349 94 -188 -574 -492 312 378 783 998
720I98j423k10J654j63m74N07n92j099J214R99j249J46k30j288P74J943j532p53
$$ 998 -425 -635 1019 856 382 889 297 -802 412 1411 162 308 78 -1210 -436 1507 -25 -778
738g78O94j050l53K254l33k009Q19L19o20J836Qj466J24Q30k78Q13P50j733m82
$$ -778 -84 -1134 -1487 767 434 -1575 -756 -437 -1057 779 787 -679 -555 275 -3 810 1560 -173 -655
757f55J163o7L66M10j107q07P73L56K24M4j478o7O84Q1r6J30o72l29N50K45J85
$$ -655 508 441 807 1217 110 -697 76 432 656 700 -778 -845 -161 -80 -176 -46 -718 -1047 -497 -252 -67
778f7J69m67l65J027P8m14K28l6j24N50M70m24m68K07l99N46J36o88j49L06k77
$$ -67 102 -365 -730 297 375 -39 189 153 29 579 1049 625 157 364 -35 511 647 -41 -190 116 -161
799a61j81P95o02l06j05L62J18j76l20K4J24m6M40J20o5m40K35R17j22k46K6k73
$$ -161 -342 453 -149 -455 -560 -198 -80 -256 -576 -552 -428 -474 -34 86 21 -419 -184 733 611 365 391 118
821A18J13J20J33Q8o36m14K64N49k55j87m53K16K52l4J50l92l83M0N09J53J61
$$ 118 231 351 484 572 -64 -478 -214 335 80 -107 -560 -344 -92 -126 24 -368 -751 -711 -202 -49 112
842A12m67J22k81L43N59K16k56p52K94P25M5k4m52j89K07K51J59m24j05o41L28
$$ 112 -355 -233 -514 -171 388 604 348 -404 -110 615 660 636 184 -5 202 453 612 188 83 -558 -230
863b30K13L37n81k07j37J13L85K7k46m12K63L14k8M05M6n35K6P20n2K15j22o23
$$ -230 -17 320 -261 -468 -605 -492 -107 -80 -326 -738 -475 -161 -189 216 262 -273 -247 473 421 636 514 -109
885a09K65O09m2o53L76l03l35R9N46n37l82n7J41l3N60n01k94N68P3n26L77L79
$$ -109 156 765 723 70 446 143 -192 -93 453 -84 -466 -523 -382 -415 145 -356 -650 -82 -9 -535 -158 221
907B21p74K57O27q2l39K60J08l04L75J97m80n4J87J09j10M50l89r83O38L41l49
$$ 221 -553 -296 331 249 -90 170 278 -26 349 546 66 12 199 308 198 648 259 -724 -86 255 -94
928i4k35Q5m31j97R66J22q06K34j43l06R73J78l61j7J26k46M59Q15n58n65K64
$$ -94 -329 -244 -675 -872 94 216 -590 -356 -499 -805 168 346 -15 -32 94 -152 307 1122 564 -1 263
949B63K49l35K83J86q04l83P16j6K90l53o34k60N06R8J21l30k09l49L11O93M04
$$ 263 512 177 460 646 -158 -541 175 159 449 96 -538 -798 -292 -194 -73 -403 -612 -961 -650 43 447
970D47o03m50M5N88J57O22l00p38J98P05k29M78k01j025J63N69L81l72j02l41
$$ 447 -156 -606 -561 27 184 806 506 -232 -34 671 442 920 719 -306 -143 426 807 435 333 -8
990hj051R94R30j304l45N19m44j88J295l97j210O56O03l48N03K53j085J97J507
$$ -8 -1059 -65 865 -439 -784 -265 -709 -897 398 1 -1209 -553 50 -298 205 458 -627 -430 1077
1009A077p28r9O16r35m06J347M35j498K42M65q88M56J087j286p73J169j37r02
$$ 1077 349 250 866 -69 -475 872 1307 -191 51 516 -372 84 1171 -115 -888 281 144 -758
1027g58J290m46j901J338R59j240K66J019j244K9J581q40q33J162j59n84J344
$$ -758 532 86 -1815 -477 482 -758 -492 527 -717 -688 893 53 -780 382 223 -361 983
1044I83m9j384N10J033j154j29J248j098p37J365K0j453J065L93j286Q5J031j194
$$ 983 934 -450 60 1093 -61 -190 1058 -40 -777 588 608 -845 220 613 -673 -588 443 -751
1062g51j33J282o64n98J007o55m54J359L15j473N01Q64q50M85J150j071o08J006
$$ -751 -884 398 -266 -864 143 -512 -966 393 708 -765 -264 600 -250 235 1385 314 -294 712
1080G12l25j68M13r6j113Q61K94j001L74k00p55O24P28n28k65j18l76Q00N82n88
$$ 712 387 219 632 536 -577 284 578 -423 -49 -249 -1004 -380 348 -180 -445 -563 -939 -139 443 -145
1100a45j35P2n07O05J198j079j87M44l73J46J089n74j000P58K54r68J275P9j903
$$ -145 -280 -208 -715 -110 1088 9 -178 266 -107 39 1128 554 -446 312 566 -402 873 952 -951
1119i51P20J299j552J11R54j230m04J725p92j002J303j37j246J591L31j733P14
$$ -951 -231 1068 -484 -373 581 -649 -1053 672 -120 -1122 181 44 -1202 389 720 -1013 -299
1136b99J195j317Q4J107r50k47J461k42j272R23K09q88O39N68j298o91J302k84
$$ -299 896 -421 -337 770 -180 -427 1034 792 -480 443 652 -236 403 971 -327 -1018 284 0
1154@l18Q07o37j093J145M37q49L49K32n45k46J682p90l99M01j83p25J446L38
$$ 0 -318 489 -148 -1241 -96 341 -508 -159 73 -472 -718 964 174 -225 176 -7 -732 714 1052
1173A052j506L04O75m58J91R54q90q93P49K52p12O70M0j183M32O79o91m5M72p03
$$ 1052 -454 -150 525 67 258 1212 322 -571 178 430 -282 388 428 -755 -323 356 -335 -380 92 -611
1193f11MP77j89l25M84l05j63M54K26n38L74J61m15L68M1j02J41K37r27J71N25
$$ -611 -607 170 -19 -344 140 -165 -328 126 352 -186 188 349 -66 302 343 241 382 619 -308 -137 388
1214C88o03K26P5j45k60M88l81J54P3m77j48N26K14m46K96m2l85L76L08O2Mk25
$$ 388 -215 11 86 -59 -319 169 -212 -58 15 -462 -610 -84 130 -316 -20 -62 -447 -71 237 299 303 78
1236G8k28K96J98n7j53K25J0l14L85M2n13j87P00n15j28K66m62M6L96k61m44M88
$$ 78 -150 146 344 287 134 359 369 55 440 482 -31 -218 482 -33 -161 105 -357 -311 85 -176 -620 -132
1258a32K58p24L68K20m74P7P04l19m94R01l44P6J19L05o11L32J72k79M30j08o48
$$ -132 126 -598 -230 -10 -484 -407 297 -22 -516 385 41 117 236 541 -70 262 434 155 585 477 -171
1279a71r2N65l04k29M78m93l47L24M30m36mk2j45R6M11l2j37n7k01J52L86L94
$$ -171 -263 302 -2 -231 247 -246 -593 -269 161 -275 -279 -301 -446 -350 61 29 -108 -165 -366 -214 172 566
1301E66n98K15J1r8K94M08n73M2mk32J90K18m00m6j56k33j3L12O3l31K2j24K37
$$ 566 -32 183 194 96 390 798 225 267 263 31 221 439 39 -7 -163 -396 -409 -97 -34 -365 -343 -467 -230
1324b30o5K12k93M74j82K05j06M9P3j72M07j11o3P6j40O0J76o8j18r6Q2l38M91
$$ -230 -295 -83 -376 98 -84 121 15 64 137 -35 372 261 198 274 134 194 370 302 184 88 170 -168 323
1347C23m46j68K20lm2k80J17n8J73P0k9j74R8Q9l1L72q5k33L1J83J62k02K75k3
$$ 323 -123 -291 -71 -74 -116 -396 -279 -337 -164 -94 -123 -297 -199 -110 -141 231 146 -87 -56 127 289 87 362 339
1371C39N1j82P6O1k33K8l6j35N7K29k68rm52RK88o0j21K39l99J19L17K2L31j91
$$ 339 390 208 284 345 112 140 104 -31 26 255 -13 -22 -474 -465 -177 -237 -358 -119 -518 -399 -82 -60 271 80
1395H0k3L4j56L19K40j13j13j01jK13j8l07L8j70K9P9r8M7k40J1n4K20l4q8J6
$$ 80 57 91 -65 254 494 381 268 167 166 379 361 54 92 -78 -49 30 -68 -21 -261 -250 -304 -84 -118 -206 -190
1420a90j50mL82J3k56L11l29M5O07mk32O7j04j86L59R4k78J47k50j07L2P8k01
$$ -190 -340 -344 38 51 -205 106 -223 -178 429 425 193 260 156 -30 329 423 145 292 42 -65 -33 45 -156
1443a56K3nj10O9J86o5j01L4k2j95K78O4j62j15J80K47j47p6M30k14m7K73m49
$$ -156 -133 -138 -248 -179 7 -58 -159 -125 -147 -342 -64 0 -162 -277 -97 150 3 -73 357 143 96 369 -80
1466h0J77J56k03j70M28j04k54M04l17k55L7K51p5j92o7J15K7r3j24j3K48J81
$$ -80 97 253 50 -120 308 204 -50 354 37 -218 -181 70 -5 -197 -264 -149 -122 -215 -339 -352 -104 77
1488G7o01M85K01L0l06L40J55j71l18L07n5L9K29j48k71K22%j06p9j83O8m7J91
$$ 77 -524 -39 162 192 -114 226 381 210 -108 199 144 183 412 264 -7 215 215 109 30 -153 -85 -132 59
1511E9j44k12m2K95k79O1k6K3j89M46j15J54Q0J33n13J92K56j05j04K00R2k03
$$ 59 -85 -297 -339 -44 -323 -262 -288 -265 -454 -8 -123 31 111 244 -269 -77 179 74 -30 170 262 59
1533E9N30No12o0N97o00J07k5j35pK57J18o83K16j78P1K69J25k05l07N46l9J16
$$ 59 589 594 -18 -78 519 -81 26 1 -134 -141 116 234 -449 -233 -411 -340 -71 54 -151 -458 88 49 165
1556A65J03k39k52M40J98m20K50j74j85M4M56j64l27J70J28j69J11n0o07J5Q05
$$ 165 268 29 -223 217 415 -5 245 71 -114 -70 386 222 -105 65 193 24 135 85 -522 -507 298
1577B98l27j03J87k23l10K19M34k79j52R8P1o9O29j32n18J42K91l10M09J60m93
$$ 298 -29 -132 55 -168 -478 -259 175 -104 -256 -158 -87 -156 473 341 -177 -35 256 -54 355 515 22
1598B2k12P67j60n59K60l93j43O20K29p78J01L36k21o9K61k70k37K31J05l6pO62
$$ 22 -190 577 417 -142 118 -275 -418 202 431 -347 -246 90 -131 -200 61 -209 -446 -215 -110 -146 -153 509
1620E09o17M4M79l99J14r1L73m35P0J06j63k0L39j14k72L09k69k20L29O2k62J09
$$ 509 -108 -64 415 16 130 39 412 -23 47 153 -10 -30 309 195 -77 232 -37 -257 72 134 -128 -19
1642a9j89j32M26R8l32l27M05J76k10K31J14m87K50K40j41M4J83l53J87L36k39
$$ -19 -208 -340 86 184 -148 -475 -70 106 -104 127 241 -246 4 244 103 147 330 -23 164 500 261
1663B61n27P26k67k38K31K1m37K0J48l7QJ35J03k38j61M43l28k98M43j7kJ08J40
$$ 261 -266 460 193 -45 186 207 -230 -210 -62 -99 -91 44 147 -91 -252 191 -137 -435 8 -9 -11 97 237
1686B37m84J75M24n9m23M07k56j32P35k70l12M3j13r1M5K39k24l30L13N2j48K61
$$ 237 -247 -72 352 293 -130 277 21 -111 624 354 42 85 -28 -119 -74 165 -59 -389 -76 -24 -172 89
1708H9j96j90L24K24l17j47L4J35k85L95L08k28p6J04j06P3L20n32O9n2L24j50
$$ 89 -107 -297 27 251 -66 -213 -179 -44 -329 66 374 146 70 174 68 141 461 -71 -2 -54 270 120
1730A20J5J36k02NJ16l24Q0Q0O2m84J91K53l00K40K05o76K06O83m60j16L60j0
$$ 120 135 271 69 74 190 -134 -54 26 88 -396 -205 48 -252 -12 193 -483 -277 406 -54 -170 190 180
1752A80j88M41k77k48M26k16l15M44k84J03l67M12k35K74r6J86m90m8j8m2K58
$$ 180 -8 433 156 -92 334 118 -197 247 -37 66 -301 111 -124 150 54 240 -250 -298 -316 -358 -100
1773a00K15k68r1p5K62J62j29M2l99M0O36k47mr2L32l31J48M12k10k25Q9q1k54
$$ -100 115 -153 -244 -319 -57 105 -24 18 -381 -341 295 48 44 -48 284 -47 101 513 303 78 167 86 -168
1796a68J73L2l65L68k07L9j29K12K06m03L66j22k42K6L10O2j88J14k43K51J77
$$ -168 5 37 -328 40 -167 -128 -257 -45 161 -242 124 2 -240 -214 96 158 -30 84 -159 92 269
1817B69r4O2j10m0M5K22k35p7M8j03m4K40L3l23N0R8qq6j43P8Pj49L59j3k11R1
$$ 269 175 237 127 87 132 354 119 42 90 -13 -57 183 216 -107 -57 41 33 -53 -196 -118 -111 -260 99 86 -125 -34
1843c4p1m9L30j01l07N44k97k00K84J38l1j40j59K49jo9j56p4L53l50M7J56q2
$$ -34 -105 -154 176 75 -232 312 15 -185 99 237 206 66 -93 156 155 86 -70 -144 209 -141 -94 62 -20
1866b0j90R4J11qk11K07K17j21j74p1J05J35L37m24j04K33j8K4L2P6j56OR6m2
$$ -20 -210 -116 -5 -13 -224 -17 200 79 -95 -166 -61 74 411 -13 -117 116 98 122 154 230 74 80 176 134
1890A34n2o1k2N5j13L7R4q5q4k94J90m2J22J21k36J8K76k12L77N1j28Lk34L39
$$ 134 82 21 -1 54 -59 -22 72 -13 -97 -391 -201 -243 -121 0 -236 -218 58 -154 223 274 146 149 -85 254
1914B54%J62j56j69L3K6J17j44R2k86L57m92L09k84J18P7R1j39o3J3l0R5LK3M4
$$ 254 254 416 260 91 124 150 267 123 215 -71 286 -206 103 -181 -63 14 105 -34 -97 -84 -114 -19 -16 7 51
1939E1k89J49J05k22J02J04K38j35J18k46J41j1K71j93q5L39m82L0M7K2j91J84
$$ 51 -238 -89 16 -206 -104 0 238 103 221 -25 116 105 376 183 98 437 -45 -15 32 54 -137 47
1961D7j41p9J44J20n27K42K72j58n4j27J25j01K71j78J29n6M01l45P4K24k29k86
$$ 47 -94 -173 -29 91 -436 -194 78 -80 -134 -261 -136 -237 34 -144 -15 -71 330 -15 59 283 54 -232
1983b32K57L7M9K77l18j95J75J32k52p4L05j0m71K94J4l10J16J99R0l10O3K07
$$ -232 25 62 111 388 70 -125 50 182 -70 -144 161 151 -320 -26 -12 -322 -206 -7 83 -227 -164 43
2005D3J8r9qo2J62p0K93l58N53l00p6m3R4k1r4O7k17K99m02J85k3m8O7l19K37
$$ 43 61 -38 -46 -108 54 -16 277 -81 472 172 96 53 147 126 32 99 -118 181 -221 -36 -59 -107 -40 -359 -122
2030a22K19l40L12m0j71M06m26j34M2L69r8k59M11j01p0K90K7k38LM7Q2l19J88
$$ -122 97 -243 69 29 -142 264 -162 -296 -254 115 17 -242 169 68 -2 288 315 77 80 127 209 -110 78
2053G8n3j91K60o7j67J48J00k80J90J69k33l09M3J79L6j8J22l2k71O41j50l47
$$ 78 25 -166 94 27 -140 8 108 -172 18 187 -46 -355 -312 -133 -97 -115 7 -25 -296 345 195 -152
2075a52R1r6K71j3J88Q6o18K94j63L8K38j05j29M0j4j95K67J72m12K48J70j31
$$ -152 -61 -157 114 101 289 375 -243 51 -112 -74 164 59 -70 -30 -44 -239 28 200 -212 36 206 75
2097G5m24M29p0k81L17J78j87k87N36l92J36Q9L4j53j82L02j24L2Nk37J13J73
$$ 75 -349 80 10 -271 46 224 37 -250 286 -106 30 119 153 0 -182 120 -4 28 33 -204 -91 82
2119H2j42K19m6j33o4P6K6l72N25j81l83N66j90j61O0M42k00j99n2K52K4J15q0
$$ 82 -60 159 113 -20 -84 -8 18 -354 171 -10 -393 173 -17 -178 -118 324 124 -75 -127 125 149 264 184
2142A84j00j32J26q1m29L91k4KM3K25o7k55N7K1k02L28P1j04j05N3l11J91J52
$$ 184 84 -48 78 -3 -432 -41 -65 -63 -20 205 138 -117 -60 -39 -241 87 158 54 -51 2 -309 -118 34
2165C4j27rK71l36M23k91O7PQ3j04J62j61Q3J28j36j73M03k82L0j78J03M2o1L40
$$ 34 -93 -102 169 -167 256 -35 32 39 122 18 180 19 102 230 94 -79 324 42 72 -106 -3 39 -22 318
2189C18o17J48lJ25r9j79J27J83J96j06l33L01O2k64L1M00j85j21K04P3r8k56
$$ 318 -299 -151 -154 -29 -128 -307 -180 3 199 93 -240 61 123 -141 -110 290 105 -16 188 261 163 -93
2211i3J54q6J1J5j15J23J10j96k24M01j42k31K62o0j03K68j5m28J85J69L8j12
$$ -93 61 -25 -14 1 -114 9 119 -77 -301 100 -42 -273 -11 -71 -174 94 79 -349 -164 5 43 -69
2233f9K82j46j47K7l2QM43p0k85j53M5K61K4j09l03J24J26j78J22J5J20k25J50
$$ -69 213 67 -80 -53 -85 -77 366 296 11 -142 -97 164 188 79 -224 -100 26 -152 -30 -15 105 -120 30
2256C0k34j09K60k6j80J4L19j05j58K51l95K65K31k2n6Oj94R1q1Q0l9p3K91l4
$$ 30 -204 -313 -53 -79 -259 -245 74 -31 -189 62 -333 -68 163 141 85 91 -103 -12 -93 -13 -52 -125 166 132
2280A32l38J82j70L96j49k61J23j44R6j15j7q9K13K54j42L5J52l3j1l09K23O3
$$ 132 -206 -24 -194 202 53 -208 -85 -229 -133 -248 -265 -354 -141 113 -29 6 158 125 114 -195 28 91
2302I1j08K24l00m2K98j63J19r7n9L44m13kpP2Rj89o2L07j80J14QK17j84J13p6
$$ 91 -17 207 -93 -135 163 0 119 22 -37 307 -106 -108 -115 -43 -34 -223 -285 22 -158 -44 -36 181 -3 110 34
2327C4j73K35q8m1P7rj2o3J84j28q9J27J45jj36o3j97O4O5N9j11K22m31M68l91
$$ 34 -139 96 8 -33 44 35 23 -40 144 16 -73 54 199 198 62 -1 -198 -134 -69 -10 -121 101 -330 138 -253
2352b53K29q8J48j44J23p5k61K90%j9J77k37L4O4n7P4L6J7O4K31m70K85R3j02
$$ -253 -24 -112 36 -108 15 -60 -321 -31 -31 -50 127 -110 -76 -12 -69 5 41 58 122 353 -117 168 261 159
2376A59j60j05n4L3K38M6k68J94j38P4J16j11l80L47q3j8Q4J12q1j15L14k03P2
$$ 159 -1 -106 -160 -127 111 157 -111 83 -55 19 135 24 -356 -9 -92 -110 -26 86 5 -110 204 1 73
2399G3Q6j21J5j69K93J31k20J20j33k65K97K8k86J11J07j63J13j10K38j91J63
$$ 73 159 38 53 -116 177 308 88 208 75 -190 107 135 -151 -40 67 -96 17 -93 145 -46 117
2420A17j08J48q3l91K25K44m27K96J13%J38k73O8K93k92k20L11k05J87k71K55
$$ 117 9 157 74 -317 -92 152 -275 21 134 134 272 -1 67 360 68 -152 159 -46 141 -130 125
2441A25k76L54l73J88K0J12k48J19r4j42K88k96K44J26M3k17K6L6l8k28K56j1
$$ 125 -151 203 -170 18 38 150 -98 21 -73 -215 73 -223 21 147 190 -27 -1 35 -3 -231 25 14
2463A4L1J17j77J77j19K2J61j54M9j36L29j27k67O6j36k6M5K05l19J99J79k50
$$ 14 45 162 -15 162 43 65 226 72 121 -15 314 187 -80 -14 -150 -176 -131 74 -245 -46 133 -117
2485a17K00p6RnoK38k74Rm0mJ8J81j97J02j26M4K4K60p0K0l74K87N4q6k23K71
$$ -117 83 7 16 11 5 243 -31 -22 -62 -66 -48 133 -64 38 -88 -44 -20 240 170 190 -184 103 157 71 -152 119
2511A19k24N9J38O5k20J63m11L69K9P3l45K25K28l98J13Kk62K77K81j75P6l24
$$ 119 -105 -46 92 157 -63 100 -311 58 87 160 -185 40 268 -130 -17 -15 -277 0 281 106 182 -142
2533a42L96k60P0M8j7K07j78p9o9k4J70k35P2Q0j1m7j93L06k34j50L47q1K78l50
$$ -142 254 -6 64 112 95 302 124 45 -24 -48 122 -113 -41 39 28 -19 -212 94 -140 -290 57 -24 254 -96
2557i6K68j48PJ15j31L4j58J60K07n2l48j0J95O5p9n0m1J7q9j31J29j16J61NP3
$$ -96 172 24 31 146 15 49 -109 51 258 206 -142 -152 43 108 29 -21 -62 -45 -134 -265 -136 -252 -91 -86 -13
2582a3o8K22j13p3J45j40K17k79R3J27J89l11j72K68p5J07j89lK58n8J7j23J40
$$ -13 -81 141 28 -45 100 -40 177 -102 -9 118 307 -4 -176 92 17 124 -65 -68 190 132 149 26 166
2605A66q3k23l1K73o2o5j59Q2R4K10j69p0J50j97PJ94l04K60j60J12K01j20j37
$$ 166 83 -140 -171 102 40 -25 -184 -102 -8 202 33 -37 113 -84 -77 117 -187 73 -87 25 226 106 -31
2628c1J08M6k37L13k41jN3k2P6r2J48k98M65k32k06J16J27j97J61k4k67K42J9
$$ -31 77 123 -114 199 -42 -43 10 -12 64 -28 120 -178 287 55 -151 -35 92 -105 56 32 -235 7 26
2651B6l0J07j54Q1o2J65O1j88p7K87j54k04K96l3%l51Q7K16j6k06J05oj18O3R3
$$ 26 -4 103 -51 30 -32 133 194 6 -71 216 62 -142 154 121 121 -230 -143 73 57 -149 -44 -50 -168 -105 -12
2676a2p4P0M5k0j06K46j40l03L90k51N3J68o5J28j33m6p0J72K2q1J00K22k76J12
$$ -12 -86 -16 29 9 -97 149 9 -294 96 -155 -102 66 1 129 -4 -50 -120 52 74 -7 93 315 39 151
2700A51J8m23J8K38k5J73k82r1J60o7o0N6K04j27J48K2j23j43j87L26J06Pj30
$$ 151 169 -254 -236 2 -23 150 -132 -223 -63 -130 -190 -134 70 -57 91 113 -10 -153 -340 -14 92 99 -31
2723c1J28k33K4L61j66q1j43M2J76l3O7j31j04o3L44j22l8M7j97K09j42k01r8
$$ -31 97 -136 -112 249 83 2 -141 -99 77 44 111 -20 -124 -187 157 35 -3 44 -153 56 -86 -287 -385
2746c85K84R0l4K07r0j63r6L34qk09M1J00Lj51J33j42P6j48j31L20J6Q0k93M08
$$ -385 -101 -11 -45 162 72 -91 -187 147 139 -70 -29 71 74 -77 56 -86 -10 -158 -289 31 47 127 -166 242
2770B42k13j87M3Jm2Q3L30k85J27k31R2l1J46k3n5o3P3J36q6P2n2j60J52L36m83
$$ 242 29 -158 -115 -114 -156 -73 257 -28 99 -132 -40 -71 75 52 -3 -66 7 143 57 129 77 -83 69 405 -78
2795g8J29O3J3j05J04J42j93n3j71J77J11Q0k35K9J00j30l07R2J91LP0l4j20L60
$$ -78 51 114 127 22 126 268 75 22 -149 28 139 219 -16 13 113 -17 -324 -232 -41 -38 32 -2 -122 238
2819B38k11J43R0l16L61n28K90Rr2Q2J74m16L50N2k71J38k73J98q0L45o00K68
$$ 238 27 170 260 -56 305 -223 67 76 -16 66 240 -176 174 226 -45 93 -180 18 -62 283 -317 -49
2841d9pJ92K31n27M0k7n7J36K03Q3j34J98j57l18J54o5J40l19N02Q0l57l1N8J30
$$ -49 -56 136 367 -160 -120 -147 -204 -68 135 218 84 282 125 -193 -39 -104 36 -283 219 299 -58 -89 -31 99
2865I9k7m61L72j97R3m6K44On4j3l6O2l07o7N52l26K60j36J72j24j04M6J43q4
$$ 99 72 -389 -17 -214 -121 -167 77 83 29 16 -20 42 -265 -332 220 -106 154 18 190 66 -38 8 151 67
2889F7Q1K4l24O8j56M4K82J8j44l29K29J77p1O0JKj59N3lL03j76k33L24j6m32
$$ 67 148 172 -152 -84 -240 -196 86 104 -40 -369 -140 37 -34 26 27 29 -130 -77 -80 223 47 -186 138 122 -310
2914c10K09J04j88L13j65k5n2O8R6j07J56j85jK12p5k1J67k81l41N69l14o9K45
$$ -310 -101 3 -185 128 -37 -62 -114 -46 50 -57 99 -86 -87 125 50 29 196 -85 -426 143 -171 -240 5
2937Ej15L14o0j76%k11L25K06k35K09j27j61o8K95o6Qk96K97j23k10K42o2M0n
$$ 5 -110 204 144 -32 -32 -243 82 288 53 262 135 -26 -94 201 135 143 -153 144 21 -189 53 -9 31 26
2961B6k5j69J80k45L36j63j86J81K06n4J2J54r9j26Pj41Q5J57j61o8M6K24J46
$$ 26 1 -168 12 -233 103 -60 -246 -65 141 87 99 253 154 28 35 -106 -21 136 -25 -93 -47 177 323
2984C23j99k85m4K69j07J98j56r4K06k12J33r5J94m21K19J85j67k65L89L9l43
$$ 323 124 -161 -205 64 -43 155 -1 -95 111 -101 32 -63 131 -290 -71 114 -53 -318 71 110 -233
3005b33L30j29P6j23K8K25k30J86j96l9J55k42J39J58k57N5l5J60k71K54j05J82
$$ -233 97 -32 44 -79 -51 174 -56 130 -66 -105 50 -192 -53 105 -152 -97 -132 28 -243 11 -94 88
3027H8Q6j11k5k75L30l6Q1k92J32j26K90J4j55K94j57r7j85J06j28M21k27K9j25
$$ 88 174 63 38 -237 93 57 138 -154 -22 -148 142 156 1 295 138 41 -144 -38 -166 255 28 57 -68
3050f8L0J48J86m56J14K4O5j60J49n0L5O2j02p0J55j25J65k83L93j60L0j45O6
$$ -68 -38 110 296 -160 -46 -22 43 -117 32 -18 17 79 -23 -93 62 -63 102 -181 212 52 82 -63 3
3073Ck03J56j3j10KK36j42j27L08n0p6R5j39M5j47L86l54o3K97J96l12Q2j12j
$$ 3 -200 -44 -57 -167 -165 71 -71 -198 110 60 -16 79 -60 -15 -162 224 -130 -193 104 300 -12 70 -42 -43
3097d3L65l83Q2q2m9R7j02n1Q7K76j53N3M4j5j35O8j5Mk19K80j30j07K41k7J18
$$ -43 322 -61 21 -61 -110 -13 -115 -166 -79 197 44 97 141 126 -9 59 44 48 -171 109 -21 -128 113 86 204
3122B04k41j68L01l76K30r1n1jK4l7L37l42J96J0Q6Oj03R1r2P2j87K50j61R5L1
$$ 204 -37 -205 96 -280 -50 -141 -192 -193 -169 -206 131 -211 -15 -5 81 87 -16 75 -17 55 -132 118 -43 52 83
3147H3j65J06j6J58p2j53O7m8M4J22j40q6j25K77L7p4R1m4q0j2j16K87J3o4o0
$$ 83 -82 24 8 166 94 -59 8 -40 4 126 -14 -100 -225 52 89 15 106 62 -18 -30 -146 141 154 90 30
3172C0M6J05j12J56k51O5j76p3K06jo4J28l28K53n7N1l33M86j64%O7j51J15k29
$$ 30 76 181 69 225 -26 39 -137 -210 -4 -5 -69 59 -269 -16 -73 -22 -355 131 -33 -33 34 -117 -2 -231
3196b31L23k08nM6P0j8Q1j89J52o3J96j77K55n9J57m14K72k46r1J15J51q6M8P0
$$ -231 92 -116 -121 -75 -5 -23 58 -131 21 -42 154 -23 232 173 330 -84 188 -58 -149 -34 117 31 79 149
3220A49k67J58j90L1J09Q6j89N6O7K24m02Q6K84k07K35k87j06J5J83J65j41l5
$$ 149 -118 40 -150 -119 -10 76 -113 -57 10 234 -168 -82 202 -5 230 -57 -163 -148 35 200 59 24
3242B4j90J52j48K30l68L10K54j41O4r5m16K22j16J74p1p1K78o8j51K30O1l51
$$ 24 -166 -14 -162 68 -300 10 264 123 187 92 -324 -102 -218 -44 -115 -186 92 24 -127 103 164 -187
3264a87J92k5k8m6pK7J32j88J09J35j43q2M4J40j73K77j73r1R7r5K27mj44O6K2
$$ -187 5 -20 -48 -94 -101 -74 58 -130 -21 114 -29 -111 -67 73 -100 177 4 -87 10 -85 142 138 -6 60 82
3289H2r5p4J4k0J29k87K52Q9PJ69k48Q9m3J62j13j78O6j50L49l57J52jr7J06n0
$$ 82 -13 -87 -73 -93 36 -251 1 90 97 266 18 107 64 226 113 -65 1 -149 200 -157 -5 -6 -103 3 -47
3314d7LM5J22j82L7J4j8J32k32K60j38j29M18j19l12K21R8MJ88m95P2R2M6O6l14
$$ -47 -44 1 123 -59 -22 -8 -26 106 -126 134 -4 -133 285 166 -146 75 173 177 365 -130 -58 34 80 146 -168
3339a68J00J27r7l6J85R9k40O6j91J70O8j25J03K10n51K69p7J93p2N7j27j26L31
$$ -168 -68 59 -38 -74 111 210 -30 36 -155 15 83 -42 61 271 -280 -11 -88 105 33 90 -37 -163 168
3362A68k4j19M6j48K74k26J05lk58K91j68p1J46n3r9r3J18L7J33o8k7q0K49J1
$$ 168 144 25 71 -77 197 -29 76 73 -185 106 -62 -133 13 -40 -139 -232 -114 -77 56 -12 -39 -119 130 141
3386A41l30L75o7k17J64l2k32J5K31j12o7J44l6J34K3oJ62k72j40J37n8O8n1j0
$$ 141 -189 186 119 -98 66 34 -198 -183 48 -64 -131 13 -23 111 134 128 290 18 -122 15 -43 25 -26 -36
3410c6j47K40o3R4j81P4n0J70l29M17k60pjJ03J00o6J76m53L73k16Q4q3P4J5k19
$$ -36 -183 57 -6 88 -93 -19 -69 101 -228 189 -71 -78 -79 24 124 58 234 -219 154 -62 22 -61 13 28 -191
3435a91J72J03n25M08kj01K50k19%L29k87J83l42L39k58j28L53N6q3j79O3m4J53
$$ -191 -19 84 -441 -33 -35 -136 114 -105 -105 224 -63 120 -222 117 -141 -269 84 140 57 -122 -59 -103 50
3458E0j28K24m8j3l43J23L35M0lk77j89K33J39O2l14R6j12K19q8O2j10j33K33
$$ 50 -78 146 98 85 -258 -135 200 240 237 -40 -229 4 143 205 -109 -13 -125 94 6 68 -42 -175 58
3481E8j04j00m9L02N0j72j33P2J70k27K91k57J28p0l3K24k18r1J72J9k73K74q5
$$ 58 -46 -146 -195 107 157 -15 -148 -76 94 -133 158 -99 29 -41 -74 150 -68 -159 13 32 -241 33 -52
3504e2p4K59j36J40j24J76k78K66k73M6j20O3K57p8m8j91J49P3rR4k99N24o53
$$ -52 -126 133 -3 137 13 189 -89 177 -96 -50 -170 -107 150 72 24 -167 -18 55 46 140 -159 365 -288
3527b88M43m19L95k08j52L9M8m3P0K39j89K63l54L32l37K69j15J54j31j08K30
$$ -288 155 -264 131 -77 -229 -190 -142 -185 -115 124 -65 198 -156 176 -161 108 -7 147 16 -92 138
3548A38j2j45K4K3J5R6j50r2k92jO13ll7j37L0%j93N6J28j12J47j86J05p0J84
$$ 138 126 -19 5 28 43 139 -11 -103 -395 -396 217 214 177 40 70 70 -123 -67 61 -51 96 -90 15 -55 129
3573A29j30q7M1j27J36j62K46J4j02J85j15K1j20K81n84L24rJ66j87J10k21J2
$$ 129 -1 -88 -47 -174 -38 -200 46 60 -42 143 28 49 -71 210 -374 -50 -59 107 -80 30 -191 -179
3595a79L14k61K10j2J50k10L2j55K18k98J18k33K17N6K8k11M46m24J04L54k08
$$ -179 135 -126 84 72 222 12 44 -111 107 -191 -73 -306 -89 -33 -5 -216 230 -194 -90 264 56
3616E6k22p7L64j01k36M9N29m84K49k24J61J9r3L30k64q6K14j26k4r5j2j35J93
$$ 56 -166 -243 121 20 -216 -167 362 -122 127 -97 64 83 -10 320 56 -30 184 58 34 -61 -73 -208 -15
3639a5o6Q1J05Lo5j61J66n8j8O7r6nJ04l07L47Pp9Q9J53k83k22L29m6j85K5p6
$$ -15 -81 0 105 108 43 -118 48 -10 -28 39 -57 -62 42 -265 82 89 10 99 252 -31 -253 76 30 -155 -130 -206
3665b06J4R3J28K1j40P1j05M02k78l1J02j38j8l2M43l99J44k1r9r8M17l31P6j14
$$ -206 -192 -99 29 50 -90 -19 -124 278 0 -31 71 -67 -85 -117 326 -73 71 50 -49 -147 270 -61 15 -99
3689i9J45O9J08k22K54j61k36j0k6K31l22K81P3l6M0j89R8r6j07pK20o2P3nlJ31
$$ -99 46 115 223 1 255 94 -142 -152 -178 53 -269 12 85 49 89 -100 -2 -98 -205 -212 8 -54 19 14 11 142
3715A42l34kJ06J92k8l38O8N5L6Q1j37L52k99K03O4k28J73J1J2j58Q0j27j9j02
$$ 142 -192 -194 -88 104 76 -262 -194 -139 -103 -22 -159 193 -106 97 161 -67 106 117 129 -29 51 -76 -95 -197
3739a97J79j87K93j06M1j80j69M04m1k64L98Mj31J26n06M54p3q4lJ55j05J10K9
$$ -197 -18 -205 88 -18 23 -157 -326 78 37 -227 171 175 44 170 -336 118 45 -39 -42 113 8 118 147
3762A47k58j28L23k87J25J36Q3n1j17j13K01Qk22K48j46J02J21J70n25K30K18
$$ 147 -111 -239 84 -203 -78 58 141 90 -27 -140 61 69 -153 95 -51 51 172 342 -183 47 265
3783B65k90R4j55J73L1j7K8j51J31k74J54J54Mk18q3J76J37m69L62L9m8j53M88
$$ 265 -25 69 -86 87 118 101 129 -22 109 -165 -11 143 147 -71 -154 22 159 -310 52 91 43 -110 378
3806C78k26l57R4j46L71k6p7J07O0r1l16K20K3n5K0r6k1J1K50m4q3p4o2J62l73
$$ 378 152 -205 -111 -257 114 88 11 118 178 87 -229 -9 14 -41 -21 -117 -138 -127 123 79 -4 -78 -140 22 -351
3831c51N60k42J77k42J02l30L72j20j08J0J57K9r4K0J78k60K46j61L32l19J58
$$ -351 209 -33 144 -98 4 -326 46 -74 -182 -172 -15 14 -80 -60 118 -142 104 -57 275 -44 114
3852A14j58J41J5p2J10k24q0J34P0j05M62n07O2K06l12J77N4q8K4m5Q8q8N7J13
$$ 114 -44 97 112 40 150 -74 -154 -20 50 -55 407 -100 -38 168 -144 33 87 -1 23 -22 66 -22 35 148
3876A48j31k52M6L25l45J62j5k9J96j14J4J81k55J10j1P9j0j53J6pN3J5k23J44
$$ 148 17 -235 -189 136 -209 -47 -62 -91 105 -9 5 186 -69 41 30 109 99 -54 -38 -45 8 23 -200 -56
3900e6N9K6L8j36J60o1j81P4J69r4J68k2j47nj3J4J88l27L71M7l34Q9j50M2J38
$$ -56 3 29 67 -69 91 30 -151 -77 92 -2 166 144 -3 -8 -21 -7 181 -146 225 272 -62 27 -123 -81 57
3925E7o7k19M7L34k74j28M53k37OM8q9M9J14j77M6J78L5l17O2%O3K35k27qko4
$$ 57 -10 -229 -182 152 -122 -250 203 -34 -28 20 -69 -20 94 -83 -37 141 176 -141 -79 -79 -16 219 -8 -16 -18 -82
3951h2J8K13l6J9Q9k22R7J3J1j32K24j29j82O0P9M9l61L86l99M12k45K30j9qj35
$$ -82 -64 149 113 132 221 -1 96 109 120 -12 212 83 -99 -39 40 89 -272 114 -285 127 -118 112 93 85 -50
3976e0K3j12K60k16O7p2J31j5Q5k11K80k3m2n7m0qJJ80j33k2o4K37m11J72J74
$$ -50 -27 -139 121 -95 -28 -100 31 16 101 -110 170 147 105 48 8 0 1 181 48 26 -38 199 -212 -40 134
4001A34m5n8L06m05Q5j85J44J13J01o9j25m1J74j88l2K08l18K80k27k03K02R4
$$ 134 89 31 337 -68 17 -168 -24 89 190 121 -4 -45 129 -59 -91 117 -201 79 -148 -351 -149 -55
4023e5J4R8L6j91J72k71J83J50m04L29k34L39j60J45o6j26P8j18J69k56J19ml8
$$ -55 -41 57 93 -98 74 -197 -14 136 -268 61 -173 166 6 151 85 -41 37 -81 88 -168 -49 -53 -91
4046i1L8k93L86J34r7j3j73l8L36j67r5pm9J53O0k43j04L52k52P0J77j06J86j78
$$ -91 -53 -346 40 174 77 64 -109 -147 189 22 -73 -80 -129 24 84 -159 -263 89 -163 -93 84 -22 164 -14
4070a4P4k40N5M00l09P0k1K75k76J13j9J6k70J98K0k52K92q7J42j46Mk68L63n1
$$ -14 60 -180 -125 275 -34 36 15 290 14 127 108 124 -146 52 72 -180 112 25 167 21 25 -243 120 69
4094F9l0n4L30l23j19J24K14j99J0pj30J36N7K6j37m3J31j05j04k5O7j9J58j8
$$ 69 39 -15 315 -8 -127 -3 211 12 22 15 -115 21 78 104 -33 -76 55 -50 -154 -179 -112 -131 27 9
4118Il2J59k04J46l03j7K04J3J39j76R8n7L7Q0N5Q1j91j43J52j34L89o7k67K29
$$ 9 -23 136 -68 78 -225 -242 -38 -25 114 -62 36 -21 16 96 151 232 41 -102 50 -84 305 238 -29 200
4142B00j36o0J51M1l50O7L33j93j5j07j4P7J07j38j8J17q0O2K58k71L6J76m64
$$ 200 64 4 155 196 -154 -87 246 53 38 -69 -83 -6 101 -37 -55 62 -18 44 302 31 67 243 -221
4165b21J59J30l66M18r0No0N9o2K00j56p8L0K15k14j28J87j62J15j88J61l8P4
$$ -221 -62 68 -298 120 30 35 -25 34 -28 172 16 -62 -32 183 -31 -159 28 -134 -19 -207 -46 -84 -10
4188a0R7k4j33j93K06J9K84k91l14K46J01r4M06n26K84J42k45p4n7K44l22L33
$$ -10 87 63 -70 -263 -57 -38 246 -45 -359 -113 -12 -106 300 -226 58 200 -45 -119 -176 68 -254 79
4210G9p9O0P9k13M5Q8k23K32l13K67J9J26k18j3M1o0J67m90L44Q3M3j20j0O4P1
$$ 79 0 60 139 -74 -29 59 -164 68 -245 22 41 167 -51 -64 -23 -83 84 -406 -62 21 64 -56 -66 -2 69
4235F9n8j31j4K05n1j51L16J7k51R4j12k42K95j29J44N7R2j11m1p0L67K9l27j0
$$ 69 11 -120 -134 71 20 -131 185 202 -49 45 -67 -309 -14 -143 1 58 150 39 -2 -72 295 324 -3 -13
4259a3N1J3j23j09J23k9j32K72K69l57j69L77j76j21K08k20K73k16Q3J90k91K9
$$ -13 38 51 -72 -181 -58 -87 -219 53 322 -35 -204 173 -3 -124 84 -136 137 -79 4 194 -97 -68
4281f8K43j47J64mk72r8L9L25j47o2k15K23Q6P5r7r1Nm0o1M33k36k5l6K77k60
$$ -68 175 28 192 188 -84 -182 -143 182 35 -27 -242 -19 67 142 45 -46 -41 -81 -142 291 55 30 -6 271 11
4306A1m5J4J00j3K32m58J54J7o8q3J70J4j98L10j85L21k30l9J50j79J05Lk52J48
$$ 11 -34 -20 80 67 299 -159 -5 12 -56 -139 31 45 -153 157 -28 293 63 24 174 -5 100 103 -149 -1
4330aj3L43p4k41jK6o9J59j8p5o8j44L44j57P6j69K33k2R3p9j07p2L54m19K18
$$ -1 -14 329 255 14 13 39 -30 129 111 36 -32 -176 168 11 87 -82 151 129 222 143 36 -36 318 -101 117
4355A17m8N5l04J97J28l44J53L95j91j42k2k7m4P0k9P7QR8k83J99J22l8k62P3
$$ 117 69 124 -180 17 145 -199 -46 349 158 16 -6 -33 -77 -7 -36 41 49 147 -136 63 185 147 -115 -42
4379d2N8j41J06n1J43J82m96M41j57l5K99l14J18k65L04j7j10o3j5p5L30k91L18
$$ -42 16 -125 -19 -70 73 255 -241 200 43 8 307 -7 111 -154 150 133 23 -40 -55 -130 200 -91 227
4402B27j6m09K3K09P1N4k23K34n12J63m9K28k32P9J95j57J78j76K4m3J48K8r9
$$ 227 211 -198 -175 34 105 159 -64 170 -342 -179 -228 0 -232 -153 42 -115 63 -113 -89 -132 16 44 -55
4425e5K00k28J5O6j15R6J31l21mJ17j32L09k6L6j05J84o6k08J50K67l8m40J69
$$ -55 145 -83 -68 -2 -117 -21 110 -211 -215 -98 -230 79 53 89 -16 168 102 -106 44 311 273 -167 2
4448BJ6Kj39pK80N7k4l80L14j03J43j77J98j71j25J65k97L56k6k26pj29J64P9
$$ 2 18 20 -119 -126 154 211 187 -193 121 18 161 -16 182 11 -114 51 -246 110 84 -142 -149 -278 -114 -35
4472c5J66M9m07N5p3K75j59j33M84k15N1m5o5j40K57j04lJ78k88j03L27J5r7L3
$$ -35 131 180 -227 -172 -245 30 -129 -262 222 7 58 13 -52 -192 65 -39 -42 136 -152 -255 72 87 -10 23
4496B3J23q3J8J15j66k5K7jJ26l09J29l21J71K47l4q3Jj61J94M3q0j90P8K70j36
$$ 23 146 63 81 196 30 5 32 31 157 -152 -23 -344 -173 74 40 -43 -42 -203 -9 34 -46 -236 -158 112 -24
4521b4N8m5p5K09p3l47M63k53O3j92J05J47QJ08j50k5j33OJ33j32K93n3j89J01
$$ -24 34 -11 -86 123 50 -297 166 -87 -24 -216 -111 36 44 152 2 -23 -156 -150 -17 -149 144 91 -98 3
4545Cn6pj70J90q2L39k72j3J75R6k22r6J89L3j29L2K81r3j49j68J80L7j68R5k34
$$ 3 -53 -60 -230 -40 -122 217 -55 -68 107 203 -19 -115 74 107 -22 10 291 198 49 -119 61 98 -70 25 -209
4570b09J50o4J24m6O7m5j5J62k21J00J09j8j95J48Lp8k05K53o4J04j15o3J66o6
$$ -209 -59 -123 1 -45 22 -23 -38 124 -97 3 112 94 -101 47 50 -28 -233 20 -44 60 -55 -118 48 -18
4594a8l4k5J10q3p6J30r4K39j29j51L73k88j10K33r7J81K4j47l34J32K39k65K47
$$ -18 -52 -77 33 -50 -126 4 -90 149 20 -131 242 -46 -156 77 -20 161 185 38 -296 -164 75 -190 57
4617E7l08n8K01L2j93J32J00K00j81J44k03K96l58R3L89k76j44K21N2l9m30L57
$$ 57 -251 -309 -108 -76 -269 -137 -37 163 -18 126 -77 219 -139 -46 343 67 -77 144 196 157 -273 84
4639H4j78j31q0K45j95M91r4m18M14O3j56j4P2j1j24J05J29j09M2k40oq6M38l13
$$ 84 -94 -225 -305 -60 -255 236 142 -276 138 201 45 31 103 92 -32 73 202 93 135 -105 -111 -197 241 -72
4663g2k33K59J14N8k02J41k08o4L40r5p1K97j45q2K07q6j41R2j65rM3l4J74k4
$$ -72 -305 -46 68 126 -76 65 -143 -207 133 38 -33 264 119 37 244 158 17 109 -56 -65 -22 -56 118 94
4687I4J60l90L13Mk42J73q7m47L95J44q9J90k07q6J78j0J31P3n33J36r6j6J22
$$ 94 254 -136 177 181 -61 112 25 -422 -27 117 28 218 11 -75 103 93 224 297 -236 -100 -196 -212 -90
4710i0J04j65J91k59K88J19k59K13k50L49k39j46J46j71L02n3k9j09k48N22m55
$$ -90 14 -151 40 -219 69 188 -71 142 -108 241 2 -144 2 -169 133 80 51 -58 -306 216 -239
4731b39o5K54M8mj0j18J56p9J3J77k66J10J70o77N69J0K15j32J39l50k37K73L00
$$ -239 -304 -50 -2 -6 -16 -134 22 -57 -44 133 -133 -23 147 -530 39 49 264 132 271 -79 -316 -43 257
4754B57n4j25j36q5L57j78Q0j85K32n4q2J00k46j6K89n8p6j59L17k26M5j46K28
$$ 257 203 78 -58 -143 214 36 116 -69 163 109 27 127 -119 -135 154 96 20 -139 178 -48 -3 -149 79
4777G9Oj86J41n4n9J64L5J74m45M65l46L9j33J45k02OM02j27j00Mj13J30j42L11
$$ 79 85 -101 40 -14 -73 91 126 300 -145 320 -26 13 -120 25 -177 -171 231 104 4 8 -105 25 -117 194
4801A94k82K37r6qK18o1p8l5P3j58J64j22J39n15O73l13j40J61J35j40L7j55R0
$$ 194 -88 149 53 45 263 202 124 89 162 4 168 46 185 -330 343 30 -110 51 186 46 83 -72 18
4824A8L5j07J99j17k01K12Q3J7J24k46Q9k22m8l3J43m8K32k49l5K63k70j19M78
$$ 18 53 -54 145 28 -173 39 122 139 263 17 106 -116 -164 -197 -54 -102 130 -119 -154 109 -161 -280 198
4847A98K9l67L9J57J67m22k0R6J15M3K9k15J02o2J88k1P4Q0l20J55k41K27J00
$$ 198 227 -140 -101 56 223 -199 -219 -123 -8 35 64 -151 -49 -111 77 56 130 210 -110 45 -196 31 131
4870A31rn60L97l7J15k33J87J67m0Q5k32L3j62M66m57K46j11k8o9N1J02k48J34
$$ 131 122 -438 -41 -78 37 -196 -9 158 118 203 -29 4 -158 308 -149 97 -14 -42 -111 -60 42 -206 -72
4893g2k20M39l30J49K46k08j33K58K1q3k28K2K87j15k35K11J57k3Q4j67Q5q7%
$$ -72 -292 147 -183 -34 212 4 -129 129 150 67 -161 -139 148 33 -202 9 166 143 227 60 145 58 58
4916E8r0L64k80k3p6j8m0K48J76l52k8L53q3l49J67J67k93k6K29n05L61n7j44
$$ 58 -32 332 52 29 -47 -65 -105 143 319 -33 -61 292 209 -140 27 194 -99 -125 104 -401 -40 -97 -241
4939b41M71l50K53k95K04m7k8K24j97j68K0J27R3j50K8r9J66rm3Q7m3j40J38n7
$$ -241 230 -120 133 -162 42 -5 -33 191 -6 -174 -154 -27 66 -84 -56 -155 11 2 -41 46 3 -137 1 -56
4963e6R8m77K47J98j79J11j74K22J94m2j33k83K10K1J30l27Q7Q5J30k8j29K57
$$ -56 42 -435 -188 10 -169 -58 -232 -10 184 142 9 -274 -64 -43 87 -240 -153 -68 62 34 -95 162
4985A62k8m2k60K96j75J61j59K07j16L1k14O3L8r0J36J8j78J88J13k90J02p8K29
$$ 162 134 92 -168 128 -47 114 -45 162 46 77 -137 -74 -36 -126 10 28 -150 38 151 -139 -37 -115 114
5008A14j21N2j93J24p7J95M6k47J05q4j69O5L2K34P8R5qp5k38M8j03J15J58l2
$$ 114 -7 45 -148 -24 -101 94 140 -107 -2 -86 -255 -190 -158 76 154 249 241 166 -72 -24 -127 -12 146 114
5032A14o9J22p9k02J12J40l30L54p6m6l7R5P1l32K47m7Q1k80o5K13K35k08k6k04
$$ 114 45 167 88 -114 -2 138 -192 162 86 40 3 98 169 -163 84 37 118 -162 -227 -14 221 13 -13 -217
5056b17J82k6M1R6k33L69j46Kj87J49q0l6K40p4k3J84l9l27J33p8L81j11j40O5
$$ -217 -35 -61 -20 76 -157 212 66 68 -119 30 -50 -86 154 80 57 241 202 -125 8 -70 311 200 60 125
5080A25m1m1l4j17J9J9Pj15J13P1Q0J64m57L33j39L3lj89K79L6j36o6j3M1o5M1
$$ 125 84 43 9 -108 -89 -70 -63 -178 -65 6 86 250 -207 126 -13 20 17 -172 107 143 7 -59 -72 -31 -96 -55
5106e5j44M42l34r8K75j45p7J01K81m81L49l36K51J0jl58L94R9l14J08j0J65M0
$$ -55 -199 243 -91 -189 86 -59 -136 -35 246 -235 114 -222 29 39 38 -320 74 173 -141 -33 -43 122 162
5129A62k85K7J30j41K70o7j94R2M26k86j35j14rJ20j3JR1O9R6j86j43k2M36m89
$$ 162 -123 -96 34 -107 163 96 -98 -6 420 134 -1 -115 -124 -4 -17 -16 75 144 240 54 -89 -111 325 -164
5153a64J34l3N7l4k14L67n8O9l1r1Q0r9J13j4p8p0p6J77j85P7K7KJ1K69j03k38
$$ -164 -30 -63 -6 -40 -254 113 55 124 93 2 82 -17 96 82 4 -66 -142 35 -150 -73 -46 -44 -33 236 133 -105
5179a05j85K73k04J51J84j10p0m7J3J61l4j45R3N3k17K52k39K40q3q7r4K97n5
$$ -105 -290 -17 -221 -70 114 4 -66 -113 -100 61 27 -118 -25 28 -189 63 -176 64 -19 -106 -200 97 42
5202D2o3q8m3K6L22k33n0j79K79J79j43k38K27j73K28m8k4o2K7j44L4O8o0J65
$$ 42 -21 -109 -152 -126 196 -37 -87 -266 13 192 49 -189 38 -135 93 45 21 -41 -14 -158 -124 -56 -116 49
5226D9K1j22n7L23k05K42j86k16q1J31J18J65j90L02j86j1P5k73K37m07L78p2
$$ 49 70 -52 -109 214 9 251 65 -151 -232 -101 17 182 -8 294 108 97 172 -101 136 -271 107 35
5248C5k02L57j76O2q5k3J24j18p8K51k01j12L27j91mJ44N5l16q1M8K59J15m16
$$ 35 -167 190 14 76 -9 -32 92 -26 -104 147 -54 -166 161 -30 -34 110 165 -151 -232 -184 75 190 -226
5271b26N6Oq4L11J3q8pM5O2o4n0j42n3J03K90r8j67J90q2J27o4k15L82q8K1J27
$$ -226 -170 -164 -248 63 76 -12 -19 26 88 24 -26 -168 -221 -118 172 74 -93 97 15 142 78 -137 245 157 178 305
5297C05k94p0K26l13J17K65Q8l36j3J08l06J93K31k79K5J1N9J23q5M0qJ04k05
$$ 305 11 -59 167 -146 -29 236 324 -12 -25 83 -223 -30 201 -78 -53 -42 17 140 55 95 87 191 -14
5320a4J38k87J56J6j18k9K61j41j21K86J17l49K34K4m04L59n1k37J88o6k3L60
$$ -14 124 -163 -7 9 -109 -138 123 -18 -139 147 264 -85 149 173 -231 128 77 -160 28 -38 -61 299
5342B99j81l7j9j7j61J93j32J26M5m1L5J43j10p3j87J90k52J50j07K54j3q4j15
$$ 299 118 81 62 45 -116 77 -55 71 116 75 110 253 143 70 -117 73 -179 -29 -136 118 105 21 -94
5365i4J15k0n6K97j79k88J75J07m6k6l2j1j75L80j29L6Q9j59J24j32M0l50M98
$$ -94 21 1 -55 242 63 -225 -50 57 11 -15 -47 -58 -233 147 18 54 143 -16 108 -24 16 -334 164
5388A64q1r4P2q2J28L26o70J45J64Jo7q7Q4l8o5O8R6Q3l50L66p5k81K28r6l0j
$$ 164 83 -11 61 -21 107 433 -237 -92 72 73 6 -81 3 -35 -100 -32 64 147 -203 163 88 -193 35 -61 -91 -92
5414i2J55P2j79k05J86m9J81M8m6o6q5K40n2l04L17l24K21o5J75k77O9Q0J2l52
$$ -92 63 135 -44 -249 -63 -112 69 117 71 5 -80 160 108 -196 121 -203 18 -47 128 -149 -80 0 12 -340
5438c40K35J42j11q6L15m4k23J23m4J5j21P6J0K2j9J00k91J66K40k43J87P7j03
$$ -340 -105 37 -74 -160 155 111 -112 11 -33 -18 -139 -63 -53 -31 -50 50 -241 -75 165 -78 109 186 83
5461H3j25J16r6Kj12R9J65r8n8J08Kk91L28j0qk6M0k64M1L6L49m46J05K12m9J15
$$ 83 -42 74 -22 -20 -132 -33 132 34 -24 84 86 -205 123 113 105 79 119 -145 -104 -68 281 -165 -60 152 103 218
5487B18j95J95k10j96R3L5r1L0M0J64Q8j86K86k94j4Q4o7Q4j10J79j58mJ05p4
$$ 218 23 218 8 -188 -95 -60 -151 -121 -81 83 171 -15 271 -23 -37 47 -20 64 -46 133 -25 -29 76 2
5511Bl06M08k71M17k50K6J02k35N2RQ4k12L58j79J23j50j25P0J90k86M4R0l1J96
$$ 2 -304 104 -167 250 0 26 128 -107 -55 -46 38 -174 184 5 128 -22 -147 -77 113 -173 -129 -39 -70 126
5535A26j79m6O6k4J83l36K21r4q9K87j27M6j84J44j2Q4r7K25n3j70j86L03P4k49
$$ 126 -53 -99 -33 -57 126 -210 11 -83 -172 115 -12 34 -150 -6 -18 66 -31 194 141 -29 -215 88 162 -87
5559h7L3l2J04j77L06k51Q4J18L7j00r6k4mL3j15r3K40p3J02K9O2l76L45q4L7
$$ -87 -54 -86 18 -159 147 -104 -20 98 135 35 -61 -85 -89 -56 -171 -264 -24 -97 5 34 96 -280 65 -19 18
5584A8Kj1j37O7r3L5K37p9j66L58j32m27J56K36j93K89l08K92j74p1J56K17k25
$$ 18 20 9 -128 -61 -154 -119 118 39 -127 231 99 -328 -172 64 -129 160 -148 144 -30 -101 55 272 47
5607D7k34K10l51J80k6J98j00L2m9J87k14M3j97J65l8m0J95j46K00j83L46l83
$$ 47 -187 23 -328 -148 -174 24 -76 -44 -93 94 -120 -77 -274 -109 -147 -187 8 -138 62 -121 225 -158
5629a58J71q4j73P2J72K9kN0l25L87l12R1P4l46L71k60J64M8K39r1k29R8m0M8
$$ -158 13 -71 -244 -172 0 29 27 77 -248 139 -173 -82 -8 -354 17 -243 -79 -31 208 117 -112 -14 -54 -6
5653fL4o8l5P2K52k33j56J04j33J69k36K81L7k15K50O1m36K26l4K2o0J67P1J90
$$ -6 28 -40 -75 -3 249 16 -140 -36 -169 0 -236 45 82 -133 117 178 -258 -32 -66 -44 -104 63 134 324
5677C24l63R3p3J77j1k49L50q7j58l03N80k91K11k14J55j98Q3l9M04l19Nl5k80
$$ 324 -39 54 -19 158 147 -102 248 161 3 -300 280 -11 200 -14 141 -57 26 -13 391 72 77 42 -238
5700b38J55L8K36k92J51o8M5J64l52p7L35q5m3L2k55L54q5p2j36K11K49l93K4
$$ -238 -83 -45 191 -101 50 -18 27 191 -161 -238 97 12 -31 1 -254 100 15 -57 -193 18 267 -126 -102
5723a02K66k89K83J4l20O8m8O4K58n18L21J77k57k37K74M2J63k79j29K78N7Q0
$$ -102 164 -125 158 172 -148 -80 -128 -64 194 -324 -3 174 -83 -320 -46 -4 159 -120 -249 29 86 166
5745A66R2m09J94j10J52J25l95P8J03j20J96l6Jq4J10J9j33N2o4l2o0j19Q4K66
$$ 166 258 -151 43 -67 85 210 -185 -107 -4 -124 72 36 37 -47 63 82 -51 1 -63 -95 -155 -274 -190 76
5769G6R9j34j87K71Mj0k80K16p4j0m0J79j85J65j81m5J6J16K4j16j10J67J07k80
$$ 76 175 41 -146 125 129 119 -161 55 -19 -29 -69 110 -75 90 -91 -136 -120 -4 20 -96 -206 -39 68 -212
5793b12r7L68p3k5r1J95p2N0qJ22r2n27N44oj03k3O0j21J59p9p5l6J18L7L13k85
$$ -212 -309 59 -14 -39 -130 65 -7 43 35 157 65 -462 82 76 -27 -50 10 -111 48 -31 -106 -142 -24 13 326 41
5819D1j33L45j05l80J25R0M61p65L09l3L55n2l60N7m7M29k57r1j99K27q9M1o1
$$ 41 -92 253 148 -232 -107 -17 444 -321 -12 -45 310 258 -102 -45 -92 337 80 -11 -210 17 -72 -31 -92
5842i2k12L66J22k2k80J76j33L41n70K63K8q1J80k17K4k00M71j94J11M8k30K7
$$ -92 -304 62 184 162 -118 58 -75 266 -304 -41 -13 -94 86 -131 -107 -307 164 -30 81 129 -101 -74
5864g4O1J15j05j5L2j00K02j65MJ68l03q6K48K3Q1m2j04J35l32K67j20L11n2j58
$$ -74 -13 102 -3 -18 14 -86 116 -49 -45 123 -180 -266 -18 5 86 44 -60 75 -257 10 -110 201 149 -9
5888ik11M58j3k42O2q4R6j63j07K88m33L52J02j32k7R9J60k96O9k95L97N1j37
$$ -9 -220 238 225 -17 45 -39 57 -106 -213 75 -358 -6 96 -36 -63 36 196 -100 -31 -326 71 122 -15
5911a5j29R4J84k64J86K33l61Q4R5m1M7j14J55j97j55K55J4p2k85L58k73J19O3
$$ -15 -144 -50 134 -130 56 289 -72 12 107 66 113 -1 154 -43 -198 57 71 -1 -286 72 -201 -82 -19
5934a9j90P0J26L47k62j32K7J39j07n8j14J79Oj1j18p4K82j91Q0j53J93j55M2
$$ -19 -209 -139 -13 334 72 -60 -33 106 -1 -59 -173 6 12 1 -117 -191 91 -100 -20 -173 20 -135 -93
5957i3K51O5j93K54j06l36J88o9L5oj81J48L8J21J4K5k71K56k84L62k54K6j88
$$ -93 158 223 30 284 178 -158 30 -39 -4 -10 -191 -43 -5 116 130 155 -116 140 -144 218 -36 -10 -198
5980a98J67m1J92j34j30N4j00J43j62N4Q1P1p7l7K75rk50o3M48k06k8j29L08m20
$$ -198 -31 -72 120 -14 -144 -90 -190 -47 -209 -155 -74 -3 -80 -117 158 149 -101 -164 284 78 50 -79 229 -191
6004a91p5M10j30Jk45J80p2K84j55J19k94L50L9k75J78j45R7j83R1K43j96K7k21
$$ -191 -266 144 14 15 -230 -50 -122 162 7 126 -168 182 221 -54 124 -21 76 -107 -16 227 31 58 -163
6027a63M52k49J29j33J45m51L77l90K69J66m09N8K81J17j95J99k19J05j1q0k5
$$ -163 289 40 169 36 181 -270 107 -283 -14 152 -257 -199 82 199 4 203 -16 89 78 -2 -27
6048b7P5k51Q1K26l26J33J07NK06m03p5J61J54R9j85J93k27o5K8p3K04K55k57
$$ -27 48 -203 -122 104 -222 -89 18 23 229 -174 -249 -88 66 165 -20 173 -54 -119 -91 -164 40 295 38
6071C8K27l79o3J98Q3N1l13J02J02q4L0m1Q7J0P8l86L38j82K04j42J80k9j83P5
$$ 38 265 -114 -177 21 104 155 -158 -56 46 -38 -8 -49 38 48 126 -260 78 -104 100 -42 138 109 -74 1
6095AJ66n0j25j3J03K2l1p0L31n83J43L85m50J50j3J3N9J46m11J50J4K06j31j48
$$ 1 167 117 -8 -21 82 104 73 3 334 -249 -106 279 -171 -21 -34 -21 38 184 -227 -77 -63 143 12 -136
6119a36J18n4J3K00o3j31L5K72k42k45K61k55J46QM4J25k62K36j34j63J05P9J9
$$ -136 -18 -72 -59 141 78 -53 -18 254 12 -233 28 -227 -81 -73 -29 96 -166 70 -64 -227 -122 -43 -24
6142b4K25k43k7K65j87K0j62K40n7j2p7O8J23J7k26L10k35k87N27l60j83K57l0
$$ -24 201 -42 -69 196 9 29 -133 107 50 38 -39 29 152 169 -57 253 18 -269 258 -102 -285 -28 -58
6165e8Q2J56j32k2J1J69j91o8k53N65m44N63j47j73j04r5K51r6j85L4P2j8L09
$$ -58 24 180 48 26 37 206 15 -53 -306 259 -185 378 231 58 -46 -141 110 14 -171 -137 -65 -83 226
6188B26m07Q6K72l50L16k49K56j66J56k15J4J51p9k03L59j30P0j61oJ37l29q9
$$ 226 -181 -95 177 -173 143 -106 150 -16 140 -75 -61 90 11 -192 167 37 107 -54 -60 77 -252 -341
6210c41M13m4J20j61j37J46K39j92Lj79Q4j95K13p5J0oo4Q7j73K74J03l30R5j5
$$ -341 72 28 148 -13 -150 -4 235 43 46 -133 -49 -244 -31 -106 -96 -102 -166 -79 -252 22 125 -205 -110 -125
6234a25K83k70j00L25j76R9Nj36K69l51J84m7K1k4OJ48q3J07k57J81O0l34K73
$$ -125 158 -112 -212 113 -63 36 41 -95 174 -177 7 -40 -19 -43 -37 111 28 135 -122 59 119 -215 58
6257E8O4J48k10l3k74J62K45k65K83j62j15j13J77M4K49l97K27J28o3l13P9j23
$$ 58 122 270 60 27 -247 -85 160 -105 178 16 -99 -212 -35 9 258 -139 88 216 153 -160 -81 -204
$$ [...]
8191i9
##END NTUPLES=NMR FID
##END=
