##TITLE=1H_SR159_k
 DMSO-d6
 8 sc, 
 20.1.2023
##JCAMPDX= 6.0         $$ Bruker NMR JCAMP-DX V2.0
##DATA TYPE= NMR FID
##DATA CLASS= NTUPLES
##ORIGIN= UXNMR, Bruker Analytische Messtechnik GmbH
##OWNER= root
$$ XWIN-NMR		Version 3.5
$$ Fri Jan 20 16:16:48 2023 Russian Standard Time (UT+4h)  she@DPX200
##.OBSERVE FREQUENCY= 200.13135
##.OBSERVE NUCLEUS= ^1H
##.DELAY= (6, 6)
##.ACQUISITION MODE= SIMULTANEOUS
##.ACQUISITION SCHEME= undefined
##.AVERAGES= 8
##.DIGITISER RES= 18
##SPECTROMETER/DATA SYSTEM= spect
##.PULSE SEQUENCE= zg30
##.SOLVENT NAME= D2O
##.SHIFT REFERENCE= (INTERNAL, D2O, 0, 15.7039)
##AUDIT TRAIL= $$ (NUMBER, WHEN, WHO, WHERE, WHAT)
$$ ##TITLE= Audit trail, XWIN-NMR		Version 3.5
$$ ##JCAMPDX= 5.01
$$ ##ORIGIN= Bruker BioSpin GmbH
$$ ##OWNER= she
$$ F:/spectra/data/she/nmr/H-F/1/audita.txt
$$ ##AUDIT TRAIL=  $$ (NUMBER, WHEN, WHO, WHERE, WHAT)
(   1,<2023-01-20 16:15:50.26 +0400>,<she>,<DPX200>,
      <created by zg, POWCHK disabled, PULCHK disabled
       configuration hash MD5:
       00 E9 B6 7A A2 85 ED C7 34 08 36 98 17 FE 4E 26
       data hash MD5: 16K
       28 2B 5F D7 17 DA E0 13 6C 92 84 A6 86 F6 83 1A>)
$$ ##END=
$$ 
$$ hash MD5
$$ 5E 53 3A 8E 94 16 26 58 A4 39 43 B0 69 C5 EE A5
##$RELAX= 
##$RELAX= 
##$RELAX= 
##$RELAX= 
##$RELAX= 
##$RELAX= 
$$ Bruker specific parameters
$$ --------------------------
##$DU= <F:/spectra>
##$EXPNO= 1
##$NAME= <H-F>
##$PROCNO= 1
##$TYPE= <nmr>
##$USER= <she>
##$AMP= (0..31)
100 100 100 100 100 100 100 100 100 100 100 100 100 100 100 100 100 100 
100 100 100 100 100 100 100 100 100 100 100 100 100 100 
##$AQSEQ= 0
##$AQ_mod= 1
##$AUNM= <au_zg>
##$AUTOPOS= <>
##$BF1= 200.13
##$BF2= 200.13
##$BF3= 200.13
##$BF4= 200.13
##$BF5= 200.13
##$BF6= 200.13
##$BF7= 200.13
##$BF8= 200.13
##$BYTORDA= 1
##$CFDGTYP= 0
##$CFRGTYP= 5
##$CHEMSTR= <none>
##$CNST= (0..31)
1 1 145 1 1 1 1 1 1 1 1 1 1 1 1 1 1 1 1 1 1 1 1 1 1 1 1 1 1 1 1 1 
##$CPDPRG= <>
##$CPDPRG1= <>
##$CPDPRG2= <>
##$CPDPRG3= <>
##$CPDPRG4= <mlev>
##$CPDPRG5= <mlev>
##$CPDPRG6= <mlev>
##$CPDPRG7= <mlev>
##$CPDPRG8= <mlev>
##$CPDPRGB= <>
##$CPDPRGT= <>
##$D= (0..31)
0 1.2 0 0 0 0 0 0 0 0.06 0 0.03 0 0 0 0 0.0002 0 0 0 0 0 0 0 0 0 0 0 0 
0 0 0 
##$DATE= 1674216949
##$DBL= (0..7)
120 120 120 120 120 120 120 120 
##$DBP= (0..7)
150 150 150 150 150 150 150 150 
##$DBP07= 0
##$DBPNAM0= <>
##$DBPNAM1= <>
##$DBPNAM2= <>
##$DBPNAM3= <>
##$DBPNAM4= <>
##$DBPNAM5= <>
##$DBPNAM6= <>
##$DBPNAM7= <>
##$DBPOAL= (0..7)
0.5 0.5 0.5 0.5 0.5 0.5 0.5 0.5 
##$DBPOFFS= (0..7)
0 0 0 0 0 0 0 0 
##$DE= 6
##$DECBNUC= <off>
##$DECIM= 32
##$DECNUC= <off>
##$DECSTAT= 4
##$DIGMOD= 1
##$DIGTYP= 9
##$DL= (0..7)
0 120 120 120 120 120 120 120 
##$DP= (0..7)
150 150 150 150 150 150 150 150 
##$DP07= 0
##$DPNAME0= <>
##$DPNAME1= <>
##$DPNAME2= <>
##$DPNAME3= <>
##$DPNAME4= <>
##$DPNAME5= <>
##$DPNAME6= <>
##$DPNAME7= <>
##$DPOAL= (0..7)
0.5 0.5 0.5 0.5 0.5 0.5 0.5 0.5 
##$DPOFFS= (0..7)
0 0 0 0 0 0 0 0 
##$DQDMODE= 0
##$DR= 18
##$DS= 0
##$DSLIST= <SSSSSSSSSSSSSSS>
$$ [...]
##$SUBNAM2= <"">
##$SUBNAM3= <"">
##$SUBNAM4= <"">
##$SUBNAM5= <"">
##$SUBNAM6= <"">
##$SUBNAM7= <"">
##$SUBNAM8= <"">
##$SUBNAM9= <"">
##$SW= 18.05172834244
##$SWIBOX= (0..15)
0 0 2 0 0 0 0 0 0 0 0 0 0 0 0 0 
##$SW_h= 3612.71676300578
##$TD= 16384
##$TD0= 1
##$TE= 0
##$TE2= 300
##$TE3= 300
##$TEG= 300
##$TL= (0..7)
0 120 120 120 120 120 120 120 
##$TP= (0..7)
150 150 150 150 150 150 150 150 
##$TP07= 0
##$TPNAME0= <>
##$TPNAME1= <>
##$TPNAME2= <>
##$TPNAME3= <>
##$TPNAME4= <>
##$TPNAME5= <>
##$TPNAME6= <>
##$TPNAME7= <>
##$TPOAL= (0..7)
0.5 0.5 0.5 0.5 0.5 0.5 0.5 0.5 
##$TPOFFS= (0..7)
0 0 0 0 0 0 0 0 
##$TUNHIN= 0
##$TUNHOUT= 0
##$TUNXOUT= 0
##$USERA1= <user>
##$USERA2= <user>
##$USERA3= <user>
##$USERA4= <user>
##$USERA5= <user>
##$V9= 5
##$VALIST= <valist>
##$VCLIST= <CCCCCCCCCCCCCCC>
##$VD= 0
##$VDLIST= <DDDDDDDDDDDDDDD>
##$VPLIST= <PPPPPPPPPPPPPPP>
##$VTLIST= <TTTTTTTTTTTTTTT>
##$WBST= 1024
##$WBSW= 4
##$XGAIN= (0..3)
0 0 0 0 
##$XL= 0
##$YL= 0
##$YMAX_a= 71673
##$YMIN_a= -140646
##$ZGOPTNS= <>
##$ZL1= 120
##$ZL2= 120
##$ZL3= 120
##$ZL4= 120
##$ABSF1= 10
##$ABSF2= 0
##$ABSG= 5
##$ABSL= 3
##$ALPHA= 0
##$AQORDER= 0
##$ASSFAC= 0
##$ASSFACI= 0
##$ASSFACX= 0
##$ASSWID= 0
##$AUNMP= <proc_1d>
##$AZFE= 0.1
##$AZFW= 0.1
##$BCFW= 1
##$BC_mod= 2
##$BYTORDP= 1
##$COROFFS= 0
##$CY= 11.3945322036743
##$DATMOD= 1
##$DC= 2
##$DFILT= <>
##$DTYPP= 0
##$F1P= 2.36226072786647
##$F2P= -0.459571619588291
##$FCOR= 0.5
##$FTSIZE= 0
##$FT_mod= 4
##$GAMMA= 1
##$GB= 0.15
##$INTBC= 1
##$INTSCL= 1
##$ISEN= 128
##$LB= 0.24
##$LEV0= 0
##$LPBIN= 0
##$MAXI= 10000
##$MC2= 0
##$MEAN= 0
##$ME_mod= 0
##$MI= 1.114404
##$NCOEF= 0
##$NC_proc= 0
##$NLEV= 6
##$NOISF1= 3.799351
##$NOISF2= 2.8
##$NSP= 1
##$NTH_PI= 0
##$NZP= 0
##$OFFSET= 15.70392
##$PC= 1
##$PHC0= -19124.8
##$PHC1= 28.00079
##$PH_mod= 1
##$PKNL= yes
##$PPARMOD= 0
##$PSCAL= 0
##$PSIGN= 0
##$REVERSE= no
##$SF= 200.130013532006
##$SI= 16384
##$SIGF1= 3
##$SIGF2= 2
##$SINO= 400
##$SIOLD= 16384
##$SREGLST= <1H.CDCl3>
##$SSB= 0
##$STSI= 0
##$STSR= 0
##$SW_p= 3612.71676300578
##$SYMM= 0
##$S_DEV= 0
##$TDeff= 0
##$TDoff= 0
##$TI= <>
##$TILT= no
##$TM1= 0
##$TM2= 0
##$TOPLEV= 0
##$USERP1= <user>
##$USERP2= <user>
##$USERP3= <user>
##$USERP4= <user>
##$USERP5= <user>
##$WDW= 1
##$XDIM= 8192
##$YMAX_p= 0
##$YMIN_p= 0
$$ End of Bruker specific parameters
$$ ---------------------------------
##NTUPLES= NMR FID
##VAR_NAME=  TIME,          FID/REAL,        FID/IMAG
##SYMBOL=    X,             R,               I
##VAR_TYPE=  INDEPENDENT,   DEPENDENT,       DEPENDENT
##VAR_FORM=  AFFN,          ASDF,            ASDF
##VAR_DIM=   8192,          8192,            8192
##UNITS=     SECONDS,       ARBITRARY UNITS, ARBITRARY UNITS
##FACTOR=    0.0002768,     1,               1
##FIRST=     0,             0,               0
##LAST=      2.2672688,     0,               0
##MIN=       0,             -140646,         0
##MAX=       2.2672688,     71673,           0
$$ Real data points
##PAGE= N=1
##DATA TABLE= (X++(R..R)), XYDATA
$$ [...]
1812C87m45l4L96k57l15L68Q7J93k19p44K98N63Ro64o5P00j22l31j18J83M30k08
1834I2n27L36O76m01m17P1P73l83n29rK68O01n60m71N41K07J9o36N21K05k17n11
1856c51J19M84K39p91p1N43O51p63l05L12J29j48j63J29O2R2o04L18N53k62m35
1877b62J34K05L80p9p58J56N59R6o18N5K90L04m01o34N43Q22p60l00M07O19m26
1898C32q22J70N51O9n24k24P84M2n07m2K54L12m17l94P28K68l97l11M5M14L8m46
1920g7n5k0L50q2k55k9M05Lm10N0O13k5m82j76K88M78p50j99J7O97k51l09L78
1943A59ML7m14k84R06k56k16l01K70L39k48m71M66J09K90q72M22L17j07j12l74
1964c36N28J03n4o36K88J65p9n12M11K90J03k82j59J26L69j82n24N45J29l76k92
$$ y = [387, -58, -92, 304, 47, -268, 100, 187, 380, 161, -583, -285, 278, 287, -377, -442, 258, 136, -195, -313, -130, 300, 92, -435, -99, 577, 176, -241, -170, 603, 220, -309, -318, -50, 551, -9, -480, 61, 268, 287, -349, 172, 377, 160, -351, -232, 252, 491, -300, -371, 172, 823, 60, -245, 67, 196, 48, -115, 14, 76, 168, -436, -118, 435, 173, -262, -128, 77, 457, 378, -380, -224, 335, 431, -187, -132, 158, 462, 61, -573, -30, 792, 32, -268, 139, 758, 332, -490, -320, 231, 300, -224, -448, 336, 378, -129, -171, 83, 395, -22, -416, 312, 580, 183, -128, -83, 331, 369, -77, -132, -152, 198, 116, -139, -168, 237, 240, -170, -120, 493, 468, -14, -190, 98, 576, -174, -373, -356, 341, 90, -219, 159, 163, 200, -214, -498, 408, 152, -64, -365, -95, 244, -4, -475, -9, 100, 390, -482, -60, 257, 150, 38, -336, 192, 295, 241, -395, -107, 58, -21, -533, -122, 168, 271, -11, -170, -44, 325, 143, -381, 164, 293, -83, -375]
1985c75L53L13J2n88oK69K32n29M2K50L82m70j78M14J0M9o28L67J23P3k31j70
2007b86M86o2j53m89N43R0j49m54M42L64l17l46R7M50l03k56qM58L55n57n81M23
2029b53N21k16k34K01K89j22m34J60K15o6P0m26K19M15m65k10M09J98n66N2J31
2050a12M10k08j79o1J58K30n21O4L41J36k69R8j39L07j25l46J97K23k06n7L0J9
2072a0L22m04j5K69L2J04n81L05P2o1J02l93L16K34j67m11L73Q7r6l81O2K51L2
2095D2J14k29Q9P1k79J84L91l39k85K11K64J1N8l98N7L55j40l55R7N2P7k17M9
2118a20K5J17l12j8K89L14j10o55M31K74j71l21K32J15k3jl68L58j01Pk7R9K61
2141B95k82j86K66J97k32O8l33K32J31k58l4O0K83k99qJ24J79j89J00m21M08J81
$$ y = [-375, -22, 291, 303, -285, -291, -22, 210, -319, -277, -27, 355, -115, -293, 121, 131, 180, -448, -81, 42, 115, -116, -286, 200, 138, -15, -504, 39, 129, -20, -474, -32, 332, 15, -331, -234, 216, -87, -343, -351, 107, 462, -95, -676, -253, 268, 52, -182, 19, 308, 186, -248, -88, 127, 61, 131, -295, -76, 339, -126, -336, 73, 271, -295, -243, -112, 298, 90, -89, -150, 8, 238, -283, -219, 122, 258, -11, 87, -52, 255, 130, -216, -19, 204, -2, -59, -29, -10, 312, -92, -107, 162, 194, 298, -283, 22, 94, 33, 135, -258, 58, 292, 125, -286, 87, 174, 78, -303, -241, 10, 42, 156, -73, 16, 87, -192, -8, 383, 44, -241, -30, 234, 245, 303, -95, -38, 317, 177, -178, -81, -29, 48, -169, -120, -95, 22, -290, -308, -19, 295, 185, -470, -39, 235, 64, -257, -25, 90, 67, 66, -302, 56, -45, -38, -65, 34, 295, 13, -173, 93, 290, 58, 126, -207, 25, 156, -102, -136, -76, 207, -92, -100, 24, 203, 14, 114, -307, 101, 282]
2163B82k45l04J59K90k64j23K07K17o75L64O9pJ8k04J60K8K03k74q4J53k0J10
2185F0Q5r5l6j65n8L74Q3l85qj56K67L15k23j40L34l65J55l29J61OK62k10l80
2208d48O47K8l41j92O47r8k90m1J22J94k54j64K76r2K89l41OJ45j2l67K94P1M7
2231A26M3l76K59J71k63MO9l0r4J7L5j44oJ39j28J29L10k27k64L6J22J8k8RM17
2256C44m21O9K3K07k99J42k10J89j12P0R8n2K26k35N5l54M24j19j07j41M23j76
2278D4N4J6k06K21r6k98K09k23O22m35j12K14J72r8o2j37K88l11o8R9J71L60m50
2301b6J36k45R4r0q4jM98j65j49nL9j17L13k04K61n1l86J70Q3J11l54M70k71%
2325B7k12Q9K7J13P9j84kL14o7j25k30K79P9k2k20o9L29jl84J0M34Jm52K49K34
$$ y = [282, 37, -267, -108, 182, -82, -205, 2, 219, -456, -92, -23, -30, -12, -216, -56, -28, 175, -99, -183, -30, -50, 60, 145, 50, 14, -151, -209, 165, 248, -137, -145, -301, -34, 281, 58, -82, 252, -113, 42, -287, -126, -120, 142, -68, -448, 199, 227, -114, -306, 341, 243, -47, -88, 34, 228, -26, -190, 86, -6, 283, -58, -52, 93, 81, -286, 8, 79, 126, 169, -207, 52, 223, -40, -36, 33, 3, -91, -74, -39, -183, -189, -50, -178, -49, 261, 34, -230, -194, -72, -54, -82, -73, 344, -77, -8, 15, 222, -77, 65, -145, 44, -68, 2, 100, 48, 274, 39, 94, -260, 164, 45, -62, -203, 220, 44, 98, 114, -92, 129, 33, -265, -56, -279, 343, -92, -204, 10, 182, 84, 22, -115, 173, -138, -206, -107, 64, 424, -26, 110, -135, -41, -131, -215, -216, 282, 117, -32, -37, 2, -115, 198, -6, 255, 204, -182, -12, 71, 182, -172, 298, 27, 27, -185, -96, -69, 44, 123, -61, -63, 251, 184, 59, -171, 108, 187, 165, -55, -124, 205, 204, -180, -170, 264, 265, -187, 62, 296]
2350B96k12n85M76j0l6J55L4K50l09J7Q0k76J00r8J70m14L18K23k43mK50j13J62
2373B31k25k39J79J22Jl40L33N1J3r7rNk64J51OJ96q4Pj49K6L27k61j21mJ70J93
2399B18j90j04J30P5k90K0J4P7K10j59J40j34j85J00L4K98k99j25L2M18j16q0
2421H4o0r5K93j99j23K2J10j47L7J46j76J43q7K85j82o2k87J84q3K14J36j42m6
2444c5j14J40j05j24M19k79Rm7K4m4j57K63L41l86K36rR1l14K01Pj41MJ43q1o9
2469b7R8j82K23k31J77J3Mj39l9K40k61K25k08K77J20o29M14k31L63p9k15J2K07
2492A32M0m25K73J85j19m5Q1m24N28r6l4j94j4j9J78k51O5K21J2j50l00L50nj40
2516a51J86j47O8J34O9p0O0j07k28J12J1J25M4o3p1oJ18N7j80K2P7L3j57K02j3
$$ y = [296, 84, -501, -25, -35, -71, 84, 118, 368, 59, 76, 156, -120, -20, -118, 52, -362, -44, 179, -64, -68, 182, 69, 231, 6, -233, -54, 68, 69, -271, 62, 113, 126, 29, 20, 25, -239, -88, -82, 114, 30, 37, -112, -86, 241, -20, -141, -145, 25, 218, 28, -76, 54, 129, -161, -141, -127, -50, 160, 1, 141, 7, -178, -78, -44, 254, -45, -170, -138, 280, 164, 84, 24, -71, 222, 23, -100, -78, 32, -115, -78, 68, -108, 35, -52, 233, 51, -11, -298, -114, -197, 17, 153, 11, -35, -149, -9, -114, -238, 181, -98, -89, -136, -112, -156, -313, -50, 291, -95, 141, 132, 223, -91, 110, 117, -24, -20, 123, 42, -27, 71, -111, 112, -119, 58, 71, 75, -64, -103, 137, -124, 101, -107, 170, 290, -339, 75, -156, 207, 128, -87, -75, 132, 172, -253, 20, 205, 86, 41, 122, -302, 226, 130, 96, -98, -112, -131, 47, -204, -139, 82, 94, -56, -356, -6, -11, -151, 35, -112, -44, 90, 159, 89, 149, 42, -186, -74, -63, 62, 106, 43, -28, -34, 84, 141, -39, -17, 60, 93, -64, 138, 125]
2541A25p5j51J15O0k1J10l84K20Q5k51Q1J39p1K96k91L1r0K57m74J45M57l46K13
2564A80l65J11K76k83K98O3l73n2P4J43J14o20L22Q8J44q9j48J38oj46K16P1j55
2587AP7J77j78M8k1M0l88K19Q5j07J64J0n2J16R5k73J23o9J62m41O1J67k62K36
2611a0MJ0j37J03j17J63O1j2L0m28J35L81l02K61n6N2q6j64j25K41P0r9L7k31
2635b19J57o3K46jk9kK31k06l47k0K07j8J11p8n8l0o6L15j50J19k28j31L25j89
2659a24R9k05K08N8P2J50k00J16k66J02j11J01M7J3n5j62K49l4r5M9J26q0k35
2682a77M54j38j95p8K87n8M4k75j75L50j75P2L45k97K51j54j36L7k74l8L75K09
2704B54j43nQ5n7j08J34k35L8k29M86rk88J13J82k21P0j32J72j21J39k39K32K45
$$ y = [125, 50, -101, 14, 74, 53, 163, -221, -1, 84, -167, -86, 53, -18, 278, -13, 18, -72, 185, -289, -144, 313, -33, 180, -185, -74, 202, -81, 217, 280, -93, -145, -71, 72, 186, -434, -112, -24, 120, 31, -117, 21, 15, -131, 85, 156, 1, 78, 255, 77, 125, 104, 144, -244, -25, 60, -47, 117, 127, 75, 191, 286, 13, 136, 67, 229, -212, -151, 16, -246, -10, -6, 4, -133, -30, -147, 16, 77, 65, 95, -333, -198, 183, -119, 142, 86, 138, 52, -112, -237, 4, 74, -25, 12, -219, -62, -125, 121, 120, 91, 89, 320, 114, -233, -253, -46, -64, 47, -31, -89, -119, -185, 130, -20, 99, -129, -260, 65, -124, -25, -230, -22, 36, 108, 258, 58, 174, -92, 10, -101, 0, 47, 60, 5, -157, 92, 58, -37, 12, 138, 58, -177, 277, 139, -56, -134, 153, 95, 139, -136, -311, 39, -136, -64, 281, -16, 235, 81, -55, -18, -292, -330, 45, 254, 111, 106, 191, 134, 26, 160, -75, -37, -266, 220, 211, -77, 36, 218, -3, 67, -65, 107, -14, 125, -114, 118, 363]
2727C63n66K28j6J6ml8Rl01N40k87J0k3R1K3j37J17R4k41Rj31J29J52o7J70l23
2752a83J39j5j75Q9J3J02J59k76K82k08J83j68j57J30k9mJ92k85K12j80K66J99
2774B86k13p3J72r0J33k63K7Q7o4K31k77P6p7N0k52L27J7m56K93o7l3L89j89k75
2798b41Q0M3J8J44Q4o7k39M11n37J72K50j2j02j41K94j7j26O4L9k69J96L9j44
2821f1J96j46K07m9m1k35K46j09J71l45J88J46k95k8N9O9j46J9K93k18J22K35
2843B78m78K42j43q3J52m0J07M3j47j4J46QqM0mk44J68M1r2j11J68j7O5j77N6
2868d4m6P8j40J39K2o8J21n8R9k25L17m58K38j47K13N7j87K59j21m5L7kK25l79
2892a15O2K32j30K48o6m31J12j11J12o2K47j17L8k69J48J19m37K60K11m7kq9Q4
$$ y = [363, -203, 25, 9, 25, 21, -17, -8, -309, 231, -56, -46, -69, 22, 45, -92, 25, 119, -122, -113, -244, -115, 37, -30, 140, -183, -44, -59, -234, -145, -132, -30, 129, -147, 135, -73, 110, -58, -215, -85, -114, -118, 74, -211, 1, -179, 87, 286, 73, 0, 172, 82, 215, -48, -21, 66, 2, 233, -44, 32, -45, 5, -247, 80, 97, -359, -66, -133, -166, 223, 34, -241, -161, -118, -100, 44, 128, 61, -178, 233, -304, -132, 118, 106, 4, -137, 157, 140, 14, 78, 117, -152, 44, 83, -61, 135, -11, 196, 147, 106, -129, 117, 8, 179, -166, 22, 168, -127, -155, -96, -27, -173, -154, 139, -79, 43, 278, -200, 42, -101, -184, -32, -72, 35, 78, -69, -83, 63, 71, 63, 103, 99, -145, 23, 64, -28, -139, 29, 12, 77, -100, -44, -90, -12, -152, -13, 9, -59, 62, 4, 103, -122, 195, -263, -25, -172, 41, 98, -89, 170, 49, 4, 41, 39, 264, -115, -53, 179, 49, 297, 231, -200, -88, -199, -87, -149, 98, -19, 19, -250, -102, 17, -420, -160, 51, 4, 2, -87, -3]
2915cp0Q5K24j76n7J5q0jJ15l39K44J87j63j48Q7J82J05L09l84p0k05K06Q8j46
2939Ej42J53k62K06K04r0J4j30J03j16%K15j40j11J04J02m18j7K88m9J36j15L43
2962B83k59k23L67j80j76K78RP5Q5m40J56Ok1P9J96n4k51K81k42j11J7l6L64l43
2986a40Q1j54K78j97J14o5P4j35j6Q2L9j1j43L27l71L00J15L0k11P3k84L93m18
3009b39J64q7m3K31j32P4K36j34J38m00P6J23l3j60J65P3r1j49L56K02k42l27
3031a99J97n8J32K32l27q8N8p1M1k57M66Jk1L8jp5j97K7L9K64k05jJ80q9r6J59
3057A49R6o9p6k52J23j65P1J42j76L93o3j9p5k46K46k72J15K6J09p1q7O3j22K09
3081D9N2k89J24j12J43K40k33QK4l0K80m49M3M19j36k16R8Qm9O9n9j7K37l67J54
$$ y = [-3, -73, 12, 236, 60, 3, 18, -62, -63, 52, -287, -43, 144, -19, -167, -80, 102, 207, 516, 132, 62, -143, 63, 151, 5, -137, 16, -246, -40, 164, 74, 88, -42, 61, -55, -55, 160, 20, -91, 13, 115, -303, -320, -32, -81, 55, -60, 283, 24, -199, 168, -12, -188, 90, 99, 174, 259, -181, -25, -19, -40, 39, 235, 181, -70, 211, -31, -142, -125, -161, 203, -140, -59, -213, 65, -132, -18, -83, -9, -144, -160, -78, -39, -50, -193, 134, -237, 63, 178, 208, -3, 70, -214, 179, -239, -75, -162, -205, 26, -106, -32, 204, 70, 208, -192, -116, 7, -26, -186, -21, 52, -39, -188, 168, 370, 128, -199, -2, -60, 72, 304, -23, -111, -53, -124, -83, -340, 126, 127, 106, 144, 143, 68, -129, -102, -63, 201, -4, -5, 175, 86, -10, 149, 245, 176, 100, -152, -29, -194, -123, 19, -157, 236, 173, 154, 79, -167, 79, -193, -78, -52, 57, -14, -101, -38, -160, 49, 101, -188, -64, -176, -33, 207, -26, -18, 6, -24, 256, -193, -150, 269, 133, -83, 15, 23, -26, 43, -16, -33, 204, -163, -9]
3106ij15m3o6J75K43m29L23j94j16L52m74K01K85L2k82j1Qq9L21k44P1M40m55
3129g6O8nkj4K26l12N7K27k22l4j91K26R8k91J63K41k2j25J60k19k31K87O1N7
3153A27j78J02j9l8Q1J8j53%K84k45L95k15K4l83K05Oj3J39q1LK3rq4O9lj61L92
3180B86j83k62K60pn2l0k19J88l2k05K52K2k4j00J50k88J83m6Q7O5k6N7j35O6
3204GK24k59j2m4l8K63Q9m67N1J16k8J96J9Q1m03K64Kk91k15M10Q2J21q9K3q7
3229A5N7j76M43m68r6J61oJ37q5J06k02k2K83k16Q4k2k19J49pJ52J86m33M99k54
3253F6Q5j3p2l22K72J76k80k5L2K33l47N4L03L0J25k47j03J21j82L23l03pL38
3276B57j88j00o0K5J1N0J49j13l7l7n6LR0k3j01M26k01j46m1k5K71K1l41K95j31
$$ y = [-9, -124, -167, -233, -58, 185, -244, 79, -115, -231, 121, -353, -152, 133, 165, -117, -128, -120, -209, 112, -132, -61, 379, -76, -8, -13, -15, -29, 197, -115, -58, 169, -53, -87, -278, -52, 46, -245, -82, 159, 137, 12, 172, -47, -278, 9, 70, 127, -51, 51, 32, -6, 75, 93, -60, -60, 224, -21, 374, 159, 183, -200, 5, 11, -2, 137, 56, 59, 82, 73, -11, 58, 55, -106, 286, 103, -159, 101, 94, 42, 12, -207, -19, -51, -256, -4, 18, -6, -106, 44, -244, -61, -107, -20, 45, 19, 76, -59, 7, 231, -28, -40, -84, -122, 141, 230, -237, -186, -70, -98, 98, 117, 198, -205, 59, 61, -230, -445, -35, 47, 168, 79, 102, 15, 72, -104, 339, -129, -225, -64, -70, 67, -18, 88, -114, -136, 147, -69, 15, -7, -226, -77, -84, 68, 254, -179, 320, 66, 151, 138, 66, -256, 16, 192, -88, -113, -81, 152, -195, -141, 162, 192, 317, 70, -33, 88, -94, 229, -74, -81, 257, 69, -31, -91, -66, -55, -5, 144, 31, -6, -43, -99, -96, -6, -29, -130, 296, 95, -51, -92, -117, 154, 175, -166, 129, -2]
3301bk01J09J87j88J51J23k35J32l78K68J31P3J2J72j76j13j07N1J5l0l4K00m17
3324b57J23K32j62k4P2q1K07l39J33J86l10K11K37j66j48k0L16k95J85j54l8K62
3346A70j92k30K25N7j17M03k19Pj13O3j00r9K18l27L28L7j1l93K38m5r5L37j39
3369CP9j57k44L72J46k92L05j51J65l46J93m29M37J35l72M10l57o8K84L4j98K16
3391A65L9m2q1J59l43K0K5R7Q2P1j38N0mm6O5J6l5l16M49l48J22L1m18N00L7k
3417A55k39J20j15j00J84K01k10R4o8J61l87K25rj8J6J68k16J19Q2j29J40m4j6
3440A14q6r7o6J32J09ql04Q7O3j4NK26n9K16l17n0R2p4J1J21R2Q2j95o4K37j74
3466G9k4m9n2Q8k49K34L4L1l6J13l78K58p9J33RK1k1K33k82K5k90J29J9M11l32
$$ y = [-2, -203, -94, 93, -95, 56, 179, -56, 76, -302, -34, 97, 170, 182, 354, 178, 65, -42, 9, 24, -6, -40, 160, -257, -134, 98, -64, -88, -16, -97, 110, -229, -96, 90, -220, -9, 228, 62, -86, -106, 210, -85, 100, -54, -92, 170, -22, -252, -27, 30, -87, 316, 97, 104, -9, 54, -46, -145, 73, -254, 74, 111, 100, -293, -55, -100, -195, 142, 3, 82, -75, -319, 53, 199, -93, 212, 61, 226, -120, 73, -356, 81, 216, -156, 254, -103, -171, 113, 147, -51, 165, 204, 162, 81, 240, -103, -83, -58, 39, 121, 192, 54, 104, 100, 54, 119, 135, 100, -216, 233, -115, 7, 38, -380, 120, 157, 155, -84, 36, -79, -179, 5, 206, -4, 90, 22, 183, -204, 21, 12, -6, 10, 178, -38, 81, 163, 34, 174, 130, 114, 28, -69, -135, -3, 106, 98, -206, -119, -56, -70, -65, 161, 102, 318, 1, -49, 43, -31, -20, 101, 193, 275, 80, 16, 253, 79, 55, 6, -46, 42, -207, 27, 61, 92, 56, 169, -209, 49, -30, 103, 112, 133, 112, 345, 63, 88, -202, -73, -54, 357, 25]
3491B5J23q7j19J93k36K12r4n3j10J59NP5j86K19k8N2j93j52K32Mo8Q6l10L30
3515G9j31J27j71O7R5j36J09J41O1l67J06n1j23J82l0K55l63q5K46O2j40K13j73
3538b7j51J29n9K06p8l0l9J08k28J76k25J85J24k5k05K12K5p7l6j5J4k50L09R1
3562A34j31Q9l76L83j1Lj01M4j03J15J4j11MJ74o6j6L5j28j65L36j29rQ4lj11
3587d5J29K3j1Q2k34l1j75N17k30j82J53M3L9j29O7j81L02k13J51Q2M0N3k48l11
3611c09L50j98K7Q8k74M64J37l67L01r5o1j4jK2m8K7l5J30J27j78k91M13k21J30
3635A24m69K37j50L19K41k42K5j83j3L05r3k39O9O0p1O2K22j03m10J70J68J66
3657A95P2m57J30r4J02J35j40m1K44j93J25J19m18L98l0k96K72p3J77m5r6J45
$$ y = [25, 148, 61, -58, 135, -101, 111, 17, -36, -146, 13, 18, 93, -93, 126, 98, 150, -43, -195, 37, 41, -27, 59, -251, 79, -52, 75, -96, -29, 66, -70, 39, 180, 241, -126, -20, -71, -194, -12, -42, 213, -150, -235, 11, 73, -67, 146, -27, -178, -49, -108, 98, 20, -10, -49, 59, -169, 7, -218, -33, 91, 66, -139, 73, 98, 21, -15, -30, -16, -266, 43, 134, 3, 92, -284, 99, 88, 91, -10, 34, -69, 46, 60, -51, -47, 127, 61, 45, 80, -48, -213, 123, -6, -15, 69, 66, -45, 84, 107, 96, 178, -56, -87, -262, 255, 25, -157, -4, 39, 78, -51, 16, -165, 137, -76, 75, 157, 197, 250, 2, -309, 41, -157, -130, -42, -316, 148, 285, -82, 219, 124, 63, 49, 48, 70, 22, 49, 14, 144, 271, 93, -198, 215, -6, 124, -345, -108, -258, 61, 302, 60, 85, -98, -111, 194, 101, -138, -69, -9, -80, -18, 204, 101, -309, -139, 29, 195, 267, -190, -60, -154, -52, 83, -57, -98, 146, -47, 78, 197, -221, 177, 147, -149, 123, 50, 227, 182, 86, 231]
3679B31l02m5L32j65j57J38rL9j80j0J70k44K1K61l26K75J55j02q1K18m69L16
3701F6k40n1K85j02R7k20J86q7j02K05mJ79j8k66J1K86l9n41L26j02j65N51m47
3724a92M77l44L08j08J54N3l26J36p1j55K07K7k78L00l48R0L27j93Qk25L80j37
3746I0j11L07m85J99P0j08J82o1j96P8r7j32N00m64K81j2j1j11P0J36o3Q8j36
3769A4p3j35L85R9k63k38M22m30n6K86j91K88r3j16K21l83K25q7R0l9L20l56K8
3792h2L37m77L89j58K13k08R7k25j7O9K04j24j45J27K8k82J81L6J37j84kk3j5
3815a24J26M6n7o1J89J51k42P0l07K70k71J69j89Q5J16J73PQ1m43N9K36p1k48
3838b35L49k35R1N8j57M6M51n16K51l8K13k80Mj10K31K48l09r9J5j55L00k90J49
$$ y = [231, -71, -116, 216, 51, -106, 32, 23, 62, -118, -128, 42, -202, -181, 80, -246, 29, 184, 82, 1, 219, -250, 66, -174, -225, 60, -42, 55, -165, 21, -66, -168, 37, 33, 212, 194, -72, -61, 225, 186, -355, -29, -131, -296, 255, -192, 285, -59, 249, 141, 295, 348, 22, 158, 87, -68, 139, 166, -112, 188, -160, -70, 257, 64, 72, -153, 227, 90, -21, 286, -199, 0, 70, -38, 144, 83, -113, -35, -132, -264, 236, -228, 53, 41, 30, -81, -11, 125, 62, 150, 14, -59, -194, 191, 290, 27, -211, 211, -219, -275, 11, -180, 108, 15, -101, 120, -263, -38, -125, -35, -74, 246, -110, -82, 255, -222, 167, 9, 222, 14, 111, -114, -131, -62, 142, 18, -127, 0, 28, -254, -73, -37, 100, -84, -86, -109, -124, 2, 48, -9, -70, 119, 270, 28, 98, -209, 61, -210, -41, -230, -145, -29, 144, 151, 232, -211, -152, 84, 13, -235, 114, -121, -30, 28, -129, -83, 368, -148, 103, 65, 278, -2, 2, -108, 123, 371, 62, -37, -22, -177, 123, -167, -18]
3861a8L32l68Q0k1J07j54K26l27L92j73R7j3j95n4K44p6k80L60p3l17K09r4j63
3884b79J99J1K97l23q6J01J94kj11K41k19J11j0j73R0j95k8K39kR4p0J2j12qK65
3909B36k62L23k65j66R9j4MJ80n1N0M8m09J67K04n51L65J89l47J15J71k83k0j07
3932c24L54J32j41o2J52q6K8l6r2o2K03J08j49k9J39r8m6n0q4J24P9j02k04M88
3956B42k3m17L38L7l59J89m6P8L2j97NL01m01J02P1M6j71k8K63K88n47P1o2J99
3980A1j48K12m4l4j28K06j76n6L31R9l10M0K10Pk56K9J6J03k53K89k34J8J27j18
4004e9Pj43L02R9j45l29M18l26K34J76j05k2l27L36l22K45j53J78M6O1l42J77
4026Fk70K97p8rJ51Jk88R6L08j07j97l0J65j42K44n9J7K2J27k76J78j49k1K35
$$ y = [-18, 314, -54, 26, 5, 112, -42, 184, -143, 249, 76, 173, 160, -35, -89, 155, 79, -201, 159, 86, -231, -22, -116, -279, -80, -69, 228, -95, -181, -80, 114, 112, 1, 242, 23, 134, 124, -49, 41, -154, -182, 57, 55, 149, 79, 91, -21, -29, 236, -26, 297, 32, -134, -35, -49, -45, 135, 84, 134, 182, -227, -60, 144, -407, -42, 147, -200, -85, 86, -197, -217, -324, 30, 162, 21, -41, 111, 25, 53, 17, -75, -137, 66, 174, 25, -4, 135, 37, -9, -59, -143, -19, 60, -42, -246, 242, 219, -198, 140, 177, -182, 7, -39, 39, 71, -126, -121, 180, -221, -119, -48, -2, -173, -201, 62, 350, -197, -126, -188, 11, -137, 75, 31, -3, -131, 75, -101, -157, 174, 273, -37, 3, 213, 220, -36, -7, 9, 112, -141, 148, -86, -68, 59, -59, -52, -195, 107, 206, 61, -268, 150, -176, 58, 234, 129, 107, -220, 116, -206, 39, -114, 64, 110, 171, -171, 6, -264, 33, -45, -54, 97, 98, -190, -94, 214, 107, -90, -120, 45, -97, 147, 88, 105, 127, 254, -22, 156, 7, -14, 221]
4050B21m61J60o3J45M7j69R5J36m2J52l73L74k70P4J5J29r2q7Pl17N10J03k20
4073G4oN0l8R7k33k89L73J76k83j28oK70k2K40k63m8m6R3K43k17M8Qj05j77P7
4098a12j16L60j08M9p6Pq2K9J42j77J53L1J6j52o2J54l75K05K15l89L64r4L0r3
4122h1K63j1l87n3N09Q7m45k64M68j83J16j61J63Ok8J22m1K30l45j55J61O8K60
4145B99l77P6L0k8J08j90K16k71Q4O2nQ2N7r0K3m8L33m16M1J45l0k69K50J72q4
4170A70j4l19J91J17rl58J57o4K18k62K0J31k64L97j25K48l78K10N5l39J57o8
4192a29J54l45M30K09m35J20n8l7R5j58R7K1L65j08l63K91J3k76L0J89Kk93K53
4215F7n9lJJ59k80K73J6p1j10pk3K5k6rJ46N5j27R7j58j5l2R9K5n9J27j03K0J76
$$ y = [221, -240, -80, -143, 2, 49, -120, -25, 111, 69, 221, -152, 222, -48, 26, 41, 170, 78, -9, -2, -319, 191, 294, 74, 68, 118, 80, 177, -56, -345, 28, 204, -79, -207, -213, 57, 35, 275, 12, -36, -82, 11, 254, 37, 85, 93, -12, -189, -112, -228, 132, 24, 73, -3, 4, -78, -49, 93, -84, 69, 100, 116, -36, -98, 56, -319, -114, 101, -288, 76, -18, 12, -81, 182, 171, -216, -269, 240, 327, -118, -382, 86, -97, 19, -142, 21, 27, -1, 121, 80, 310, -35, -190, -29, 39, 299, -78, -2, 28, 0, 108, -82, 134, -137, -53, 9, 4, 86, 143, 53, 76, 28, 361, -55, -14, 131, 101, -168, 82, 254, 170, 156, -163, 28, 145, 136, -222, -65, -129, 89, -173, -153, -22, -286, 111, -14, 234, -144, 66, 121, -218, -61, -129, 25, -320, 110, 319, -116, 4, -54, -91, 4, -154, -57, -36, 329, 221, -142, 149, 162, -114, -84, 105, 107, -186, 67, 8, 5, 6, 165, -115, 158, 174, 103, -7, -14, -37, -12, -38, -47, 99, 154, 27, 124, -34, -49, -81, 18, 43, -16, 111, 8, 28, 204]
4243B04j65Mj36O9K02l47j31J07K5kL02M4m7k55J13n8L77j74k16N5J30L9j86Q6
4267D0j91N7j22J83o7K21L9nl75l4OL07k56M84j33j68J19O7l02L63n0l41R0N0
4291a8o2k3K85l66L37k61J47l4J19j23J8K01m8k54O0J9Q9j74J81J50j63k40K69
4314A09l6K9j64j27M15l97K56K5k83L46k05K18j52J42k77J40K01k18O7Q8k33P5
4336A9l19M95j80K0K14n8m55K37j77J75J05O2K8l53K41l4p2j8p6P8J19k27K16
4359D0k19J32K42l39m6K26pK21m41J87M1Q7K5m9j37q7K03k5p6p6j09J50J81j04
4383B0j72J59k59L01r8M8M4RL9J04l75J15l4J49J10j09l21K68k6q4M55m82K01
4406F2J48k22j52K46k66J48K98k29j8j6M4p5j06K42p3Q3Q9j65k45J8J21M6j60
$$ y = [204, 39, 43, -93, -24, 178, -169, -300, -193, -168, -170, 132, 176, 129, -126, -13, -71, 306, 132, -84, -29, 101, 140, -46, 40, -151, -94, -216, -33, -100, 121, 160, 155, -220, -254, -248, 59, -197, 287, 154, -14, 105, 172, -130, 233, 183, -158, -68, -18, -80, -103, 182, -184, 153, -108, 39, 5, 124, 1, 19, 220, 172, -82, -22, -3, 86, -88, 93, 243, 80, -160, 109, 73, 102, -62, -189, 226, -171, 85, 110, -173, 173, -32, 186, 34, 176, -101, 39, 240, 22, 89, 177, -56, 19, -300, 195, 15, 35, 249, 191, -264, -27, -204, -29, 76, 138, 166, -187, 54, 20, -52, -70, -146, -68, 51, -176, 40, -179, -47, 195, -144, -190, 36, 29, 250, -191, -4, 37, 124, 149, 100, -37, -124, 79, 54, -22, -98, -207, -57, 124, 20, -152, 7, -252, 49, -49, -1, 43, 52, 91, 195, -180, -65, -99, 50, 160, 51, -270, -2, -28, -112, 343, -139, 62, 210, -12, -164, 82, -184, -36, 262, 33, 15, -1, 43, -32, -138, 104, 31, 114, 203, 38, -207, -189, -68, -22, -182]
4429a82J20RQP6L4L1l40J28K4K16j52j90nK51q7j42L20j24r3l66P53o5n32O20
4453C12k41P4j25j31J99k7n0q2L81n08L94j45K11l68m8J14m0P8j70J31P8p6k75
4476c14L02k93L10J77P0k62p6j49K04Q9l37M04j08j70n6J31j24L80j35q1J42r3
4498A1k5k41K95O3j68K84k55J42j1o5j0K32j05q4o0M1J97N5m05j4J73Lk15J52
4522a0K5r4k2j2J44q7r8K37j00J61k17l0J09M1j78J68J8o1p3K79n74L42K82j74
4546G6K6L6Pm7m1P3k35K5Lj78J65Q9qL38l24k24K33o4R2m4k6jp1J77k85L02j44
4573e0q8J57ok9k6K44k39R7l59M74r2m27O07l19O6N3j08K15k50k37N41l8j54J2
4597D4M8p4P6j06m8l0j2J40K20Kj64k89L26J04l85R2j77P6R9o6J62k39K05j07
$$ y = [-182, -62, -53, -45, 31, 65, 96, -244, -116, -92, 124, -28, -218, -223, 28, -59, -201, 119, -5, -98, -464, 289, 224, -308, 312, 71, 145, 20, -111, 88, 61, 11, -71, 310, -198, 196, 51, 262, -106, -154, -40, -80, -2, -172, -41, 37, -39, -314, -12, -305, 5, 182, 252, -10, -86, -235, -31, 58, -279, 125, 17, -153, -209, -78, -202, 178, 43, -38, 104, 11, -14, -255, 40, 103, -65, 219, -36, 106, 95, 30, 20, 252, 147, 63, 3, 44, 241, 296, -109, -123, 50, 53, -162, -10, 15, -79, -101, -113, 31, -56, -154, 83, -17, 144, -73, -103, 6, 47, -131, 37, 55, -6, -79, 200, -374, -32, 250, 76, 102, 138, 145, 98, 57, 130, -105, -80, -77, -255, -90, -1, -9, 329, 5, -219, 14, -50, 42, -2, -28, -29, -100, 77, -208, 94, -50, -138, 19, 13, -16, -42, 202, -37, 60, -299, 175, 83, -344, 263, -56, 10, 63, -45, 170, -80, -317, 224, 186, 32, 44, 92, 18, 94, -12, -60, -90, -102, 38, 258, 260, 96, -193, 133, 237, -148, -56, -233, -157, -58, -124, 38, -201, 4, -103]
4621a03%L21j81k74M37l57J69r1K1j22L89j40R3l41k2P1K69q5k39K76j56l9R7
4644gR9R6o8j46M09l63j44K38j55n4K04l81M6L74m4l6Lj26J40q7J11j36K68k37
4668DJ60j88J96k24JN7j46J59J9J03k44Q8k04j15K28K05k5j94J14P9l68K35J28
4691F8RJ7K61k54jj66l00L04K3J7K66j34k96L26l16L63Po1k22K27l51K02K10m16
4715b17J56M1L7N5J22l19m9k8K23M3J29k22k98L92j46P1O6j75K17j39j8K35k27
4738e1K39k10J98j89pJ08m3j4K59k70K60k75J28k24P1J94l05O0J34J9ooj34j73
4762b37K18J24o5R7N0k28q2N04n58J75O1P7j67j00N0P3p6l6J55j1q4j33J49K81
4786B37m01J58k79K46j36M8P0J29k95J25J13k28O09k94J29o03P2N56n6j28J27
$$ y = [-103, -103, 218, 37, -237, 200, -157, 12, -79, -58, -180, 209, 69, 162, -179, -201, -130, 139, 54, -185, 91, -65, -104, -7, 92, 188, 120, -26, 383, 20, -124, 114, -41, -95, 109, -272, -226, 148, 104, 68, 71, -55, 85, -2, 109, -27, 241, 4, 164, -24, 172, -52, -51, 6, -140, 19, 38, 141, -103, -15, -219, -334, -106, 99, 74, -120, -6, 73, -295, -60, 68, 77, 94, 355, 101, 100, -66, -366, -62, -39, -22, 244, 110, -186, 140, -176, 187, 194, 133, -89, 138, -213, -11, 199, -217, -61, -20, 17, 72, 194, -125, -174, -202, 21, 64, 193, -29, -327, 65, -81, -10, 56, -119, 98, -41, -59, 176, -51, 188, -22, 176, -13, -20, 88, 45, 31, 290, 20, 280, 5, 133, -91, -20, 174, -131, -71, 63, 82, 76, 70, -64, -237, -19, 105, 40, 137, 187, -41, -123, 381, -177, -2, 59, 136, -31, -131, -81, -8, -84, -120, 35, 24, -60, -193, -44, 237, -164, -6, -285, -39, -175, -127, -57, 72, -223, -98, 15, -213, 396, 102, 231, -372, -300, 256, 200, 72, 199]
4807A99m21L41j64n3o3K93l42K08Q0j63nJ00k53P8J70j82J13o7J71P6l2n2l33
4830c01M33O8m30J68J60m1J3l2j40N0K28p9j76n4J5K69L2l31J11l5J49K66l21
4853B2K84l45q4J60j42K52l09P7J04ML4j39P3J17j02L9j20N0k20M46m08J04L31
4876B28j95j48j25L24q4j81J39J27J59o0k38J45J57j76j5O4j98J92k0o8L0j79
4898a22k8J0N02l65K0O2q6P2j1L29l55R5j93N4N5j62J43j6m1J1j61N6K61l76K21
4923b5O7k71L81m91K73Q9j60L37j18KP2m14K62O3L21l24q5J77j43J12q7j11L7
4946c6O3m9J46n1R7p1j31P6o4J45j67K16k52j32L88j25j21nM5j37J61n2K43l17
4970a30J64n8L1n8j29L81k94J31J09J2k14M5M3K41l20J10q5m7J67P2j39j78J07
$$ y = [199, -222, 119, -45, -98, -161, 132, -210, -2, 78, -85, -90, 10, -243, -165, 5, -177, -64, -131, 40, 116, 84, 32, -301, 132, 200, -230, -62, 98, 57, 70, 38, -102, -52, 176, 97, -79, -133, -118, 151, 183, -148, -37, -72, 77, 343, 22, 306, -39, -123, 37, -105, 147, -162, -85, 19, 23, 57, -82, -9, 108, 6, 45, -75, -25, -245, 201, -207, -103, 228, 33, -115, -240, 84, 0, -181, -42, 85, 244, 184, -54, 91, 248, 72, 57, 121, -77, 115, 95, 27, 57, -122, -150, -140, 362, -3, 17, 79, -7, 65, 54, 383, 28, 123, -70, -16, 39, -123, 20, 4, -37, -26, -187, -131, 130, -246, -25, 42, -229, 152, -339, -66, 23, -137, 200, 82, 84, 156, -258, 4, 67, 388, 64, -21, 156, 13, 125, 38, -73, -36, 27, -22, 124, 73, 170, 99, -32, 44, -20, 125, -42, 174, -78, -210, 178, 53, -68, -73, -28, -165, -4, -56, 187, -130, 34, -24, 7, -51, -180, 201, -93, 38, 147, 159, -55, -10, 33, 274, -46, 64, -21, -68, 99, 171, 32, -146, -39]
4993c9J8J26j53J3N0K4p2j44J13K05k16N5q0J10J99k29j90J22K62k29N5oK51k5
5017B20r8n5j32J03j05J64R0k87K38o4l26K30l5R6J30j51j2N5Kk8Kj18P7k9RK36
5043B12k70K46k71J90j94O5R3j44J71J6k21j28K06k41L01J17j52j68L32k35K15
5064A40j48k97P5L48p3J98j12j57J71m30M04k3L6l96K19M00m36J37J28m98J76
5085a38L76j69k50R9J06J36j84j27J52R4o6J69j64r0o8k36O73n06J42QP2J79k79
5108g1L69k86O9j23l9K07KQ5r1K1k00R4j20K6J00o7m1r4M3J07l78J16J69p1Q8
5133h5J29l3k91M92J3n6l08J23J59k4Q3l92K15J28k28J70j95j05M48k16jQ5J94
5156C05n59M13o0J07m8l76J98l8N3L2K14k36L6L0j23K11k20J50J14l53Q5k53K25
$$ y = [-39, -21, 105, -48, -35, 15, 39, -33, -177, -64, 141, -75, -20, -100, 10, 209, -20, -210, -88, 174, -55, 0, -6, 245, 220, 122, 67, -65, 38, -67, 97, 187, -100, 138, 74, -252, -22, -57, 39, 169, 18, 6, 61, 63, 35, 37, -81, -4, -33, -24, 212, -58, 188, -83, 107, -87, -22, 71, -73, 98, 114, -107, -235, -29, -270, 31, 148, -4, -172, 160, -75, 140, -8, -305, -230, 118, 45, 243, 131, -26, 145, -285, 119, 96, 132, -264, -45, 355, -81, 56, 184, -314, -138, 238, 69, -181, -82, 24, 160, -24, -151, 1, 95, 29, 198, 34, -56, -124, -360, 313, -193, -51, -43, 29, 208, -71, 298, 12, 81, -42, -81, 126, 128, 213, 122, 143, -57, 37, -83, -57, 43, -24, -65, -159, -116, -9, -387, -271, -102, -173, -85, 44, 11, -280, 212, 225, 169, -139, -16, 143, 119, 202, -190, 25, 153, -75, 95, -100, -205, 243, 27, 26, 111, 305, -254, 159, 99, 206, 158, -218, -20, -58, -5, 27, 241, 5, 41, 71, -52, 159, -61, 89, 203, -150, -65, -318, -93]
5179i3M38m87K28j47k0K37p3K89m20J38k06J49l9J02k51rL75jJ8l14k5K40m7k19
5203a37O0K04k20K44N2l55M2K33j73K03l13J46j57J84R8J11k04J56k56N9J86j14
5225D9j90J80J6L4M2j08Q5M9k08K2o3J69K19k59kj52J76r8m2M2j06J92l26J11
5249a68J41Q1J2K1j55L3P1j03K93j46n8j64m7K17J48k91L37R4l24N3%k1k31L30
5273A23J57l80m8J92j42N4j03Q4P1L01l01k47J83j81ON48l5l38J21p0k48J58L12
5296B17rl07P8j75R1K26k00Q1k49K26k66J95K31n1k65O2J01OK51k04p6J3K38l42
5320a28J55Q4j41L9P3k2k86R2o0R8L0km1K35o2QPk87J03j3J2J48j52K86m3k38
5346a05J93q0Km8j34O0M04l17p7J5J21j66L35J4l0j62j49J5J49K0J01k29J43L1
$$ y = [-93, 345, -142, 86, -61, -81, 156, 83, 372, -48, 90, -116, 33, -6, 96, -155, -164, 211, 210, 228, -86, -111, 129, 82, -137, -77, 127, -93, 151, 203, -152, -110, 123, -50, 153, -160, -14, -171, 13, 111, 222, 18, 174, -82, -23, 163, 49, -141, 39, 55, 89, 131, 23, 108, 157, -51, -29, -92, 77, 296, 37, 35, -117, 59, -39, -81, -39, -145, 47, -279, -168, -27, 54, 66, 87, -68, -35, 36, -67, 226, 80, 22, -142, -189, 28, 176, -115, 222, 316, -8, 45, 45, 24, -207, 123, 280, -100, -148, 44, -98, -44, -147, -63, 8, 309, 8, -239, -56, -237, -231, 317, 282, -56, 65, -5, -253, -95, 217, 208, -99, -21, -196, -105, 121, -79, 2, -247, -21, -287, -92, 139, 88, -177, -115, -14, -8, 243, 39, -37, -24, 214, -128, 27, 111, -30, 9, 82, 60, -226, -134, -194, -96, -66, -68, -109, 126, 64, 72, 79, -208, -105, -118, -106, 42, -110, 176, 133, -105, 88, 8, 10, -38, -172, -112, 292, -25, -102, -87, 34, -132, 203, 217, 187, 25, -124, -109, 40, 60, 161, -68, 75, 106]
5370A06j92R6q2K13l47K09l66L83J58m2mj12l0o9J82j66K16J2j43k07J91K9l11
5393b76J57PL0J58j02K33j68m0K81m85M44j35J39l10N0j71L98J20m09J24N7k35
5415a33K28n90P84l61M4m1O8J85m06K10Q5l49K08Q7M6P4J58l14m2P1k65O4J37
5438e2J36p8K77k03O1q6J88o45L03N7K07k11J9j17L49m38K54O1o4N2J75k88k72
5461c15J70O9M3l19L87J52l29p0J61J66l16L60m9j83j23J21J46k05L84k14m39
5482d03M26K1p3o1K71n1j46N1j63J54N4J06l0j14R5j9l88J96Q1J65r5j53L50k67
5506Go8L3r4K91k68J41j05MJ19R1L3j85k73K49n6J8LO3M0o2K77k44Q4J52l70J30
5532A0k57K00L05l92L29j68k72P0K93N5m37K95q3K3j19R3p3Q0J40p3j43L3l8M88
$$ y = [106, -86, 10, -72, 141, -206, 3, -363, 20, 178, 136, 132, 20, -10, -79, 103, -63, 153, 165, 22, -185, 6, 35, -276, -119, -112, -82, 76, -26, 207, 39, -1, 280, -205, 239, 104, 243, -67, -17, -188, 210, 330, -79, 45, 102, -133, 95, -495, 289, -72, -28, -69, -1, 184, -222, -12, 73, -276, -68, 19, 65, 139, 297, -17, -59, 12, -253, -189, -52, 84, 6, 283, 80, 141, 55, 243, -402, -99, -42, 165, -46, -27, -144, 205, -233, 21, 82, 18, 70, 245, -43, -315, -145, -76, -33, -352, 35, 187, -142, -212, -51, 115, -201, 159, 110, -73, -196, -75, 71, -134, 250, 36, -403, 23, 44, -29, -90, 181, 130, -16, 35, -128, 26, 80, 186, 156, 42, 137, 118, -270, -74, 7, 172, 77, -76, 274, 7, -61, -28, -122, 169, -99, 42, -63, -59, 60, 151, 184, -1, -274, -25, -81, -63, -60, 3, 43, -19, 258, 14, 98, 250, -120, 10, -247, -47, 258, -134, 195, 27, -245, -175, 118, 173, -264, 31, -52, -29, -148, -55, -128, -48, 92, 19, -124, -91, -129, 359]
5556C59l24J30j89J48m07L50O6j70N5j40J56O0k14K97n8r2p6K80k15pP9k66l1
5579b09Q0J58OJ07l14M9l2J56M4K14k13k22J61o1k04L18o8j88L50l00Q6Q9j06
5602i9oM39m09Q3R6O6k63K78l03L25k31n2J2l8J35J12k06o9l4k8K41n3Nk20J3
5627b06L39j68N0M2j22k8r1J79O3J2Q1j82J29L8k90J9J55L9l25K34J28m7j07p0
5651a28K90k25N5j84J70J79r2r8J47m7N5k9p2j22M2J14j01J8j46P1k20L58N4P2
5675A61l31L05j62J16L1N0l47J08L95l83J19M6m2n1l0J06j20k55M83m35L05j04
5697c5J5L75l95j04J21q9K40p7N3j78j3J47p0k5j72K38k5M7O0J35l29K45k14K95
5721B45k29L54l23k23r9J89L32o1k89K5J47j94J67j15K08k52M45o51N84l31L8
$$ y = [359, 35, 165, -24, 124, -283, 67, 133, -37, 18, -122, 34, 94, -120, 177, 119, 27, -49, 231, 16, 9, 88, -178, -209, -129, 29, 35, 142, -172, -123, -155, 1, 45, 259, 46, -176, -15, -76, -280, 38, -30, -218, 132, -168, -82, 7, -99, -105, 334, -75, 8, 104, 170, -93, 185, -118, 207, -24, -76, -64, -102, 33, 145, -61, -130, -164, -192, 49, -4, 1, -219, -206, 133, -35, 15, 57, -65, -93, -184, -5, 58, 70, 151, -31, 98, 136, -154, -135, 20, 59, -266, -32, 96, 49, -58, -128, 162, -63, -8, -192, -22, 157, 65, -33, 114, 67, 122, 93, 21, -101, -59, 55, -46, -28, -174, -103, -323, 35, 89, 161, -170, 135, -27, 89, 120, 170, -177, -69, 326, -57, 62, 108, 66, 15, -15, 91, -29, -284, 199, -236, 69, -35, -20, 355, -40, -144, -23, -112, 128, 51, 104, -74, -87, 60, -10, -35, -207, 31, 6, 53, 113, 248, -81, 164, -50, 245, 16, 370, 47, -176, -275, -86, 246, 185, -104, -79, 68, -126, 41, -74, 134, -118, 327, -324, 260, -71, -33]
5742c3j3Mk7R7j69N1K9J81j71LM1K8Q9r2j14K7K73r9n3j54L5j11R6K45m46L56
5768G3J72k96J84Mp3n9r5Q2j26N7j11O1R9q0K8n8k07K05J74j32l6J98m9J11j83
5793e7Q5J78J3j37J7j84j17o8N8K13j54L28j3j21q5J36o6P9k59J04p4J31k1L33
5817C19k63k42M65j28l20K31j46o7M2L5J68j53K08k50R4l0J22J80k93j27K81k19
5839i3J74j4j97J85l22K77k95M74l48K61k11K15N5k67K31j65j52K13J14j65k71
5860c01Q4Q8J41k14K85m6j50K71j74k22J96m1M43k94Kq1p8J54L8m06M47k43Q9
5883a2J69j38L3k37M23j54l48K7L75k13qm3J2l7K7K69Q2l36J61p2j90L25M8o0
5907A03J28j45l73J29j21L70K59l46l21J63L94j65k52J60R7R4j29m9j06m2K26
$$ y = [-33, -46, -42, -69, 28, -141, -90, -61, 120, -51, -48, -7, 21, 110, 18, -96, -69, 204, 105, 52, -102, -67, -178, -82, 163, -283, 73, 245, -51, 133, 137, 64, 5, -90, -8, -134, -77, -188, -127, -28, -108, -80, -138, -345, -140, 34, -98, -134, 64, 15, 126, -57, 28, 206, 219, 82, 99, -85, -202, -270, -212, 1, -153, 175, 162, 41, -44, 92, 26, 105, -154, -50, -124, 7, -14, 319, 56, -186, 279, 151, -169, 62, -84, -151, -109, -74, 94, -59, 149, -101, -7, -37, 85, 265, -28, -155, 126, -93, 81, 67, -130, 55, -267, 10, -285, 189, -159, 102, -109, 106, 161, -106, 125, -40, -192, 21, 135, -30, -301, -217, -129, 12, -202, 83, 37, -113, 158, -16, -238, -42, -83, 360, 66, 68, -13, -91, 63, 101, -305, 142, -101, -12, 157, 19, 52, -185, 238, 84, -264, -237, 138, -75, -83, -126, -114, -151, -124, 145, 227, -109, 52, -20, -210, 115, 163, 103, 231, 86, -287, -158, -279, 91, 350, 4, -317, -154, 240, 75, -177, -17, 80, 174, 45, -4, -110, -152, 74]
5928G4R7j53k06J85Nj11n8L11j92o1K10K00r8l27j4J27j24j85J86J6l5K18k18
5951a53J83lo6%K54l56K35J43o16N64J02j49j81j52m9J35Q3O7j56J06n7q8J38
5974a6j95M40l42j05K70n4k08K5R5J68L3j61j9J04Q8m6P9n4J94n11R1k2K38n2
5998D0o1j00R2P5j25Q9O6J39K1k37J46J87p65P09q8l79M8J39j14K57j58l55L65
6021ij29K0M9j21K12k76K72K7r4J43k22J13R6k2j72m3J86k06K3L9R9K04k20J8
6045a3O4J34Q0k73O4n2L9p4p6j5L8K89j33j17R5m0R7j59QJ1j62M89j95j55K08
6070A52l72P6N8j35M07m8j73n0K59j90j5j91L71k36k21L27k5n2j21M00l77K11
6092E5j5L7Q6L4j52J54l13R8j03K52L1o2k95J94jq6N3K38j08q5k97M8L65k56l2
$$ y = [74, 171, 18, -188, -3, 2, -109, -167, 144, -48, -109, 101, 301, 203, -124, -138, -11, -135, -320, -134, -118, -153, 65, -153, 30, 27, -39, -39, 215, -141, 94, 237, -379, 185, 287, 138, -43, -195, -244, -109, -26, 41, -115, -9, -66, -154, -16, -211, 229, -113, -218, 52, -2, -210, -185, -90, 78, 111, -50, -69, 35, 123, 77, 156, 102, 296, -215, -124, -146, 92, 40, -21, -121, -29, 46, -79, 10, 76, 215, 236, -1, 145, 332, -433, 276, 188, -191, -143, -4, -118, 139, -19, -374, -9, -138, -118, -69, -190, 22, -254, 18, 45, -49, 94, -128, -15, 81, 59, -113, -156, 30, -176, -153, -114, -15, 189, -31, -13, 51, 185, 265, -8, 56, 4, 43, -31, -107, -122, -84, 205, 72, -45, 50, 10, 107, -52, -44, -33, -195, 294, 99, -56, 152, -220, -144, -86, -221, 186, 138, -35, -85, 174, -16, -31, -222, 149, -87, -308, 19, -6, -58, -179, 221, -156, 55, 40, 77, 163, 197, 45, 199, -114, -16, -119, 133, 164, 102, -193, 1, 0, -86, -33, 205, 97, 12, -285, -237, 128, -128, -160]
6117a60pnL10j76o9J81k26K57m3l07K61J11j15P2J50k46p9J09l2NK6j98J99l01
6141b83L75M8j47k8k0MO7l1j23Q6J03L3j38OJ87k47J39l30K73L8R6M9p3j13k26
6166b55K27J09l08J02J32j47o3K78k02K83j89K29M7j59Q8l22J7J93J22r7q0j54
6188a49J08J98j80J33j34m2n7J71Q5k01j22K57k32M2K31k5k72K88L2k1j45J15
6210H0q3l8j18M4O6po0L25n6l32J51o7K41l52J76J61J9j68k6kK75n4j85J82m59
6235b87J04K86j56j66J77K24j23L8j36J79Q1l75J04%P3Q1j09L52m74Q9M8j21R2
6258a9M0RM36l93j36o0L06j78P2J18j65r6Q9R7J8q7kl40K39K44k76N18m55R8r2
6283a5j01J5J8K60k96o6L10j90K98q7j31j87J77K1l02K51J19Nlj65P2j79K10o6
$$ y = [-160, -167, -172, 138, -38, -107, 74, -152, 105, 62, -245, 16, 127, 12, 84, 234, -12, -91, 18, -14, -9, 17, -181, 18, -283, 92, 140, -7, -35, -55, -51, 16, -15, -138, -52, 51, 84, -54, -48, 139, -108, 31, -299, -26, 12, 108, 157, 84, -29, -255, -28, 81, -227, -125, 7, -140, -203, 75, -127, 156, -33, 196, 243, 84, 172, -150, -133, 60, 182, 85, 5, -149, -41, 157, -23, 110, -24, -66, -123, 48, 133, -68, -190, 67, -165, -123, 108, 83, -189, 99, 131, 110, -35, 80, -3, -41, -159, -115, -49, -56, -116, 209, 153, -179, -28, -95, 146, -206, -30, 131, 150, -18, -44, -46, 229, 175, -10, 172, -287, -183, 103, -53, -219, -42, 182, 59, 97, -39, 140, 221, -154, -50, -50, 23, 104, -5, 347, -127, -38, 10, -111, -19, 21, 30, 466, 73, -63, -123, 183, 5, 77, 195, 30, -66, 23, 120, 138, 51, 49, -291, -52, 192, -84, 434, -21, 77, -15, -116, -101, -83, 177, -119, -185, 125, -65, 233, 146, 15, -172, 5, 26, -276, -25, 94, 99, 96, -69, 3, -176, 34, -32]
6307c2n8J84j65L1l91M41j8K20o8l1J8r1k4l23L48r2J3p4j36L74j03K49k15R3
6331A50k04J68Km4m1j61K48N4j37J43l54K05J88N8m64L27j06m1r5l4J13j68J71
6354b2j25j10M70L4N0k62j34J26O8j18J81j73J67j3l25K01R3r1M6N1O6K00k97
6377H3j5j61m0L79n3l21J56j85q3J12L35j48j55K5l68M20L3j50J4L31k20j17J28
6400@J60m6m7K03m51K23lk04J80n6M1mj02o0K90M1J7j11Pj18J48M5l6K3l77l9
6426b76J04M13j85J51k9k2K53m60K97k11R5J5j93J39j32o4K49k10j9K13k54k08
6448c34M31l29M5K76m4J86l44K79K9k16o5N35m16j97j6J00kK20j07k8j05K10p1
6471C7K60k97o1K82m05k1L04j10j05k0l4N14n53nJ18K9R0k79K66r7n2L81j65n1
$$ y = [-32, -90, 94, -71, -40, -431, 10, -8, 212, 144, 113, 131, 40, 16, -307, 41, -51, -38, -112, -248, 126, 23, 272, 57, 150, -54, 114, 116, 72, 31, -130, 118, 172, 35, 178, -176, 29, 217, 275, -189, 138, 32, -9, -104, -138, -25, -193, -22, -147, -257, 213, 247, 297, 35, -99, 27, 95, -23, 158, -15, 152, 139, -186, 15, 108, 17, 63, 114, 180, 380, 83, 68, -93, -133, 246, 193, -128, 28, -157, -240, -128, 207, 59, -96, -71, -439, -19, 14, -136, -122, 209, -11, -128, 0, 160, 114, 67, 270, -181, 42, 39, -165, 15, -41, 0, -4, -106, -166, 124, 165, 182, 71, 78, -40, 108, 153, 117, 140, -237, -276, -172, 241, 56, 207, 178, 156, 409, -51, 246, 35, 130, 145, -48, 91, -41, -105, 144, -66, -85, 128, -126, -334, 97, -232, -187, 89, 45, 231, -113, 166, 195, -21, -86, 449, 33, -164, -180, -80, -82, 138, 31, 3, -102, 108, 37, 297, 0, -61, 221, -184, -205, 99, -11, -116, -136, -170, 344, -209, -214, -96, -67, 23, -256, 10, -87, -139, 242, 77, 26]
6495B6q2r4Oj02J35K08l04M03j24j32j6J59j81q1J68J68l0j41L02l01R2jn63N97
6519A12J84m19L5k26J89Qn3L05MOj58o2O1K14j07M7j16k45J29j09J70j28L92j77
6543E6R2p0L2n9p9k05L36j3k03J46j70j19M47j08j75J75k74o2J91K62l53OJ91
6566D4q8k01K03JJ04q7M6J50k16j08p4L29p9k14J68P9r8r0J56K3M5J92j21l88
6590b24K95k8j83J94n1K47j56k59M61l22J76j11R5j76J04J1k75K23K87m12NJ28
6612B9J83l77K24Q6jj36j06J06M1m04L31j10J92k6M6k03K13m29M14j53j0P4j26
6635a42K84k04J13n3j50L76j4k39p9J57q8P7J1k07J88J85l73K09m7j12MK74o7
6658A03j87M9k4k6l8K23n2j04L10m32J93O2j10M3q6O0n2k6J4Q5j30J17l01O10
$$ y = [26, -56, -150, -144, -246, -111, 97, -207, 196, 72, -60, -76, 83, -98, -179, -11, 157, 127, -14, 288, -13, 79, 78, -485, 112, 296, -123, -88, -314, -125, -117, -170, 135, 139, 145, -13, -75, -14, 200, 93, 140, 24, -221, -92, -201, -31, -159, 233, 56, 148, 78, 110, 51, -28, -233, 103, 90, -113, 33, -137, -256, 191, 83, -92, 83, -191, -253, -62, 200, -153, -147, 44, -44, -245, -42, -41, 63, -24, 22, 172, -44, -152, -226, 103, 24, -190, -22, 57, -41, -131, 25, 48, 93, 285, 164, -224, 71, 43, -140, 54, 3, 250, 94, -165, 296, -26, 150, 39, 134, -42, 62, 73, -202, 21, 308, -104, -99, 29, 212, -165, 59, 145, 144, 8, -98, 8, 49, -355, -24, -134, 58, 32, 78, -125, 88, -341, 73, -80, -90, -16, -142, 142, -62, 51, -2, -152, 224, 210, -29, -108, 49, -39, 38, 49, -158, 30, 215, -158, 51, 4, -108, -104, 170, 103, -84, -35, -59, -85, -123, 100, 48, -56, 254, -178, 15, 77, -33, 10, -76, -16, -68, -94, -80, 5, -125, -8, -309, 301]
6682C01k43K5n8l54K47m4J20j36J05r4K24j98K0M8j60L61o1m0j16mJ72m1J0k66
6706a82K47m18M82j31R0j44J42k1j35M6q9K49k11J07P5j32p8NK3q1l1J42K59l86
6730a72J92K20j00N6k93j15L0k0j49L90j43J5K62J32q7j91k16O5K2j6L91m9k11
6753A3QJ83k8j35j3K7j91Q6J76J55p7l73K60q0j37J76j70m8L04N3j99p0P9Q0J89
6778B68l70j32L44k30j8J91Q5M9k11J45k34J36N9L8l94L66K08m37J54k01LJ46
6800c5n1J46K08n72M14j32j62K77j62L85k01l0o7j33n9n1J76n1r2J18o9K82M6
6823A85k59O3J09k73K52j46R0n2J96j39Q8k38P4k03J44q4O7Q3k00K18J7J64l48
6846a92O26n71K32r4M55n45j02k4J54J01k67J42P3R0k05J39l00L45o2j97K99O1
$$ y = [301, 58, 83, 25, -329, -82, -126, -6, -142, -37, -131, 93, -105, -85, -37, -197, 164, 103, 63, -53, -57, 115, 74, 84, -182, 65, -353, 129, -2, 88, -56, 86, 65, -70, -24, -113, 136, -75, 32, 107, -25, -103, -98, -75, -156, -187, -45, 214, -172, 20, 240, 140, 196, -97, -212, -182, -202, -351, 39, -104, -89, 173, 305, 218, 27, -189, -124, -102, -118, 273, 224, 13, 21, 204, 176, 41, 28, 55, -136, -50, 126, 281, 204, -169, 91, 11, -126, 50, -120, -168, 136, 189, -10, -80, -1, 79, 268, -102, -234, 110, -120, -138, 53, 138, 187, -24, 121, -113, 23, 82, 120, -274, 92, 300, -137, 17, -184, -181, -35, -86, 60, 268, -304, 110, -22, -184, 93, -69, 316, 115, 85, 18, -115, -174, -225, -49, -100, -192, -74, -143, 139, 185, -74, -11, 98, -175, 77, -69, 21, -31, 165, 26, 114, -124, -50, -253, -109, -193, -126, -43, -243, -25, -8, 156, -192, 434, -137, 95, 1, 456, -89, -191, -215, -61, 40, -227, -85, -12, 78, -127, 12, -288, 57, -5, -202, 97, 158]
6868A58j16j43J88l37J94J04r2NM9o0l7J37k04J48O0j56K07n5j7k94L55M9l25
6891a82K67k38N3J56j88J48l26K90L5j75L09m5l25K79k53J10J42m8o7P6J16r1
6913D3K07m13K2k0L43k64J47m7K7r0L45k89m0K32l13J58N2J16r8mj46K9k64L85
6937A18L1o6J49j73k32K29q2j14O7oJ68j5j18q3K50k82K40N0m0l62M79l36K16
6960H8j31o7N7N3J50j69P2j14k09J96j9R5K24m73L85n3q7O7O9k18J28j81J96N4
6984A13R8j84K93n18rK46K41m33M2L31m09J14M56l54m2j01K43Ql51M18j05l31
7006b34J13M1J21j56L78j30K6j80K99j76p8J88j94j84K81j9l5L03l36n0K0o2j03
7029a67Q8K97k06J21j98l8K60j5k65K49l93K8J89M4O0r4qJ15k20K33l12K09j01
$$ y = [158, 42, -101, 87, -250, -56, 48, -44, -39, 10, -50, -87, 50, -154, -6, 54, -102, 105, 50, 33, -261, 94, 143, -182, 85, -153, -100, 56, -132, 16, -310, -20, 15, -160, 149, 104, -221, 58, -195, -85, 57, 9, -58, 18, 134, 43, 250, -163, -141, -161, 182, -82, 65, 18, 45, -45, 300, 11, -29, 203, -110, 48, 100, 216, 118, 114, -32, -3, -267, 118, 149, 83, 232, 59, -173, 56, -26, -140, -73, -79, 89, 74, -44, -127, 123, -159, 81, 131, 91, -271, 208, -128, 88, -43, -110, -53, 0, 150, -19, 53, -61, -270, -74, -93, 2, 226, -247, 138, 85, -2, 65, 134, -84, 44, -137, 59, 113, 211, 27, 320, -198, -207, 39, 280, -153, -111, 220, -189, -75, 381, 27, -15, -116, 127, 135, -216, 202, 97, -234, -121, -80, 41, -115, 263, 133, 159, -21, 278, 102, 24, 212, 18, -166, 115, 96, 61, 364, 28, -22, -2, -64, -167, -79, 218, 12, 133, -65, -103, 157, 142, -123, 126, -267, -239, -50, -6, 54, -40, -48, 67, -153, 80, -232, -23, -124]
7052a24J83n8o9j37k5J44N46p64K46M9L6k31J71O4Q2o0kM04o90l5O3K84j63J80
7076I4k49J35j14o7L53J19l83J65O0k07M3O7QL6l59K47p3K26j0k95Q3J07J28n35
7100d21K14R7J33l3L21q1j97O7o3n1L3Q8k74M19j22j82j35j0P6K64Q2l44m3J26
7124c6Rj33K64j9L3j22R4k38JJ70j20j60K79j76R7J3j32J41Q2k70L09o3j37r4
7148b08L90j91J5M8j18J75m8J81k56K76k80QJ17p8oL2Mn9n6l7j61K32jk04O02
7173C77o5l44j25J66K03k43j77J42k8L0k27L55L81m79R7J70m21O8J06l4J26O5
7195A43k54K66q8l15M45j25r1k9J86n9k11K61k32K46Om2m3k3p3J01l17K45j07
7218a10L05l69Q8j50Q4L73n23L73k01o0R9J69Q7l0P4m27K77l6k92L47j73J60J90
$$ y = [-124, 59, 1, -68, -205, -230, -86, 460, -304, -58, -9, 27, -204, -33, 31, 113, 53, 51, 455, -235, -270, -207, 77, -86, 94, -155, -20, -134, -201, 152, 271, -112, 53, 113, -94, -51, 16, 24, 60, -299, -52, -125, 101, 91, -204, -121, -14, 114, -421, -207, -110, 23, -10, 311, 230, 33, 100, 37, -14, 19, 107, -167, 252, 130, -52, -187, -197, -121, 143, 225, -119, -162, -36, -27, -160, 104, 85, 118, -4, 90, -148, -147, 23, -97, -257, 22, -154, -57, -44, -176, -35, 47, -223, 86, 23, -114, -208, 182, -9, 6, 54, -64, 111, 63, 244, -12, 264, -16, -8, 109, 31, 25, 57, 61, 2, -54, -91, -252, -20, -21, -225, 377, 312, -32, -157, 9, 212, -31, -208, -66, -94, -64, -291, 64, 445, -34, 63, 233, -188, -120, -14, -48, 78, 143, -111, 155, 67, -248, 197, 72, -19, -48, 138, 79, -132, 129, -103, 143, 149, 107, 64, 41, -32, 69, -248, -3, -110, 195, -174, -86, -236, -152, 221, -302, 71, -130, -190, -91, 78, 165, 135, 209, -218, 59, 23, -269, 78, -95, 65, 255]
7241B55k33P6j84Q5J79k65m7J75j04j3N9k13J77q0K40k71K95l0O0O0j53k9K66
7264C05j40k38J7j35K60k1m9k8r5n2J09K7K45l97K10k02K70k07Q3K28k54K1J71
7287A28j50J25k04J15J33k8j6o6J30J26l84P4r9N0J81k53N6K25k58J62L72m72
7309e3%o9L40l83M40l27R3J16j48J35K1k14J34j77J68j61K34j26k45P0K09k0j40
7332a03j93L90j86R3K53k18j44J78k5k14K23lJ48l49K58j20J18J44k68J04q9j51
7354a54L8L29k82m2R1L8L7M3j40j24K29j03K3j92K18J6M1jj09np3j4J05J88k4
7379A33l81L08r7L5J03N1l21J42J21j6q7J4M5O0o6q9l55L63J8R7K2j80J22O4l05
7404a99K66J90k85M4l8q2O0J0K7N2N1k16M82m91R9p3J25J06k13J89mK34k05q0
$$ y = [255, 22, 98, -86, -1, 178, -87, -134, 41, -63, -76, -17, -230, -53, -133, 107, -164, 131, 101, 161, 221, 68, 39, 305, 165, -73, -56, -191, 69, 48, -1, -29, -124, -176, -67, -40, 205, -192, 18, -184, 86, -121, -38, 190, -64, -43, 128, -22, 103, -101, 14, 147, 119, 103, 37, 167, 293, -91, -17, -116, -66, 115, -138, -82, 143, -115, 47, 419, -53, -53, -122, 218, -165, 275, -52, 41, 157, 9, 144, 165, -49, 85, -92, 76, -85, 149, 23, -222, -152, 57, 37, -103, -296, 94, -92, 1, 254, 36, -108, 70, 45, -169, 54, 51, 199, -150, 108, -12, 106, 250, -18, 86, -3, -154, -116, 213, -69, -111, -20, 18, 55, 98, -42, -166, 63, -40, -17, -209, 9, 25, 66, 65, -44, -49, -122, -136, -31, 157, 133, -248, 60, -37, -2, 101, 152, -169, -27, 94, 78, -9, 5, 50, 110, 44, -45, -400, -37, -19, 78, 100, -80, 42, 106, -199, 67, 257, -28, 16, -22, -104, -44, -34, -7, 45, 96, -120, 362, -129, -30, -103, 22, 128, -85, 104, 100, 334, 129, 49]
7428D9m8J00j15R6j58j87L21J0k59K64k97J30J76j84O6MJ1k85J85m53M24j40J21
7451a69L78l30rP2M1J23r7j93K16J97m11J08J75q8q8J04j79P5J27j46j53J17J0
7474a20J74k23j51K94N3m8j59K42o1j7J29mj07j54p1K22m8O7ok5l5J01j29K28
7498A52j75k51N50j47r4n4J03k6p3K40j30j62j09L70l06K24k68K08p6q7K29j01
7520A7j85Q3r2l2K58r3j29K20J00q5k95L02J9R3j47k76K77j89R0l9J37p5M6J77
7544A82j25j41k62M14j98j33L03j50l49M41oJ34l24L27m8j28J83j62k2o9M03j84
7566H6J35k23p9L8k40n9K65L29q7m45R4J88L9l5q9k0K52m3j13p2J27j41M1K56
7590B04J8m11J95l6p9J88m3M5j3o6k1p2j76K15N9l6j17Q3OM2%Q9O0j01m0p7M2
$$ y = [49, 1, 101, -14, 82, -76, -263, 58, 68, -191, 73, -224, -94, 82, -102, -36, -32, -21, -306, -121, -574, -150, -290, -169, 209, -121, -130, -58, -17, 106, 9, -184, 32, 229, -182, -74, 101, 13, -75, 29, -150, -75, 52, -94, -247, -130, -120, 54, -169, -320, -26, 27, -21, -180, 62, 1, -16, 113, 109, 2, -152, -223, -1, -49, 18, 12, -13, -48, 53, -76, 152, -23, -274, 276, 129, 35, -19, 84, 58, -15, 225, 95, -67, -176, 194, -112, 112, -156, 52, -24, -111, 118, 17, -168, -85, -177, -209, 49, -44, -173, 47, 147, 62, -233, 69, 88, 181, 34, -242, 35, -154, -64, -103, 34, -41, 5, 182, 57, -84, -346, 68, -130, -263, 40, -110, -459, -18, -24, 110, -214, 113, 65, -63, 120, -42, -64, -133, 270, 86, 221, -2, -81, -43, -283, -342, -77, 252, 165, -280, -186, 2, 41, 6, -83, -103, 149, 106, -7, -79, 48, -93, -52, 204, 222, -189, 6, -30, -109, 79, 36, 81, 68, 2, -19, -91, -267, -52, 7, -29, -146, -63, -57, -15, -15, 74, 134, 33, -7, -84, -42]
7617d2K76j33jK35l83M6k08L06j7R9mk07J05J9J16l62J28k7K6m11O52k96KJ16
7641C5o7L01k89J14n7j42K51q6j21k9K72k89J6N8m7J89k01j09J15J1L33j96Q7
7664A49J32k12j02Q6m8L1J88l59K20j17j44K76j21M4J49k50P7o8P7P4J21k49j32
7687a78J09L14n10pL18L9j02n6J90P5l81M13k01K70k05j41J36L6j23r6J76k52
7709a76q8J62L13k94P7ll3q1j50L31k22K08J31j02K36k32j42jj45K63j1j31j75
7732b65J92R9J51k02J77j08l32L55M9J27j2k72o3R3n3N6p0o5K26k9J02L1k40j94
7756b47K00K28j57J55j2O2k88O4n7j83K95j48L87r5n6n90M51J96l65R1J75j80
7778g4J21j8o1K82k74p9O5p7K98k9J6l03J03j21J96p3R3j9P1j50P2J6j78R6J86
$$ y = [-42, 234, 101, 100, 335, -48, -2, -210, 96, 79, 178, 174, -33, 72, 91, 207, -155, -27, -54, -28, -439, 213, -83, -81, 35, -32, 269, -20, 94, 37, -105, 146, 60, -61, -90, 182, -107, -91, -33, -80, 109, -92, -201, -86, -75, 258, 62, 149, 281, 69, -33, 53, 5, 36, 224, -135, 85, -32, -176, 100, -21, 23, 172, -78, -1, -69, 8, 82, 203, -46, -178, -69, 245, -265, -272, 46, 85, -17, -73, 117, 192, -189, 224, 23, 293, 88, -53, 83, 119, -4, -100, 76, -176, -264, -102, 211, -83, -6, -9, -42, -123, -273, 58, -164, 44, 175, 73, 309, 77, -65, -66, -211, 52, 41, -90, -265, -73, 26, 177, -25, 152, 44, -288, 67, 116, 243, 231, -41, -104, -11, -64, -8, -78, -143, 83, 54, 156, 187, -53, -247, -47, 181, 24, 179, 167, 229, -59, 5, -52, -235, 60, -88, 299, 204, 148, -442, 9, 205, -160, -69, 106, -74, 47, 29, -32, 250, -24, -103, -38, -115, 183, 154, 170, -133, -30, -151, 45, -28, 65, 46, 117, -33, 39, 55, -123, -27, 159]
7803A59j24l27K83J60q2k22N72n05R7j10J5K08r1k18J1L59P5l11J10j03k8K76
7825B04m29J48P8P7j39K05j30J24k78K58j52j64K34q5j35M36l12m1L98r4l28K42
7847A17N8k70n8J99j47J63p7R0m0j07j78K87K32m84L41m2j24J59j6K1L6k16q7
7870a43L14k21l6L51l71O0j7J25j9Q5k23j1N9J78O6l04R9j22J19o2k1J22RK2N4
7895A13ol70R6%K66Q0k69J91o8q1j32J96j28M2j50L96k94L83l88K01o9r8J49J3
7919G3o8j64K55j79L49l46K35L2m11O71m31N9j34R9N4K4k74K55l5m2J66j13o1
7942A4k1Ok2O2k53j4K93n7j50J14K20l1k66J74J68r2k08m3J46Ln7ol0J5n6K17
7968A26j44K87k36m8J1j72K60j57K12j81J62p1q0K05K64j62l55M6P2j76m8L09
$$ y = [159, 35, -292, -9, 151, 69, -153, 419, -86, 11, -99, -84, 124, 33, -185, -174, 185, 260, -51, 59, -44, -72, 204, -225, -77, 1, 78, -61, 144, 14, 138, -140, 118, -34, -198, 36, -49, -184, 252, -60, -101, 297, 203, -125, 117, 175, -95, -153, 46, -101, 62, -15, 75, 35, -72, -250, 37, 269, -215, 126, 84, -40, 119, 103, 124, 160, -56, -143, 171, -50, -86, 265, -106, -46, -63, 62, 43, 128, -95, -106, -47, 131, 197, -107, -8, -130, -11, -73, -94, 28, 37, 59, 113, 107, -263, -167, -167, 99, 179, -90, 101, 33, -48, -180, 16, -112, -70, -220, 176, -118, 265, -123, 78, 9, -89, 60, 73, 5, -159, 96, -83, 266, -80, 155, 187, -224, 447, 16, 75, -59, 40, 94, 118, -156, 99, 64, 22, 188, 75, 14, -7, -1, -23, 39, -214, -228, 65, 8, -142, -28, 192, 161, -105, 69, 237, 145, -63, -106, 40, 43, -14, -20, -50, -35, -91, 126, -18, 269, 33, -15, -4, -176, 84, -73, 139, -42, 120, 49, -31, 174, 438, 276, -79, -33, 39, -137, -185, 124]
7990A24m71K55M1P3j39r0L52j97J38p8j30J1L74k74J08K0j05J65q7J16l94M29
8012B41j76j08j02L67m93J85J36R3k98Q5K49k28k57RO28k88j3j97J60l15L12J50
8034A40j56NM0q6J44n2q8K77k22j65N8j70K21L5P9jJ35k39r2q8K64L1J45Pk52
8059c0o5K2J64r1p9q1K60k6j66K1J94n6q6R5k01R1L2K88l57O8L9M3p4K46k35j06
8085i0L21k93J54n3J67k41JR9K13l31j26%M80k65k95L98J87l59L8J03J1nk61J51
8109DK03k38j75L11l2K99m65L63k77l6o7j55J48N1L29k90j65k9M31J2m95M92j23
8132I6oJ16l45m5K56j38K18l01k9N2m8K36q3K76k81J15J40o9J3j76j25J04j65
8155a89Q5O4J3r5P1p7J41k8k45ON10k80j9Mj04K10j03LJ2j61J68R2O3k50K04q6
$$ y = [124, -347, -92, -51, 22, -117, -207, 145, -52, 86, 8, -122, -111, 263, -11, 97, 117, 12, 177, 90, 206, -188, 241, 65, -43, -145, 222, -271, -86, 50, 143, -155, -70, 179, -49, -306, -297, 331, 43, 30, -167, -7, -322, -10, 140, -16, -11, 29, -57, 87, 35, -53, 224, 2, -163, -105, -275, -54, -19, 60, 59, 194, -45, -137, -225, 39, 70, 215, 222, -30, -95, -73, 91, 0, -79, -160, 100, 74, -92, -71, 123, 67, -19, 76, -125, -34, -2, 286, -71, -3, 36, 79, 5, 251, 16, -90, 231, -62, 92, 39, 206, -35, -34, 65, 278, -53, -179, -179, 301, 36, -259, 139, 326, -33, 5, 108, 119, 114, -147, 4, 207, -31, -206, 105, 73, 372, -93, 270, -7, -43, -110, -265, -117, -66, 263, -27, -192, -221, 210, 222, -273, 219, 96, 90, 206, -139, -184, 72, -66, 152, -149, -178, -126, -174, 62, -21, 255, -26, 89, 229, 160, 173, -3, -128, -24, -189, -104, -40, -27, -122, -51, -128, 13, -15, -260, -254, 256, -24, -43, -39, -143, 67, -36, -33, -21, -182, -14, 78, 141, -109, 95, 9]
8181IQ3k71J33k3J59j85J61j15R8j34
$$ y = [9, 92, -179, -46, -69, 90, -95, 66, -49, 49, -85]
8191h5
$$ Imaginary data points
##PAGE= N=2
##DATA TABLE= (X++(I..I)), XYDATA
0@%%%%%%%%%%%%%%%%Qj6J6j6J6j6K4l2L2m0M8n5O3p2Q2r0J04j20J36j52J69j89
38a00K11k35K64k94L25l59L97m38M81n31N87o48P13p85Q67r57J055j168J298j447
58g64J623j830K077k381K766l273L970m987O623r655J7060o6396q5479J62325
72B1679L4970m8407J1535j8224k4121N7413l737l0352M0793k315n8915K1479L2855
85C4653q634l672k9931k4836N2628P798n6724J2515K3035l1830Q214J8698k0024
98a8110L468J29k1033L5421K4422n2722j2515M9112R937j4495j0161r719K7395
111A1129K0223m0076j243M7179j7111l4357J5868J4829J0323j247m6373m009N8255
124C3390m873m7865N131J8251k010J123j4094n323K6052r478l1484K4740K4322
$$ y = [0, 0, 0, 0, 0, 0, 0, 0, 0, 0, 0, 0, 0, 0, 0, 0, 0, 8, -8, 8, -8, 8, -8, 16, -16, 16, -24, 24, -31, 32, -40, 42, -48, 56, -64, 72, -80, 89, -100, 111, -124, 140, -154, 171, -188, 209, -229, 252, -279, 308, -340, 373, -412, 455, -502, 553, -615, 683, -764, 859, -971, 1106, -1275, 1491, -1782, 2188, -2799, 3824, -5831, 11229, -55167, -140646, 21679, 56649, 8242, 19777, 1553, -22568, 34845, 31108, 756, 41549, 39234, -19681, 1798, 34653, 26019, 22347, -7584, -32420, 20208, 28006, -28718, -16203, 6832, -24998, -16784, 1914, -18110, -14642, -14513, -35546, -125, 24297, -28425, -40940, 8172, 18109, 3614, -6547, -16266, 11129, 31352, -8724, -9967, 37212, 20101, -14256, 1612, 16441, 26764, 25517, -20856, -24865, 33390, 28517, -19348, -14217, 4034, 2024, 3147, -10947, -16270, 9782, 304, -31180, -6440, 17882]
137A7882k6684j1896J4723P447P591q743j9439J7555J8131j8406o197J6809r54
150G819j0449k341R020J5974j0273k9448Q542L2622m401k4969m335J1184J3770
163A2715m236k0703P524K1179j7143j9851K0375J6418j1678j5812l752J6848J7404
176A9288j6974k3192J4116J9177j0162j1242N804P153k316p838O7J3839K405j9517
190i392n459K0771R163j5897j1091R484J1536l410q563O18P683r96j1070K261
204d362J6952j422k0920k210J8633P720j1192j3787J894J5937K019j6241j480
217h459J4922k889j2680L491J1241J681j1582j0805J1414J7957r751j7993O233
230g220J3201K31o750m240M357O395q070m666J3615L345j4416l838J0171P524
$$ y = [17882, -8802, -20698, -5975, 1472, 9063, 320, -19119, -1564, 16567, -1839, -8036, 8773, 7819, -2630, -4971, 4049, 20023, 9750, -19698, -11156, 21466, 17065, -7904, -12239, -1055, 12715, 8479, -12224, -4700, 16479, -664, -20515, -140, 16278, 4600, -11212, -14964, 1884, 19288, 2314, -20878, -6762, 12415, 2253, -8989, -3185, 3968, 1652, -6186, -6119, 7720, 10125, -9392, -14851, 5920, 15083, -814, -11905, -2421, 9115, 5705, -2858, -2240, 5443, 4447, -6623, -4362, 12590, 11168, -9752, -11962, 6671, 14391, 3199, -10588, -8694, 7243, 9262, -6979, -8459, 6463, 3574, -9106, -5615, 5626, 7307, -4275, -15080, -3666, 14291, 4540, -13453, -7220, 5981, 6212, -538, -4778, -421, 5974, -2096, -6762, 6853, 10198, -4218, -8056, 2115, 9639]
244I639k020j2992m758J5649M943j4429j481J0133k837n510J042M420M570p233
258h64j3016R605J6617q821j4356M158Q653L358l562q446L488R374p269o281J0963
273C601M917j0076n015M755R180K794j3898o999J4076O566j0840l142N300J108
287B327k246k127K021N937m921j0816O093J1763l599r288k171N750P269l100r541
302f649L352P358m801m434O627L325m536n429J386R421L268j1716o381J0599O370
317G760n707n291K212L754O3m855J404N922l686q259K646R069L74p695m880M511
333b658Q092j955q472L93O462p30m227K029M583j956n843K98P893K688q113n334
349f850O043O635k810n428Q88M319J23l873N06L750j041n381q76O848K812o428
$$ y = [9639, 7619, -5373, -10131, 5518, 10461, -3968, -5449, 4684, 1847, -3663, -2621, 1799, 6369, -864, -13880, -4275, 12342, 3521, -10835, -6677, 1976, 5334, 1772, -6674, -3186, 6188, -1081, -7362, 3601, 8518, -1558, -6573, -1818, 7362, 10156, -3742, -10741, 3335, 9901, -939, -4081, 1219, 2327, 81, -2046, -25, 5912, 991, -9825, -3732, 8031, 4432, -4856, -7027, -1277, 5992, 2892, -6649, -3297, 4061, -740, -5174, 1453, 4778, 242, -5187, -3801, 5620, 8888, -2828, -9209, 1390, 7760, 2053, -3238, -1026, 2728, 2791, -2064, -660, 5262, 1576, -6683, -4037, 5032, 5406, -2289, -7169, -2658, 5434, 3479, -4993, -4600, 1862, 1132, -3095, -1066, 3517, 1561, -4282, -3984, 3909, 6597, -1516, -6850, -807, 5828, 3018, -2410, -1522, 2797, 2920, -953, -447, 3303, 2262, -3119, -3995, 2853, 5665, -763]
365g63n552L940O864j751o718p36N057J277m385l52M465L82m418r14N098L817
381E311m571n963L217P308q27n812m29M046J442k493j729K083J618l668k865M350
397A018L898m668n092K212N363Mn612k230M333K302l488j508L687J163l169j513
413c300L401L725k973m762J936N585N16m710j838L398L629k823l083K179K386
428C266k718k571K033L743j431m818o28N387J552n544k725L681K643k508k200
443b838J074K213r29k666J498L123j174l342L0M173K070l474k581L135K913j569
459A656k224N86K346k93k799L5M586m18n587L7M380M75k465k714N5L879J42m171
477b494K01L801j591k909K054J157M6j011k809J676N007k156m357K634K859j310
$$ y = [-763, -6315, -2375, 4489, 2738, -3980, -4716, 341, 1618, -2767, -3119, 1346, 1728, -2690, -3604, 1494, 5311, 740, -5223, -2006, 5302, 4475, -1337, -1766, 2280, 3722, 1229, -500, 1583, 3201, -467, -3332, 1018, 4916, 248, -4844, -2632, 2731, 2735, -2877, -5107, -774, 1528, -1960, -3468, 219, 1382, -1787, -3300, 101, 3826, 853, -3909, -1973, 3612, 4128, -582, -2420, 978, 4607, 1784, -1299, 880, 3266, 548, -2023, 10, 3753, 2322, -2496, -3124, 2263, 3815, -1729, -4454, -773, 1870, -638, -2838, -1764, 449, -480, -3146, -1648, 1475, 301, -3041, -3011, 1162, 3232, -242, -2823, 312, 3225, 1656, -568, 18, 2364, 2071, -728, -693, 3893, 3475, -2112, -2075, 2305, 2780, 315, -2399, -2344, 1535, 1677, -2494, -2293, 1508, -83, -2992, -938, 219, 265, -746, -3555, -1879, 3128, 972, -3385, -751, 2108, 798]
493G98p22n56P26J733j756j891L919O31m109K38K420M02o86k599r86M022O46l924
511a694N03K254j151k48m45m10K794o84n195K854M999l270k566J812L96P95L91
528A135l616J298M008l511k009M894q94k443J144m94J82K453k477k651M418Q46
544B283l355Q02J168j049J658j020k277L050K02l715K040K700k157q30P9m04K528
561A703l20l974J262K867k623n5J834j580M62P12k554J822K589l300j698L584
577G31Q0n96O84j831O40L201k648j824L420o46j904J801O78j362P33j223q37K900
595A997o38l469J285J406j464J210o58j697K097N2k279J745P21k361K47J827l50
612c29R66n7k618J914K485k441l20K075j354k08J622j485K10J778k468o66K830
$$ y = [798, 76, -480, 246, 1979, 223, -1668, 2251, 2882, -1227, -989, 1431, 1833, 1147, -1452, -2438, 1584, 2230, -1694, -1191, 1063, -88, -336, -781, -1191, 1603, 919, -4276, -1422, 3577, 307, -2259, -447, -51, 744, 1135, -2481, -1183, 2825, -686, -2695, 2199, 1305, -1138, 6, -488, -306, 2147, -330, -2981, 1437, 2283, -1072, -270, 898, -151, 1507, 487, -1790, 1260, 1462, -2253, -213, 2487, 330, -500, -421, -825, 1703, 1383, -2591, -1329, 1538, -1085, -1140, 694, -886, -424, 288, -2266, -444, 2145, -1155, -2853, 731, 811, 215, 899, -932, -292, 2909, 261, -1563, 1857, 1211, -693, 1108, 1786, 424, 1157, -66, -903, 1997, 1359, -2110, -825, 581, -883, 327, -331, -2028, 69, 121, -2158, -413, 308, -2053, -1806, 21, -329, 637, 580, -2038, -124, 2361, -80, -400, 1675, 321, 113, 1735, 250, 460, 2238, -230, -896, 1934]
629A934j103j910J319p22m1J756j436j949K672J34k042M19Q75j669J486j5o19
646i11J459m44j710J758J334j457j96K08o51J535K11j323K23Q25p58J47P01j095
664a44J61J74j154R20J398j832o46J337Q3l67L69j472K73J352p40m50J271m56
682G7q39R65K72m32L85r02k92J406K70r24m08L22L36M48l47m88O1K82p22O85N41
703F96o41k64J97K73L11o54p58L64O12J25J0n00m9N11p2o87Q59q5r37M18J77O34
725E40j87n54k88P73L66r93j11N28k36K00K63m96N52Lq74N79M41o31j43k28L6
746d60R59l43p00M58O92p72J43O1m3j86K05n60J114K41j425K46R72l09o47L96
766D2n43L09Q93q31k57Q63M2q48M10k58j84P14r28k46J565k4j168M85M0J54J28
$$ y = [1934, 831, -1079, 240, -482, -523, 1233, -203, -2152, 520, 654, -1388, -969, -94, -1763, -277, -292, -911, 548, 104, -1606, 152, 1486, 29, -167, 41, -610, 925, 1136, -187, 36, 861, 103, 250, 951, -144, 17, 191, -963, -43, 1355, -477, -1123, 214, 297, -70, 299, -1173, -900, 452, -288, -738, 533, 77, -762, 203, 475, 43, 428, -474, -766, 640, 910, -14, -422, -100, 236, 684, 337, -151, -90, 192, -530, 155, 696, 55, -209, -12, 261, 572, -82, -840, -476, 136, 261, 271, -229, -278, 233, 161, -526, 333, 248, -689, -271, -94, 540, 353, -201, -489, 284, 650, -343, -454, 74, -162, 38, 301, -195, 357, 360, -514, 65, 506, -125, -268, -496, -460, 499, 156, -544, -86, 606, -166, -23, 38, -5, -191, 14, -546, 568, 809, -616, -370, 602, 293, -354, 42, -501, -192, 701, -130, -387, 476, 518, -330, 80, -178, -362, 352, -576, -822, 743, 719, -449, 36, 76, 230, 358]
787C58l89m64P46j29o43P16L34o81j1J78l43N97j70r65N07J303r23m10Q97k99
807B09k92O52q40L23N62j144j52J214k0n47l03J23J43N96q06j55M37J86p73N89
827BK64O1qo03o7O82J44r44M15K60j05J33k25j42O27l84o84L50M53n53k34N63
849EK50j19k80k78R9P38l72m65K22K9L03N7r7j8K26k52n40O33K77p02k54N09L95
872C66k66j45l04K26J49j20o7M53j52k85j33N49M9J31p12l79P97N57j039j22L72
893g5N68j12l63K76j10j98l76j6P96j67n63j65O64L45o00k51J97K23K9j67m57
914e22L42N53n50j43M66L46o91l42N74L70k21l97Q1M90K12n14l38M14L75o33j18
935b46K31L59n97K04RL25J83n92k07O66J33q33k41M04L09J31p12R0Q20j12p53
$$ y = [358, -31, -495, 251, 122, -521, 195, 529, -152, -163, 15, -328, 269, 99, -866, -359, 944, 21, -389, 508, 209, -83, 569, -271, 52, 614, -530, -682, 532, 512, -35, -338, -215, -72, 524, -282, -437, 0, 186, -587, 2, 266, 327, 319, -284, -351, 331, 475, -469, -54, 206, 101, 234, 9, -133, 494, 110, -574, -224, 229, -324, -558, 5, 255, 136, -144, -422, -323, 415, 43, -422, -200, -171, 132, 189, 92, 74, 300, 48, -492, 141, 418, -284, -538, -29, 366, 100, -45, -349, -123, 26, -94, -161, 292, 140, -145, -278, 271, 320, 451, -261, -640, 157, 714, -325, -447, -75, 493, 381, 18, 294, 184, -14, -390, -406, 390, 223, -340, -505, 159, 504, -96, -347, -150, 73, 102, -65, -522, -180, 373, -177, -320, 146, 492, -199, -541, 33, 403, 182, -215, -134, 356, 568, 54, -284, 130, 505, -128, -246, -15, 344, -253, -49, -40, 285, 468, -124, -331, 335, 468, -365, -606, -202, 107, 238, -474, -384, 436, 324, -429]
956d29r8Q57J07q24q1N92N23n04m88m2O95J31j061L4P02L8k94k53P83K50p75k21
978c58O2N67l25n32m4Q86Q2q27MP76j38n9p88M91J99J18o30J80O42P4n87j1P56
1001E38m08m40N4K31N43j56p53j47J310M5j228j0P44k51o89N05M93l15j85j76
1021b95N8P34j59j212M93P57k72l01P9J73J57M34p81j35O25k68q89R35L73l72
1041A34m42K12pL98K97j103P5P22m27k60N90L30l36l14N2L31Q1m95k03J27N09
1062B71j06o34q1R86k15n40J99J99j0k58J25k7K84j3p08N00R53q86o85N32K65
1083A51RM28n88q23J002K10p15O53K80r84l08P00j42J20J32r16O49J063j003l41
1103d23O38j76j38J37K6J18n0Mq6N39n82k47k37L24K64J74p71K47M45j5j48J18
$$ y = [-429, -527, 330, 437, -387, -468, 124, 647, 143, -345, -387, 308, 439, -622, -588, 114, 152, -142, -395, 388, 638, -137, -358, -296, 271, -54, -586, -630, 256, 338, -489, -485, 291, 153, 94, -694, -203, -4, 114, -516, -336, 306, 380, -207, -218, 538, 130, -310, -256, -25, 518, 362, -391, -538, 772, 817, -411, -421, 323, 72, -617, -112, 381, 66, -119, -295, -237, 497, 338, -874, -381, 376, 104, -197, -118, 55, 212, 646, -135, -270, 355, 87, -802, 133, 506, 134, -308, -96, -103, 295, 592, -511, -436, 286, -141, -401, 189, 519, 183, -131, -79, 252, 333, -162, -365, -238, 271, 165, -469, -550, 436, 221, -319, -120, 79, 69, -189, -64, -91, 193, 180, -528, -28, 925, 39, -646, -114, 151, 160, 588, 0, -823, 179, 389, -326, 327, 607, -377, -685, 15, -127, -7, 125, -791, -142, 921, -82, -423, 215, 39, -99, 38, 64, 182, 132, 136, 50, 589, 7, -240, -477, -153, 111, 285, -486, -239, 206, 191, 43, 161]
1125A61j51l34M44l06K38R05j092p43J179K85q71K99M8q25P08N84p70K12N61p59
1145b27P2N42m56j97L32l90J44O92n12n44O35P8l21m7%M9K29q8J98K27l61m94
1167d39K38M21J79j22p88J39L91K17j70q5n6q6M45l61K6L00m84l24O51M40m47
1188H5J24k73j44O53j64l45r7L61k97J4K55K48q09J67K80k8K09j65n10L8O97j54
1210A45l02K65l66K28j81K80j95k61K86oK85L26n72O4o0R7KJ55k45l31L65L15
1232B94j6l2r6n48J60K66N1k26J1j76J91M30p4m44J43j2K75m91L9j05K70O7K91
1255B68J08m64mj46R3O32j63p77M9N98o1J85k04k16K16j88K14j75M33l76o37R29
1277C14K63l30p40K12J64L99Jl33l04M63N1l33M21j51o11L88q9M70J29o45k63
$$ y = [161, 10, -324, 120, -186, 52, 957, -135, -878, 301, 586, -285, 14, 62, -763, -55, 529, -241, -29, 532, -227, -155, 387, -69, -266, 66, -324, -180, 512, 0, -544, 91, 169, -152, -199, -199, -150, 79, -9, 189, 416, 55, -439, -201, 220, 399, 277, -511, -372, 19, 236, 66, -19, -75, -161, 284, -77, -51, 249, -235, -559, 92, 532, 85, 209, -64, -208, 445, 281, -64, -161, 200, -97, -83, 172, 420, -389, -222, 58, 30, 239, 74, -436, -398, 299, 145, -157, 108, -258, -30, -211, 69, -126, -387, -101, -107, 178, 504, -68, -4, -64, 33, 35, 190, -55, -386, -21, 294, 278, 246, 150, -398, -238, 28, 79, -147, -136, -312, -121, 309, 235, -209, -66, -78, 197, -294, -255, -360, -90, -23, 268, 376, -88, -92, -238, -145, 487, 324, -453, -404, 194, 133, 318, 114, -102, 114, -74, 140, -35, 398, 22, -615, 314, 577, 247, -493, -281, -117, 282, 283, -50, -354, 109, 160, -173, 248, 97, -514, -126, -215, 255, 384, -261, -524]
1298e24O93J77l21P3n5j33K57J0O0k98k44J01L02L97j78k82l87l8O22l8l00k87
1320c93M13o5M03l01j17k27R2J4N02m23l20l5O75J21j00j81m77J74L78L9k95J24
1342Ak80L70K52j08J08j71m90K19L17J22o05J60J50P1L25n48j52K04k89J10M02
1363A68nk14m03L10M82J55o02l33M31L68m2k88m89J21L00J8K2O8R1l28q1O12L6
1386C97k00n74m4Q59R1m30j88j81L31K96l27J19n81J68R7K85M36n22l70N4K72
1407a2J77k55l70MN81m4R6J1k39rj62K53L0J22l89n9K51J56K3k90K2k5L38R3n14
1432b11L51j83n1M45k07J49j79n73K76M82Jn18r8N76l49L66k09q4K10j90RMK60
1455B77k86k40J70O46J43m99p17L66L68j9n19J37L40j07k43J83L39k17o69N76
$$ y = [-524, 169, 346, 25, 98, 43, -90, 167, 177, 237, -61, -305, -204, 98, 495, 317, 35, -352, -390, 232, 194, -106, -393, 20, -45, 358, 57, -60, -287, -195, -181, 321, -102, -422, -457, 218, 339, 239, 58, -419, -245, 133, 172, -123, 1, -279, 91, 343, 235, 343, 172, -318, -99, 218, 340, -265, -105, 45, 116, 441, -107, -259, -55, -344, -234, 168, 163, -51, -454, -144, 338, 493, -109, -442, -11, 357, 315, 27, -462, -341, -41, -23, -1, 67, 158, -170, -251, 361, 397, 197, -377, -421, 438, 529, 99, -89, -270, 61, 357, 30, 149, -432, -264, -167, 118, 554, 32, -338, -284, -12, 165, -90, -460, -456, 125, 81, 177, 188, -51, -60, -222, 31, 61, 183, -206, -265, -14, 142, 165, -125, -103, -128, 210, 303, -211, 140, -43, -94, 351, 144, 293, 114, -459, -183, 299, 300, -218, -316, 260, -89, 277, 68, -16, 194, 4, 13, 17, 277, -9, -249, -79, 567, 710, 211, -506, -140, 228, 209, -310, -173, 167, 60, -183, 0, 339, 122, -547, 29]
1475B9Q7J28m03m05K50N04J30j96l21k04N81k67LJ39p3k43J04L58K9j51k02j11
1497b34K75N0l72j19M04N9p0M37q1o11K59k51K30J29j99k25l9M48O29p95l11Q1
1519c06K30L15j50k05j1J00n19P80K35j36q22K95M33Q3j18l93J68O5K21j02j23
1540D0j91p4j94O41k48n2j78R0J00N71j06m90j9j0M46l78J56L5m03L15Q4J22k48
1563Imk03K61M92n77k0k26L62k47J89l6p8J35j81M1J37K9k45j3M10L03m10m53
1586c25J6L26K85nm50J13P3l77J27K74j07l07L69p5K12n2l88j37M35L18k42L0
1608A13l44pj75O97k53J1Q8n37P12J03j38o66k4N79L9j14l84K30n3k4L04J81k55
1631H3j19k26O8L76j61r2l5K92j4K07n52J67j00J55l24K11L68l07m37N49M9lJ77
$$ y = [29, 116, 244, -159, -564, -314, 190, 320, 124, -197, -401, 180, -87, -84, 55, -18, -261, -157, 201, 230, 79, -123, -234, 41, 91, -281, -400, 4, 63, -7, 430, 349, -262, -3, -254, -24, 105, -94, -319, -358, 90, 719, -76, -387, -306, -76, 239, 89, -116, -127, -27, -546, 234, 469, 333, -489, -194, 239, 322, 204, -189, -21, 44, 265, 163, 40, -151, -225, -419, 222, -26, -78, -256, -166, -66, 505, 399, -91, -110, -120, 326, -52, 104, 139, -264, 51, 135, 257, 9, 5, -198, 63, 555, -22, -42, -268, 94, -153, 36, 0, -78, 57, -124, -83, 54, 83, -162, -175, 235, 538, 128, -325, -309, 17, 302, 297, -153, -40, 33, -344, -217, 57, -50, -357, 12, -63, 149, 97, -291, -428, 7, 325, 83, 113, -231, -238, -413, 284, 31, 42, 130, -407, 305, 408, 270, -396, -420, 159, 198, 84, -300, -70, -123, -147, 157, 338, 83, -36, -262, -194, 182, 21, -71, -106, 186, 172, 379, -173, -6, -106, 49, -275, -64, 304, -3, -440, 109, 158, 155, 332]
1654C32m65J15J92p4l27J81J19j40J82J75j29r8l54K23N11n09m1k2L14k91O4n3
1676i5J90k0N7j89k47N90m64J09P7K60O0l89k60L35N15o77Q2K53n0k52K66K4j5
1699A60nm14j30O11kn12Q0K59K20l69j33J81J88k38k86M43K16p3n51L05K44J69
1721C63o32J04J84K37m44Q5J19J79j8J56k69J52j63l87n8O78j2l47k85N01k6J26
1743B43m62J46M92n32k76N61J85l63j56oK84K42n52j86N02K50k94n27M17L7J41
1764A46k47l7J74L74p45O6L48K23k02l69M77L27n26l31M67M1p4m18R9O84k33m68
1786b24l48N47M13m16k27K43J29r9k17k7K34K01j74m36N17Q1m77k55N17N39k65
1807B56o66K67M19Q9o45L3L95K60p33J19J40K39k41l6J93M04n56j56k71Q67j4
$$ y = [332, -133, -18, 174, 100, -227, -46, 73, -67, 115, 290, 161, 63, -291, -68, 443, -66, -107, -129, 185, -106, -42, -95, 95, 75, 132, -57, -304, 286, -178, -69, 8, 268, 328, -61, -321, 14, 529, -148, -66, 187, 137, -115, 151, 175, 160, 155, -259, -389, 222, 220, -292, -212, 47, 267, -102, -235, -54, 134, -104, -390, 53, 269, 196, -355, -50, 194, 363, -269, -165, 19, 256, -188, -103, 16, 195, 177, 333, 64, 216, 53, -334, -392, 286, 274, -73, -358, 143, 117, 243, -219, -73, 419, -113, -389, 172, 357, -6, -162, -168, 116, 358, -194, -380, 122, 372, 78, -449, -32, 5, 146, -101, -138, 36, 410, -335, -269, 79, 302, 100, -269, 208, 535, 9, -322, 145, 186, 112, -306, -207, 477, 244, -224, -572, -25, 388, -28, -255, -12, 117, 18, -199, -226, 8, 209, 35, -401, 116, 197, -280, -535, -18, 521, 256, -410, -143, 276, 365, -280, -247, 148, 408, -325, -206, -66, 173, -68, -104, 89, 493, -63, -219, -490, 377, 363]
1828C63n61j9J90N54n56j81J02M50j83m95K40N58k63n53j35P71j12n25j70O50
1848A25L96n25j83J61M27j49o75L56L70L0o78k48Q13K34o37k38K38O50k49o18
1868d00L68K45J59p40M4O99k15n84R8M36M52l30o47L47L42j18n89J23L41J26k43
1889h6k9j67L70l34m19O27N83n05l55R1O67k46l63p9L30J69l25k07L28Q5J05o67
1911d27L47N41k35m30j94Q23j15n30JM25O9k53l56L11K21k68l35M07R5L22p34
1932c15j37P45j5o02O6J12O09l54n27K43M87j00k46l55O61M9o65j10O97L9l67
1953h5m49O02K32j90l87K62K55q8j62k26N34k1k92m03P37K01m56n53O53J64m1
1974B87n09r2N98K60q09R0K85J97j64m35L89J69j36m55J5L34K88o23j72O04J23
$$ y = [363, -198, -217, -27, 527, -29, -210, -108, 342, 159, -336, -96, 462, 199, -354, -489, 282, 170, -355, -525, 125, 521, -4, -187, -26, 401, 252, -423, -67, 303, 333, -345, -593, 220, 454, -183, -421, -183, 467, 218, -400, -32, 213, 372, -368, -324, 375, 160, -424, -326, 110, 562, 232, -415, -68, 274, 156, -433, -310, 31, 157, -86, -115, -282, 88, -246, -665, -38, 545, 40, -315, -224, 443, 197, -166, -245, 85, 254, -71, -278, 50, 135, 240, -427, -80, 461, 226, -204, -398, 425, 310, -220, -219, 206, 275, 22, -334, -23, 198, -70, -405, 2, 97, 419, -315, -452, 293, 278, -324, -258, -146, 463, 109, -418, -175, 312, 212, -34, -389, 272, 321, -344, -454, 243, 282, -85, -534, 68, 300, 110, -277, -15, 240, 152, -10, -236, 298, 277, -15, -418, 319, 520, 64, -489, 164, 328, 287, -222, -314, 284, 544, -265, -175, 110, 307, 143, -292, 97, 266, 130, -325, -310, 24, 312, -311, -483, 121, 244]
1995B44m01JJ80K56k60k78L69M6l82J20k87M50L62m59k75K96J13n4k21Q7K93j80
2017B0l86M80K58j80m90J57J18J63j50j63O2N77l04k26k18L29J84l88K68p5L47
2038C83j45m27L71J1k11j36J9M15l03k00j14O04l56k45K07M01m34j67o2N74J27
2059C12l02m71N88l6M8m92K1N22k24n5k7L67rl09J3n6L59j53k27J22Q7J22k62
2082f2j71L70r8j15k68K62R2j68m0K26j9j01K61m84K25K67l27j41N26j9k28%J40
2105A28J03j80l17J71M54l33k78L0O41j24j49k44j18K79j20l23M45N9m8k46m9
2126b19L31j13j54n7J06J38k3k16K14J47k33k01M66L4j97m26L95m9J50j36j48
2147a91M15q0j45l66N36k75j5L0K61n1J14l77n5M91j35M1l12L09j26k06j15M2
$$ y = [244, -157, -156, 24, 280, 20, -258, 111, 157, -225, -105, -392, 58, 420, -39, -314, -18, 95, 41, -180, -93, 200, 20, -366, 114, 372, 192, -298, -141, -23, 140, -10, -173, -111, 466, 162, -64, -282, 47, 231, -157, 111, 36, 383, 238, -189, 182, 193, -18, -154, -135, 280, -23, -223, -337, 267, -89, -334, -127, 274, -160, -327, -389, 185, 312, 10, -461, 127, 91, 139, -353, -332, 190, -34, -89, -116, 251, 242, -67, -54, -110, 249, 96, -131, -9, 78, 200, -62, -233, 137, 39, -76, -344, -82, 10, -158, -198, 28, 9, -92, 169, -315, -90, 177, -150, -291, 235, 216, -12, -12, 128, 231, 51, -266, -95, 359, 26, -252, -222, 419, 295, 146, -98, -216, 63, -57, -380, 65, 124, 76, -170, -219, 112, -1, -155, -212, -106, 32, 9, -207, 7, 154, -79, -280, 186, 220, 23, -403, -8, -57, 93, -43, -191, 224, 144, -1, -367, 169, -106, -121, -91, 170, 119, 233, -144, -199, 292, 157, 198, -114, 195, 69, -137, -252, -210]
2169b10L08L0m83M76m0m81L72k00N00j13j70k10L29J14M6k69j16J12J15k96K67
2190H1K56l17K2j64K48j9j42k22L07K92l96p1k2L11l09lo1J35r1N5j28J44M09
2213C15j21k79j2K13k97J20j78K50j57m0P0L14k00K9j02K94Q5l85m7J89j77K10
2235I4k81N4K18K1l16L72k54K28l11o5L92Q3j60l27M05J53N0m84J86J0j6j96k2
2258a66L73o2n5j57L04k30R5l22R6K56o7q7k00L79n3p9L4J48l15J22k68J58K95
2281A99j76m0k10K86j61j08K66j80J76J11j04p4J68j60o51P59K25j69k61j2J65
2302D9j47J78l40K51j25q0K06l58K37P4J18j87M71j95n26M91pQ4k86J62P2k9j67
2325e4J69M0K04k02k72L4P3p2J46k64L59Q9q6l52J49K94j71j65r4R0M0J57j17
$$ y = [-210, 98, 128, -355, 121, 81, -400, -28, -228, 272, 159, -11, -221, 108, 222, 268, -1, -117, -5, 110, -186, 81, 337, 20, 42, -122, 126, 107, -35, -257, 50, 342, -54, -125, -147, 164, -145, -148, -209, -74, -165, -110, -238, -94, 315, 194, -85, -97, 116, -181, -61, -239, 11, -146, -186, -116, 198, -2, 27, -75, 219, 304, -81, -128, 61, -116, 94, -187, -133, 85, 106, -210, 162, -92, 136, -175, -240, 152, 235, 75, -252, 153, 306, 356, -128, 58, 68, 52, -144, -166, 207, 145, 90, -67, 237, 7, 102, -220, -124, 132, 65, -22, -222, 157, 104, 25, 59, 207, -108, 14, -254, -96, 199, 23, -17, -227, 59, -102, -210, 56, -124, 52, 163, 59, -15, 153, -7, -658, 101, 326, 157, -104, -116, 49, -98, 80, -260, -9, -134, -214, -8, -366, -129, -55, 63, -124, 347, 152, -374, 117, 110, 194, -92, 70, 142, 113, -54, 115, 155, 359, 157, -115, -81, -8, -80, 66, -198, 161, 250, 164, -188, -39, 255, 84, -81, -175, -85, -45, 112, -5]
2348eK39L1k29m44K59K54R1m17J56M83l43k13M03l02K66m34J08K82j22k5j2Rl5
2371@l21M05J01l82M02l00j13j60K39k77M17r8J46j22r3N1L25j54j09P8j39K13
2393A09q2l40J96J71l85J88k80O90j65l01N3L0K79o0l22J00J71L4k57L23p9j69
2415i6K08l06K81O5K3K1J08j88m21K90l8n4M9j9J77M8J04j67k89K14k20J96k11
2438b25L58J51k09j6l84M54nk48J40J26k74J18r0K29j80J75L3l22M00k62k06K98
2460F1j03KL3pj27L06j16k27j22K88J00j37J28j68K28o1k76J91j8j96L90l25K32
2483G6j25j14k37J09N11j94r2J82J79l01N7l13M50l49K2J2K61m7l07J22K11r7
2505A6o2k9J62N4NJ0k48J88k52K28O8JK9qk63O7q2K61k56N72q05M24J2j83K18
$$ y = [-5, 234, 265, 36, -408, -149, 105, 196, -221, -65, 418, 75, -138, 265, -37, 229, -205, -97, 185, 63, 38, 26, 35, 0, -321, 84, 185, -197, 205, -95, -208, -368, -129, -406, 11, -87, 59, -63, -156, -105, 220, 66, -43, 35, -104, 109, 27, -313, -117, 54, -331, -143, -423, 267, 102, -199, -146, -116, 163, 103, -219, -119, 52, 86, -171, 152, 73, -96, 112, -194, 87, 152, 175, 196, 304, 116, -305, -15, -53, -107, -58, -77, 100, 148, 252, 85, -204, 10, -210, -14, -225, 133, 284, 75, 59, -325, 129, 124, -124, 16, 142, -132, -14, -104, 125, -55, 120, 153, -169, 231, -31, -237, 61, -42, -40, -7, -14, -141, 165, 49, -178, -300, -12, 88, -49, 79, -89, 139, 78, -198, -7, -25, -221, 169, -156, 76, -49, -163, -400, -291, 220, 26, -66, 116, 295, -6, 51, -262, 188, -161, -139, -127, 134, 87, -220, -98, 113, 16, -46, -75, 87, 141, 146, 156, -92, 96, -156, 72, 140, 141, 170, 162, -101, -34, -116, 145, -111, 461, -344, 80, 92, -91, 127]
2530A27R5k58L9NJ25k08J11J56K8k01J14j44k0J5n4M27m52L47l24K29Q8j73J2
2553H4%JJ12j22k73LK46j4j52J66m78N28p3l0R2j49M1j27K64p0j27p2J43j01J60
2578E2J59k87k6j26M52k96L63j55r1M2k09r4J97J39k62P9j24L18j96L17j93p4
2600a5j98l5L51j35K94j55p1K15l2k90J2j15K01j19MM4j52L74k95k28M22k90K96
2623H3k13K29l7o2j12O8j20L21k16K71L8j17j91K52J41m00J32N1n8L1k10L33k49
2646c5r8K13k00Q0J53q5j2R4j15N8l0Mk94K35J8K32m62J85j17K15j21j70J34L6
2670h2L47n63L17L6K2J44k33R2j60j2J44kj5K10l79L16k8k30J95L8Q6m56M66j91
2694F2J67q8j61P8k35q4J82L4k19J35N1O9l51M31J78j89Q3j7J23p5k59J36r4N3
$$ y = [127, 222, -36, 3, 8, 133, -75, 36, 192, 220, 19, 133, -11, -31, -16, -70, 357, -95, 252, -72, 157, 245, 72, 84, 84, 85, 197, 75, -198, -195, 51, 37, -115, 51, -427, 101, 28, -2, 90, -59, -18, -145, 119, 49, -78, -150, -7, -108, 52, 211, -76, -102, -228, 224, -72, 291, 136, 45, 87, -122, -216, -19, 120, -142, -63, -187, 131, -65, 252, 59, -15, -213, -248, 103, -32, 262, 107, 36, 251, 219, -71, -59, -174, 27, -92, -88, -44, -196, 178, -117, -345, 77, -213, 83, -130, 99, 62, 0, -112, -44, -164, 157, -59, 212, 250, 133, -58, 194, 335, -65, 67, 118, 60, 91, -119, 214, -35, -133, 80, -120, -40, 113, 28, 16, 110, -5, 53, 23, 27, -267, -32, -14, 218, -244, -59, -176, 39, -82, -252, -118, -82, 265, -298, 19, 55, 77, 221, -12, 80, -80, -92, 52, 50, 35, 245, -134, 182, 154, -76, 119, 157, 243, -213, 253, 62, 229, 141, -20, 58, -177, -261, -79, -45, -264, -129, -78, -9, -360, 71, 249, 60, 143, 126, 249, 174, -85, 51, -43, 10]
2718A0j6l3J1N6K14k56K8m4J56j06N7p9O3k62K03J4j62j15J98K73k74j57J64k9
2742h6K73P3l88M11p1k28j54k4J63R0j01J9j96J18N5N0j18J10k30J12Q9j53J22
2765f4K65l67J54m8p7J26K60o25M30P3K8k0p1j69L22l46J99n1R7J66l85l9mRK35
2790I8pq8j01k5K71k40K05k05K05k32J80M3J9l05J7J73m3j65j60N08l33K21%K04
2814B40j48k0m0j66J32j2k1J13J53k87N0k00L1P3Q6L4j52K69K65n33j8j4K95j89
2838e9K89k11j42K5J64J65k23M8k21k5K28Lj9k03K44K4J03k29p9j28M25N4k52
2861a9N4K6P0j59J56j19J30j75q5J33J84l21J59n9p3J61Jn7L02k84l37L71j28
2884f9J99m1k20K65j67k97L11l0J99l54K05P4qj48J52k08J71o6M19j80n3l36J26
$$ y = [10, -6, -39, -28, 28, 242, -14, 14, -30, 126, 20, 77, -2, 61, -201, 2, 16, -146, -261, -63, 210, -64, -221, -57, -86, 187, 260, -128, 283, 212, -16, -170, -194, -31, 59, -42, -23, -219, -101, -46, 4, -114, -4, -234, -122, -33, -186, -64, 201, -166, -12, -60, -137, -11, 249, -376, 54, 127, 155, 135, 64, -105, 217, -129, 70, 19, 116, 282, -103, -142, -146, -137, 98, 91, 3, -98, -123, 148, -92, 113, -92, 113, -119, 61, 104, 123, -182, -165, 8, -35, -200, -360, 148, -185, 36, 36, 240, 92, 72, 32, -134, -2, -14, -35, 78, 231, -56, -6, -206, -175, -102, -16, 18, -134, 135, 400, -133, -151, -165, 130, -59, 230, 19, -123, -98, 66, 231, 8, 56, -165, -190, 38, 41, 22, -181, 63, 87, 190, -39, -118, -246, 179, 233, -19, 35, 61, 131, -28, 128, 9, 139, -36, -121, 12, 196, -125, 34, -25, -98, 63, 64, 7, 309, 25, -312, 59, -69, 130, 89, -131, 134, -33, -330, -19, -49, 150, -204, 1, 75, 67, -81, 71, -137, 34, -32, 387, 207, 154, -182, -56]
2907e6K20n4j9k0q3q4L69l76N6J12m5l0R4q9K91k32jK1k71N38l38J51J41k31%
2932F4j90J51K2j4j58R3Q5Q5k19k46K00pK85J44k14K2k47K28r1N5J92j97k18K22
2956D7l0p3K84k78K20l10P2L2p1J32j65K97K89o39lK25O2K9j76L7j30K60k05K07
2980A13k20J60k11J31K81k46K1n0M1o0j4J07n4j6R0l32O31j06m75J28q4R1qK13
3004A31k15J53j06j5N1O3K34k60o1O2J2J87j9J37n62L21J0J0k71J24j8K3J10o8
3028C3j5N1p4m2P6J82j10p4j26RJ08r4K2L10q6j23j00K58k64K41q7k34K39K7l26
3053a99K50J17k62N8j8M7j32J7J35q9K32k95L72J04k66r8n1L40k27m0J47o7m5
3076C0k9j50J65J23k27k5L19j89q1J14r9K81k65K01k11J99j66M34m15J81n5l42
$$ y = [-56, 164, 110, 91, 71, -12, -96, 273, -103, -47, 65, 20, -10, 84, -5, 286, 54, 53, 74, -197, 341, 3, 154, 295, 64, 64, -126, 25, 47, 33, -125, -32, 53, 138, -81, -327, -127, -134, 151, 295, 81, 103, -144, 84, -7, 48, 240, 43, -175, 47, 17, -56, 228, -50, 170, -140, -68, -36, -107, 25, -140, 157, 446, -193, -196, 29, 91, 120, -56, -19, -149, 111, -94, 113, -107, 53, -158, -27, 254, 8, 29, -21, 20, -40, -54, 53, -1, -17, 73, -259, 372, 266, -209, -81, -165, -74, -82, 131, -84, 69, -37, -52, -1, 62, 296, 36, -25, 37, 49, 236, 217, 354, -208, 113, 123, 133, -138, -14, -32, -9, 101, 33, 18, 69, -5, -47, 29, 211, 101, 27, -99, -90, 18, -76, -54, 256, 170, 47, -53, 205, -59, 182, 95, -139, 100, 127, -199, 51, 168, -94, -36, -54, -7, -139, -122, 13, -76, 156, -139, 233, 337, 71, -27, -78, 262, 35, -5, 142, 75, 30, 1, -149, 16, 139, -88, -113, 206, 17, -64, 50, -49, 232, -33, 168, -43, 156, -10, 424, 9, 190, 135, -207]
3098b07O3K62Mj28j19J16k2K3N3l2j23M57m37j04N44m43J07MN8J45l44J4j22M21
3122A90r2rn8K05m25O6J51j13J6Q7K52k99k2Q5J7N3p8m7j44L99m22L88j82J7j34
3147i9j13L46m45L47Jj09J97l51M72k34R1j89O1L3mJ79k20j17j32K03O2J84j01
3170F2o2k1j52Q4J4J25l4J27j58N0O7M6o3K1J38k24j50R6k84L3L41J35j97n5P
3195e4J81o0k01J14l0K01j32j32n4L93l0k77J81j31L3j2J38j53n8l9LN2L6P6k48
3220b03J19P4J94l35Q5J83j25q4J05k5jk2j80M12l82J53j9j12K14j20R9K5l17
3243b62M17P6k60K40p5j32J08K6Q6l0l52J53l2O2o0K2j38L24k84Q0M5K96o59L1
3267c18L37R8j12k4J93J05l6n46Q4r5J82K92p7j15J85J3k78R6L27k76l0o1j30
$$ y = [-207, -144, 118, 122, -6, -125, -9, -31, -8, 45, 13, -110, 347, -90, -194, 350, -93, 14, 18, 76, 221, -123, -109, -231, 190, 98, 89, 31, 236, -189, -123, 28, -85, -69, 18, 270, -29, -51, 34, 51, 104, 26, -21, -165, 234, -188, 200, 18, 35, -99, -212, 134, -311, 36, 37, -72, 125, -226, 246, 12, 103, -86, -25, 8, 4, 183, -37, -154, -286, -83, -21, 163, 62, 0, -21, -173, -89, -75, 50, 16, 143, -15, 35, 102, 148, 85, 106, 244, 20, -130, -34, -318, -285, 56, 191, -6, -61, -54, 127, 67, -134, -20, -50, 151, 19, -113, -167, 226, 196, -81, 100, -31, 2, -10, 128, -25, -83, -122, -119, -67, -31, 45, -203, -84, -10, 184, -151, -66, 117, -8, -92, 13, -12, -13, -35, -215, 197, -185, -32, -51, -163, 51, -69, 30, 55, -262, 155, 231, -29, 211, 136, 4, 112, 138, 224, 194, -158, -5, -37, 25, -35, -13, -151, 173, -111, -31, 14, 310, -349, -318, 19, 117, 5, -19, 174, 279, 243, -303, -219, -314, -132, 160, 83, -32, 153, 166, -112, -16, 311, 35, 5, -56, -186]
3290a86M4K14R1k7j27qR0M3n0l8m8m0L59l55J38k96Q1m0K94J5j64P2M5p7j25J95
3316A00k32J95l9p2K55j35l55J66J49J36J38m80J00M0p1J9J32j20Q8j59J05J74
3338A34j18J85L0o6k89K17k11m4O9J38JN3r0n0j03O4k29J81L21k83J8K13J59k17
3362H3l5J33j26k12N16l89K3J85j00K74m65j9j71K72J29j87K64k13J16j66R7J49
3384A58q7k3Pj57L27k97jJ03jJ5k28K11K52m20K76j57O7j15Q1K1l77M87q1k9p7
3409d5O7J24k59J32M1o8K44m11L68q4j85m1M34j62nk86J98j99J05Q5j14k7O6J03
3433H1j14j37M2j8M7M2j00L07m1kk06M21k10o5l21M33j54kK18l82K66L2q9K9j2
3458F5r7L4r0R6l01M95j45q0P1j47k3K59jj01R1J8k76M8K82q8k35j6L88Q9l60
$$ y = [-186, -142, 72, 163, 136, 9, 1, 91, 134, 84, 46, -2, -42, 317, -38, 100, -196, -115, -155, 139, 154, -10, 62, 107, 30, -95, 100, -132, 63, 24, -48, 207, 72, -283, -117, 32, 168, 306, -174, -74, -34, -105, -86, 46, -74, 14, -145, -40, 134, 16, 201, 231, 165, -124, 93, -118, -162, -93, 45, 46, 99, 9, -41, -144, -80, -309, -128, 193, -90, -72, 141, 300, 83, 48, 181, 55, -157, 359, -30, -7, 178, 78, 352, -113, -132, -303, -31, 98, -89, 175, -38, 78, -88, 9, 158, 71, 48, 55, -102, 225, -72, -73, 30, 29, 44, -184, 27, 279, -141, 135, -22, 45, -70, 11, 32, -345, 142, 61, 32, -45, 22, 146, -113, 19, 60, -8, 236, -175, 193, 109, -76, -117, 317, 155, 150, -136, 62, -137, -32, 53, -61, -88, -22, 81, -33, -170, -128, -146, -99, -57, -157, 150, 109, 107, -99, 322, 112, 47, -274, 159, 5, 3, 221, -161, 105, 137, 48, 77, 65, -32, 2, -88, 8, -293, 202, 57, -23, 48, -99, -122, 137, 136, 35, 126, 144, -132, -84, 198, 110, -125, -141, 247, 336, -24]
3483b4P7j29QMj3O9l3K10j85m8M7J30q3J37K55k86k60K27N1j58K11j31Q2q4j05
3508c1j84K49J9P7l4n7k3j18k7J35j78L27k05L95m73r1J88l66K01P8J86j7K2o3
3532A0m6J66k25L34l70M11l13j43J36J2N3R8j04q8j31L62k06N2J32j59J88l29
3554a60K92k4M3j93lk33R6K53k6o0J11J4j08R1O1k35l6K14k12J07R4pn4m0M6j2
3580A9k4K3k0J83j56J70j06j17J03J25k88j18K02Q5j04j3M55l45k44L92o8q2n6
3603A6Q1j03j61K00j81J53k5J86J34l64Q8k18L04L8J1k19J48j0n6j59L03k31J2
3626e3M9K06q0j99K14j31l3j26K27k19J94N1J69j38j87j25M46l72K29l04L31j90
3648d1J7o8P7K72m72J62L6k20K75j13n6K36j82O9o4K32k29J23m5J32l83k8L74
$$ y = [-24, 53, -76, -68, -64, -77, -8, -41, 169, -16, -64, -17, 113, 30, 167, 422, 136, -124, 103, 154, -4, 207, 76, 158, 74, -31, -215, 34, 53, 130, 96, 39, 16, -102, -129, 6, -172, 155, -50, 345, -128, -219, -31, -397, -196, -118, 68, 51, 73, 10, -36, 130, -95, 239, -131, 280, -33, -176, -40, -28, 25, 123, 19, -69, -200, 162, -44, 8, 140, -19, 169, -160, 132, 108, 151, -42, -45, -278, -182, 71, 45, -15, 96, 110, 2, 93, 154, -81, -117, 97, -115, -8, 86, 79, 25, -15, 31, 19, -5, 18, -2, 181, 25, 195, 89, -28, 75, 200, -88, -206, -4, 81, -23, -36, 419, 74, -170, 222, 154, 72, 16, 97, -6, -167, 33, -148, 5, -20, 166, 300, -64, 24, -194, 110, 148, 159, -60, 88, 78, 22, -137, 166, -65, -53, -4, 202, 122, -77, 137, 6, -27, -153, 74, -145, 49, 100, 269, 131, -56, -181, 265, -107, 122, -182, 149, -41, -24, -92, -15, 257, -215, -53, -17, -237, 38, -75, -131, 105, -77, -8, -72, 160, -69, 54, 9, 141, -242, -270, 104]
3671A04k79K54m0j64L36k89K84J3j79j04M9J77L9L9k27R7P8l68L03J07m51N70
3693C49k75j19K05p0q6Ro6J71M7j26m7k9J92j03n1o3l3K68%j16k71R2o6K48J95
3718B55p06M48lk16L79K4j90J38k85N7k14M03k17P8O6N4m1j33J11j07L45k74K23
3741A95M8m34O1J99j7j42J78j10k3J33j20N9K41j37j26j87Q2K9p8m2J49K18j45
3764C1j59K25j80l34L97K37j46j20j81N20r0j51j69K86K7q2j5j19j95L09j05Q0
3786F6J04n8j5k34M06l26M40k07j79N4k49K04PJ14l22J27l23L91k5p0J04J15M5
3809A69j58j07J0L33l64ko5K10k39K3K43N4K81l87O7j15P0J37l17L01n6K06m8
3832B46j65l22K3K07K90k33j1k7j19L34l07q5J25M2j14J52L8j7j14K50l66R6j83
$$ y = [104, -175, 79, 39, -125, 211, -78, 206, 219, 40, -64, -15, 162, 201, 240, 13, 110, 188, -180, 123, 230, -221, 349, 74, -45, 160, 90, 4, 13, -53, 118, 165, 39, -8, -37, 155, 52, 1, -62, -95, 173, 173, 57, -214, -122, -188, 60, 255, -451, -3, -6, -222, 157, 181, -9, 129, -156, -99, -313, 90, -127, -49, 17, 71, 30, -103, 8, -99, 246, -28, 195, 243, -191, -130, 69, 52, -90, 88, -22, -45, 88, -32, 27, 268, 131, 5, -182, -100, -71, -149, -191, -42, 176, 31, -128, 97, -83, -417, -20, 217, 71, -49, -230, 290, 200, 49, -120, 166, 193, 111, 96, -23, -218, 91, -14, 66, 170, 112, 97, -137, 269, -57, 383, 176, -3, 51, -198, 6, 13, 127, -195, -68, -391, 0, -25, -95, 9, 124, 169, 11, -96, -86, 247, -117, -119, -184, 26, -213, -190, 53, 107, 388, 1, 68, -47, 23, 160, -157, 144, 88, 294, 246, 81, -241, -218, -11, 279, 46, 35, 8, -111, 223, -84, -169, -44, -2, -116, 36, 74, 57, -57, 193, -173, -77, -260]
3855b60O08k30m20K26n9J68j56P0j01K25l8n1M6N4k39J72R1K6k42K04p7P3k41
3878a51J86j93J59K00j38K66j96J05l72J02J25j18p6Q6J51j23j37j14M0K24l1
3899eJ91j11qJ08p2J44o71M02o4j9O5j50L82q7j24P7k57K54L3P3j35M4k09K01
3923F2j26K35k42Q7ok4n3O6N0j55Q4k78K87P3Q2j17R3k83J17k2j28J88Q3j19l0
3948g6j79K54R7k41J86o1j11J61L13k97n5q0K41O2k09oJ59o1j00J96l2j28R0q
3972A15j07k18K52j42p3J82k73L89M1k08O5%j38j43O2K95j91n7J90j33J77o6N3
3995G2j52J2J47J71p8k80l9l0J49J86j00l5j20J30j13P6j05j90L95j99J50K6j67
4018i4J12j90k54O48p8l94K86k55L85K1j77O6j8k30J24J43j04j42J54p1K83q5
$$ y = [-260, 348, 118, -302, -76, -135, 33, -123, -53, -154, 71, 33, -18, 28, 82, -157, 15, 106, 132, -110, 94, 17, 90, -151, 35, -158, 1, 201, 63, 329, 133, 238, -134, -32, 93, -25, -101, -15, 136, 13, -124, -238, -198, 26, -5, 186, 75, 67, 175, 103, 247, -424, -22, -86, -105, -40, -190, 192, 105, -19, 58, -199, 55, 88, 161, 26, 70, -139, 62, -64, 171, -71, 16, 10, -14, -67, -1, 49, -106, -22, -300, -13, 60, 142, 25, 118, -165, -48, -70, -198, -10, 73, -46, -76, -255, -1, 96, -145, 41, -20, -131, 30, 343, 46, -9, -89, 152, 214, 5, -1, 158, 97, -3, 193, 161, 33, 123, 115, 8, -210, 42, -100, -173, 9, -264, 125, 166, -42, 23, 23, -115, -258, -196, 99, -92, -149, 41, -92, 85, 19, 72, -80, -68, 79, 250, 172, -108, -147, -177, -28, 158, 58, 23, -97, 33, -80, -4, -109, -299, 96, -103, 47, 73, -94, 18, -172, -426, 222, 144, -250, 36, -219, 166, 187, 10, 76, 58, -172, -48, 95, -9, -151, 3, -68, 215, 130]
4040A30j66J08p6o7j75L28k0r5J44k61p8N0L16j62Q6N6J20n7k30Km8q5M02j49
4064G3j59J25N4j07k3Q0P0j01P2L0J18j79j9J10k41L63m46n5J4K24j07k35L09
4087c0l3J54R2p3n1k3j01j5M3j99J89J89M0j95j80J91o2M4p7L51k83K2K05k01
4111cK09n7k10P7k1n3l24L62l6r9L6R9qk9o2J90r5p0J1J29J54k07R9j13k24P9
4137a66J06J75j59p4K8L8J89k25n4J25K5K6q2O2L1o5Q7o1O9J00j02m46M73j69
4161f9J28j26J17m7J6q2R3p3Kj00K95Q9k99L65k92J70q5K32k27r1r9K70k09n0
4185g2L82l27l9J9j80L6L0k50N58j20k7l03K61j04pR5J90q9k70K76j31J65j2l93
4209c12L25o6Km6n0K12O9k43j49L20J6j53J78l08M5P2LK4Q4%k60K24m6J39J9J3
$$ y = [130, -36, 72, -4, -71, -246, 82, 62, -33, 111, -150, -228, -178, 138, -24, 62, 118, 238, 181, -49, -47, -95, -180, 222, 73, -86, 39, 93, -14, -37, 43, 113, 12, 84, 114, 232, 53, 34, 144, -97, 266, -180, -235, -221, 3, -104, -339, -30, -63, 91, 183, 110, 59, 36, -65, -80, -37, -236, -47, 142, 182, -13, -193, -2, -64, -20, -97, 254, -29, -7, 198, -3, 206, 149, -61, 16, -5, -58, -382, -20, -56, -155, -119, -20, -28, -57, -119, 71, -24, -94, -83, 46, 200, -7, 92, -21, -245, -166, -60, 115, -44, -118, -90, -52, 137, -88, -142, -17, 8, 34, -48, 14, 45, -20, 67, 6, 75, 175, 73, -373, 100, -69, 59, -67, 50, 3, 19, -63, 30, -43, -41, -141, 154, 243, -56, 309, 17, 187, 102, 334, 107, 16, -83, 187, -22, -72, 310, -17, -56, -37, -217, -181, -151, -401, 157, 37, 10, -293, -32, -136, -143, -48, 142, 53, -217, 59, -72, 93, 81, -312, 13, -53, -51, -97, -147, 65, 134, -109, -258, 62, 78, -75, 103, -205, -160, -88, -85, -61, 23, 23, -237, -13, -59, 80, 99, 112]
4235A12k24N8J30m1j23l00K99j2j1K99j05n4p8R6k44J09j92M08Q2r5J3O7p3r1
4259C0J60k23qr7R8r8j44J13N4K54l26J37O3L9l08K90k36K09Pj7J81l86J25J71
4283H8j15n4J11j35r4M05j81j48K43J18j70k67L04J17k15r9M29q5j39j22j26Q9
4305d6L38m36O1k3j11M73l02M3Q3j24N9n9p0L4k4p5J87l26N28l44K39J51l80J82
4329E8L8j9j97j58J30O1K17O7k29O6p0j54K19J84k36n4K26k8k48QJ06l40L96j99
4353a56K88J27m87K89q2o7J76n16K18L42j98O7m4K00j86j06L24k53l7K8J62j48
4375e9%n7P0J30k05K72k97l6K22j49l24L90j68K46J06o7J02j08k39K07j34RJ44
4398E5j34J17j80J12L3J24k62L43k00K37k6m27J09J2K95j78j51K80j63J65l33
$$ y = [112, -112, -54, 76, 35, -88, -388, -89, -101, -112, 187, 82, 28, -50, 46, -198, -89, -281, 127, 209, 114, 127, 194, 121, 30, 190, -33, -41, -138, -40, -138, -282, -169, -115, 139, -187, -50, 13, 52, -256, 34, -202, 7, 14, -3, 178, -208, -83, 88, -27, -81, 30, -105, -199, 206, 25, -123, 120, 238, 68, -199, 105, 222, 7, -92, 337, 252, 113, -9, -135, -46, 292, -144, -83, -106, -217, 256, -46, -3, 80, -44, 15, -44, -114, -80, -104, -179, 8, -318, 210, -134, 105, 256, -124, 58, 96, 77, -120, -278, -148, -87, 130, 197, -32, 34, -36, -190, 29, 213, -23, -77, 149, 121, -127, -119, -13, -353, 43, -156, 132, 259, -228, 61, -21, -88, 88, -428, -210, 132, -66, 1, -43, 157, -29, -135, 189, -64, -101, -73, 89, -59, -59, -116, -46, 84, -121, 151, -146, -182, 40, -109, -433, -43, -211, 35, 141, 74, 176, 68, -171, 36, -98, -89, 55, -79, 38, -142, -30, 3, 127, -135, 208, 8, 245, 219, -208, -99, -87, 208, 30, -121, 159, -4, 161, -172]
4419a72L78j03k68J31j8M9K1J0R6p4m29M45p2j93J57m2l7j07J13J9K56J70l76
4442d6J39q1m3J25M5m00J41L6M3m3J1K0K42j99j53J00O8J96l12K27j24Q0j96K40
4466A16o0j80m3j63L24Pj46M36k88p9j07O3K18L4L6l25J94j3M3k91J54P9L8j7
4490C0K53n9k33j81M6L26m20L55P7o8k51J75k4J2j88J77j13O8n5J07rL4j30K12
4514A41j96P9j69j2L15k51J66j0o9J82P0k34j87K69k38Q6P0j82L24J34k62R4m3
4537G7N9l6P7n2k45l3J26P1L1j85N6J82K88j83k99J15r6K16N7j55l53K51k5M4
4561a2O1p9J66n2J21j22p7Q7j47R9j70L4L06k52P2o7K07k14J44l00K19mj99K14
4585C5J77l72l7J83k82J51K54J68l41J83j91k09L48j57j12L20j56N0k04J61M00
$$ y = [-172, 206, 103, -165, -34, -52, -3, 18, 28, 124, 50, -379, 66, -6, -199, -42, -84, -121, -228, -115, -96, 160, 330, -46, 93, 12, -31, 94, 139, -261, -120, -84, -41, -84, -73, -53, 189, -10, -163, -63, 5, 201, -111, 116, -8, 72, -124, 116, 56, -124, -167, -330, -6, 1, -145, 291, 3, -76, -183, -120, 98, 132, 168, -157, 37, 24, 67, -224, -70, 9, 47, 30, 283, 224, -9, -190, -144, 182, -238, 117, 194, 126, -125, 50, 26, 38, -150, 27, -86, -18, -73, 34, 25, 59, -71, 141, -55, 24, -145, -157, 158, -93, 73, 63, -6, 176, 246, 12, -175, 94, -144, -58, 12, -170, 154, 288, 26, 120, 77, 136, 100, 177, 125, -120, -153, -27, 44, 75, -110, -54, 128, 416, 233, -66, 49, -47, 169, 226, 71, -282, -31, -56, -12, 49, -30, 136, 84, 205, 83, 6, 93, -54, 45, -125, -91, 215, -37, 35, -32, 175, -39, 105, -195, 24, 20, -179, 35, 212, -160, -197, -14, -296, -145, 109, 277, -64, 119, -72, -281, 67, -90, -202, 118, -38, 12, -192, -31, 369]
4606C69k80k9l1R7J36n25K42j7j24r6J53j1J95k78O1j42M35N4j51l3j56K20j84
4629i5l9k32l7L78n8P9K45m11K35r1j16Pl26N68J67n58J97L55k61K14m67q4L26
4652dj04J74k10Q6o9p0L13k19J36J4K19k07J28l4k20K8%k15J43k4Q9L42o21J09
4676b16P8J29K30l74J85o8K07k3l07O4j9K1j6R8p5R7j49O5L9J08O0k24N8M7n1
4701c6o9L04k12n4J64k42K02J81j85j68kO0L05k50L51j88j21N8j77L5L05k90N2
4724B3J14k43l4M9N8P1j31K77m4k36K17r9j15J29J13k53J47j7M4j1o1k80K87j3
4748hk13J65q7o3K65j27K3k00M84l11n6K96j56q2J79l1n9l3m8K18J51l31M7Kl90
4773c65M87k15J49K81m54J51q9L15j54M7k3J17k55k0K6j45J95k4O5J0Jo5oq8Q0
$$ y = [369, 89, 60, 29, 126, 262, -263, -21, -38, -162, -258, -105, -116, 79, -199, -138, -280, 155, 209, 58, 25, -131, 89, -95, -134, -366, -403, -25, -83, -4, 241, -170, 65, -26, -142, -135, -461, 107, 274, -284, -87, 268, 7, 221, -246, -330, -4, -108, 66, -144, -58, -127, -197, 116, -103, 33, 47, 266, 59, 187, 153, -67, -39, -39, -254, -111, -135, -46, 296, -325, -216, -138, -9, 221, -153, 32, -36, 171, 148, -159, -95, -114, -93, -109, -11, -86, 11, -138, -73, -34, 74, 134, -90, -32, 15, -36, -105, 199, -13, -67, 97, -145, 57, 238, 53, -115, -117, -57, 248, -2, 349, 161, 40, 98, -79, -44, 261, -29, 23, 137, -106, -140, -91, -33, 38, -93, 184, 140, -96, 121, 22, -93, 36, 149, -104, 43, 26, 70, 59, -2, -282, 5, -8, -221, -56, -143, -206, 59, -68, -45, -245, 239, -72, -128, 168, 12, -70, 109, 78, 19, -14, -62, 156, 307, -24, 23, 25, -365, 122, -93, 56, 337, -117, 34, -55, 260, 106, 153, 130, 247, -8, -28, -2, -147, 48, 24, 89, 99, 100, 35, 29, -59, 21]
4798B1k88L79J53j57k96N5L09j3k4j22l03M18Q9n0m5j03q3L31j8l66k4K98K38
4821C99l93j02K4J19J63j88n7R9l24M29j96J69q6j1j03l5j11j5M12k02j5j00N9
4844f5j64M0K5K32j70O8p4j6J27j83L06j88k74M97lj42nrj3J05J0j67k2J76k0
4869G1j19j0q3N0l7K48J05j28O2l13j08K0L23k3j62n9j27J55M0J14p9O0j16J54
4893C8M8q9l83J95K72m3m1q3j84J01L64k75J25j22O1J84k56J1pj43K89j46L71
4916B87j81k55K15q9q9n1J81m23K63J7J16q1K57l26M21k19m6Pj92M77m56M01l36
4939a02R1r7K73j29J25j52M05n85n9k8M00l09K75j13j60M82l40m6L88k51J0o3
4961A5RJ55l05J71j22R3J32m1J04j75l4j97J04Qro5o7K13O2j00j02J72R1j97K6
$$ y = [21, -267, 112, 265, 108, -188, -133, 176, 163, 139, 17, -286, 132, 221, 171, 126, 23, -60, 271, 253, -113, -137, 161, 399, 6, -96, -72, 47, 210, 22, -35, 64, -260, 169, -27, 142, 56, 45, -58, -93, -204, -219, 193, -9, -24, -124, -65, -229, -189, -164, 68, -102, -34, -108, -124, 3, -180, 126, -62, -336, 161, 158, 16, 11, 2, -11, 94, 104, -63, -85, 91, 71, -48, -58, -141, -91, -128, 120, 225, 97, 159, -154, -262, -242, 81, 58, -104, -163, -290, -135, -95, 19, -60, 0, -116, 38, 86, -3, -386, -191, 81, 38, -3, -86, -270, -169, 195, -80, 45, -77, -16, 168, -88, -77, -84, -227, 62, -84, 287, 106, -149, 66, -23, -112, -163, 18, -405, -142, -125, -9, -90, 167, -159, 262, 43, -3, 4, -188, 289, -167, 234, -102, -11, -108, 165, 36, 161, 9, 414, -171, -230, -258, 142, -167, 108, -5, -165, 317, -23, -69, 319, 68, 78, 15, 24, 179, -126, 45, -77, 16, 148, 107, 211, 36, 2, -195, -91, -83, -92, -157, -224, -11, 51, -49, -151, 21, 112, -85, -59]
4986e9L03j97j44J68j71K27p4N2j79l1j68K15K26Rk00n3p8R4R7j55K30j10J3k08
5010a93R0Q6N0J22k58R1J41m6q3K9n5K0N2K3J29j42j27k40J29L97R2j97l22K62
5034E0R0q5J58k75o9K53k15J68r7l5K56k24J63j18L56l90K5J18k85R3J96l50O0
5057a57J38j73N4j31QL91l86L94j71N4l5p9Q8J7m8J2%Q1N9K3o0k58q4J83N0J50
5083A20j49L4j93J05K62K6j44J03P3k43M2r7P2j80L35o1k68K98m4j06q6K65k20
5106e6O1o4R6J13j64Q9J4J08j80K10k99K89j32pk88M12J62n40L54l56J67k36J78
5129f9r1J28L56j52j93l5R0K53j18k23n0O0R5m55M78k80J64J41j4J44q7k31K02
5152A13j84L8p9p3L59p4J1m12K39j0K35J37l47J42L3J61n37M15j65Q9k0l05J73
$$ y = [-59, 244, 47, -97, 71, -100, 127, 53, 105, -74, -105, -273, -58, 168, 177, -23, -76, -154, -60, 37, -118, 112, 2, 15, -193, -103, -17, 33, 155, -103, -12, 129, 83, 0, 29, -26, -6, 46, 69, 198, 56, -71, -311, -182, 215, 307, 110, -212, 50, 140, 55, 213, -62, -131, 122, -93, 75, -22, -57, 199, -25, 138, 20, 376, -14, 11, 129, -156, -63, 133, -217, -157, -19, -192, -138, -269, -261, 130, -256, 138, -33, 21, -14, -93, -5, 12, -36, -24, -24, 57, 116, 139, 79, -179, -263, -80, -30, 120, -29, 5, -188, -83, 179, 205, 61, 164, 237, -6, 36, -61, 11, -169, 166, 105, -163, 135, 91, -15, -101, 164, -56, 5, -59, 37, 150, -14, 75, 89, 197, 17, 227, -72, 217, 85, 78, -210, 202, 364, -176, 178, -178, -11, -247, -69, -160, -32, 324, 172, -21, -56, 34, 287, 169, -54, -104, -44, 51, -404, 74, -206, -42, 99, 85, 229, 142, -89, 113, -71, -33, -112, -185, 174, 100, 111, -301, -62, -72, 163, 300, -47, 95, 128, 289, -248, 167, 2, 91, 71, -234, -61]
5175f1K61k70J02O0j95J44O4N2m32J1N00m68Q5N1J23j8k35J75J52m8J54j85j94
5198a72p9L05J19k01k7Q8J08j1l92K43J31n5l6MK12l06O8k60J32J57nJ42n0J92
5222C07j38j80l49O03n39K26Jj22L84j74j57L04Nlq6j87N7K32k73J96l36K47j46
5245a28Q0K53k68OR8qn7K2j28J23J53o95Q22l52L8K57j99p5q0J80j84K12P6j58
5269a2Q8O6k45M6J0mo4J27j66K55j76K74k15k80L36k70K27J23L4j22r3j08K9J49
5293Iq7p2J72p5J43l60J53j76K76J91k04L2K00k40R8j32q3P7n3N8J63P8j53K3
5317C8k5k09L29l7l17M15m77M94k01l4O4q3P4j13J91k99K46J38j51j6l0J30j22
5340El63J46M8J93r3j48J65K67j31j03J59l1k89L40j73k92M59l50R9K75l81J66
$$ y = [-61, 200, -70, 32, 92, -103, 41, 105, 157, -275, -264, 236, -232, -147, -96, 27, 9, -226, -51, 101, 53, 207, 22, -172, -251, 54, 173, -28, -55, 33, 141, 130, -262, -19, 112, 57, 21, 25, 237, -69, -1, -261, -129, 28, 23, 165, 115, 307, 169, -11, -360, 243, -296, -70, -69, -191, 193, 19, -138, 166, 171, 168, 82, -105, -48, 184, -89, 107, -229, 18, -128, -48, 205, -63, -57, 41, 33, -24, -2, -130, -7, 146, -549, 273, -79, -41, 216, 17, -58, -138, 42, -142, 70, 146, -12, 76, 142, -103, -57, -47, -51, -115, 12, -154, 101, -75, 199, -16, -296, 40, -230, -3, 120, 154, 32, -61, -169, -140, 9, -78, -150, 22, -53, 90, -270, -117, -293, -17, 174, -30, 2, 202, -38, 60, -72, -155, -78, -131, -73, 90, 168, 15, 38, 13, -196, 133, 96, -221, 194, -283, 211, 10, -24, 40, -43, 31, -82, 109, -190, 56, 194, 43, 27, -3, 127, 5, -358, -212, -164, 29, -64, -212, -47, 220, 89, -14, 145, 114, -175, 165, -8, -300, 159, -191, -92, 183, -198, -32]
5362c2M6L4K6N2q9l58L67k44O5J41m00M29o3j21L17k75k15L08j54K01J8R5P2k33
5386a3n6m7N5J44J50j08j70Pj14rJ37j61Q5K25J71l96K09K63l82K01m6p6o1J81
5410A89m37L14K9k47J88MJ22j21j39J23l9K12l30P5r6L07k41m1Lk9K49k41K10
5433F4k40K36K36k41j42L59k53k82J10J89j47J84r2j00J79J51k89KK41l24O7P8
5455a4j9o9J81l5m1j61n7K61Oj58j2J76L4k18m5L28k18K29j2J7j52k26K33O1J8
5480A07J07j53j31P2k61L90k18J72j89k3K19j40R9k54M7K35l07K61j00J24K64
5501C21k21k21M04l70L12j81p8k26J54J43o2J10j68J03o2j29k08L73r7j52K81
5522B6MJ19m6J8j50j02K38j81K8Q7J65j04N7k27J10r5K91j52J48l88J60J6K4k93
$$ y = [-32, 14, 48, 74, 126, 37, -321, 46, -198, -133, 8, -392, 37, -26, -147, 170, -105, -320, -12, -166, 35, 53, 148, 220, -13, -69, -116, -61, 83, 233, 125, -45, -38, -152, -161, -24, -185, -100, 125, 296, -100, 109, 372, -10, 191, 145, 69, 8, 189, -248, 66, 95, -152, 36, 40, 162, 41, -98, 25, -14, 198, -132, -57, -153, 154, -87, -128, -125, -154, 95, -146, 64, -176, 60, 296, 55, -87, 272, 19, -263, -153, 36, -111, 73, -19, -119, 60, 211, -78, -76, 165, -159, -92, -14, -33, -102, 79, 44, 3, -158, -215, 46, 52, -106, -118, 58, 92, -126, -171, 157, -61, 168, 156, 173, 21, -205, 28, 89, 107, 214, 61, -70, 2, -259, 131, -87, 85, -104, -127, 92, -48, 51, -203, -156, 79, -228, 33, -67, 57, 321, 100, -121, 283, -87, 225, 44, -34, -260, -106, 37, -25, 85, -83, 20, -42, -171, -379, -6, -103, -255, 26, 30, 149, 103, 121, -29, -131, 107, -74, -46, 41, 206, 102, 159, -68, 42, -53, 238, 86, 234, -154, 6, 22, 46, -247]
5546b47N80j4m37p0L73j66J09l29N23j83n8l1O0q5M3m1j43M00k78l1J33K4k35
5569a03j12J78R9L5OK71m13N3q6k9J76Om0m6J79J26o25L68L6k30M4J25J2J69m6
5594A53j25J88k54m7J06k03L1Q0K94o2j98L21j97q3k36K57M7j10KK1M3k05K12
5617C5ql3R0j67k57M33m2K67l33N7j75J26k6k01J37k9q9K22l0j71L29J15k97R1
5641D4j24M31k33k82K1M2Qj55L97j93j26K80L6j56r6J5L3J82K8j55K99l5k05m4
5665A2l7J05pn8k5j18K29J05k37o3P5J32%k31J31J3j20K38j42J66L7n8j36L0n8
5690a7Q8l15L18o5j75J55j07K78k37K91k91J54k81J60L4k61L98k15K12k01p3l4
5712a84L60J02l01K5p0J07K9k77J06J70j83j58K85l7P1J6j6l70L09K06k95j06
$$ y = [-247, 333, 319, -118, -188, 185, 19, 128, -201, 322, 139, 81, 50, 110, 25, 68, 27, -116, 284, 6, -25, 108, 132, -103, -215, -37, 62, 97, 103, 374, -39, 14, -72, -101, 75, 81, 41, -5, 174, 300, -325, 43, 79, -151, -107, 18, 30, 199, 153, 28, 216, -38, -85, 21, -182, -151, -71, 223, 161, -37, 284, 87, 4, -232, 25, 72, -38, -36, -15, 28, -177, 35, 27, -6, 84, -83, -340, 93, 51, 318, -15, 42, -133, -7, -33, -234, -97, -126, -215, 7, -23, -194, 135, 250, -47, 44, -80, 351, 118, -164, -143, -101, -93, -248, 149, -44, -170, 110, 146, -10, -106, -91, -58, 124, 152, -3, 296, 261, 56, 12, -25, 80, 73, 15, -10, -128, 101, 206, -31, -94, -19, 113, 113, -118, 13, 26, -94, 144, 2, 168, 205, 147, 11, 41, -17, 71, -244, 74, 9, -166, -11, -118, 160, -77, 214, -77, 77, -204, -44, -10, -271, 127, -88, 124, -77, -150, -184, 176, 278, -23, 2, -68, 39, 68, -209, -103, 67, -116, -274, 11, -26, 45, 61, 45, -325, -16, 190, -105, -211]
5734b11J23J4K45m09J16K42Nj54l66J96L20l24K18O5j23o2or6N3L56l93K94r7
5757Fj12J17J3Jk05L7L14J6k51J35l00R0LJ39K08j13j03j28L68k17k53j42K15
5780a62K03j21q1J13K60m46M9K38j21Q0L0r3p2P7j35K93j14k1P9J24k14Q5J45
5803A96k47Q7O5J23l21J11J27j34r2J44R2j5k26J83j34j52L22j39k0R9Mj45j2
5826h4L8J16k48J03J61Po02O92j32j02Q2J61K71l79j92J48P6j09r3k02J59R3j43
5849a79j55M26l0K5kJ9j02M6r8J05j0m8M8p0l55J42K37J5k25K40L2mn0j21j9o3
5875a96K05q0L0J63j42n6j8J13l8jK32k32j47Q0R9J06m00L67k35Q5K2L9p2j15
5899a91KJ78K43j97l7L07m21N2K76Ql7j70N2l10L24J52l27J14J94n1n40L48Kp5
$$ y = [-211, -88, -74, 171, -238, -122, 120, 125, -29, -395, -199, 121, -203, 15, 80, -43, -105, -111, -207, -154, 202, -191, 103, 6, -106, 11, 24, 25, -180, -143, 171, 187, -64, 71, -229, -139, -136, 3, 211, 98, -5, -133, 235, 18, -235, -377, -162, 41, -80, -161, -48, 212, -234, -185, 53, -68, 12, 42, -51, -123, -46, -181, 112, -2, -23, 56, 180, -34, 51, 196, -51, 36, 101, 224, -97, 14, 141, 7, -85, 59, 151, 136, -90, 93, -41, -193, 129, -10, -30, 69, 73, -72, -84, -46, 70, -178, -75, 86, 93, -509, 183, 51, -51, 31, 192, 463, 84, -108, 40, 116, 7, -86, -288, -129, -36, -179, -334, 92, 62, 87, 85, 104, 2, 48, -50, 55, 45, -3, 45, -25, -380, -238, -1, 14, -211, 29, 61, 57, 7, -114, -133, -196, 9, -71, -41, 122, -20, -76, -94, 19, -19, -20, 212, -20, -167, -87, 12, 118, -282, 85, -150, -65, -43, -4, -76, -191, -189, -11, 232, 35, -2, 305, -116, -64, 212, 220, 183, 13, 65, -245, 79, 231, -96, 18, 212, 161, -379, -31, -29, -104]
5923a04K54j00J43q4l18L36J84m28k9J67j81K09m3OJ85j75k0k10l2L25j54j67
5945b36L54JM9o6l33M13j55J71k91P0o7N6p1J41q0j39rJ15J36r1k43J71J18L20
5969C34m92L25J41k95n6q1L18l39K18k05J05LJ51k41K0K36q6k64J68j43J81J7
5991A5m3m5K28m2o3p6k92N1L63o8j11K2j80K27q2L3J48J69l05j38J54J31L9m4
6015I1J59l40J28J26k44J9K08j9o4l30K58R4q0o4K28k21J17K0p7k47L08Q4n9R9
6039A94Mr0j13P5q9R5pj3R3j74K09n32M20K06j98r5J69l9l07L27P4k15p0M28j52
6064B00j53m2j1J72L8j35j53k4o1J54J31k01J08Q8j12j5M9j32r9J75JK14k08J43
6088A27j76q3L58K3l04L20k42Q4N5Np9q6J93P8j59J62j99Jj59J19j30J41J25k25
$$ y = [-104, 150, 50, 193, 109, -209, 127, 311, -117, -146, 21, -160, 49, 6, 12, 197, 22, 2, -208, -240, 85, -69, -236, 118, 119, 168, 102, -231, 182, 27, 198, -93, -23, -90, -34, -105, 36, -44, -183, -192, -77, 59, -32, -275, -104, 14, 334, -158, 167, 308, 13, -43, -124, 194, -145, 73, -132, -27, -24, 127, -114, -94, 142, 56, -208, -40, -183, -2, 15, -28, -73, 155, 113, 50, -26, -318, -267, 96, 28, -83, -61, -241, -14, -96, -63, 85, 254, -51, -189, -35, 96, 135, 91, 250, -90, 38, 164, -80, -61, 147, 128, 64, -266, -8, 86, 6, -58, 170, -51, 66, 86, 9, -238, 70, 154, 95, 194, 198, 108, -5, 70, -19, 76, 69, 56, 149, -25, 184, -348, 72, 278, 80, -15, 154, 115, -192, 135, 209, -6, -76, 352, 200, 47, 5, -6, 166, 204, 69, -84, -108, -169, -15, 116, -85, 23, 111, -1, -16, 33, -99, -198, -23, -22, 192, -16, 127, -49, -132, 226, 249, -55, 265, 23, 107, 162, 167, 88, 2, 195, 273, 114, 276, 77, 78, -81, 38, -92, 49, 174, -51]
6112e1P5q5J79j00j92J01J3K73l67K07R2j72j13L37j9k19J16n3q2rK30k45J47
6135F3j25K40j20j7j46k3J29j15O9J86K7k14J36n1Q3j36R6q2O3J01k33J98m11
6158b82K37K19k15J26k08j1L6O4J04N3k5j09J93j89o6J13l93J73J21r2P1L81o4
6181B37l72J6o9J03J07m0j57L63r6O3k44j50K73j06n5J58o5R3k29L35p7l8j45
6204i5M62l20J48k71J09J58j96J25k94J49P2q1k45M50k88L82j81k2p4J44J86k50
6226F8j67Q0r0J6K09k02P0j0R8j00J99j75Q4j12M4k62L18l25K42Q1r8J34O3j57
$$ y = [-51, 24, -61, 118, 18, -174, -73, -60, 213, -154, 53, 145, -27, -140, 197, 178, -41, 75, 22, -60, -69, 161, -84, 63, -62, 178, 58, 41, -105, -128, 1, -114, -45, 141, 168, -46, 90, 39, 122, -14, 82, 0, 63, 164, -69, 129, -282, -45, 174, -41, 85, -123, -134, -98, -34, 70, 123, 98, -11, 182, -7, -73, 40, -353, -180, -59, -151, -80, 301, 237, -135, -119, -188, -85, 22, -18, -175, 188, 92, 155, -89, -239, 34, -72, -127, 31, -34, 59, -170, 165, 88, 50, -95, 367, 47, 195, -76, 33, 191, -5, 120, -174, -25, 47, -34, -279, 171, -117, 265, 84, 62, -12, 132, 318, 68, -99, -19, -109, -93, 116, -86, -16, -26, 72, -28, 171, -4, 80, -32, 12, -250, 68, -257, -15, 66, -32, 102, 165, 8]
$$ [...]
8191D6
##END NTUPLES=NMR FID
##END=
