##TITLE=1H_SR158_k
 CDCl3
 32 sc, 
 16.1.2023
##JCAMPDX= 6.0         $$ Bruker NMR JCAMP-DX V2.0
##DATA TYPE= NMR FID
##DATA CLASS= NTUPLES
##ORIGIN= UXNMR, Bruker Analytische Messtechnik GmbH
##OWNER= root
$$ XWIN-NMR		Version 3.5
$$ Mon Jan 16 15:29:09 2023 Russian Standard Time (UT+4h)  she@DPX200
##.OBSERVE FREQUENCY= 200.13135
##.OBSERVE NUCLEUS= ^1H
##.DELAY= (6, 6)
##.ACQUISITION MODE= SIMULTANEOUS
##.ACQUISITION SCHEME= undefined
##.AVERAGES= 32
##.DIGITISER RES= 18
##SPECTROMETER/DATA SYSTEM= spect
##.PULSE SEQUENCE= zg30
##.SOLVENT NAME= CDCl3
##.SHIFT REFERENCE= (INTERNAL, CDCl3, 0, 15.7039)
##AUDIT TRAIL= $$ (NUMBER, WHEN, WHO, WHERE, WHAT)
$$ ##TITLE= Audit trail, XWIN-NMR		Version 3.5
$$ ##JCAMPDX= 5.01
$$ ##ORIGIN= Bruker BioSpin GmbH
$$ ##OWNER= she
$$ F:/spectra/data/she/nmr/H-F/1/audita.txt
$$ ##AUDIT TRAIL=  $$ (NUMBER, WHEN, WHO, WHERE, WHAT)
(   1,<2023-01-16 15:28:16.00 +0400>,<she>,<DPX200>,
      <continue with go, POWCHK disabled, PULCHK disabled
       configuration hash MD5:
       00 E9 B6 7A A2 85 ED C7 34 08 36 98 17 FE 4E 26
       data hash MD5: 16K
       0F 00 00 7F 37 5A 0F A9 0C E4 74 92 2B F4 29 D8>)
$$ ##END=
$$ 
$$ hash MD5
$$ 70 07 40 0E 70 F3 33 89 C4 8C 23 6E E2 42 F9 6F
##$RELAX= 
##$RELAX= 
##$RELAX= 
##$RELAX= 
##$RELAX= 
##$RELAX= 
$$ Bruker specific parameters
$$ --------------------------
##$DU= <F:/spectra>
##$EXPNO= 1
##$NAME= <H-F>
##$PROCNO= 1
##$TYPE= <nmr>
##$USER= <she>
##$AMP= (0..31)
100 100 100 100 100 100 100 100 100 100 100 100 100 100 100 100 100 100 
100 100 100 100 100 100 100 100 100 100 100 100 100 100 
##$AQSEQ= 0
##$AQ_mod= 1
##$AUNM= <au_zg>
##$AUTOPOS= <>
##$BF1= 200.13
##$BF2= 200.13
##$BF3= 200.13
##$BF4= 200.13
##$BF5= 200.13
##$BF6= 200.13
##$BF7= 200.13
##$BF8= 200.13
##$BYTORDA= 1
##$CFDGTYP= 0
##$CFRGTYP= 5
##$CHEMSTR= <none>
##$CNST= (0..31)
1 1 145 1 1 1 1 1 1 1 1 1 1 1 1 1 1 1 1 1 1 1 1 1 1 1 1 1 1 1 1 1 
##$CPDPRG= <>
##$CPDPRG1= <>
##$CPDPRG2= <>
##$CPDPRG3= <>
##$CPDPRG4= <mlev>
##$CPDPRG5= <mlev>
##$CPDPRG6= <mlev>
##$CPDPRG7= <mlev>
##$CPDPRG8= <mlev>
##$CPDPRGB= <>
##$CPDPRGT= <>
##$D= (0..31)
0 1.2 0 0 0 0 0 0 0 0.06 0 0.03 0 0 0 0 0.0002 0 0 0 0 0 0 0 0 0 0 0 0 
0 0 0 
##$DATE= 1673868360
##$DBL= (0..7)
120 120 120 120 120 120 120 120 
##$DBP= (0..7)
150 150 150 150 150 150 150 150 
##$DBP07= 0
##$DBPNAM0= <>
##$DBPNAM1= <>
##$DBPNAM2= <>
##$DBPNAM3= <>
##$DBPNAM4= <>
##$DBPNAM5= <>
##$DBPNAM6= <>
##$DBPNAM7= <>
##$DBPOAL= (0..7)
0.5 0.5 0.5 0.5 0.5 0.5 0.5 0.5 
##$DBPOFFS= (0..7)
0 0 0 0 0 0 0 0 
##$DE= 6
##$DECBNUC= <off>
##$DECIM= 32
##$DECNUC= <off>
##$DECSTAT= 4
##$DIGMOD= 1
##$DIGTYP= 9
##$DL= (0..7)
0 120 120 120 120 120 120 120 
##$DP= (0..7)
150 150 150 150 150 150 150 150 
##$DP07= 0
##$DPNAME0= <>
##$DPNAME1= <>
##$DPNAME2= <>
##$DPNAME3= <>
##$DPNAME4= <>
##$DPNAME5= <>
##$DPNAME6= <>
##$DPNAME7= <>
##$DPOAL= (0..7)
0.5 0.5 0.5 0.5 0.5 0.5 0.5 0.5 
##$DPOFFS= (0..7)
0 0 0 0 0 0 0 0 
##$DQDMODE= 0
##$DR= 18
##$DS= 0
##$DSLIST= <SSSSSSSSSSSSSSS>
$$ [...]
##$SUBNAM2= <"">
##$SUBNAM3= <"">
##$SUBNAM4= <"">
##$SUBNAM5= <"">
##$SUBNAM6= <"">
##$SUBNAM7= <"">
##$SUBNAM8= <"">
##$SUBNAM9= <"">
##$SW= 18.05172834244
##$SWIBOX= (0..15)
0 0 2 0 0 0 0 0 0 0 0 0 0 0 0 0 
##$SW_h= 3612.71676300578
##$TD= 16384
##$TD0= 1
##$TE= 0
##$TE2= 300
##$TE3= 300
##$TEG= 300
##$TL= (0..7)
0 120 120 120 120 120 120 120 
##$TP= (0..7)
150 150 150 150 150 150 150 150 
##$TP07= 0
##$TPNAME0= <>
##$TPNAME1= <>
##$TPNAME2= <>
##$TPNAME3= <>
##$TPNAME4= <>
##$TPNAME5= <>
##$TPNAME6= <>
##$TPNAME7= <>
##$TPOAL= (0..7)
0.5 0.5 0.5 0.5 0.5 0.5 0.5 0.5 
##$TPOFFS= (0..7)
0 0 0 0 0 0 0 0 
##$TUNHIN= 0
##$TUNHOUT= 0
##$TUNXOUT= 0
##$USERA1= <user>
##$USERA2= <user>
##$USERA3= <user>
##$USERA4= <user>
##$USERA5= <user>
##$V9= 5
##$VALIST= <valist>
##$VCLIST= <CCCCCCCCCCCCCCC>
##$VD= 0
##$VDLIST= <DDDDDDDDDDDDDDD>
##$VPLIST= <PPPPPPPPPPPPPPP>
##$VTLIST= <TTTTTTTTTTTTTTT>
##$WBST= 1024
##$WBSW= 4
##$XGAIN= (0..3)
0 0 0 0 
##$XL= 0
##$YL= 0
##$YMAX_a= 955004
##$YMIN_a= -773966
##$ZGOPTNS= <>
##$ZL1= 120
##$ZL2= 120
##$ZL3= 120
##$ZL4= 120
##$ABSF1= 10
##$ABSF2= 0
##$ABSG= 5
##$ABSL= 3
##$ALPHA= 0
##$AQORDER= 0
##$ASSFAC= 0
##$ASSFACI= 0
##$ASSFACX= 0
##$ASSWID= 0
##$AUNMP= <proc_1d>
##$AZFE= 0.1
##$AZFW= 0.1
##$BCFW= 1
##$BC_mod= 2
##$BYTORDP= 1
##$COROFFS= 0
##$CY= 11.3945322036743
##$DATMOD= 1
##$DC= 2
##$DFILT= <>
##$DTYPP= 0
##$F1P= 2.36226072786647
##$F2P= -0.459571619588291
##$FCOR= 0.5
##$FTSIZE= 0
##$FT_mod= 4
##$GAMMA= 1
##$GB= 0.15
##$INTBC= 1
##$INTSCL= 1
##$ISEN= 128
##$LB= 0.24
##$LEV0= 0
##$LPBIN= 0
##$MAXI= 10000
##$MC2= 0
##$MEAN= 0
##$ME_mod= 0
##$MI= 1.114404
##$NCOEF= 0
##$NC_proc= 0
##$NLEV= 6
##$NOISF1= 3.799351
##$NOISF2= 2.8
##$NSP= 1
##$NTH_PI= 0
##$NZP= 0
##$OFFSET= 15.70392
##$PC= 1
##$PHC0= -19104.58
##$PHC1= 5.80073
##$PH_mod= 1
##$PKNL= yes
##$PPARMOD= 0
##$PSCAL= 0
##$PSIGN= 0
##$REVERSE= no
##$SF= 200.130013532006
##$SI= 16384
##$SIGF1= 3
##$SIGF2= 2
##$SINO= 400
##$SIOLD= 16384
##$SREGLST= <1H.CDCl3>
##$SSB= 0
##$STSI= 0
##$STSR= 0
##$SW_p= 3612.71676300578
##$SYMM= 0
##$S_DEV= 0
##$TDeff= 0
##$TDoff= 0
##$TI= <>
##$TILT= no
##$TM1= 0
##$TM2= 0
##$TOPLEV= 0
##$USERP1= <user>
##$USERP2= <user>
##$USERP3= <user>
##$USERP4= <user>
##$USERP5= <user>
##$WDW= 1
##$XDIM= 8192
##$YMAX_p= 0
##$YMIN_p= 0
$$ End of Bruker specific parameters
$$ ---------------------------------
##NTUPLES= NMR FID
##VAR_NAME=  TIME,          FID/REAL,        FID/IMAG
##SYMBOL=    X,             R,               I
##VAR_TYPE=  INDEPENDENT,   DEPENDENT,       DEPENDENT
##VAR_FORM=  AFFN,          ASDF,            ASDF
##VAR_DIM=   8192,          8192,            8192
##UNITS=     SECONDS,       ARBITRARY UNITS, ARBITRARY UNITS
##FACTOR=    0.0002768,     1,               1
##FIRST=     0,             0,               0
##LAST=      2.2672688,     0,               0
##MIN=       0,             -773966,         0
##MAX=       2.2672688,     955004,          0
$$ Real data points
##PAGE= N=1
##DATA TABLE= (X++(R..R)), XYDATA
0@%%%%%%%%%%%%l2O4o4O4r6J28j60J92k24K58k90L52m16M80n76O72p68Q96j024
31e44J157j317J504j698J916k158K415k704L021l365L746m155M600n097N634o216
47c261O859p559Q324r172J0104j1137J2289j3567J5010j6648J8513k0676K3212
60A2291k6229K9907l4497M0403m8345N9648p7152J08209j79911O61265K75471
71H21060r73455l23292k52907N28540Q66135K08022o94099o06304l47666K54515
81e19451Q04159N20670l81156o51852m95484j9537O26240P48702K5180n52364
91A05107n86067j69051M15536O78905K81997k95443o28414m34481J94180O15109
101A77378M15184k1512m53267o13313j22820N28637N15564Q9642l00283n67433
$$ y = [0, 0, 0, 0, 0, 0, 0, 0, 0, 0, 0, 0, 0, -32, 32, -32, 32, -64, 64, -96, 96, -128, 130, -160, 192, -224, 256, -320, 352, -416, 480, -544, 613, -704, 800, -898, 1018, -1140, 1275, -1429, 1592, -1773, 1973, -2182, 2418, -2679, 2955, -3261, 3598, -3961, 4363, -4809, 5295, -5842, 6447, -7120, 7890, -8758, 9755, -10921, 12291, -13938, 15969, -18528, 21875, -26470, 33178, -43974, 64235, -115676, 545589, 821060, -152395, -475687, -728594, -200054, 666081, 874103, 180004, -426300, -773966, -519451, 284708, 805378, 424222, -227630, -723114, -742651, -116411, 632291, 657471, 105107, -480960, -650011, -234475, 444430, 726427, 430984, -197430, -631911, -437731, 177378, 592562, 571050, 117783, -495530, -618350, -89713, 425851, 515493, 215210, -352223]
111c52223l49911L10675N73959K87611q2907m36576m97297M2944N33571L95744
121D25590L4581k62305m84701k54948L43846N44324K01139j99837m28736l66094
131d47141N8741M48098L58277m9401l61013l89065j13665L02827M55369J62419
141D25446k46578l91704k29960J18086M14007L32238q0454l65668k95170j2273
151c32030K96843L83639R5376k86455l73183j55882J63823L52185K24600j21129
161B47787l47929k67044L8071L10484L01258K3722k63395l26078r8680K29970
171a51834L36029J51594j26532l04263k22925J00553L18112K17927k6316k39997
181E2348k96394o1732K51797K80584O9937j53153k89503j88484J28432K90391
$$ y = [-352223, -702134, -391459, 182500, 470111, 387204, -49372, -546669, -503725, 29846, 425590, 460171, 197866, -286835, -541783, -197937, 346387, 547526, 347689, -81047, -447141, -388400, 59698, 417975, 368574, 7561, -381504, -495169, -192342, 263027, 425446, 178868, -212836, -442796, -324710, 89297, 421535, 341081, -24587, -319757, -332030, -35187, 348452, 443828, 157373, -215810, -371692, -207869, 144316, 368916, 247787, -100142, -367186, -329115, -18631, 282627, 306349, 42954, -283124, -381804, -151834, 184195, 335789, 209257, -95006, -317931, -217378, 100734, 318661, 292345, 52348, -244046, -305778, -53981, 226603, 296540, 143387, -146116, -334600, -206168, 84223]
191H4223J57993o0209k32358k44618L692K62111K42659M4035j60443k56229j11344
202b70488J60011K61395J31199p9242k39547j93881N2149K29729J86253O684j96078
213D8184k47740o1378J62103K12106R7473j02759k39132j39585R4418K12075J57082
224A92847p376j92250k03084J028J80719J92602P4430j14358k18269r7175J10525
235h0361J87480J15886m8282j99448j73243J9305J68185J60478K8478j39948j92838
246a54308o4802J12175J78277R3271p2461j76987j16594M9471J73669J54661L160
257A79532j44148j52946k9725J13514J63984O5906j00442j66487q3765N5214J51193
268E1830J19693l4076j58245j32924q240J10170J43281M2529j05819j44212m8085
$$ y = [84223, 242216, 182007, -50351, -294969, -291277, -29166, 213493, 257528, 97085, -159144, -270488, -110477, 150918, 282117, 202875, -36672, -230553, -178404, 51325, 237578, 244262, 48184, -199556, -260934, -98831, 113275, 210748, 107989, -131143, -270728, -176310, 35765, 192847, 185471, -6779, -209863, -208835, -28116, 164486, 238916, 124558, -93711, -190886, -80361, 107119, 223005, 174723, -24725, -197968, -178663, -10478, 150000, 178478, 38530, -154308, -219110, -106935, 71342, 164613, 92152, -84835, -201429, -151958, 21711, 176372, 179532, 35384, -117562, -147287, -33773, 130211, 196117, 95675, -70812, -154577, -99363, 51830, 171523, 137447, -20798, -153722, -161962, -51792, 91489, 134018, 28199, -116013, -164098]
279a64098P8230J45152R8247m5497j44774j01535K0344J19118J23844J9584j06937
290D1678j27491l1505Q4474J23976N6614o6598j37550q8513L3798J18127R7259
301A04269n893j03558j06402j2258R2551J13351L4819p1225j14997n9154N4259
312g4238J18938P9741k2543r8528q8836M11Q9554R2587R417q1579j03670m1603
324a20349N9587J05643N8686l8217r8155p1014J7852Q7253P7656K361p6229q5284
336h0210j6478P1963R5392M0732m6684r1363n5298K6559Q0251N9760j4076p8029
348g481p4904k519O8732P8858K0285n6631q3125l9832L6340P9904N0372k1237
360D8762o8605n1713R777P1074P2404N330o1844o8326k3775L7133P3458L9897
$$ y = [-164098, -85868, 59284, 157531, 112034, -32740, -134275, -113931, 5187, 129031, 148615, 41678, -85813, -117318, -32844, 91132, 147746, 81148, -56402, -144915, -111117, 7010, 104269, 98376, -5182, -111584, -123842, -31291, 82060, 116879, 45654, -69343, -128497, -74238, 44700, 124441, 101898, 3370, -85466, -85055, 4499, 97086, 106503, 24924, -78746, -120349, -60762, 44881, 103567, 65350, -32805, -103819, -85967, 1286, 78942, 81303, 5074, -80210, -96688, -24725, 70667, 111399, 64715, -26648, -81946, -55387, 24864, 84624, 70548, -7481, -82385, -84904, -16172, 62686, 82971, 26340, -56785, -96617, -60277, 19627, 69999, 48762, -19843, -71556, -61779, 9295, 81699, 87029, 25185, -43141, -66916, -29783, 43675, 83572]
372H3572l6458o9589m0585J1729N9447N7059j0276o7330n7169j0815M1338O9391
384C0314L2322m0006n9882k3726K3299N8302M8555j3773n9703m5365L684M7317
396A338N7544J6312m2368n8858k3064K6306M9091K6836k2038n5678m3339J0661
408e7257N2905M3990J834l7034n0350j6942L7621N1839J7681j9891m1291l1953
420d8848J9054N6730L4677r603l5607m4090j4978L7963M4759M609k7572l8299
432b1205k5614J7045M8304K4715k0253l7242l2941n952L7678M5160L113k9037
444C771k7945j1751J9462M4972K1222k2569l6866k2696L493L4549L5995k266l1963
457G408k7901p562J8885L3501J0654k4090l4859j8385J2060L5473K5285n595k5697
$$ y = [83572, 47114, -22475, -63060, -51331, 8116, 65175, 54899, -12431, -69600, -80415, -39077, 30314, 62636, 22630, -37252, -60978, -37679, 20623, 69178, 55405, -4298, -49663, -45979, 1338, 58882, 75194, 32826, -26032, -49096, -22790, 26301, 53137, 31099, -24579, -67918, -57257, -4352, 39638, 41472, 4438, -45912, -62854, -25233, 26606, 44287, 24396, -16895, -48848, -29794, 26936, 61613, 52010, 16403, -27687, -42665, -4702, 40057, 44666, 17094, -21205, -46819, -29774, 18530, 43245, 22992, -14250, -47191, -53143, -15465, 29695, 32808, 3771, -24174, -35925, -16463, 28509, 49731, 27162, -9704, -32400, -28907, 5642, 41637, 39371, 7408, -20493, -28055, -9170, 24331, 34985, 10895, -23964, -42349, -30289, 5184, 30469, 24874, -823]
470h23k5682l375K6527K7754K621j9399k7427j4698J9397L5924J2228r513k2007
483A527k5753k016K8721K1368n813j6030k2379j1171K1495L1807O146j2704j9565
496d367k1434K021K9821J7070p324j6370j6778n232K1293K4410J081j4848k1180
509a1837j5966P112K5101J2907o755j5887j5894K130K1085J7313p88j1676k0512
522a3667j1126J6565K2109N710l178j2781j9200O039K2804M925m690p820k3543
535a7853j0014K3305J5783l419K77j3803j9905J1643K2466j009l295m825j9813
548b0462o02K5341J1772j658k11j6280j2486J4550J3205j76n86j2274j5445P225
562h087J4243M680M515j1284k0022L64J0006K834Q783p22j9929k566J3922K183
$$ y = [-823, -26505, -29880, -3353, 24401, 27022, 7623, -19804, -34502, -15105, 20819, 33047, 23534, 1527, -24226, -26242, 2479, 23847, 18034, 2004, -20375, -31546, -10051, 21756, 27902, 15198, -4367, -25801, -23780, 6041, 23111, 15787, -583, -17361, -22593, -1300, 23110, 24191, 9343, -11837, -27803, -20691, 4410, 17317, 10562, -5325, -21219, -19089, 1996, 19309, 18521, 6845, -13667, -24793, -8228, 13881, 19591, 16413, 3632, -15568, -9529, 13275, 18200, 13510, 5690, -17853, -27867, -4562, 11221, 7802, 8079, -5724, -25629, -13986, 8480, 7471, 4176, -649, -20462, -21064, 4277, 16049, 14391, 14180, -2100, -14586, -36, 13169, 12993, 12407, 133, -15312, -8087, 6156, 10836, 15351, 4067, -15955, -15591, -5585, -2751, 6032, 5310, -14619, -17185, -3263, -1080]
576a080Q579J1369j9579j6545J3277M619l38J6985m573k2764N196J1845m502R618
590A2107N887k3221j0485J1358J909K526J1097p893j5352K936O673L246O572l625
604C735j1685m742L706Q579Q772o75n705l408n017L616J2995k030r527nm298k697
620h386J4330Q662j0352k905p98r383N326J3114n407r034K356l619q55J2623L988
635I660p473n538k738l038N024O522j43m712l170J04O315L469L133k106q174l707
651f572M664L768J244M998l938p682M857O402l569J797j301j1311l617Q009P8
666b173k15N462m775o557M492M854k378N60m48o778n22P479M453J519J003j487
682D489k866Q94L272J064l281m047q04j351K147O516N8n194j400j690l566J709
$$ y = [-1080, 7499, 18868, -711, -17256, -3979, 640, 302, 17287, 12714, -10050, -4854, 6991, 2489, 12107, 17994, -5227, -15712, -4354, -2445, 81, 11178, 3285, -12067, -9131, -2458, 788, 7360, 3735, -7950, -12692, -8986, -407, 8365, 7690, 1985, -1423, -6440, -2824, 10171, 8141, -1386, -1391, -5689, -8386, 5944, 14606, 4254, 1349, 551, -8832, -3506, 9608, 4201, -4833, -2477, -6096, -6951, 5672, 9660, 2187, -3351, -6089, -9127, -4103, 2419, 2276, -2436, -5606, -5502, 813, 4282, 7415, 5309, -2865, -6572, -1908, 1860, 3104, 8102, 4164, -3518, 1339, 7741, 4172, 5969, 4668, -6643, -10260, -2251, -2173, -2388, 3074, -1701, -8258, -3766, 1088, -1290, -730, -1178, -7956, -8478, -999, 3454, 4973, 5976, 4489, 1623, 2517, 5789, 6853, 3572, -475, -1279, -2630, -483, 6033, 6091, 897, -503, -2193, -5759, -4050]
698d050L498m864k712K413N6K567P610L83n060M71o17q66L493K798l463j371J488
715A774J337L137K581k691l908k757k105P99Q49j056m40r16j583L199L782j309
731F93j441p76l994q50N654J296q32K374n09j840M046L192l435j866r39m170J93
748c204M712m79m9R26j908j325L975L67k933j536q82k194J630L310J291n76k08
765I17j410O93J487j705j64j035k624m25L666J027Q79M96j685k053K118N8n34
782b94J508j020k132J720L419j65N24P86k847k010J931r41j580J689j692k757
798c861K058J709n64o92M61l197p34J878N19J54J868o74K38L540J436o67P98l95
816C875k547P31R20o5J63n64j732l20P31j071m65j695k075k181J045J283N68J63
$$ y = [-4050, -552, -5416, -8128, -5715, -5659, -3092, 4518, 4901, -159, 312, -305, -1171, 2322, 5120, 1657, 286, 1774, 3111, 6248, 8829, 6138, 2230, -527, -2632, -1833, -984, -2040, -2480, -3396, -4979, -1780, 2002, 693, -748, -1524, -5518, -6368, -714, 582, -250, 2124, 1615, -225, 3821, 7013, 3578, 1712, 773, -3397, -3204, 1508, 1029, 980, 1906, -2, -1327, 2648, 3015, 82, -1454, -2336, -4530, -2900, 410, 1701, 1125, 917, -493, 200, 1687, -18, -182, -1217, -3841, -4266, -600, 427, 1306, 1802, 117, -1936, 182, 240, -294, 1214, 194, -1938, -218, 3201, 3036, 3560, 4346, 1499, -511, 1420, 479, -1101, 588, -1104, -3861, -1803, -94, -658, -1350, -889, -4086, -4820, -2942, -2423, -2269, -401, -1075, -837, 2703, 4139, 3472, 4270, 3875, 1328, 2059, 2979, 2914, 3077, 2513, 781, 461, 1192, 121, -344, -2039, -4114, -6295, -5250, -3967, -3399, -3236]
834c236j50k90J878J633Q01O18m36m13P35J679J625J300k60j685m30m45K9n45
852B408j317j881j616l26J23J054K4k112j069k93J63J341Q13L36j83J076J143
869c16K277J459M49q22k43o74J117Q08p4q84j039p37q22P84J9k166j043j829j016
888d752J160J281o50N07K82p76K348J578q61l9K64q26K05K166J215l8J0p18j165
907A191K54M41j183r46q69j193J06J821R07o21l66n73k15J95J254m44m33k25l99
926a298K014O41R07n24l19j606kn55J23K92m40p44P4J523J290l45p04p6q19m78
946a046R38J687p01k88L80K8J160J127o98j697M2j954j608K190n40j693J533l58
964a498j657K319N19k478J112L01j342K11L760l18K40K283q89L8J617l17j892
$$ y = [-3236, -3386, -3676, -1798, -165, 636, 1254, 818, 405, 1140, 2819, 4444, 5744, 5484, 3799, 3369, 2924, 2953, 2408, 1091, -790, -2406, -2732, -2609, -1555, -1531, -3643, -4712, -5005, -4842, -3501, -2688, -2352, -2535, -1459, -316, 1961, 3420, 3869, 3047, 2804, 2130, 3247, 4055, 3981, 3097, 2058, 1321, 499, 1283, 1302, -864, -1907, -3736, -4752, -3592, -2311, -2961, -2454, -2172, -2948, -600, 978, 117, 78, 342, -484, -279, 1887, 3102, 3064, 3074, 2356, 1191, 1445, 1886, 703, -243, -1112, -2305, -2199, -378, 529, -92, -458, -1031, -1246, -1051, 203, -241, -674, -899, -1298, 716, 1357, 2264, 1740, 1421, -185, -187, -742, -619, -327, -767, -1511, -1437, 86, 1376, 1031, 327, 251, -568, -1046, -108, 1579, 878, 590, 970, 998, 2158, 3285, 2587, 890, 932, -1022, -2630, -440, -980, -2673, -1140, -1498, -3155, -836, -317, -2795, -1683, -1382, -2724, -2513, 1247, 929, 1169, 3452, 2563, 2601, 4218, 3901, 2009]
981B009M92j318j798J089R04j286M17j156j862J06R58j940m61P12k376J229L277
998a004q2J73K071q25m97K738L68j323J737j54k484J631J850j259l32N01k563
1015E46k648J750n87k256J218j187j984J584J959l60l03N03j99r56K383J282l60
1032C85J115M75r86J763J659p23m85n90j281j643J380k01j062n27q07j35R53m19
1050a129r2j22j841l8R19M18O84J797q39R3J099J518j640J119N17l307O27J957
1068A740q28k83J951j298k463K217R0k256J747n72k633J345J480q20Q85J092k215
1085h21m97K085j523K45J763j406j694K036l94j22K216j285k185J684r93o69K291
1102G31m0k109J744P19k205K690R78j874r74J168r18R8K035j309j138J472j701
$$ y = [2009, 2501, 1183, -615, 474, 1378, 92, 509, -647, -2509, -2403, -1445, -3385, -3846, -3134, -5510, -4281, -1004, -1086, -913, 1158, 333, -164, 2574, 2942, 1619, 3356, 3202, 718, 2349, 4199, 2940, 2608, 3109, 546, -2102, -352, -939, -3195, -1977, -3164, -5148, -3564, -1605, -1965, -2268, -1765, -1964, -2920, -537, 745, 385, 1500, 1975, 989, 2752, 4411, 3688, 3203, 2613, 1332, -311, 1069, 868, -194, -721, -1528, -1663, -710, -1129, -1221, -1343, -3184, -3222, -2303, -1885, -1201, 596, -243, -150, 949, 2467, 827, 1946, 2463, -844, -217, 1740, 912, 629, 2580, 1282, -1181, 1036, 1126, -1130, 617, 45, -2588, -1243, 237, -583, 302, 1394, -821, -1318, 767, -756, -511, 1252, -154, -1848, 188, -206, -328, 1888, 603, -1582, 102, -891, -1560, 731, 691, -1418, 326, 1045, -1160, 1530, 2508, 634, -340, 828, -90, 8, 2043, 734, -404, 1068, -633]
1119f33m06K426j115j844j64k79q63J283J468j474K31J197j178J550Q24k70k08
1136E45O52n24J043J038l13l79K09r32l16N35m22j681N13j241p40O64M31j314
1154b232Q6K90r69O36M86J459p42Q10J2L58J274P57Q9q3m06l46M74K85m8m51n34
1175A205m79m54R9p69l33r38n79o05L33L51p0L09l70N59K11J449p2J019K75q21
1195C20N23J435q9K4J88l91o72M80L11j467o67n11o93k75Q11k74j17K94j013p51
1215b534J659K46r03M36j47K33J23J882K90l01L50m86l27L29R09j185K8R2j287
1234e93R00J212j478P27j099j119M16N37j15L43J85p36j48M87J027m13K84j047
1252f30n63O92N26l40J00Q0m21r3R04J61J86J37j415L9J094O16m18N59n09n00
$$ y = [-633, -1039, 1387, 272, -1572, -1736, -2015, -2878, -1595, -127, -1601, -1370, -173, -1351, 199, 1023, 753, 545, 1197, 673, 1716, 2754, 2441, 2062, 2271, 1339, 1023, 1558, 1136, -545, -32, -1273, -2013, -1349, -918, -2232, -2146, -1856, -2825, -2189, -1703, -244, -986, -176, -164, 194, 1468, 2225, 2314, 2231, 1825, 1479, 1953, 2238, 2190, 1739, 1205, 726, 272, 371, -398, -731, -1669, -2248, -2853, -2520, -2169, -2239, -1930, -2300, -1741, -1530, -81, -153, 866, 1141, 320, 843, 2278, 2189, 2213, 2401, 2010, 1338, 1818, 2129, 662, -5, -516, -1209, -1484, -673, -947, -1064, -770, -1783, -2534, -875, -629, -1532, -1096, -1243, -1010, -887, 995, 1285, 984, 1334, 848, 521, 850, 1759, 574, 602, 694, -593, 307, 1519, 41, 768, -331, -1450, -1034, -497, -612, -269, -84, -820, -968, -481, 546, 133, 417, -630, -1193, -501, 25, -315, -215, -135, -556, -649, 255, 416, 602, 739, -676, -637, 457, 1073, 655, 1214, 705, 205]
1272B05N63L67o65K85K9j606j51R95m63m77N17k17r20O31j16K48j28j12m24P2
1292a367Q20L33J004O38q12K57L65L21M7l30k52J67n33M40Q2j84k68j108l12j16
1312h08n95j66l84N6k76j52K10Q86N39J48p4M68O6R24M49N67q23R55r5N0Q83o30
1334B198l77q59n99n07m35N63q65n61K30q85O82K15n21k23J47J37M67O17Q38p9
1354A83o7M57Q24M28L89o38J31o70L84k77m0L50o18p56n05R5L21k75j041j33p22
1375b180P37J20M79O84j74o48J71J020l70P2L63P4j6P5K70N75o07P26j260O45
1395G56n58l31J013q74m37J72L04o29N41k19m34n0M64k01L2q1k28L73r1k92P84
1416A4L45l80kk12O1l82K90K47m23P06Om55M17P84q56K13N40p57MR67m94j57k15
$$ y = [205, 768, 1135, 470, 755, 784, -822, -973, 22, -441, -918, -401, -618, -1538, -907, -1023, -775, -903, -1015, -1439, -1367, -547, -214, 790, 1428, 616, 873, 1238, 1559, 1606, 1276, 1024, 1191, 658, 1098, 1180, 996, 728, -380, -692, -808, -1403, -1569, -1953, -1897, -2173, -2325, -2115, -1229, -690, -542, -616, -148, -82, 842, 1291, 1858, 1035, 1990, 1895, 1945, 2828, 2198, 1821, 962, 363, -144, -579, -16, -881, -1442, -1212, -2097, -1415, -1200, -1721, -1944, -1797, -1660, -1193, -576, 262, 183, 116, 573, 1397, 1825, 2214, 1576, 1707, 1037, 1421, 1144, 1104, 1454, 836, 80, -425, -330, -9, -284, -1325, -1458, -2180, -1443, -1323, -844, -160, -334, -982, -811, 209, -161, -89, 274, 348, 332, 407, 677, 1252, 645, 1371, 111, 756, 198, -133, 880, 6, -431, -259, 45, -584, -43, -262, -696, -746, -282, -483, -451, -532, -760, -387, -478, -770, 14, 359, -21, -23, -235, -174, -556, -266, -19, -442, 264, 270, -185, 232, 1016, 160, 373, 913, 156, 160, 1127, 633, 476, 261]
1439B61j06l93P04j000K04l69j60n86J042j43q07Q09n58j15L15J161n11R12q4
1458E76l54R99O88o28K0m0m2n56K50j95m69n52j5J32m25k28j1k99m28l5J45j54
1480a621M72N65J1j46L32Q89l79J170J01n56N53l8N9J03k52l55K54j75o94K25
1500E18o63p59O31j432L35J55J99l24N9L93j27O11l32P0K05M27K74N84M42m72
1520G94j61J021J06o75P3l48J32o73n95L90j2n57N10l19l22j04p0n34N13j28j02
1541a061K63M24L28N7M09j01k98K88m2Q04j57o31n04P66jJ4P0k84j07p15K88J82
1563hj50m13K8k75N46J07L34m30k04j94l2K70J44j76O23q6j89J99K93J07m20Q36
1585I10n19q38O12J38R4j68K05K75m65K15K1k97k56P5r9L19j85k90L5q0k47K22
$$ y = [261, 155, -238, 466, -534, -330, -699, -859, -1445, -403, -546, -1353, -544, -1102, -1217, -902, 259, -252, 660, 576, 222, 1221, 1909, 1281, 1301, 1261, 1219, 663, 913, 718, 249, -303, -318, -186, -611, -839, -850, -1149, -1577, -1612, -1467, -1621, -1149, -584, -573, -719, -387, 502, 123, 1293, 1394, 838, 1391, 1353, 1412, 1515, 1263, 908, 1162, 987, 293, 518, -145, -904, -273, -1705, -1370, -1215, -1016, -1340, -1281, -888, -1015, -404, -736, -666, -461, -34, 240, 824, 1266, 794, 633, 1654, 1760, 1085, 1158, 810, 942, 269, -326, 64, 52, -505, 5, -314, -636, -740, -810, -1344, -831, -959, -1061, -798, -374, -46, 11, 420, 319, 21, 309, 267, 1071, 914, 283, -221, 545, 544, 558, 628, 344, 237, -478, -190, -8, -158, -571, -543, -818, -272, -165, 169, -261, -465, -659, -691, -421, -277, -453, 170, 84, -105, 94, 387, 494, 74, 910, 391, -447, 165, 303, 397, 229, 434, 709, 244, 459, 480, 183, -73, 2, -97, 222, 37, -253, -218, -298, -545, -323]
1607c23k27k39R2J37o54O99K38n98Q64O41m77j37R46q77N26J076r43j51P8j41
1627E30J74J27j62j102J91R5n55n3m3j29m79P79q91N58M55l03m37J164L99o04
1647b86K57N17m26L90R31l73L10J16l97j61Q8m33k97N49l82m82J70j025m89L73
1667a050l56j23P92o79N42m12R63k06k4Q41o97O08P15n73K03J60M0L43n77J81
1687F91M73M4j253M22j31k4q00O1o2n92K01L77m98N47k79J00L21k84L63L05l41
1708c59N57j37M48k25J40N26l31K60l18k21M5J87o75M70m71l53K62K93m72Q1O8
1729b25l02L9k81K85M14m60K65J08K34l07k14L04l52R77j03j56l21M33k00PJ07
1750B52l31O1j2M02n2l70O23l1l44qj45Q5K3K30j011N01m41k49N83j72k28j3L22
$$ y = [-323, -550, -789, -697, -560, -1214, -515, -277, -875, -11, 630, 153, 16, 962, 85, 611, 1687, 744, 593, 671, 530, 704, 831, 669, -433, -242, -147, -702, -755, -798, -927, -1406, -627, -1518, -960, -505, -808, -1245, -81, 318, -286, -29, 488, 62, 452, 1383, 1010, 1320, 1436, 1039, 878, 966, 533, 236, 785, 403, -79, 91, -934, -1423, -1050, -1406, -1529, -737, -1416, -874, -1286, -323, -529, -553, 288, -409, 199, 914, 341, 544, 704, 744, 1087, 510, 691, 1164, 1208, -45, 377, 246, 222, -578, -517, -579, -1171, -970, -593, -1091, -544, -823, -723, -402, -686, -323, -18, -359, 198, 61, 509, 284, 424, 950, 619, 879, 561, 340, 385, 572, -103, 367, -104, -457, -195, 98, -374, -293, -225, -527, -488, -769, -484, -70, -530, -265, -157, 77, -230, -444, -140, -492, 485, 382, 226, -95, 338, 138, 145, 252, -79, -18, -30, 372, 320, -50, 573, 542, 198, 190, 45, 130, 153, 383, -628, -127, -568, -817, -234, -406, -634, -647, -325]
1773c25k01j30O29k03L75K70m97k00J068L38m96N4k33m86O65m32k59K91J74k85
1793A17J59l06n3j34k16k60J21l6k56K99o8K4K67M35k25J38O5l3N30j10m9N37
1815I46o3j42o3P88j191M68l94j78k59J0n8j75l25L66l30k00P4K3JM91J19j78
1837b70K10L7K31l4nJ30P27l11k56Q0P54p67K42r0m20J60M7J2l43m40n2K28r46
1860a076L60L71k91k93O79l76J85O3m90J241o36K50j9N77l08M67m43k18O49k97
1880C95K35L17j251M23L95k08l14l5l01K33J7J64n06K26k49l91N67p70P82L55
1900H4l03j1J36K6K86m2m65K54R90k05N21n25m34k49J17r8K98k44j11k29K93k60
1922a71K53m54k41j6J08j14J80k09j36J027n38J52K96l56J68Q8N4K73l67OJ07
$$ y = [-325, -526, -656, -27, -230, 145, 415, -82, -282, 786, 1124, 628, 682, 449, -37, 628, 196, -63, 228, 402, 117, 276, -30, -83, -217, -433, -693, -572, -608, -864, -565, -633, -609, -342, 93, -132, 6, 71, 38, 568, 458, 409, 946, 883, 741, 678, 1466, 275, 743, 349, 171, -88, -78, -136, -311, -636, -270, -600, -800, -726, -703, -702, -211, -92, -270, -60, -23, 208, 174, 169, 299, 1026, 715, 459, 539, 1293, 526, 768, 678, 258, 418, 465, 477, 134, -306, -358, -130, -1076, -716, -345, -636, -929, -250, -626, -441, -378, -868, 373, -263, -13, -32, 545, 237, 704, 261, 43, 692, 395, 630, 947, -304, 119, 514, 306, -8, -43, -344, -111, -94, 70, -436, -210, -459, -850, -283, -1053, -271, 84, -219, -230, -94, -68, 218, 176, -289, -35, 955, 750, 1271, 746, 312, 63, 180, 82, 380, 136, 25, -204, 89, -171, 82, -372, -613, -629, -521, -635, -455, -664, -800, 227, -311, -159, 137, -219, -51, 37, 91, 364, -3, 3, 110]
1943A10P5K73J24j86j1K23k68l52J38k65j21k31L17J65r7j48m67j84L27K98j63
1964d43o6M23m92Q48j60m4j04O91k32j46N6M26o96L68L31l59N1j68J93l42r0r4
1986d9j93M3j29J99k12k1k7l5K72l17K66L16m33j77K53L20N29p05K04R22p23K80
2008E83m11M78j5j97k15K24M5n92j7m8J84o56R15j79q5q41O49n10N7J07K49N3
2030b22j70P4J4k6Q30k76J2N87n94L65j83m27j51P71l57k74P72p65n5j01J52M5
2052B1R8l62k10j30R9l7J67l81K66l66Q92J69m15K31J87J97M4K8K9K73o35M10
2074E75k62q8l58N43k25L64l47O9q60J33J85k77J32k03L8J20m71K71K90R7o02
2095h76J133J03m35k85N67p8P1K72K00n85jJ20M40J0m32J41j77M2n92J93k33k1
$$ y = [110, 185, 458, 582, 396, 385, 608, 340, -12, 126, -139, -260, -491, -174, -9, -106, -254, -721, -905, -578, -280, -443, -509, -86, -578, 270, 110, 66, -38, 653, 421, 275, 331, 757, 61, 429, 760, 401, 452, 284, 477, 135, 45, -49, -242, -199, -328, -129, -341, -362, -389, -424, -152, -469, -203, 113, -320, -497, -244, 76, 605, -100, 104, 1026, 303, 583, 172, 650, 635, 438, 223, 447, 492, -100, -117, -165, 19, -637, 278, 99, 14, -827, -178, -688, -631, -524, -275, -222, -392, -318, -304, -330, 500, 224, 236, 823, 229, 594, 411, -16, -167, 604, 247, -27, 745, -20, -75, -176, -24, 21, 119, -243, -453, -583, -484, -521, -354, -735, -469, -835, 57, 226, -189, 42, 229, 426, 470, 498, 527, 800, 165, 575, 313, 225, -133, 410, 185, 549, 202, 271, -589, -456, -271, -548, -416, -619, -581, -461, -932, -661, -371, -274, -876, 257, 360, -75, -360, 207, 129, 200, 472, 672, 87, 86, 206, 646, 656, 224, 365, 188, 230, -362, -169, -402, -423]
2117d23n5J26n26M25M86o29M93j19n4j91N31k46K32q2L57J75k78NK09L83k12l11
2139B96k02L52mk25l4o6K63n32n36P78j42k9n10k5n4j11j39P40Q5j64N09o43J70
2162b23L59n99K41q4Q07k88j14K31m32O06l61N47o28K19k40R8j87K27M0l16j48
2183b45n06Q3o7Q91o60j49K76L01J7j09j9n76J277r24N63l5J06m22O10L2k0j74
2205B50r3j33M37l07n0J46O3k25j32m56qL93RK7k69l41K42J22j11l4K82N71m71
2228h8Pm0L61j67N77J7m07J15J71l91J33n6L97n78K26j66l50K6k34O35o65k43
2250g20O09q83O32j68N85k57J09n83M51Q54k70j74L49n9K33j136N66K33J39j4
2270D96O9j43k58j4k98j7j88j55J91K4m03N51q17L73K19L68k87l21P63L0P6n39
$$ y = [-423, -478, -352, -878, -453, 33, -596, -103, -222, -276, -467, 64, -182, 50, -32, 325, 500, 222, 227, 436, 819, 607, 296, 94, 446, 442, 217, 183, 117, 380, -152, -688, 90, -52, -81, -591, -616, -670, -781, -920, -180, -95, -259, 250, -393, -223, 136, -463, -222, -306, 501, 213, 99, 330, -102, 504, 143, 690, 62, 281, 41, 139, -48, 179, 219, -97, -245, -751, -668, -735, 156, -504, -653, -377, -76, -59, -168, -187, -763, 514, -410, 153, 118, 224, -198, 412, 444, 424, 250, 157, 24, 461, 154, 104, 250, 313, 88, -44, -500, -508, -115, -106, -79, -348, -689, -447, -325, -436, -470, -188, 383, -88, -81, -121, 240, 73, 650, 667, 260, 375, 546, 155, 288, 232, 629, 51, 277, 111, -239, -213, -447, 188, -477, -720, -111, -994, -362, -530, 55, -202, -93, -676, -225, 629, 359, 185, 534, 475, 708, -428, 138, 371, 510, 496, 565, 422, 164, 150, -148, -165, -353, -508, -317, -293, -696, -145, -962, -589, -370, -2, -289, -610, 153, 183, 259, -280]
2292b80j57R99J22l84m36O73k38N11k84k95j80K7O2l7k45Rj07N43j56m80J7r3
2314d09O82m93J77j76j42L33k89J56j24K11j38O54l79K12K58j08k10o4Q5l84k22
2335c70L38K11K70l10k22J86k37j4J66Q0J04l31k38k25j50R73j83n39L20L12p2
2356F9K3j07P8J30p4M7k10M2J84l88N33L08j1o61K18o3k32J59P6k74l97M8M87
2379a5j74J68k4m99M2%M72j55n20K92O57r8k86K57n2R4R5N42k40K16p67J82m64
2402b77O88l1n8n13j26m2L62n30L45r8l23j35P34n44M46J27j09J20J06Mj73L56
2424C29j35l23L48q5nL73p30L16p6O30l61m38J92Qj68j56J35jl01J6J040r86N96
2447B18m19M8q1j0K94O2k03Q2K86l3J39l21N14k75n0K68m75j10k49O69m94j78
$$ y = [-280, -437, 562, 684, 300, -136, 537, 299, 810, 526, 231, 51, 78, 140, 103, -142, -133, -240, 303, 147, -333, -316, -409, 273, -220, -43, -219, -361, -28, -317, -161, -285, -74, -212, 442, 63, 275, 533, 425, 215, 151, 236, -148, -370, -32, 179, 449, 139, -83, 103, -134, -148, 18, 98, 202, -129, -367, -592, -742, 231, 48, -491, -171, 141, 69, 92, -15, 63, 193, 119, 166, -44, -2, 182, -206, 327, 635, 624, -37, 181, 118, -114, 45, 121, -153, -550, -502, -15, -189, -21, -45, -544, -502, -502, -30, -185, -705, -413, 244, 146, -140, 117, 65, 159, 254, 796, 556, 772, 5, 187, -277, 411, 380, 322, -191, -317, -359, 3, -527, -182, -280, -603, -738, -4, -548, -102, 25, -84, 36, 142, 146, -27, 329, 194, -129, 219, 134, 129, 502, -228, 88, 12, 642, 281, -157, 35, 43, -125, -281, -146, -147, -448, -432, 608, -378, 218, -201, -153, -234, -244, 50, 112, -91, -9, 277, 244, 383, 62, 576, 301, 251, 519, 44, -66, -315, 354, -140, -318]
2469c18J52k16L3L30Nk23M9n24P7J30k6M77r5L47N5J85l04J68J20p04O75q2o07
2492b96Q27o65N39p06L14J9N85o25L06n9m02M41m84L79n61M29K94k48m69m0K4
2513c98Q6J75K6m17L62J6P46n47o1R1J53l55O67l21K63m02k72K08j98n1R90r12
2535a51P20l35m71j96K26j43M33l58N3L15l42r9L35K00k55m4P4k2m3J90LQ0J02
2558B72l07L52J02o73L36L46j90k64k23O54p07q9M88j40p6l04k39N11K88j64p00
2579g27J203n32n72R26k29J13r7j2l01Q44J14r43J240j262N79q1J33q25K73m33
2599e89L05L14N4o49Q89p61J15Q08r17O00o62K69q1j78P36o73O38L17l45n84O68
2620B74J73r6J69m56m09Q35n59J88n34N09k92K54L3j93k58K12o13O55j14m03K56
$$ y = [-318, -166, -382, -349, -19, -14, -237, -188, -712, -635, -505, -531, -54, -149, 198, 253, 438, 134, 302, 422, -282, 393, 311, -296, 531, -134, 405, -301, 13, 32, 617, -8, 298, 239, -163, 278, -206, 173, -388, 41, 335, 87, -382, -422, -398, -312, -137, -111, -528, -166, -150, 596, 49, -12, 79, 232, -123, 544, 223, 486, 84, -188, 20, -178, -229, 761, -151, 569, 234, -237, -433, -207, -350, 83, -275, -222, 93, -249, -348, -13, 187, -68, -112, -38, -60, -103, 87, 90, 170, 272, -35, 317, 419, -254, 82, 428, 238, -26, -249, 405, -302, -391, 97, -43, -119, -423, -662, -151, 137, -27, -727, 476, -56, -628, 298, 69, 182, 85, 73, -228, 616, 730, -213, 1027, -235, 344, 263, 396, -429, -156, -589, -284, 30, 84, -565, 324, -437, -322, 486, -431, 169, -493, -224, -305, -483, 253, -420, 218, 535, 190, -394, 274, 447, 351, 520, 64, -345, 490, -69, 119, -415, 94, -198, 56, 89, -104, -362, -150, -763, -108, -222, -625, -369]
2641c69N4R2M82n33J56j85J27K28J50j45L72K09l32j51j5J74P3j3k60K68j12l79
2663a09j17K83n03K91o1M20j28j88l23M43j24j87K56j44n0o4J05M62j42p2r3k33
2685b78N40j61k75J53J34N92n95k45M90j36J66l89m0K07kN02r64L91l55p8M09
2706F6l96N25j15q6K05n56l7K83K40q2l38O54j85J26k44k06M85Jk48l32K43J43
2728A46m48J08L43j73j43j49N9N43q19M13j95p5N3l9L71j19M93n44r4R11k45n22
2750a25L49j65R54r55K9K96j53k88Q27o88j45j50K44J65o54j5K16J2M62k93j12
2771a89L5J00k29N73n12l57N06pJ48P3l42M20O5j15j83j05j82J84N89n20P3L90
2793D15j61n93J05J53o5R0l38K40L94r60J14O38n83Q8L07J83J13l71L69j6j89
$$ y = [-369, -315, -223, 259, -274, -118, -303, -176, 52, 202, 57, 429, 638, 306, 155, 140, 314, 387, 374, 114, 382, 270, -109, -226, 57, -446, -155, -216, 204, 76, -112, -435, 8, -116, -303, -47, -191, -241, -305, -200, 262, 120, 48, -45, -278, 262, 101, -174, -21, 113, 705, 110, -135, 355, 219, 385, -4, -44, 163, 161, 663, -301, 90, -265, -343, 66, -330, 195, 80, -6, 199, -357, -394, -111, 129, 47, -291, 363, 178, 304, 60, -146, 339, 340, 92, -240, 3, 146, -302, -194, 149, -24, -167, -316, -257, 286, -533, -120, -315, -390, -337, -376, -5, -124, 369, -175, -269, 642, 397, -125, 224, 59, 1013, 58, 87, 383, 230, -58, 769, 81, -64, -214, 30, 195, -459, -474, -258, -246, 216, -77, -189, -154, -54, -283, 290, -222, -579, -73, -80, 68, 141, -201, 219, 284, 169, -14, -119, -301, -117, 472, -48, 25, 415, 254, -339, -234, -81, -146, -56, -394, -154, 240, -720, -606, 32, -551, -463, -156, 27, 140, -231, 138, 122, -67]
2814f7M47l38K68l16K35l76O98o03O16n04k4j27K62L17r14O2m2N47l95J48j21
2835b27Qj5j54O4N68q1l16M41l02n69P76l55K55m3j44L52j11K92r53L43N42p40
2857c69P8P24j29o46m2M03J14p23O52j95J69k20J31k59P67j426Q87N21k24j07
2877A06k15n0j23K35l1n6Q8j93P07j8o05J89l54M04j07j83j47L73rk35N43k10
2899A09j88k02K85k45N04L4p29L65J56j94J97Q4l03K85M98n36L46j74Nj68N65
2920F94m28n50J02L75j57o45L07Q82l97k45L8K75R5r39J072j28l21J71j47l2r2
2941g0J91k25K15R0j16k85K62l46N39k38k80P68l58l7o48O63lm31M20p26M89L50
2963B24j53l15K64j27q4M78o89M4O85k92k86K38j94J65K07k30J90L66m61o05K00
$$ y = [-67, 380, 42, 310, -6, 229, -147, 551, -52, 564, 60, 36, -91, 171, 488, -426, -364, -406, 141, -254, -106, -227, -219, -234, -388, -324, 244, 163, -153, 288, -14, -583, 193, -162, 93, 50, -94, 258, 147, 439, -514, -171, 371, -369, -291, 433, 304, -342, -384, 19, 133, -590, 62, -133, 36, -184, -53, -312, 455, -971, -84, 437, 213, 106, -109, -159, -282, -47, -78, -134, -46, -239, 468, 450, -155, 34, -320, 84, -23, -206, -353, 20, 11, -224, 319, 109, -79, -281, 4, -241, 263, 297, -432, -67, 89, -105, 92, 176, -127, 158, 656, 120, 466, 292, 297, 129, 694, 266, -284, -182, 193, 36, -609, -302, 580, 183, -62, -24, 251, 346, -593, 479, 351, 30, 201, 54, 22, -70, 121, -104, 111, 201, 85, -200, 62, -284, 255, 17, -263, 505, 147, 110, -538, 125, 122, -309, 111, -615, -126, 224, 71, -244, 20, -107, -191, 287, -402, -358, 327, 35, -251, -13, -207, -42, 165, -65, 125, 491, 30, -575, -375]
2984c75M53J66k15L06J06p26K57Q9k18j30L91J20n13k4J86j68l83N26K4k3r1J18
3006a24K65mj61L27j33M12n3n99n1R5L20m45N8j21M63L5m67j21o8j58K2J40Q49
3029D81q02K84J38k99K56n6J69n04O77l98o09R52j01l70J56M52l59pM53l40k97
3050a24M25l44M6k28L38n12K01P0j39K50j00k23K51m4J25K75l83l81K42J92l4
3071i7j54j15M72L7k96N93j58k18J10l11J40J83m80j86M41k2Om01J14K73O3j74
3093a80L8o44K57Q39l80J68j60j08N67k44k48O1K04j70k21P65j95n75Q61m61j69
3114Ej39l7L43q61M23O6N36J7m23l77M97m75L38o8o5J88N7k31M3Q44o56QM07l81
3138E9j15L49l99K48k55K1N99q01L0r1N83l10J21L99n47K87j22J82n68M78n08
$$ y = [-375, 78, 244, 29, 335, 441, -285, -28, 61, -157, -287, 104, 224, -289, -313, -127, -295, -678, -152, -128, -151, -242, -124, 141, 137, -24, 303, 170, 582, 529, -70, -121, -26, 294, -151, -93, -214, 249, 284, -183, -304, -372, -530, -508, -368, 481, -321, -37, 101, -198, 58, 2, 171, -333, 344, -54, -663, 289, 188, -182, -26, 426, 67, 60, 513, 173, -124, 301, -43, 3, -225, 113, -399, -198, -128, -267, -17, -117, -340, -89, -133, -8, 267, -116, -497, -255, -63, -97, -251, -366, 106, 143, -153, 440, 282, 64, 174, -137, 3, 186, -294, -480, -39, -61, -55, -456, -342, -69, -6, -180, -142, -786, -529, 310, -70, 98, -62, -170, 397, 153, -95, -34, 170, 0, -221, 544, 349, -226, 635, 174, 5, -134, -171, 172, -689, -266, -200, 336, 353, -70, -447, 50, -425, -87, -155, -220, -32, 25, -206, -163, 681, 25, 33, 440, 59, -56, 293, -106, 142, -113, -92, 507, -294, -264, -355, 228, -82, 39, 438, -109, 178, 56, 238, -330, 148, -360]
3159c60L24k14l98N74m43N50L20j06M1k13p6J15k11J36l79K48J43m36K26j94J30
3180b23N61o26L69k68m0N9P5K25l85K89k60l02N42j36k88J48K19J69m7K25o46
3201c40K71J16J94J56m10J64m12M01j25l88K76K08k36L72k33K1K35l78m18L62
3221a64J09j66Rp3J75k91J32N50j32j50Q8L3k06L69l37r6J55j97M09J40n60M69
3243B66n3j7L17k45o74N42j48m8K27k92L76m69L53J32m71j75M49l80L61J54K14
3264D19j011M99Q37o93K01l6J77m29M5r5o8J76j44K62P7L45m45l42L02j26N01
3285D52k43l05k76N5m02N40o3J46K18k79L70o38N98m47K76M6n5K43k16N83l07
3306B96o26M34q4R7l16K31J60m53Q5K08l31J13L29k57K28k47K90p9l5j40N49l71
$$ y = [-360, -36, -250, -648, -74, -517, 33, 353, 247, 288, 75, -1, 114, -97, 39, -340, -92, 51, -385, -159, -353, -223, 338, -288, 81, -187, -227, -168, -93, 132, -253, 36, -224, -526, 16, -120, -408, -260, -41, 128, 81, 306, -340, -69, 47, 241, 397, -13, 151, -261, 140, 15, -373, -97, 111, -125, 247, 14, 35, 270, -108, -526, -164, -55, -221, -212, -285, -110, -401, -269, 281, 149, -1, 87, 120, -86, 283, -54, -150, 5, -192, 217, 357, -203, 266, 213, 196, 513, 268, -406, 136, -12, -60, 167, -125, 251, -218, 135, 267, -204, -379, 70, -310, 51, 205, 419, -592, -93, 744, 51, 252, 216, 393, -36, 9, -86, -154, 22, -122, 140, 217, 562, 117, -225, 77, -49, 452, 209, -96, -372, -317, -719, -179, -242, -96, 122, -157, 213, -425, 173, -274, 2, 48, -7, 236, 20, 603, 296, -330, 104, 20, 117, -199, 32, 192, -261, -176, 32, -299, -186, 143, -114, 114, -133, 157, 78, 43, -97, 452, 81]
3328H1L78l08k60k74O60j18n01M09M66n16M27m85j65M41m86J34O44p55M93m64
3348a99J08P2K92k13K4j03L33N3k40l46O9L48K55o19J10K90L57m20m21N73n29
3369b06L73l66J7PJ41J7J32Nk65L40k52k3M15p93J52M14r22J131n32n73O75M61
3391C48l76q8K9N09P2p22P63m67m79M97j29L02k41j5R5P4j50l03L73M3l74%J46
3414i3M3J46l45M76m04K78n20N8N81L1J54o04k88K39M42n63M93K65o88K14L46
3435B61k7p5J13N7o6m90M07n21N37kl71m4R71q66r0p9L83k39L79m56M52l50o27
3458g43P14M9M36n93J74J26P0j98J86q3L53k46o35L41k85N46L8l74l20K72J52
3479b0L6k17J25K04k6m01J49j38L72j15J30m8K24o75P71n47J11J50k14M82l32
$$ y = [81, 459, 151, -109, -383, 277, 159, -342, 67, 533, 17, 444, -41, -206, 235, -251, -117, 527, -228, 265, -199, -91, -19, 273, 60, 84, -19, 314, 367, 127, -219, -150, 198, 453, -166, -56, 234, 591, 171, -250, 323, -206, 167, -199, -182, -175, -34, -17, 115, 120, -145, 195, -57, -80, 335, -458, -306, 108, -814, 317, -215, -788, -113, 348, -28, -116, -87, 422, 494, -228, 535, 68, -411, 86, -43, 259, 18, 3, 98, 172, 22, -281, 92, 135, -239, -239, -93, -50, 96, -249, 227, -177, 101, -419, -361, 220, 251, 405, -199, -487, -248, 194, -369, 124, 389, -299, -85, 261, 234, 159, 272, 329, 263, -227, 180, -341, 196, 194, -177, -221, 750, -116, -206, -285, 98, -141, 238, -218, 234, -116, -743, -29, 20, 456, -137, 37, 163, 233, 35, 221, 138, 491, 245, -390, -49, -334, 212, 250, -124, -444, -172, -20, 16, -201, -76, 128, 102, -299, -150, -288, 84, -31, 99, 51, 275, -400, 371, -176, -65, 85, -129, 353, 21]
3500B1J30M40m50K61j60J25l00j59Q0oj93J65j9m75M74m49K34J08L22l90N91n49
3522a99L92r5k08K15L08n94P62o94K26o3p7J19q2K85K42m09K93l70k3m3j69q5
3544b69L33N2k82M9L2Q6m36K80J69J8k8l0m09N86R2j1J80j84p2o1k01J90L14l48
3568E0J06m41P70m69k53M2l47J86N11k37K40R5k38L73m50R7k63L06l66L48l83
3589c23O81l64l06K62j40N1M1j83P76l15k52N5m7M6J94j7o64M96p1k90K81J44
3611E5J3O8l45M64l74m20M17N4J52q0j37K39J00p67P61l96L17K82r1j89J21n09
3633b65M54l31k50O78j09o23N89k06l47L40j5J32m90L58j11L32r6m82J84P58l01
3654A99k0n5K46j33m23K22m90N78o4N32l11n73J16L50n20N2M64L01m19L05n35
$$ y = [21, 151, 591, 141, 402, 242, 367, 67, -92, -12, -18, -211, -46, -65, -540, -66, -515, -281, -173, 149, -241, 350, -199, 193, 98, -110, 105, 413, -181, 581, -113, 113, 50, -27, 92, 10, 295, 537, 128, 421, 51, 28, -15, -184, -269, 64, 116, -166, -117, -85, 1, -435, -155, 14, 32, 4, -26, -435, 151, 243, 232, 412, 228, 156, 95, -106, 84, 398, 50, 156, -285, 485, 16, -237, -195, -542, -356, 155, -82, 158, 253, 15, 388, -62, 35, -228, 78, -288, 60, -323, 358, -6, -312, -50, -190, -139, -98, -281, 495, 180, -72, -17, -64, -18, 176, 159, -505, -9, -80, -370, -89, 55, 68, 136, -209, 255, -119, -539, -122, -68, 84, 4, -133, 106, 206, -561, 200, -196, 121, 403, 312, 123, 244, -265, 189, -142, -392, 286, 177, -446, 143, -63, -410, -70, -85, 47, -443, -85, -196, 136, 40, -442, -258, 500, 199, 179, 124, 370, 237, -186, 36, -454, 124, 60, 592, 281, -292, -176, 174, -346, -294, 170, 471, 52, 357, -178]
3675a78K30j33m2j67j89J89N50q06L15N04q33M59J41R2j71k2o3q9nJ08N37l80
3697D7J62j14k58Q16n46j0l08k27O79k94l06k4M50J50l12J44l17M51m88J99l83
3718d89O19N1L23m45J32j90M0L20Q0n10M04o10P66k16n58L65K74j82m26K78M22
3739D48j63n09L38P32j159J39K43p47Q26k64J93l88M22l56l9L22k11j64M29L00
3759C92n17Q9K68J39m92J14N34l25j25M42n92M7l67j15l07P88Q6n09j4Q80k82
3780A34P6j03l76J02n3k7K50R0RJ72m92O21l20j11K77n72K73M9N40k36o30K11
3802a16M1M70l82m4j57m71M08L15k90K6k60M88m49N44j30P3J36j64k89M52j81
3823B0j3J48m45J71m62M10L03J36m23L00l43N0J57m18M96n58o5L85J7M36j69l88
$$ y = [-178, 52, -81, -123, -290, -479, -290, 260, -546, -231, 273, -560, -101, 40, 132, -39, -61, -124, -213, -218, -110, 427, 47, 209, 95, -163, 653, 107, 97, -211, -438, 241, -53, -359, -383, 67, 217, -95, 49, -268, 183, -305, -106, -489, 130, 181, 504, 59, 191, 1, 41, 361, 441, -69, 335, -275, 491, 275, -283, 82, 356, 174, -252, 26, 448, 285, -224, 114, 846, -313, -174, 69, -678, 148, -116, 77, -311, 111, -245, -284, 38, -173, -337, 92, 392, -125, -36, 232, 371, -121, -7, 527, 202, 77, 519, -73, -26, -393, -508, -815, -27, 59, -450, -464, 416, 134, 210, 107, -269, -167, -220, -247, 3, 93, 102, 274, -218, 403, 83, -28, 249, -323, -50, -1, 539, 303, -327, -116, -75, 395, 13, -31, -188, -659, -251, 64, -226, -200, -460, 28, -421, 123, -7, 66, 202, 38, -251, 201, 20, 7, 155, -290, -119, -581, -171, 132, 268, -155, 145, -198, -148, 9, -409, 87, -471, -536, -151, -134, 302, 133, -255]
3845b55L94l11L5K77k03j32J75K58k42J92k81N67J4j39k61j36j80p8M64k55L02
3866B05r9p4o5l9M04m80M06n76K16J1j02j73L13j59M34n41J97R1Q4N88m92J39
3888B88j84k05L76p84M08K50n00L18K00k53L99o70N61K67m72N4k1l73L24o98Q77
3909A62r8o68M14j03J59K88j34M2R35j041m10O10l16p8N53j81l76J12m86Q65m34
3930a85k82L07q9k08L56J26l3n21O07k62m07O90n3k18M49j48Q5k15M67q62P39
3951C43p23N88k35l7N38o09N86l87q1m58R50q91L98L04n38K69j22l43K33K16m84
3972d83N58k78K18n03M45k71M18j84k4P3L17l88k55J64K16j41L78l70K16k86r
3993a89L94q6j19K82k88o33N51k2P1m0J46K69j068J228j73r8j28K89j87k30l78
$$ y = [-255, 139, -172, -137, 140, -63, -195, -20, 238, -4, 188, -93, 474, 488, 349, 88, -48, -228, -306, 158, -97, 205, 106, 32, -33, -72, 332, -148, 258, -318, -102, -91, -193, -366, -53, -212, 222, -319, -122, -31, 53, 641, 149, 288, 104, -101, 275, -509, -101, 149, -351, -33, 167, -86, 313, -357, 204, 471, -1, 53, 32, -341, -17, -715, 162, 64, -604, -190, -293, -134, 154, 20, 62, 997, -44, -454, 156, -160, -238, 315, 134, -242, -130, -616, 249, -185, -467, -160, -249, -457, -101, 25, -8, -529, 78, -184, -591, 99, 46, -172, 277, 129, 214, -1, 466, -396, 343, -380, 208, -27, -64, 474, -135, 451, 64, -17, -475, 475, -416, -18, 286, -252, 17, -105, -448, -215, 1, -483, 75, -203, 15, -488, -43, -314, 104, -80, -104, -31, 286, -102, -357, -193, 23, -118, 260, -110, 106, -180, -189, 205, 119, 0, 282, -6, -639, -88, -110, -39, -79, 67, 336, -732, 496, 323, 225, 97, 386, 199, -31, -409]
4014d09P27n47K97K70p04N75n76R79q73R9P95k45M5n54J74m99K72O7K18R7k74
4035f6K27J47q71Q55k58J25k5j93n14N56J33l9m13Q5l14O11L19J51l00K7j68o5
4057A0Lj26O70k76J39K68q01K46q76M82L2J88j23l0M48j048Q83M3l29k6Q8l50
4079d85Q73m25n72O59k87K27O8k13L13l6l39M49k70M5m31K35j43L37p2k92m5O41
4101B37m10j73M93r00P59M40m33k68J49K13m2p16O98M1q8L95K20J63o28p6n9M48
4123D63k00m29Mj25l7O23j40j09M7l54J58l70L69k14K35k16m74J037l30O28k38
4144C28p7L93n18l2N4J44j60L78p74R7J38J47m0K5j13L79n67K15k14j5j50O51
4166B89l91k66N56Q4n63j19j9N34J9q05M21M94n22L38L54N7l73m31P16l42N42
$$ y = [-409, 318, -229, 68, 338, -366, 209, -367, 612, -261, -162, 633, 388, 433, -121, 53, -446, -174, -107, 111, 208, -66, 161, 308, -563, 292, 34, 159, 134, -59, -573, -17, 116, 77, -336, -251, -565, 46, 365, 516, 216, 243, 75, 10, 13, -113, 557, 281, 420, 688, -113, 133, -743, -261, -229, -41, -164, -194, 254, -794, 89, 132, -197, -223, -135, -485, 388, -37, -609, 50, -237, -10, 58, -155, 158, 122, -217, 232, -38, 7, -424, -189, -332, 5, -67, -359, -404, 237, -173, -346, 147, -753, 6, 446, 13, -255, -106, 107, 65, -651, 47, 88, 0, 395, 615, 778, 150, 74, 15, 463, 263, -166, -162, -287, -324, 299, 159, 50, 97, -257, -99, -469, -100, -314, -79, -295, -769, 268, -62, 566, 328, 251, 644, 126, 94, 148, 292, 132, 510, -264, -167, -29, 118, 78, 103, -10, 369, -198, 17, -197, -212, -362, 289, -102, -368, 188, 272, -291, -410, -429, 105, 124, -681, -260, 234, -288, 50, 404, 461, 88, -343, 373, 31, 573]
4187E73o11J3N9j57J42L17m95q1L10j6K06l61O48o77L02l09K1K14M0m7J94M0l73
4210d8k23K06J28j22K63k37L3k52L75m15K25J27j84L36m70N35k66k3k46J29o3
4231a92L6j23m8L93k08K36L01k61L09m21rK18j56n22L96p7J86M34j99m0r8j13
4253D2J43l17k54N63r2J02m17j86M90l29J99j41l4O86m63j47j03N22j59m52K59
4274h8k8J90L01q1k47j69Q27j030M06J51k87m8J57l00L12m5q0J4J90k18J74pm14
4297c20J86K06K67m63P3j83L58l26K79N19l97k1J43q7m34p2M91K72q19J33J35
4318f0J3M26p45J2N62j37J5L5m83N02k09k21P77j068K42O16P4o2m0r6k46J25m72
4341d40J59L98n1m05O01R0m00Q6k67L11n74N34j7N1m02O47m50L27m73J26M5l4
$$ y = [573, -38, -25, 34, -123, 19, 336, -159, -240, 70, 54, 260, -101, 547, -130, 172, -137, -116, 98, 138, 91, 285, 325, -48, -271, -65, 63, -59, 204, -33, 0, -252, 123, -292, -67, 60, -124, 212, -258, 277, 11, -12, -258, -129, -192, -156, -279, -327, 66, -142, 94, 395, 134, 443, 22, 13, 231, 75, -447, -51, -128, 58, 492, 293, 253, 155, 42, 185, -132, -386, 177, 85, 187, -230, -416, 74, -255, -56, -197, -231, 455, -8, -155, -258, 264, 105, -347, -88, -116, 74, 375, 294, 47, -122, 705, -325, 81, 232, -55, -103, 54, -246, 66, 21, -59, -45, 145, -73, 101, 94, -320, -134, 72, 339, -124, -51, -234, 124, -202, 77, 596, 199, 178, 321, 234, -200, -272, 219, 491, -328, -195, -60, -47, 379, -366, -354, 208, 71, 86, 121, -362, 140, -69, -290, 487, -581, -339, 277, 351, 289, 249, 153, -93, 32, -440, -281, 117, 66, -339, 262, 352, -48, 38, -229, 82, -492, 42, 25, 76, -326, 321, -129, 198, -275, -149, -104, -138]
4363a38P3ol13N22J96o86m7O96j69J5M3o15K47K88j92K22L24k3o76lM26L07j71
4386C20n07J17l30L09O7k20O52q87N61n8j60j65O05l35n2j57J01M41j067L04K73
4407a88M92l15j39K29j90m08O12L86p73J16J98j15M0o9K43K07m47Q9k70Q07m16
4428H9J26n58L76J08j70J73j96j57K1J30n9P30o39J31J21J79o53M61O4j53R6j83
4450C7P9k64K92q1Rk90j07j3M03N7P42n86l42M6J51M31l98j03N1j68K45k76L12
4473B27j06j54J10%n30J18M09k17k02N30j34L8k02nl56M28j08P11n15L28j40m41
4495b11M13l78J73n9%J28l22M72j10J54n8l92J01k5L56n89K25J32r4P2J75o6m21
4518c24O03j84m86J103p58L22n72R0P86m80l32L76K76MJ53n75J24l97j88M20p5
$$ y = [-138, -65, -71, -384, 138, 334, -352, -399, 297, 128, 143, 186, -429, -182, 106, -86, 136, 460, 437, -239, -242, 184, 491, 320, -187, -70, -400, -91, -24, -244, 408, -479, 82, 24, -136, -301, 304, -31, -83, -240, -139, 302, -765, -461, -188, 304, -11, -150, 79, -111, -519, 93, 479, -294, -178, 20, -95, -55, -124, 119, 326, -121, -32, -302, 505, 89, 215, -343, 33, 141, -29, 144, -52, -209, -188, -58, -117, 613, -26, 105, 226, 405, -248, 213, 277, 124, 220, 37, 116, -148, 144, 63, 72, -218, -325, -338, 65, 122, 864, 278, -64, -18, 133, 564, 166, 63, 114, -54, 191, -85, 227, 121, -33, 77, 77, -453, -335, 74, -143, -345, 185, 51, 89, -113, -118, -474, -46, -154, 557, 42, 370, 230, -211, 202, -176, -3, -62, -62, 66, -256, 216, 106, 260, 202, -190, -89, -114, 242, -347, -122, 10, -84, -12, 163, 97, -324, 279, 95, -391, 712, -46, 276, -296, -206, 580, 100, -232, 144, 420, 424, 577, 2, 126, -271, -459, -39, -114]
4539a14j53L4k20L48n1p0P41o67n6l96Q13n00K16J06L86m68lj7J68K11l22Rl37
4562c42J52j52RN71j1l04J80j48J00q1L71rp61J333q71q7k23M07p32J96P28j0
4584C16l84l82O26j57l89J50K47o3k91j49P44k47M6o12Q95l5l62J96k57n7O84
4605E19n85J16M27k66Q8l21j75J5RN3J079q70j87j98L23o3k56J79j51M63j15k21
4627a37l99K25O74j09m85J64J01j59L56o52L49l71N37j38m47K51N69k17k61N40
4647C91J6m14K59o32n77R03L62n25M07k97K93J96o89K30l82N17J33k45J77M81
4667F04j53J02l92L93m82o1K39l88J36L63n35l39M07L17n13R4J02J15K00n47O04
4688B66q22N77K83j046P14p9J61k47J68j14l34Q10m79O5n7K29J41k38k10P17l63
$$ y = [-114, -267, -233, -453, -105, -156, -226, 515, -152, -208, -604, 209, -291, -75, 31, 417, -51, -54, -71, 97, 308, -14, -5, -342, -190, -342, -333, 238, 227, -77, 103, -45, 55, -26, 345, 336, -425, 908, 37, -50, -273, 134, -598, -402, 326, 316, -68, -450, 176, 19, -370, -220, 27, -36, -327, -476, 268, 21, 67, -545, 350, 315, -47, 149, -108, -165, 519, -66, 50, 477, 211, 299, -22, -197, -182, -173, -120, 959, 89, -98, -296, 27, -36, -292, -113, -264, 199, 84, -137, -536, -311, 363, 254, -231, -67, 34, -125, 231, -421, -72, -443, 94, -44, -491, -240, 329, 112, -149, 391, 407, -7, 252, -380, -957, -54, 308, -217, 190, -107, 186, 382, -307, -77, -459, 58, 191, -54, 123, 604, 451, 553, 161, 554, 72, 11, 250, -138, -2, 361, -174, -513, -106, 211, -302, -208, -106, 9, 209, -338, 266, -556, 21, 304, -742, -28, -107, 54, -193, -25, -139, -473, 337, -142, -77, -134, 95, 236, -2, -212, 505, 142]
4709A42K0k56J53O2j40J8k77o8L79q7J94J01n02O6k87M18o07J334p50M80j95r4
4731A04j86J51J90l05J09l78M60n74K05K95l30Q1M13m64r1J78jJ91J12m75K85
4752c0K44m40R1k07M54k29j08O75j79P8k29l66J87j49M52j94n45Q6Q3K11j93O08
4774C00j54m01N45l11j71j1l23M39l38M64K25j71j68j02R1L83k42n59K23O15p53
4795d19M22k82N4K53K92j52J40k00k72L58l93L83n4j78p2L2j0k87L82o3m02K88
4817a80j56Q79p26K63o30J84K54q2K39m4O18o13j27N2j78M32l2k63p2o0L54j79
4839f7PL42o5l66M14N39p17j64m3L84m55P25l74j72J59M90j017O06m97K61k69
4860b79J99M01k75j85J26j49k26N41k79j58M55L61n68N4p2J06k24KK82l65M15
$$ y = [142, 162, -94, 59, 121, -19, -1, -278, -346, 33, -54, 140, 241, -261, -195, -482, -64, -671, 663, -87, 393, 198, 104, -82, 69, 259, -46, 63, -315, 145, -429, -224, 71, -259, -178, 235, -229, -320, -142, -143, 48, 160, -315, -30, 214, -226, -135, -342, 112, -117, -225, 450, 271, 349, 120, -246, -59, -208, 244, 50, -495, -409, -326, -115, -308, 300, 146, -255, 290, -21, -192, -203, -526, -87, -425, 39, 264, 93, -75, -177, -86, 297, 55, -504, -281, 334, -419, 3, -279, -225, 28, 320, 168, 308, 108, -164, 194, -199, 184, 130, -48, -120, -88, -98, -385, -3, -66, -468, -180, -336, 543, -183, 80, -550, -366, -112, -194, 45, 1, 619, 6, -121, -69, -247, 185, 153, -110, -182, -242, 112, -67, -60, 282, 217, -149, 265, 804, 87, -77, -120, 264, -191, 534, 160, -12, 147, 637, -380, 226, -271, -10, -279, -80, 321, 46, -139, -13, -162, -388, 153, -126, -284, 171, 532, -36, 18, -54, 52, -172, -170, 112, -253, 162]
4881A62j27m73M35L82l89l7J03o2j70j51L76J76k89m7l8k96M44M09p55O27q98
4902f18K91K32N0m00N74m10L70m56K15K7N3j09l91J53L71k85J92L08j29M05O7
4923E10n15P3J31n50J21N52p10J62O20m76Mm0k1l0R0k11N71j38k16Q0k49N68k63
4946F3M40j093N56R9n31J60K14K54p8K90j79n72N80m55K54J87l64N87o69pP40
4967D76n04j86L33m7M5n51M30j02k64l9K91P3k53N63l96j39j94K6N06Q2k57M45
4989C38k20q0j44k90N49J60m97K92k40j19J59k82k7M46j39J11K27o76P31l71K59
5010A87m92l3L17L46k48R7k34K57K55m10j57j8M51m80M11l96K86j33j62N0K51
5031A45J88j45m59J22J95M2k57L23k93P9N3m50N50o89l68Q42m7J98k01J70k19
$$ y = [162, 35, -438, -3, 379, -10, -47, 56, -6, -176, -327, 49, 225, -64, -111, -149, -445, -1, 408, -347, 280, -618, -327, -95, -45, -445, 129, -281, 89, -367, -152, -125, -72, -181, -572, -419, -48, -333, -141, 167, 38, 443, 510, -5, 68, 199, -351, -230, 322, -388, -226, 394, -82, -78, -118, -139, -169, -79, -290, 281, 143, -73, 7, -242, 326, 63, 503, -590, -34, 65, -466, -306, -92, 162, 84, 374, 195, -377, 203, -252, 2, 189, -175, 412, -257, -264, 476, -28, -214, 119, 72, 117, -434, -4, -106, -370, -409, -118, -45, -298, 265, -131, -270, -464, -438, 68, 150, -107, 338, 118, 38, -106, -396, 153, 313, -184, 108, -132, -251, -92, -374, -401, 45, -94, 17, 244, -432, 299, -72, 187, -305, -338, -21, 325, 77, 174, -60, 197, 452, 42, -115, -133, 318, -162, 249, -147, 139, 6, -156, -106, 145, 333, 188, -271, -149, 46, 88, -169, 154, -139, -60, -7, -457, 93, -596, -964, -122, -169, 29, -172, -2, -221]
5052b21r7R37p04J71K19o52J068m08k79j01k05O20Jm17m37J24M10m21M23o09K19
5073c59K64j0k74L07M56k99J97J76J8l41j40k48L66k72M94n44M81jk81lO11o05
5095gJ65m49k43Q38k61k27l83P71M1n50M34QK12J21p17K87J75K2k9n8l41j5J11
5118i5K55j11k00Q4j48J83o1j26o3L51k36K49l13K93j054R21p3o5L59o5n47M41
5140b1L39n95N95l04m54J269o80L13o21K3M34n61J36l60K34K79m6J82j39J61k10
5161b6k54j1L83l43n5K83J00o39M45l26K58L34l86R25q95L6L82N01k36k08k47
5182B1L84n21N8O8M49m16M54r0m67Lj40O16k55l09J10L12J80n77l44L21j0J51
5204bl67O95m41k62O52jN6k38K8p51P89l06l94J162r14j81L86n6k67O9K44K62
$$ y = [-221, -318, 619, -85, 86, 305, -347, 721, 313, 34, -67, -272, 348, 349, -68, -505, -381, 29, -392, 31, -578, -359, -95, -105, -379, -72, 384, 85, 282, 458, 476, 135, -5, -253, 113, -159, 335, -209, 272, 271, -10, -13, 598, -7, 158, -291, -534, 304, 43, -184, -567, 204, 245, -305, 129, 137, 349, 470, -247, 40, 215, 237, 208, 150, -191, -206, -95, 160, 49, -151, -67, -215, -32, -93, -219, -282, 69, -167, 82, -231, 62, -992, -71, -144, -209, 150, 85, -462, -21, 318, -277, 318, 14, -440, 829, 149, 462, -159, -136, 298, -263, -127, -487, -253, 26, -20, 162, 23, 184, -26, -280, -291, 92, -251, -306, -23, 77, -562, -117, -443, -185, 149, -237, 688, -207, -171, 211, 712, 476, 268, 21, 405, -116, -58, 10, 459, 43, 497, 407, -60, -57, -197, 419, 164, -145, -35, 277, 457, -120, -464, -143, -153, -2, -369, 326, -115, -377, 275, 274, 330, 92, 120, -631, 158, -148, -542, 620, -294, -475, -89, -145, -412, -343, -99, 163]
5226A63n55P38j57J60o07j53M57k9p3N2k20P4J08K24m61M80K98o21m0p3J26L58
5248B49j72M76m46M36n45j90L86r4j00k41N57k73M22k28J75k82j1j23K7J88m69
5269b58M91j22j70j54K19J96m35L70J07m29k0j84N55L14j82l00J68l53J23j90
5289b54q8J94k76O64P5k60m3J10n49N79l26M40L8m37J66L92o31N72j60l60O7j91
5311b78J91M62J28j54m67J43K82n24N05n93J62j59o5K05P54q46l77Q52j03j73
5331e5M7P8l50L84l43K35n0L06nk76j76K64m10J53M38J89k87k53Q08j083L18L36
5353B68k89J5K32j74MJ54k89n4k57M73j37N72q39k61N92r8N74p48K77M8l33N17
5375B47J50n9j41j49j8P71l31n07N44q33L61P4l95O3J9M98j72P0n46N06k5Q65
$$ y = [163, -392, 346, 189, 349, -258, -411, 46, 17, -56, -4, -224, -150, -42, 182, -279, 201, 499, -122, -162, -235, -109, 249, 77, 553, 107, 543, -2, -192, 194, 100, 0, -241, 316, 43, 465, 237, 412, 130, 119, -4, 23, 211, -258, 233, 111, -59, -213, 6, 202, -233, 137, 244, -185, -205, -389, 166, 480, 298, -2, 166, -187, -64, -254, -342, -148, -424, 240, 315, 55, 12, 122, -427, 152, -174, 266, 304, -133, 33, 425, -206, 366, 206, -154, -87, -278, -87, 375, 503, 349, -118, 25, 307, -217, 288, -305, -143, -302, -367, -162, 592, -254, -631, 221, 118, -55, -8, 70, -280, 104, -239, -4, -54, 252, 247, -29, -205, 59, -351, -198, 240, 429, 142, -111, 697, -386, -68, 268, -21, -6, 226, 52, 56, 210, -79, -133, -390, 83, -54, 518, -321, -582, 10, -88, 486, -262, 15, 63, -270, 247, 397, 338, 197, 48, 30, 801, 470, -37, 507, -326, 35, 109, -286, -223, -204, 294, 122, 192, -354, 152, 127, 992]
5397I92j117j9K99O9P5o45J73k80P03n50L27J36J39j22L5l0P3n36J32P45o25J08
5419H2l4J40j60j41j9N03n54O9M82k78n30L99l16O67k56o58J272n63j70m88R02
5440C49k69L59n41L65q0P6K61q51M32n34J19K08J61J96m3m43O3q2p7K00j22L11
5462E8l02K04q2n05N78qj27J02K36l57L10l84N91K77n39j76O67q55J21K94o14
5483e11O35P9m23N88k46K19m66m46K04K73M38L2J49k20N7m69k01j59N61j42j2
5504f0J15J3L6L80o95L77M31j221N17mK64l09Q3L64q3k43M37l07K36j25l09J87
5526H4k39K50j90J98N64p53j81M13m37K48J50l69K77K93k72k61L22M58o64K66
5546A57n0j33j56N73l52J56K1jj65m78M44K82k34p22Q23m41N1M03n0m50M41L89
$$ y = [992, -125, -144, 155, 224, 299, -346, -173, -453, 250, -300, 27, 163, 302, 180, 215, 185, 258, -278, -146, 599, -26, 82, 48, 188, 28, -113, -132, 371, -183, -114, 368, 90, -440, -41, -357, 310, 54, -604, 668, 105, -65, -553, 349, 80, 439, -102, 263, 183, 259, 520, -331, 101, -433, -314, -106, 55, 251, 208, -235, -172, -254, -331, -131, -253, 58, -244, -40, -122, -627, -49, -57, -184, -82, 154, -203, 107, -277, 314, 591, 52, -124, 543, -312, -191, 103, -511, 124, 203, -220, 368, 122, 341, -125, -571, -367, -94, 344, 376, 525, 305, 362, -107, -308, -467, 94, -48, -60, 55, 68, 104, 484, -211, 166, 597, -624, -107, -111, 153, -156, -73, 291, 208, -35, 402, 95, 331, 206, -103, 84, -155, 95, -95, 103, 667, -86, -267, 146, -291, -43, 107, -262, 15, 308, 36, -225, 97, 555, -109, 157, 107, -26, -182, 391, 39, 195, 216, 215, 50, -428, 16, 298, 64, -658, 165, -276, -225, 178, 128, -322, 119, 508]
5568E08l75K2j1k16k34J08L84j27k29L3k24M54K81m62m8k16L79j47K84k15n08
5589e59K63j07N57l92L28J2n35O46l40M17n9p98L98r9J32r7J81N0j73K26j15j71
5611b35L72q4PL4j77L4r6O8O3O51n58k63N30p14L01L6J52k83M24Q2o14J94JQ10
5635G35m89p3n41O43n8L1J17m28L79k43j42L7N9L31l64n66Q03p2J03o31R72r91
5657c88p3J02K84M0p5k80j1q8K12L19J75n87M88r7l33M69pJ66n89J66l78N03m08
5680c90K17O03n44l53N62qm51L58l10K86J26M55n54k62M59J40m50J67L37m80L86
5701B94k92k92L88Q9l19O00p83N07j72j08r2K95j24p8J88o8M63p3p11K55m9K48
5723A66rm03J79l4l11L19K63l49K96k48L70J37k15m25P21p5k73J69J58p08M12
$$ y = [508, 133, 155, 144, -72, -306, -198, 186, 59, -170, -137, -361, 93, 374, -88, -136, -352, 27, -120, 164, -51, -559, -296, -403, 154, -238, 90, 102, -433, 213, -127, 290, 231, -567, -169, -268, -136, -233, -52, -2, -175, 51, -64, -235, 137, 53, 60, 94, -83, -49, -145, -77, -14, 637, 79, -184, 346, -368, -67, -31, 121, -162, 262, 344, -270, -76, -75, 735, 246, 173, -368, 275, 217, 248, 365, -63, 316, 73, -69, -32, 27, 358, -6, -572, 231, 159, 262, -369, 603, -388, -461, -359, -75, -35, -110, -390, -401, -489, -277, 42, 217, -370, 118, 21, -312, 157, 150, 316, -273, -107, -485, 18, -390, -173, 430, -114, -467, 95, 87, -364, -6, -316, -30, 96, 551, -3, -265, 194, 334, -116, 51, 388, -92, 294, 2, -290, 98, 187, -132, 468, -315, 192, 20, -88, -180, 115, -9, -87, 101, 33, 496, 423, -288, -33, -82, 166, 157, -246, -67, -101, -412, -93, 170, -179, 117, -131, 239, 376, 161, -264, 457, 382, 109, 278, 436, -272, 140]
5744A40p58N66q8J10L80k25m69J37j42P91m90r7j79k1P15o65O45l46k61J34J96
5765G3k34J13k5L86o4k57N23o50K38P6o11O97L3p51K00M45J70n29J55K07Qn63
5787c60Q50m16P0k89J44m27L73M70q66M76O1l88M36m59M69N69r31j73K66O1m1
5808a05L7q5k28j85N80K61j018J117p17K76j25J37J45m0J42J17k01k8Rl0r1L73
5830C41q60N19j20PK15M63l24m07O0j97K17M4l0O7n2m6K24J39k11J45j04m20L37
5853Gk32j34M23P0m2k84M47l38J61p3k45L29p66N27P9j4j94N15l42P7n25M52N2
5876e0n67Q18p1m73l64Q69j43J09j58J24l87J173r70J06M72o1j85k93K42j82k65
5897b56J52K8j78O3l60Q17K04p62N24l81l33K34M38k36j45J94l35J71J09Q1j66
$$ y = [140, -618, -52, -140, -30, 350, 125, -344, -207, -349, 442, -48, -145, -324, -345, 370, -295, 350, 4, -257, -123, 73, -161, -48, -73, 313, 249, -8, 515, -135, 103, 179, -432, 265, 298, -453, -253, 192, 362, -167, -12, 195, 203, -360, 490, 74, 144, -145, -1, -428, -55, 415, -451, 25, 86, -302, 134, -325, 144, 713, -218, -391, -125, -64, -105, -68, -153, -381, -566, 14, 275, -743, 374, -343, -67, -192, -55, 90, 50, 192, 309, 108, 80, 89, 59, -32, 341, -519, 0, -120, -113, 102, 565, 241, -166, -106, -303, -86, -42, -72, -5, -57, -103, 121, 260, 49, 194, 90, -330, 7, -225, -359, 64, 134, 92, -192, 255, -83, 78, 5, -240, 89, -677, -150, -71, -85, -279, 236, -106, -29, -554, -102, -50, -617, 201, 130, -343, -707, 162, 19, 128, -30, 94, -293, 880, -90, 16, 488, 427, 242, -51, 191, 9, -256, -104, -76, -254, -191, -551, 266, 470, -292, 232, -149, -482, -248, 190, -46, -191, 3, -332, -161, -52, 29, -137]
5918a37K30J16k24J60q0p6M57r23M78K3m47M11m28J7L24N0L42p21N12p41N65j57
5940b49R7j66J53J0n83N58j52J38O48q14L1O5j31L09J18k63o3N48j20J64n10L67
5962A55k93L82m73K38k9M6m69J29PO61k50P0j87j5L25k99M31j53l30K68K04m78
5984f0j03j89L53O29p16P9M93j96q81J066o23J40J07J30l50O3q7k26P52n31k5
6005a75M18k73j87M16P5m40N63j10K60j00n92n3P9p3j38M73m03L66l40M15j78
6026Cr7j10j60K81l23M15m68K59L83k31J32J29q2q1k7j49N8k26L08k67K09j28
6048a72K42J34m81M76r2o6J6l3n52N25k21N37k88K32l89j13M58MM1q5K27m95L55
6071B60l41Q9J34n44R45m17p79N51N15n86L81J03p01K58Qk62N12j01o8J74q9j
$$ y = [-137, 93, 209, -15, 145, 65, -11, 446, -477, 1, 24, -423, -12, -440, -423, -99, -49, 293, -428, 84, -657, -92, -249, -152, -318, -165, -155, -738, -180, -332, -194, 454, -360, -329, -264, -395, -86, 32, -231, -294, 254, 134, 298, -212, 155, -138, 244, -229, 9, -20, 26, -443, -314, -307, 354, 104, 174, -13, -28, 297, -2, 429, 276, -54, 214, 418, -60, -163, -352, 1, 630, -86, -7, 486, 290, -591, 475, -148, -8, 99, 229, -121, -58, -145, -371, 381, -150, -175, 243, -30, -217, 199, 274, -166, 397, 287, 547, 447, -145, -198, -119, -192, -330, 143, -260, 106, -234, 181, 3, -94, -204, -364, -83, -406, 9, -459, -200, 183, -48, 84, 213, 131, 50, 23, -126, -68, -294, 14, -253, -44, -172, 70, 204, -277, 199, 107, 41, 57, 24, -528, -3, -224, 313, 25, 257, -132, -245, 213, 217, 258, 173, 400, -95, 260, -81, 8, 142, -402, 543, 126, -653, -102, 413, -173, 208, 311, -390, -132, -124, -386, 126, 25, -43, 131, 42, 41]
6093D1K81l44j12L25l49K70k74M8j27K70m6k4N1K30l81J81j64J9M54n28Q71j353
6115f61L37J52J3J87Q3j47M52q6m36K64l82K25J38M3m48N1q9M82P4n66J03K33
6137B2k96K96l10m3J68L00r76O81M42m6l2o34O20j74J79n12M69J71j16j63k09
6158a63M67n07J040m39n44r3L53j96J07j45j33m49P85o20K78P2J13J11k04lK15
6179D5k9n20N12L8m23K77L77m5l96L1M81r06M45l97K69J99j20K55j80M96l95J47
6201A61j4k06L13k49K5J41j8J65k71J89n95j45O47L94o87o9J34j54j00K10L94
6222B65L38o65J09J94l21p8M92j83K01m42M15OJ59q39M26rn0O8n2k78j49J59N10
6245B76n65N24l80K74J01J13j62J28k82l16J01K79L50q36M49l92P71n05q8K77
$$ y = [41, 322, -22, -134, 191, -158, 112, -162, -114, -241, 29, -17, -41, 10, 240, -141, 40, -124, -105, 349, -179, 692, -661, -324, -172, -159, 28, 111, -36, 416, 330, -106, 158, -224, 1, 139, 182, -266, -215, -304, 178, 252, -314, -211, 22, -274, 22, -288, -331, -163, 137, -839, -158, 284, 238, 206, -428, 192, 18, 197, -315, 154, 325, 209, 46, -163, 304, -203, 837, 398, -146, -239, 114, -82, 25, -120, -253, -702, 83, -537, -259, -187, -74, 37, -167, -170, 45, 16, -504, 8, 46, -377, -100, 277, 232, -164, -133, 348, -558, -113, -510, -241, -42, -162, 93, -87, 409, 14, 161, 147, -59, 254, 5, 30, 171, 153, 318, 47, 236, -359, -504, 143, 537, -150, -219, -85, -239, -339, -129, 265, 603, -62, 47, 241, -80, -158, 334, 151, 352, -90, 325, 331, 490, -349, 77, 68, 18, 86, 34, -244, -393, -234, 276, -289, 235, -145, 129, 230, 343, 181, 309, 27, -289, -188, 91, 441, -395, 54, -338, 433, -72, -160, 117]
6265A17k0J46o86l5N91R9o26O74m93J79o1J09K54l38N9L2Rj98J98k57K47j43M41
6288B98p07J92K91J07J08r8m4n5k17K47N7n91N12k49J80l96j7k71L48R8M1j28
6310b94L07K73m46n99M78q5L32J0K39q02O84n4L78k6n97N73p20N31j60K67N5l53
6332ij41J76N02m01R6P3J86p02M19k89p9K04M1l93J81M27j93j45R6k90M02J05
6354B66j68J79J48k76r1k02N29j72l20K48j4J22l01k54L77J04o29N98o91P86l50
6375a11J03K55Q4L3m16r9Ro1M88L4n15L10l65M96l93J07m72P46o8q4M25l54j18
6398C4N56o26N9P04l78l25J01k9J01J53m59P23p37o0M67l62j0O80q08j52K94j48
6420b22K85j11j09J59J30l00R5J96l10M85k25j12L47n21L55k73J04l57L67r4K93
$$ y = [117, 97, 243, -443, -478, 113, 212, -414, 260, -233, -54, -115, -6, 248, -90, -31, 1, 10, -188, 10, -247, 0, -143, 298, -409, -217, 74, 181, 289, 191, 147, 92, -125, 122, 179, -412, 100, -149, 31, -365, -382, -653, -305, -207, -166, -294, 13, 286, -160, -759, -281, -366, -34, -24, 215, -587, 97, 43, 421, 395, -202, 371, -349, 182, 22, 289, 344, -9, -150, 26, 528, 127, 223, 296, 482, -220, 199, -90, -169, 35, 76, -317, -136, 291, 98, -47, 49, -241, 161, 266, 98, 277, 425, 149, 58, -144, 385, 213, -107, 141, 127, 249, -52, -306, 71, 175, -454, 144, -547, 239, -111, -8, 247, 331, 364, -52, -151, -142, -203, 285, 319, -196, 114, -251, 245, -148, -41, -513, 233, 165, 81, 506, 152, 34, 590, -36, 23, 727, 349, 24, 125, 96, 197, 350, -109, 614, -123, -183, 284, -78, -88, 592, -216, -368, -74, -222, 63, -48, -157, 2, 132, -168, -73, 123, -187, 298, 73, -39, 308, -213, 142, -131, -27, -384, -17, -111, 182]
6441A82p86N68J83J75J1j19l18q90J234k97L88m86j94M46l68M38M65m26j49k77
6461b20O59j91m85P31n25N54j57j90K99K60j381L98K09n92O95J60j36J8k16J59
6481D9J16j3j16k9j5m77L79l64N99J05L6j04n61m3J96K48m15J055r19Q7L31K35
6503C80n43l41M20r8M5L09J24n25j65J98L72q7m32P2M55j80J66O5j94K03m5K27
6525D26k92l60M42P4k14k09M15q0j47o6k1L22n86J65nL63L85p99M16k88M9O9j02
6548d3M87q31M28K58l4k26j28J58l26k83k04M26J18J21M05J30l98l57K05Q55p55
6569Fm86O34n29L02K71p34Q51l85J1k41R03l74k58L17j55l20M07j66k41L23P1
6590B07l59M4P3J76J9n85N54n67L83L99j97L9k23n5M91r08K83L94p6m24P1L7K18
$$ y = [182, -604, -36, 147, 322, 333, 214, -104, -994, 240, -57, 331, -155, -349, 97, -271, 167, 632, 206, 57, -220, 439, 248, -237, 494, -31, 523, 366, 176, 475, 735, -646, -248, -39, -631, 64, 224, 88, 106, -110, 49, 165, 152, 36, 7, -8, -485, -106, -470, 129, 234, 270, 166, -395, -438, -242, 6, -409, 646, -273, -186, 145, 380, -163, -504, -84, -182, -137, 172, 296, -229, -394, -196, 176, 89, -343, -271, 184, 4, 170, 235, 41, 244, 199, 426, 134, -226, 216, 290, 76, -133, 282, 202, 55, -11, -32, 290, -296, -131, -136, 227, 612, -187, 229, -59, -10, 59, -43, 444, -387, 41, 299, 265, 39, -89, 69, -257, -540, -744, -318, -200, -79, 326, 456, 58, -299, -94, 761, 6, -480, 154, -375, -73, 198, -536, 315, -70, -59, -300, 603, 229, -29, 288, 133, -187, 220, 54, -187, 136, 207, -152, -108, -35, 141, 160, -425, 129, -438, -55, 344, 147, 186, -37, -92, 399, -509, -226, 168, 92, -332, -261, -224, -6]
6613fk36J71j52J66L39o65J076l09k10j7l37l30N09Q2j47P5J9K50l71J09R2j42
6635c4m16K42L84l28M08P2m97O22n30J88k43j90J06k2K2l0L2j63N90k58k91J4
6657c22M97J95k36m6L5j70k71N85k67k59N92n80j55O85J76q82L19K92j95K41k57
6678b3J37K1j29k9K8K85l94L04k93l19N34m8k45M00m11M9N5j4P6M48m80n75P84
6701A61L50m68L6Mm5K96k14J59k65m5O2J95j78k49N6k9K81l14n8J64O5J56n2p
6725F1P9nk30p6j5k32N15j7j13k21K19N55j42l70R3K24l48J41N9j09l00K08L07
6748B83n37L34k30L42m70J60k41M52j3j48R7m8j70J48K5m86K58J24K5j31L86k86
6770a26j72M66n89J78K74n2J32m61K50j33p4Q6J42Q5k70K1K9j14K85m53O12n57
$$ y = [-6, -242, -71, -223, -57, 282, -383, 693, 384, 174, 157, -180, -510, -1, 81, -66, 9, 28, 278, -93, 16, 108, -34, -450, -208, 176, -152, 256, 328, -169, 453, -77, 111, -132, -322, -216, -238, -216, -246, -214, -377, 213, -45, -336, -322, 175, 370, 134, 88, 123, -47, -318, 267, 0, -259, 333, -247, -402, 283, 459, -423, -104, 188, -7, 234, -23, 114, 135, 6, -23, 5, 290, -104, 200, -93, -412, 122, 74, -171, 229, -182, -133, -78, -92, -16, 432, -48, -623, 161, 511, 43, 79, 83, 38, 334, 120, 279, 14, -31, 31, 226, 48, -201, -145, -174, 107, -207, -265, -101, -36, 120, 68, 61, 140, 135, -95, -171, -186, -418, 97, 80, -33, -254, -35, 520, 378, 8, 101, 325, -23, 118, 177, 68, -232, -24, 283, -254, 80, -150, 192, -278, -118, -359, 93, 80, -68, 29, -19, -189, -41, -16, -502, -244, -120, -95, -226, 160, -126, -298, 168, -421, -243, 31, -21, 111, -350, -100, -233, -307, -221, -79, 6, -264, -243, -214, -328, -43, -496, 116, -441]
6792d41j03M8Q56k27l64M06jp3m05L84l88L12M59o71N62p16N89m51J67k47L05
6813Aj1l54O74m55j0M90j54o3k25O17n24j1L00j40mj33k49J58N32j003M52Q8L34
6836C10l77K54k55L00k95j31K60l4r2J30L42J6k23p8J20L85p20K91j57j21j0K87
6858B02k91j15K10K14pl85K77l36J2o8O5M57m59k23O85L6p79L11j07r1O26j35
6880I9J50l96L15j39l28r2k84N08J74m50K05L74j9k63K86l63O99m78J19K4L05
6901D46m91L58k86j57K22j85k90M85k66k00J0M09P7k31J90m5O62n36k15k2R5j96
6923a66k49N35q39J043k83j10N7L06L71q98M98k59P9p7l87K18L29n75O78n69j04
6944d02J27O62m65K44p6r0l49l6K89L0L37l59k21k0j39K01L72q98P51L64l40k48
$$ y = [-441, -544, -496, 360, 133, -231, 175, 174, 101, -304, 80, -308, 4, 463, -208, 354, -362, 227, -224, -57, -304, 1, -10, -364, 310, -145, -155, 335, 181, 118, -107, 510, -14, -25, 275, 135, 131, -2, -251, -93, 439, -564, -112, -24, 310, -67, 187, -68, 232, -63, -194, 66, 32, -60, 70, 412, 428, 205, 127, 247, 632, -88, 203, 46, -75, -85, 202, -89, -204, 6, 220, 213, -172, 105, -231, -219, -287, -222, 235, -224, -447, 238, 274, -505, -194, -301, -392, 234, 99, 249, -147, 168, 29, -299, -391, -675, -167, 7, -443, -238, 136, 117, -146, 140, -223, 476, -2, 117, 141, 446, -45, 313, 27, -130, 92, -93, -383, 102, -164, -364, -354, 55, 132, -99, 91, 46, 708, 172, -43, -65, 30, -166, -415, 120, -719, 324, 41, -69, -12, 294, 665, -233, 265, 6, 85, 8, -379, -161, 168, -407, 271, -298, -402, -275, 387, -78, 166, 90, 0, -349, -385, -96, -66, 271, -88, -309, -329, -468, -267, 105, -793, -42, 322, -18, -266]
6966b66Q72n36n1K49j45j77L5j78j33P71m84J01J51o7j0L08l49lp3K5K73j02j62
6989D9j58kL8J67q33J140p26L08J23k16MK41n66L22M94K9k87q93P36K86p54J66
7011c32J99k87O76j60j17k95J61m07M11L39k57N66l64p18N66k15M11P5LJ41k62
7032A34j39r5O50n64K8J62m87N30J71l19j2k24L01l35L45j01l03O44j0Ol23l49
7054b90L18K35qo01R3K43O37q06N52l91j08L34m85K06J43L19r11J57L19m37N56
7075G5r1O1l03oO20k80m80J22L03K82j06j87o21N16M54j94j61k86P32k77j83J20
7097A10N03o77K6l37P05m12m4N4J72N1K0j48n2o64M50N87n41P7M28r6o51R08j167
7120f98M51q6M32j85M16m34N14n31R6O27l75j33o67N80j30P20j94n53j53P8L75
$$ y = [-266, 606, 70, 19, 268, 123, -54, -19, -197, -330, 441, -43, 58, 209, 142, 132, 440, 91, 88, 15, 40, 313, 211, 49, -109, -111, -73, 94, -739, 401, -325, -17, 106, -110, -106, 135, -431, -109, 385, 414, 127, -766, -30, 256, -498, -332, -133, -420, 256, 96, -21, -316, -155, -562, -151, 188, -69, 497, 133, -585, -19, -234, 177, 252, 255, 396, 134, -5, -100, 550, -14, 14, 176, -311, 219, 390, 71, 59, -165, 136, -199, 146, 45, -258, 386, 376, 382, 59, -290, 28, 263, 255, -346, -253, -10, 627, -179, 373, -18, -126, 208, -277, -71, 72, 391, -520, -363, -44, -481, 75, -16, 45, -258, -264, 356, 76, -404, -282, 21, 303, 197, 10, -611, -95, 359, 165, 4, -282, 450, 173, -10, 110, 613, -64, -38, -375, 330, -82, -126, -72, 100, 151, 171, 23, -29, -693, -243, 344, -197, -120, 308, 212, -439, 469, -698, -247, -333, 99, -86, 330, -104, 410, -121, -25, 602, 227, 94, -573, 7, -123, 597, 403, -150, -303, -225, 150]
7141A50%j21K78Q3j2p94K69N68l84l93L13mQ7O2K35m57j1L49J86n24n4M81k85
7164B2J61L59o84M26J40m63p0J06o3j73K21L40n69L08l55J20J99M30l90j8P0K51
7186C68k21K29q17K92K99k23l51P95L6n48P9K66J19n76L28l75M00k75Q5L22n23
7207b91k61R55m78J84k75K15K8nK62j078P07j32j92rK48K13j21N0N31j79j70J34
7229C36k85k39O7L98n7J49n58J17j26j36O56l96L27o91M03K04j11R8L67m36j81
7250i4k53L13M87n81j31m8L12M51p36K94l58J85K9n6Q1J13K14k27l95N46k79r1
7272b24J3J39K68j12k97l30O12K11o64qj82M12j43M8J52k11N13k30L71k48K89
7293C79k06o75L80L52l44Q8k86K38P7j00k3j32P66n47N76q80L61j23K07R2k74
$$ y = [150, 150, 29, 307, 390, 378, -416, -147, 421, 37, -356, -43, -47, 40, 102, 337, -120, -131, 218, 404, -120, -174, 307, 22, 183, 542, -142, 284, 424, -39, -109, -3, -66, -239, -18, 322, -247, 61, -294, -174, 25, 455, 65, 47, 117, 368, 147, 376, -441, -149, 150, -73, -424, 371, 407, -141, -62, 204, 323, -253, 75, -300, 100, -175, -90, 232, -291, -552, 403, -75, 109, -166, 49, 77, 72, 334, -744, -37, -169, -361, -370, -122, 91, -30, 20, 551, 372, 202, 336, 51, -188, -121, 277, 220, 369, -189, -72, -198, -334, 322, -74, 253, -438, -35, 169, 58, 156, 523, 87, -94, -347, -34, 453, -128, -259, -307, 5, 456, -280, 14, -344, -159, -130, -186, -105, 8, 222, -5, -400, 146, -133, -224, -211, -72, 196, 84, -213, -543, 69, 280, -384, -392, -574, -162, -305, -257, -105, -316, 197, -33, 338, 90, 379, 173, -502, -122, 230, -114, -26, -312, -74, 3, -97, -120, -252, 514, -33, 543, -337, 24, -99, 108, 200, -74]
7314g4K2N6K2k01J59K52n1L2n86M10p6j56N77l20J15m30L58J83j51m6j32q0J44
7337B7n51K65K56n41Q94o57N16l14K87n04L05Q4l31J04M0P64n92j24K50o04M43
7358A7p2j09L36m35J6J63O61j095R0L3Q45m02k07O63l35k16K24K30l38L58l74
7379E3L46N2p76J5J85k98O96j00j18M32o46L55P8l61j13N22j70m77L14k14J09
7400a16L9j66O32l86K08k19j56N4k27Q24l95k44j15L88J97l65L47n70J55J70J25
7421A80k85K68k07L8J27m19PO5j04Q0K41l20N44j83PP3j23L0M2L41n74M90J72
7444D90q91M56m39J022o15m48M57j5k05K3O23q74M25Q8o3L58m76M89q20N24j63
7465e4m45Q79l78n02K85O27m82R7k55R46q45L06l10J94j34O35n99M5K71k83k70
$$ y = [-74, -52, 4, 26, -175, -16, 236, 185, 217, -369, 41, -35, -191, 386, 66, 181, -249, 109, 292, 141, 95, -37, -117, 27, -524, -259, -3, -544, 350, -307, 209, -105, 182, -322, -17, 67, -264, -160, -120, 644, 52, -72, 178, -426, 17, -55, -164, 172, -263, -247, -84, 577, -518, -428, -395, 450, 48, -159, 504, 169, -47, 177, 407, 69, 427, 53, 399, 451, -325, -310, -125, -423, 273, 173, 55, 487, -159, 196, 274, -87, -200, 322, 152, -325, -11, -225, -116, -77, -243, 389, 3, 211, -8, -164, -110, -337, 487, 92, -152, -267, 121, 318, -47, 300, -270, -115, 55, 180, -105, 163, -44, -6, 121, -298, -291, -226, -330, -250, -9, -329, 215, 32, 39, 112, -11, 19, 61, 402, -172, 318, 490, -401, 55, -384, 638, 23, -425, 32, 17, -188, -165, 458, -416, 9, 97, 34, 392, -84, 405, -415, 109, -54, -499, 380, 2, -500, -215, 412, -70, 27, -228, 718, -127, 179, -131, 63, -71, 564, -35, 10, 281, -2, -272]
7486b72N11j76k42K05N8l7N87p63P78k49q18R42j152Q16k49O7n23L45L79l20O5
7507d8j44K27j26j21N63O8n50M23O8m51J35o44P09r6j4P5k53j0K05L6J32l04J57
7530C7J49K78p31N84k30l11j56j79M78M52r94L06K74L36k93m40N24K17l64J99
7550A36K22n19N13m88j4O15k29l53M65o22L50r2L2J41o5N2P3k49j6k35K1L11K54
7573C03k71j93J66p6O72l70K85m55k77K63p7l9K76l03k2O42n28j40k6J51K78K84
7595E43k50m61L73m5L42k65J8k64L99l03j38N2J52k55J30J54Pn63M27l10Q8m9
7617b18J056q13j27O8N24m41J65k30l95K33M38o6rl40l13L40L98l97QL82j69r
7639H5n59L63r9O39J2n46J97K66l67J28q1j88J8l8K78n3l32p0ok47M11J13J09
$$ y = [-272, 239, 63, -179, 26, 84, 47, 634, -129, 649, 400, -418, 524, -628, 188, -61, 6, -517, -172, 207, -113, -48, -192, 35, -91, -212, 351, 419, -131, 292, 360, -91, 44, -600, 109, 13, -1, 74, -179, -189, 16, 52, 184, -120, 37, 186, 464, -267, 317, 87, -224, -380, -559, -81, 371, -623, -317, -43, 293, 0, -440, 84, 301, -63, 136, 358, -161, 352, -136, -150, 465, 236, -117, 348, -274, 76, -16, 16, 157, 92, 144, 217, -32, -48, -283, -262, 49, 303, 32, -161, 5, -71, 601, 231, 516, 61, -216, 47, -30, -69, 207, -96, -118, 524, -4, -144, -170, -19, 259, 543, 293, -168, 205, 160, 502, 237, 255, -9, 390, 87, -51, 1, 153, -102, 28, 182, 189, -374, 53, -257, -169, -218, 838, 25, -102, -34, 490, 49, 214, -16, -411, -178, 260, 194, 185, -155, -468, -128, 270, -127, -119, 263, 94, 85, -474, -111, -210, 429, 441, -105, 92, 358, -9, 119, 38, -150, -132, -170, 108, 55, -277, -347, -353, -600, -189, -76, 33]
7662C3l1J9Q1l3J61n29r4O59m15L51r4j64lJ62%o4n6P80p46j03L75k89J19k66
7686a47o8L05N3l88Q6J37O0M82m66J3n20Q41k32m23K13k52K62K03k25N86j96n45
7708b21K92j3jO76k73p29P83n97L78k48k48P3N31k98k88K53J33o73Q52k60j50
7729b8l15J78K42j93K98o61K11N40o06J82L16J04j92J80n82K36j70L66j30j38
7749a62J49kR8M42o45J41L37L7o24P4Q3o47L10o7N34l32N57n49N35k38L5J04k36
7772f6m0k41L32J83l10p7J33q3rK81K33k60q4j13K61j62o9L0R8l75J32K49k61
7795b18J09m4J97rJ82k92j12N95M0k73m19K13J54k41p0K96M28r74Q5J83P1k5J38
7818A4M3k33j95K69M6J84J25p82P10k66L67q76J158j061K17j88M53J42L32l42
$$ y = [33, 2, 21, 102, 69, 230, -299, -393, 266, -149, 202, 108, -56, -59, 103, 103, 39, -17, 763, 17, -86, 289, 0, 119, -147, -215, 90, 143, -245, -159, -22, 38, 520, 54, 67, -453, 388, 156, -267, -54, -306, -44, 159, -66, 520, 324, -221, 71, 58, 57, 733, 460, -269, 514, -83, 295, 47, -201, -128, 403, 105, -183, 70, 203, -470, 382, 122, -28, -343, -165, 77, -116, 182, -479, -268, 272, -334, -152, 164, 268, 76, 256, -326, -90, -260, 106, -24, -162, -13, -15, 83, 525, -120, 21, 358, 395, -229, -155, -72, -719, -409, -476, 58, -274, 283, -266, 269, 31, 66, 170, -66, -106, -347, -15, 168, -142, -219, -86, -169, -178, 103, 336, 76, -8, -121, 140, -22, -91, -61, 37, -338, -206, 43, -218, -109, -153, 44, 35, 217, -75, -187, 408, 448, 175, -244, -31, 123, -118, -188, 108, 536, -438, -353, -170, -99, -124, 14, 57, -176, -371, -102, -56, 128, 253, -529, 181, -85, 282, -594, 564, -497, -280, -468, -15, 127, 459, 117]
7838A17l94P17o97L79j93O0Q4j89P0l5k61l1k9L31n7O78j070M64k52M86k77l04
7860d03J34K69M32q8j26k51K3KL84l38l85N90j47l70Q43l83K59j40p84J20O07
7881B48j93K55q14L42k63N11m40J80K36j8p1J5K58n8r44O50K58PJ94l67N1k47
7903b10P38n94j31R0o7J13l74M90Q4N0M49l48n44O73l88M6J78m79L28l53J72N26
7925D49n02j58P35j65n16M96k01j18m99Q81k14L90n52J31k36M75%n93M93j90k64
7946a58m07Q52j98l70N03l50L24k46l85J54J20K1L54l67j11O49o54L6N23j81k11
7967a02j75K82J52p8J7m78L09j50k11O97l72N26m99L46k60k69P8K0j34O35l50
7988a6M32k94m49L15j52K91J97m0m07M05k83M13j58n75J63k75L91K42k16k26L44
$$ y = [117, -277, 440, -257, 122, -71, -11, 73, -116, -46, -81, -342, -373, -402, -71, -128, 550, -520, -56, -308, 178, -99, -403, -269, 0, 432, 344, 218, -33, -10, -8, 376, 38, -347, 243, 96, -274, 569, 186, 445, 305, -479, -359, 248, 55, 310, -504, -162, -425, 86, -354, -174, 62, 44, -27, -12, 246, 188, -756, -106, 152, 159, 353, -14, 37, -210, 528, -66, -197, -107, -174, -61, -435, 55, 139, 189, 638, 290, -254, 419, 31, 77, 255, -224, 104, -249, -77, 449, -53, -211, 524, 359, -157, 339, 138, 20, -479, 402, 188, 578, 26, 157, -79, 396, 396, -197, 296, 106, -158, -565, 287, 89, -281, 222, -128, 196, -50, -435, -281, -161, -140, 214, -153, -264, 385, -269, -233, 290, 109, -102, -277, 5, 157, 79, 96, -382, -73, -223, -434, 263, -109, 417, -82, 264, 4, -265, -187, -167, -301, 334, -16, 416, 122, -327, -12, -164, 127, 324, 284, -123, 282, -1, 412, 254, -321, -158, -433, -42, 200, -16, -242, 102]
8009A02j79j19L9Q08q48M87n00K23j77j2M08l29R2J69k27J56k04J19J27O3o0q5
8031E3M4M55m03q75R36m24J45J17j32M03n14N81n88J48J6J94J05l4J78n57M95
8052C43o6k51K18m64j2J31j34j19l05P66o1j60L3j81M13p15Q26K1n63N14n82K37
8074a11K75k29n9pj51L35k54N22o20j67J27rL20K61k36L77j94l25J0K60l14L01
8096A12p4j98K70k85N2N3j25M60l34l57K24j70K83N1L04J5k01r2k5k39M54P4K53
8119E05o63L5J67K33j74J31k71L09j2m7n10k59L27M06m0K44l0l57K09K32l95j4
8141B6L64l59l21L01l63K94K87k02o37L17L20l35M26L95q22l01K85J48j07L46
8161F2K80l0k99M1l19J66J34Q0k10o48R79k56J34k42o0O7M09L7n43K04J31j56
$$ y = [102, -77, -196, -157, 651, -197, 290, -210, 13, -164, -176, 232, -97, -5, 164, -63, 93, -111, 8, 135, 198, 138, 53, 97, 552, 149, -726, 210, -214, -69, 48, -84, 319, -195, 386, -202, -54, -38, 156, 261, 227, 405, -152, 343, 277, 26, 244, -220, -232, -101, -235, -354, -659, 107, 46, -114, -81, -262, 151, -564, 262, 283, -280, 234, -348, -111, 164, -65, -124, -131, -282, 53, -201, 321, -299, -466, -339, -348, -28, 233, -3, 374, 180, -145, -135, 125, -189, 112, 38, -160, 110, -175, -123, -70, -195, 265, -69, -426, -202, -372, -89, -38, 266, 281, 80, -12, -37, -276, 178, 252, 505, -158, -123, 44, 277, 103, 234, -37, 272, 260, 213, -297, -556, -229, 177, 137, 381, 351, -6, 203, 435, 40, 26, 390, 31, -290, 11, -352, -58, 229, 27, -610, -293, 27, -308, 118, 513, -309, -610, -325, -177, -284, 62, 342, 312, 13, 54, -265, -99, 35, 115, -95, -743, 236, -20, 114, -128, -188, -121, 288, 325, -218, -14, 117, -39]
8183c9m73P40q3j64l34L95q3l1
$$ y = [-39, -512, 228, 145, -19, -353, 42, -41, -72]
8191g2
$$ Imaginary data points
##PAGE= N=2
##DATA TABLE= (X++(I..I)), XYDATA
0@%%%%%%%%%%%%%%%%L2o4O4o4O4q2J14j28J41j73J92k24K61k93L48l95M44n07
34b70N73o42P23q12R08j016J128j252J396j550J714j897K091k304K546k805L088
51A619l402L744m126M561n045N592o219O940p788Q797j0021J1548j3498J6103
65H805j9793K5400l5037N5840j69783L62743P26829m58389r50814k97993L52248
76c99944N65923O76511k5597q19649o27394M4333M35951O69050K73583n63137
86B29630p51817j94923L08950O07509M68730j97429o95359n01831O5709N87198
96g3633O07396N7446m74688n49487k03512M14401O97457K37669l50045n08639
106a45635l83276N8470N90795M86686j18368m59860m55064j60331M05637N85457
$$ y = [0, 0, 0, 0, 0, 0, 0, 0, 0, 0, 0, 0, 0, 0, 0, 0, 0, 32, -32, 32, -32, 32, -50, 64, -64, 77, -96, 96, -128, 133, -160, 188, -207, 237, -270, 303, -339, 384, -428, 480, -536, 592, -660, 736, -814, 900, -997, 1094, -1210, 1336, -1469, 1619, -1783, 1961, -2165, 2396, -2649, 2943, -3276, 3664, -4124, 4673, -5348, 6200, -7298, 8805, -10988, 14412, -20625, 35215, -134568, 228175, 955004, 496615, -454199, -752192, -399944, 165979, 842490, 816893, -2756, -630150, -585817, -149866, 519184, 792767, 229630, -522187, -717110, -408160, 199349, 668079, 470650, -224709, -726540, -660831, -73633, 533763, 591209, 116521, -432966, -636478, -222077, 475380, 713049, 363004, -145635, -528911, -470441, 120354, 607040, 488672, 28812, -426252, -586583, -180946, 404511]
116D04511R6714l53868m41732l12895J51966O07410L78313k00085m16267l12947
126c98880l5258L82780M92206O7853l71861m19029j60605K22567M67636K78418
136E25827j96293m52801k89921O8883L57651L60650R117l81807l87067n2766K67321
147a71206L81713K01553j98781m16593k12956J49295L51971K88391k5872l40769
157F746l22236m741K94744L38909R5685k38729l59468j69048J52968L33365K06983
168C35178j09885l14088k54036J5714K95314L00795J7908k41115k79390j14105
178c47710J85445L46912J54774j50116k63300j86394M5574K94011K49761m8507
188B80450k47285k41390p7176J93207K98151Q1009j77903k51264j55990P9560
$$ y = [404511, 501225, 147357, -294375, -607270, -455304, 152106, 530419, 330334, -85933, -398880, -434138, -51358, 440848, 508701, 136840, -282189, -442794, -220227, 247409, 525827, 329534, -123267, -413188, -344305, 13346, 373996, 383113, 1306, -385761, -438527, -171206, 210507, 412060, 213279, -203314, -416270, -266975, 84996, 373387, 347515, 6746, -315490, -320231, -25487, 313422, 409107, 170378, -189090, -358138, -205170, 128195, 335178, 225293, -88795, -342831, -327117, -31803, 268992, 286900, 45785, -233605, -347710, -162265, 184647, 339421, 189305, -73995, -260389, -214815, 79196, 328957, 280450, 33165, -208225, -285401, -92194, 205957, 286966, 109063, -142201, -298191, -218631]
198b18631K76845J89308p2860k29169k03156j1345K26010K56072M7434j63014
208I7494k27376j11246J30066K55548J29246q5676k16961j84280K6689K23355
218C6859J86834m804j72291k23158q3974J51173K21042P8142r8236j98619j45926
229b52958O8917K24113J54668k3852j61050j83583l0451J71736K00734N4346j10187
240A12433j83741j06343Q5156J94126J13369n8285j78845j60950r26J56975J63123
251A36092K6185j29499j73631o3211J02113J69233R4086o4502j69528j13986M7098
262a39550J58282J42721J5186j30965j54012k7109J10163J41758O3101q2384j66397
273f9206r0388O1973J39882J04511j7522j39406j37508p404J13502J23427L8745
$$ y = [-218631, 58214, 247522, 174662, -54507, -257663, -269008, -42998, 213074, 260508, 97494, -129882, -241128, -111062, 144486, 273732, 188056, -28905, -213185, -186496, 36859, 223693, 218889, 46598, -176560, -260534, -109361, 111681, 189823, 91587, -107032, -252958, -184041, 40072, 194740, 170888, 9838, -173745, -204196, -32460, 168274, 222620, 112433, -71308, -177651, -92495, 101631, 215000, 156715, -22130, -183080, -184006, -27031, 136092, 162277, 32778, -140853, -204064, -101951, 67282, 161368, 96866, -72662, -186648, -139550, 18732, 161453, 176639, 45674, -108338, -135447, -25284, 116474, 179575, 97191, -69206, -159594, -97621, 42261, 146772, 129250, -10156, -147664, -155068, -41566, 81861, 120606]
284A20606q6177j39921n6026Q2040J41221Q5650l4019j26961j07308J3556J16466
295I127J11455J2836r5614j19238l7471Q0115J21193N5194o1570j25473q6260
306a35706K5480J10668R4371n591r5244r5569j2377Q5810J11173L7421o8675j09161
318e7400n7070M3300J07211P9078k0479r4757q1669J368Q0803Q7904J3376p5619
330B6046j02257m1416N4267R9244N6324l2406q8144o5052J4771Q3881P6207N84
342H2049p2168q1566j9096O4071R1367M0449m1630q3468n4733K1812P4799N8242
354H0128j4482p5691o9919o745O2599P7006K5284n1085p8849l4888L3318O8761
366A5437N2097j3907p1148n1288J6341O1322O4450J6303n5722p3773k0000L6717
$$ y = [120606, 34429, -105492, -161518, -79478, 61743, 147393, 113374, -13587, -120895, -107339, 9127, 120582, 133418, 37804, -81434, -118905, -38790, 82403, 137597, 76027, -49446, -135706, -110226, 442, 94813, 89222, -6022, -101591, -113968, -28158, 83015, 120436, 51761, -57400, -114470, -71170, 36041, 115119, 94640, -117, -81786, -80418, 385, 88289, 101665, 26046, -76211, -117627, -63360, 35884, 92208, 59802, -28342, -93394, -78623, 5258, 81465, 82049, 9881, -71685, -90781, -26710, 64657, 105106, 63476, -19992, -74725, -52913, 21886, 80128, 65646, -10045, -79964, -86709, -24110, 52896, 78180, 27095, -51754, -86642, -53324, 15437, 67534, 53627, -17521, -68809, -52468, 8854, 73304, 89607, 33885, -39888, -59888, -23171]
378b3171N8628L7691k6284p1913m3748K1497N2650M7281K274n8901o5653p911
390g7560M5958N6189K9001k6536n8844k8363K8479N7123M0190q898n2548m9483
402d5292j117M7928N2648J1754l5546n2089k6589K1900N1676K6108k5637m9653
414b3909l7068J289M7663N0507J178l8559l8234j4129K5108N2366K4030k8703
426B1539m0753j9473J0085M4477M3819n363m4465l5105o971K1317M1534J5016
438D5657l3007m2281j3022J5522L5391L2019r776m5515l0040L885K6780L5156
450B0769J3102k8208l4472l860K1951L3316K3908j4312m1541k4064Q658K8184
462C431K8714K245k8203k8819n556K0909K9559J2014k2776l3297j7114Q937L2229
$$ y = [-23171, 35457, 73148, 46864, -25049, -68797, -47300, 5350, 52631, 54905, -3996, -69649, -77560, -31602, 24587, 53588, 27052, -31792, -60155, -31676, 25447, 65637, 56739, 4191, -45292, -46409, 1519, 54167, 65921, 30375, -21714, -48303, -26403, 25273, 51381, 25744, -23909, -60977, -59688, -12025, 38482, 39660, 1101, -37133, -51262, -26154, 26212, 50242, 21539, -19214, -38687, -28602, 15875, 59694, 54331, 9866, -25239, -32210, -10893, 30641, 45657, 12650, -29631, -42653, -27131, 8260, 40279, 30503, -15012, -45052, -41167, -14387, 20769, 33871, 5663, -28809, -32669, -10718, 22598, 46506, 32194, -9347, -33411, -24753, 3431, 32145, 34390, 6187, -22632, -28188, -7279, 22280, 34294, 11518, -21779, -38893, -29956, 2273]
475B273K6721o634k4506j9201m277K0377L1896M339k6756k3888r341Q694L1560
488A1257K2695j4056k4719j4294l070J8286K7871j986k6402j7341m075J2316K8972
501A5454J7197j5593k3930j1529K155J8898K1220n145k2528j4563j217J5052K2996
514A8467O732j6844k0684j1466M092K1074J4322q348j5523r529k296J9182K2892
527B2071k166j5836j1041j1939O104K7235Q300j4465o976q462o812K1110J8996
540B6119j3492j4651p426j3534P401K6903J243j4313m125r517k702K1448J2436
553A5790j2174r009o942o342J5663J9766q23o110p750j2046Q058J5867l85l875
567I688p296j8019K780J9299K986j305L26j9777j0022J8578O345n982O812r281
$$ y = [2273, 28994, 22360, -2146, -21347, -25624, -5247, 26649, 30988, 4232, -19656, -28997, -20303, 11257, 33952, 19896, -4823, -19117, -22187, -3901, 23970, 21984, -4418, -21759, -25834, -13518, 15454, 32651, 17058, -6872, -18401, -16246, 2652, 23872, 18727, -3801, -18364, -19581, -4529, 18467, 25199, 8355, -12329, -23795, -19703, 1371, 15693, 7345, -8178, -17707, -20003, -821, 22071, 19905, 4069, -6972, -18911, -12807, 14428, 22728, 8263, 1287, -7175, -13987, 7123, 26119, 12627, -2024, -9450, -22984, -15583, 11320, 12563, -1750, -5875, -15392, -18094, 3354, 15790, 3616, -5393, -12335, -18677, -3014, 16752, 15929, 9819, 2069, -9977, -1919, 13948, 13563, 9688, 2392, -15627, -12847, 6452, 9438, 8133, 8459, -11318, -21340, -2762, 3583, -2399, 4413, -4868]
581d868j8428J4558J7771m280L909J831k2752k058K0669J419l185P148j1594j3023
595a2883J3951J1638m091J81o118j4497J014R992N048J720m886q377j112M836
609c584O864N693o573j0982L0J234K927J2063K422j2730k076M715l434O458R039
624A2066j0476r823M659P98J777J2734q21j2622j092K856j666N575L193p663p357
639g862J718L246N112M515k408o232n391j65N071K773j684j70l800k959Q676P895
655H335l682m71r49q225K65J0108L69m194L352m114m110R631M153o515j592l197
671h36q439J781P155L90l127L30j928j471N610L252j818m608k438N8K408N420
687A739N069r85l427J533J171J91K831p80p973l207K518J90K056M711l287o205
$$ y = [-4868, -23296, -8738, 9033, 4753, 8662, 10493, -12259, -14317, 6352, 7771, 4586, 11734, 140, -12883, 1068, 12706, 8615, 8796, 2678, -11819, -10805, -813, 4235, 5955, 1069, -7308, -8420, -3584, 3280, 8973, 2400, -8582, -8552, -7318, -4391, 7672, 10094, -2636, -4712, 3, -3431, 3027, 12066, 1590, -8233, -3574, -2776, -999, 11735, 10914, -1708, -2800, 56, -1610, 3965, 7158, -505, -7862, -6144, -2898, 2214, 6729, 4321, -1911, -7302, -7467, -2396, 377, -1307, -1477, -5277, -8236, 440, 8335, 4653, 4182, 3233, -4992, -4727, 5381, 5750, 1556, 4908, 794, -3316, 6315, 10468, 3953, 2361, -836, -9275, -7494, -339, 51, -3076, -2746, -4674, -6145, -535, 2717, 899, -3709, -6147, -6089, -3681, 1739, 6808, 5823, 2396, 3929, 5100, 5291, 8122, 7342, -631, -3838, -1320, -1130, 926, 5637, 2350, -3855]
703c855J499R80k615K230n20o005q53N027J919L803L556k553k762O85N89J038
719B163K012k691j426l97R65L878L231k014l399q96l327q05K885j573k987J430
735b951n25m17O011K162m902q01L91l687J970M186j296k212L215l02k73M478O40
752E687m174j633q56k228K147K667j744p61J455l75J391J625r05k479j200j541
768b924N34K957K69m72Q72p15n55J723m28k046j216j139k274K966K943j060L78
785a87J239j707N79K552p65j601P24o82n87L548J700j358o53K06k922J48J890
802B124j805k589j52j372N9K441P92j785k81m20j632J951J980m38J2N64n7K029
820A421L158O56p20k80j212r01J388p7j126o07r55j524Q80N5j281j067j916k355
$$ y = [-3855, -2356, -1376, -3991, -1761, -2281, -8286, -9139, -4112, -2193, 1610, 5166, 2613, -149, 536, 1125, 2163, 4175, 1484, 58, -339, 626, 4504, 7735, 5721, 2322, 1426, -1901, -2706, 179, -1394, -4381, -2951, -3476, -3893, 2118, 4280, -622, -1423, -1032, -4719, -2749, 1437, 141, -2071, 1144, 842, 569, 5047, 5687, 1513, -120, -976, -3204, -1057, 1610, -134, -895, 560, 185, 1576, 3201, 2296, -183, -1383, -2924, -2390, 567, 836, 364, 1236, 521, -34, 1689, 1261, -785, -2001, -3140, -5414, -2448, 495, -565, -187, 1052, -655, -76, 2476, 1711, 110, 834, 152, -435, 3113, 4813, 3455, 2802, 3008, 86, 234, 2124, 319, -2270, -2422, -3794, -3735, -1294, -502, -2287, -2568, -2988, -4620, -2669, -689, -1127, -1115, -551, -608, 1421, 4579, 5235, 4515, 4235, 3023, 2122, 3510, 3433, 2307, 1700, 745, -779, 101, 156, -1125, -2192, -4108, -6463]
838f463P61J470N15K24R15l12R08J994J389P17K8o14j11J891J211Q43P4j163j148
857C129m16l66l31j339k106j386m98O29R8k03o37n51o84Q57N89R77P46m83J195
876g80J132J895J851j33p46K67p74p50J443J33j876n79m53r02J173M89k387j572
894b569m67k95p18J882O48j042O24J068J72J080J683j059r50M02n62J055J371
911B323m01M5m55j77k20L07k95j721m19j153L2J452O17M74l43k1j28R4Q13k44
931E80j306l05k2P79J478K67l62k92p89o12J96J97r02q78l86K51O82K243J087
950A906j147q00O30l08J33K164j294j369J033J113j152K124M22l081o37m19j824
967b506L12J434j987j592K153j38m25K613J77k314R74N93j127K688J422j060J128
$$ y = [-6463, -5702, -4232, -3717, -3493, -2578, -2890, -1982, 12, 1401, 2118, 2146, 1532, 1421, 3312, 4523, 5366, 5440, 4277, 3129, 2713, 2347, 2016, 677, -1429, -2815, -3313, -2684, -2586, -2789, -3426, -3977, -4661, -3804, -3215, -2238, -1492, -1975, -780, 352, 2247, 4098, 3965, 3219, 3486, 2712, 1962, 3405, 3538, 1662, 1083, 630, -272, 901, 1390, -997, -2569, -3036, -3331, -4049, -2167, -1519, -2561, -1937, -869, -697, 383, 2066, 1007, 57, 459, -103, 952, 2323, 1922, 1967, 1512, 1335, 1115, 1422, 1127, -594, -1013, -2166, -2134, -682, -65, 409, 66, 45, -83, 11, 824, 580, -726, -1031, -1053, -274, 1204, 1471, 1109, 817, 28, -584, -388, -191, -1093, -1971, -2357, -2106, -1424, 819, 1906, 759, -41, 589, 281, 414, 2578, 1284, -85, 948, 2061, 909, 3033, 3455, 374, -263, -682, -2506, -2194, -760, -2747, -4339, -2186, -2324, -2749, -136, 41, -2273, -1299, -706, -1833, 855, 2277, 1217, 2345]
984B345N74m47J536P61j644j312n13k399K58J858j028j859J612j892j365K223
1000a292j16k766Q84k56j593K512L080m26Q57K072j758J05K572p5k064J589o35
1017B690j970J544J826k750m0j90k207j376J571l90k467K23L12l51J074J524j8
1034i95k82P75p78M83J785O31j36k24O65l06J610M58k23j373j569n30K39P2q71
1053e69O4j135n84J814j2j126P48l25k199Q98J941n88J15K410q06j792K806O19
1071B279j954J082j89k980J848J778j368K81J234k502n09K208q61q38Q22j411
1087a080r47J994P44r58J435j430o90J843l98j195R15o62j859J690N59r46J353
1104C68O94k793J02K185r45m63K187j377j108K520j42j05J579l32k016P47P68
$$ y = [2345, 2919, 2472, 4008, 4769, 3125, 1813, 1300, -1099, -841, 1017, -11, -1870, -258, -2150, -3515, -1292, -1408, -4174, -3290, -3546, -5139, -2627, 453, 27, 884, 2956, 1198, 1303, 3875, 3800, 1736, 3325, 2690, 720, 2264, 4090, 1340, 1300, 1110, -1097, -2473, -902, -1292, -3759, -3536, -3224, -3575, -2501, -977, -995, -1277, -502, -1280, -797, 988, 1619, 1483, 1259, 1924, 1618, 3228, 3686, 3463, 2090, 521, -9, 230, 302, -569, -505, -1640, -2224, -410, -422, -1548, -800, -1125, -3324, -2426, -485, -1073, -958, 1452, 646, -1146, 1660, 2279, 325, 1407, 1218, -1762, 86, 1864, 496, 777, 2011, -491, -1000, 1208, 347, -491, 331, -1080, -2027, -33, 711, -247, 1188, -242, -932, 911, 513, -682, 233, -429, -2288, -598, -39, -985, 368, 1062, -1731, -1629, 556, -389, -852, 1335, -42, -1150, 1370, 1228, 1123, 2702, 2370, 354, 1101, 1869]
1121A869k036J079O95k403j68R25q94L05O44j558p97L54m10K41J038J30r02J302
1139e86M13J40J982k14j590J266rk39J687K50q72l03m10j334K42O29j598l06q13
1158a665n05m08J565j001n17M16k79K41J544Q4m97N15K86J149R34P75K50k23k16
1177B448r56J49M93j73k21q41j447J48L42k40q68n58r28l48M99J104n16r4Q01
1196a206k70K26J399Q45k76j06L08j45L56J153n4j036N43k40r03P84J34r19j127
1215e34P4j195j6J462j053J03L52j037N26J025rp94O63n33L04J018Q86l79J57
1234A020M6r07O35Q31p90n96L1n42L97O61p10m3J91l77o60N67L67r24P42K2q15
1255h54N16J109n97J50m02m02l88L30J92k25N68q01j53J138L19j36Q6m15K61l09
$$ y = [1869, -167, 912, 1607, -796, -964, -39, -933, -628, 16, -1542, -2339, -1985, -2395, -2154, -1116, -986, -1888, -586, -173, -33, 1949, 1735, 145, 1411, 1402, 1163, 2850, 3100, 2228, 1925, 1515, 181, 423, 1052, -546, -852, -1665, -2170, -2578, -1013, -2014, -2531, -2115, -2394, -2153, -609, -525, -1022, -507, -221, 928, 1862, 2637, 2887, 2664, 2448, 1492, 1641, 2134, 1961, 1740, 899, -548, -400, -58, -298, -1166, -1724, -2652, -3000, -2501, -1397, -1913, -2007, -1206, -1476, -1250, 149, 994, 718, 612, 920, 775, 1131, 2284, 2230, 1194, 1737, 1497, 594, 1378, 1512, 593, -534, -460, -1655, -1671, -209, -1262, -1159, -807, -1844, -1318, -293, -302, -1096, -433, -966, -662, 356, 1242, 863, 1020, 1066, 159, 794, 1625, 835, 239, 270, -272, 125, 786, 76, 33, 224, -153, -813, -246, 121, -803, -61, -39, -854, -338, 771, 174, 324, -78, -480, -868, -538, -346, -571, -3, -804, -957, 181, 500, 364, 450, 35, 296, -13]
1275a3J058k57r5L53l36n05J142L92q28k44n62o68n6M46n47M09j045l38O24J09
1295i61M2J60o70k61P9J564K12L80Q3L46L07N35n5J88rm22r24j26P09l9j97m74
1317D67j115p25K60m4l58J11m69p22P22M82J94J188l31N5K31N14N39J46O01l75
1337A371O3M41l3jJ44p62o53nm87q61N86q31j155M77n20J126m5l50K32m29P77
1358i15J8L24M90O15k21L53N60N41L31j59m58m22r57P51N70q36no95q2N2M8m85
1380e82l65l09o61N27M93j0M33N18n14l16J84R14M5p8K23j06N22K39l97k42K24
1401G42n84O0N95q19R0O0n85J58K51n26N17K95l94m61R47p55K76N1l62m16N33
1422c27M20o94O19m43j50o9Q44r51L05P26Q1k10M29L17j70j30Q25j044N10l70
$$ y = [-13, 1045, 788, 693, 1046, 710, 205, 1347, 1739, 911, 667, 105, -563, -619, -173, -720, -311, -1356, -1694, -1070, -961, -919, -759, -1429, -1690, -1611, -47, 165, 545, 628, 974, 1281, 1816, 1761, 1949, 1940, 1518, 594, 468, 1177, 1138, 941, 467, -648, -1373, -1113, -1157, -1515, -1404, -1873, -2595, -1873, -1391, -1197, -9, -340, -285, -54, 460, 999, 1145, 1746, 1371, 1434, 1875, 1842, 1841, 1985, 1223, 570, 565, 78, -783, -197, -1028, -2183, -1706, -2226, -1100, -1145, -1495, -1263, -1692, -915, -897, -573, -83, 532, 311, 664, 1224, 1765, 2096, 1937, 1479, 1057, 100, 851, 1421, 585, 580, -115, -197, -145, -97, -582, -947, -1256, -1917, -1390, -897, -907, -474, 44, -470, -786, -602, 312, 357, 279, 502, 396, 918, 1157, 760, 518, 742, 158, 218, 813, -6, 84, 144, -441, -283, -32, -558, -41, 254, -140, -601, 346, -409, -133, -82, -444, -860, -327, 93, -601, 18, -425, -575, -644, 200, -751, -446, 280, 361, 151, 580, 897, 727, 597, 1422, 378, 888, 518]
1442E18J9N25n01q76K98L13j390K69K06k63K4j38o74Q63M20q4p91M68P3L98P3
1463b50O80j55K22O1R77pK97p88N41p05P5l90J21j69j117J82J39j88n84J91j56
1484a023j18n46K54L07K2M24m79O26N62J58L94N34J34m32M36k43N45m7p52M1K02
1505I99j54J35q44l75k52n66J31p52K79M17k25N23j163J186O2L24k91R8N07L31
1525C70L72l73J078K91m14N08p06N4m11j86l92o30J84l47J57L08j49m50K54m98
1545i80M35J2n61J44L51m6M08J76P01o00l23O18k54K29k20N50J14l00Q5j08J76
1566F07k05L04o64j72k9l9j59o24R30P2O5j11k84J98J25r73L30O14k58l60L99
1587b34K12l80J35J095q62j38M83j32l01J143j96k09M61n0l27J006m33j092M73
$$ y = [518, 537, 1062, 561, -315, -17, 296, -1094, -825, -619, -882, -858, -996, -1670, -807, -387, -471, -1262, -794, -721, -323, -250, 430, 275, 497, 558, 1535, 1528, 1825, 1037, 1578, 873, 948, 558, 679, 510, -607, -425, -286, -474, -1058, -867, -1023, -1141, -1687, -1433, -1126, -1104, -680, -1159, -533, 29, 187, 581, 1115, 1249, 817, 1253, 1010, 1555, 1508, 756, 797, 999, 845, 980, 136, -239, -491, -1057, -926, -1678, -1399, -982, -1207, -684, -1847, -661, -599, -275, -566, -468, 39, 370, 742, 369, 1447, 1738, 1324, 1832, 1126, 1180, 769, 583, 191, -439, -255, -602, -445, -137, -286, -736, -482, -980, -545, -533, -1094, -950, -599, -645, -237, -61, 640, 40, -283, 335, 81, 310, 90, 640, 754, 454, 539, 431, 607, 402, 706, 42, -130, -159, -198, -357, -981, -51, 21, 86, -25, -309, -111, 14, -959, -629, -15, -273, -633, -234, -22, -402, -267, 828, -34, -172, 311, 179, -122, 1021, 825, 616, 1077, 1027, 700, 1706, 1273, 181, 654]
1606F54K66j296J13N50p13K25J61p41n33R44k52o31K33O8M67K08P7j58R35J75
1626G52j13k20R43q87L11P39o45l5K23n09k22N32p52j86r26R2K2N12o97m69O38
1647h97K83o30O08L95l75K49L11K43m24P95j29p1J016l8n05N27n84k2j86J04J07
1668G77j28p77L09n99LP3j98K4m94J61k32O00j43j8J65J81Q4N74K49L01j26j55
1690F31M77k86l61N37R6m66l01k70K03k30L9l87K69j28k54o8J0k86n33P26k03
1711g85M72m70M63j56P18m2m07O47j08K60j96J81l88j20K81L59k22p28O17L34
1731G10o38n85J022r93M96Rm72J31K96l47j83l22N45j98L55m25L04L79k98J4K9
1752a71K53K86l73N61l25j46K88j76J2L06m22L2N06o14k80N93O1n58K22K8k28
$$ y = [654, 920, -376, -263, 287, -426, -201, -40, -781, -1314, -370, -622, -1253, -1020, -952, -485, -277, -200, -358, 577, 752, 639, 419, 1362, 475, 786, 1525, 880, 845, 1068, 559, 337, 869, 117, -69, -995, -903, -881, -369, -1066, -1535, -897, -614, -1244, -636, -241, -616, -367, -56, 187, -237, 558, 429, 358, 1374, 1336, 831, 1358, 774, 752, 566, 670, 777, 649, -128, 181, -418, -415, -342, -540, -516, -1010, -849, -1081, -481, -624, -642, -477, -296, -212, 362, 611, 912, 786, 631, 1108, 822, 461, 998, 1094, 628, 327, 57, 260, 30, 69, -318, -49, -177, -431, -499, -489, -775, -1308, -582, -785, -313, -783, -320, -476, 242, 200, -207, 440, 332, 592, 396, 577, 189, 69, 350, 709, 487, -241, 376, 710, 72, -513, 509, -484, 12, 21, -451, -320, -24, -371, -554, -876, -331, -529, -174, -599, -295, 84, -214, -200, -171, 82, 368, -5, 556, 231, 85, 373, 197, 209, 515, 93, 125, 631, 17, -263, 330, 391, -167, 55, 83, -145]
1773a45p47R76l27j57K36m10K32k42L15l82L46Q9L86M85l70K60L78k67N1J14n05
1794C16N10n58Q19n17j24J09q8p57M57L13j480J39k92M97o35Q94j52k79N15j39
1814d52N0M67M32n13M46j12K58R6M68k64m21K73L28q13L68n87k5k16j7l29L29
1835b34k94J42J34j077M21M40k83j98N86j78J27Q53n60L09J11J42j80M41K98k31
1855G69k33j00N8N86p11Rm97K56k44J42m91k67r4R03q47L22J6M54p04L30k76K74
1877c45L76q6L03m72M65k3Q7k40L91P1k15K15J51j008M81o5M98o69n05M4o6L84
1899b28m33M89k43k68k06Q60N4l97L01j39k20M11K20p18O95k2M12k68J66N47m77
1920E36j60l88K77K27m01o2l1M96q03P49n20m8K20n82%j06o07N92j04M7P83r72
$$ y = [-145, -892, 84, -243, -400, -164, -574, -342, -584, -269, -651, -305, -216, 170, 655, 285, 545, 923, 656, 707, 821, 316, 826, 268, 1087, 570, 446, 555, 467, -290, 167, 480, -1000, -861, -1153, -656, -1291, -397, -549, -828, -313, -452, -402, 65, 497, -16, 430, 318, 576, 672, 1140, 876, 455, 728, 1056, 243, 611, 24, -1, -217, -234, -563, -234, -528, -386, -252, -1329, -908, -468, -751, -949, -363, -541, -414, 439, -121, 188, 299, 441, 261, 702, 1000, 769, 536, 436, 494, 1080, 369, 378, -119, 137, -107, 35, -456, -723, -817, 86, -761, -439, -423, 31, -673, -343, -619, -345, 31, -55, 248, -224, 241, 218, 305, 65, 456, 527, 312, 527, 678, -330, 151, 86, 584, -85, -590, -546, -612, -228, -661, -172, -415, -683, -889, -29, 25, -372, -71, -210, -430, -19, 201, -517, 178, 156, 568, 300, 466, 1013, 536, 376, -12, 265, 492, 91, 29, -2, 494, -309, 440, -80, -128, 92, -490, -490, -596, -1203, -611, -715, -668, 115, -857]
1942h57P73N7J3rk0n2N36j53j01K9L65k18L10k15l24K47k67L20l96K53n60n12
1964g81N04O9j9Q0o26P79o75L81L3J45k51l46Q66K19l62N18J20l30J30k17k62
1985b5J48P66l94J46m1j54n91L57l40j95O04j013M10j36j10M47j61K93p67Q50
2005I4j83k14J34k49L94K75J12J1j0M71p57P12N8n62L10j46L9n96Q46P5j268L77
2027g7R1%l9j19m61oL51k79L48l61K81m90P92m56K93j6j8Q90o1p24L15L33N3l14
2051C26L03L04n41l70J05j96M07l08p80P05m74o39L38j61M18l54Q56M7m39M46
2071gj57M66m09J5L96N60l28J40L65q56K09P16r58L94m04J59j74J67J05l19R4
2092A74o6n23M04j21n45j61K84J75o7M5J67J68k74P69k23P1k03J70J78k60L52
$$ y = [-857, -84, -27, -14, -23, -43, -95, 441, 288, 187, 216, 581, 363, 673, 458, 134, 381, 114, 434, 38, 291, -269, -781, -277, -208, -227, -147, -773, 6, -669, -288, -255, -110, -361, -707, 159, 378, 16, 534, 654, 324, 454, 237, -25, 123, 889, 495, 641, 600, 446, -145, 212, -128, -323, 281, -732, -322, -458, -568, -121, -282, 11, -756, 94, -89, -303, -169, -418, -24, 251, 363, 374, 364, 835, 78, 790, 848, 286, 596, 450, 489, -107, 739, 814, -454, -77, 14, 14, -25, -144, -605, -611, -260, -539, -191, -552, -271, -761, 31, -425, -132, -148, -166, 724, 663, -61, 254, 587, 640, 326, 629, 933, 392, 22, 127, -69, 338, 30, -750, -45, -519, -1158, -820, -981, -563, -917, -61, -14, -453, -7, -164, 302, -107, -92, 304, 864, 536, 676, 1041, 185, 394, 1110, 152, 546, 142, 301, 127, 294, 399, 80, 174, 108, -415, -11, -132, -677, -838, -554, -379, -446, -401, -234, -66, -340, 429, 206, 277, 74, 244, 422, 162, 514]
2113E14n15O65j82j76k5n77L19L83o70J28q4J07M76k86l20k97N42l19n14L37P04
2134B10q80O63M42j56K1j98L21Lp1j95L4M6R6j18N10m41k58k12M59q63K69J64
2156a54k07k0L17j67k15O09p23M5J35K4L28j33N26J97n99j31L66k15K71k0k06
2177B8P5n6L64l87l7p9K31K38l58n80P00l68N96l91lK8J5k71o4n0l56L86p8L06
2201a11N0J88k80p04J169l10J22O8l34P84j65o36O40K3K41j21l20j80J53q4p63
2222e70L68K65j68k67RJ13R4m53O0NP30o76J54N80o72K47L88P2j20L0J32l06J74
2245A89L46l49K80j52k10J12q1k40n3L4k24n7K33k1l29J74K30L8j79M3k47N25
2267F2O6k19K19O7N92o17O07n12L92pl08l38q6J95m68J46N72p41L14K23q02P63
$$ y = [514, -1, 664, 482, 306, 281, -296, 23, 406, -264, -136, -220, -113, 363, 77, -243, -540, 2, -317, -831, -494, 210, -670, -7, 435, 279, 300, 102, 423, 426, 355, 160, 194, 240, 336, 218, 728, 287, 29, -183, 276, -587, -318, -154, -361, -381, -64, -231, -446, 163, -560, -515, -380, -356, -28, -161, 365, 562, -37, -168, 198, -17, 254, 234, 28, 103, 47, 411, 24, -13, -92, 139, 377, 19, -561, 139, -229, 367, -24, -27, 1, 16, -255, -319, -369, -725, -339, -417, -111, -61, 127, -153, -857, 312, 2, 124, 192, -142, 642, 477, -159, 481, 504, 745, 624, 304, 124, 277, 193, -570, -202, 63, -105, -372, -363, -250, -156, -609, -549, -544, 186, -490, -336, 244, -428, -181, 207, 279, 159, 189, 321, 15, 189, 535, 186, 466, 314, 104, 216, 135, -105, -158, -124, -348, -405, -172, -193, -522, -348, -118, -80, -259, -216, -463, 62, 128, -91, 128, 195, 787, 170, 777, 265, 657, 650, 342, 4, -82, 113, -355, -209, 363, -378, -64, 159, -643, 120]
2289A20n79l27R0R76l45L3o4r5j55N96J15k7j59k40M4N25m21k49M15l5P5k42L18
2312C69m40J69ml14m38O65l72o2M31l00m16L71n2j78P89l16j6M00m92j41k16O30
2334F7L64k98N5m60Q51p16j27L12J41r4J95L99m02j93L70q6j18l23k03q2N43j19
2356G6m19K38k37N15l25k54J98r2J33P78n12J69l05m3Q86m98K79n47N05j65N5
2377D35p86M33M6O8j92j34r7J57P6J7LK70m80p5l53K51L89n05M60J16m41L08j15
2400a49K34q9N77J08n28N45n35M70n93K58P4J90q31j6K65n1l47J85L13j34k71
2421c25m1J1Q14n91%l27M41K97o11L47K06m74N39k16J64K62n84K62J68j74K49
2442D17l99l06L61j37K2m87O35m53M21k43k70O89p72K53k99P52q8j93P3J22k43
$$ y = [120, -459, -786, -696, 280, -65, -32, -96, -191, -346, 250, 365, 338, 179, -61, -17, 508, 87, -162, 253, 218, 293, 51, 369, -71, 98, 94, -220, -658, 7, -365, -427, 4, -296, -712, -341, -393, -571, 218, -98, -114, 286, -206, -347, -563, 67, 431, 133, 188, -272, 579, -137, -264, 48, 189, 95, 290, 689, 287, 94, 464, 378, 260, -63, -266, -348, 195, 76, -343, -105, -342, 173, -152, -406, -208, -300, -167, 611, 99, 268, -37, -80, 806, 308, 587, 40, 545, 380, 435, -351, 82, 128, 196, 4, -130, -227, -70, 6, 23, 26, 296, -184, -259, -612, -361, 28, -477, -17, 99, -342, -34, -149, 85, -4, 573, 681, 153, 698, 163, 633, 40, 298, 372, 562, -269, -285, -20, -71, -418, -233, 80, -54, -325, -366, -355, 459, -132, -132, -459, -18, 279, -332, 15, 221, -253, 286, 70, 234, 496, -88, 174, 342, 168, 417, 18, -288, 73, -64, -42, -529, 106, -347, 74, -169, -439, 250, -522, -269, -568, 184, 96, -97, -24, 98, -145]
2463a45P01j28k17L82m91L07o4J61p91R91l91k16k4m17J59M5j75j4M56m17J50
2484a38m9n86O23k88J14J98J29l0N3j34J16L21K6r9K19p0j76L43P8k85K38k28
2506C75j79j84J01n64P42k1l60rN3J41q4k41K47m14m1l40O52L4K4k50J82L50K19
2529D33m59N92n53j23J34J19M1R3M70j008P36K47m36m54N15p73M56m78J77l36
2549f07N58k62n89R58J40m28L2J95j32O0J43k73K31j43L10j84M1L43K42J52n11
2570B76q6J78n45k3P68o35J22P7O8n21K7p2j94N13k59J39j60o8J20k93P54k54
2592f8J12l42J00M98k53P76o50N19n34N4l25J95k89K02K70r4j50M07l29R8m37
2613b40l25N09J02m8k21J52p1Q6k00n4M91j57L6p9J16K19n12K93P3k80N81p00
$$ y = [-145, 556, 428, 211, 593, 102, 409, 345, 506, -285, 706, 315, 99, 75, -342, -183, -138, -313, -327, 129, -288, -138, -187, -773, -150, -438, -324, -126, 3, -27, 26, -108, 8, 329, 355, 256, 475, 405, 229, 572, 650, 365, 603, 375, 196, 12, 113, -451, 291, 270, -90, -99, -46, 95, 11, -230, 17, -397, -438, -778, -126, -92, -68, -318, -136, 214, 433, -26, 566, 13, -110, 24, 143, 184, 277, 747, -261, 475, 722, 286, -168, 347, -426, 30, -448, -271, -607, -49, -311, -900, 58, 198, -230, -198, -3, -135, -75, 68, -205, 26, -117, 193, 9, 50, 393, 635, 787, 276, 190, 368, -177, -200, 568, -67, 55, 132, 200, -321, -294, -366, -560, -47, -306, -167, -327, -395, -275, -568, 186, -68, 44, -298, -198, 300, 47, 823, 173, 692, 158, 212, -113, 82, -207, -5, 265, 171, 21, 428, 99, 197, -240, -565, -56, 46, -2, -223, -71, -142, -56, -256, -310, 181, 24, 60, -19, 97, 316, -196, 97, 170, -110, 471, -229]
2635b29L80j15J7j4k18N23k55m25N00j76l7p4k6J3K18j69j69m76O39k7k41K54
2657a07P7R2J32Qj76o46P75L13N5n65M3k86Q06n13J72m47J17K47m66J94l81N44
2679a2l34N34j27m46N14O7l31q1j63k1N50K25o26M60O19o16j72K87k96k61K8N40
$$ y = [-229, 151, 36, 53, 39, -179, 344, 89, -336, 164, -12, -49, -123, -149, -136, 82, -87, -256, -732, -93, -120, -361, -107, -30, 62, 194, 202, 26, -620, 155, 468, 523, -42, 1, -285, 521, 8, 180, -267, -150, 97, -369, -175, -556, -12, -346, 188, 61, -385, 129, 196, -135, -216, -379, -400, 150, 375, -251, 209, 828, 212, 40, 327, 31, -230, -202, 338]
$$ [...]
8191F2
##END NTUPLES=NMR FID
##END=
