##TITLE=1H_SR158H3W
 D2O
 48 sc, 
 13.4.2023
##JCAMPDX= 6.0         $$ Bruker NMR JCAMP-DX V2.0
##DATA TYPE= NMR FID
##DATA CLASS= NTUPLES
##ORIGIN= UXNMR, Bruker Analytische Messtechnik GmbH
##OWNER= root
$$ XWIN-NMR		Version 3.5
$$ Thu Apr 13 15:34:48 2023 Russian Standard Time (UT+4h)  she@DPX200
##.OBSERVE FREQUENCY= 200.13135
##.OBSERVE NUCLEUS= ^1H
##.DELAY= (6, 6)
##.ACQUISITION MODE= SIMULTANEOUS
##.ACQUISITION SCHEME= undefined
##.AVERAGES= 48
##.DIGITISER RES= 18
##SPECTROMETER/DATA SYSTEM= spect
##.PULSE SEQUENCE= zg30
##.SOLVENT NAME= D2O
##.SHIFT REFERENCE= (INTERNAL, D2O, 0, 15.7039)
##AUDIT TRAIL= $$ (NUMBER, WHEN, WHO, WHERE, WHAT)
$$ ##TITLE= Audit trail, XWIN-NMR		Version 3.5
$$ ##JCAMPDX= 5.01
$$ ##ORIGIN= Bruker BioSpin GmbH
$$ ##OWNER= she
$$ F:/spectra/data/she/nmr/H-F/1/audita.txt
$$ ##AUDIT TRAIL=  $$ (NUMBER, WHEN, WHO, WHERE, WHAT)
(   1,<2023-04-13 15:33:02.85 +0400>,<she>,<DPX200>,
      <continue with go, POWCHK disabled, PULCHK disabled
       configuration hash MD5:
       00 E9 B6 7A A2 85 ED C7 34 08 36 98 17 FE 4E 26
       data hash MD5: 16K
       CB 4B FF 49 CC 03 FF F4 AE AB 70 D8 C9 E1 92 29>)
$$ ##END=
$$ 
$$ hash MD5
$$ 97 2F 2F 82 AE FD B0 DA 58 81 8A B1 E6 71 06 82
##$RELAX= 
##$RELAX= 
##$RELAX= 
##$RELAX= 
##$RELAX= 
##$RELAX= 
$$ Bruker specific parameters
$$ --------------------------
##$DU= <F:/spectra>
##$EXPNO= 1
##$NAME= <H-F>
##$PROCNO= 1
##$TYPE= <nmr>
##$USER= <she>
##$AMP= (0..31)
100 100 100 100 100 100 100 100 100 100 100 100 100 100 100 100 100 100 
100 100 100 100 100 100 100 100 100 100 100 100 100 100 
##$AQSEQ= 0
##$AQ_mod= 1
##$AUNM= <au_zg>
##$AUTOPOS= <>
##$BF1= 200.13
##$BF2= 200.13
##$BF3= 200.13
##$BF4= 200.13
##$BF5= 200.13
##$BF6= 200.13
##$BF7= 200.13
##$BF8= 200.13
##$BYTORDA= 1
##$CFDGTYP= 0
##$CFRGTYP= 5
##$CHEMSTR= <none>
##$CNST= (0..31)
1 1 145 1 1 1 1 1 1 1 1 1 1 1 1 1 1 1 1 1 1 1 1 1 1 1 1 1 1 1 1 1 
##$CPDPRG= <>
##$CPDPRG1= <>
##$CPDPRG2= <>
##$CPDPRG3= <>
##$CPDPRG4= <mlev>
##$CPDPRG5= <mlev>
##$CPDPRG6= <mlev>
##$CPDPRG7= <mlev>
##$CPDPRG8= <mlev>
##$CPDPRGB= <>
##$CPDPRGT= <>
##$D= (0..31)
0 1.2 0 0 0 0 0 0 0 0.06 0 0.03 0 0 0 0 0.0002 0 0 0 0 0 0 0 0 0 0 0 0 
0 0 0 
##$DATE= 1681385395
##$DBL= (0..7)
120 120 120 120 120 120 120 120 
##$DBP= (0..7)
150 150 150 150 150 150 150 150 
##$DBP07= 0
##$DBPNAM0= <>
##$DBPNAM1= <>
##$DBPNAM2= <>
##$DBPNAM3= <>
##$DBPNAM4= <>
##$DBPNAM5= <>
##$DBPNAM6= <>
##$DBPNAM7= <>
##$DBPOAL= (0..7)
0.5 0.5 0.5 0.5 0.5 0.5 0.5 0.5 
##$DBPOFFS= (0..7)
0 0 0 0 0 0 0 0 
##$DE= 6
##$DECBNUC= <off>
##$DECIM= 32
##$DECNUC= <off>
##$DECSTAT= 4
##$DIGMOD= 1
##$DIGTYP= 9
##$DL= (0..7)
0 120 120 120 120 120 120 120 
##$DP= (0..7)
150 150 150 150 150 150 150 150 
##$DP07= 0
##$DPNAME0= <>
##$DPNAME1= <>
##$DPNAME2= <>
##$DPNAME3= <>
##$DPNAME4= <>
##$DPNAME5= <>
##$DPNAME6= <>
##$DPNAME7= <>
##$DPOAL= (0..7)
0.5 0.5 0.5 0.5 0.5 0.5 0.5 0.5 
##$DPOFFS= (0..7)
0 0 0 0 0 0 0 0 
##$DQDMODE= 0
##$DR= 18
##$DS= 0
##$DSLIST= <SSSSSSSSSSSSSSS>
$$ [...]
##$SUBNAM2= <"">
##$SUBNAM3= <"">
##$SUBNAM4= <"">
##$SUBNAM5= <"">
##$SUBNAM6= <"">
##$SUBNAM7= <"">
##$SUBNAM8= <"">
##$SUBNAM9= <"">
##$SW= 18.05172834244
##$SWIBOX= (0..15)
0 0 2 0 0 0 0 0 0 0 0 0 0 0 0 0 
##$SW_h= 3612.71676300578
##$TD= 16384
##$TD0= 1
##$TE= 0
##$TE2= 300
##$TE3= 300
##$TEG= 300
##$TL= (0..7)
0 120 120 120 120 120 120 120 
##$TP= (0..7)
150 150 150 150 150 150 150 150 
##$TP07= 0
##$TPNAME0= <>
##$TPNAME1= <>
##$TPNAME2= <>
##$TPNAME3= <>
##$TPNAME4= <>
##$TPNAME5= <>
##$TPNAME6= <>
##$TPNAME7= <>
##$TPOAL= (0..7)
0.5 0.5 0.5 0.5 0.5 0.5 0.5 0.5 
##$TPOFFS= (0..7)
0 0 0 0 0 0 0 0 
##$TUNHIN= 0
##$TUNHOUT= 0
##$TUNXOUT= 0
##$USERA1= <user>
##$USERA2= <user>
##$USERA3= <user>
##$USERA4= <user>
##$USERA5= <user>
##$V9= 5
##$VALIST= <valist>
##$VCLIST= <CCCCCCCCCCCCCCC>
##$VD= 0
##$VDLIST= <DDDDDDDDDDDDDDD>
##$VPLIST= <PPPPPPPPPPPPPPP>
##$VTLIST= <TTTTTTTTTTTTTTT>
##$WBST= 1024
##$WBSW= 4
##$XGAIN= (0..3)
0 0 0 0 
##$XL= 0
##$YL= 0
##$YMAX_a= 927467
##$YMIN_a= -1036039
##$ZGOPTNS= <>
##$ZL1= 120
##$ZL2= 120
##$ZL3= 120
##$ZL4= 120
##$ABSF1= 10
##$ABSF2= 0
##$ABSG= 5
##$ABSL= 3
##$ALPHA= 0
##$AQORDER= 0
##$ASSFAC= 0
##$ASSFACI= 0
##$ASSFACX= 0
##$ASSWID= 0
##$AUNMP= <proc_1d>
##$AZFE= 0.1
##$AZFW= 0.1
##$BCFW= 1
##$BC_mod= 2
##$BYTORDP= 1
##$COROFFS= 0
##$CY= 11.3945322036743
##$DATMOD= 1
##$DC= 2
##$DFILT= <>
##$DTYPP= 0
##$F1P= 15.7292609196834
##$F2P= 12.9074282941183
##$FCOR= 0.5
##$FTSIZE= 0
##$FT_mod= 4
##$GAMMA= 1
##$GB= 0.15
##$INTBC= 1
##$INTSCL= 1
##$ISEN= 128
##$LB= 0.24
##$LEV0= 0
##$LPBIN= 0
##$MAXI= 10000
##$MC2= 0
##$MEAN= 0
##$ME_mod= 0
##$MI= 1.114404
##$NCOEF= 0
##$NC_proc= 0
##$NLEV= 6
##$NOISF1= 3.799351
##$NOISF2= 2.8
##$NSP= 1
##$NTH_PI= 0
##$NZP= 0
##$OFFSET= 15.70392
##$PC= 1
##$PHC0= -19834.3
##$PHC1= 10.60081
##$PH_mod= 1
##$PKNL= yes
##$PPARMOD= 0
##$PSCAL= 0
##$PSIGN= 0
##$REVERSE= no
##$SF= 200.130013532006
##$SI= 16384
##$SIGF1= 3
##$SIGF2= 2
##$SINO= 400
##$SIOLD= 16384
##$SREGLST= <1H.CDCl3>
##$SSB= 0
##$STSI= 0
##$STSR= 0
##$SW_p= 3612.71676300578
##$SYMM= 0
##$S_DEV= 0
##$TDeff= 0
##$TDoff= 0
##$TI= <>
##$TILT= no
##$TM1= 0
##$TM2= 0
##$TOPLEV= 0
##$USERP1= <user>
##$USERP2= <user>
##$USERP3= <user>
##$USERP4= <user>
##$USERP5= <user>
##$WDW= 1
##$XDIM= 8192
##$YMAX_p= 0
##$YMIN_p= 0
$$ End of Bruker specific parameters
$$ ---------------------------------
##NTUPLES= NMR FID
##VAR_NAME=  TIME,          FID/REAL,        FID/IMAG
##SYMBOL=    X,             R,               I
##VAR_TYPE=  INDEPENDENT,   DEPENDENT,       DEPENDENT
##VAR_FORM=  AFFN,          ASDF,            ASDF
##VAR_DIM=   8192,          8192,            8192
##UNITS=     SECONDS,       ARBITRARY UNITS, ARBITRARY UNITS
##FACTOR=    0.0002768,     1,               1
##FIRST=     0,             0,               0
##LAST=      2.2672688,     0,               0
##MIN=       0,             -1036039,        0
##MAX=       2.2672688,     927467,          0
$$ Real data points
##PAGE= N=1
##DATA TABLE= (X++(R..R)), XYDATA
$$ [...]
2669c973k368L3M143M151L203J533k314m736l527k190Q15L391L842L879K0k081
$$ -3973 -6341 -6308 -2165 1986 5189 6722 4408 -328 -3855 -6045 -5230 -1839 2003 5882 5902 3821
2685C821l984m839j456J288K930M929K840K42k363m012m837q51J417L441L946
$$ 3821 -163 -5002 -6458 -5170 -2240 2689 5529 5771 3408 -604 -5441 -6292 -4875 -1434 2512
2700B512L580m03k889l884l722j918J897L400M253L431n13k775m532k657j586
$$ 2512 6092 5689 2800 -1084 -4806 -6724 -4827 -1427 2826 6257 5744 2969 -1563 -4220 -5806
2715e806J237L932M722J831n27j949n003k824j591J872L729L891L027m81l477
$$ -5806 -4569 -637 4085 5916 5389 3440 -1563 -4387 -5978 -4106 -377 3514 6541 6060 2583
2730B583m150l813l76K026L658L903J769o97l208m247k974m09K072M284L325K331
$$ 2583 -1567 -5380 -5756 -3730 -72 3831 5600 4903 1695 -2552 -5526 -5935 -3863 421 3746 6077
2746F077j256k905m260k894k21L066L171L164J605j121l011m024l023L91K262
$$ 6077 4821 1916 -2344 -5238 -5459 -2393 778 3942 5547 4426 1415 -2609 -5632 -5241 -2979
2761b979L731L395J773j728l612l816j978l90K834M838K681J801l308k684l884
$$ -2979 752 4147 5920 4192 580 -3236 -5214 -5604 -2770 2068 4749 6550 3242 558 -3326
2776c326k267J232J949L780L374O29j402l893l853j326N13K707L727K796N19j533
$$ -3326 -5593 -4361 -2412 1368 4742 5371 3969 76 -3777 -5103 -4590 -1883 1844 4640 5159 3626
2792C626l283m072j620Q75K691M114J567J454k531l586l295j175P33L300M049
$$ 3626 343 -3729 -5349 -4474 -1783 2331 3898 5352 2821 -765 -4060 -5235 -4502 -1202 2847
2807B847K033l4j718m258k964q33Q48K809L792K199M41k800l104l585q84Q91L647
$$ 2847 4880 4846 3128 -1130 -4094 -4927 -4079 -1270 2522 4721 5162 2362 -742 -4327 -5211 -4320 -673
2824f73L175K762o41j847m403k561o42R86L444K962K308m15k580l248k754j043
$$ -673 2502 5264 4623 2776 -1627 -4188 -4830 -3844 -400 2562 4870 4455 1875 -1373 -4127 -5170
2840e170J842K921L913J754j137k226l472k157m67J085L626L215J258p18l159
$$ -5170 -3328 -407 3506 5260 4123 1897 -1575 -3732 -4199 -3114 512 3727 4985 4267 1108
2855A108l158k246p04K154K860L580J648j303k560l103k658l82K375L798K149
$$ 1108 -2050 -4296 -5000 -2846 14 3594 5242 3939 1379 -1724 -4382 -4764 -2389 1409 3558
2870C558Q64p70k804l261k050m3J576L622K985J371r63l173l376j969j91K778
$$ 3558 4422 3652 848 -2413 -4463 -4506 -2930 692 3677 5048 4085 912 -2464 -4433 -4624 -1846
2886a846K919K582N52o42l940k604r08o21K188L167L406J99j278k778k997j879
$$ -1846 1073 3655 4207 3565 -375 -2979 -3887 -4508 -2320 847 4253 4452 3174 396 -2601 -4480
2902d480l82L234L651J809L94r93k776m225j169J291K097L249K538Q8j630l278
$$ -4480 -4862 -1628 2023 3832 4226 3233 457 -3768 -4937 -3646 -1549 1700 4238 4326 2696 -582
2918e82k738k152J910L058K813J625M30k151l345k157j251J752J608L826J934
$$ -582 -3320 -5472 -3562 -504 2309 3934 4364 2213 -1132 -3289 -4540 -2788 -1180 2646 4580
2933D580p6k392k904k029j390J556K096K722J918n53k133k245k674p79J293K362
$$ 4580 4504 2112 -792 -2821 -4211 -2655 -559 2163 4081 3528 1395 -850 -3524 -4303 -3010 -648
2949f48L017K244l91k536k977k248p68J912K181L603Q51r71k381k496j849o55
$$ -648 2369 4613 4222 1686 -1291 -3539 -4307 -2395 -214 3389 4240 3269 888 -1608 -3457 -4112
2965d112J548K435K950O75m35k460k324j696j40J307K786K116J209J08l277k327
$$ -4112 -2564 -129 2821 3496 3061 601 -1723 -3419 -3559 -2252 534 2650 3859 3967 690 -1637
2981a637k457K97J419L438K631P13j026k408l166j825N68J423K515K802P41j178
$$ -1637 -4094 -3797 -2378 1060 3691 4404 3378 970 -2196 -4021 -3453 -2030 485 3287 4028 2850
2997B850k843k178j928M8K576K729J727J836k588j767k284k711J198K049J908
$$ 2850 7 -2171 -4099 -4051 -1475 1254 2981 4817 2229 462 -1822 -4533 -3335 -1286 622
3012F22K706M53j310k084l179m49j94K145K768J837O55j614k633k182j065L80
$$ 622 3328 3781 2471 387 -2792 -3241 -3435 -1290 1478 3315 3970 2356 -277 -2459 -3524 -3144
3028c144K284K669J567M26j622l221k101q47J213K050K672J935n85j527k873j927
$$ -3144 -860 1809 3376 3802 2180 -1041 -3142 -3989 -2776 -726 1946 3881 3296 1769 -1104 -3031
3044c031j044J249K508K721J305m81k271j635k069r21J000K842K009J713p80j765
$$ -3031 -4075 -2826 -318 2403 3708 3227 956 -679 -2748 -3669 -2669 173 2182 3895 3115 1350
3060A350k438k387m34J036K937K149J286m73k619j310k671k63J529K319K051J098
$$ 1350 -1088 -3475 -3909 -2873 64 2213 3499 3026 407 -903 -3574 -3837 -2308 11 2062 3160
3076C160J05k144k721j486j95J266K134K691N48n42j960k710j362K28J090K127
$$ 3160 3265 1121 -1600 -3086 -3281 -2015 119 2810 3358 2816 856 -1854 -3216 -2988 -1898 229
3092B29K602K7n60j394k641k428Q78J172K705K070R45r47k252k549j611J003J399
$$ 229 2831 2858 2298 904 -1737 -4165 -3287 -2115 590 2660 3605 2658 406 -2143 -3754 -2751 -1352
3109a352K484K104L87j399k339j418j422J20J430K367J794L41q43k231j376j895
$$ -1352 1132 3236 3623 2224 -115 -1533 -2955 -2835 -1405 962 2756 3097 2254 23 -1353 -3248
3125c248N88J476J801K360J69j276k407j826m59L24J666K168J634l87p35k500
$$ -3248 -2660 -1184 617 2977 3146 1870 -537 -2363 -2822 -2498 -832 1336 2970 2583 1848 -652
3141f52j629j010Q49J873J973J735p06j008k021j472j084R69K089J372K121l53
$$ -652 -2281 -3291 -2442 -569 1404 3139 2433 1425 -596 -2068 -3152 -2183 -94 1278 3399 3046
3157C046j794k073r93j297R69J965J555K204p16j140k750j057j345Q07K689J976
$$ 3046 1252 -821 -1814 -3111 -2142 -177 1378 3582 2866 1726 -1024 -2081 -3426 -2619 70 2046
3173B046J469j126j173j855k143r2J349J731J878J243q15j573k237j468J99Q96
$$ 2046 3515 2389 1216 -639 -2782 -2874 -1525 206 2084 3327 2512 939 -1298 -2766 -2567 -1671
3189a671J619K166J531j651j628j537j242m86J024J833K328P94o86j354k252j903
$$ -1671 -52 2114 3645 1994 366 -1171 -2413 -2899 -1875 -42 2286 3080 2394 1040 -1212 -3115
3205c115M69J344J885J951O14o75j809k055j242j81J739J869J426P94j315j521
$$ -3115 -2646 -1302 583 2534 3148 2473 664 -1391 -2633 -2814 -1075 794 2220 3014 1699 178
3221A78j438j358m24K331J647J983J6j372j405j942q77P47Q87J712J887K45j052
$$ 178 -1260 -2618 -3042 -711 936 2919 2935 1563 158 -1784 -2661 -1914 -1027 685 2572 2817 1765
3238A765j533k319L1l19J560J437K070O1p39k487j528k96L08R85K346J241K86
$$ 1765 232 -2087 -2056 -2375 -815 622 2692 2753 2014 -473 -2001 -2297 -1989 -1004 1342 2583 2869
3255B869j399j589k727q9K78K296K396k87Q29j034j488j725p86K77J861J936P92
$$ 2869 1470 -119 -2846 -2935 -2657 -361 2035 1748 2577 1543 55 -1670 -2456 -2179 -318 1618 2410
3272B410j31r51j790k011K43N16J472J986R08n06j326j449j210j108J153K278
$$ 2410 2279 1328 -462 -2473 -2230 -1714 -242 1744 2652 2146 820 -629 -1839 -2947 -1794 484
3288D84J199P11j77j542k029j406k86J258K008R96J217m81q93k227j333k05J205
$$ 484 1683 2394 2217 675 -1354 -2760 -3046 -1788 220 1216 2433 1952 1059 -1168 -2501 -2706 -1501
3305a501J646J926L97p32j136j138j736k95J504J454J404O13k52j600j612j335
$$ -1501 145 2071 2468 1736 600 -538 -2274 -2569 -1065 389 1793 2406 2154 554 -1058 -2393
3321b393l72K041R66J494N91j140p85j621j016j7J128J709J724L04r80j489q94
$$ -2393 -2765 -724 242 1736 2327 1187 402 -1219 -2235 -2252 -1124 585 2309 2613 1633 144 -750
3338g50j808K02J432J381J799k57m84k032p40p85L39J592J288J395n61n4k101
$$ -750 -2558 -2356 -924 457 2256 1999 1515 -517 -1257 -2042 -1703 -111 1177 2572 2011 1957 -144
3355a44j586k01M9J650R06R10K90p22j179j367r9q22J812K059J023l01r05j850
$$ -144 -1730 -1931 -1882 -232 674 1584 1874 1152 -27 -1394 -1493 -2315 -503 1556 2579 2278 1373 -477
3373d77j607K19Q4J238J597J158k49q52j799j472m51J223J541J413K22J29j152
$$ -477 -2084 -1865 -1781 -543 1054 2212 1963 1111 -688 -2160 -2611 -1388 153 1566 1788 1917 765
3390G65j133j690k70P62J505J258O84K60j505j548j044l74J029J056J701J193
$$ 765 -368 -2058 -2328 -1566 -61 1197 1881 2141 636 -912 -1956 -2330 -1301 -245 1456 2649
3406B649r46r33j135j902K52L39J410K279J52m37j385j361o07o19P71K214O48
$$ 2649 1703 770 -365 -2267 -2015 -1676 -266 2013 2165 1728 343 -1018 -1625 -2244 -1473 741 1389
3423A389M10M19k118j410r54K27J065J030K133n79j82r90k122k51K3J476J265
$$ 1389 1799 2218 100 -1310 -2264 -2037 -972 58 2191 1612 1430 440 -1682 -1933 -1910 -434 831
3440H31J028K75j467o28j479j667J302J070J364Q80P53j136j327r94j243L13J244
$$ 831 1859 2134 667 39 -1440 -3107 -1805 -735 629 1509 2262 1126 -201 -1195 -2438 -2125 -881
3457h81J440J015N04n40j727j917M94N54Q72Q64J279l64n83j233j730r7J170L34
$$ -881 559 1574 2078 1538 -189 -2106 -1612 -1058 -186 678 1957 1593 1010 -223 -1953 -2050 -880 -546
3475e46J617Q66N7j103q74j121m35rJ695N55R36O52j401j291n00j051M85J893
$$ -546 1071 1937 1994 891 17 -1104 -1539 -1548 147 702 1638 2290 889 -402 -902 -1953 -1468 425
3493D25L32J694n24q27j470j226L13K6J507J027Q33n83j239o45j285K71P16K92
$$ 425 757 2451 1927 1100 -370 -1596 -1283 -1257 250 1277 2110 1527 288 -357 -1642 -1371 -655 -363
3511c63J456P91j40j184j402j218Q52q1J616J512J91l12j848q11j082J82J179
$$ -363 1093 1884 1744 560 -842 -2060 -1208 -1289 327 1839 2030 1718 -130 -941 -2023 -1841 -662
3528f62R06J299N56k44j181j849l5j037J361J027J528N1k84j001j220r59l97J048
$$ -662 244 1543 2099 1855 674 -1175 -1210 -2247 -886 141 1669 1720 1436 435 -785 -1744 -2141 -1093
3546a093J627J211J70r99j173p32j399Q58Q25J155R85N3n88q28j328m83M48M57
$$ -1093 534 1745 1915 916 -257 -989 -2388 -1530 -705 450 1435 1488 900 72 -1256 -1739 -1291 -834
3564h34J346J206j16o41j251j025l00o2J327J174P64Q49j677o61r90m17k58J452
$$ -834 512 1718 1602 961 -290 -1315 -1615 -1677 -350 824 1588 2437 760 99 -891 -1308 -1566 -114
3582a14Q28N09P57j267j068q31l82M19P40J476N36L52r28j224j534L28r9J602
$$ -114 714 1223 1980 713 -355 -1186 -1568 -1149 -409 1067 1603 1955 1027 -197 -1731 -1403 -1502 100
3600A00Q55J498r03j124j522l46k83O76N58J514P62k86j184j059j010n3J485J51
$$ 100 955 2453 1550 426 -1096 -1442 -1725 -1049 -491 1023 1785 1499 315 -744 -1754 -1807 -322 -171
3618a71J309J48K19j260o22l42j335P36J801K66P14m24r81q77m91m41J025J491
$$ -171 1138 1286 1505 245 -377 -719 -2054 -1318 483 749 1463 1039 58 -819 -1310 -1751 -726 765
3636G65N15J60j71n52j444o64N3K59N35J300M08J0r30j351n4j23Q89Q97P67K30
$$ 765 1280 1440 1269 717 -727 -1391 -1338 -1079 -544 756 1164 1174 244 -1107 -1161 -1284 -395 502 1269 1499
3656A499n57m87j279n86m35J478O51J069k1q27p75r71l31K86Q39R56M50J164j186
$$ 1499 942 455 -824 -1410 -1845 -367 284 1353 1332 505 -270 -1241 -1572 -1286 -447 509 959 2123 937
3675I37r72j557N9k03J425P68L86R05j066j198o66k82N28N50J142Q24l75k23o81
$$ 937 -35 -1592 -1533 -1736 -311 457 843 1748 682 -516 -1182 -1464 -936 -386 756 1580 1205 982 301
3694C01j267o48O32K36J548P42j57q20p61j323J17M88P31J322j11j00l09r47j016
$$ 301 -966 -1614 -982 -746 802 1544 1387 567 -194 -1517 -1400 -912 -181 1141 1030 930 621 -326 -1342
3713a342j81J8J237Q35K89P79j181j278k71l75O0J363J126N40o26n33j694K33
$$ -1342 -1523 -1505 -268 567 856 1635 454 -824 -1095 -1470 -1410 -47 1079 1619 993 460 -1234 -1001
3731a001m51O62J819J21O68n62j256k44j248L6Q39M03J404l86L02j295o39j070
$$ -1001 -1452 -790 1029 1150 1818 1256 0 -244 -1492 -1456 -617 -214 1190 804 1106 -189 -828 -1898
3749a898j05P75J563N34O21l85n49j263r31N35O58K84J675j18m91o81j239j45
$$ -1898 -2003 -1228 335 869 1490 1105 556 -707 -1638 -1103 -445 -161 1514 1396 905 224 -1015 -1160
3767a160k8R65M99Q93J13n78j162k42l12n48O82J315O53L25j061o28q31p97M93
$$ -1160 -1188 -223 276 1169 1282 704 -458 -700 -1012 -1560 -878 437 1090 1415 354 -274 -1105 -1902 -1409
3786a409J031N39O78P3k03o24r57k74M24N25Q95Q17l98l58o45j294p0L40R66M08
$$ -1409 -378 161 839 912 709 85 -872 -1146 -722 -197 698 1515 1117 759 114 -1180 -1250 -910 56 464
3806D64J524p29p11n18j372j35P43N58J111M60o78R3r67j276j50J143K46J273
$$ 464 1988 1259 548 30 -1342 -1477 -734 -176 935 1395 717 810 -157 -1433 -1583 -440 -194 1079
3824A079N6p65K98j201m09k12J76P07J058J76J79j061o14j329Q63M01M41J014
$$ 1079 1135 370 668 -533 -942 -1154 -978 -271 787 963 1142 81 -533 -1862 -999 -598 -157 857
3842H57O33o51n76o22o83K22N36L56M21O27m2r29l75r61J95P68M86Q81J21K83
$$ 857 1490 839 263 -359 -1042 -820 -284 72 493 1120 1078 149 -226 -1187 -992 -224 262 1143 1264 1547
3862A547j634l58n47l05L71R90J129j12O1p57j089r80P64rJ753L97Jl85o01j111
$$ 1547 -87 -445 -992 -1297 -926 64 1193 1081 1142 385 -704 -1684 -920 -929 824 1221 1222 837 236 -875
3882h75m50J44P85Q29J078p50M84l84k028k79N26M89J354N20m19K9j371n21o98
$$ -875 -1325 -1181 -396 433 1511 761 1245 861 -1167 -1446 -920 -431 923 1443 1024 1053 -318 -839 -1537
3901a537Q78N39N47K92R34j222j288L21o29Q31K04M42Q78l40L70j738n7j66K73
$$ -1537 -659 -120 427 719 1653 431 -857 -536 -1165 -334 -130 312 1190 850 1220 -518 -575 -741 -468
3920d68M20N95O5n2M4p87p75j82J77N81K54R44O19j000l37q42j44J16J079M12
$$ -468 -48 547 612 560 604 -183 -958 -1140 -963 -382 -128 816 1435 435 98 -744 -888 -772 307 719
3940G19QJ17K33j891l67l78R04P29M97N97l46j240j05n58m12J96Q74J324j21K97
$$ 719 727 844 1077 -814 -1181 -1559 -655 74 571 1168 822 -418 -523 -1081 -1493 -1297 -423 901 780 1077
3960A077r33l43q29N57j09J410l15M15q0p25j026J86l17L24R26O11k6K92n03j546
$$ 1077 144 -199 -1028 -471 -580 830 515 930 850 125 -901 -715 -1032 -708 218 829 803 1095 592 -954
3980i54K05k66M51Q07J043m06K89r10p57o97O52l31J725p3M40r97n83p3k16J71
$$ -954 -749 -1015 -564 243 1286 880 1169 259 -498 -1195 -543 -874 851 778 1218 221 -362 -435 -651 -480
4000d80n88J469N21M02n86q03r46j70K23P08P5R92R0K8j086p60n6K40R69N87j9
$$ -480 -1068 401 922 1324 738 -65 -1011 -1181 -958 -250 -175 817 907 935 -151 -911 -967 -727 242 829 810
4021H10K31l58j359k74J16J71O43P65K29J44j129j44k34j058K10J427P28M55n00
$$ 810 1041 683 -676 -950 -834 -663 -20 745 974 1118 -11 -155 -389 -1447 -1237 190 918 1373 873
4040H73r42q3j447O56J02Q30O31L72p94o1j49m84k50M7K50Q56M92k56k15o33k16
$$ 873 -69 -152 -1599 -943 -841 -11 620 992 198 137 -12 -496 -746 -699 -449 407 899 643 428 -205 -421
4061d21n14J12Q15Q25N44l66o69o00q96p4R03L08jQ37M58m72j480m43N55J09J009
$$ -421 -935 -823 -8 817 1361 995 326 -274 -1170 -1244 -341 -33 -34 803 1261 789 -691 -1134 -579 -470 539
4082E39J98J39K9o93o21l62m86P79R03K65lk9j53j566l85O23P62N31M59j31K61
$$ 539 737 876 905 212 -409 -771 -1257 -478 425 690 687 658 505 -1061 -1446 -823 -61 470 929 798 1059
4103A059j427o74J36q5M81R47J85P08n74l40q48m10J95L28J023J86l90M80j320
$$ 1059 -368 -1042 -906 -991 -510 437 622 1330 756 416 -432 -842 -647 -319 704 890 500 980 -340
4122c40J70r45P34O31L9Q62n79L76l10j080q54L25O63Q64L98P1j028o50Q3j38
$$ -340 -170 -1115 -381 250 289 1151 572 948 638 -442 -1296 -971 -308 556 954 1025 -3 -653 -570 -708
4142g08k67R76J35J336p79q77j28l03M0K40L68K35R87J83m20j391n86n7Q44J21
$$ -708 -975 1 136 1472 693 -184 -312 -615 -575 -335 33 268 1255 1438 1018 -373 -959 -1016 -172 -51
4162e1K83M31j24m16l22m16k66M86K23Q16N10K73j348q5j059Q05k32L15O77O46
$$ -51 232 663 539 123 -199 -615 -881 -395 -172 644 1154 1427 79 -6 -1065 -260 -492 -177 500 1146
4182A146n13m48r07m28M63N43L85J030k09n04q57J40q26L65j93P95N02M81k74
$$ 1146 633 185 -722 -1150 -687 -144 241 1271 1062 558 -299 -159 -985 -620 -813 -18 484 965 691
4201F91P6j196j79N8N19K33Q43L70p84o75n11N9Q2O81l51J348m77k47k96l4j075
$$ 691 767 -429 -608 -550 -31 202 1045 1415 631 -44 -555 -496 -414 267 -84 1264 787 540 244 210 -865
4222h65J29P73J129l45m96O09j288n22j59N94K75J24J198Q6o96j249N68p80n2
$$ -865 -736 37 1166 821 325 934 -354 -876 -1035 -441 -166 -42 1156 1242 546 -703 -135 -915 -967
4241i67J002PM43P19p46j7j037N7m37O06O01K41M19q68j80j301P95m49J403J93
$$ -967 35 42 485 1204 458 441 -596 -539 -976 -370 231 472 891 23 -157 -1458 -663 -1112 291 484
4261D84M19J5r37l66k22k60k83J332P37j90l13J05o25r0n38K92L98J059R7n57
$$ 484 903 918 -19 -385 -607 -867 -1150 182 919 729 416 521 -104 -194 -732 -440 -42 1017 1114 557
4281E57n10o74l27p1J133J9L53j68K09q58k29j37j18O29N10M29L11o10n73j96
$$ 557 47 -627 -954 -1025 108 127 480 312 521 -337 -566 -703 -821 -192 318 747 1058 448 -125 -321
4301c21p52P09l66J248k06N13k31n36r0p70k15R31M87O3j27K73j139l73L94o08
$$ -321 -1073 -364 -730 518 312 825 594 58 -32 -802 -1017 -86 401 464 337 610 -529 -902 -508 -1116
4321a116J81Q08J032J39p7p58j210R96q8j61L29P65Q2p74m36n64l46N40R22r2
$$ -1116 -935 -127 905 1044 967 209 -1001 -5 -93 -254 75 840 922 148 -288 -852 -1198 -658 264 172
4341A72M08J9r4p35N21p57k4Q81K34L22l17l36k69p85J35k5R08J14J62j61m32
$$ 172 580 599 505 -230 291 -466 -490 391 625 947 630 294 25 -760 -625 -650 258 372 534 373 -59
4362e9l68k34M23J32q1O04k07N16m64l44o42J00p2M40J256L08o16n32l68k01o87
$$ -59 -427 -661 -238 -106 -187 417 210 726 262 -82 -724 -624 -696 -256 1000 1308 692 160 -208 -409 -1096
4383a096N47O35Q39m2k91o56j7n78J94P2O29N56j82j96j96l71q15O71n36J058
$$ -1096 -549 86 925 883 592 -64 -81 -659 -465 -393 236 792 610 414 218 -153 -968 -297 -833 225
4403B25P0J79j64p39J17o8K10r6m87J251q4k0n97l29j40J96l01O91J121Q0n10
$$ 225 295 474 310 -429 -312 -380 -170 -266 -753 498 414 394 -203 -532 -672 -476 -777 -86 1035 1115 605
4424F05r96o19L97J22O8K50R26L46n63j20j011k73q5P95L43M01J51j60p14j56
$$ 605 -391 -1010 -613 -491 -423 -173 753 1099 536 416 -595 -868 -953 -158 185 586 737 577 -137 -293
4444b93m56K05P24r9J081m95k02o34o75l23L8J327M60M04j041K35o95M97o62M72
$$ -293 -749 -544 180 81 1162 667 465 -169 -844 -1167 -1129 198 658 1062 21 256 -439 58 -604 -132
4464a32L25O92m49L62r64J8o94m1L31P60l02M86k80M86m05n77M96o03L20M44M23
$$ -132 193 885 436 798 -166 -148 -842 -883 -552 208 -94 392 112 598 193 -384 112 -491 -171 273 696
4485F96m07K65j002j62l5Q03j01J13M68m6p82K71r37J35N77P16k81R9L28j085
$$ 696 289 554 -448 -610 -645 158 57 170 638 592 -190 81 -856 -721 -144 572 291 390 718 -367
4505c67k3r6J22r3K48Q03j34K04q23R2R0m15o53R40N87k0j01j194O29n62J85P99
$$ -367 -390 -486 -364 -457 -209 594 460 664 -159 -67 23 -392 -1045 -105 482 462 361 -833 -204 -766 -581 218
4527B18P8M49J86p1j189m44J14PJ32Q65N38m68j2K45o91m41K45q9N23O72k08n21
$$ 218 296 745 931 860 -329 -773 -659 -652 -520 345 883 415 403 648 -43 -484 -239 -328 195 867 659 138
4549A38o23o2o97Q50L83N52J14l00j40o47J37ll43O01J60K16M32l04r56J27k89
$$ 138 -485 -547 -1244 -394 -11 541 655 355 215 -432 -295 -298 -641 -40 120 336 768 464 -492 -365 -654
4570f54K27M7N09J247q84o65J44l14m83J2R44m47O88L21n06l66j006M24J75L98
$$ -654 -427 -380 129 1376 492 -173 -29 -343 -826 -814 130 -317 371 692 186 -180 -1186 -762 -587 -189
4590a89P12l07m7Q8o91J74l97P5N85l16P95L63j010L84l08l99k57Q37J28N91m96
$$ -189 523 216 169 257 -434 -260 -657 -582 3 -313 482 845 -165 219 -89 -488 -745 92 220 811 315
4611C15m4n3j326J275r9M85j91Q7M56r02n8n65j69O69l10J373m65m49M79q99j55
$$ 315 271 218 -1108 167 68 553 362 449 905 3 -55 -620 -789 -120 -430 943 478 29 508 -391 -546
4632e46LM50L69L84J79j036O42j101j3q4j18J168n1J37o76K72m50l75J94L98N67
$$ -546 -543 -93 276 660 839 -197 445 -656 -669 -753 -871 297 246 383 -293 -21 -471 -846 -652 -254 313
4653C13J46J72r50L82q47Q74m95L06P79o9j24l36Q6j72n95O3N72k29O84k24Q1
$$ 313 459 631 -319 63 -784 90 -405 -99 680 611 487 151 237 65 -530 -467 105 -124 560 336 417
4674D17j18m25m8r0m1M07J038m20k61r86j38L65m31Q68P52L2k14p29m40m6L79
$$ 417 299 -126 -174 -264 -305 102 1140 720 459 -527 -665 -300 -731 137 889 921 707 -22 -462 -508 -129
4695a29l50O72l29P08m77k32n86Q19q07L77J6Q68Q78j097K03k91j135L97L97K38
$$ -129 -479 193 -136 572 95 -137 -723 96 -711 -334 -318 550 1428 331 534 243 -892 -495 -98 140
4715A40J95k71j97K47j13p17J80L22O16L4m31O65l06q56L40J92k35L15L67r8k12
$$ 140 335 64 -133 114 1 -716 -536 -214 402 436 5 670 364 -492 -152 40 -195 120 487 389 177
4736A77k56j21k45n44L79J093j68P43J06j326L70r69L69O05K25J45K14j36p84
$$ 177 -79 -200 -445 -989 -610 483 315 1058 1164 -162 208 -761 -392 213 438 583 797 661 -123
4755a23l83m48J153m1N22K81j23n81k65q73k75R34L40r2L15K2M18r32m11j59L81
$$ -123 -506 -954 199 158 680 961 838 257 -8 -881 -1156 -222 118 26 341 363 781 -151 -562 -721 -340
4776c40J6J276%r32J79Q6n72n81N03o21R67J77M25l66j395R65n45Q14m70N89M74
$$ -340 -324 952 952 20 199 285 -287 -868 -365 -986 -19 158 583 217 -1178 -213 -758 56 -414 175 649
4797F49m45k62J66r79N86L7O53L43l04K68j152J58Jk32J40L96Q11k55n33O96q87
$$ 649 204 -58 108 -871 -285 -248 405 748 444 712 -440 -282 -281 -513 -373 23 834 579 46 742 -145
4818a45m93O74j9J0P14k77l62L88j032l31K36N47K69M47n3K96r52l84J59j33P08
$$ -145 -638 36 17 27 741 464 102 490 -542 -873 -637 -90 179 626 573 869 -83 -467 -308 -441 267
4839B67M07n45M06j4q48L32m14rK3r2O12J56j4P4p14M48Q9j01O11r5K84k31p87
$$ 267 674 129 535 521 -327 5 -409 -418 -395 -487 125 281 267 341 -373 75 164 63 674 579 863 632 -155
4862a55q38L95L90l03N25Q3O57m44j54m94j89M78j75N04J32j54n90J47M1n93M50
$$ -155 -993 -598 -208 -511 14 97 754 310 156 -338 -527 -49 -224 280 412 258 -332 -185 -144 -737 -287
4883b87k19P89qM92m95o02l20l23J342j39R2N50m11j199N15m07j99M97O74J72
$$ -287 -506 283 275 767 272 -330 -650 -973 369 230 322 872 461 -738 -223 -630 -829 -332 342 514
4903E14j09K67p3p45l49k48N49K33Q93J22l63o98l55m47M2P53k43O25L14k96l33
$$ 514 405 672 599 -146 -495 -743 -194 39 932 1054 691 -7 -362 -809 -767 -14 -257 368 682 386 53
4924E3m07m58O12K01qM69K74l85m35Jm15m8L81M12j58M10j65M23q13n17K05M8
$$ 53 -354 -812 -200 1 -7 462 736 351 -84 -83 -498 -546 -165 247 89 499 334 757 -56 -573 -368 -320
4946c20J66P13k87r6K57j120l12O17O4N54J78K46l62o06k10L52J3l27K97P63p0
$$ -320 -154 559 272 176 433 -687 -999 -382 -318 236 414 660 298 -308 -518 -166 -153 -480 -183 580 510
4967E10n58N06o63j39J36M60l11K46q6J7K03p15m56K5P89M16L6rP0p29p74L05
$$ 510 -48 458 -205 -344 -208 252 -59 187 101 118 321 -394 -850 -825 -36 380 416 407 477 -252 -1026 -721
4989g21J4O14j28R50q45L57m66j83L5J59J61M79M0L72l96m95m88L68nr4M1J5J176
$$ -721 -707 -93 -221 729 -116 241 -225 -408 -373 -214 -53 426 466 838 442 -53 -541 -173 -178 -272 -231 -216 960
5012I60j13n08q18P2K59l30M92Q4j51M82n91K21n56P69n53O2Q22j46k28q09L2
$$ 960 847 339 -479 -407 -148 -478 14 98 -53 429 -162 59 -497 272 -281 -219 603 457 229 -580 -548
5033e48P0l6Q72k95l12J015l30p88nj157R95J99O25N6l1j35m10l22Q28n95m4O45
$$ -548 -478 -514 358 63 -249 766 436 -352 -357 -1514 -519 -320 305 361 330 195 -215 -537 291 -304 -348 297
5055B97o01P71l17o73L75m66L36J56L17M57q25J12m74J39J88k48K56P21k92j05
$$ 297 -304 467 150 -523 -148 -614 -278 -122 195 652 -173 -61 -535 -396 -208 -456 -200 521 229 124
5075A24j08r2l22k23M94O30k58M35n94J93n87q46J173J40m88L90L34K36n41o48
$$ 124 16 -76 -398 -621 -127 503 245 680 86 279 -308 -1154 19 159 -329 61 395 631 90 -558
5095e58M66j31L44o2j84K96m4M20j008k60J11J191k9p9n6k61l29p0j88j31M54
$$ -558 -92 -223 121 59 -125 171 127 547 -461 -721 -610 581 552 473 417 156 -173 -243 -431 -562 -108
5116a08P80p1n31MO5q04K68L69k94Q13l80K71m10p9K59n27N55L9N58o97K9M0j029
$$ -108 672 601 70 74 139 -665 -397 -28 -322 491 111 382 -28 -107 152 -375 180 219 777 80 109 149 -880
5139h80N54K37l32j24P57O34n2p54o03M65R6k18K59M50L18j010K16p02O0K11J35
$$ -880 -326 -89 -421 -545 212 846 794 40 -563 -98 -2 -220 39 489 807 -203 13 -689 -629 -418 -283
5160b83P51j164J264j006L18J04l86L06j40j31K41P61J35o90j39o06K66O06j65
$$ -283 468 -696 568 -438 -120 -16 -402 -96 -236 -367 -126 635 770 80 -59 -665 -399 207 42
5179D2N93p76M50l02n18N09J7J32k58N06K13m61j2k01J5n29Q59K65J27L7o43J9
$$ 42 635 -141 309 7 -511 -2 15 147 -111 395 608 147 135 -66 -51 -580 279 544 671 708 65 84
5201H4l26m44J26J125j61q3K30k7q59J47k62Q64o52P78m66P14n8q79k84N4P14
$$ 84 -242 -686 -560 565 404 321 551 524 -335 -188 -450 414 -238 540 74 788 730 -149 -433 -379 335
5222C35k71k01Q87j61q18J47n02j15K03O30l74M60J67m63q5l99O07l10M80L45
$$ 335 64 -137 750 589 -229 -82 -584 -699 -496 134 -240 220 387 -76 -161 -560 47 -263 217 562
5242E62o13R3j61J09p9j79k61K39N96L94k82j1p49m41J45J092j033R43L12p89
$$ 562 -51 42 -119 -10 -89 -268 -529 -290 306 700 418 407 -342 -783 -638 454 -579 364 676 -113
5262a13K59n21k18K16J57qM82M96j95k49j79o42L01j99J048o39L18j05n50j49
$$ -113 146 -375 -593 -377 -220 -228 254 750 555 306 127 -515 -214 -413 635 -4 314 209 -341 -490
5282d90q2J8M81K4N44m92L11j01n67L55j97j35L34L47j12k06m64M88p68Q9N22
$$ -490 -572 -554 -73 -49 495 3 314 213 -354 1 -196 -331 3 350 238 32 -432 56 -712 -623 -101
5303a01O91k94k51L29l26m44J10N02J89j83l46O43m32N53l32l04j14O26j19K95
$$ -101 590 296 45 374 48 -396 -286 216 405 222 -124 519 87 640 308 4 -110 516 397 692
5323F92j57o91M50J86j148K46M01K60k3j17K40o03k60J35l57P98N67L46n35j02
$$ 692 535 -156 294 480 -668 -422 -21 239 216 99 339 -264 -524 -389 -746 52 619 965 430 328
5343C28m39l78N8L47N09K62j31m59K65o31j3j47K92j30N31K71k72m51o2L67J58
$$ 328 -111 -489 -431 -84 425 687 556 97 362 -269 -282 -429 -137 -267 264 535 263 -188 -250 117 275
5364B75m00L36J76p7k06k10k10m23Q89k67Q8N34k73l5q0m88j62L36O89n90P97
$$ 275 -125 211 387 310 104 -106 -316 -739 150 -117 -29 505 232 197 117 -371 -533 -197 492 -98 699
5385F99l83n43L43n01j08J6M2M09M96l74K19L30q68j8j08j6R87l62k56M30K22
$$ 699 316 -227 116 -385 -493 -477 -435 -26 470 96 315 645 -223 -241 -349 -365 622 260 4 434 656
5406F56o42l57K2N26k66Q1j25R4j15j5l23J7L30j18J254m91n66j24P1q6q4P1M69
$$ 656 14 -343 -321 205 -61 20 -105 -11 -126 -141 -464 -447 -117 -235 1019 528 -38 -162 -91 -177 -261 -190 279
5429B79O43n32o25J77k65k77K92j51R36K11m04n59J14l04J41L66n35J036m25p0
$$ 279 922 390 -235 -58 -323 -600 -308 -459 477 688 284 -275 -161 -465 -324 42 -493 543 118 48
5449D8n02M24p54P2Q88J32j96r6J74j13p4o81P74o70P09L70J43m39l0o61J46Q1
$$ 48 -454 -30 -784 -712 176 308 112 16 190 77 3 -678 96 -574 135 505 648 209 179 -482 -336 -255
5471b55P59l93J00N83l27l20l85N19l22L23j15J63j09l4j87k11l03K90lL67K83
$$ -255 504 111 211 794 467 147 -238 281 -41 282 167 330 221 187 0 -211 -514 -224 -227 140 423
5492D23n50M24n97O0j87J04K02L95n56P19j98j24p46OJ124O6p65Q56o07l4j52
$$ 423 -127 297 -300 -240 -427 -323 -121 274 -282 437 239 115 -631 -625 499 565 -200 656 49 15 -137
5513a37K02n04K51p5M76j23P41r8j225M56om8K47J64N1n80N10m81O4o52J57O69
$$ -137 65 -439 -188 -263 213 90 831 733 -492 -36 -42 -90 157 321 372 -208 302 -179 -115 -767 -610 59
5535E9K09n51N77n2L51o83k26l8P80o00N05m37j58j8m07K3L28O21k01k15O41k77
$$ 59 268 -283 294 242 593 -90 -316 -354 426 -174 331 -106 -264 -282 -689 -666 -338 283 82 -133 508 231
5557B31l63K22o55M89l43Q66K32j81m57J32n88NL27k6P1R25q12j39J71mk19k97
$$ 231 -132 90 -565 -76 -419 447 679 498 41 173 -415 -410 -83 -109 -38 887 75 -64 107 103 -116 -413
5579d13Q7P82L7q91O60n09j38l94O11k6J58q9J99K90j3p70l1O95n07O07J5p40
$$ -413 -326 456 493 -398 262 -247 -385 -779 -168 -194 -36 -125 74 364 351 -419 -450 245 -262 345 360 -380
5601c80M89m74N58l96j97K98O57j54K49n64O0m83L90k30k50P52k57k68k85L13
$$ -380 109 -365 193 -203 -400 -102 555 401 650 86 146 -337 53 -177 -427 325 68 -200 -485 -172
5621a72n32J35J77Q41j39k79l8R4m26L45k56k54O36L9m32O58j23o13lJ30L5K02
$$ -172 -704 -569 -392 449 310 31 -7 87 -339 6 -250 -504 132 171 -261 397 274 -339 -342 -212 -177 25
5643B5K63L6k09l40n6m39Q02m25R93j41m45j65M99j159M60k2Q3O48k32K26k53
$$ 25 288 324 115 -225 -281 -720 82 -343 650 509 64 -101 398 -761 -301 -323 -240 408 176 402 149
5664A49l40j17K17L43q23O52M61l12J88o4l27o31R06r47Q39K78l89J13l49l49
$$ 149 -191 -308 -91 252 -571 81 542 230 418 354 27 -604 302 -645 194 472 83 196 -153 -502
5684e02j79L88M97l73N63l18L51j62o54P54o27L08N24l96J1l56m71K37o56O28
$$ -502 -681 -293 204 -169 394 76 427 265 -389 365 -262 46 570 174 185 -171 -642 -405 -1061 -433
5704d33Q19j29l6J17n45k30K35j63M36J4j13K26J15M8j176O25J35k37J9J27J45
$$ -433 386 257 221 338 -207 -437 -202 -365 71 85 -28 198 313 361 -815 -190 -55 -292 -273 -146 -1
5725al5K33j79L9o78J051p86N15j86K81j70J43o62Pm2M83J58O4j37l93L42j97
$$ -1 -36 197 18 57 -621 430 -356 159 -27 254 84 227 -435 -428 -470 13 171 235 98 -295 47 -150
5747a50l52N5Q2N65J59l49k38M42k21K44o9j69j68j89N14k17L36j12l13J05N81
$$ -150 -502 -447 -365 200 359 10 -228 214 -7 237 168 -1 -169 -358 156 -61 275 163 -150 -45 536
5768E36j54J75m64q79Q38n37O8J259q00L08L33l72m67j20l33L95K8O93k9j02r9
$$ 536 382 557 93 -786 52 -485 -417 842 42 350 683 311 -156 -276 -609 -214 -186 507 478 376 277
5789B77o5l23K18q20O94P68n79N3j53r2l53J39L53J08K39r0L91n92k97l77N09
$$ 277 212 -111 107 -713 -19 749 170 223 70 -22 -375 -236 117 225 464 374 765 173 -124 -501 8
5810Ho23P17K08k73J85J08k71K3j96M86j93J8l6k63K39o16N54l58K47P62p18Q53
$$ 8 -615 102 310 37 222 330 59 82 -114 372 179 197 161 -102 137 -479 75 -283 -36 726 8 861
5832H61o03l03j94j49M05L2k4p7P98n3n6j058L44J52M50q53O08L38l82l85l49
$$ 861 258 -45 -239 -388 17 49 25 -52 746 693 637 -421 -77 75 525 -328 280 618 236 -149 -498
5853d98k17L88K47l26O28mL6J12o13J09K08r42N65R77l92Pm89j54J9q8N05l20
$$ -498 -715 -327 -80 -406 222 218 254 366 -247 -138 70 -872 -307 670 278 285 -204 -358 -339 -427 78 -242
5875b42J73l4K93j86J83l07M17p20J292l79o5k28k22l06K97J2j51J59l04P94k09
$$ -242 -69 -103 190 4 187 -120 297 -423 869 490 425 197 -25 -331 -34 -22 -173 -14 -318 476 267
5896B67L78o74o69M40M28P06r01r0j29l11N89l54O83K46n57L19n11K09K89o62
$$ 267 645 -29 -698 -258 170 876 -25 -115 -244 -555 34 -320 363 609 52 371 -140 69 358 -304
5916c04L47o29N10L59P2J11j98k30l21J92K21n7L55J90n13j98M7m19k81Q72n12
$$ -304 43 -586 -76 283 355 466 268 38 -283 -91 130 73 428 618 105 -93 -46 -465 -746 126 -386
5937c86P98L23r15O19o69l98K26N34L95n7m18J78r0k50j39K93Q3j39P4J99L53
$$ -386 412 735 -180 439 -230 -628 -402 132 527 470 52 230 140 -110 -249 44 127 -12 62 261 614
5958F14J20r87j82O7L81n11N90J36j29M6J98k9q46K90L38L95n59J60o8l03k97
$$ 614 734 -253 -435 -368 13 -498 92 228 99 145 343 314 -532 -242 96 491 -68 92 24 -279 -576
5979e76m2R10n13Q76m40K50o55R1RJ03j76L9M51n01L60J77o26Q4k03Q30k97J80
$$ -576 -618 292 -221 655 215 465 -190 -99 -90 13 -163 -124 327 -174 186 363 -263 -179 -382 448 151 331
6001C31mp85M78m2p03K20j88O02Q5q6L11j75j30k02k40M48L95l6q30O47k71K98
$$ 331 327 -458 20 -22 -725 -505 -693 -91 -6 -92 219 44 -86 -288 -528 -80 315 279 -551 96 -175 123
6023A23o07j62R22k94j68k48P19K1l27L05n3j67r7L30K58q21K00k3l73O43n43
$$ 123 -484 -646 276 -18 -186 -434 285 306 -21 284 231 64 -33 297 555 -266 -66 -89 -462 181 -362
6044c62M68n87J112q55M29o83l0N43l80M30K35Qjn79M10p47Q52K62j81k73n2l20
$$ -362 106 -481 631 -224 205 -478 -508 35 -345 85 320 328 327 -252 158 -589 263 525 344 71 19 -301
6066c01J69p08N96N90q21K74M13n95N21l03l74J78P13j53K6L34o60J19j65l88
$$ -301 -132 -840 -244 346 -475 -201 212 -383 138 -165 -539 -361 352 199 225 559 -101 18 -147 -535
6086e35M78L71k14L4M20J18l96l50n49O82k02k73O36K61o38J85l39K61k16K30
$$ -535 -57 314 100 134 554 672 276 -74 -623 59 -143 -416 220 481 -157 28 -311 -50 -266 -36
6106c6M83j77l73O82r66L71P04p80K82m34R1M46k26o15J68l5P7M53N92p42N03
$$ -36 447 270 -103 579 -387 -16 688 -92 190 -244 -153 293 67 -548 -380 -415 -338 115 707 -35 468
6127D68o67J07k1O7k26K87m47J082j15j07l10n84L04n09P96N78p63R78r16j96
$$ 468 -199 -92 -113 -46 -272 15 -432 650 535 428 118 -466 -162 -671 125 703 -60 918 2 -194
6147a94m30K79j76O55K19k04p0j49n47O12M66o21L02k77O11q30N50p77l5P62m85
$$ -194 -624 -345 -521 134 353 149 79 -70 -617 -5 461 -160 142 -135 476 -354 196 -581 -616 146 -339
6168c39J72K84l99Q3J93k80L48m58j17O46P5N42r18P4j16L10k61l35N27j50N66
$$ -339 -167 117 -282 -199 -6 -286 62 -396 -513 133 208 750 -168 -94 -210 100 -161 -496 31 -119 447
6189D47j64k44M7l71j31K93O21m63L60m9J6r28N72k72M66l70J08L76n51l7L7k9
$$ 447 283 39 86 -285 -416 -123 498 35 395 346 362 -566 6 -266 200 -170 -62 314 -237 -274 -237 -266
6211b66M18j27L15L89m2m03N89p25l45OK7Q2k50L60k11K86l06j22J08J78J82k84
$$ -266 152 25 340 729 687 284 873 148 -197 -191 -164 -82 -332 28 -183 103 -203 -325 -217 -39 143 -141
6233a41K78M6J73n23J45j22l07Q51j78j88R6o30k07J240m84k08J25n59R49o79
$$ -141 137 183 356 -167 -22 -144 -451 400 222 34 130 -500 -707 533 49 -159 -34 -593 356 -323
6253c23K43Pj85m4L08j67L16K59j07j49l05j43J87J25K27K4l84J18l28L58l71
$$ -323 -80 -73 -258 -302 6 -161 155 414 307 158 -147 -290 -103 22 249 273 -111 7 -321 37 -334
6274c34L38l3J43L07r18M4Q57j09j118J313l26J00n37M68p1J11n80K59M99m22
$$ -334 4 -29 114 421 -497 -453 404 295 -823 490 164 264 -273 195 124 235 -345 -86 413 -9
6294iN08j005N68J15l66j59O17k27nL81n79%N85j32p67N9O90L82p35J032p58m33
$$ -9 499 -506 62 177 -189 -348 269 42 37 418 -161 -161 424 292 -475 -416 274 656 -79 953 195 -238
6316b38J23K4n93N03N84l69J1J44M86j094K88m03P83k34N16m61k06J00m0k06J76
$$ -238 -115 -91 -684 -181 403 34 45 189 675 -419 -131 -534 249 15 531 70 -136 -36 -76 -282 -106
6337a06J77j12j48N24n21N78o63P18n16R2K26L5j66L38K35r26j23J97N55K54m99
$$ -106 71 -41 -189 335 -186 392 -271 447 -69 23 249 284 118 456 691 -235 -358 -161 394 648 149
6358A49K01J06n84L52p17n2M19L78K29o42L32m0o64N56L18q06O47K23j45J33j37
$$ 149 350 456 -128 224 -493 -545 -126 252 481 -161 171 131 -533 23 341 -465 182 405 260 393 256
6379B56l9n68K93k81p4P00l20M85l00o28M46K48rL45K32l19j63j93l70J62K02
$$ 256 217 -351 -58 -339 -413 287 -33 452 152 -476 -30 218 209 554 786 467 304 111 -259 -97 105
6400A05K05k75j71R85q27p26Q84q70O52k19P37m31L96q77K21N69j397J543k93
$$ 105 310 35 -136 849 22 -704 180 -690 -38 -257 480 49 445 -432 -211 358 -1039 504 211
6419B11o67M46j75L72j85j28q2N46k18J33j47K20q43L05J075j341L68K87k34K21
$$ 211 -456 -10 -185 187 2 -126 -208 338 120 253 106 326 -517 -212 863 -478 -110 177 -57 164
6439A64j9q1k1p1l74L94m05N60j9ql46K18m0J39j96L9L97n36L61r7n81M10l5Q3
$$ 164 145 64 43 -28 -402 -8 -413 147 128 120 -226 -8 -48 91 -105 -66 331 -205 156 59 -522 -112 -147 -64
6463f4K59m74K72j8R59j728L78%Q9K49O7k09L38M57j013j11K38N62o97L94J68
$$ -64 195 -279 -7 -25 934 -794 -416 -416 -327 -78 -11 -220 118 575 -438 -549 -311 251 -446 -52 116
6484A16J92r8r6n22Q3L01o8J76q0J0l44K7O00q40M66l42L73J17j26l62k37J136
$$ 116 308 210 114 -408 -325 -24 -92 84 4 14 -330 -303 297 -543 -77 -419 -46 71 -55 -417 -654 482
6506D82o94K29l80N85k18l7K99l27j78L26K86m95J98N14Q8r26K71k32m83Q98K31
$$ 482 -212 17 -363 222 4 -33 266 -61 -239 87 373 -122 76 590 678 -248 23 -209 -692 206 437
6527D37J7q62j91O68k61m20K80M39n43L58J38R0j24o2M1j06k75O24M14l45p01
$$ 437 454 -408 -599 69 -192 -612 -332 107 -436 -78 60 150 26 -36 5 -101 -376 248 662 317 -384
6548c84M27o41R35K1k33O37k64j54n39J2j8p36Q30n1M15r2n15J54K3N7j64L05
$$ -384 43 -598 337 358 125 762 498 344 -195 -183 -201 -937 -107 -158 257 165 -350 -196 -173 -116 -280 25
6570B5k22r0J63N02J03n63j78J33O33n63O07p73L34K75k3n19J04n92R71j28R0
$$ 25 -197 -287 -124 378 481 -82 -260 -127 506 -57 550 -223 111 386 363 -156 -52 -644 327 199 289
6591B89l45n49J244n41k09K12q8l79R38j77n36M06j29q39L27Q64k79M6k02k44
$$ 289 -56 -605 639 98 -111 101 13 -366 572 395 -141 265 136 -703 -376 488 209 255 53 -191
6611a91k49L86j18N90l25l05Q65j068O31Q4j028O97j60L84K09J06k10o48M63l93
$$ -191 -440 -54 -172 418 93 -212 653 -415 216 300 -728 -31 -191 193 402 508 298 -350 113 -280
6631b80k15J078o21K98k14L82q06O38o1n3k98n22O16M80p4q76L34L74m28L6P50
$$ -280 -495 583 -38 260 46 428 -378 260 199 146 -152 -674 -58 422 348 -528 -194 180 -248 -212 538
6652E38M09p32p89P43l99J48p4J93K06m93K36k98N33n33K61m47K0j8Q32m89m0
$$ 538 947 215 -574 169 -230 -82 -156 37 243 -250 -14 -312 221 -312 -51 -498 -478 -496 336 -153 -193
6673a93k83M82L38o42P45k85M95m92j46m9k37J53k34O55p7Ml0l41N13l34n52Q03
$$ -193 -476 6 344 -298 447 162 657 165 19 -30 -267 -114 -348 307 230 234 204 -137 376 42 -510 293
6695B93pk78m57M93o2L50k08l74Q45l93k35oN22j048Q37j141Q73J68r2k97R7j8
$$ 293 286 8 -449 44 -18 332 124 -250 595 202 -33 -39 483 -565 272 -869 4 172 80 -217 -120 -138
6717a38L35n77K24o7J93%J7L74J11q74N1M38Q3o75M86O5l48O96q08J22OK39J14
$$ -138 197 -380 -156 -223 -30 -30 -13 361 472 -402 -351 87 170 -505 -19 46 -302 394 -414 -292 -286 -47 67
6740F7M68q14M70O9m21l38M31L14q33M46P96p36L83no69J45l52R04O2l50j95N39
$$ 67 535 -279 191 260 -161 -499 -68 246 -587 -141 655 -81 302 297 -372 -227 -579 325 387 37 -158 381
6762C81Mj494J126R96j028L9K17P7n87J58j28K16m51P05k77J02KJ73l93j78L06
$$ 381 385 -1109 17 1013 -15 24 241 318 -269 -111 -239 -23 -474 231 -46 56 58 231 -162 -340 -34
6783c4L05o12L13j25N05j57k27P7j80j4M00k01M44n63P08j138N07k46R0q7N38
$$ -34 271 -341 -28 -153 352 195 -32 45 -135 -149 251 50 494 -69 639 -499 8 -238 -148 -235 303
6804C03l6n34O24Q6l42j65n26R28q8J37m30J80p20M7N87p3L05N4m61J25l47J90
$$ 303 267 -267 357 443 101 -64 -590 338 250 387 -43 137 -583 -536 51 -22 283 337 -124 1 -346 -156
6826a56l16KO80J03q3l69p0N84n31n8L6J83N37m2p70j42M11P9l60M86L80p94L90
$$ -156 -472 -470 210 313 230 -139 -209 375 -156 -214 -178 5 542 500 -270 -412 -1 78 -282 204 584 -210 180
6849A80j68P6L71q79K49L20n9r5J37K85j58J08r72J080j01l0q30L18J1R4M47m90
$$ 180 12 88 459 -420 -171 149 90 -5 132 417 259 367 -605 475 374 344 -486 -168 -157 -63 384 -106
6871a06n67R15l90N57k20M66p22o07M47L9L38k14M54l57k51K12l68Q28k1p81R25
$$ -106 -673 242 -148 409 189 655 -67 -674 -227 -188 150 -64 390 33 -218 -6 -374 454 433 -348 577
6892E77k99n02O76l9p79j9L39J80k12Q6r63J430k83P3o41l50P59j67O23k20k12
$$ 577 278 -224 452 413 -366 -385 -46 134 -78 8 -955 475 192 265 -376 -726 33 -134 489 269 57
6913E7m27J026m66n03j44O91K83o67o8N36n7J50k70j83J34K54l17k74K84K18l32
$$ 57 -370 656 190 -313 -457 234 517 -150 -218 318 261 411 141 -42 92 346 29 -245 39 257 -75
6934g5k92N60J74j75m00K09k95N42q81N89k4N5P58j111P93m94j37k6J79J37m20
$$ -75 -367 193 367 192 -208 1 -294 248 -633 -44 -68 -13 745 -366 427 -67 -204 -230 -51 86 -334
6955c34K92K4N34k57k38p2O7k28M43r5l8M51r99R32m63R0L07j50k40J9L02l04
$$ -334 -42 -18 516 259 21 -51 16 -212 231 136 98 549 -450 482 19 109 416 266 26 45 347 43
6977D3n48Q78q26j22N63M31o07K76L72o87L64QNm08J81J66p5K95n33J04J47n14
$$ 43 -505 373 -453 -575 -12 419 -188 88 460 -227 137 145 150 -258 -77 89 14 309 -224 -120 27 -487
6999d87L26M32k60l21L41Q0k57L33n30N66J69n25P5j91K37k65j2O64l34J69l29
$$ -487 -161 271 11 -310 31 111 -146 187 -343 223 392 -133 -58 -249 -12 -277 -289 375 41 210 -119
7020a19O61k11J28o05l20O45K96k93k59j5k92M30o57M78N47m24j67O03p23j89
$$ -119 542 331 459 -146 -466 179 475 182 -77 -92 -384 46 -611 -133 414 -10 -177 426 -297 -486
7040d86R90r34J01J94R28q23m43P00j24j31J17m84O42l57M21k58j02M0K15K27
$$ -486 504 -430 -329 -135 793 -30 -473 227 103 -28 89 -395 247 -110 311 53 -49 -9 206 433
7060D33m89j60K55K67n49L36l37k5N16m9k65M75m70O77m25j66l85M03J57m11J99
$$ 433 -56 -216 39 306 -243 93 -244 -269 247 198 -67 408 -62 615 190 24 -361 42 199 -212 -13
7081a3P9m74J79P5q5K08J80L08J75l52l00K52j70K6L6k19R3K19M28l43j26k40
$$ -13 66 -408 -229 -154 -239 -31 149 457 632 280 -20 232 62 88 124 -95 -2 217 645 302 176 -64
7103f4L45r5l2l80j66q8L73R2k66n90K92J222l13L35k93j45m55J35P7j74L3L94
$$ -64 281 186 154 -226 -392 -480 -107 -15 -281 -871 -579 643 330 665 372 227 -228 -93 -16 -190 -157 237
7125B37L97k66o19N68q87L54K61L74n16M23o44R49p32J0l42J06J34L82N40o84
$$ 237 634 368 -251 317 -570 -216 45 419 -97 326 -318 631 -101 -91 -433 -327 -193 189 729 45
7145D5j09k55L90j46k67M32O2LL92n02j23j82k1P01p55j07P67k51J82k08k22q6
$$ 45 -64 -319 71 -75 -342 90 152 155 547 45 -78 -260 -281 420 -335 -442 325 74 256 48 -174 -260
7167b60N47j82K18J07o69L74l13L70L29l79M6N4m44L29J29Mq3j25L78l59p9L05
$$ -260 287 105 323 430 -239 135 -178 192 521 142 188 242 -202 127 256 260 177 52 430 71 -8 297
7189B97j44m5M33n04J92m16L09M7r5l42M35k47l33j86M44l01P50M5m54J83N99
$$ 297 153 108 541 37 229 -187 122 169 74 -268 167 -80 -413 -599 -155 -456 294 339 -115 68 667
7210F67m20n13j20L43m07O01J17q92P36j82k25J1P07l23Q73p21p55K83R7k93O43
$$ 667 247 -266 -386 -43 -450 151 268 -624 112 -70 -295 -284 423 100 973 252 -503 -220 -123 -416 227
7231B27l56L31l26l9K87Km0L90j79j20k36M88l3n98M52p59J083r50O37L87m16
$$ 227 -129 202 -124 -163 124 126 86 476 297 177 -59 429 396 -202 250 -509 574 -376 261 648 232
7252B32j57L7K44k87l57P5QK71K11r08M87K07j42M12l51o5M58rM6j0l47O9P0l48
$$ 232 75 112 356 69 -288 -213 -205 66 277 -631 -144 63 -79 333 -18 -83 375 366 412 402 55 124 194 -154
7276a54J76K56M8oo32L54JJ1L56m14L37J90l52k56m92NQ22l51k48M80k55J95J6
$$ -154 22 278 326 320 -312 42 43 54 410 -4 333 523 171 -85 -577 -572 250 -101 -349 131 -124 71 87
7299H7k4L13m5k14M84n32J8k30m69K97p3n3N61L58o38L62k63K35l92K45j5j52
$$ 87 63 376 331 117 601 69 87 -143 -612 -315 -388 -441 120 478 -160 202 -61 174 -218 27 12 -140
7321a40J14L80o32M0J32l32N86l07L76l55J41l03J81o6K31MJ7k28j98K19J47j60
$$ -140 -26 354 -278 -238 -106 -438 148 -159 217 -138 3 -300 -119 -185 46 50 67 -161 -359 -140 7 -153
7343a53K14l78N63k81j1J94M21r31N43n46J67R54r94M62j8n54M67P9l13L25o66
$$ -153 61 -317 246 -35 -46 148 569 -362 181 -365 -198 756 -238 224 206 -348 119 198 -115 210 -456
7364d56P77o48L22l67O41o9j26J13R8K34q91Q43j00o66P5o3K6K68K37j053J241
$$ -456 321 -327 -5 -372 269 200 74 187 285 519 -372 471 371 -295 -220 -283 -257 11 248 -805 436
7385D36o15P8N16q20L44j62P61r08J336o98o05K32J88j86K5K41j7j57L20k44j02
$$ 436 -179 -101 415 -405 -61 -223 538 -370 966 268 -337 -105 83 -103 -78 163 146 -11 309 65 -37
7406c7J1K89o95N44J11l80M8l3j43P17M2p51L72j15j6j28K67k56o0K05j07l11
$$ -37 -26 263 -432 112 223 -157 -109 -142 -285 432 474 -277 95 -20 -36 -164 103 -153 -213 -8 -115 -426
7428d26K65N48q14%K73n7N06n72J45L35j93J04q22O51N29m05P4N03j5m80J57m90
$$ -426 -161 387 -427 -427 -154 -211 295 -277 -132 203 10 114 -708 -57 472 67 141 644 629 149 306 -184
7450a84JN94N0n89j62K53m9j10j98J08L91o6J77N92l73l80J13K64j36l89Q9j69
$$ -184 -183 411 461 -128 -290 -37 -86 -196 -394 -286 105 39 216 808 435 55 168 432 296 -93 -4 -173
7472a73N7k44P42j85o51O52n91N00n76L37O33l86K96p48j77O44M20R5j74l93j31
$$ -173 -116 -360 382 197 -454 198 -393 107 -469 -132 501 115 411 -337 -514 130 550 645 471 78 -53
7493e3j20L21o47P41j07n4K57j35m47J13L22q28O7L98m33L46N01N1K45L7p58J2
$$ -53 -173 148 -499 242 135 81 338 203 -244 -131 191 -637 -570 -172 -605 -259 242 293 538 575 -183 -171
7515a71k9L2j44M06j57K20k27o8K2r9O60K00o05K61k90J78J58m82J19L14j92Q15
$$ -171 -200 -168 -312 94 -63 157 -70 -138 -116 -215 445 645 40 301 11 189 347 -135 -16 298 106 921
7537I21j022q6N3k28K39OK3J63M67m24l49J52Q5O7L82m27j83L14J53m07l47M2
$$ 921 -101 -187 -134 -362 -123 -117 -94 69 536 112 -237 -85 0 67 449 22 -161 153 306 -101 -448 -406
7559d06M50J33k84L54K06j067P66l04K23l57K64K19K74m37j5M33k07q58j40M28
$$ -406 44 177 -107 247 453 -614 152 -152 71 -286 -22 197 471 34 19 452 245 -613 -753 -325
7579c25L19M20m48k90L68J72l76M92o85N56M16q42k44m11N75J1M23M04q57Q38
$$ -325 -6 414 -34 -324 44 216 -160 332 -353 203 619 -223 -467 -878 -303 -292 131 535 -322 516
7599E16O13r91q2m09j03N04J61q33J416p59K94o55M13l02j64K81O6Nm43N63j99
$$ 516 1129 138 56 -353 -456 48 209 -624 792 33 327 -328 85 -217 -381 -100 -34 -29 -472 91 -108
7620a08M9k97M57o31R09m30p9O06r02Q8P91o02R3K49l02L29p53K00P10k84l14
$$ -108 -59 -356 101 -530 379 -51 -130 476 -426 -338 453 -149 -56 193 -109 220 -533 -333 377 93 -221
7641b21M74p16K13L87J51j017O35K9j64O45j072R22m98M83k60K08n03K24j40n3
$$ -221 253 -463 -250 137 288 -729 -94 -65 -229 416 -656 266 -232 251 -9 199 -304 -80 -220 -273
7661b73N21k53J41n45Q9j02J208k98m27j8k33k63L28o70J163K31n57M42l39m5
$$ -273 248 -5 136 -409 -320 -422 786 488 61 43 -190 -453 -125 -795 368 599 42 484 145 100
7681A00O94r14J51j9R7p8O37n82L38l22m90J33M88k57k97q5Q72q29R4k51K86K15
$$ 100 794 -120 31 12 109 31 668 86 424 102 -388 -255 233 -24 -321 -406 466 -363 -269 -520 -234 -19
7703a9J29o61M48J68j42J05L5k44l69N07k48Q83n76P0O57q38j19L77j42N15k19
$$ -19 110 -551 -103 65 -77 28 63 -181 -550 -43 -291 592 16 86 743 -95 -214 163 21 536 317
7724C17o85M05l78l15P83m60K54P38r03L37M52o59J16J54m33j25N18J54l10k40
$$ 317 -368 37 -341 -656 127 -333 -79 659 -244 93 545 -114 2 156 -277 -402 116 270 -40 -280
7744b80J27n25J201l41k74j1N99k17n47L9K30l74N29K29m22k24K66k41M12n48
$$ -280 -153 -678 523 182 -92 -103 496 279 -268 -229 1 -373 156 385 -37 -261 5 -236 176 -372
7764c72m90P08M07L32m69Q6J55r47R27O7j51K05j090L93O2l04P13k09j40n9K81
$$ -372 -862 -154 253 585 116 202 357 -590 337 404 253 458 -632 -239 -177 -481 232 23 -117 -176 105
7785A05m21j4O70p26J19K14M72j42j81j15N14k9j219M13N01k14P7J37j88j44N9
$$ 105 -316 -330 340 -386 -267 -53 419 277 96 -19 495 466 -753 -340 161 -53 24 161 -27 -171 -112
7806a12l04Q11k04l45O46n90J37o8K38j41O13l17l83j25K07J88l69m71N05l5K32
$$ -112 -416 395 191 -154 492 -98 39 -29 209 68 681 364 -19 -144 63 251 -118 -589 -84 -119 113
7827A13O0n42M25o8L77p03J0P53j042N98N15j081L07Q3M74J01o96J08K22l6o99
$$ 113 173 -369 56 -12 365 -338 -328 425 -617 -19 496 -585 -278 -195 279 380 -316 -208 14 -22 -721
7848g21J127J98j032K79rK2r5M49p13K01K56L01l24o4K94j14k27L56j68j62k21
$$ -721 406 604 -428 -149 -158 -136 -231 218 -495 -294 -38 263 -61 -125 169 55 -172 184 16 -146 -367
7869c67O69j18j56M9j24K41k9K74k10j18n30O17m20O1Q3j8L46Jn19K46r7M83J06
$$ -367 302 184 28 77 -47 194 165 439 229 111 -419 198 -222 -161 -78 -96 250 251 -268 -22 -119 364 470
7892D70o81M04l5j75L01n70J89p2Q0K43n1p07O48k22J36o48J389q04M67p88P42
$$ 470 -211 193 158 -17 284 -286 -97 -169 -89 154 103 -604 44 -178 -42 -690 699 -105 362 -426 316
7913C16j05l62j45N4L80R84j164l37N60K28l32o3l83L56J47K22k33k74m3N76o15
$$ 316 211 -151 -296 -242 138 1122 -42 -379 181 409 77 14 -369 -13 134 356 123 -151 -194 382 -233
7934b33L5M27m55J18O15o36L23q58J089Q3o29j75J54J58p0j35N19n62k3j67L99
$$ -233 -198 229 -226 -108 507 -129 194 -664 425 508 -121 -296 -142 16 -54 -189 330 -232 -255 -422 -23
7955b3N31p08N47q68O31m20Q9M74J16j34l38n3Kj63Q12o92j35R73K91j79r76k9
$$ -23 508 -200 347 -521 110 -310 -221 253 369 235 -103 -156 -154 -317 495 -197 -332 641 932 753 -223 -252
7977b52O44N9r53Q18m8L8r7r09P54j95L20Q6J2k23l4l45K50O86o32k42Q07m11
$$ -252 392 451 -502 316 268 306 209 -700 54 -141 179 265 277 54 20 -325 -75 611 -21 -263 544 133
7999A33m57J62L91K17o28j43J88J47n48O51k51M4K28o7m14j54O08M18j221J221
$$ 133 -324 -162 229 446 -182 -325 -137 10 -538 113 -138 -94 134 67 -347 -501 107 525 -696 525
8019E25n96r38P81j12Q76m14j87k44O77M3m75n30M68m5P3J22k89O2J48N47j86
$$ 525 -71 -1009 -228 -340 536 122 -65 -309 368 411 -64 -594 -126 -171 -98 24 -265 -203 -55 492 306
8040C06q11K74m42J159q21M56L74p92m09J014k09n04K53K39M4q8J34p25K24N68
$$ 306 -505 -231 -673 486 -335 121 495 -297 -706 308 99 -405 -152 87 131 43 177 -548 -324 244
8060B44k21L38l71j03N20q36P60l58k6L46n94L78n22J152j009L96L14o06L80K00
$$ 244 23 361 -10 -113 407 -429 331 -27 -53 293 -301 77 -445 707 -302 94 408 -198 182 382
8080C82n69Q80k94j096K46J09N91K36k74K86j11j006Q52J79j57n71L34K43m06
$$ 382 -187 693 399 -697 -451 -342 249 485 211 497 386 -620 232 411 254 -317 17 260 -146
8099a46J75k73M11p39L18j13L42P45J16j198jM26k2M88p49O96l63l69k6M43M37
$$ -146 29 -244 167 -572 -254 -367 -25 720 836 -362 -363 63 41 529 -220 476 113 -256 -282 161 598
8120E98j116J025o68N1O67j239L61k73R77k01l58M59m34l43N76p6j91L80L83n9
$$ 598 -518 507 -161 -110 557 -682 -321 -594 383 182 -176 283 -151 -494 82 6 -185 195 578 519
8140E19k29o53Q92q01Q2l69M80l40L55R4K31l24l77K48K05K27RJ10k45l34J87
$$ 519 290 -363 529 -272 -190 -559 -79 -419 -64 30 261 -63 -440 -192 13 240 249 359 114 -220 -33
8161c3j45l14J58N39n75p8P84K49r36N97k0l10M03j153J043m28R68p40j63j95
$$ -33 -178 -492 -334 205 -370 -448 336 585 -351 246 226 -84 319 -834 209 -219 749 9 -154 -349
8181c49N14k68M01r65J050n05k08J37J37M20
$$ -349 165 -103 298 -667 383 -122 -330 -193 -56 364
8191C64
$$ Imaginary data points
##PAGE= N=2
##DATA TABLE= (X++(I..I)), XYDATA
0@%%%%%%%%%%%%%%%%M8r6R6r6R6r6J42j90J92k17K65k97L45m13M61n28O10o78
$$ 0 0 0 0 0 0 0 0 0 0 0 0 0 0 0 0 0 48 -48 48 -48 48 -48 94 -96 96 -121 144 -153 192 -221 240 -288 322 -356
34c56P64q64R67j084J208j346J503j668J853k054K265k503K763l047L355l692
$$ -356 408 -456 511 -573 635 -711 792 -876 977 -1077 1188 -1315 1448 -1599 1756 -1936
50a936M070m484M945n459O036o687P421q267R254j0418J1821j3543J5718j8567
$$ -1936 2134 -2350 2595 -2864 3172 -3515 3906 -4361 4893 -5525 6296 -7247 8471 -10096
64a0096K2467k8166L7303n4264R6141l86902p12522L97985J89336L76294P57585
$$ -10096 12371 -15795 21508 -32756 63385 -323517 -1036039 -638054 -448718 -72424 685161
75F85161K42306l75244k95518n67257n75422Q8343M30391M18293N90840K38926
$$ 685161 927467 552223 256705 -310552 -885974 -797631 -367240 51053 641893 880819
85H80819l18925m07944m72976n11949K6154M80085M80683M29863K34460k32047
$$ 880819 561894 153950 -319026 -830975 -804821 -324736 155947 585810 820270 588223
95E88223m96917n07602l37846M1549L86378N03844M45125J40849k37520m55826
$$ 588223 91306 -416296 -754142 -712593 -326215 177629 622754 763603 526083 70257
105G0257n14504l05140J15139L58707M51626M55319J12675l03996m01350m45652
$$ 70257 -444247 -749387 -634248 -275541 176085 631404 744079 440083 38733 -406919
115d06919l53244J28721M57275L93703L45088J58697k85600m77506l91042k58978
$$ -406919 -760163 -631442 -174167 219536 564624 723321 437721 -39785 -430827 -689805
125f89805Q2869M42376M44537K86316Q9744k52802m71871l85146j88431Q4236
$$ -689805 -606936 -164560 279977 566293 656037 403235 -68636 -453782 -642213 -557977
135e57977L98172M72691K67890J0417k29626m29443m16468j48794J56404L42166
$$ -557977 -159805 312886 580776 591193 361567 -67876 -484344 -633138 -476734 -134568
145a34568M29846L11949l3007k94984l63173l78415j82281K10274L75768L37219
$$ -134568 295278 607227 574220 279236 -83937 -462352 -644633 -434359 -58591 278628
155B78628K93535J3061l52874l76506k83568j85724J71950M39550L22127J96694
$$ 278628 572163 585224 232350 -144156 -427724 -613448 -441498 -1948 320179 516873
165E16873M1542l24351m37873k34747j05358J16041M26761L75353J28623j5611
$$ 516873 558415 234064 -203809 -438556 -543914 -427873 -1112 374241 502864 487253
175D87253k57709m40536k68389k5420J41588L57249L87528J41923q8624k56887
$$ 487253 229544 -210992 -479381 -504801 -363213 -5964 381564 523487 434863 177976
185A77976l79055k81439k0151J96215L32767L37055J56893r6418k95297l50560
$$ 177976 -201079 -482518 -502669 -306454 26313 363368 520261 423843 128546 -222014
195b22014k40907k8594K08574L54161K98885J18977q5607k95690l62540k01675
$$ -222014 -462921 -491515 -282941 71220 370105 489082 403475 107785 -254755 -456430
205d56430L166J88835L52233L07276P4667j11756k63178l56141k09214M6182K02390
$$ -456430 -453264 -264429 87804 395080 469747 357991 94813 -261328 -470542 -424360 -221970
216b21970L13584L08807P4728j58643k60760l11919k13200N3976K39443K89656
$$ -221970 91614 400421 475149 316506 55746 -256173 -469373 -415397 -175954 113702
226A13702K69437R0602j73218k91131k74670j80277L7551K55458L04173K24320
$$ 113702 383139 473741 300523 9392 -265278 -445555 -408004 -152546 151627 375947
236C75947O9490j52579l06480k80308j35259N1332K37474L13619K15959K9011
$$ 375947 445437 292858 -13622 -293930 -429189 -377857 -140383 173236 389195 418206
246D18206j54886k86885k84858j21399Q3097K31526K97240K15379Q065j78039
$$ 418206 263320 -23565 -308423 -429822 -346725 -115199 182041 397420 405485 227446
256B27446k69192k67402j20382J04865K45054K70117K00243J0015j99801k75491
$$ 227446 -41746 -309148 -429530 -324665 -79611 190506 390749 400764 200963 -74528
266g4528k32677j09097R9911K63890K67914J64597J321j92643k88795k22076p2952
$$ -74528 -307205 -416302 -316391 -52501 215413 380010 381331 188688 -100107 -322183 -395135
277c95135J02192K54015K73514J46814k6282j88289k78293k22549n3298J22003
$$ -395135 -292943 -38928 234586 381400 355118 166829 -111464 -334013 -387311 -265308
287b65308K46150K62759J39851m7452j96327k65014k11849m1582J38890K42725
$$ -265308 -19158 243601 383452 336000 139673 -125341 -337190 -378772 -239882 2843
297B843K45494J32990n8354k11155k53791j91622l6656J46796K51225K31365J11511
$$ 2843 248337 381327 322973 111818 -141973 -333595 -370251 -223455 27770 259135 370646
308C70646o2783k13564k56198j74520j5679J48684K47337K25633R3723p6337k12573
$$ 370646 307863 94299 -161899 -336419 -352098 -203414 43923 269556 363279 286942 74369
319G4369k47877j63912l981J60270K44343K11874Q1981q7175k15916k40818j49986
$$ 74369 -173508 -337420 -341401 -181131 63212 275086 357067 269892 53976 -186842 -336828
330c36828J0129J64790K41420K01871O7148r7778k16473k33121j36071K3515J68568
$$ -336828 -326699 -161909 79511 281382 348530 250752 34279 -198842 -334913 -311398 -142830
341a42830K37870J93851N1069j09151k14351k24378j26432L8195J75681K28849
$$ -142830 95040 288891 339960 230809 16458 -207920 -334352 -296157 -120476 108373
351A08373J80772M3126j19351k17013k12283j13087M6013J84109K24089J63173
$$ 108373 289145 332271 212920 -4093 -216376 -329463 -283450 -99341 124748 287921
361B87921L3783j23938k23171k01082r2710M9603J83024K30168J48891J1254j22703
$$ 287921 321704 197766 -25405 -226487 -319197 -269594 -86570 143598 292489 303743 181040
372A81040k16661k02300p7945O7531J77125K23123J47091q206j32949k03162j98829
$$ 181040 -35621 -237921 -315866 -248335 -71210 151913 299004 290798 157849 -45313 -244142
383b44142p2173Q8906J77957K04352J45506j3713j53490j98052j76128p0661R5400
$$ -244142 -316315 -227409 -49452 154900 300406 286693 133203 -64849 -240977 -311638 -216238
394b16238J90428J89996J29519j4138j62692k00733j58676n8942R6093J99080
$$ -216238 -25810 164186 293705 279567 116875 -83858 -242534 -301476 -205383 -6303
404f303J85509J06238k0644j58120k05670j51916l7793J00883J93112J83264R8380
$$ -6303 179206 285444 264800 106680 -98990 -250906 -288699 -187816 5296 188560 286940
415B86940l7326j63704j94721j42692l2962J13501J95482J67981Q9605m0557j74305
$$ 286940 249614 85910 -108811 -251503 -284465 -170964 24518 192499 282104 241547 67242
426F7242j92488j21542k9842J14052K08062J57484O5323l5615j74734k05972j00599
$$ 67242 -125246 -246788 -276630 -162578 45484 202968 268291 232676 57942 -148030 -248629
437b48629n772R9525K10222J67633L6635n1418j54276k10664j05646K6097J03001
$$ -248629 -254401 -154876 55346 222979 259614 208196 53920 -156744 -262390 -236293 -133292
448a33292J88615J77468L0579q1172j42905j92808j18391M0179J28091J66421
$$ -133292 55323 232791 263370 182198 39293 -153515 -271906 -231727 -103636 62785
458F2785J63649M4445j00056j59675j66251j08858L0758J47290J70882J36113
$$ 62785 226434 270879 170823 11148 -155103 -263961 -233203 -85913 84969 221082
468B21082M0717r5662j75308j58451q4672K7779J44570J85117J21749J7812q6794
$$ 221082 261799 166137 -9171 -167622 -252294 -224515 -79945 105172 226921 244733 157939
479A57939j73217j70252o4892M6389J33949J81728J25269j443r7719j62855j64981
$$ 157939 -15278 -185530 -250422 -204033 -70084 111644 236913 235470 137751 -25104 -190085
490a90085o2700O3196J35911J70837J23652j0304j11736j56175j52740o1950P0770
$$ -190085 -252785 -189589 -53678 117159 240811 230507 118771 -37404 -190144 -252094 -181324
501a81324J47488J60638J09128r809j18092j62284j41785m8502P2969J49008J62254
$$ -181324 -33836 126802 235930 226121 108029 -54255 -196040 -244542 -171573 -22565 139689
512A39689R6222k3323j15304j60627j44049l0029Q6081J35288J59346J01782m4090
$$ 139689 235911 212588 97284 -63343 -207392 -237421 -151340 -16052 143294 245076 200986
523B00986j26807j39014j41974l7469J09872J40150J33129J06200m1843j52591
$$ 200986 74179 -64835 -206809 -244278 -134406 5744 138873 245073 203230 50639
533E0639j30134j16242n1050J16050J65301J08091Q4586k0555j65411j50459p8734
$$ 50639 -79495 -195737 -246787 -130737 34564 142655 227241 206686 41275 -109184 -187918
544a87918l8449Q9424J84166J19134M4534k0409j43410j70967p8712j720Q1726
$$ -187918 -226367 -136943 47223 166357 210891 190482 47072 -123895 -202607 -204327 -122601
555a22601J66201J37597L4595m9787j29285j59144r0055J1951J00996J51554J26017
$$ -122601 43600 181197 215792 166005 36720 -122424 -212479 -200528 -99532 52022 178039
566A78039M0826o2069j39867j44496p9610R557J09706J56962J09552L0883n7285
$$ 178039 218865 156796 16929 -127567 -207177 -197620 -87914 69048 178600 209483 152198
577A52198j47171j46190o2199J6849J03999J61418J09706J1603o2815j37089j49394
$$ 152198 5027 -141163 -203362 -186513 -82514 78904 188610 200213 137398 309 -149085
588a49085n8335L5884J02303J51279J12318L177p7708j29708j39823o0728M7206
$$ -149085 -207420 -171536 -69233 82046 194364 197541 119833 -9875 -149698 -210426 -163220
599a63220J12027J38806J05367L811q8679j33293j26252n5456M8503J21346J35597
$$ -163220 -51193 87613 192980 196791 108112 -25181 -151433 -206889 -158386 -37040 98557
610I8557R0165K098r0051j40156j17900m1601M7909J22391J40280P7398j0103
$$ 98557 188722 190820 100769 -39387 -157287 -198888 -150979 -28588 111692 189090 178987
621A78987q5587j40052j19948k7112N5882J15783J40160P7083k6911q9161j27985
$$ 178987 93400 -46652 -166600 -193712 -137830 -22047 118113 195196 168285 79124 -48861
632d8861j22831k5108P5907J11824J26340Q0839l1899j05845j19884j07066k8939
$$ -48861 -171692 -196800 -120893 -9069 117271 198110 166211 60366 -59518 -166584 -195523
643a95523Q0162J23901J13569O8306k6968j11919j26530r1225j9948P4654J30454
$$ -195523 -115361 8540 122109 190415 163447 51528 -75002 -166227 -186175 -111521 18933
654A8933J14617N1491l2880j05243j31284q7928l428P6542J22486J17770M6346
$$ 18933 133550 185041 152161 46918 -84366 -172294 -175722 -99180 23306 141076 187422
665A87422m9269j04345j20230r0461L579Q9247J15944J07026M9540n5334j15529
$$ 187422 138153 33808 -86422 -176883 -173304 -84057 31887 138913 188453 133119 17590
676A7590j10371q0037N0R8212J22058R1212M2586n1143j23059j10971o3866K000
$$ 17590 -92781 -172818 -172768 -74556 47502 138714 181300 130157 7098 -103873 -167739 -165739
688a65739R5492J30304Q5714K6157m9236j21021j16618n2738J5699Q8096J28797
$$ -165739 -70247 60057 145771 171928 122692 1671 -114947 -167685 -151986 -63890 64907
699F4907Q8026J3243n5751j14538j14790n1976K7141R1981J20902Q6351J0269
$$ 64907 152933 166176 110425 -4113 -118903 -170879 -143738 -51757 69145 155496 165765
710A65765o6106j14563j07036m6728L0331R6438J20480P6773L811o7937j14643
$$ 165765 99659 -14904 -121940 -168668 -138337 -41899 78581 155354 159165 91228 -23415
721b3415j04150l8008L6029R5887J19002P2549n513o9677j12269j03831l1162
$$ -23415 -127565 -165573 -129544 -33657 85345 157894 152381 82704 -29565 -133396 -164558
732a64558M6958R2178J13867P3678j5878p7640j04219r8905l1482N7958R5815
$$ -164558 -117600 -25422 88445 162123 146245 68605 -35614 -134519 -166001 -108043 -12228
743a2228J02502P1214j5773q8780j02642q6105l1806N8077J06736R5816N8007
$$ -12228 90274 161488 145715 56935 -45707 -131812 -163618 -105541 1195 97011 155018
754A55018j3343r0005j09533p6299k0976N4441J08907R6962M5843j7581q7703
$$ 155018 141675 51670 -57863 -134162 -155138 -100697 8210 105172 151015 133434 45731
765D5731j11175p3074r808N6022J05793R8281L9145k7753q4136j08202p3546l18
$$ 45731 -65444 -138518 -148326 -92304 13489 111770 150915 123162 39026 -69176 -142722 -143040
777a43040O1920J00321R6083L6242l6151q7443j01188o9193J898O8656J00241
$$ -143040 -81120 19201 115284 151526 115375 27932 -73256 -142449 -140551 -71895 28346
788B8346Q9001L2194m0359r0726r8276o1581O212P0785J00044Q4589K5706m3905
$$ 28346 117347 149541 109182 18456 -79820 -141401 -135189 -64404 35640 120229 145935 102030
800A02030r1732r4714n7137J2525P3092R7816P9798K1581m8589r2848r1887n0391
$$ 102030 10298 -84416 -141553 -129028 -55936 41880 121678 143259 94670 1822 -90065 -140456
812a40456J7172P6085R6916P2916J7174n2087r3488q8780m5068K1917P9153R4943
$$ -140456 -123284 -47199 49717 122633 139807 87720 -5768 -94548 -139616 -117699 -38546 56397
824E6397O6975J1650n4250r3547q5568l8390K4988P9632R5477O2322K415n5700
$$ 56397 123372 135022 80772 -12775 -98343 -136733 -111745 -32113 63364 125686 128101 72401
836G2401r0814q3687l3686L1139Q0185R2667N8744j957o0918r0986p6996k8941
$$ 72401 -18413 -102100 -135786 -104647 -24462 68205 126949 124992 64074 -26912 -103908 -132849
848a32849L3630Q2018R0097N4510o743o2812r1342p4137k2102L8070Q0922Q7517
$$ -132849 -99219 -17201 72896 127406 120663 57851 -33491 -107628 -129730 -91660 -10738 76779
860G6779N0124j0745o5862q9914p0136j6988M2407Q1287Q4539M4720j6208o6501
$$ 76779 126903 116158 50296 -39618 -109754 -126742 -84335 -3048 81491 126211 110003 43502
872D3502q8058o7715j2737M7742Q1493Q0534M0034j9661o8720q5412o4349q268
$$ 43502 -44556 -112271 -125008 -77266 4227 84761 124795 105134 36414 -48998 -113347 -121615
884a21615N0070Q2350P8024L4765k4735o9501q3991n8644l439N1705Q1257P6745
$$ -121615 -71545 10805 88829 123594 98859 29358 -54633 -113277 -116716 -65011 16246 92991
896I2991K9872l0042p1938q0293n5458J784N6232P8620P1565K9192l4787p4905
$$ 92991 122863 92821 20883 -59410 -114868 -113084 -56852 21768 93333 122525 87738 12833
908A2833p6245n0858M093O0654P9605O3093K5868l4772p8136p5188m2632N583
$$ 12833 -63412 -114270 -110177 -49523 30082 93175 119043 84271 6135 -69053 -111685 -106102
920a06102O0816Q3575N8626J5944l3981p7536p6222l6393J1648N9538Q2761N9257
$$ -106102 -45286 38289 96915 112859 78878 1342 -74880 -111273 -99625 -40087 42674 101931
932A01931P975l9401p3974p4706l4475J9761N9760P8343N7846N494m5928p2460
$$ 101931 109906 70505 -3469 -78175 -112650 -92889 -33129 45214 103060 108554 62626 -9834
944i834o9650l3266K3425O4962P3505N2720M713m7912p6499o4431k7301K4388
$$ -9834 -79484 -112750 -89325 -24363 49142 101862 106575 58663 -17836 -82267 -109568 -85180
956h5180O6766P3701M6284Q69m9234p6891o2248k0887K7117O5890P4965M1981
$$ -85180 -18414 55287 101571 102440 53206 -23685 -85933 -106820 -79703 -13813 61152 103133
968A03133p246m9194p2341o3010j7563L3060O5953P1149M0336j1403n3432p0311
$$ 103133 95887 46693 -25648 -88658 -106221 -73161 -7208 63941 104277 92874 39442 -30869
980c0869n8196j5826L6428O8130O5956L7704j2235n8404p1599m9547j2574L5898
$$ -30869 -89065 -104891 -68463 -333 65623 103327 91092 32688 -38911 -88458 -101032 -65134
992f5134P0548O5432K8878j3542n6688p4521m7167l088L6012O8222O7290K3243
$$ -65134 5414 70846 99724 86182 29494 -45027 -92194 -95282 -59270 8952 76242 99485
1004I9485k1673n2268p2172m9622M273M2223O2259O4261K4336k8117n5813o5109
$$ 99485 77812 25544 -46628 -96250 -91977 -49754 12505 76766 101102 72985 17172 -47937
1016d7937m7962L119M9310O3103N6460K3435k9387o1382o1111m0834L548M8914
$$ -47937 -95899 -92780 -43470 19633 76093 99528 70141 8759 -52352 -93186 -89638 -40724
1028d0724O6983N2928J6339k8924o1385o3645l4240R068M6871O5723N4590R939
$$ -40724 26259 79187 95526 66602 5217 -58428 -92668 -83600 -36729 28994 83584 93523
1040I3523l3732n7798o2134l5212J6068N0810O0315N0909J1157l9930n9289n5503
$$ 93523 59791 1993 -60141 -95353 -79285 -28475 31840 82749 93906 53976 -5313 -60816
1052f0816l2566J4913N7189N9363M2460J0499l9616o4844n0331k5557J3218N8362
$$ -60816 -93382 -78469 -21280 38083 80543 91042 51426 -13418 -63749 -89306 -76088 -17726
1064a7726O2554L6054M613l5973o7277n1837j6940J6408N4076O5155L5785m428
$$ -17726 44828 80882 85495 49522 -17755 -69592 -86532 -70124 -16048 49107 84892 80464
1076H0464l7027o3726n2939j3033K2794N2225O2439L4324q274m0301n9389n2242
$$ 80464 43437 -20289 -73228 -86261 -63467 -11242 51197 85521 77247 36946 -22443 -74685
1088g4685j1877K8393N2810N7489L4299j0573m4284n9410m6609j0678L0226N5147
$$ -74685 -86562 -58169 -5359 52130 86429 75856 31572 -27838 -74447 -85125 -54899 248
1100B48N6175K8910j3045m5481n8220m4805n959L2834N4152N3589K6831j7241
$$ 248 56423 85333 72288 26807 -31413 -76218 -82177 -49343 4809 58398 85229 67988
1112F7988m6769n5224m3800l598L7614N2851M9551K6759k0436n0240n2101l8763
$$ 67988 21219 -34005 -77805 -81403 -43789 9062 58613 85372 64936 14696 -37405 -76168
1124g6168m640M0991N6790M2231K3250j7927n5760n2003l0343l402L8424O0380
$$ -76168 -80808 -39817 16973 59204 82454 64527 8767 -43236 -73579 -76981 -38557 21823
1136B1823M2283J3476j6858n2778n6747k6240N450L3155N9303M5961O886k1862
$$ 21823 64106 77582 60724 7946 -48801 -75041 -69591 -36436 22867 68828 75714 53852
1148E3852m7887n7151k6708J2072L6288N3590M6187O568k8848m7419n1140k8477
$$ 53852 5965 -51186 -77894 -65822 -29534 24056 70243 76811 47963 544 -50596 -79073
1160g9073J4419M2812M9057M1951P217l2266m9395m6661k5516J4353M5155N0179
$$ -79073 -64654 -21842 27215 69166 76383 44117 -5278 -51939 -77455 -63102 -17947 32232
1172C2232L6414M673l2198m9934m5789k1555J5798M5770N0600L3589J176l2549
$$ 32232 68646 73319 41121 -8813 -54602 -76157 -60359 -14589 36011 69600 70776 38227
1184C8227n0910m4196j7379J7471M5780M9670L1310r60l5609n1035l9907j5836
$$ 38227 -12683 -56879 -74258 -56787 -11007 38663 69973 69013 33404 -17631 -57538 -73374
1196g3374K0243M7879M7353K7053k386l6722n3085l7795q785J9127M7680M9134
$$ -73374 -53131 -5252 42101 69154 66768 30046 -23039 -60834 -69619 -50492 -2812 46322
1208D6322K2796p462l4633n1781l8439m734K3711M3963M8795K1965j3648l4066
$$ 46322 69118 61656 27023 -24758 -63197 -67931 -44220 -257 48538 70503 56855 22789
1220B2789m9195l8557j921K7932M2575M5653K2231j7164l8391m3956l6141k716
$$ 22789 -26406 -64963 -66884 -38952 3623 49276 71507 54343 15952 -28004 -64145 -66861
1232f6861L2654M3259L9476K1700j6182m2953m3167l0657l189L2349M7773L7037
$$ -66861 -34207 9052 48528 70228 54046 11093 -32074 -62731 -65920 -33571 14202 51239
1244E1239J5490j5912m2352m5148k5896N03L2145M6492L7116J1481j7412m2798
$$ 51239 66729 50817 8465 -36683 -62579 -62076 -29931 16561 53677 65158 47746 4948
1256D948m4013k3707L725L2564M5967L6202Q129k0735m1093m2768k3465Q311L4332
$$ 4948 -39065 -62772 -59047 -26483 19484 55686 63815 43080 1987 -40781 -64246 -55935 -21603
1269b1603M4165L3889P418k3196m2462m1488j8896Q848L4207M4811L1393L494
$$ -21603 22562 56451 63869 40673 -1789 -43277 -62173 -53325 -19118 25693 57086 60580
1281F0580k3209m2368m0462j7476J2284L5987M2119L0275J442k5883m1347l8689
$$ 60580 37371 -4997 -45459 -62935 -50651 -14664 27455 57730 59172 33289 -8058 -46747
1293d6747j6260J5284L6517M1525K7922k23k8750m0340l6736j4132J5956L8631
$$ -46747 -63007 -47723 -11206 30319 58241 58018 29268 -11072 -47808 -61940 -45984 -7353
1305g353M0035K5572k144l0589m0537l3492j1502J6703L8786M0430K1962m202
$$ -7353 32682 58254 56110 25521 -15016 -48508 -60010 -43307 -4521 35909 57871 53669
1317E3669l0225m1739l2187q060J9382L7378L8713K1036o989l1266m0850l0363
$$ 53669 23444 -18295 -50482 -58542 -39160 -1782 36931 57967 50978 19712 -21138 -51501
1329e1501n567K1638L7614L7245J7872r272l0929m0280k8844l953K2996L8144
$$ -51501 -57068 -35430 2184 39429 57301 48029 17100 -23180 -52024 -55977 -32981 5163
1341E163L5959J5595j1134l2197l9234k6324k031K3845L9363L4192J3541j3706
$$ 5163 41122 56717 45583 13386 -25848 -52172 -54203 -30358 9005 43197 56738 43032
1353D3032l2661l8308k4762K87K5694L7728L3148J1342j4351l4245l6985k3395
$$ 43032 10371 -27937 -52699 -52412 -26718 11010 44158 55500 41149 6904 -30081 -53476
1365e3476K911K6777L7820L0828R873j6304l5076l5587k0696M884K7180L7156
$$ -53476 -50565 -23788 14032 44860 54733 38429 3353 -32234 -52930 -48046 -20866 16290
1377A6290K9742P070j7694l4077l5534j9123O947K8887L6461K8032N279j9912
$$ 16290 46032 53102 35408 1331 -34203 -53326 -46379 -17492 18969 47001 52280 32368
1389C2368l4771l3007j7916R603K9574L5579K6044M079k1530l5440l1711j5193
$$ 32368 -2403 -35410 -53326 -43723 -14149 21430 47474 51553 30023 -5417 -37128 -52321
1401e2321J0276L0649L5173K4477N33k2158l4728l0431j2619J1943L0860L4534
$$ -52321 -42045 -11396 23777 48254 48787 26629 -8099 -38530 -51149 -39206 -8346 26188
1413B6188K1158L3k3300l4425k9863j0985J4288L1387L3173K1087k680k5144l3757
$$ 26188 47346 47379 24079 -10346 -40209 -51194 -36906 -5519 27654 48741 46061 20917 -12840
1426a2840k7854r155J4753L2317L2557J7495l091k5361l4825k5803o535J5746
$$ -12840 -40694 -49849 -35096 -2779 29778 47273 44182 18821 -16004 -41807 -48342 -32596
1438c2596L2392L1449J5587m924k5035l5059k3656m413J6352L1821L1307J4052
$$ -32596 -204 31245 46832 41908 16873 -18186 -41842 -46255 -29903 1918 33225 47277
1450D7277p531k5836l3823k3582q98J7309L0726L1325J1859r913k6363l1138k3640
$$ 47277 39746 13910 -19913 -43495 -44393 -27084 3642 34967 46826 36913 10550 -20588 -44228
1463d4228k66K0956L0607K8228J2127j2124k7000l1574k0170R93K1294L0316K7238
$$ -44228 -44494 -23538 7069 35297 47424 35300 8300 -23274 -43444 -42451 -21157 9159 36397
1476C6397R028j2238k8581k9341j9452K622K2656L0358K5396Q368j4864k7788
$$ 36397 45425 33187 4606 -24735 -44187 -41565 -18909 11449 36845 45213 30349 2561
1488B561k9005j7443M491K2817L0377K3859O897j5571k9061k8075j4967M616K4371
$$ 2561 -26444 -43887 -39396 -16579 13798 37657 44554 28983 -78 -28153 -43120 -38504 -14133
1501a4133L0236K1918N157j6280k9245k7744j2834O317K4948L0728J9627K665
$$ -14133 16103 38021 43178 26898 -2347 -30091 -42925 -36608 -11660 19068 38695 41360
1513D1360j6471k9295k7196j0897Q494K3728L0282K0301m98j7480k8329k6907
$$ 41360 24889 -4406 -31602 -42499 -34005 -10277 20005 40306 39808 22328 -6001 -32908
1525c2908r262J0374K5071K7294K0016j565k0925k5675k4977r850J3132K4846
$$ -32908 -42170 -31796 -6725 20569 40585 39020 18095 -7580 -32557 -42407 -29275 -4429
1537d429K6427J8388j963k1689k7983k1400r025J3039K7151K5001J5434j900k2293
$$ -4429 21998 40386 38423 16734 -11249 -32649 -41674 -28635 -1484 23517 38951 37051 14758
1550A4758k8551j9316p337J2843K9050K4130J3214l762k2025k8016j9296l974
$$ 14758 -13793 -33109 -40446 -27603 1447 25577 38791 35029 13004 -15012 -34308 -38282
1562c8282J3587K7542K4388J0943m910k2687k8085j7480j930J3929K7529K4298
$$ -38282 -24695 2847 27235 38178 33268 10581 -17504 -34984 -36914 -22985 4544 28842
1574B8842Q848o426k1872k8408j6612J23J4697K7074K4171O659q121k1412k7935
$$ 28842 37690 31264 9392 -19016 -35628 -35505 -20808 6266 30437 37096 28975 7563 -20372
1587b0372j6372K760J5667K5635K3761O814j1552k1437k5433j7007M484J7795
$$ -20372 -36744 -33984 -18317 7318 31079 37893 26341 4904 -20529 -37536 -33052 -15257
1599a5257K4812K1829O534j3524k2052k3585j5820N081J9245K4730J9477N623
$$ -15257 9555 31384 37918 24394 2342 -21243 -37063 -31982 -12737 11993 31470 37093
1611C7093j3391k3870k2950j3123M164K1161K3872J8782M315j4062k4519k1992
$$ 37093 23702 -168 -23118 -36241 -32077 -10916 12956 31738 36053 21991 -2528 -24520
1623b4520j0979M520K1130K5989J6092J838j3933k4548k1375q947O483K0119K5033
$$ -24520 -35499 -30979 -9849 16140 32232 34070 20137 -4411 -25786 -34733 -28250 -8131 16902
1636A6902J5712K60j4462k4200k1669p268Q391K0975K3887J3841o85j6223k3264
$$ 16902 32614 32874 18412 -5788 -27457 -34725 -26334 -5359 18528 32369 31684 15461 -7803
1649g803k0466o409J0191K0251K3660J3807k977j5500k3294k0305m748J1132K1037
$$ -7803 -28269 -34678 -24487 -4236 19424 33231 30254 14754 -8540 -28845 -33593 -22461 -1424
1662a424K1899J3221m377j7066k2211j9101m570J1978K2333K0569J2416n238j8755
$$ -1424 20475 33696 29319 12253 -9958 -29059 -33629 -21651 682 21251 33667 28429 9674
1675I674k1477j7404l392J3149K1862J9616J0586n256j9957k1971j4619k280J3570
$$ 9674 -11803 -29207 -32599 -19450 2412 22028 32614 27358 7401 -14570 -29189 -31469 -17899
1688a7899K1901J9709Q694o009k0218k2687j2979l67J2725K3046J9046O333o727
$$ -17899 4002 23711 32405 26396 6178 -16509 -29488 -29855 -17130 5916 24962 31295 24568
1701B4568j8776k3344j2456P86J3921K2811J8304M577q139j7923k2102j2068K310
$$ 24568 5792 -17552 -30008 -29222 -15301 7510 25814 30391 22252 4329 -17773 -29841 -27531
1714b7531J3925K1726J8140M088r056j9501k0529j1492L472J5266K1635J6730
$$ -27531 -13606 8120 26260 30348 21292 1791 -18738 -30230 -26758 -11492 10143 26873
1726B6873K921j0428j8991k0567j0121M227J6796K0872J5462K258j1403j9297
$$ 26873 29794 19366 375 -20192 -30313 -26086 -9290 11582 27044 29302 17899 -1398
1738a398j9519r486O378J6221K0516J4639K183j2947j9465j8526q621O840J6618
$$ -1398 -20917 -30403 -24025 -7804 12712 27351 29534 16587 -2878 -21404 -30025 -23185 -6567
1751f567K0321J3273J022j3508j9524j7143o716O455J8151J9295J2670m45j3599
$$ -6567 13754 27027 28049 14541 -4983 -22126 -28842 -22387 -4236 15059 27729 27284 13685
1764A3685k0875j5854n552P593J7844J8864J1906j466j4272k0026j5133n189R168
$$ 13685 -7190 -23044 -28596 -21003 -3159 15705 27611 26145 11873 -8153 -23286 -28475 -19307
1777a9307J8062J8413J0113k562j4182j9809j5065l549R809J8350J8463R088m297
$$ -19307 -1245 17168 27281 24719 10537 -9272 -24337 -27886 -18077 273 18736 27824 23527
1790B3527j5192j8539j4492j981R622J9046J7094Q226m629j5193j8988j3262j346
$$ 23527 8335 -10204 -24696 -26677 -17055 1991 19085 27311 22682 7489 -11499 -24761 -26107
1803b6107J0493J8788J6676P178o340j4907j8502j2354K74J1064J8061J6635N790
$$ -26107 -15614 3174 19850 27028 20688 5781 -12721 -25075 -24801 -13737 4324 20959 26749
1816B6749o459j6379j7658j1806N41J2767J8487J4841M905p083j5668j8045j0417
$$ 26749 20290 3911 -13747 -25553 -25012 -12245 6242 21083 25988 18905 3237 -14808 -25225
1829b5225J844J2394J8560J4113M008p569j7456j6628r667K290J3366J8856J3125
$$ -25225 -23381 -10987 7573 21686 25694 18125 669 -15959 -25626 -23336 -9970 8886 22011
1842B2011L420q631j7190j6209q185L224J3120J8409J2464K605j0365j6088j6174
$$ 22011 25431 16800 -390 -16599 -24784 -21560 -8440 9969 22433 25038 14673 -1415 -17589
1855a7589p262L835J3996J7687J2002L94r272j6683j5285o348N243J3776J7033
$$ -17589 -24851 -21016 -7020 10667 22669 23063 13791 -2892 -18177 -24525 -19282 -5506 11527
1868A1527J1626M53j1105j6752j4228n868N336J5368J6341J0514j377j0992j5650
$$ 11527 23153 23606 12501 -4251 -18479 -24347 -19011 -3643 12698 23212 21835 10843 -4807
1881d807j4241m765O466J4595J6722R494j500j2312j6113j3579l986Q588J3953
$$ -4807 -19048 -23813 -17347 -2752 13970 23464 21964 9652 -6461 -20040 -24026 -15438 -1485
1894a485J5509Q967k366j1962j5808j2766l825Q671J5139J5027P782k754j3200
$$ -1485 14024 22991 20625 8663 -7145 -19911 -23736 -15065 74 15101 22883 20129 6929
1907F929j5168j2069k368Q931J5063J4429O643l641j3552j4544j1384j063R359
$$ 6929 -8239 -20308 -22676 -13745 1318 15747 22390 18749 5197 -9347 -20731 -21794 -12435
1920a2435J5733J3393N869m764j3454j5024r944p78J0142J5075J3196N466n677
$$ -12435 3298 16691 22560 17796 4342 -10682 -20626 -21404 -11262 3813 17009 22475 16798
1933A6798j4102j4193r223qR791J5791J2518M421n560j4137j4891q047J012J1017
$$ 16798 2696 -11497 -20720 -20728 -10937 4854 17372 21793 16233 2096 -12795 -20842 -19830 -8813
1947h813J4801J1873L199o210j3882j4546p182J547J1324J4533J1363K608o728
$$ -8813 5988 17861 21060 14850 968 -13578 -20760 -19213 -7889 6644 18007 20615 13887
1960A3887j3454j3821p529K757J1009J5468J0282K300q853j3016j3722o395L744
$$ 13887 433 -13388 -20917 -18160 -7151 8317 18599 20899 12046 -970 -14692 -21087 -17343
1973a7343J2509J3360J0095J082q208j3877j2478n757L933J2768J3367R632M42
$$ -17343 -4834 8526 18621 19703 11495 -2382 -14860 -20617 -16684 -3916 9451 19083 19525
1986A9525q807j4340j1973m691M810J2389J3485Q942m33r199j5023j1164l801
$$ 19525 10718 -3622 -15595 -20286 -15476 -3087 10398 19340 18907 9708 -5315 -16479 -20280
1999b0280N728J2268J4640O618o26r940j3732j1116l017N616J3007J2978P055
$$ -20280 -14552 -2284 12356 18974 18348 8408 -5324 -16440 -19457 -13841 -834 12144 19199
2012A9199k679r275j3612j0707j814O424J2539J2469O487k825r835j3806r484
$$ 19199 16520 7245 -6367 -17074 -18888 -12464 75 12544 19031 16206 6371 -7435 -16919
2025a6919j489O897J2528J2274O189l888j0397j2863r639n08P163J2435J1460
$$ -16919 -18408 -11511 1017 13291 19480 15592 5195 -7668 -17307 -17815 -10652 1783 13243
2038A3243O114m745j1041j2220q206j134Q519J2421J0974M244m630j0937j2094
$$ 13243 19357 14612 3571 -8649 -16855 -17989 -9470 2951 13925 18169 13539 2602 -9492
2051i492p867K94Q378J3152R539M259m363j1771j1770p637L77R497J2420R881
$$ -9492 -17359 -17065 -8687 4465 14004 18263 13900 2129 -9641 -17278 -16901 -7404 5016 14897
2065A4897K676n458j1470j1614n718J110Q860J2739Q925K338n794j1189j1397
$$ 14897 17573 12115 645 -10969 -16687 -15577 -6717 6022 14947 17285 11491 302 -11095
2078a1095n669J647R023J2266R155J896o616j1111j1692n384L360R660J1960P751
$$ -11095 -16764 -15117 -6094 6172 15327 17223 10607 -504 -12196 -17580 -14220 -4560 7400 15151
2092A5151J706q242j0035j0698m675L475R823J1402P228J319q133j0516j0103
$$ 15151 16857 8615 -1420 -12118 -16793 -13318 -3495 7907 15135 16454 8321 -2195 -12298
2105a2298m276M143R816J1165O970l47p057j1992r629l157M606J0775J0435O981
$$ -12298 -16574 -12431 -2615 8550 15520 15173 8116 -3876 -13505 -16662 -12056 -1281 9154 16135
2119A6135q64q834j0729r123l124N276J1060R999O343j641q820j1377p552k966
$$ 16135 15271 6437 -4292 -13415 -16539 -11263 -203 9796 16139 14498 5678 -5699 -13251 -16217
2133a6217N471J1458J0002M742k172p630j2435o946j368N848J0392R399M318j357
$$ -16217 -10746 712 10714 15456 13284 5654 -6781 -13727 -15095 -9247 1145 10544 14862 13505
2147A3505r808j0957p071k63N652J0629R655L513k957q691j0490o837P7O765R805
$$ 13505 3697 -7260 -14331 -14594 -8942 1687 11342 14855 11898 3207 -7283 -14120 -14043 -7278 2527
2162B527R342L594m255q715j0385o204K02O684J0018R496K840m495r395r492o192
$$ 2527 11869 15463 11208 2493 -7892 -14096 -13894 -7210 2808 12304 15144 10649 1254 -8238 -14430
2177a4430M23Q443R501Q022K975m474r790r488n538Q91Q192J0724O679K738o262
$$ -14430 -14007 -5564 3937 11959 14934 10460 670 -8818 -14356 -13465 -5273 5451 12130 14868 8606
2192H606q495r204n173K222P730R557P305J781n777j0138p978m140K185P136J0477
$$ 8606 111 -9093 -14266 -12044 -4314 5243 12548 14329 8552 -1586 -9564 -13704 -11519 -4383 6094
2207F094O777R29o311r180q446l725K751Q414R459O207R4n809r411q481k928L295
$$ 6094 12871 13800 7489 -1691 -10137 -13862 -11111 -2697 6762 12969 13063 7254 -2157 -10638 -13566 -10271
2223a0271Q172R701N733p30o035r150q650k887M271Q427R643N060j663n619r266
$$ -10271 -2099 7602 13335 12605 6570 -2580 -11230 -14117 -9846 -1419 8224 13284 11621 6002 -3264
2238c264q498j252M509P636Q477N149j212o204r677o972j619M149R152P750N081
$$ -3264 -11762 -13014 -8505 -869 7608 12757 11545 5341 -4336 -11308 -12927 -8778 374 8124 13205
2253A3205j598p596q946o438j667N234R122P402L846k050p386r544n197o05N119
$$ 13205 11607 4011 -4935 -11373 -13040 -7806 1316 8718 12564 10514 3128 -6416 -11613 -12218 -7099
2268g099Q850Q076K647k422p181q596o384o7N481R349P082K504k584p415r461
$$ -7099 1751 9827 12474 10052 2871 -5725 -12109 -12176 -6695 2654 9736 12240 9656 2241 -7220
2283g220l851p04N816R338O157L138l983o686r305m346J065N103Q150P532J619
$$ -7220 -11071 -11775 -5959 3379 9536 12674 8691 2005 -7300 -11646 -10581 -5478 2672 10204 11823
2298A1823m067o392q802m264J486N668Q219P032Q49l505p540q500l729J829N994
$$ 11823 7756 1364 -7438 -11702 -10216 -4548 3671 10703 11552 8047 507 -7993 -11722 -9893 -3899
2313c899Q609N434J203m426p313p417l663J838P066P116N475J544n210p891p518
$$ -3899 4710 10144 11347 6921 -392 -7809 -11472 -9634 -2568 4548 10023 11567 6357 -1534 -9052
2328i052k325K114O804P501O209j21n070q040p059k399K782P201P927L976l45
$$ -9052 -11377 -9263 -2459 5042 11251 11130 6060 -1980 -9039 -11438 -8656 -1455 6472 10448 10103
2343A0103n478p522o325k233K647P579P664M779j326n466p734n462k602M284P155
$$ 10103 4625 -2897 -9222 -11455 -8808 -1229 6435 11214 9888 4422 -3312 -8774 -11376 -7092 63
2358F3P459L642j853n887p227n578j404L829P349P040L399j178o694p221m878
$$ 63 7522 11164 9311 3424 -3803 -9381 -10785 -6956 393 7433 10832 9654 2960 -4261 -9139
2373i139j003L949O831O513L447j751n982p953m553K47K782Q222O408K762k797
$$ -9139 -10142 -6193 638 7151 10598 8847 2865 -5088 -9641 -9394 -6612 1610 8018 10780 7983
2388G983n348q264m179L41M026O767O594K253k182o424p555m098K55N810N957
$$ 7983 2635 -5629 -9808 -9467 -5441 1326 7920 10173 7991 1567 -5988 -10086 -9831 -4021 1936
2403A936O503J731k921o487o416l784M35N073P226N523J643l537o543o452l952
$$ 1936 8439 10170 7249 762 -5654 -9438 -9003 -3930 3296 8819 10462 6925 382 -6070 -10022
2418a0022J843M793O693N214J229l404o885o534k191R62N638O662M862R37l626
$$ -10022 -8179 -3386 3307 8521 9750 6346 -539 -7073 -9264 -8302 -2664 3998 8860 9797 6171
2433F171o511o678k706J584N486P036M437Qm016o429n962k088K832M823O681M429
$$ 6171 -340 -7018 -9724 -8140 -2654 4382 8819 8827 4811 -1618 -7580 -9668 -6836 -2013 4668 9097
2449I097P1m318o331n471k509K218O052O317L686q84l703o406n469j925L014N763
$$ 9097 9168 4850 -1481 -6952 -9461 -7243 -1191 5126 8812 7928 4225 -2181 -7650 -9575 -6561 -798
2465g98O531L606j031m756n550n695j407L116N783O188L437j171m906o624m939
$$ -798 5733 9339 8308 3552 -1998 -7693 -9100 -5984 -201 5987 9424 8253 3347 -3277 -8216
2480h216q83K999O707N159L150p91n248n773m480j280L215O167N321K735j414
$$ -8216 -9099 -6100 607 5766 8916 8125 2877 -2896 -7376 -8656 -5441 726 6047 8782 7368
2495G368n385o301l722m51L286O226N428K223j452n014o710l607k03M214N309
$$ 7368 1983 -4318 -8040 -8491 -5205 1021 6449 8672 7220 2206 -4504 -8111 -8314 -4100 1209
2510A209N888J755j947n757n733l477N2M211N897N000J399k097n594o193l088
$$ 1209 7097 8852 6905 1148 -4585 -8062 -8010 -3799 2098 7098 8497 6400 806 -5387 -8475
2525h475J615L393N858M255J737l174n073n199l348J407M059N655M175J444k750
$$ -8475 -6860 -3467 2391 6646 8383 5209 136 -5063 -8411 -7004 -2945 2710 6885 8329 5579
2540E579o141m405k776O13N506M966L733P54l004n560m746k443J408M356N501
$$ 5579 -562 -4967 -7743 -7130 -1624 3342 7075 7829 4825 -735 -5481 -7924 -6516 -2160 3341
2555C341L490Q31l659m883n155j742J776M711N305L403j95l178o033m512j463
$$ 3341 6831 7662 4003 -880 -6035 -7777 -6001 -1290 4015 7418 7223 4045 -1988 -6500 -7963
2570g963K098M539N511K696r8k851n863m867p84J962M816N338L282r63l435n436
$$ -7963 -5865 -1326 4185 6881 6783 3932 -1931 -6798 -7582 -5620 -804 4534 7816 6853 3418 -2018
2586b018m520q86K580M563M389L378j055l558n397m062r67K943M784N216K213
$$ -2018 -6538 -7424 -4844 -281 4108 7486 6431 2873 -2524 -6586 -7553 -4610 174 5390 7603
2601G603j729m147m565l925k95K902M792M314K302j841l294m480m765M6L206N076
$$ 7603 5874 1727 -2838 -6763 -7058 -4156 636 4950 7252 5411 2117 -2363 -7128 -7082 -3876 1200
2617A200L930K555j777m302m790l470l33L995M954L502J738j752n127m455k407
$$ 1200 5130 7685 5908 1606 -3184 -6654 -6987 -2992 1962 5464 7202 5450 323 -4132 -6539
2632f539L60L205M693L785R13j341m493m796k838J032K791N749L682J63j652m755
$$ -6539 -6179 -2974 1719 5504 6417 5076 583 -4213 -7051 -6019 -3228 2521 6203 6366 4714 -41
2648d1m240k387O93L422M776L589M11j834n026l901k501J204M143L933L457M30
$$ -41 -4281 -6668 -5975 -2553 2223 5812 6223 4389 -637 -4538 -7039 -5835 -1692 2241 5698 6128
2664F128k055m972m144j497R53M238L670L344M73l035m244l962j253J807L561
$$ 6128 4073 -899 -5043 -6540 -5587 -1349 2321 5665 6138 3103 -1141 -5103 -6356 -4549 -988
2679i88M272K781kl022m418l393j615R76N198L724K425J15l110m469l899j045
$$ -988 3284 6065 6063 3041 -1377 -4770 -6385 -5409 -211 3513 5938 6053 2943 -1526 -5425 -6470
2695f470K082M705L235K258J76l210n047l834m9J822M641L925K027q98l189m501
$$ -6470 -4388 317 3552 5810 5986 2776 -2271 -6105 -6154 -4332 309 4234 6261 5363 2174 -2327
2711b327l583l98J861M476L921K205p89l395m239l684L42J810M394L579K092j625
$$ -2327 -5910 -6308 -4447 29 3950 6155 5366 1971 -2268 -5952 -5610 -3800 594 4173 6265 4640
2727D640l081m354k541o45K901M362L417M34j312k538m260k477K59L205L350L410
$$ 4640 1559 -2795 -5336 -5981 -3080 1282 4699 5133 3821 1283 -2977 -5454 -5195 -1990 1360 4770
2743D770R36j599l307m405k336M16L008M401L575L5j880l065m548j600M75L529
$$ 4770 5706 4107 800 -3605 -5941 -5525 -2517 1884 5459 5494 3614 549 -3999 -5599 -5124 -1595
2759a595L368K818P42j045l915m393j334O00L328L463L169j24j349m455l061j447
$$ -1595 1773 4591 5333 4288 373 -4020 -5354 -4754 -1426 2037 5206 5082 3733 -722 -3783 -5230
2775e230O90K893M441K043N11k101l637l584j715J520K751M399K266K98k724l414
$$ -5230 -4540 -1647 2794 4837 5348 3247 -390 -3974 -5689 -4169 -1418 2981 5247 5545 2821 -593
2791e93k823k306J845K749L920K527n41k552l744k810p67N34L929M078J471k88
$$ -593 -3416 -5722 -3877 -1128 2792 5319 4778 2226 -1518 -4328 -5095 -4561 -632 3446 4917 4629
2807D629k831k885l085j213K304L642K792J351n2k560l827k849n0J925L419K742
$$ 4629 1798 -1087 -4172 -5385 -3081 561 3353 4704 4652 2092 -1735 -4584 -4634 -2709 710 3452
2823C452J061j00k493l572l244m44K410L204L904J134r05l330l742k378p2K081
$$ 3452 4513 4413 1920 -1652 -4896 -5340 -2930 274 4178 5312 4407 1077 -2665 -5043 -5115 -3034
2839c034L619L439Q95j187k942l385k591P47K322K756L259J307j570l193l528
$$ -3034 585 4024 4919 3732 790 -2595 -5186 -4439 -2117 639 3898 5205 3635 442 -3086
2854c086j447l35K632L431L184r7j007l074l278j453k42K823L178K509J181j702
$$ -3086 -4533 -4868 -2236 1195 4379 4282 3275 201 -3077 -4530 -4772 -1949 1229 3738 4919 3217
2870C217k522l781j976R87J905L974K450L64j777l140k676j620J177J672L861
$$ 3217 695 -3086 -5062 -4075 -2170 1804 4254 4618 2841 -299 -2975 -4595 -3418 -1746 2115
2885B115K668L97k483k884l008j299O47K520L574K491J6k170l544k115j319J295
$$ 2115 4783 5180 2697 -187 -3195 -4494 -3847 -1327 2247 4738 4754 2584 -960 -3075 -4394 -3099
2901c099K253K638K614j54k348l068k965m29J185K906L374J800m53k467k997k082
$$ -3099 -846 1792 4406 4252 1904 -1164 -4129 -4558 -3373 -467 2907 4707 4254 1787 -1210 -3292
2917c292j416J633K392L343J922p93k532k998j749p58J491K685K863K187j229
$$ -3292 -4708 -3075 -683 2660 4582 3789 1257 -1741 -3490 -4248 -2757 -72 2791 4978 3749
2932C749k048m010j735l76J528L246K786J693j454k057k981k650k75K364K689
$$ 3749 1701 -2309 -4044 -4420 -2892 354 3140 4833 3379 1322 -1659 -4309 -4584 -2220 469
2947D69K592J617r70l182k740j692m4J951L040J836J696j328k991k439k060M81
$$ 469 3061 4678 3708 526 -2214 -3906 -3950 -1999 1041 2877 4573 3245 254 -2185 -4245 -3764
2963c764J933K958K266J337j718l005j729k456J76J627K942K927O96j219k648
$$ -3764 -1831 1127 3393 4730 3012 7 -1722 -4178 -4002 -2375 567 3494 4190 2971 323
2978C23k800j044r4K062K894K315J22j266k789k584l61n8K511K421K064R46k277
$$ 323 -2477 -3521 -3615 -1553 1341 3656 3778 2512 -277 -2861 -3222 -3280 -769 1652 3716 4662 2385
2995B385k940k359j231J264K566J697K302M69k250k207k263j367J129J906L266
$$ 2385 -555 -2914 -4145 -2881 -315 1382 3684 4153 1903 -304 -2567 -3934 -2805 -899 2367
3010B367J560O2k110k581k524l45N23K395K656J592k16j505k883k080p10J083
$$ 2367 3927 3989 1879 -702 -3226 -3571 -3048 -653 2003 3595 3379 1874 -1009 -3089 -3799 -2716
3026b716L100K284J543k85j918l205j927o32R14K457K712J408J1k425k768k317
$$ -2716 384 2668 4211 3926 2008 -1197 -3124 -3756 -2842 -385 2327 3735 3746 1321 -1447 -3764
3042c764m96J846K318J597K202j306j457k507j219n54N58L188K330Q18l75k239
$$ -3764 -4260 -2414 -96 1501 3703 2397 940 -1567 -2786 -3340 -2782 406 2736 3554 3179 940
3058I40k558k009n7J779L083J768L75p8l136j797j386K63J266K412J920N08p85
$$ 940 -1618 -3627 -3684 -1905 1178 2946 3321 3243 107 -1690 -3076 -2813 -1547 865 2785 3293 2508
3075B508k147l033j077O66J306K478J902O49n87k104k600j614J333P29K647J690
$$ 2508 361 -2672 -3749 -3083 -1777 701 2603 3252 2665 561 -2039 -3653 -2320 -1591 1056 2746
3091B746P08j516j374k343j362K26J634K548J659O80j556k017j979j593L6K557
$$ 2746 3454 1938 564 -1779 -3141 -2915 -1281 1267 2926 3606 2050 33 -1946 -3539 -3503 -946
3107i46K043K404l27j413k123k119o48P41J648K335J025K37j056k185j786j343
$$ -946 1097 3501 3174 1761 -362 -2481 -3129 -2388 -740 1595 2620 2857 1801 -384 -2170 -3513
3123c513J010K443J789J089K97j788j571k243q35J334J575K092J050k92j343j963
$$ -3513 -2503 -60 1729 2818 3115 1327 -244 -2487 -3322 -1988 -413 1679 2729 2437 1094 -869
3139h69r52n72M81J507K136J292J2j754j812k510J18Q02K663K008O06n86j307
$$ -869 -1821 -2393 -1912 -405 1731 3023 3035 1281 -531 -3041 -2923 -2121 542 2550 3156 2570 1263
3156A263k446j465o46J416J703K430J231m33k128k513q62o16J480K069J821R53
$$ 1263 -1183 -2648 -3294 -1878 -175 2255 3486 3053 925 -1588 -2450 -3066 -1586 483 2304 3257
3172C257p31k168j775j403k18J555J625K044K49m70j483j957j559M11J784J882
$$ 3257 2526 358 -1417 -2820 -3038 -1483 142 2186 2435 1965 482 -1475 -3034 -2623 -839 1043
3188A043O20J480j203j391j938j386o6J609K242J683L56j139k357j505j067J90
$$ 1043 1663 3143 1940 549 -1389 -2775 -2841 -1232 1010 2693 3049 1910 -447 -1952 -3019 -2829
3204b829J835K252J378M83j034k684j514p75P89J058K279J817k73j356j715k232
$$ -2829 -994 1258 2636 3119 2085 -599 -2113 -2888 -2099 -1041 1238 3055 2782 1426 -289 -2521
3220b521l95J002P88K674J642k41q02k709j360o74J019Q74K442R87K51j637j572
$$ -2521 -2916 -1914 -1126 1548 3190 2949 2147 -562 -1922 -2596 -1577 -703 1739 2726 2977 1340 -232
3237b32j578j440J125J162K335K035n22k087j364j683n86J264J138K698K36k05
$$ -232 -1810 -3250 -2125 -963 1372 3407 2885 798 -566 -2249 -2835 -1571 -433 2265 2501 2296
3253B296j119k214j211j79R05J260J859M81j08j277j534j577N07K52J583J969
$$ 2296 1177 -1037 -2248 -2427 -1522 -262 1597 2078 1970 693 -841 -2418 -1911 -1659 -76 1893
3269A893P82r71o63j824j847j97J464J617J965J67j68j465k376n70j068J503K229
$$ 1893 2675 1704 1041 -783 -2630 -2827 -1363 254 2219 2386 2218 753 -1623 -2193 -3261 -1758 471
3286D71K387n41m47n52l006m82m88J389K075R91L42r9j581j781r91k68J792K178
$$ 471 2858 2317 1870 1318 -1688 -2170 -2658 -1269 806 1797 2139 2040 459 -1322 -2313 -2581 -789 1389
3304A389J81R07l44k290j077j130k17J253K252J111P96r18j782r74j974N72J487
$$ 1389 1570 2477 2133 -157 -1234 -2364 -2581 -1328 924 2035 2831 1913 131 -843 -2817 -2245 -758
3321g58J390J815L56j017k000j604p93P57J035J946J242j75q16j316j592l61j04
$$ -758 632 2447 2803 1786 -214 -1818 -2611 -1854 -819 1127 2369 2194 1378 62 -1530 -1891 -1995
3338a995R64K666N17l56r61j168j222j025K67J634J557J383k44j039j578j729
$$ -1995 -1031 1635 2152 1796 835 -333 -1555 -2580 -2313 -679 878 2261 2017 978 -600 -2329
3354b329m80M33K240J892n3N63j411j547j172m93J497M01J749R61j89k015q23
$$ -2329 -2809 -2376 -136 1756 1703 2266 855 -692 -1864 -2357 -860 -459 1290 2251 2062 47 -776
3371g76p12n19L9K044J185J025n40o22j873j281l70Q57J336J798O63l1k178o61
$$ -776 -1488 -2007 -1968 76 1261 2286 1746 1124 -749 -2030 -2400 -1543 -207 1591 2254 2223 45 -616
3389f16r27J2K98J500J479J81k43j648j260n87j09J209Q32J524O24n16j251j898
$$ -616 -1543 -1531 -1233 267 1746 1927 1684 36 -1224 -1811 -1920 -711 121 1645 2269 1753 502 -1396
3407a396k0l52J068Q55J840K95n00j516j368j296J70J595J174J663N67j132j391
$$ -1396 -1416 -1768 -700 155 1995 2290 1790 274 -1094 -2390 -2220 -625 549 2212 2779 1647 256
3424B56j797m02M12L82K493R58k91j146n76j670m65K07J172J255R96L47r89j368
$$ 256 -1541 -1943 -1531 -1149 1344 2302 2011 865 289 -1381 -1846 -1639 -467 788 1784 2131 1142 -226
3442b26r58j236P21J981R92J273j60j845j665j43r62M17R58K008P89M5o38j462
$$ -226 -1184 -2420 -1699 282 1274 2547 2387 542 -1123 -1266 -2228 -1811 -853 1155 1944 1989 1351 -111
3460a11j251m57L08R76J582R9K43l05j943l08o51O17P53J497N18L41j099j564
$$ -111 -1362 -1819 -1511 -535 1047 1146 1389 1084 -859 -1167 -1818 -1201 -448 1049 1567 1908 809 -755
3478g55j169K57M58J411R89P95l70q38j789r45MN36J185J286Q49o78r45j360j039
$$ -755 -1924 -1667 -1209 202 1191 1986 1616 778 -1011 -1956 -1952 -1416 -231 1055 1904 1226 281 -1079 -2118
3497b118k10J052J288J383K23K87k140o52q94L13O40J865O41M41n96j469j008
$$ -2118 -2328 -1276 12 1395 1618 1905 -235 -887 -1781 -1468 -828 1037 1678 2119 1523 54 -954
3514i54n40l35J209R65J402m2P7j598k064Q9O19Q63P69R99O15o79j226j273p74
$$ -954 -1494 -1829 -620 345 1747 1705 1782 184 -1880 -1791 -1172 -309 460 1459 2074 1395 169 -1104 -1878
3533a878Q42J37J679P17M80o09j370j206m54P4J592L32J195P9p42j597J18j196
$$ -1878 -1036 -899 780 1497 1977 1368 -2 -1208 -1662 -1588 4 336 1531 1610 868 -729 -611 -1807
3551a807K52J066J490O72K48j091o88j416j213J286P29J267J035L5j089j165j194
$$ -1807 -1555 -489 1001 1673 1921 830 142 -1274 -2487 -1201 -472 795 1830 1865 776 -389 -1583
3568a583k23N86P47J712N75p07l24j241q50o77P19J809Q20KJ32j310j262k50o42
$$ -1583 -1806 -1220 -473 1239 1814 1107 783 -458 -1308 -1985 -1266 543 1363 1365 1497 187 -1075 -1325 -1967
3587a967P87J702L93P12M54j725j059r84N42k03J563N53J114p93m52j660l45k79
$$ -1967 -1180 522 915 1627 2081 356 -703 -1687 -1145 -1348 215 768 1882 1089 637 -1023 -1368 -1647
3605a647J197J101O28J43k41n16j663p83k2Q51M30J789K32n36q93o69j212K0Q60
$$ -1647 -450 651 1279 1422 1181 665 -998 -1781 -1803 -952 -522 1267 1499 963 70 -599 -1811 -1791 -931
3624i31J028J198n1o51n80q23n10m62J358P65J506m39j004q75p91r4mQ27J193
$$ -931 97 1295 1244 593 13 -810 -1320 -1782 -424 341 1847 1408 404 -471 -1262 -1356 -1360 -533 660
3643F60J260O5j529l54j048o74P45L17P52P60J44J79j613m76m18J7O62J364P95
$$ 660 1920 1985 456 102 -946 -1620 -875 -558 194 954 1098 1277 -336 -812 -1230 -1213 -551 813 1608
3662A608m60n31o95o33q34O10R97Q90J57N62j027j430m87JM44K4J914J211q46
$$ 1608 1148 617 -78 -711 -1545 -935 62 952 1109 1671 644 -786 -1273 -1272 -828 -804 1110 2321 1475
3681A475o24j999J62n26P2J354J537K96o40p48j054j099J71Q13J197L84R93n72
$$ 1475 851 -1148 -986 -1512 -1440 -86 1451 1747 1107 359 -695 -1794 -1623 -810 387 771 1764 1192
3699A192j362o04j046R50L41O70J072pl88jj470j640P40P43Q31J190K83n61l78
$$ 1192 -170 -774 -1820 -870 -529 141 1213 1206 818 817 -653 -2293 -1553 -810 21 1211 1494 933 555
3718E55j897j40K77Q77O50P78J88j43p24j336J65m05O26O16R64K77l68j008o95
$$ 555 -1342 -1482 -1205 -328 322 1100 1288 1145 421 -915 -750 -1155 -529 87 1051 1328 960 -48 -743
3737g43o62k13P92R17Q33R22j008o83j029m32j05O74J279O34M03j202l89p05p67
$$ -743 -1405 -1618 -826 91 924 1846 838 155 -874 -1306 -1411 -737 542 1176 1579 377 -12 -717 -1484
3756a484L79K23J533L14Q20j186r99O7q73k05O57J615O63j64j32j705n44l43M46
$$ -1484 -1105 -882 651 965 1785 599 -400 -333 -1206 -1411 -754 861 1524 1360 1228 -477 -1021 -1364 -918
3775i18P73N85P05P27r73j266o81r19Q33J001jJ624j006N91j299m52o32k26J583
$$ -918 -145 440 1145 1872 899 -367 -1048 -1967 -1134 -133 -134 1490 484 1075 -224 -676 -1308 -1534 49
3794D9J201N6k24r4j202m31n13l34J652R94K86j92m12j541l50m15J128J128j9
$$ 49 1250 1306 1082 988 -214 -645 -1158 -1492 160 1154 1440 1248 836 -705 -1055 -1470 -342 786 767
3813G67L22K47o33j202o61k1L26J184J089l55J92j038q64m55k08Q25Q05Q09l91
$$ 767 1089 1336 703 -499 -1160 -1181 -855 329 1418 1063 1255 217 -647 -1102 -1310 -485 320 1129 738
3832G38P47j418k82n94j098J618M02R54J5o07l38q60p0n13M81J252J66Q97o33
$$ 738 1485 67 -215 -809 -1907 -289 113 1067 1082 475 137 -723 -793 -1306 -825 427 593 1490 857
3851H57j51j831o32Q21N59J347L10n4k97j061r22L92L90k68J251L58M84l70j202
$$ 857 706 -1125 -1757 -936 -377 970 1280 1226 929 -132 -1054 -662 -272 -540 711 1069 1553 1183 -19
3870a9j203n0K57N15J147n0k0n64j66r17p48P96O51J435P14k95q66p30m17o14
$$ -19 -1222 -1272 -1015 -500 647 597 577 13 -153 -1070 -1818 -1022 -371 1064 1778 1483 617 -113 -530 -1144
3890a144K59J206L87Q58p23j163l55m90J74J15N43J321q6N02r70o83l00o85k33
$$ -1144 -885 321 708 1566 843 -320 -675 -1165 -991 -876 -333 988 902 1404 434 -249 -549 -1234 -1467
3909a467J499O42N56k00k44j408o33j8J006M70L10N30K14p44p37o86n12R82M51
$$ -1467 32 674 1230 1030 786 -622 -1255 -1273 -267 203 513 1043 1257 513 -224 -910 -1422 -440 11
3928A1J138j40K52p14j177J62p16k03J987L25R92j131o79n82q70K42K40J195M25
$$ 11 1149 1009 1261 547 -630 -468 -1184 -1387 600 925 1917 786 107 -475 -1345 -1103 -863 332 757
3947G57K5Q0p25j161L2n84R55J000O60l48J96j260n21j87K2J92J276P18J82o32
$$ 757 782 862 137 -1024 -992 -1576 -621 379 1039 691 887 -373 -894 -1081 -1059 -867 409 1127 1309 677
3967F77j328M62k90l31O29M3N39O29j62j176k07n43K1R67M80R03o50p9q64r7j195
$$ 677 -651 -189 -479 -810 -181 -138 401 1030 868 -308 -515 -1058 -1037 -70 410 1313 663 584 -280 -377 -1572
3988a572L13P27M55J099l85K69r68j544P94Q4K47Q24K43K81n29k60o51j441J754
$$ -1572 -1259 -532 -77 1022 637 906 -62 -1606 -812 -728 -481 343 586 867 338 78 -573 -2014 -260
4007b60P6L34R28n93R3n95j095RO45K94R43Q20l55j412r40j11M61K75J43J198
$$ -260 -184 150 1078 485 578 -17 -1112 -1103 -458 -164 779 1599 1244 -168 -1108 -1219 -758 -483 -340 858
4027H58N14n27l77p68l48j115Q77M98Q24R3J95o77m86J37o18J22R67R80j31O3
$$ 858 1372 845 468 -300 -648 -1763 -886 -388 436 529 724 47 -439 -302 -920 -798 169 1149 1018 1081
$$ [...]
8191c73
##END NTUPLES=NMR FID
##END=
