##TITLE=1H_SR158H3HCl
 D2O
 8 sc, 
 11.4.2023
##JCAMPDX= 6.0         $$ Bruker NMR JCAMP-DX V2.0
##DATA TYPE= NMR FID
##DATA CLASS= NTUPLES
##ORIGIN= UXNMR, Bruker Analytische Messtechnik GmbH
##OWNER= root
$$ XWIN-NMR		Version 3.5
$$ Tue Apr 11 16:05:41 2023 Russian Standard Time (UT+4h)  she@DPX200
##.OBSERVE FREQUENCY= 200.13135
##.OBSERVE NUCLEUS= ^1H
##.DELAY= (6, 6)
##.ACQUISITION MODE= SIMULTANEOUS
##.ACQUISITION SCHEME= undefined
##.AVERAGES= 8
##.DIGITISER RES= 18
##SPECTROMETER/DATA SYSTEM= spect
##.PULSE SEQUENCE= zg30
##.SOLVENT NAME= D2O
##.SHIFT REFERENCE= (INTERNAL, D2O, 0, 15.7039)
##AUDIT TRAIL= $$ (NUMBER, WHEN, WHO, WHERE, WHAT)
$$ ##TITLE= Audit trail, XWIN-NMR		Version 3.5
$$ ##JCAMPDX= 5.01
$$ ##ORIGIN= Bruker BioSpin GmbH
$$ ##OWNER= she
$$ F:/spectra/data/she/nmr/H-F/1/audita.txt
$$ ##AUDIT TRAIL=  $$ (NUMBER, WHEN, WHO, WHERE, WHAT)
(   1,<2023-04-11 16:04:38.98 +0400>,<she>,<DPX200>,
      <created by zg, POWCHK disabled, PULCHK disabled
       configuration hash MD5:
       00 E9 B6 7A A2 85 ED C7 34 08 36 98 17 FE 4E 26
       data hash MD5: 16K
       A5 90 B9 4A EE C8 B6 3D A7 1D 4E 3E CA 7E 89 E0>)
$$ ##END=
$$ 
$$ hash MD5
$$ 42 8F 53 11 61 0E 0F A6 CD 60 71 07 2D 22 3D 50
##$RELAX= 
##$RELAX= 
##$RELAX= 
##$RELAX= 
##$RELAX= 
##$RELAX= 
$$ Bruker specific parameters
$$ --------------------------
##$DU= <F:/spectra>
##$EXPNO= 1
##$NAME= <H-F>
##$PROCNO= 1
##$TYPE= <nmr>
##$USER= <she>
##$AMP= (0..31)
100 100 100 100 100 100 100 100 100 100 100 100 100 100 100 100 100 100 
100 100 100 100 100 100 100 100 100 100 100 100 100 100 
##$AQSEQ= 0
##$AQ_mod= 1
##$AUNM= <au_zg>
##$AUTOPOS= <>
##$BF1= 200.13
##$BF2= 200.13
##$BF3= 200.13
##$BF4= 200.13
##$BF5= 200.13
##$BF6= 200.13
##$BF7= 200.13
##$BF8= 200.13
##$BYTORDA= 1
##$CFDGTYP= 0
##$CFRGTYP= 5
##$CHEMSTR= <none>
##$CNST= (0..31)
1 1 145 1 1 1 1 1 1 1 1 1 1 1 1 1 1 1 1 1 1 1 1 1 1 1 1 1 1 1 1 1 
##$CPDPRG= <>
##$CPDPRG1= <>
##$CPDPRG2= <>
##$CPDPRG3= <>
##$CPDPRG4= <mlev>
##$CPDPRG5= <mlev>
##$CPDPRG6= <mlev>
##$CPDPRG7= <mlev>
##$CPDPRG8= <mlev>
##$CPDPRGB= <>
##$CPDPRGT= <>
##$D= (0..31)
0 1.2 0 0 0 0 0 0 0 0.06 0 0.03 0 0 0 0 0.0002 0 0 0 0 0 0 0 0 0 0 0 0 
0 0 0 
##$DATE= 1681214678
##$DBL= (0..7)
120 120 120 120 120 120 120 120 
##$DBP= (0..7)
150 150 150 150 150 150 150 150 
##$DBP07= 0
##$DBPNAM0= <>
##$DBPNAM1= <>
##$DBPNAM2= <>
##$DBPNAM3= <>
##$DBPNAM4= <>
##$DBPNAM5= <>
##$DBPNAM6= <>
##$DBPNAM7= <>
##$DBPOAL= (0..7)
0.5 0.5 0.5 0.5 0.5 0.5 0.5 0.5 
##$DBPOFFS= (0..7)
0 0 0 0 0 0 0 0 
##$DE= 6
##$DECBNUC= <off>
##$DECIM= 32
##$DECNUC= <off>
##$DECSTAT= 4
##$DIGMOD= 1
##$DIGTYP= 9
##$DL= (0..7)
0 120 120 120 120 120 120 120 
##$DP= (0..7)
150 150 150 150 150 150 150 150 
##$DP07= 0
##$DPNAME0= <>
##$DPNAME1= <>
##$DPNAME2= <>
##$DPNAME3= <>
##$DPNAME4= <>
##$DPNAME5= <>
##$DPNAME6= <>
##$DPNAME7= <>
##$DPOAL= (0..7)
0.5 0.5 0.5 0.5 0.5 0.5 0.5 0.5 
##$DPOFFS= (0..7)
0 0 0 0 0 0 0 0 
##$DQDMODE= 0
##$DR= 18
##$DS= 0
##$DSLIST= <SSSSSSSSSSSSSSS>
$$ [...]
##$SUBNAM2= <"">
##$SUBNAM3= <"">
##$SUBNAM4= <"">
##$SUBNAM5= <"">
##$SUBNAM6= <"">
##$SUBNAM7= <"">
##$SUBNAM8= <"">
##$SUBNAM9= <"">
##$SW= 18.05172834244
##$SWIBOX= (0..15)
0 0 2 0 0 0 0 0 0 0 0 0 0 0 0 0 
##$SW_h= 3612.71676300578
##$TD= 16384
##$TD0= 1
##$TE= 0
##$TE2= 300
##$TE3= 300
##$TEG= 300
##$TL= (0..7)
0 120 120 120 120 120 120 120 
##$TP= (0..7)
150 150 150 150 150 150 150 150 
##$TP07= 0
##$TPNAME0= <>
##$TPNAME1= <>
##$TPNAME2= <>
##$TPNAME3= <>
##$TPNAME4= <>
##$TPNAME5= <>
##$TPNAME6= <>
##$TPNAME7= <>
##$TPOAL= (0..7)
0.5 0.5 0.5 0.5 0.5 0.5 0.5 0.5 
##$TPOFFS= (0..7)
0 0 0 0 0 0 0 0 
##$TUNHIN= 0
##$TUNHOUT= 0
##$TUNXOUT= 0
##$USERA1= <user>
##$USERA2= <user>
##$USERA3= <user>
##$USERA4= <user>
##$USERA5= <user>
##$V9= 5
##$VALIST= <valist>
##$VCLIST= <CCCCCCCCCCCCCCC>
##$VD= 0
##$VDLIST= <DDDDDDDDDDDDDDD>
##$VPLIST= <PPPPPPPPPPPPPPP>
##$VTLIST= <TTTTTTTTTTTTTTT>
##$WBST= 1024
##$WBSW= 4
##$XGAIN= (0..3)
0 0 0 0 
##$XL= 0
##$YL= 0
##$YMAX_a= 115047
##$YMIN_a= -166525
##$ZGOPTNS= <>
##$ZL1= 120
##$ZL2= 120
##$ZL3= 120
##$ZL4= 120
##$ABSF1= 10
##$ABSF2= 0
##$ABSG= 5
##$ABSL= 3
##$ALPHA= 0
##$AQORDER= 0
##$ASSFAC= 0
##$ASSFACI= 0
##$ASSFACX= 0
##$ASSWID= 0
##$AUNMP= <proc_1d>
##$AZFE= 0.1
##$AZFW= 0.1
##$BCFW= 1
##$BC_mod= 2
##$BYTORDP= 1
##$COROFFS= 0
##$CY= 11.3945322036743
##$DATMOD= 1
##$DC= 2
##$DFILT= <>
##$DTYPP= 0
##$F1P= 2.36226072786647
##$F2P= -0.459571619588291
##$FCOR= 0.5
##$FTSIZE= 0
##$FT_mod= 4
##$GAMMA= 1
##$GB= 0.15
##$INTBC= 1
##$INTSCL= 1
##$ISEN= 128
##$LB= 0.24
##$LEV0= 0
##$LPBIN= 0
##$MAXI= 10000
##$MC2= 0
##$MEAN= 0
##$ME_mod= 0
##$MI= 1.114404
##$NCOEF= 0
##$NC_proc= 0
##$NLEV= 6
##$NOISF1= 3.799351
##$NOISF2= 2.8
##$NSP= 1
##$NTH_PI= 0
##$NZP= 0
##$OFFSET= 15.70392
##$PC= 1
##$PHC0= -19473.36
##$PHC1= 6.0008
##$PH_mod= 1
##$PKNL= yes
##$PPARMOD= 0
##$PSCAL= 0
##$PSIGN= 0
##$REVERSE= no
##$SF= 200.130013532006
##$SI= 16384
##$SIGF1= 3
##$SIGF2= 2
##$SINO= 400
##$SIOLD= 16384
##$SREGLST= <1H.CDCl3>
##$SSB= 0
##$STSI= 0
##$STSR= 0
##$SW_p= 3612.71676300578
##$SYMM= 0
##$S_DEV= 0
##$TDeff= 0
##$TDoff= 0
##$TI= <>
##$TILT= no
##$TM1= 0
##$TM2= 0
##$TOPLEV= 0
##$USERP1= <user>
##$USERP2= <user>
##$USERP3= <user>
##$USERP4= <user>
##$USERP5= <user>
##$WDW= 1
##$XDIM= 8192
##$YMAX_p= 0
##$YMIN_p= 0
$$ End of Bruker specific parameters
$$ ---------------------------------
##NTUPLES= NMR FID
##VAR_NAME=  TIME,          FID/REAL,        FID/IMAG
##SYMBOL=    X,             R,               I
##VAR_TYPE=  INDEPENDENT,   DEPENDENT,       DEPENDENT
##VAR_FORM=  AFFN,          ASDF,            ASDF
##VAR_DIM=   8192,          8192,            8192
##UNITS=     SECONDS,       ARBITRARY UNITS, ARBITRARY UNITS
##FACTOR=    0.0002768,     1,               1
##FIRST=     0,             0,               0
##LAST=      2.2672688,     0,               0
##MIN=       0,             -166525,         0
##MAX=       2.2672688,     115047,          0
$$ Real data points
##PAGE= N=1
##DATA TABLE= (X++(R..R)), XYDATA
$$ [...]
1863a693M79P32J190Q88J72p91o54j691j00J32Q10J157R88k30n31j099q38o01
1881a680L46J005J288O61l8q26j017q48m86J92J091J218O38j52p09r43j058m38
1899a756P64J027P92P14o3p18j286p77m33O31J068Q21P46k25m61j230j060l46
1917a792Q25J120R00M47k18n74j083p82l05K99J029J047O08p4p11j406o88k47
1935a605O41R54R32O46m16n83j195p02j5O00R21Q46O00n93o25j066o45j18N78
1954h45J076Q69K48k95p21j066n93J88L52Q93R67N13m99o14j040j117J70P24J063
1973B73P64L41k05j304m36n93k28N51J124Q27K64q5j019j169k89m00J009J004
1991D29P14L6j83q51j068l84QQ04Q32R45L31q64o38r81m57K23O94Q26R00p0m80
$$ plain form
1863 -1693 -1214 -482 708 1596 1768 977 323 -1368 -1468 -1336 -526 631 1619 1389 858 -241 -1079 -1680
1881 -1680 -1334 -329 959 1620 1582 756 -261 -1109 -1595 -1403 -312 906 1544 1392 683 -260 -1318 -1756
1899 -1756 -992 35 827 1541 1478 760 -526 -1303 -1736 -1105 -37 784 1530 1305 844 -386 -1446 -1792
1917 -1792 -967 153 1053 1500 1282 708 -375 -1157 -1462 -1163 -134 913 1521 1447 736 -670 -1358 -1605
1935 -1605 -964 -10 922 1568 1152 569 -626 -1328 -1343 -743 178 1024 1624 1031 406 -660 -1305 -1423 -845
1954 -845 231 1100 1348 1053 332 -734 -1327 -1139 -787 106 1073 1586 1087 473 -567 -1684 -1514 -790 273
1973 273 1037 1378 1173 -131 -567 -1160 -1388 -837 287 1114 1378 1293 274 -895 -1184 -1584 -575 429
1991 429 1143 1179 996 145 -923 -1307 -1299 -495 337 1282 1613 749 111 -870 -1327 -1104 -410 416 1316 1246 766
2012G66q71p42m08K14O63N62R66P8n06q65n08n49K37O65R68O67N7o18o53j104
2032i81j34K58M44J040L04J06l62j014n00k46J09P50O65O81J66o41j127m17k23
2051a122qQ18P73P18l7n59r39l64n90L78R95R40J5K35n32j177m68j81L56M77J025
2072G53M78k78l33q94q54P6M9R15Q53K70m7m01r84l13m66M75O21J004J81n6n77
2093D72p94p67j57O55Q16K54R52m24p44q02m20j0K20R10N88M51l93n96o76m62
2113i27j1P67L41O60J57k3p04n44n61m92P22O74O78L89k69n12o20n24j31K62R35
2134B67N38L23l14m98p93l45j6J18R91M33J28J73q32p87k99O9L03O86O55K46l67
2155F79m44p57p07M54M04Q03N01l7o9q59n41l96J30M54M62J132j36l62m61p06
$$ plain form
2012 766 -105 -847 -1255 -1041 -378 184 1150 1228 722 -143 -651 -1200 -963 -298 670 1337 1394 776 123 -981
2032 -981 -1115 -857 -413 627 931 1037 675 -339 -839 -1085 -976 -226 439 1120 1286 645 -482 -899 -1122
2051 -1122 -1130 -312 461 1179 1142 583 -356 -720 -1310 -932 63 1003 1018 1253 721 -456 -924 -1105 -749 -272 753
2072 753 1231 953 620 -274 -1128 -1052 -1003 -88 765 1035 988 587 -397 -710 -1176 -701 -80 924 1105 1049 472
2093 472 -322 -1089 -1246 -591 225 479 1431 1007 263 -539 -959 -969 -749 161 749 1200 807 211 -465 -927
2113 -927 -938 -171 170 830 987 964 260 -284 -845 -1337 -615 59 737 1126 857 345 -275 -799 -930 -668 267
2134 267 805 1128 814 316 -477 -822 -838 -720 271 704 832 1005 173 -614 -913 -844 -541 145 800 1046 679
2155 679 235 -522 -1229 -775 -371 432 933 896 827 -32 -573 -969 -839 -385 77 1209 1073 711 250 -456
2175d56n94J85M29Q16N61J3m02m81o82k26P4L72P57M79J91l20p64n06m78J67N32
2196c33N89N15J37l97n16q14l42M60P04K72L14K01k87o42m15k86m4Q05M81M11
2216H13P3l02p44o89j25K31N84P88K75j72k06p64m39l29J82N92P73L28j32m75
2236B62k89o47o2L31L06N97N11k07n43n1r36l01N81L91N09M89n6m91p06m50k29
2257i91L37N93O19L30p3r61j42m59K4J91N65O33R0j38l65m73k41m15M83J54M45
2278B06N73j70j92p87k52j71K51Q58K39J41N1m14p73l42n6Q20J39N71Q7k84k61
2299B34n01n27k19M55O66O18j1k73k37n76m94j5O53M56N64M0m46l28l23j64l65
2320g93R1R01K54L54l71m90l33k99Q1L31M65L32J66j32n27l67l63J0L32P44M2
$$ plain form
2175 -456 -1050 -865 -436 380 941 954 552 71 -611 -837 -763 -391 366 845 1036 716 -48 -554 -1032 -865 -333
2196 -333 256 771 908 511 -5 -819 -1161 -701 3 275 589 790 503 -139 -554 -840 -884 -79 402 813
2216 813 886 584 -160 -849 -974 -743 -159 629 904 732 526 -238 -677 -1006 -824 -232 541 869 737 262
2236 262 -27 -674 -736 -405 -99 498 1009 802 259 208 -728 -1029 -448 -57 452 941 885 394 -312 -762 -991
2257 -991 -654 -61 558 888 815 -146 -288 -747 -723 -532 33 666 756 618 253 -220 -461 -876 -393 -239 206
2278 206 779 609 417 -370 -622 -793 -542 316 555 696 747 333 -440 -782 -838 -18 121 692 779 495 234
2299 234 -267 -794 -1013 -558 108 726 715 442 205 -371 -865 -880 -227 229 793 833 387 59 -264 -428 -793
2320 -793 -702 199 453 807 436 -54 -387 -686 -605 -274 191 523 689 557 30 -337 -700 -690 -358 386 428
2341D28L77j56p09l00m85L84J4P32K77j60L7m68l41m09J66M35N14L85M0k19p08
2362a66k57m05J29N17M16O14k35J4p72n76K16j51O11L17K53K23m38k10o90j81
2382g71K13N11K77K00J46l40l90m57M3J43K37O74K20j80k48n09k12l45P8N12N54
2403C56K71k6m62l88j84q9j45O41M80L32k95l84j92n81m5L10P61l0K06J07m86
2424A57n24l06J29QM05L57M0J24p8q88m3o7K22M22L98R8j11k66k89l04k00N32
2446a84R0M65L13J32n26n37n23K02J37M42N56j73M4k17l58l91M9K63J61O08l3
2467E20K6l00l51n53j29O54K71M19J14j5p29k28k13j12L96K22N83m04n8j71n55
2488f13j2J68J20M66K96j1J02k80n59l39J89J96M61K26K35m69j36m45p8o7L01
$$ plain form
2341 428 805 649 -60 -360 -845 -461 -447 285 562 402 439 -29 -370 -779 -613 -178 336 721 761 542 -166
2362 -166 -423 -828 -699 -182 234 848 613 627 -145 -721 -505 -656 -45 272 525 748 310 100 -590 -771
2382 -771 -558 -47 230 430 576 236 -154 -611 -568 -425 -188 486 706 526 278 -231 -443 -788 -710 -198 356
2403 356 627 601 139 -249 -433 -522 -667 -26 454 786 491 107 -85 -666 -711 -401 360 330 536 643 157
2424 157 -367 -673 -544 -536 -131 226 266 390 312 -576 -619 -686 -464 -42 356 454 343 77 -212 -516 -716 -184
2446 -184 -94 371 684 816 290 -247 -770 -568 -431 11 567 394 438 221 -137 -528 -479 -216 -55 553 520
2467 520 546 246 -105 -658 -787 -133 138 557 671 656 -73 -301 -514 -626 -230 -8 575 171 113 -58 -613
2488 -613 -625 -457 -337 129 425 414 516 236 -323 -662 -473 -277 184 410 645 176 40 -405 -483 -550 -249
2509b49N71J27L80n30l96m23p2Q6N10K57J66K29l11l73j66l68k5O76L81j32J45
2530D83l88M1m40l43J15M97K70J73R6j97m52k15m09K67K55M91J30K08j52p53o
2551c29r6P3L78K36J5J35r2m50l63OL3L72K59L08l3k14n69j18J30j79M34M56J87
2574E79j66l67j01l45O2j84L33L62K81p5l02j4o04n1K80M49M68m1j03l88k3l89
2596c39j63L71p2O02k8j10l04j93q6r8K31J00J59M08q3k36l78o0j57L95L49J34
2618D42Jj40l85j29j23j9K42J48J11Q1J30k27n26LLJ44K14K84M44m37k43j78k25
2641c85l52O92K34P9K28k01l9l41k30j53M62J83L83j24k24k27k64k06J06L01J99
2662A21K86Q7j85j68m54M0r8M59L9J84j4p2k48j77k19J85J53L00mK29J6n40j84
$$ plain form
2509 -249 322 449 829 299 -97 -520 -592 -506 4 261 427 656 345 -28 -194 -562 -587 89 470 338 483
2530 483 95 136 -304 -647 -532 -35 235 408 504 307 -145 -360 -769 -502 -247 244 374 582 430 -323 -329
2551 -329 -425 -352 26 262 277 412 320 -130 -493 -487 -454 -82 177 485 452 238 -331 -449 -319 -498 -64 392 579
2574 579 413 46 -55 -400 -338 -522 -189 173 454 379 77 63 -541 -592 -312 137 605 564 461 73 50 -339
2596 -339 -502 -131 -203 399 371 261 -43 -236 -322 -420 -189 -89 70 478 395 159 -219 -279 -436 -41 308 442
2618 442 443 303 -82 -211 -334 -353 -111 37 148 229 359 132 -394 -391 -388 -244 -30 254 698 261 18 -160 -385
2641 -385 -737 -45 189 268 496 295 256 -85 -315 -468 -6 177 560 436 212 -15 -279 -485 -379 -78 121
2662 121 407 494 309 141 -313 -273 -371 88 127 311 297 225 -23 -200 -419 -234 -81 219 215 444 460 -80 -264
2685b64r6J37K70J37O4J55k34j70l40J05q3K38M50q2m8j33m17J97k06j6K56J84
2707A04K33l8j6n40j78N5m6R5P35k0J6k74j07l32j18R4K86K96J47o7r2m27l97
2730e91J00N9L84K12J75j0j98l26J40m33J30M15n1J43J78j36j34j97l57J33N97
2751B33j88L33r2o5l54k05R0M0J57J64K06rk79k30k31p7L26K73J80M9j00j8k97
2774i4k85K60k26N37%J29J00n61P2l89N7L73J32Q3Q1N7k47j43k14O4L19j56L34
2797B83J2lj0n67j98J22K50K02J2M39k43j16l83r8k21J66M07L55J34l61k84m03
2819e05K31o9K96L93k45J62J5m39K7j69m7M10j34L66L6j91j45r4n6k07K60J18
2841A3J7L72j3m64j15n1J80J90r2K61p6k93mk92m0J71K29K16rj5J9m09J38l89
$$ plain form
2685 -264 -360 -223 47 184 248 403 169 -1 -341 -236 -319 -81 369 287 239 106 -311 -114 -320 -336 -80 104
2707 104 337 299 283 -257 -435 -380 -426 -331 404 384 400 126 19 -313 -431 -337 -51 245 392 325 233 -194 -591
2730 -591 -491 -432 -48 164 339 329 131 -195 -55 -488 -358 57 6 149 327 191 57 -140 -497 -364 233
2751 233 45 378 286 221 -133 -338 -248 -208 -51 113 319 310 31 -199 -430 -507 -181 92 272 321 221 203 -94
2774 -94 -379 -119 -345 192 192 321 421 -140 -68 -457 -400 -27 105 188 269 326 79 -64 -278 -214 105 -51 283
2797 283 295 292 282 -285 -483 -361 -111 91 103 542 299 183 -200 -298 -519 -353 54 409 543 182 -102 -505
2819 -505 -274 -343 -47 346 101 263 278 -161 -134 -303 -350 60 -74 292 328 137 -8 -102 -158 -365 -105 13
2841 13 30 402 389 -75 -190 -241 -61 129 37 298 222 -71 -75 -367 -407 -236 -7 209 200 185 204 -205 -67 -456
2865d56M13l9K30J26j58N2l37M1q1r9K53k3L78J44k45l16%j59J96J49L2J66l2
2888B35P3m54k01K16N8n8J69M65l56O2j51k42l0J95q3L58J47l52J82k66k61N5
2910b39J69J65l5L20m3m64Rk74J41L9L43r7K49p3J22n45p3K2q2J38M30q3j10L5
2934F4p0l57J74P8K46oR5q8n3k30M9L6j2o7J93J99o6k13m6L7j17J40k9O6Q5J31
2960B39m32K79m24K98J13k04L14J38j68j8j02k36j11m0N75J55l56Nj20j3j24p3
2982c05J66L02j57K46l72R7j15l6J93k16L13J09K9L7k49k95o6J4J53J60K71l1
3004B48J1l90j60k0K93J90Mr9N3Mk41m9j20l7L50NM8J36O9l67k19K63l07K62J
3029g2K91j78K45m29O8k19mJ99P6K94j55O9k77Jn45K97K89L83q5j74pp8l01K32
$$ plain form
2865 -456 -43 -82 148 274 116 168 -169 -128 -209 -308 -55 -78 300 444 199 -117 -117 -276 -80 69 101 267 235
2888 235 308 -146 -347 -131 -73 -131 38 503 147 209 58 -184 -214 -19 -102 256 403 51 233 -33 -294 -239
2910 -239 -70 95 60 380 337 -127 -118 -392 -251 -212 131 34 283 210 332 -213 -286 -264 -346 -208 222 139 29 64
2934 64 -6 -363 -189 -111 135 129 224 136 83 -147 -98 -62 -74 -141 52 251 185 -28 -74 -37 -154 -14 -43 23 108 239
2960 239 -193 86 -338 -40 73 -131 183 321 153 135 33 -203 -314 -354 221 376 20 25 -95 -108 -232 -305
2982 -305 -139 163 6 252 -120 -23 -138 -174 19 -197 116 225 254 291 42 -253 -319 -305 -152 8 279 248
3004 248 259 -131 -291 -311 -18 172 176 77 130 134 -107 -156 -276 -313 37 42 90 226 295 -72 -291 -28 -335 -73 -72
3029 -72 219 41 286 -143 -75 -294 -298 -99 -23 271 116 185 -92 -91 -636 -339 -50 333 248 74 67 -11 -312 -80
3053h0J95k72K77j42P8L0j84j83j08L18j54M72jj23l8k87q1QK47J43j48N6K76
3076B99P9l95p5j78O8J59j6P0J53j92lM6k84K58J9N4J57R6l02K08l61n8m5J65
3100g8J90N7K0l07J81k54J4o4J14K56k06Q5R7j86j44o4K60l41M31K50l35K6L5
3123C7m18K24J41M5J41o4K17l75j43J2l9Q9l8J53K79j53k68n8L0k4J42K25j91
3146c6L12k05k24P3k4q6J77j7j13L78j46k56J52o8k93N71j55k35J83K04l48J53
3168cj55J51qo5Q8K61j95k65N7j79J82J4J39J60j22J59J6k08k65K14m6K16j38
3191HJ87k30J8M5q7k75M71l4J60k8k34o3j28R1j72N11l72L41n9q3l51L49j61q2
3215a78m8L79pM2P2j41k23J36j66M6J47O8K2p8j27o1J59j14L2K86l6K6k69R6n19
$$ plain form
3053 -80 115 -157 120 -22 56 86 -98 -281 -389 -71 -225 247 246 123 85 -202 -283 -275 -28 115 -33 23 299
3076 299 378 -17 -92 -270 -202 -43 -59 11 164 -28 -31 15 -269 -11 8 62 219 315 13 221 -140 -198 -243 -78
3100 -78 112 169 189 -118 63 -191 -177 -241 -127 129 -77 8 105 -81 -225 -289 -29 -370 61 311 -24 2 37
3123 37 -381 -157 -16 29 170 106 323 -52 -195 -183 -222 -133 -171 -18 261 108 -160 -218 -188 -212 -70 155 -36
3146 -36 276 71 -153 -80 -104 -190 -13 -30 -143 235 89 -167 -15 -83 -376 195 40 -195 -12 192 -156 -3
3168 -3 -158 -7 -15 -80 8 269 74 -191 -134 -313 -131 -117 22 182 60 219 235 27 -238 -24 -70 146 8
3191 8 195 -35 -17 28 -59 -334 137 103 263 235 1 -62 -190 -99 -271 240 -132 209 150 67 -284 65 -96 -178
3215 -178 -226 153 146 188 260 119 -104 32 -134 -88 59 127 149 71 -56 -117 42 -72 -40 246 210 236 -33 63 -456
3240d56K54K67o3j04N1q0j43L26J9j19j2q8M4K42J39k49j20N3k77L53r8M00j60
3263A79P3k27k40K35k89N9J36K23N3Nk62j81K02J35l26L29n1j05K08N6k30j1k88
3286c17K26RJ38M9J17r8j71nj77J21O0J54%j04M3j48j28O9K2L01J34m1k32J59
3310A81j87j21n4nK22j55J79l6M7K52k62k60J54k7j9K00l8Nj45j35j09J64J10
3333c9K40j99r7K76r2j20k22K06K86q1q2O3k31nq6J21J15p0mK75j4l84M7P0L2
3358Em03L24Q4p2J41k6j11j08p6J37R9K26p9J2k06J43k68O1J18Nk07K16L9Rk24
3383a61j91K87J04OrmJ88pl57K54l23L7M2K92j80O4j07k41K95j36J21K22l67J01
3407g0J28j55PJ47j53M27j80O7m4q7j59q0K09m6l7J38J97k09j90O2j3r8J11pj35
$$ plain form
3240 -456 -202 65 2 -102 -51 -131 -274 52 71 -48 -60 -148 -104 138 277 28 -92 -39 -316 37 -61 339 179
3263 179 252 25 -215 20 -269 -210 -74 149 202 207 -55 -236 -34 101 -225 104 53 -52 156 212 -18 -29 -317
3286 -317 -91 -82 56 105 222 124 -47 -52 -229 -108 -48 106 106 2 45 -103 -231 -162 -140 161 295 254 22 181
3310 181 -6 -127 -181 -186 36 -119 60 24 71 323 61 -199 -45 -72 -91 109 71 76 -69 -204 -313 -149 -39
3333 -39 201 2 -95 181 89 -31 -253 -47 239 158 76 139 -92 -97 -183 -62 53 -17 -21 254 240 -144 -97 -27 5
3358 5 -398 -74 10 -62 79 53 -58 -166 -242 -105 -6 220 141 153 -53 90 -178 -117 1 6 -201 15 54 63 -161
3383 -161 -352 -65 39 45 36 32 220 213 -144 110 -213 -176 -134 158 -22 42 -65 -306 -11 -147 -26 196 -171 -70
3407 -70 58 -97 -90 57 -96 331 151 218 174 87 -72 -152 57 11 -26 112 309 100 -90 -28 -41 -139 -28 -35 -170
3432a70N64m25K22l03j35N5O0NK74J17j67j48j20J21j56K46r5J23lK39j92k55
3454a43J7K50j73j44L60k12J4P6o9k40K33l51K63J04L59m03j14R0J34k03K30j5
3476F3j43J51Rk95K17j85p2J07k01O56Pl38P8j59j78L04j07J46k9k4P2l4j75l2
3500a62J68qM2J35m5j23J41j83k18K16j31M0J74P5mk7k34KR7n3M4L14k65J8J14
3525A27p1k50K28p8j01K75J19n9l17N7l0k26K57L2J03J3K75k89k08q9J73J33J6
3548I0J1k3M0r2p3M2k71J44J43K57k51M3q6j43k1r5K06m7M68l13K0j89k4J97j29
3573i6K34r0p0p6Q9K2J84k32J36r5N5O2j71n8l0M3O5l53L76l1l4LM0J22m22M86
3599A59J0l76L03p7k4K52k38O5k09K62k84L8j15M86k44M4r7LPP4j33J80j19o2
$$ plain form
3432 -170 394 -31 191 -112 -247 -192 -132 -127 147 264 97 -51 -171 -50 -206 40 -55 68 65 304 112 -143
3454 -143 -126 124 -49 -193 167 -45 -31 45 -24 -264 -31 -382 -119 -15 344 -59 -173 -83 51 -152 78 63
3476 63 -80 71 80 -215 2 -183 -255 -148 -349 307 314 -24 54 -105 -283 21 -86 60 31 7 79 45 -130 -162
3500 -162 6 -2 40 175 130 7 148 -35 -253 -37 -168 -128 46 121 117 90 -144 -142 -45 -98 -54 260 -5 13 127
3525 127 56 -194 34 -44 -145 130 249 190 -127 -70 -100 -326 -69 -37 66 79 354 65 -143 -232 -59 74 90
3548 90 101 78 118 26 -47 -5 -276 -132 11 268 17 60 -26 -169 -190 -285 -79 -126 342 29 49 -140 -164 33 -96
3573 -96 138 48 -22 -98 -9 13 197 -35 101 6 61 123 -48 -106 -136 -93 -28 -381 -5 -36 -70 -67 -27 95 -327 159
3599 159 169 -207 96 19 -5 247 9 74 -135 127 -157 -119 -234 252 8 52 -45 -42 -35 39 -94 86 -33 -95
3623i5oK4j75K02r0P4J42R2o2k09J77k19M10l28M6j11L1q0L06l13o3K17J0M4K43
3648B67k69j3l1O9J08l38J70J34ll35K54l4J1K13k60J27k69K4J18j03L95m58P1
3671a52R2j27M2L32M5j50q5j27J17q1K97M3k25J39j92J29j42o9K45j7k14J09P6
3694H5p9K3o9R7K2K00k78K09l88lL02k07J43jj42J93r8m3j1j24pJ77o9J38q0M7
3720C7n5J8l67M78l11J18J3K09j26J53k95j96L26j91J77M8J86q1K2o4j14j19p2
3743b06K25Lk2J00K7o5Ll58K28K52k40J49%oJ78J05o78L35J12l41K96L9J01k70
3767c3P6k36L22j55l8J14J86o7p4q5K25k14j95L52j39K54l79K33l45J77Q6j27
3789f2k3J20J55k15k8j12K2j08M04j57J17j0j1o3k13O9j1J19j6J56p4j19J55l39
$$ plain form
3623 -95 -101 -77 -252 -50 -140 -66 76 168 106 -103 74 -145 265 -63 -17 -128 -97 -177 129 -184 -247 -30 -20 24 267
3648 267 -2 -15 -46 23 131 -207 -37 97 94 -241 13 -21 -10 203 -57 70 -199 -175 -57 -160 235 -223 -152
3671 -152 -60 -187 -145 187 232 82 -3 -130 -13 -94 203 246 21 160 -32 97 -45 -114 131 114 -100 9 85
3694 85 6 29 -40 57 79 279 1 210 -178 -181 121 -86 57 56 -86 107 9 -34 -45 -169 -176 1 -68 70 -10 37
3720 37 -18 0 -367 111 -200 -82 -69 140 14 167 -128 -324 2 -189 -12 36 222 141 163 99 -15 -134 -206
3743 -206 19 22 0 100 127 62 65 -293 -65 187 -53 96 96 90 268 373 -305 30 142 -199 97 136 237 -33
3767 -33 43 -193 129 -26 -64 50 236 169 95 10 235 21 -174 178 39 293 -86 147 -198 -21 65 -62
3789 -62 -85 35 190 -25 -53 -165 -143 -251 153 -4 113 103 92 29 -184 -115 -126 -7 -23 133 59 -60 95 -244
3813b44J87j12K78p1%N7l35K32j12k9K52k20P0k0J87j09r0l5n6J85j57M48j59
3836A47l22L54j83J59k38L15l99J5K88j00k82K16J18r0J7j13K14Q2j11n4j52J72
3858E3m1j46K4K41N5m02O29n11j55P1K49l8m8K0J37k40M5Q4L3j02N3nK64l24n5
3883a09K44j16k72J41M2J01J75pj03n2j20M4m2K07r8j08K44m9J09k95O5R4l9j22
3907f6r7J83k7J60m7K3K0r7p0K2r5K02j12j61J47k57K90RL8k32O3J08l8p9R7j83
3933a99K01P4j35L1J27j91K76j49j43J13K22j70q8L1j35J09j78L29n7p8n9J32
3955F3q5J17k25J79j35oq7R6J1R3l6J44q3l4J09j86J57j07K50m37L96k75J4j4
3979h1K94k35O2k56K55L5j37J86j08o8K09j67L9j69M6J24o9pJ30j47n7K82j97
$$ plain form
3813 -244 -57 -169 109 38 38 95 -240 -8 -120 -149 103 -117 -47 -67 120 11 -79 -114 -170 15 -142 306 147
3836 147 -175 179 -4 155 -83 232 -167 -152 136 36 -246 -30 88 -2 15 -98 116 198 87 33 -119 53
3858 53 12 -134 -110 131 186 -216 413 -98 -253 -182 67 29 -19 1 138 -102 -57 27 60 -42 11 6 270 -54 -109
3883 -109 135 19 -253 -112 -70 31 206 199 96 44 -76 -32 -74 133 35 -73 171 122 231 -64 1 95 56 -66
3907 -66 -163 20 -7 153 106 129 149 52 -18 4 -91 111 -1 -162 -15 -272 18 27 65 -167 -104 4 -34 -113 -16 -199
3933 -199 2 76 -59 -28 99 -92 184 35 -108 5 227 57 -31 0 -135 -26 -204 125 68 -10 -69 63
3955 63 -22 95 -130 49 -86 -92 -179 -83 -72 21 -15 129 46 12 121 -65 92 -15 235 -202 194 -81 -67 -81
3979 -81 213 -22 40 -216 39 74 -63 123 15 -53 156 -11 28 -141 -95 29 -40 -47 83 -64 -121 161 -36
4002c6P3k68L82j00JO6l09J39P0P3j84K6q4M0M0M1J02j84J81j69J75k7Q0k78L69
4027B19l18n2L2J51J98k17J9L7m1j41n1M14k74l2r4R8M13l25J04K7k36R5j47M1
4051h0L20j62j32j35J04J22j72O5J39k08K00l39p3K96o8Q1j3J64l3j88K74j86
4073b4m1m6K46J25j73j41L14l25j40N9P3rl4K67r1N8o7k86K19J96j95j18j42J35
4097a40K75lk54P2M8P5pk22K46R4q2j15o3q2K79K18k14j72KN0q9K00l2k39N9M2
4123e4L5j94L54j91n8K35k02kK10J07m51J96K96n5n29N17j53Oj33k0K0J5Q8j63
4147a26Q2M8r5q8K95j46L8q3J59j62O9K38k38j22K0K64k83P7k4J77j60j81K48
4170GJ81l92J10J18j34PK37k2j59K2k88J97K19j41P3q3K40k22l4j0J29Jj03J17
$$ plain form
4002 -36 37 -231 151 51 52 118 -191 -52 18 91 -93 -67 -151 -111 -71 -30 72 -112 69 -100 75 48 128 -150 219
4027 219 -99 -151 -119 32 230 13 32 69 28 -113 -164 250 -24 -56 -150 -52 361 36 140 167 -69 26 -121 -80
4051 -80 240 78 -54 -189 -85 37 -135 -70 69 -139 61 -278 -351 -55 -123 -42 -55 109 76 -112 162 -24
4073 -24 -65 -111 135 260 87 -54 260 -65 -205 -146 -73 -82 -116 151 60 118 51 -235 -16 180 -15 -133 -275 -140
4097 -140 135 132 -122 -50 -2 73 66 -156 90 184 102 -13 -76 -158 121 339 125 -47 -45 5 -84 116 84 -155 -96 -54
4123 -54 -19 -213 141 -50 -108 127 -75 -77 133 240 -211 -15 281 226 -303 214 61 67 -66 -86 -66 -51 37 -126
4147 -126 -44 4 -91 -179 116 -30 8 -75 84 -78 -9 229 -9 -131 -111 153 -130 -53 -77 100 -60 -241 7
4170 7 188 -204 -94 24 -110 -103 134 112 -47 -25 -313 -116 103 -38 35 -48 192 -30 -64 -74 55 56 -47 70
4194G0j12pk58J25K27j27m5Q8K13r5k23J04m6j31J81J75l01q3L54k81K35k81L06
4217H8j12J25K1o9R1n7k64j2K39l93L42K65j30r6n1J29j10J1K4l1J80l03L5K88
4241B10k81l0J05J06k31o3Q1L28k26j87P8J06r2k8L82J09k86j49P6L1MO3j6p8
4265A2J6j%M3r6j91L33m89N69l37K31k62N2J39qp6nJ56l7j16m3M46k63j47PK75
4291B08q6j82K20j55j77O3o0J28k08M00j84J5J2j0O7m7j28M6j9K26j18J96m0k54
4315h7o1J65o9K5J32k23K23k98jK76j00J57k00P9L67m91L2J77p6O0j43o1K46J0
4339A39k47r0M0K65j60l1P8lQ2j70J07k9N7O0j52o7Q9rk54K37J91%k79K76k28
4364i8L77l55j77%J66M0J98l02n0K24n7J43j99Q1J27l7J2k55J95r6j24J87j34
$$ plain form
4194 70 -42 -49 -307 -182 45 -82 -127 -39 174 79 -144 -40 -86 -217 -36 139 -162 -245 109 -172 63 -218 88
4217 88 -24 101 122 53 144 87 -177 -189 50 -343 -1 264 134 38 -13 116 6 17 41 10 190 -113 -78 210
4241 210 -71 -101 4 110 -121 -184 -103 225 -1 -188 -110 -4 -96 -124 258 367 81 -68 8 39 43 106 90 12
4265 12 28 27 27 70 -26 -217 116 -373 196 -141 90 -172 -120 19 11 -65 -70 86 49 -67 -110 336 73 -74 -67 208
4291 208 122 -60 160 5 -172 -109 -169 -41 -249 151 -33 -18 -6 -16 51 4 -124 -78 -97 129 11 207 167 -87
4315 -87 -148 17 -52 -27 105 -118 105 -193 -194 82 -18 139 -61 18 385 -106 -74 103 27 87 -56 -117 129 139
4339 139 -108 -198 -158 107 -53 -84 -6 -9 73 -97 10 -19 38 98 -54 -121 -32 -41 -295 -58 133 133 -146 130 -98
4364 -98 279 -76 -253 -253 -87 -47 151 -151 -201 23 -34 109 -90 -9 118 81 93 -162 33 -63 -187 0 -134
4387a34l2L66k09O7JL5j38J96q1j2j84J35o5J7L60j73m8j92q1J61J68k06K02k50
4411i7K27k7j21J52l31J90R4K4k13j88M46K9j94r0K15j69J76Nl69K87pk75J09
4434a27J24j66L74k35m4m2ML2J98N1r9o5j09J05l23J41K05K0J2P3q2J18l67R1
4458a11K13j57JJ40k19J11K99l76J22j0p3K05l04m3L96j82n9k3k8L35l31J45j15
4481f4L07o8k78M4j7j79R6J36j30R5K03J07l70J86l3q6J40n9O7j15j25J12j32
4504a63J83q8J85k29J32j3J39p7j14qJ78K3j83J83l29L46j83l9J07J26k74J74
4526G6jO6q2l8j72Q4J64J28o6m7Mk6k72K14m8j0lj67J48k0K03p6q1L5m9K86l03
4553e3J10J52k34K12j29J19j55J45j11J3j15P8l6J36k16L6L24j68k06J53j66j54
$$ plain form
4387 -134 -166 200 -9 58 59 94 -44 152 71 59 -125 10 -55 -38 322 149 101 -91 -172 -11 157 -49 153 -97
4411 -97 130 103 -18 134 -197 -7 87 111 -102 -290 156 185 -9 -99 116 -53 123 128 -241 46 39 -236 -127
4434 -127 -3 -169 205 -30 -74 -116 -112 -80 118 169 70 5 -104 1 -322 -181 24 44 56 129 47 165 -202 -111
4458 -111 102 -55 -54 86 -133 -22 277 -99 23 13 -60 145 -159 -202 194 12 -47 -70 -98 237 -94 51 -64
4481 -64 243 175 -103 -59 -76 -255 -159 -23 -153 -58 145 252 -118 68 35 -51 89 30 97 -18 -143 -31 -163
4504 -163 20 -68 117 -112 20 7 146 69 -45 -53 125 148 -35 148 -181 165 -18 -57 50 176 -98 76
4526 76 75 141 59 21 -151 -67 97 225 159 112 116 90 -182 32 -16 -26 -29 -196 -48 -68 135 59 -22 13 -36 250 -53
4553 -53 57 209 -25 187 58 177 22 167 56 69 -46 32 -4 132 -84 -48 276 108 -98 55 -111 -265
4575b65J34O1K25Q6k31M3j37j42P3K15j76J84l1j5L7P9pL9k34q3J55M12n31L44
4599B35m78M41k80J55N5k12M5n8O5l0KJ32j20p1K05o8K31l98K15j9m5j70J14j90
4623b44L79q3j39J29j36l1L00m6J74k78j99K27n4J31r2R0k43n1K31p1n0K85l34
4646a05K07j15J0r6O8L4R8j95K91n5k53K45j79J23n5K48j78L7j09j71L45l40J66
4669B1J81j79J60j40k22K75J8k10J49J09j01J27j21p4k5K59k40J46j4Pj64l3L00
4692B29l31KL35l82k9J17k1k48M00K3k02P1M5n5L9K59l16J50l38K10K65l09K4
4715f2K05o8l3j18K06j44J08l51K71J41k16J82m7M9k93K05j8k9j94J30M6l1l6
4738i7L43k48K69k49J57j95J66m0m8r8q6J34m6K4R0k19K65J82l96J81j52n3O9
$$ plain form
4575 -265 -131 -70 155 241 10 53 -84 -226 -153 62 -114 70 39 24 61 140 133 172 -62 -145 10 422 -109 235
4599 235 -243 198 -82 73 128 -84 -39 -97 -32 -62 -60 72 -48 -119 86 18 249 -149 66 47 2 -168 -54 -244
4623 -244 135 52 -87 42 -94 -125 175 129 303 25 -174 53 -1 130 38 128 -115 -166 65 -6 -56 229 -105
4646 -105 102 -13 -3 -99 -31 3 101 -94 197 142 -111 134 -45 78 23 271 93 130 21 -150 195 -145 21
4669 21 202 23 183 43 -179 96 114 -96 53 162 61 188 67 -7 -32 227 -13 133 119 126 -38 -71 229
4692 229 -102 -100 235 -147 -176 -59 -80 -328 72 95 -107 -36 9 -46 -7 252 -64 86 -252 -42 223 -86 -62
4715 -62 143 75 42 -76 130 -14 94 -257 14 155 -61 121 74 123 -170 35 17 -12 -206 -76 -30 -61 -97
4738 -97 246 -2 267 18 175 -20 146 106 58 -40 -126 8 -38 -14 76 -143 122 304 -92 89 -63 -116 -47
4761d7n2P7j4j6n6K03n4J46j04k44J4J79J6L7J7j97K11k52qP8N5L7j92K28K6m5
4787D3j38j01K95k47K99j9j15j2J78j75J24l37L77j46K75n09j6K97j38J17j24
4808g2Q1k75L31j38J02j16K05m2Rj23K04k19J64K9K1p6j26p5J45PR0o2k38J26
4832d8M4N2J10j12j29k1J44J05k30j02L4L18k31M9j2J6P2j24J19m0m50J02M22
4855H8k16K03J10j27J39k55K34j11QOK3n8J19j30M5n2%q5J80j31j75M35l07j40
4879a97L40L9q0l5j35N7J25j60N2K15j24l4q9OJ51k73L4J88Kj25O9p9j0J65l0
4904G2p8k3L6j30J61j51mJ27k32K16J23k08K82k65J98O2P5k18p2j48R9J25K45
4927B92m9k30l08J75K34k18L05j69Pm2Oj34j98K25J03P7j21n9L6K92l46r5L26
$$ plain form
4761 -47 -99 -22 -36 -52 -108 95 41 187 83 -161 -147 32 48 85 102 -95 116 -136 -144 -66 -11 26 -166 62 88 43
4787 43 -95 -196 99 -148 151 132 17 5 183 8 132 -205 172 26 301 -208 -224 73 -65 52 -72
4808 -72 9 -266 65 -73 29 -87 118 76 85 -38 166 -53 111 140 161 85 -41 -116 29 36 126 64 -174 -48
4832 -48 -4 48 158 46 -83 -104 40 145 -85 -187 -153 165 -66 -17 -29 -13 59 -65 54 14 -436 -334 88
4855 88 -128 75 185 58 197 -58 176 65 73 79 102 44 163 33 78 26 26 -59 121 -10 -185 250 -57 -197
4879 -197 143 182 102 67 -68 -11 114 -46 6 221 97 63 -26 -20 131 -142 -108 80 82 -43 26 -53 -63 102 72
4904 72 -6 -29 7 -123 38 -113 -117 10 -222 -6 117 -91 191 -74 124 186 261 43 -29 -177 -78 47 292
4927 292 243 13 -295 -120 114 -104 201 32 39 -3 3 -131 -329 -104 -1 76 -45 -104 -68 224 -122 -217 109
4950A09K4k5j36j49J00M9J61k87L60k43J24q7m0J95k71K99j91p6Mk45L33J9r2
4973f5J68k37J18j67R7K75k32N4oM5j50J73l9J60m03J76K41j33j13K7J90j60J0
4996B9j16K12k86J37rj6R5k52L83m32J65L4q8J2M4O2j07J92j75J56P6n5K1L2k15
5021a01O1o2J05M1J73j51n9K0j00Q8j1j70J85l4j65M4K65R5j1q8J2M3l28M5j67
5046b70L84k86kK06o2j02J36K03l76P4K08k29M18k83R9j80J70p0N5k18J00K8Q2
5069H5l02K3L30j98k24K75l0L5j75P9J14l9j32K36J7j6O0k82j7J28j37J44p0K83
5093A87k7m44J29M87k27k09J56J15o5q4l6j5J35j51j33j17L60j46L27l10L4j61
5115a95L13k72lQ0P5l4M6j07M5J6k17J78J19P7k77j44P0K11nJ15N4r0m1j61J95
$$ plain form
4950 109 133 108 -28 -177 -77 -28 133 -154 206 -37 87 0 -40 155 -116 183 -8 -84 -80 -325 8 27 -65
4973 -65 103 -134 -16 -183 -86 189 -43 11 5 50 -100 73 34 194 -209 -33 208 75 -38 -11 179 19 29
4996 29 -87 125 -161 -24 -33 -49 46 -206 177 -255 -90 -56 -144 -132 -88 -26 -133 59 -116 40 116 61 82 114 -101
5021 -101 -40 -102 3 44 217 66 7 27 -73 15 4 -166 19 -15 -180 -136 129 224 213 125 137 180 -148 -103 -270
5046 -270 114 -172 -174 32 -30 -132 4 207 -169 -95 113 -116 302 19 118 -62 108 38 93 -125 -25 3 85
5069 85 -217 -194 136 -62 -286 -11 -41 -6 -181 -102 12 -27 -159 77 94 78 138 -144 -161 -33 -170 -26 -96 187
5093 187 160 -284 -155 332 105 -104 52 167 102 18 -18 -33 102 -49 -182 -299 61 -85 242 -68 -34 -195
5115 -195 118 -154 -157 -77 -2 -36 10 -97 -52 -36 -253 -75 44 121 -156 -300 -230 -19 -24 91 145 55 14 -147 48
5140D8j44q0K44j49M45l78k2J45q7j18K02l52p4J94Pm2M6J64R1l39J71M2l20K19
5164h7J22r7N3K3M2j06p1J58Q5j34p2J16j07L2J78j10J53k65j09J84j19Q7k78
5187c22M40k96k8K04J23k91J94N2j37k7P1K1J47r9k87K32P2k03R2J50j88k9L15
5210B06j13j84n5K05J67k15j14j2K6M6Q6k6J8m2K3n7L22k36q7Q1K9n2q5j6J26
5235D1k02P7L37j07k06j8Q8j30j02L21k81J39k08J75J62k81K14J15l7p7p3j15
5257a68K75l0N4k95m7K43K3l7Oq0K78m26K04L0K38l39N2j09J87J25k27j62K59
5280E4j78J61j86K6j4J87J07l00N1jK10j86K12j25p5J14J08l46%O7j03M16k74
5303g5K65J23k96N7j32j52K19O1l04L46j1k16NK18l31p3O34m34K98j43j57Q9r1
$$ plain form
5140 48 -96 -176 68 -81 364 -14 -36 109 22 -96 106 -246 -320 -126 -119 -161 -115 49 140 -199 -28 14 -306 -87
5164 -87 35 -62 -9 14 56 -50 -121 37 122 -12 -84 32 -75 -43 135 25 178 -87 -196 -12 -131 -44 -322
5187 -322 118 -178 -206 -2 121 -170 24 76 -61 -88 -17 4 151 52 -235 -3 69 -134 -42 108 -80 -109 206
5210 206 93 -91 -146 59 226 11 -103 -115 -89 -43 43 17 35 -7 16 -41 281 45 -42 39 68 16 -69 -85 41
5235 41 -161 -84 253 146 -60 -78 10 -120 -222 99 -182 -43 -251 -76 86 -195 19 134 97 20 -53 -168
5257 -168 107 77 131 -164 -211 32 55 18 24 -56 222 -204 0 30 268 -71 -19 -128 59 184 -43 -205 54
5280 54 -124 37 -149 -123 -137 50 157 -143 -92 -93 117 -69 143 18 -57 57 165 -181 -181 -114 -217 199 -75
5303 -75 190 313 17 74 -58 -210 9 70 -234 112 101 -115 -110 108 -223 -296 338 -96 202 59 -98 -9 -100
5326a00O1jr3J22J32J40l14J59r3J59n0J9l7oo3k47L26j75k18J45J81j13M43r0
5350B87q4p9k8r9NL32k81Np2L3M2l59K30K17j72J88k20L16k73K9J55o1m9k61P
5375a92M43l62K06j34O6ll8M9k32L6L02j48J33R0m02J63K7J92j92M5N4j85P0j21
5399a33J23r7OJ36j4Q2k37K27r8j57qL53p9l23J24K74j88j67J30O2j37J58O1j91
5423i3K39l9j71J51N3j04k0j30k8j4J21J52n1p8q4J9P4N9k22L31J0j18p8M25l66
5448C8J6l40N80k84J3LQj82M02l22j11N10l72K12n9J09l42J08o6L13k59j43L06
5471A38m0k23J80o1k8llM0O9r6J09o1j19K15k01J78j53j6MK4K34j26Ok96J12M44
5497C27l44J37p8k0j26n3J14l5N6m6K08j44J87j34J0P2l48K29L11j97j76L65n40
$$ plain form
5326 -100 -39 -40 -133 -11 121 261 -53 106 13 172 122 141 104 98 35 -212 114 -61 -279 -134 47 -66 377 287
5350 287 203 124 96 -3 2 334 53 58 -14 19 61 -298 -68 149 -23 165 -55 261 -12 17 172 111 62 -199 -192
5375 -192 251 -111 95 -39 27 24 -14 35 -197 -161 141 -7 126 216 -186 -23 4 196 4 49 103 -82 -12 -133
5399 -133 -10 -107 -101 35 21 103 -134 93 -5 -162 -170 183 104 -219 -95 179 -9 -176 -46 16 -121 37 98 -93
5423 -93 146 107 -64 87 140 36 16 -114 -142 -156 -35 117 66 -12 -96 -77 -3 56 -166 165 175 57 -21 404 38
5448 38 54 -286 294 10 23 26 34 -148 254 -68 -179 331 -41 171 112 221 -121 -13 -79 234 -25 -168 138
5471 138 98 -125 55 -6 -34 -37 -40 0 69 -27 82 21 -98 117 -84 94 -59 -75 -71 -47 187 61 67 -229 -117 327
5497 327 -17 120 42 22 -104 -157 -43 -78 -22 -68 140 -4 183 49 59 131 -217 12 323 126 -50 315 -225
5520b25L33j60l5L5K03k01k4n3K47j40K6j69K6K99k18k49N6K66p7P4J91l46P4
5543f7L5J17pj82M76l30j53q0K35j34K8J20n9o3qJ74o9j5K59j11j96j53N4K39
5567A10j44P9j03nK92j81k5j6j06L6K74j42j62J16Q1j00J67j12j42O5j0R4j09
5590d3R5m0j24l3M5K02j63J58j49K29N3m35K10j60K25j4l16L35l66L10k20N9N
5613a37n4M2M56p5n7r0JP5j06j25P5K0P2p4j45K00l99L91k16L5J01J4N3j01J59
5638A15j86j52N7k9L93k41k71L61j42J27q3j8r6K70l1q4j94M22m37K29rL4N8J51
5662B44j17N6j58j06J08R6k59M09q1l70j03L58L1p6j05P2j85K53J50j92k63K81
5684D3Q4k14J43N2l26K22P4j29j88K01J30k41L41k71K62p4l12J80l1K13j76q4
$$ plain form
5520 -225 108 -52 -87 -52 151 -50 -74 -127 120 -20 6 -163 -137 162 -56 -305 -249 17 -60 14 205 -141 -67
5543 -67 -32 85 78 -104 372 42 -111 -191 44 -90 -62 58 -1 -64 -72 102 33 18 277 166 -30 -183 -129 110
5567 110 -34 45 -58 -63 229 48 23 7 -99 -63 211 69 -93 23 104 4 171 59 -83 -18 -28 66 -43
5590 -43 52 12 -112 -145 -100 102 -61 97 -52 177 230 -205 5 -155 70 56 -260 75 -291 19 -201 -142 -137
5613 -137 -191 -149 307 232 175 85 86 161 55 -70 5 25 97 23 -122 78 -321 70 -146 -111 -10 4 57 -44 115
5638 115 -71 -223 -166 -195 198 -43 -314 47 -95 32 -51 -69 -165 105 74 -10 -204 218 -219 10 1 35 93 244
5662 244 127 183 25 -81 27 123 -136 273 192 -178 -281 77 108 32 -73 -1 -186 67 217 25 -238 43
5684 43 127 -87 56 108 -218 4 78 -51 -239 -38 92 -149 192 -79 183 109 -203 -23 -54 159 -17 -101
5706a01J10m0K40l27k0R6pQ0J29l37J33J31k6L9k52J65n3P6j67M13r8k50L19l80
5730a27K27j90J88L4k90P9L3L3kl1m9K2J57j14n5K1k05K07RJ53j16k4J49l2l2
5755D5J44k73N1q9J37l38L21Ll3O2j08J05k55K88k38J90j13J61o2K24k36O3j3
5778C6k49J31K83k31J04j35J36L0n2n5J63k76J44QN7J5o0j01k11J73J72O8J09
5801B59l7m7k55Q8J3j37J74J50m17J43PQ6qm8J30k20p2K04M5p2R5K70k15Q7k45
5826b2R8j08l7K11j42o7K62j20j05J74l10J44L81n30M37l46m4j13R8J73L1J17
5848A82j78m9j12Q5O1N5j52M40l78p5R7j83N8J83J8l8n4J40j65oR4r1R3o5J84
5873A44p2oJ03r4ol29J31K28n0J03j88k93L67N5N4n1j60J19r4J44k74L27k22n1
$$ plain form
5706 -101 9 -31 209 -118 -138 -42 -49 31 160 -177 -44 87 61 100 -152 13 -40 36 -131 282 184 -66 253 -127
5730 -127 100 -90 98 132 -158 -79 -46 -13 -15 -46 -95 -73 84 -30 -85 -64 -269 -62 -53 100 -16 -40 109 77 45
5755 45 189 -84 -33 -122 15 -323 -2 1 -32 30 -78 27 -228 60 -178 12 -101 60 -2 222 -14 49 36
5778 36 -213 -82 201 -30 74 -61 75 105 53 -2 161 -115 29 37 94 109 49 -52 -263 -90 82 150 259
5801 259 222 175 -80 8 21 -116 58 208 -209 -66 -59 27 19 -29 101 -119 -191 13 58 -14 81 351 136 223 -22
5826 -22 76 -32 -69 142 0 -67 195 75 -30 144 -166 -22 359 -171 266 -80 -124 -237 -139 34 65 182
5848 182 4 -45 -157 -72 -11 44 -108 332 -46 -121 -24 -207 -149 34 52 14 -40 100 -65 -71 23 -68 25 -40 144
5873 144 72 66 169 75 69 -260 -129 99 49 152 -36 -329 38 93 147 96 -64 55 -39 105 -169 158 -64 -115
5897a15R0p0P6pJ01j53n0M6J62J12l2k74L9J28j05K6J34jk15J52J3o3M6k04M7
5922a17Q8J3L6k04J93j50j17K25j22K46J31N8n25Q9J27K5J8lk3nJ04k12K9R8J38
5947A40j63j28J2J43M4R6j78P8j07K7J55n4j55R4J53j57J85l02L31l13J65k13
5969a47QJ78q7J11P9k02L9m2K24j14nK19k30r0J3o4J29j28%J08r1J01k4J92j47
5994C0n4N4k46L70J0k68O5J27j47j24j2O2K6J51j84K47p0Q7n3j62K64k35J78l61
6018b45L9J01M6N1M1k98J05L26j86J76j13J77k80k06J39J89p9j52J54L74l38K08
6040B29l96M85l12j56K11m4q1J17M3j2J52l38J37L5j63L7Q4p0K66n01K93k54L81
6063A43j04K8J48r1l02J65N5j3lJ1j14J84k63L47m04K16J45j36P5j51K08k19K72
$$ plain form
5897 -115 -25 -95 -19 -26 75 -78 -128 -82 80 192 160 -114 -75 53 -52 -26 108 107 -108 44 57 -6 40 -164 -117
5922 -117 -29 -16 20 -184 9 -141 -258 -33 -155 91 222 280 -245 -156 -29 -4 14 11 -12 -17 87 -125 -96 2 140
5947 140 -23 -151 -139 4 48 144 -34 44 -63 -36 119 65 -90 4 157 0 185 -117 214 -99 66 -147
5969 -147 -139 39 -48 63 142 -60 -21 -63 161 47 42 261 31 -59 -46 -110 19 -109 -109 -1 -92 9 -15 177 30
5994 30 -24 30 -216 154 164 -104 -39 88 -59 -183 -195 -133 -107 44 -140 107 37 124 71 -91 173 -62 116 -245
6018 -245 -206 -105 -59 -8 33 -265 -160 166 -20 156 43 220 -60 -266 -127 62 -17 -169 -15 359 21 229
6040 229 -167 318 6 -150 61 17 -64 53 96 84 236 -102 35 70 -93 -56 28 -42 224 -277 16 -238 143
6063 143 39 67 215 124 -178 -13 42 29 26 37 -77 107 -156 191 -213 3 148 12 87 -64 144 -75 197
6086A97j27O2o5N7K2j24R7J07J9j14j82N0k00K22P2K16m54L4K91l77L70j82P2
6109F3j30J37j52K48j88j1K9j44N0J00O7k02M66k88qj54P3J67L6l33K86j89n7
6132a34J49l3j31K07q1j19J52K20j67j11j49J81L7o1M6J36j3k04K5O8L2n0j25
6155a25R1J83j22r2K13n8j38J51j9p3LK4pq3k3p7J40R0o9Pk20Q8P2O5r2K10r5
6182D4J63k50J54j16j09J27N1j19m2K44k55L75m41J46K2k67K77k24K92l4J04k47
6204a05K04j41K2N7J52n7k53K19M8k66P3M2o6K59o4o0P6r3J49n15J56k4P7J42
6228C2k15J20J5K5K68j19k52J21k21K95k6j15J04M3k35J7n4K01rJ7Q7Pj46O6j31
6253a05J15K5j54J18j65N1R8n6J4r5J65M2m0R1J6Nk16K0K50l34L03j73N3On6M8
$$ plain form
6086 197 70 132 67 124 146 22 119 226 245 131 -51 -1 -201 21 93 309 -145 -111 180 -197 173 -9 63
6109 63 -67 70 -82 166 -22 -33 -4 -148 -98 2 69 -133 333 45 37 -117 -44 123 159 -174 112 -77 -134
6132 -134 15 -18 -149 58 -23 -142 10 230 63 -48 -197 -16 21 -40 6 142 129 -75 -50 18 50 0 -125
6155 -125 -34 149 27 -65 148 90 -48 103 84 11 14 38 31 -52 -75 -152 -12 78 9 16 -204 -116 -44 21 -71 139 44
6182 44 207 -43 111 -5 -114 13 64 -55 -97 147 -108 267 -174 -28 -6 -273 4 -220 72 38 142 -105
6204 -105 99 -42 -20 37 189 132 -121 98 146 -120 -47 -5 -71 188 124 64 140 47 196 -319 -163 -187 -110 32
6228 32 -183 -63 -48 -23 245 126 -126 -5 -226 69 43 -72 32 75 -160 -143 -197 4 -5 12 99 106 -40 26 -105
6253 -105 10 35 -119 -1 -166 -115 -17 -73 -59 -154 11 53 13 104 120 125 -91 -71 179 -155 148 -25 28 34 -22 26
6279B6j59K4N0O0J93k76J94P2j75j99L73l24j00L60rJ16j54j41q5K48j84K9nk27
6303b93L60k45L39r8j12j20K93j48o9J9n5L1L40m7o3l21P7J84k02K51l20L44j51
6326fK5j81J94JRn0J09L8k80p4K40q5K40k58J59n7j19j4J66j18O5J9j82J73K3
6351C7l2l38M62m48K90o2J84k76j03L77k82OK12J22k6o9R7n5J43m0k22o7J23q3
6375e0P0j72K66j79l2O4K12k0j57M4JJ98j56J65j08K4m05K88j81L39k35J5k12
6398b21L10j02K27j18l05L00j41J9J25m1L3j54O7j53P0K45k50K5R8J8p9j1m5J27
6422D4J05j49j11L35j76J00k29J07n0j3J60N3j37M2j52o5n9J7M14l49M9J96j35
6445cQ0J8q2K00j43J20j95k20K80Kl0K02k66J05j03N1L49j93j50Q0J00j80j58
$$ plain form
6279 26 -133 -109 -59 1 194 -82 112 184 9 -190 183 -141 -241 119 110 226 72 -69 -154 94 -90 -61 -66 -293
6303 -293 67 -178 161 63 -49 -169 124 -24 -93 -74 -129 -98 242 195 132 -189 -112 72 -130 121 -199 145 -6
6326 -6 19 -162 32 33 42 -8 101 139 -141 -215 25 -60 180 -78 81 24 -95 -109 57 -61 4 23 -159 14 37
6351 37 5 -333 129 -319 -29 -91 93 -183 -286 91 -191 -185 27 149 123 54 151 96 239 199 -23 -90 33 -50
6375 -50 20 -152 114 -65 -97 -33 179 159 2 46 47 245 89 254 146 170 -235 53 -128 211 -24 -9 -221
6398 -221 89 -13 214 96 -209 91 -50 -31 94 53 86 -68 -1 -154 -84 161 -89 -64 34 52 -27 -38 -83 44
6422 44 149 0 -111 224 48 148 -81 26 -24 -37 123 176 39 81 -71 -136 -195 -178 236 -113 -64 132 -3
6445 -3 77 95 13 213 70 190 -5 -225 55 57 27 229 -37 68 -35 16 365 172 22 102 202 22 -136
6468a36K97J61m69J22j23K74k12J68J9m23J20J56%K25l06J42j52J71k67k2R3J64
6490Bk78L54k51M23l32J24p6m2Q2N0q0K27j62j23K9J5J1j11J83l34R1J52j85k0
6514b51J21K4J33L48m05J56k40k1m5mN4J35N6j41j7o5K62k6m2k5P2p6J25k2o0
6539D6p7J78J07k54L8K7j27j98J71P9j17J82nk1J37M9l22K45j76J6j09m1ML32
6563A64n3j22j50r8K81j05K13j42L1j64L24l24K96k34j48K41L9p1l7K56p2P9l10
6586a06L7O9M9j38J66j41N1n6J97l4lk64J38m2P5k8K55l28%o7QR6q2K06k2r6J31
6613G1J25r4M4p6p9J75m1j3k00RQ8R3j00mp8K00k7k98K48j80N2R2Ql07K86l09
6639c15L51k9m9J86j26l1J38Pk59J56o0j52O3J08k4j02J50K13k09J4j03L13j96
$$ plain form
6468 -136 161 322 -147 -25 -148 126 -86 82 101 -322 -202 -46 -46 179 -127 15 -137 34 -233 -255 -162 2
6490 2 -276 78 -173 250 -82 42 -34 -76 6 56 -24 203 41 -82 -53 -38 -27 -138 45 -289 -198 -46 -231 -251
6514 -251 -130 -106 27 375 -30 126 -114 -135 -180 -184 -130 5 61 -80 -97 -162 100 74 32 7 79 3 128 106 46
6539 46 -31 147 254 0 38 65 -62 -260 -89 -10 -127 55 50 29 166 215 -107 138 -38 -22 -131 -172 -168 164
6563 164 111 -11 -161 -259 22 -83 130 -12 19 -145 179 -145 151 -83 -231 10 49 -22 -59 197 125 204 -106
6586 -106 -69 0 49 -89 77 -64 -13 -69 128 94 91 -173 -35 -77 -2 -30 225 -103 -103 -170 -162 -66 -148 58 36 -60 71
6613 71 196 102 146 70 -9 166 125 112 -88 -79 9 102 2 -2 -80 120 93 -205 43 -137 -85 7 15 -292 -6 -315
6639 -315 36 7 -42 144 18 -13 125 132 -127 29 -31 -183 -120 -12 -36 -138 12 225 16 30 -73 240 44
6662D4n8r9K39j56N0Q9nJ10m59L37n6o4R5p7L2k9J7j02K09r1j11K60k88j4L15
6687A88l43K15k51M49k64L0N0k8j51M9LR7o3j03M7n7O3J53L9j85Q7L7k05J51J75
6712A83l00L3J64l76M34k02k5K70k42K54l35j5J40M8M4l3J66j81P9k45J12j76
6734b03l8qM72l31l5K81n8j71J80K27m31J05K36k63L5j18K19k02mK40l5r7K51
6757B52j68k92L53mj50L4k5J50j17k27L59j09M6j22j23K84k1j97J97k10J61k94
6779b23J92J68r3L8k77L06J25l66J38R5p6k74M02j23k27O3K33j4K25k44o0K4j14
6802h2%j1p8M15l22K31j45O8K7k43J10L07l87J89r9opo7L7K41L1k12K3k99J93
6827h6Q9O1j50J66j82j14L9K47M2j17q3J11k42J42M3R7j59L4k9J27k10L22l81
$$ plain form
6662 44 -14 -113 126 -30 20 109 104 214 -245 92 36 -28 67 -10 22 -7 10 -92 117 26 -85 175 -113 -127 188
6687 188 -155 60 -191 258 -6 24 74 46 -105 -56 -53 44 -19 -122 -75 -132 -69 84 123 -62 25 62 -143 8 183
6712 183 -117 -84 80 -296 138 -64 -89 181 -61 193 -142 -157 -17 31 75 42 208 27 106 -139 -27 -203
6734 -203 -241 -249 223 -108 -143 138 80 -91 89 316 -115 -10 226 -37 -2 -120 99 -103 -107 133 98 1 252
6757 252 84 -208 145 141 -9 25 0 150 33 -194 165 56 102 -20 -143 141 120 -77 120 -90 71 -223
6779 -223 -31 137 44 82 -195 111 236 -130 8 103 27 -247 155 32 -195 -132 101 87 312 68 8 32 -82
6802 -82 -82 -93 -171 244 -78 153 8 76 103 -140 -30 277 -110 79 -20 -26 -33 -100 -63 178 209 -3 20 -279 -86
6827 -86 3 64 -86 80 -102 -216 -177 70 112 -5 -88 23 -219 -77 -34 63 -96 -62 -91 36 -174 148 -233
6850b33Q2M09m40K12j30J9J00k3p5K49k40r4K88k07kJ61p2J64q1m8q2k7O0k61
6874b71J24J86J14l46J35o3k4K63j90j26J32R6j04L27m03M50l70j14Q1J97p1j7
6896Fj37J87j42J92R8j78P6L1l00K68m5k42L25j19j24m7J01L4J12j12m1J55kk80
6920a84K99Rk16q4K68J8q7j26n4J45j92J61K8L3N6j10m7J17k07N3L81j54j43K17
6944A81n4J8k86KO7J72P2r3j50J84o8n8M6j9k20J69j13J60J56r9q3R5p7l21M38
6969A19j36J4L8j34q5L71k11n4o1J19o4L80k44Qq7j34J04K5L7K2J24k52J97L5
6993A31K4l23L64j38J74l65QK38lj95l8O4Q1o4N1k26L51p4m1k64K88k16q0K66
7017A3j90J77r8m4J73j23J08nK50r0L9o9Nj15k49M60m87K89p9M0L4n9l7M8j34
$$ plain form
6850 -233 -151 258 -182 30 -100 -81 19 -4 -79 170 -70 -164 124 -83 -85 76 4 168 87 39 -43 -70 -10 -271
6874 -271 -147 39 153 -193 -58 -121 -145 118 -72 -198 -66 30 -74 253 -150 300 -70 -184 -103 94 23 6
6896 6 -131 56 -86 106 204 26 102 133 -167 101 56 -186 139 20 -104 -151 -50 -16 96 -16 -57 98 96 -184
6920 -184 115 124 -92 -176 92 110 23 -103 -157 -12 -204 -43 -15 18 74 -36 -83 34 -173 -120 261 107 -36 181
6944 181 127 145 -141 -139 -72 100 172 79 -71 113 45 -13 33 14 -206 -37 -150 10 166 67 -16 79 2 -319 119
6969 119 -17 -3 35 -99 -184 187 -24 -78 -139 -20 -84 296 52 60 -27 -161 -57 -32 5 27 151 -101 96 131
6993 131 155 -168 196 58 232 -133 -125 113 110 -85 -123 -59 22 -42 9 -217 134 60 19 -245 43 -173 -253 13
7017 13 -177 0 -98 -142 31 -92 16 11 261 171 210 141 146 31 -218 242 -245 44 -35 5 39 -20 -57 -9 -143
7042a43J25J21j53J82j86J27j18j3J54k10L26m05j08N37m11K61j1k15K92j69J24
7063A07L6m95L76p7N5P0J37j23j51J27j96M5J78j44K8j3o1J47k12K42o6OL1m6
7087ApK76l37j18R2K77r5j29J80k75J90l22K15K69j98K8o3J1k5q4J11J18j93J08
7111C0k84J79J02j67N0K22M8k74o2L82m21K58o7q4K60k39q9k0J36o8K47k89J62
7134A2j07L45m2k82J18J05k11K1K01m03L19j00p6L90l51q2K71k0m12K22K74j10
7156H2k23J67q9k0Q8N5J9mK08l80L26k35j5Q9j33P7k9K14j61K3j34P4R1k52Q0
7181h2M3k3o4P3J57m12L48j39J88k44Q8K78K7k88J19j10j68L32j76K91l19L5N6
7204A0J22l11K45kj05k21L07r8R4k77J0K67j74K28j88l3J91l32K56J50l54L92
$$ plain form
7042 -143 -18 103 -50 132 -54 73 -45 -58 96 -114 212 -193 -301 236 -175 86 75 -140 152 -17 107
7063 107 143 -352 24 -53 2 72 209 86 -65 62 -134 -89 89 -55 -27 -40 -101 46 -166 76 10 16 47 1
7087 1 -6 270 -67 -185 -93 184 89 -40 140 -135 55 -267 -52 217 19 47 -16 -5 -30 -114 -3 115 -78 30
7111 30 -254 -75 27 -140 -90 132 180 -94 -156 226 -195 63 -4 -88 172 -67 -156 -176 -40 -108 139 -150 12
7134 12 -95 250 208 -74 44 149 -62 -41 160 -243 76 -24 -100 290 -61 -143 128 108 -304 -82 192 82
7156 82 -141 26 -63 -83 5 60 79 75 283 -97 229 -6 -21 68 -65 12 -17 197 36 59 -75 -1 90 -162 -82
7181 -82 -39 -62 -126 -53 104 -308 40 -99 89 -155 -67 211 238 -50 69 -41 -209 123 -53 238 -81 -46 10
7204 10 132 -179 66 64 -41 -262 45 -53 41 -236 -226 41 -133 95 -93 -126 65 -267 -11 139 -215 177
7226A77k22q1J26J0k84K60j35r9L98K9k08J05j46J71L5k88j66J02K75j92K43j36
7248b6%p5N7K68j69j36J58p3J71k72k15L93k8j22J18k0q2L0kkL27k47j59K01p9
7273A6j15J24j9k02K64j07R3K83k00j3k28k1K45j72k3J82M8k62K9l9l3J08P4j16
7297h4J85j42p6Q7r8J40k28R3RP8Q2j09J70j04m6O2j79R0K5K33l15J53p8J47O4
7322A59j61J09j64K39j90l3P9L0L4j86L03j37Pl07O2K23J8q0Qk4j69nK95J11m23
7347b02L03M2j9j86n7j3K19O3j74q2J9j65K38j55R1M16R1l44n9m3j01L19k16J44
7371A29m0J03j84q3J9o6J69n6L29n78J71k0J45J44m01M57k96P4j00pJ22j04J56
7394H3k63J71K09j08j43P8P3j39M3J33k7N5m32J69J94j06j98L86k57j55J57J0
$$ plain form
7226 177 -45 -126 0 10 -274 -14 -149 -248 150 179 -29 76 -70 101 136 -152 -318 -216 59 -133 110 -26
7248 -26 -26 -101 -44 224 55 -81 77 4 175 -97 -312 81 53 -69 49 29 -53 -23 -25 -27 300 53 -106 95 16
7273 16 -99 25 6 -196 68 -39 54 337 137 124 -104 -125 120 -52 -75 107 155 -107 -78 -117 -150 -42 32 -84
7297 -84 101 -41 -117 -30 -128 12 -216 -123 -114 -36 46 -63 107 3 -43 19 -160 -70 -45 188 -127 26 -52 95 159
7322 159 -2 107 -57 182 -8 -41 38 68 102 -84 219 82 89 -218 -156 67 85 5 13 -11 -180 -185 110 221 -202
7347 -202 101 143 124 -62 -119 -132 87 150 -24 -106 -87 -252 -14 -169 -78 338 429 85 26 -17 -118 201 -15 129
7371 129 89 192 8 -75 -56 -122 47 -9 320 -258 -87 -107 38 182 -219 238 -58 16 -84 -91 31 -73 83
7394 83 -180 -9 200 92 -51 27 100 -39 4 137 110 165 -267 -98 96 -10 -208 178 -79 -234 -77 -67
7416f7J7oJ55j37k49R4M47n06K53j22j83K17j22L39l35J89j82J89q8L0J88k19
7438i8j25K08m3q7L29k17k5Q6J38r0k0j78N25l88p5J13n0j14l0R4N4j87M52k40
7462C2M1QL3j11m4j7K07r6J5J99j60k64R8O7M7J31o94K99L33r6R1lk42K4kL3K23
7489A52j30J17r5O4J11j5k56N8q2K3o9J56j68J61m7j17K76m92M95j55rj41J25
7512c8P0M7m3L1k47J54mJ55J15l23P9r9j86J10L5P1q7M3j10L57k61J62k18K56
7536F9j41j54J34n8L0J17O6J12m7l43K57J18o3j17K06l27J44l3j93K2J43R9j03
7559f2j96L97j02n6P2l17J47J61j02M4M4K93o12K31K85k39j11J33J03k70j35L00
7581Hj44L39r7k15P7rj54K40N1R2l70L96j35L4l95L43J66k85J80l52M6k9L83p0
$$ plain form
7416 -67 -50 -56 99 -38 -287 -193 254 -252 1 -121 -304 -87 -209 130 -205 -16 -198 -9 -97 -67 121 -98
7438 -98 -223 -15 -58 -145 184 -33 -58 28 166 76 56 -122 403 15 -60 53 3 -111 -141 -47 7 -180 272 32
7462 32 73 81 114 3 -41 -58 149 53 68 267 107 -157 -59 8 55 186 -508 -209 124 28 119 116 -126 -102 -104 -71 152
7489 152 22 139 44 108 219 204 -52 6 -76 -53 -122 34 -134 27 -20 -137 139 -353 142 -13 -22 -163 -38
7512 -38 32 79 36 67 -180 -26 -30 125 240 -83 -4 -103 -289 -179 -144 -73 -160 -117 -227 130 -131 31 -187 69
7536 69 -72 -226 -92 -150 -120 -3 63 175 128 -215 42 160 97 -20 186 -141 3 -30 -223 -201 -58 41 -62
7559 -62 -258 139 37 -19 53 -264 -117 44 -58 -14 30 323 -289 -58 227 -12 -123 10 113 -157 -292 8
7581 8 -136 203 106 -109 -32 -41 -195 45 96 188 -182 214 79 113 -282 61 227 -58 122 -230 -184 -213 170 100
7605A00l4j82j45L47O8k33J54M3j84K3J0J7J61n3m3j39K25j46K5K0O4k8J4L4K6
7630A44j83R2j67K51l8N2M4p9K30j70n8j51K42k75j5J38j81n6J21J31j51N0J42
7653A13j71m8K15L2k3p3l8J7M3j2k43L28J03k74J0k5O9n5L08m48J36J79j28o2
7677d7P1N8l9k48L14k72J52l9R4j70K24m02J89K2O5K33k68r7J31R7J20j91L7J15
7701A49j34J31j01n8K1L9J63l30K06l66K26j17K54qj84J57k57J13K1J72k92M5
7723a50O6J73o9j00r8P2J02N6M2q1k05l0J56n3r8Q5K01jj48J59j76j04L53l14
7747a62L48k21k07K82jQ9k35J42N5j15J88l04L39l99K20K4j59K88j68J73q6K4
7769A15j09r6J28p8J29j6j30K00k82r9L19k21J76j93M19j62l51J73J5L34l25K8
$$ plain form
7605 100 66 -116 -261 86 154 -79 75 118 -66 -43 -33 -16 145 92 49 -90 135 -11 14 34 98 70 84 118 144
7630 144 -39 53 -114 137 99 151 195 116 346 176 118 -33 209 -66 -81 57 -124 -180 -59 72 -79 -29 113
7653 113 -58 -106 109 141 118 45 7 24 67 55 -188 140 243 -31 -21 -46 23 -32 276 -172 -36 143 15 -47
7677 -47 24 82 43 -205 109 -163 -11 -50 44 -126 98 -304 -115 -93 -28 205 -63 -160 -29 68 188 -3 34 149
7701 149 15 146 45 -13 8 47 210 -120 86 -280 -54 -171 83 75 -109 48 -209 -96 -75 97 -195 -150
7723 -150 -84 89 20 -80 -178 -106 -4 52 94 13 -192 -222 -66 -119 -217 -132 69 68 -80 79 -97 -201 152 -162
7747 -162 186 -35 -242 40 39 128 -107 35 90 -25 163 -141 198 -201 19 43 -116 172 4 177 91 115
7769 115 6 -90 38 -40 89 73 -57 143 -139 -238 81 -140 36 -157 262 100 -251 -78 -63 271 -54 -26
7791b6o1N1m0j01L27k74K04n1K3J13K9k01j7J09k45M2L43l33O6L8j3J51j44qj5
7816c3j13K17K9q8P8j21Q7p4l5P6L7j4r2M3k17J22K00J06j24K7o3j67k24J80J5
7841a48L51k45J79R6j16k68L7pJ90O8R6k34N0q2Q5j00n8j20m8K50O4J40l14P1
7865f3R7J10lk26KJ50O4J7L0j47J59p1k57J39J02k84J31k6M1NoK22k18nJ10m9
7891B4j61R2J06j78K42m4r2K3j26J08M9L04r6j52q5q0j05qK87K19n25j4N22k18
7915I2j86l3p8pJ7J97J53j68J21j06L2k73L08n3J63k71L52n22J34J07K21m22L90
7938A68l58m7L10r0N0NP9j27j2J99k19K14j46j48K46j97Rj19L44j04p4j7J91j12
7962D5J2j76m3J13J19k62J31J45j60J48j82m7J11n1L5j3n3rK08k09j85K99K2K02
$$ plain form
7791 -26 -87 -36 -76 -177 150 -124 80 29 52 165 194 -7 -24 85 -160 -118 225 -108 -42 -4 -17 134 -10 -18 -33
7816 -33 -146 71 100 12 90 -31 56 -18 -53 23 60 46 -46 -3 -220 -98 102 208 84 111 48 -119 -343 -163 -148
7841 -148 203 -42 137 233 117 -151 -114 -121 69 137 233 -1 49 -33 52 -48 -106 -226 -274 -24 40 180 -134 -63
7865 -63 34 144 141 -85 -83 67 131 148 178 31 190 119 -138 1 103 -181 -50 -76 -35 -30 -36 186 -32 -37 73 24
7891 24 -137 -45 61 -117 125 81 -11 12 -114 -6 43 347 251 99 14 -66 -171 -179 108 327 -198 -212 310 92
7915 92 -94 -127 -205 -212 -195 2 155 -13 108 2 34 -239 69 16 179 -92 260 -262 -128 -21 200 -222 168
7938 168 -190 -237 73 -17 33 38 117 -10 -22 177 -42 172 26 -122 124 -73 -64 -183 161 57 -17 -34 157 45
7962 45 57 -119 -162 -49 70 -192 -61 84 -76 72 -110 -157 -46 -97 -62 -75 -128 -137 71 -138 -323 -24 -2 200
7986B00o1n5k19L32J7k32J36j30K3J6K34j11j21o0N9O6k71N7K84m33L63rj90j31
8010b36J15o3L08j07n7j62L18p9j20Q5k34L28l65M44l07J4J75j90K76j67l7K4
8032c7MQM4j02O0j02M4L6r7j41K85k08K96k15L60l48K01O1k19J04j48R7j42L85
8056B26j8l25J16j04J07n0J03r4p4J38j05J55p4L4R9k50K70j42J90k11J02J39
8078B32l09P8J52k45K89l19j04K57r1l9K15o0o9P4P1j50lj62j47J29J32J9K75
8101B25j39l06L47j63N6N1k8j26J14j30O5Q7J79j35l6j38K02k94R9K35r9J60k73
8124d7J15k32L48l3k27L9J95j01N6ll47J10K7K22K8j57J55k13j5n9K35q0K64k39
8148D1K00k76k48K10P2j25K06r8j04O2p6J53J9J0J2l11L13k14L03j58K6pRO6k39
$$ plain form
7986 200 139 84 -135 197 214 -18 118 -12 11 27 261 150 29 -31 28 94 -177 -120 164 -269 94 85 -105 -236
8010 -236 -121 -184 124 17 -40 -202 116 37 -83 2 -232 96 -269 175 -132 -118 57 -133 143 -24 -61 -37
8032 -37 -33 -25 19 -83 -23 -125 -81 -45 -142 -283 2 -206 90 -125 235 -113 88 149 -70 34 -114 -17 -159 226
8056 226 208 -117 -1 -105 2 -48 55 -39 -113 25 -80 75 1 35 134 -116 154 12 202 -9 93 232
8078 232 -77 1 153 -92 197 -122 -226 31 -60 -99 116 56 -13 61 132 -18 -21 -183 -330 -201 -69 -50 225
8101 225 86 -220 127 -36 20 71 43 -83 31 -99 -34 53 232 97 61 -77 125 -169 -70 165 66 226 -47
8124 -47 68 -164 184 151 -76 -37 158 57 113 110 -237 -127 -100 122 150 -7 148 -65 -80 -139 96 16 280 41
8148 41 241 -35 -283 -73 -1 -126 80 -18 -122 -60 -136 17 36 46 58 -253 60 -154 149 -9 17 10 19 85 -154
8173a54L05l66M25k85J51k20J55m33L64K89k91J28L70k28k87j81L12R7
$$ plain form
8173 -154 151 -215 210 -75 76 -144 11 -422 -58 231 -60 68 438 210 -77 -258 54 151
8191A51
$$ Imaginary data points
##PAGE= N=2
##DATA TABLE= (X++(I..I)), XYDATA
0@%%%%%%%%%%%%%%%lJ1j6J6j6J6k4L2l2M0m8N6o4P2q6R4j04J20j36J54j75J97
37A04k21K47k75L06l40L77m18M62n10N63o19O81p52Q30r13J006j112J228j360
56g16J511j685J889k129K420k776L227l822M637n831P752j1314K0004p8229j01463
71a66525J63852k4284k8042J48834J4230r5898L1849n3283j10083M9008N5138
82a5204l982Q9838L2902p5958r814k0370r7880Q966P9902K2332L4091M4659k8695
95F0787n4362m5491l6400P680L7652M1421M7354J4666j9890l4134o5409l9950
107h6076L5403K9377K0956O2744J6845m5145j8318m0701o6495K4293O2804J5478
119A1165L6633L1420m0697l8355k4190n1764K477O6260L2466J6555K8192k3295
$$ plain form
0 0 0 0 0 0 0 0 0 0 0 0 0 0 0 0 0 -3 8 -8 8 -8 8 -16 16 -16 24 -24 32 -32 40 -46 48 -56 64 -72 82 -93 104
37 104 -117 130 -145 161 -179 198 -220 242 -268 295 -324 357 -395 435 -478 528 -584 644 -716
56 -716 795 -890 999 -1130 1290 -1486 1741 -2081 2556 -3275 4477 -6837 13167 -65062 -166525
71 -166525 -2673 -26957 -54999 93835 108065 12167 44016 -9267 -119350 -70342 -15204
82 -15204 -19186 70652 103554 27596 17782 -2588 -100468 -91502 -11600 10732 44823 89482 60787
95 60787 6425 -39066 -75466 -67786 -30134 11287 58641 73307 53417 19283 -46126 -86076
107 -86076 -50673 -21296 -340 62404 79249 34104 15786 -24915 -91410 -67117 -4313 11165
119 11165 47798 79218 38521 166 -24024 -75788 -73311 -7051 25415 41970 70162 46867
131D6867n5959k7004k0196q161M0635N4422K1734L017j0076m2673n1539j2348
143f1281J7232J9283M3637M5977r519k8703j7684m8743l5200L6191L2216J4401
155G807M8905J0579m9960j8553k2554n1599K3527O0826N559K4490L5274m8922
167B5379m9161J783l0220j1321O3948L4184j153K2833j7420o0726j8402k130p228
180d9634L8390M8320O831o97j0585m3437l4369k495J0846K6783L7883K2293m397
193D5732k5005l0641k7409j5522J5647L7667K6271J6404N866k8726l9476j5078
205c4270j0169L376M1041L4154M445M459j7505m7045k0417M858K149K8332M3655
218C7063O622j0552j0645l6800l2963O848J6425J8581L5998J8141j5698j9753
$$ plain form
131 46867 -9092 -36096 -56292 -64453 -23818 30604 52338 55355 45279 2606 -48933 -61281
143 -61281 -44049 -24766 18871 64848 55329 26626 8942 -39801 -75001 -38810 -6594 7807
155 7807 56712 67291 17331 -1222 -23776 -75375 -51848 8978 14537 39027 74301 25379
167 25379 -23782 -21999 -52219 -63540 408 34592 33439 56272 38852 -21874 -40276 -42406 -49634
180 -49634 -11244 37076 43907 43210 32625 -10812 -45181 -47676 -36830 -10047 27836 50129 45732
193 45732 20727 -9914 -37323 -52845 -37198 469 26740 43144 49010 20284 -19192 -34270
205 -34270 -44439 -41063 -22 34132 38577 43036 25531 -21514 -41931 -37073 -34924 -6592 37063
218 37063 43685 33133 22488 -14312 -47275 -40427 -24002 -5421 30577 48718 33020 13267
230A3267k3909l1323m601K4242K5005K3253K0134q430k9779k4320j8474r481J7730
243b6686L4277K1682R375j249k5762l4228j3857O7R740L0680L0604M632r073j7809
257A2393l2717k0350N697J4961K2831K9546R435j4615j8740k5731k3902L469K2426
270a5297K0890K3232J4144j4710k5862k0227j7770l060K2673K6903J7042J0063
282C8021p252k8293k5327j1456j55J6492K9138K0531L701r055k2692k6698j3056
295c6101M206J6553K6079K1329K899j1412k1051k5285j4128O225J8394K2949K0904
308C1561M641j4714k2061k1604j2967M073K0164K3719J7543M312j2698k4034k1724
321b3789j0198N781J8249K3386J7531K724j4124k2315k0524j0564N954J9885K2744
$$ plain form
230 13267 -10642 -41965 -46566 -22324 2681 25934 46068 37638 7859 -16461 -34935 -44416 -26686
243 -26686 7591 29273 38648 37399 11637 -22591 -36448 -36381 -26641 4039 34643 39275 30202 12393
257 12393 -20324 -40674 -34977 -20016 2815 32361 41796 27181 8441 -17290 -41192 -37723 -15297
270 -15297 5593 28825 42969 28259 2397 -17830 -35600 -38660 -15987 10916 27958 38021
282 38021 30769 2476 -22851 -34307 -34462 -17970 11168 31699 35400 26345 3653 -23045 -36101
295 -36101 -31895 -15342 10737 32066 34965 23553 2502 -22783 -36911 -30686 -12292 10657 31561
308 31561 36202 21488 -573 -22177 -35144 -31071 -10907 12812 30355 34667 21969 -2065 -23789
321 -23789 -33987 -28206 -9957 13429 30960 33684 19560 -2755 -23279 -33843 -27889 -8004 14740
334A4740J4901K260j3071k2796k0076q917O565J9767K2735J3176J462j3157k3232
347e643j9272o186O358J7738K3315J4763j944j3747k0504j9806o852R759J6819
360e202K0920J5353k279j6077j8669j7752r236J1060K1097J5883J2689K278j7408
373A2657k2298j2911p053N762K3932J8376P497J800j4188k5288j1993k254K891
386b3070K0683K4343M714l163r425k4208j7275J661O944J5905K3643Q046o937
399B1861j0809j9807j8698J193J0729J4350J9687J0431o684j4008j8370j5269
411b5394j214J0479J7299J9147O291o071j1173k0835j5490L302Q805J4383K2790
424B2319N652j1070q751j7561j9758N566J3784Q189K1114J2509j6349j3241q661
$$ plain form
334 14740 29641 31901 18830 -3966 -24042 -32959 -26394 -6627 16108 29284 30746 17589 -5643
347 -5643 -24915 -31101 -24743 -7005 16310 31073 29129 15382 -5122 -24928 -31780 -22021 -5202
360 -5202 15718 31071 28792 12715 -5954 -23706 -32942 -21882 -785 15098 27787 30065 12657
373 12657 -9641 -22552 -29605 -23843 89 18465 25962 27762 13574 -11714 -23707 -25961 -23070
386 -23070 -2387 21956 26670 23507 14082 -10126 -27401 -25740 -18796 -2891 20752 28798 21861
399 21861 11052 -8755 -27453 -26260 -15531 -1181 18506 28937 22253 8245 -10125 -25394
411 -25394 -26608 -16129 1170 20317 26608 20537 9364 -11471 -26961 -23659 -14854 -471 22319
424 22319 27971 16901 8150 -9411 -29169 -23603 -9819 -1630 19484 31993 15644 2403 -6258
437f258k0678j248K1472J0371J0667J6402j0450k1674q201j2197p318J9756J8427
450I071N279J0793j637k4351j5183l095m997R884K3758J1050J75j629j4819k1368
464a7069o470M493P454J7124J7360O8r240r327j7895j4139Q386J3158R661J6750
478B0314P176j4957j3591j0124j3656K585J8224J0846J0429R397j2223j8918p220
491a1718r522k087J8117J5868O640N364p056j8613j2340o404J867J5179J4663
504I958Q723L779r745j6544j1167p345L536J6113J1838Q592O525j2891j7851n438
518a1917r261j247K2302J3197M53R826q450k5837l512j027q154K0483K2096n102
532A3850K756K066k7088j3577R364l777P574K7082K431q737J877j6119k1282N682
$$ plain form
437 -6258 -26936 -28184 -6712 3659 14326 30728 20278 -1396 -9597 -21794 -29112 -9356 9071
450 9071 14350 25143 23506 -845 -16028 -19123 -24120 -14236 9522 20572 20747 19118 4299 -17069
464 -17069 -23539 -19046 -11592 5532 22892 22960 13720 4393 -13502 -27641 -19255 -6097 3564 20314
478 20314 27490 12533 -1058 -11182 -24838 -22253 -4029 6817 17246 26643 14420 -4498 -11718
491 -11718 -21240 -23327 -5210 10658 17298 22662 15606 -3007 -15347 -21751 -19884 -4705 9958
504 9958 18681 22460 12715 -3829 -14996 -22341 -18805 -2692 9146 17738 24263 11372 -6479 -11917
518 -11917 -21178 -22425 -123 13074 13527 23353 14903 -10934 -14446 -15473 -23627 -3144 18952 13850
532 13850 16606 18672 -8416 -21993 -12629 -16406 -8832 18250 20681 11944 13821 -2298 -23580 -17898
546a7898P385L046J9640J2322r825p892q819j6505l320J0676J0442J0960R984
559B0196j760j1955j2760r603l197M083J5140J4624K438j134n969j7995j1709
572a9601L554M226Q653J7992O020q065n786j2246j5233K508R605O521J3922R688
586B1758p875j0134r018j2573j640J0751J0388R974P865l994j2058j1483q466
599a6505j809Q296J3096J0317L920k374j0404j4666p595K721N238J1252J4035
612A5522K705o102p812j3113j0272M185P897P599J4130M810r469p417r570j2710
626a9617L107J2586O205R636Q515q789j2909o011q946j485J3063J0206N665O451
640A7677m039j4698r593l771j510Q809J3652P761J023l773j0371j2714n407M372
$$ plain form
546 -17898 -10513 -7467 12173 24495 14670 6778 -2041 -18546 -21866 -11190 -748 10212 20196
559 20196 18436 6481 -6279 -15882 -19079 -14996 144 14768 17206 16072 10103 -7892 -19601
572 -19601 -16047 -11821 -3168 14824 20844 12779 6993 -5253 -20486 -17978 -8373 -1852 12070 21758
586 21758 13883 3749 -5269 -17842 -19482 -8731 1657 11631 19496 15502 3444 -8039 -16505
599 -16505 -18314 -10018 3078 13395 17315 14941 4537 -10129 -17724 -15003 -9765 1487 15522
612 15522 18227 12125 4313 -8800 -19072 -14887 -6990 609 14739 19549 10080 2663 -6907 -19617
626 -19617 -16510 -3924 2281 11917 20432 11643 -1266 -7277 -16223 -17708 -4645 5561 11226 17677
640 17677 13638 -1060 -10653 -14424 -15934 -7125 6527 14288 15311 11538 1167 -11547 -16954 -12582
654a2582P282R101J1408J591q442p987r132r243M194J1420O420Q719O278j0274
668H753j2150m477p726m10J4284R340K705O363m890j6529o347j843k058J0881
682d104J3678K754J217k063j4465j0489P35Q96O923J3783N893k558l523r946j1770
697a3039k124M829P339J0756O923j129o475r823r179k636L621Q834J0318N580
711A3795r22n959j0676q530j317L166Q554J1127M889k345n300j0209r610OM752
726h579O200J0937O455l986o047p421j0576k093Q447O436O957Q416k648r750o922
741d174o595m268O935J0054N614N404M11j0217r084m159l900M873J1612P031K078
756A1615K70p599j0991m565l97K739J0025R401J645k221n298j0873o623J507M454
$$ plain form
654 -12582 -5300 3801 15209 16800 8358 371 -8761 -18004 -13810 -2390 4030 12749 19027 8753
668 8753 -3397 -7874 -15600 -16010 -1726 7614 10319 16682 11792 -4737 -11084 -12927 -14985 -4104
682 -4104 9574 12328 13545 11482 -2983 -13472 -12737 -11841 -4918 8865 14758 12200 8677 -1269 -13039
697 -13039 -15163 -10334 -2995 7761 14684 13555 7080 -2743 -11922 -14558 -10937 -2103 8215 13795
711 13795 12873 6914 -3762 -12292 -13609 -10443 -1889 9238 14127 11782 6482 -3727 -13337 -13331 -8579
726 -8579 -2379 8558 15013 11027 4980 -2441 -13017 -15110 -6663 -227 6730 15146 12498 2748 -4174
741 -4174 -10769 -15037 -8102 1952 7566 12970 13381 3164 -5920 -10079 -13979 -9106 2506 9537 11615
756 11615 11885 4286 -6705 -11270 -11667 -8928 1097 10498 12143 9922 4624 -6249 -12872 -11365 -6911
771f911P339R645L385m114o526q397o861P14N829P684P602L945l978p474p867
786e985o231N66O193P900P077L234l390q046p950n086O5O320Q470O401K588l441
802H685p802p640m909P15O177P891O662K395m004p795p019m649J25O735Q562N510
818I639J816l234q309p373l452P43O046Q193N897R46l542p555p465l380J474N795
834c761P977N973N69l869p429p386l203K219N779P408N685Q80m710o920o652l436
850a0876K084O293P571M782J45l758p271p170k469J969O256P941M642n08m074
865E557o858o961k565K937O290O738M675k77m752o765o034k117K297O244P245
880E654M246n27m744p266n698j316K516N706P312L881r05m271p129o522p04L541
$$ plain form
771 -6911 428 10073 13458 9344 2818 -5579 -12440 -11726 -5897 1787 9389 13334 9356 1882 -5985
786 -5985 -12216 -11650 -5457 2443 9520 12754 9364 1318 -6632 -11718 -11653 -5333 3137 9538 12126 8685
802 8685 883 -6757 -11666 -10951 -4774 3117 9779 12174 8170 375 -6644 -11293 -11168 -4433 4129 9639
818 9639 11455 8221 -88 -7461 -10913 -10170 -4124 4069 9966 10912 7370 -185 -7650 -11030 -9556 -3761
834 -3761 4216 10189 10758 6889 -540 -7926 -11129 -8910 -3131 4277 9962 10842 6132 -788 -7440 -10876
850 -10876 -8792 -2499 5072 9854 9999 6241 -1030 -8200 -10669 -8700 -2444 5497 10139 9631 5557
865 5557 -1301 -8262 -10827 -7890 -1600 5138 9813 9536 4784 -1981 -8015 -10132 -7835 -1591 5654
880 5654 9900 9373 4629 -2637 -8335 -9651 -7135 -1429 5883 9764 8859 4588 -2541 -9063 -9767 -6226
896f226N173O921M196j863m622n612o782j597M906N358N697M385j661n625n092
911b444n619k274M457O652M951L732q86o463o228l398j806K958P476N448K191
926H747o46n410p161l774n2K319O617O574J470j412m510o964m655N08M031M868
942E50O279K830k995m546n539n551K6N205N176M864K719k322n766n019m014m00
958h503M121O613M730J613k166n459n600l050o3L550O121N079J329k312n047n791
974d835l890J452M340M605M979K151l387n212m616m365J086N455M739L910K439
989H851l555n980l650l349n64N929O090K180J946j823p122m383j520m06M554O635
1005C833L221J69j840n842n897q38J333K943O051M117L08l562m598m905k350J622
$$ plain form
896 -6226 -1053 5868 10064 8201 3579 -2033 -8815 -10412 -5506 -148 5549 9934 8273 2648 -2444
911 -2444 -8063 -10337 -5880 772 5723 9455 8569 2106 -4122 -7520 -9326 -6368 1108 6556 8747
926 8747 8101 2691 -4470 -8244 -8296 -5977 640 7214 8684 7272 2762 -4202 -8857 -8349 -4318 550
942 550 6829 9659 6664 2118 -3421 -8972 -8946 -3741 1435 6299 9018 6696 930 -4089 -8103 -8503
958 -8503 -4382 2231 6961 8574 6408 949 -4651 -7701 -7764 -4214 1907 6986 8315 6003 956 -4835
974 -4835 -8725 -7273 -2933 1672 6651 8802 5415 203 -4413 -8778 -7692 -2237 2502 6412 8851
989 8851 5296 -684 -4334 -7683 -8247 -2318 3772 5952 7898 6075 -1047 -5430 -6950 -7356 -2802 3833
1005 3833 7054 7223 5383 -459 -6356 -7194 -5861 -2918 3133 7250 7558 3996 -602 -5507 -7857 -6235
1021f235M520M837L480R43l475n541l720k345P65N711N447J728Q40k348o475m281
1037f149R1O1L698P088K580j396j843n588n388m9K130K699N882M306j915l471
1053B736l321n895j459L937L427L742M164m43m742l778l750k520L198N257L056
1068C609K952N87m777n011k603j834J929N628M062J859j52l662n729k807n02J873
1084d578M637M603J570o07l402n107l130m58K355M734M152J679q40l879m991k644
1100e906m44K333N093L816J045m07l736n545k011k6J790M886M792l5q89k471n761
1117c476l159J646J390L929N648L35k575k040m510m349J869L307J966N112J838
1132F931l346l442k222m158l06N080L115K348K928k315n343k123k212j701M377
$$ plain form
1021 -6235 -1715 3122 6602 7545 4070 -1471 -5191 -7536 -6771 -1060 4387 6115 6955 4607 -1868 -6149
1037 -6149 -6058 -5997 -2299 4789 7369 5973 4130 -1458 -6846 -6895 -4765 -2066 3816 8122 6207 2736
1053 2736 -585 -6480 -7939 -4002 -575 3167 7331 6888 2146 -1632 -5382 -7902 -4704 553 3609
1068 3609 6561 7148 2371 -2640 -5243 -7077 -5148 480 4542 6401 6249 2587 -3142 -5949 -6451 -4578
1084 -4578 59 4662 6232 5625 2223 -2884 -6014 -6472 -4117 617 4769 6448 5608 1729 -3262 -5906
1100 -5906 -6350 -4017 1076 4892 5937 5530 1794 -3751 -5762 -5788 -3998 888 5680 5645 4756 2285 -3476
1117 -3476 -6635 -4989 -3599 330 5978 6313 3738 1698 -2812 -7161 -5292 -1985 -19 5093 6931
1132 6931 3585 143 -2079 -6237 -6543 -1463 1652 4000 6928 4613 -730 -2853 -5065 -6766 -2389
1147b389N199J320J517m96n485m102l27p48K560N807K400m86n83l987m772j064
1163e636J330J280N155L560o31j886k591m607k178K124K103L620L747Nk019l485
1179a09m052j494J138K972L611L307r4k307l049m147j702K223K337L558L486n59
1195E119k602k545l919k126K338K944K746L613k49l664k609k177k996J907M474
1210B54J687K541J418l795l990j068k372O52N174K737R72J289k886m821j777m01
1226d386Q9M183L865M41L82j835m814k734O01O79K847M483Q50p48j482l790l701
1243e070J40J664K845M105J295j037k370l072l175l39K157K877L351J767j396
1258C742k725k583k855j43J808K983L307J431r36l047l224k138k65K345K481L061
$$ plain form
1147 -2389 2810 4130 5647 5151 -334 -4436 -4763 -5511 -2951 2856 5256 4770 4187 200 -4572 -5636
1163 -5636 -4306 -3026 2129 5689 5058 3172 581 -4026 -6204 -4080 -1977 1643 5390 5395 3376 -109
1179 -109 -4161 -5655 -4517 -1545 2066 5373 5279 2972 -77 -4224 -5926 -3703 -1366 2192 5678 5119
1195 5119 2517 -28 -3947 -6073 -3735 -791 1955 5568 5319 1655 -954 -3131 -6127 -4220 254
1210 254 1941 4482 5900 2105 -1885 -2953 -5325 -4673 501 3238 4210 5499 2613 -2208 -3985 -4386
1226 -4386 -4297 -114 3751 4192 4574 2739 -2075 -4809 -4208 -3529 -682 3801 4651 3903 2421 -1369 -5070
1243 -5070 -4930 -3266 -421 3684 4979 3942 1572 -1500 -4675 -5014 -2857 20 3371 5138 3742
1258 3742 1017 -1566 -4421 -4564 -2756 227 3534 4965 4029 982 -2242 -4380 -4645 -2300 181 3242
1274C242J655j163k944l028k196l53K835L030K144J405p89l201l047j568n80K318
1290b240L675K034Q25p61l111k897j540j79J662L987K288M21r43k625l515j228
1306d147L35J732L111L042L93j543k479l179j524P31J902K820K643N71j414k613
1322C81l342j534P32K551K573K492L06j696k630k485j505M54K407L053K009J10
1338C876j524k738k591r35O57K195K803K112J82j651k861k473j163O58K697K598
1354A842K093m6j864k539k408j057J180K074K805J780l27j831k444k657o16J121
1370b894K284K397J834K2k171k304k376j174J593K685K237J568p6k077k566k089
1386c107r01J393K694K087J350k22j854k634j746p67R20K916K362R20j31j801
$$ plain form
1274 3242 4897 3734 790 -2238 -4434 -4787 -1952 1078 3222 4627 3838 637 -2410 -3978 -4558 -2240
1290 -2240 1435 3469 4294 3533 422 -2475 -4015 -4194 -2532 1455 3743 4164 3221 596 -2919 -4147
1306 -4147 -3812 -2080 1031 4073 4466 2923 444 -2735 -4259 -3528 -1626 1194 3837 4408 2994 381
1322 381 -2961 -4495 -3763 -1212 1361 3853 4159 2463 -167 -2652 -4157 -3703 -1296 1757 3766 3876
1338 3876 2352 -386 -2977 -3912 -3255 -1060 1743 3855 4037 2386 -475 -2948 -4111 -3453 -756 1842
1354 1842 3935 3889 2025 -514 -2922 -3979 -2799 -725 2080 3860 3533 1702 -742 -3399 -4015 -2894
1370 -2894 -610 1787 3621 3643 1472 -832 -3208 -4382 -2789 -104 2133 3701 3625 1548 -1018 -3107
1386 -3107 -4008 -2615 79 2166 3516 3294 1440 -1194 -2940 -3707 -2787 129 2491 3411 3280 1479
1402A479k700k188l91J605J780K955J183n09k045k471j984l05J302K714J859J105
1418C389k58k113k733j453k71J209K596K258O70k76j972k747j331k81R60K884
1434E31K283L50l90j847k792j573J97J265K573K701J45j139j652k462j610N61
1450b859J299J820K573Q01j148k106j979j772M1K018K013J788J151j262k295j877
1466a794j271j86J752K709J687N30j257j939k225j167K38J663K166K080J07r54
1482B139j870k219j439N35J799K033J966M30j678k003j642j130M08J589K505J082
1498B505K03n79k267j997q17M90J562K341J495l46o34k035k827R8N67J101K413
1515A273K072n70j455j214k370j251J575J192J542K552m55j781j240j733j925
$$ plain form
1402 1479 -1221 -3409 -3800 -2195 -415 2540 3723 3214 1169 -1302 -3286 -3591 -2289 425 2284 3389
1418 3389 3131 1018 -1715 -3168 -3439 -2230 366 2624 3294 3018 1046 -1701 -3032 -3313 -2353 531
1434 531 2814 3164 2774 927 -1865 -3438 -3241 -1976 597 3298 3443 2304 652 -1810 -3420 -2859
1450 -2859 -1560 260 2833 3634 2486 380 -1599 -3371 -3330 -1312 701 2489 3640 2378 83 -1794
1466 -1794 -3065 -3251 -1499 1210 2897 3427 2170 231 -1994 -3161 -2923 -1260 906 2986 3093 2139
1482 2139 269 -1950 -3389 -2854 -1055 978 2944 3374 1696 -307 -1949 -3079 -2671 -1082 1423 2505
1498 2505 2708 2129 -138 -2135 -2952 -2462 -900 1441 2936 2590 1956 -79 -2906 -2808 -2241 -1140 1273
1515 1273 3345 2775 1320 106 -2264 -3515 -1940 -748 794 3346 2891 1110 -130 -1863 -3788
1530c788J646K241P67J727P43k522j466j028j591Q04K825Q85J016P88j927k433
1546a313n75r86L49K597J662N55O50j741k264j287j95L51K065K142N12J31j302
1563A351k327j576j18N12K191K076K21J30j299k487q91k15N83K065K030K00k50
1580B196j201k432j115K43P76J218K510O33r71q60k143j659L89J230J182J875
1596A871J151j185j418j250k034K53J645J448J208J352q64k047j171j382m17J885
1612i55J733R98R94m81k432j628j42k59O78K295J046L67l05j642k105n99N49N47
1630a341J777K098M6q94j308k013j000Q94Q54J449K081k86r84r15k104o98O19
1647a725Q07J707J527J3j127j252j534q84M75J441J355J598K8j159j409j441j112
$$ plain form
1530 -3788 -2142 99 866 2593 3336 814 -652 -1680 -3271 -2467 358 1243 2259 3047 1120 -1313
1546 -1313 -1888 -2874 -2525 72 1734 2289 2939 1198 -1066 -2353 -2548 -2197 -132 2010 2522 2653 1351
1563 1351 -976 -2552 -2670 -2158 33 2109 2330 2460 1161 -1326 -2217 -2432 -1849 216 2246 2446 2196
1580 2196 995 -1437 -2552 -2309 -1533 -315 2195 2828 1857 997 -1146 -2805 -2416 -1186 -4 1871
1596 1871 3022 1837 419 -831 -2865 -2612 -967 481 1689 3041 2177 130 -1041 -2423 -2840 -955
1612 -955 778 1776 2770 2289 -143 -1771 -1913 -2172 -1494 801 1847 2214 1909 267 -1838 -2437 -1888 -1341
1630 -1341 436 2534 2580 1686 378 -1635 -2635 -1741 -887 562 2643 2357 1373 458 -1646 -2344 -1725
1647 -1725 -918 789 2316 2329 1202 -50 -1584 -2468 -1993 -552 803 2401 2429 1270 -139 -1580 -2692
1664b692J061J000J366J617J44j481j489r63j237Q05J663Q69J431M54j544j222
1680b18j198j140M04J975J228Q40K39r17j869o01r60J88J931J664K46ol97k094
1698f85j056j97N23J003J832J058n83o69j622j715NQ89J010J450O88Q3j102j432
1716e20j255p25J102J277J071J046j45j071j593r80k07O20J177J336P02k35q28
1733G72j619r90k26P46J189J683M58q7j218j548j233qQ53J226J464P21m58j251
1751D74j251q25m97Q48J549J071O07l90j147j203r66l94Q68J767J103J75o1j445
1769B83j345o86mP59J286J190M14l36j075j693n00R9N88J280J268L44k80j393
1787A99j411m82M1P09J150J557M7p54q75j393p56L08R13J603O68K30m45j229j266
$$ plain form
1664 -2692 -1631 -631 735 2352 2496 1015 -474 -1437 -2674 -1869 -206 663 2094 2548 1004 -218
1680 -218 -1416 -2556 -2152 -177 1051 1891 2130 1213 -656 -1257 -2217 -2029 -98 1566 1812 1806 1409 -685
1698 -685 -1741 -1938 -1415 -412 1420 2478 1895 1226 -396 -2111 -2106 -1217 -207 1243 1931 2014 912 -520
1716 -520 -1775 -2500 -1398 -121 950 1996 1851 780 -813 -1793 -2000 -1380 -203 1133 1835 1600 772
1733 772 -847 -1837 -2063 -1317 -128 1555 2013 1926 708 -840 -2073 -2081 -1228 -2 1462 2183 1725 474
1751 474 -777 -1602 -2099 -1251 298 1369 1976 1586 439 -764 -1730 -2124 -1256 511 1614 1789 1728 283
1769 283 -1062 -1748 -1752 -993 293 1483 1897 1561 486 -1207 -1707 -1608 -1020 260 1528 1872 1592 199
1787 199 -1212 -1694 -1653 -944 206 1763 1810 1056 181 -1212 -1968 -1660 -747 856 1524 1754 1309 80 -1186
1806a186o00L99O57J178J408M1o99r29j554n28L65J096J015J075J0p89r70j016
1824a027q33N24Q19J052J002J43q50p90j116o19J36J251J164O71L85j009j337
1841d34o54q73N76J032J250M99J83p00j236p47o91O02R36J274N23K99r43j440
1859e44q73k50L89J343Q34O54j43q00r70j133l21Q71P31Q31Q56l6r99r23o85n72
1879a740O96J022R84O63j90q35r57r65k89M30J187J075N10j92p41j036r73k49
1897a600P60P36J309K63Kj007j192q81L19K67J092J055M41k39j081p77q92k21
1915a646J094P42J002K71k02q34j383l66k24O01J104J093J84J7j022j248p86J44
1933a459O15R39R83M08k73j088q86o43J39P28P63R04M71n35n68j217m95j92J147
$$ plain form
1806 -1186 -1786 -1387 -730 448 1856 1897 1198 269 -1285 -1813 -1448 -352 663 1738 1748 959 -11 -1027
1824 -1027 -1860 -1336 -517 535 1537 1680 830 40 -1076 -1695 -1559 -308 856 1527 1912 903 -434
1841 -434 -1088 -1961 -1385 -353 897 1396 1579 879 -357 -1104 -1795 -1193 -257 1017 1540 1839 896 -544
1859 -544 -1417 -1667 -1278 65 899 1553 1410 610 -360 -1493 -1814 -943 -212 619 1475 1439 440 -483 -1168 -1740
1879 -1740 -1044 -22 962 1625 1435 600 -357 -1322 -1611 -1181 6 1081 1591 1399 658 -378 -1351 -1600
1897 -1600 -840 -104 1205 1468 1470 463 -729 -1610 -1291 -1024 68 1123 1564 1325 244 -533 -1425 -1646
1915 -1646 -552 190 1192 1463 1261 427 -956 -1322 -1546 -945 159 1252 1436 1453 431 -817 -1603 -1459
1933 -1459 -844 95 1078 1486 1213 125 -761 -1404 -1265 -537 226 1130 1601 1066 498 -719 -1214 -1406 -259
1952b59O46N26M29m11p60q97q27J81P98J065O68J01j86j173q59l17j39O73J226
1971D85N36L52n88q07j161j73M47L23J245P68l66k62q09j033m55N94K25J136R36
1990A393j4r31l03j139l29M62P06O48P78K75j082p49m95o53L93O80Q04O28J71
2009A243q00q00l76p24N46P61Q77M21L17p34j043q53N7J08Q06Q26O16j46p6j137
2029a11q39k39K41Q68Q30M53k29l24q81o34j69K49O77R25K26P6o80q88p70J93
2049a026L76P75Q45O4k65k56j078o23j5M58P31P00O61n05p28l30o35m05O54O44
2069D2O90N68l5j035p00l73m80P08N51P96N17j82r10q07k11k69N52O22P28L92
2089A164j71q02q20k67j12N10P91P00j01l6p75p43l64j34P08P58L99M94j49j032
$$ plain form
1952 -259 387 913 1342 931 171 -726 -1553 -1372 -574 491 1159 1260 1074 -99 -958 -1275 -1414 -741 485
1971 485 1021 1373 785 -22 -1183 -1356 -909 -586 659 1427 1061 799 -10 -1043 -1498 -904 -679 457 1393
1990 1393 1379 448 145 -994 -1323 -861 -155 493 1271 1546 464 -285 -780 -1433 -1040 -360 444 1072 1243
2009 1243 443 -357 -733 -1457 -911 -150 727 1148 1465 731 -312 -1165 -1108 -1000 -194 632 1248 1102 1026 -111
2029 -111 -950 -1189 -948 -80 750 1203 974 650 -231 -865 -1034 -785 -108 817 1043 1119 439 -449 -1219 -1026
2049 -1026 -650 125 970 1034 769 513 -565 -1188 -1203 -745 -14 686 1347 842 114 -216 -851 -1256 -602 42
2069 42 732 1300 1265 230 -470 -843 -1323 -615 -64 732 1249 1067 157 -650 -861 -1130 -578 44 772 1164
2089 1164 993 191 -629 -896 -1008 -498 293 993 892 856 81 -662 -1026 -1160 -452 306 705 1199 1050 18
2109A8m64o78P1O15O03Q02P7k02p65j122r7K28L60P32O58J29l84m11j023k16L90
2130f79K93O76O80J24o43m29o02n33J23O49O40O31J09p07k66o92o12M07L72P71
2150C12M63L22n74q14m93k08O2Q11O23N51j47l91m80n73m23k4Q74N44M58j30q1
2171F82p63o38n81M51Q20M79L18O3n32n44l38k68rP66O99J56K63m24p45n31j08
2192g84m6N65O75K78K93k94q87n70J11j92P86O36L91k55k64n62q38OO22J11Q13
2213E95L10J69p11n70n23k15N21L94P09L40k33n60l27o57j53L40P43L87J20J29
2233H08o62o03k05k40M37P74K41L13k9q99m29k48k8K88M76P60J8k14m40n27k53
2254f62lJ84M39P91k11j30l06o46r7n3r5J113L51K34k37m58l66m32k6J64Q28N43
$$ plain form
2109 18 -446 -1124 -1053 -438 165 967 1044 842 77 -1045 -1142 -914 -554 178 836 965 581 170 -853 -1069 -679
2130 -679 -386 290 970 1094 451 22 -580 -1113 -990 -341 299 930 1039 332 66 -626 -1238 -831 -459 312
2150 312 775 1097 523 -291 -784 -992 -930 -119 504 1055 908 517 37 -536 -959 -983 -109 435 893 763 682
2171 682 -81 -719 -1300 -849 -29 450 768 831 299 -245 -583 -851 -860 -94 605 761 1024 600 -145 -676 -784
2192 -784 -830 -265 410 688 981 687 -200 -770 -659 -851 -65 571 962 707 443 -119 -957 -951 -329 -218 595
2213 595 905 1074 363 -207 -730 -945 -424 -30 679 1019 786 226 -101 -758 -911 -571 172 559 679 808
2233 808 146 -457 -662 -902 -465 309 550 863 834 -65 -494 -742 -770 -482 -6 754 772 558 118 -409 -662
2254 -662 -665 -481 -42 749 538 408 102 -544 -641 -694 -789 324 675 909 672 214 -152 -584 -610 -446 382 925
2276I25k99j88l09n29j08k19N53K89M55J87k86l79m69k62k03O48N52L90J55m72
2296D31n13l19m16M4L48P28M08M20o40o35l69j43j0N26M81K51J59k83n01o32j78
2317h43L87M10N02L29p3l09m01n52n7k49O69K69M10K00j07o17l12l54J49L25N98
2338C74J51J07K1p00o19j06K20M08P02%J19l75m81k90j44L52L13j7O42j42j75
2359C60n98l78j54M57L74N00J53J85o48m50l80j03k2P43N33J2J34n12m51l75k65
2380h85M90K76M93J16K54p12m14j60J17L7O38N83j70j02j12m20o16k23M52K67
2400i1L35M60m65j15k83k66l92L25N10M66K38j46n47o3o14N7J01N06O61j54Q9
2421F12o80k01m72J72R7N05N29j84O7l81k16m20L9K15K76L46M39k29m85l71Jk01
$$ plain form
2276 925 626 438 129 -400 -508 -727 -174 115 570 757 471 92 -377 -639 -842 -194 358 748 903 431
2296 431 -82 -401 -817 -773 -425 303 711 1131 491 -144 -513 -656 -666 -140 341 592 751 468 -33 -665 -843
2317 -843 -456 -46 456 785 712 403 2 -550 -607 -856 -187 82 492 692 585 -32 -344 -698 -549 -224 374
2338 374 525 632 653 -47 -666 -772 -552 -144 558 558 677 302 -179 -469 -613 -261 52 35 677 535 360
2359 360 -238 -616 -770 -313 61 561 714 899 251 -199 -579 -682 -704 39 572 584 718 206 -245 -620 -885
2380 -885 -395 -119 374 490 744 32 -382 -542 -425 -388 250 833 663 561 449 29 -587 -810 -358 -91
2400 -91 244 704 239 124 -159 -425 -817 -492 18 484 722 576 29 -34 -648 -591 -490 16 677 523 612
2421 612 -68 -269 -741 -569 -472 33 562 378 445 64 -152 -572 -533 -318 -42 304 743 514 29 -342 -341 -542
2443e42L30N19J89M1J62o63l09j30j34K52O40J1J76j76l67l34l36K93J54J09N98
2464D83r9K43n21n29N8O2K08K18O07m30J01n56k07r8k18M01N02L21j26J89p18
2485a09j78k39Q4N04M21k13J53j97k36m17q5q3N27P19l7j96j50m64l16L4J33J87
2507a58L04L69o4k49j6m68l60M14L06K61J27j00j50q3n88o1L28M9P14q7J8k61
2529B45m57j42j14J08J64O18o2L4j65m42k25o6M49J27J97K47m3j88l10n82J7O2
2551e28N15O07p1l41l6j65k30m38L47L14N39N2o7l94r1k07q8R7J37R3L71p9k12
2574A25j00m54K16LJ59L99J33j42m03l07n1K26Q9O3N15J7p7l78k20k63J64J55
2596a31K05M25k36j89j80k59k9J34O6K15N47K19m83n7n84l50L55O2L89J38L25
$$ plain form
2443 -542 -212 307 496 537 699 36 -273 -403 -537 -285 355 366 542 366 -1 -335 -671 -378 -224 -115 483
2464 483 384 627 106 -423 -365 -303 -95 123 730 300 401 -155 -362 -460 -678 -277 225 546 420 609 -109
2485 -109 -287 -526 -442 62 483 270 423 226 -10 -427 -512 -595 -68 651 614 418 268 -196 -512 -478 -345 -158
2507 -158 146 515 451 202 186 -282 -642 -228 78 339 466 366 216 133 -455 -516 -188 -139 575 488 506 245
2529 245 -212 -354 -468 -360 -196 422 360 394 229 -213 -438 -504 -55 72 269 516 473 285 -25 -607 -590 -528
2551 -528 -13 594 523 182 146 -19 -249 -687 -340 -26 513 565 498 104 13 -194 -282 -185 -48 45 416 337 125
2574 125 25 -429 -213 -210 -51 348 481 339 -64 -371 -422 -196 -107 -44 471 488 411 33 -187 -450 -286 -131
2596 -131 74 499 263 74 -106 -365 -394 -260 -194 21 568 787 304 247 -337 -687 -332 -270 119 257 582
2617E82l17l52l8j74k16N61p4L85K5k02j65l07j84K15K63J95K44j11k95k12j17
2638b94J29j02P6K43M16N5n01j61j23m7n5L14M17j61J91m42J17l30k22L94r0K86
2660A10K36J68k00J1p50K67j85J03M29J42J64l98n8l85K0j3K83M55J42j79k14
2681A48j18k66k85M44j5J21K58rp5n23m3N1J17o1K22K92r6j35k11k59j8J48K45
2704f8L65K13Lp79M03l60k21Q6N48P0J0Q8m22N6j90k17J46M41k00N53l14j98n7
2727d4j91R5l08M54Q4lJ09Q3m56j52j17K52K95L4J51J8l03j60q3j88K85J7N59
2750D31l17J00j11l34J29j19p6L70K57j64Q9k10l3m60L5K98j0L89J60k36pk50
2772f9l87%O9O08P1K65l26m26j63K86k58J68R6J60M67l83j03l79r6K00J86l1M66
$$ plain form
2617 582 265 -87 -125 -299 -515 46 -28 357 382 180 15 -292 -476 -261 2 197 441 330 35 -177 -294
2638 -294 -165 -267 -191 52 468 523 22 -139 -262 -309 -364 -50 367 206 397 -45 72 -258 -480 -86 -176 110
2660 110 346 514 314 325 -425 -158 -343 -240 189 331 495 97 39 -346 -326 -339 -56 399 541 362 148
2681 148 30 -236 -521 -77 -92 29 287 278 203 -320 -363 -312 -195 -256 -34 258 162 27 -184 -443 -461 -313 -68
2704 -68 297 510 513 -266 137 -223 -444 -358 190 260 270 358 -64 -8 -198 -415 -269 172 -28 525 211 13 -44
2727 -44 -235 -140 -448 6 90 87 196 279 -177 -329 -446 -194 101 135 286 304 1 -159 -242 -430 -145 -128 431
2750 431 114 214 103 -231 -102 -221 -297 73 330 166 255 45 12 -448 -413 -115 -125 264 424 188 181 -69
2772 -69 -456 -456 -387 221 292 557 231 -195 -358 -72 -330 -162 -66 94 561 178 75 -304 -400 -200 -14 -45 421
2795D21m08K36m79J4k72K07J62N6K09K46j11l74j0l01Q8K53O2J54J63r4k46k13
2817b37m8PJ39M61J82k65N4l19j1k13l2Q9N93k84K46R0m71m22n3M47K1K55J57
2840C86j25n8k69j35J07r2M17m8K02k56N5k39k08p6L14K7J43K9L20l31j42o13
2862e92R0N98rL77o8k57k3l17L8j40OJ28K27J17K44l51k45j85K22j72J01J69J83
2885A41K95l51k81Q0k09K73k42M53n5J44q2n15M41m52J49J45J22J27n0J1m07O0
2907b03J00k57L29J95j9o6K0J0m39M7K97L0J72j1K8k88j76Nk1J96K40K43j07k07
2931A18j52j95j8K23k02L01K42M0o9m64J61k79j9M52q8M30K6n31M7j54O6l32R1
2954c06J80L80rj8l99j16L3lO0J94K68n4j0k83l23J33J94k1J25R1J11j48k07k30
$$ plain form
2795 421 13 249 -230 -216 -488 -281 -119 -63 146 392 281 -93 -103 -404 -316 -63 -1 153 316 222 -24 -237
2817 -237 -285 -278 -139 322 504 239 293 -26 -37 -250 -282 -193 400 116 362 452 -19 -441 -494 -47 -26 229 386
2840 386 261 203 -66 -201 -94 -186 231 183 385 129 184 -55 -263 -339 -25 2 145 174 494 163 21 -592
2862 -592 -502 96 87 464 396 139 116 -201 -163 -303 -297 -169 58 175 419 68 -177 -362 -140 -312 -211 -42 141
2885 141 436 85 -196 -116 -325 -52 -294 159 104 248 166 -349 92 -360 -211 -66 56 183 133 144 -263 -203
2907 -203 -103 -360 -31 164 145 79 99 109 -330 -283 14 44 216 205 233 -55 -231 -226 -247 -51 189 432 325 118
2931 118 -34 -229 -247 -24 -226 75 317 357 288 -176 -15 -294 -313 139 51 481 507 -24 23 -131 -65 -397 -306
2954 -306 -126 254 245 227 -172 -288 -255 -258 -198 -4 264 210 200 -83 -406 -273 -79 -100 25 116 227 79 -128 -358
2978c58K17J6p7M32j14J46j57j55l01J46J17J58p7K55j78nk1k34j01J70M19k23
3000G5P6j28K4j07m5k60l9L16L16qj65l74K65k19j12nM04p5M51k10q4o7l18J19
3024a70P9K68j70M4J59j12j92Rj03l9k5M07q3L22n41j32J60j05P8J53N4K20k75
3047Fj48o3J40k66mN51lk4j85j9j04k80K52J63j03J92J07k05K63m74m1M2O4L48
3071B09n8L04l35j80j29j48J74Q7K63K30j33j13m17M8l2j06J80K94r7J92Oj31
3093A08k13n6j96L61J97j30J73m3j34l14k4J44j8L02j2J85p0k80L5l27L37k63
3115b38L54P3o6q2n6oml95K87K36j23J45j60j42M0j48K79n3K30m3J38r7j97O4
3139C6j80j82K16J67J07J48p2K2m62n4j5K5L13L15k35j94Q9o7q5o8R8L8M16Pl67
$$ plain form
2978 -358 -141 -125 -202 230 116 262 105 -50 -351 -205 -88 70 -7 248 70 65 44 -190 -291 -121 298 75
3000 75 151 23 47 -60 -105 -365 -404 -88 228 220 55 -319 -54 -273 -385 -390 14 -61 390 180 96 29 -289 -170
3024 -170 -91 177 7 51 210 98 -94 -85 -188 -227 -252 155 72 394 -147 -279 -119 -224 -146 7 61 281 6
3047 6 -142 -205 -65 -331 -335 216 213 189 4 -15 -119 -399 -147 16 -87 105 212 7 270 -204 -245 -203 -139 209
3071 209 151 455 120 -60 -189 -337 -163 -76 187 417 284 171 -246 -198 -230 -336 -156 138 41 233 239 108
3093 108 -105 -161 -357 4 201 71 244 201 67 -247 -271 -127 -145 157 145 330 260 -20 15 -312 25 -238
3115 -238 116 189 123 41 -15 -21 -25 -420 -133 103 -20 125 -35 -177 -137 -285 -6 -59 171 128 266 169 -28 36
3139 36 -144 -326 -110 57 164 312 240 262 -200 -254 -269 -244 69 384 149 -45 44 -23 -108 -176 -78 -40 376 383 16
3164A6j91J89k43J54KL46J17l32j49o7J63k23Q2P9N2K88k69M8k04op3K6j05L76
3188G6J05L0q8j49j03ll8L57q3K6R7j67Q4l13n5L69j46J44qpP5l6j67k53j27K42
3214a38K21J33p7m9o5l56K21j15L20l4J99k81L11k41Jj19j59J55K82j00L3J38
3236B80k47j27l7j53L92J72nk85O3l10K87k57K20K42m9m7J08k79R2n02K60K65
3258H3P6p3J37l7k27J09l97L03O8J60k55L44j63k12M7n8j30K90j06K58j01J23
3280B39l12R1j70K11k99L09J00j49Q1j59R7l50J75R9j23J47l7L0Q5k51R2L8R1
3303C5j26J86j7J10k24Q5k37q6J93L15k12o4R2J09J36m45J05M2k2J41j40Q1J19
3326A76k11j64J60PL4K12j04L9n5k76j37K66Q1J28j3j50M9q0KJ90j2j37j18J38
$$ plain form
3164 16 -175 14 -229 -75 -73 273 390 58 -91 -158 5 -218 -136 -57 -5 283 14 62 -142 -148 -221 -195 -300 76
3188 76 181 211 123 -26 -129 -132 -170 187 104 130 227 60 144 -169 -224 145 -1 143 135 128 203 167 0 -253 -380 -138
3214 -138 83 216 139 90 25 -331 -110 -225 95 61 260 -21 290 49 50 -69 -228 -73 209 109 142 280
3236 280 33 -94 -131 -284 108 280 275 -10 53 -257 30 -227 -7 235 186 139 247 -32 60 -442 -182 83
3258 83 159 86 223 186 -41 68 -329 -26 42 202 -53 291 128 -84 -37 -95 -225 65 -41 217 116 239
3280 239 -73 18 -152 59 -240 69 169 20 101 -58 39 -311 -136 -37 -160 -13 -50 -20 65 -186 -94 -56 35
3303 35 -91 95 78 188 -36 49 -188 -274 -81 234 22 -42 50 159 295 -150 -45 -3 -25 116 -24 57 176
3326 176 -35 -199 -39 -32 2 214 110 149 94 -182 -319 -53 28 156 143 -7 42 -38 -36 154 142 5 -113 25
3350B5L0L26m35k23j5K44K24n8k04J27j5j71j02PJ08K08J00J87j61k22j82K66
3372F4l18L24r9J08L18j44l10O5m3n88N01J85O3Q9l8j47jk17j47L63m0J33p9K03
3396B45l76J13Q3j51j63L86j68r9M95l71j1j36L06l02Q8K69k59J02j33O0k56L84
3418A06k34K17J22n7j74Oj20O8k7L3J87j55N5r5J32j72K90m27J09p3K55r0j17
3441a61J09j49J32J32k12K50L30l09K30l60K2j40J26k22L92L2j14j39J23k62j53
3462c43J65J73K9J41j83r1K01R4k53J53k00K48j06q9J79J9k89L3j22OJ71J48k41
3485a57J42L0m4j54J94k4L21j50N3j39j71J65q1q0J20lJ26J12q9j86L2l23K66
3508d0m5K56k10J68j5k24q7j2j12L16R1j68K08J05l50N8l0n3k6J71J36q9K96n61
$$ plain form
3350 25 55 381 -54 -277 -292 -48 176 118 -86 41 26 -145 -247 -240 -132 76 176 363 202 -20 -202 64
3372 64 -254 70 -29 79 397 253 -57 8 -35 -623 -122 63 126 215 177 30 29 -188 -335 28 -12 121 42 245
3396 245 -131 -18 65 -86 -249 137 -31 -130 365 -6 -17 -153 153 -149 -61 208 -51 51 -82 -22 -278 106
3418 106 -128 89 211 154 -20 -14 -134 -66 -93 -60 127 -28 27 -68 64 -108 182 -245 -136 -209 46 -44 -161
3441 -161 -52 -201 -69 63 -149 101 431 122 352 -8 14 -126 0 -222 170 202 88 -51 72 -190 -343
3462 -343 -178 -5 24 165 -18 -109 92 186 -67 86 -114 134 28 -61 118 137 -152 -119 -241 -235 -64 84 -157
3485 -157 -15 15 -29 -183 11 -13 308 158 211 72 -99 66 -15 -95 25 22 148 260 171 -15 17 -306 -40
3508 -40 -85 171 -39 129 114 -110 -197 -209 -321 -5 86 -82 126 231 -119 -61 -91 -144 -170 1 137 48 344 -217
3532b17J68o8NJ20J63r9O0n0l5k0O3j78R0N8Q9p3k38J55Q8o4m12L16L99k84J97
3557B33k13Q8l95L70k54J06J83j19N9J88m13j18J44J12K19j62J56p3j12j11K79
3578A67l14N6J37j82J8J84k01k4L00k86K41N6R1k51K02q0j15l51L79q6n8J99j15
3601c3M45k13l81k8K62k55K13l2Q8Ro8j6j46O2pK8L43k02L3L06n29P2j84J95j7
3626e5M5J15j56k3K3k9J2Q7P1MN8J08k15j1q9N7R0n1j7Q3r2J05l8k63Q9J43N1
3653A02j29j3M13j93j90q3J52k71K15J95k91J0K01k15J41j78M0O2l34L62K07K6
3675B29n48K30NOq1J74L28l80m4p8n6K2J93J83k16J11J2J30p3k32J13k15L29M0
3699A82R2k63k0k0P4j18j18L07j58k56K57K0R2J3p5P4k07L37j21p1RO3j07J56
$$ plain form
3532 -217 -49 -117 -112 8 171 72 132 82 47 27 90 -88 2 60 149 76 -162 -7 81 17 -395 -79 320 36 233
3557 233 20 108 -287 83 -171 -65 118 -1 58 246 -167 -285 -141 -29 190 28 184 111 -1 -112 167
3578 167 -147 -91 46 -136 -118 66 -135 -159 141 -145 96 152 243 -8 194 114 -1 -352 27 -59 -117 82 -33
3601 -33 412 199 -182 -210 52 -203 10 -22 66 75 7 -9 -155 -93 -100 -72 271 69 102 408 -121 -49 -233 -38 -55
3626 -55 -10 105 -51 -74 -51 -80 -68 19 90 94 152 260 45 34 -55 2 92 41 24 107 15 120 82 -181 -92 51 102
3653 102 -27 -40 373 180 -10 -93 59 -212 3 198 -93 -83 118 -97 44 -134 -94 -32 -366 -4 203 229
3675 229 -319 -89 -84 -78 -159 15 343 -37 -81 -159 -215 -193 0 183 -33 78 90 220 147 -85 28 -187 142 182
3699 182 274 11 -9 -29 45 -73 -191 116 -42 -298 -41 -21 71 84 9 83 -124 213 92 21 30 93 -14 142
3723A42m25K89J50k9j63j26J93j54K77l27K70K98o17M83l06l2q6K30pJ08k41K33
3745A60k3l11Pq8N2l7L01R9k6Qj22J72j73pK02j19P2j33m8k22K51J73l06r1K12
3770Cq8O0j79R8J67l1j84L48m8N1r0r6J98k86K21k90J82JJ25M8l01pL0Q3k56M29
3796A88l48K13Q7r8k01K58k55j6J62K3K1l6%K11k37oL9j95K30l6K1k15K83l23
3820b30K29k37K27J03M9k47J91r7K12n44L76j01MJ39r7Q2L2k31lJ70l4J21k23
3843a09M2m0l3nj62K27L28k44k5q8J28q9N9k67L65q1J56mk64o3l8P8k0M04k68
3868a3j37L82j0k73NJ44j82N1K95l18J04%j84J91m5K8j0L7j50J20L8j31J05j05
3892e8Q0k8L7J72k29J6J42j86n7J81J86k69n4K23J8j43l4L8o2P1n2o0jo4J6J24
$$ plain form
3723 142 -283 6 156 127 -36 -162 31 -123 154 -173 97 395 -222 261 -45 -77 -163 67 60 168 -73 160
3745 160 137 -174 -167 -255 -203 -240 61 160 134 142 20 192 19 12 214 95 167 34 -14 -236 15 188 -118 -209 3
3770 3 -85 -25 -204 -106 61 30 -154 194 146 197 107 11 209 -77 144 -146 36 37 162 210 -91 -98 -68 15 -241 188
3796 188 -160 53 140 42 -159 99 -156 -172 -10 13 34 -2 -2 209 -28 -34 5 -190 40 4 25 -190 93 -230
3820 -230 -1 -238 -11 92 141 -106 85 -12 200 -344 32 -69 -65 74 -23 59 91 -140 -143 27 -7 114 -109
3843 -109 -67 -107 -140 -145 -307 -80 248 4 -21 -109 19 -70 -11 -278 87 6 162 158 -106 -169 -207 -129 -149 255 -13
3868 -13 -150 232 222 -51 -46 98 -84 -33 262 -56 48 48 -136 55 10 38 28 65 -85 35 73 -58 47 -58
3892 -58 22 -6 31 203 -26 -10 132 -54 -111 70 256 -13 -67 156 174 31 -3 35 -27 44 -8 -68 -69 -133 -117 7
3918Gj63j6K01J8j55J07J5j60p2K12l21M09k35K66k41J4L93l04l3K1OJ52j20K69
3942B70j31j27J25j4j02K0M3j65J48j02P5j04L5j54o6K19m2o4P6j6k48L51l17
3965b90K29R4k05L69j81Oj32O0K59pk75J79J30n47K81%m5j8O3J34Q9j72k9k77
3989b85J34J05K8r6K55K49l76m1n8J24j73r3N58k81L6j45m6K08l7j02k44K30p7
4012a27L22l41K2J30q5J27J37j57l5J42R0k76J40K7l81J6K69k0k1j57J7P2N4L1
4036dj02p8J99j33P0J51Q0j53J72K2k51M2J76j21j31O4M2Q3j53K32l29J29j12
4059a05L40j72o2J56l73K26J61l58J60K7J8K78l68R9j25J26k81J16J64r4p7J54
4081A0J21J15k54k0J47k91K68R6j51j17lP2J42m0J04k46J01k46N5J78J48k3jj69
$$ plain form
3918 7 -156 -172 29 47 -108 -1 14 -146 -218 -6 -327 82 -153 113 -128 -114 279 -25 -58 -37 -31 121 1 270
3942 270 139 12 137 123 21 41 84 -81 67 -35 40 -64 -29 -183 -249 -30 -72 -136 -60 -76 -324 27 -290
3965 -290 -61 33 -172 197 16 22 -110 -50 209 202 -73 106 236 -311 -30 -30 -75 -93 -30 104 193 21 -8 -285
3989 -285 -151 -46 -18 -114 141 390 14 -27 -85 39 -134 -227 331 50 86 -59 -105 103 66 -36 -280 -50 -127
4012 -127 195 -146 -124 6 -79 48 185 28 -7 135 225 -51 89 116 -265 -249 20 0 -21 -178 -161 -89 -35 -4
4036 -4 -106 -184 15 -118 -48 103 183 30 202 224 -27 15 191 70 -61 3 45 128 -25 207 -122 7 -105
4059 -105 235 63 1 157 -216 10 171 -187 -27 0 18 296 -72 27 -98 28 -253 -137 27 -67 -144 10
4081 10 131 246 -8 -28 119 -172 96 192 41 -76 -79 -7 135 95 199 -47 54 -192 -137 41 189 166 165 -4
4105dr8L1ml2K73kj42k31L06j0j54P0L9N9k25R2J30k02N5j4J36R0k3l26K69r3
4131a0J1K27o17M18j61j29M56q5p3j82J00K5R6j28J20q7J06j47J57j87L39q4k03
4154c8K38k20N2J0k73J32j3J23q5L63k2k03r8j81J53r1K76l15K97K22k99N3k8
4177E3j35J43l3J6l59J78O1N3J30rj86M0oM20o55L00L1j95J91k03J91l8Q3J36
4201B07Pj81j16j26L81m29J33K76j64k45M22k28K6R3N9p5Q9j56L12l02k71K02
4223h6J38k22j02L25Q7R0j71j20J70l09K80n3K9J05k91L46l39J28L9N8j76K10
4245A36m0J6k23K46k37P5P1j4J5J4J0k7J39m34L05j11q7L92l25J38J46n65L80
4268B0R0j53N8K4J5j02J95rm19K1L80J71j47q2j48nK72p3k43K19j0k42J55m8J92
$$ plain form
4105 -4 -102 -71 -75 -107 166 164 22 -209 97 87 -67 3 42 101 -124 -32 98 -104 -49 -63 73 163 140 -186 83 -10
4131 -10 1 228 -389 29 -132 -261 195 110 37 -145 -45 -20 76 -52 68 -19 87 -60 97 -90 249 165 -38
4154 -38 200 -20 32 42 -231 -99 -112 11 -74 289 267 64 -34 -215 -62 -153 123 -192 105 327 28 81 53
4177 53 -82 61 28 44 -315 -137 -76 -23 107 98 -88 -48 -54 366 -289 11 42 -153 38 -165 26 -12 71 207
4201 207 214 33 -83 -209 172 -257 -124 152 -12 -257 165 -63 -37 56 115 40 129 -27 285 -17 -288 -86
4223 -86 52 -170 -272 53 140 230 59 -61 109 -200 80 27 56 161 -130 216 -123 5 44 102 -74 136
4245 136 96 112 -111 135 -102 -27 44 30 45 59 69 42 181 -253 52 -59 -146 246 -79 59 205 -360 20
4268 20 110 -43 15 39 54 -48 147 138 -281 -260 120 291 144 62 -86 -91 181 108 -135 84 74 -168 -13 -61 131
4293A31k70L5L39k74l8K35j85n9M5J86j08j11K30l14M0J18R5j45O3j52J61O2o8
4316A6K1l0k30K19j60j05J54R5J51j18J67k31K2k26K47J72m87M90j41J0J39j01
4338G4j22pk01L34P1k01J1J59j5j94j84Q2N2J00J95k77j19K29pQ9q8j01j98L93
4362G5K06m16J40j10p8L87k77J38J8j97J34J07O9m1l91K49L0l08K22L99l39j3
4384Do2J44K12l59J63J59j90j43J82n7j67J81K9J54j29J7l5l20K9K81k19Q6K12
4407A72o3k32K24pj04j46K13J29j0j31q0k0J21k6J36j1j45o7l1Q6j55R6k8N6%
4432b3k47J81K8J54l04K69p7k32L12l09J88J72j51P4q8j70j74M61k59K5j67N05
4454A68j26l06N7R1J48O7r9K15r1l31NK79J70l32j4K61k75kL32l41J91q1J98k42
$$ plain form
4293 131 -139 -104 235 -39 -77 158 -27 -86 -41 145 37 -74 156 -158 -118 0 95 -50 13 -139 22 84 16
4316 16 37 7 -223 -4 -164 -269 -115 -20 131 13 180 -51 -29 -255 -8 164 -323 167 26 36 175 74
4338 74 -48 -55 -256 78 149 -52 -41 118 103 -91 -275 -193 -141 -41 154 -123 -242 -13 -20 69 -19 -120 -318 75
4362 75 281 -135 5 -105 -183 204 -73 65 83 -114 20 127 196 155 -236 13 43 -265 -43 356 17 4
4384 4 -58 86 298 -61 102 261 71 -72 110 53 -114 67 96 250 121 138 103 -217 -188 93 -126 -40 172
4407 172 109 -123 101 94 -10 -156 57 186 176 45 -35 -55 66 40 176 165 20 -47 -78 8 -147 -51 -79 -23 -23
4432 -23 -270 -89 -61 93 -211 58 -19 -251 61 -248 -60 112 -39 35 -53 -223 -397 64 -195 -170 -337 168
4454 168 42 -264 -207 -116 32 99 0 215 124 -207 -202 77 247 -85 -99 162 -113 -115 217 -124 67 -14 184 -58
4478e8j33L65k64k2M3j83J18j5O6K06j44J16P2k86J15j7j96L48k4m2J40m03L44
4501A46n3j88J09M6l7Q0l2k20k0J09J61Kj18j22L41l50J40J01j07J2j17R2K4K63
4525B62l91O0J34j42R9n2L29l4j85M3j74K07k39k37L79q5K2QJ10n8k12O6r0K45
4549F5j93K12n3P5J11l11o5L86J6j29o5k2K35l27oK92m1r1l7j73J16j09J95r5
4573a4m7L1j62J14j41M39j90o1pR9N1o9J41k19Q7l9k1j53RJ83J9j85N6R6j67M6
4599a04Q2l2r7L28k35j6J71k85j9L02q3n3J40m8K88n00P4J35j14J62k58M41n39
4622b60K88N1l61K52L1J45l11K38j50L0J36J73k02j72Q5K43k83J7J50q0j46K8
4644i8L7l7K81l0Kj94J29j6j55J45n8J64k26J39j10J05k05M11n47M26n14L35k1
$$ plain form
4478 -58 -191 174 -90 -112 -69 -252 -134 -149 -83 123 -21 95 167 -119 -4 -21 -217 131 107 65 205 -198 146
4501 146 93 -95 14 60 23 103 71 -149 -169 -60 101 103 -15 -137 204 -146 -6 95 -12 0 -117 -25 -1 262
4525 262 -129 -69 65 -77 22 -30 299 265 80 123 -51 156 -83 -320 59 -26 -4 4 114 56 -156 -90 -180 65
4549 65 -128 84 31 106 217 -94 -159 227 243 114 49 27 262 -65 -71 221 180 89 52 -121 -5 -114 81 -14
4573 -14 -61 -30 -192 -78 -219 220 30 -31 -38 61 112 43 184 -35 52 13 -8 -161 -152 31 50 -135 -79 17 -150 -104
4599 -104 -22 -54 -151 177 -58 -74 97 -188 -207 95 12 -41 99 51 339 -161 -87 48 -66 96 -162 279 -260
4622 -260 28 79 -282 -30 1 146 -165 73 -77 -47 89 262 60 -112 -27 216 -67 -50 100 20 -126 -98
4644 -98 -61 -98 183 153 155 -39 90 74 -81 64 6 170 -56 83 -27 78 -127 284 -263 163 -351 -16 -37
4667c7J84R9l06K22l44J69l8J64k05Q3r4P9J46j75k9j14J35J45Kk57L21j52O2
4690F0p9K06p7j59R5l61N07l70J69J64j71N6k0M3n2K9J43k72L39m53k3L01M7q9
4714C3r0j42J04l1P5J42j24m1L53l37m4PQ6r1R8M9o2j05J6K84q6j97R2M6K36k01
4740G0k84K15J10m04L32N5J7R7j14q6l32J25R0L6j5J53j47l4N8Q1R3p2k1J5j24
4765h6k44K65r1J81p3J19j12j8jL7P6K0j3m09N66N2p2k30k9j38K55o5q8J79k5
4790E6J17j66l1n3M4K0j90K94j72l1JrJ13K03j42N2l16K25J58k34r8K33j02J14
4814H6l1j86L95k42j22K90m2k28M50l40L6r5j10P8J76k23k94L80j7J63j92K2p4
4837a20J12j8K8k63K94j40M3R4m4j5P2l5K5j25O5j05K21j52j81K20M9J27n6j72
$$ plain form
4667 -37 147 246 -60 162 -182 -13 -51 113 -92 -9 -103 -24 122 -53 -82 -196 -61 84 86 -171 150 -2 60
4690 60 -19 187 110 -49 46 -315 192 -178 -9 155 -16 40 20 63 11 40 183 -89 250 -203 -226 75 122 33
4714 33 -57 -199 -95 -126 -51 91 -33 -74 279 -58 -102 -95 -9 -100 -2 47 -15 -120 -104 180 94 -103 -11 35 271 70
4740 70 -214 1 111 -293 39 94 111 208 94 8 -324 -199 -109 -73 -88 65 -82 -116 -58 23 116 44 23 38 -86
4765 -86 -330 -65 -156 25 -48 71 -41 -59 -60 -23 53 73 60 -349 217 269 197 -33 -62 -200 55 -10 -98 81 56
4790 56 173 7 -24 -77 -33 -13 -203 91 -81 -112 -111 -120 -7 196 54 106 -210 15 173 -61 -159 74 -28 86
4814 86 55 -131 264 22 -100 190 148 -80 370 30 66 -29 -139 -61 115 -108 -402 -22 -39 124 -68 -46 -120
4837 -120 -8 -26 2 -261 33 -107 -64 30 -14 -29 43 8 33 -92 -27 -132 89 -63 -244 -24 25 152 96 -76
4861g6J68k10K34J65k30M7j8J31l90K40j05J39Kk1r8L0j30J6j2M4J86Lr3k02K35
4886E5O5l5o6Q5j07J39k26j3lJ16o9J23M1k15L02M7k36J16L8j32J93m10J10Oo5
4911a41M2K30l79L33j11j9j41L2J76k78K02K25j15j59Mj0K69k94P1k4J13L8j83
4934a19K22k0l07R9K02O1j92j16K12o7p9L6N9k24P6K19n7J6m2kr9l9K19j02j1
4959e5L8P2j26QJ57k2J2j83J99L6j74o4J22j25j04K37q7J30j41K57J08l61K94
4982B28q2l33M23p1q3K9J34l06M3J09Q0j24J47j89k97N04j60j42p7J37N8j22R8
5005Dn1j08J24K22rj25L2r8J54k02N4j38J34o0R9l4r2J69Q6k28q8L49j21j48J11
5030C6N9j85J68p8n5J95k43j43J60J46o8J00rq2j6L19m04R0J22N7j53p5J3l6J07
$$ plain form
4861 -76 92 -118 116 281 51 98 80 211 -179 61 -44 95 97 76 -22 8 -122 -106 -118 -74 112 115 22 -180 55
4886 55 120 85 19 104 -3 136 -90 -103 -106 10 -59 64 105 -110 192 239 3 119 157 25 218 -192 -82 -76 -141
4911 -141 -99 131 -248 85 -26 -45 -186 -154 22 -256 -54 171 56 -103 -99 -109 160 -134 -63 -87 26 64 -119
4934 -119 103 83 -224 -125 77 138 -54 -170 42 -25 -104 -68 -9 -233 -157 62 5 21 -21 -23 -122 -161 58 -44 -55
4959 -55 -17 55 -71 -63 94 72 84 -99 100 136 -38 -102 20 -105 -209 28 -59 71 -70 187 295 -66 228
4982 228 146 -187 236 165 82 111 245 -61 -18 91 171 47 194 5 -292 212 52 -90 -167 -30 28 -94 4
5005 4 -47 -155 -31 191 182 57 89 -9 145 -57 -3 -141 -7 -67 32 -2 -94 75 161 -67 -155 194 73 -75 36
5030 36 95 -90 78 0 -55 140 -103 -246 -86 60 -8 92 83 1 -15 304 -100 -10 112 169 16 -59 -46 -82 25
5055B5oR1k12j01L66l7p8j5j20N8r7K36k12K10r9m0J09K98n67K34m1R4M3k21o0
5080a42K2J8L63k18l0O8k37K61n5q5P4r2J13l0l06L86o5j89J78k51M57k39J74
5103A75K5M4j37Rj97l44L82N6n6L4J63l17J82K5j55J5L3J10k85L25k09J59P2k77
5127a68p7M58m01K42J58m84L23j78J77k00qJ33J67o1J72k52k19O0J77j30R7j4
5149b8J83k61J98l01O1O1o3K62l04K42k18K77P4k53J55k15L17K8k49R1r1p2j1
5172a17J77l4N4m9j73K40j97j26r9J35J80j13Q8J01K7m3k02R4J93j83j00O3M4
5195d0J87j03M05m56o0j68J80J40QP3j93J57l16J01O5J14N0l25J36p3j1J96J81
5218B48m29n2P6Q5q2K23m5j39J73k57J96o5K59l26j9J76L2j55J40p3Nn0P6k01
$$ plain form
5055 25 19 110 -102 -203 163 126 48 33 -87 -29 -126 110 -102 108 9 -31 78 376 -191 43 2 96 139 -82 -142
5080 -142 -120 -102 261 43 13 81 -156 105 50 -35 39 -53 60 30 -276 110 45 -144 34 -217 240 1 175
5103 175 200 244 107 116 -81 -425 -43 13 -43 -9 154 -163 19 44 -111 -96 -63 47 -238 87 -122 37 109 -168
5127 -168 -245 213 -188 54 212 -272 51 -127 50 -150 -158 -25 142 81 253 1 -218 -158 19 -111 -14 -28
5149 -28 155 -106 92 -209 -148 -87 -150 112 -192 50 -168 109 183 -70 85 -130 187 215 -34 57 -34 -106 -117
5172 -117 60 26 80 31 -142 98 -99 -225 -324 -189 -9 -122 -34 67 94 51 -151 -57 136 -47 -147 -84 -40
5195 -40 147 44 449 -7 -67 -235 -55 85 93 166 -27 130 -186 -85 -20 94 144 -181 -45 -118 -129 67 248
5218 248 -181 -233 -157 -72 -154 69 24 -115 58 -199 -3 -68 191 -135 -154 22 54 -101 39 -34 -29 -79 -3 -204
5242b04J73j05lL48l09M52k60n8qj18J3m1L22k21J62k96J32K3l1l0J7Rm4J44k09
5267a42J92r0J46j94J02Or6K4n4K39o3K8j93K27l78M53j85j56R2J1j28o1L2j1
5291a99L36k51K21k5j28p4J06J52j72r7j02J94k8N3l5L20k71k0L4%J03l89K77
5314Ej76K63j61R2p9L9J77k20J10K84k71J38j88k02J54j23j19L45O0nm22L93j26
5337c2lQ8K6j60JJ71P5k51j07K21j89K33M4j91nl4P9J41m9l4r4M9k9k39L82j57
5363f4J88J11l41K62k39j12n5P4K12l2k4m5K66l81J45j06J93j26K93m69N3K83
5385H6j72J49L8j46R3o4rJ88l09J84L7r5q4K27k73K09O8j28j49L13r8j41M2K2
5409a2l7K56j97M0J90k03k27J30J8L6L99l89MJ70o4l41L38j6q3j36J84m2j88K22
$$ plain form
5242 -204 -31 -136 -139 209 -100 352 92 34 26 -92 -79 -120 202 -19 143 -153 -21 2 -29 -59 -42 -33 -77 67 -142
5267 -142 50 -40 106 -88 14 20 -76 -52 -106 133 70 98 -95 132 -246 207 22 -134 -42 -31 -159 -220 -188 -199
5291 -199 137 -114 107 82 -46 -120 -14 138 -34 -131 -233 -39 -67 -14 -49 271 0 -20 14 14 117 -272 5
5314 5 -171 92 -69 23 -56 -17 160 -60 50 334 63 201 13 -189 -35 -158 -277 68 128 123 -299 94 -32
5337 -32 -35 53 79 -81 -80 91 166 -85 -192 29 -160 73 117 -74 -79 -113 -34 107 58 24 -70 -21 -50 -289 93 -64
5363 -64 124 235 -106 156 -83 -195 -250 -176 36 4 -20 -65 201 -180 -35 -141 52 -74 219 -250 -197 86
5385 86 -86 63 101 -45 48 -16 -25 163 -146 38 75 -20 -104 123 -150 59 127 -1 -150 163 65 -76 -34 -12
5409 -12 -49 207 10 50 240 37 -190 -60 -42 -6 393 4 8 178 114 -227 111 95 12 -124 60 18 -170 52
5433E2R4o9kO1j0P3j58J36p0J89l93K56m2R7j96q4O2L3k48M45k5k42M2L30k48
5458H3j49O1j17J14l6k43K89J73j02J79o25L54k07L20q5l2K27n8j88j85J15N1
5480f1K4K74j51q4k79M25j53rk6J72k83K41L5j20J02jj42L7P5j99L18p8j13j93
5504a89K94j37oK0N6oj75j21K70R4q2n3j3p6L7L6Q4KJ24j72J61j44N0Rj05J32
$$ plain form
5433 52 146 77 75 136 126 199 41 177 107 296 -97 159 117 214 18 -66 -4 29 -219 226 201 -41 1 331 83
5458 83 -66 -5 -122 -8 -44 -287 2 175 73 252 -373 -19 -226 94 9 -23 204 146 -42 -227 -112 -61
5480 -61 -37 237 86 2 -277 148 -5 -14 -40 132 -151 90 125 5 107 106 -36 1 76 -123 195 117 4 -189
5504 -189 105 -32 -38 -18 38 32 -143 -264 6 100 18 -35 -48 -124 -87 -51 33 35 159 -13 148 4 54 63 -42 90
$$ [...]
8191a08
##END NTUPLES=NMR FID
##END=
