##TITLE=1H_SR158H3
 D2O
 8 sc, 
 10.4.2023
##JCAMPDX= 6.0         $$ Bruker NMR JCAMP-DX V2.0
##DATA TYPE= NMR FID
##DATA CLASS= NTUPLES
##ORIGIN= UXNMR, Bruker Analytische Messtechnik GmbH
##OWNER= root
$$ XWIN-NMR		Version 3.5
$$ Mon Apr 10 14:50:05 2023 Russian Standard Time (UT+4h)  she@DPX200
##.OBSERVE FREQUENCY= 200.13135
##.OBSERVE NUCLEUS= ^1H
##.DELAY= (6, 6)
##.ACQUISITION MODE= SIMULTANEOUS
##.ACQUISITION SCHEME= undefined
##.AVERAGES= 8
##.DIGITISER RES= 18
##SPECTROMETER/DATA SYSTEM= spect
##.PULSE SEQUENCE= zg30
##.SOLVENT NAME= MeOD
##.SHIFT REFERENCE= (INTERNAL, MeOD, 0, 15.7039)
##AUDIT TRAIL= $$ (NUMBER, WHEN, WHO, WHERE, WHAT)
$$ ##TITLE= Audit trail, XWIN-NMR		Version 3.5
$$ ##JCAMPDX= 5.01
$$ ##ORIGIN= Bruker BioSpin GmbH
$$ ##OWNER= she
$$ F:/spectra/data/she/nmr/H-F/1/audita.txt
$$ ##AUDIT TRAIL=  $$ (NUMBER, WHEN, WHO, WHERE, WHAT)
(   1,<2023-04-10 14:49:15.85 +0400>,<she>,<DPX200>,
      <created by zg, POWCHK disabled, PULCHK disabled
       configuration hash MD5:
       00 E9 B6 7A A2 85 ED C7 34 08 36 98 17 FE 4E 26
       data hash MD5: 16K
       A0 43 AF 9A D3 E6 89 78 2A 90 E3 E6 97 40 75 2C>)
$$ ##END=
$$ 
$$ hash MD5
$$ A6 83 F6 76 6A B7 DF EB E6 02 69 57 A3 D8 75 7D
##$RELAX= 
##$RELAX= 
##$RELAX= 
##$RELAX= 
##$RELAX= 
##$RELAX= 
$$ Bruker specific parameters
$$ --------------------------
##$DU= <F:/spectra>
##$EXPNO= 1
##$NAME= <H-F>
##$PROCNO= 1
##$TYPE= <nmr>
##$USER= <she>
##$AMP= (0..31)
100 100 100 100 100 100 100 100 100 100 100 100 100 100 100 100 100 100 
100 100 100 100 100 100 100 100 100 100 100 100 100 100 
##$AQSEQ= 0
##$AQ_mod= 1
##$AUNM= <au_zg>
##$AUTOPOS= <>
##$BF1= 200.13
##$BF2= 200.13
##$BF3= 200.13
##$BF4= 200.13
##$BF5= 200.13
##$BF6= 200.13
##$BF7= 200.13
##$BF8= 200.13
##$BYTORDA= 1
##$CFDGTYP= 0
##$CFRGTYP= 5
##$CHEMSTR= <none>
##$CNST= (0..31)
1 1 145 1 1 1 1 1 1 1 1 1 1 1 1 1 1 1 1 1 1 1 1 1 1 1 1 1 1 1 1 1 
##$CPDPRG= <>
##$CPDPRG1= <>
##$CPDPRG2= <>
##$CPDPRG3= <>
##$CPDPRG4= <mlev>
##$CPDPRG5= <mlev>
##$CPDPRG6= <mlev>
##$CPDPRG7= <mlev>
##$CPDPRG8= <mlev>
##$CPDPRGB= <>
##$CPDPRGT= <>
##$D= (0..31)
0 1.2 0 0 0 0 0 0 0 0.06 0 0.03 0 0 0 0 0.0002 0 0 0 0 0 0 0 0 0 0 0 0 
0 0 0 
##$DATE= 1681123755
##$DBL= (0..7)
120 120 120 120 120 120 120 120 
##$DBP= (0..7)
150 150 150 150 150 150 150 150 
##$DBP07= 0
##$DBPNAM0= <>
##$DBPNAM1= <>
##$DBPNAM2= <>
##$DBPNAM3= <>
##$DBPNAM4= <>
##$DBPNAM5= <>
##$DBPNAM6= <>
##$DBPNAM7= <>
##$DBPOAL= (0..7)
0.5 0.5 0.5 0.5 0.5 0.5 0.5 0.5 
##$DBPOFFS= (0..7)
0 0 0 0 0 0 0 0 
##$DE= 6
##$DECBNUC= <off>
##$DECIM= 32
##$DECNUC= <off>
##$DECSTAT= 4
##$DIGMOD= 1
##$DIGTYP= 9
##$DL= (0..7)
0 120 120 120 120 120 120 120 
##$DP= (0..7)
150 150 150 150 150 150 150 150 
##$DP07= 0
##$DPNAME0= <>
##$DPNAME1= <>
##$DPNAME2= <>
##$DPNAME3= <>
##$DPNAME4= <>
##$DPNAME5= <>
##$DPNAME6= <>
##$DPNAME7= <>
##$DPOAL= (0..7)
0.5 0.5 0.5 0.5 0.5 0.5 0.5 0.5 
##$DPOFFS= (0..7)
0 0 0 0 0 0 0 0 
##$DQDMODE= 0
##$DR= 18
##$DS= 0
##$DSLIST= <SSSSSSSSSSSSSSS>
##$DSPFIRM= 0
$$ [...]
##$SUBNAM2= <"">
##$SUBNAM3= <"">
##$SUBNAM4= <"">
##$SUBNAM5= <"">
##$SUBNAM6= <"">
##$SUBNAM7= <"">
##$SUBNAM8= <"">
##$SUBNAM9= <"">
##$SW= 18.05172834244
##$SWIBOX= (0..15)
0 0 2 0 0 0 0 0 0 0 0 0 0 0 0 0 
##$SW_h= 3612.71676300578
##$TD= 16384
##$TD0= 1
##$TE= 0
##$TE2= 300
##$TE3= 300
##$TEG= 300
##$TL= (0..7)
0 120 120 120 120 120 120 120 
##$TP= (0..7)
150 150 150 150 150 150 150 150 
##$TP07= 0
##$TPNAME0= <>
##$TPNAME1= <>
##$TPNAME2= <>
##$TPNAME3= <>
##$TPNAME4= <>
##$TPNAME5= <>
##$TPNAME6= <>
##$TPNAME7= <>
##$TPOAL= (0..7)
0.5 0.5 0.5 0.5 0.5 0.5 0.5 0.5 
##$TPOFFS= (0..7)
0 0 0 0 0 0 0 0 
##$TUNHIN= 0
##$TUNHOUT= 0
##$TUNXOUT= 0
##$USERA1= <user>
##$USERA2= <user>
##$USERA3= <user>
##$USERA4= <user>
##$USERA5= <user>
##$V9= 5
##$VALIST= <valist>
##$VCLIST= <CCCCCCCCCCCCCCC>
##$VD= 0
##$VDLIST= <DDDDDDDDDDDDDDD>
##$VPLIST= <PPPPPPPPPPPPPPP>
##$VTLIST= <TTTTTTTTTTTTTTT>
##$WBST= 1024
##$WBSW= 4
##$XGAIN= (0..3)
0 0 0 0 
##$XL= 0
##$YL= 0
##$YMAX_a= 131906
##$YMIN_a= -209484
##$ZGOPTNS= <>
##$ZL1= 120
##$ZL2= 120
##$ZL3= 120
##$ZL4= 120
##$ABSF1= 10
##$ABSF2= 0
##$ABSG= 5
##$ABSL= 3
##$ALPHA= 0
##$AQORDER= 0
##$ASSFAC= 0
##$ASSFACI= 0
##$ASSFACX= 0
##$ASSWID= 0
##$AUNMP= <proc_1d>
##$AZFE= 0.1
##$AZFW= 0.1
##$BCFW= 1
##$BC_mod= 2
##$BYTORDP= 1
##$COROFFS= 0
##$CY= 11.3945322036743
##$DATMOD= 1
##$DC= 2
##$DFILT= <>
##$DTYPP= 0
##$F1P= 2.36226072786647
##$F2P= -0.459571619588291
##$FCOR= 0.5
##$FTSIZE= 0
##$FT_mod= 4
##$GAMMA= 1
##$GB= 0.15
##$INTBC= 1
##$INTSCL= 1
##$ISEN= 128
##$LB= 0.24
##$LEV0= 0
##$LPBIN= 0
##$MAXI= 10000
##$MC2= 0
##$MEAN= 0
##$ME_mod= 0
##$MI= 1.114404
##$NCOEF= 0
##$NC_proc= 0
##$NLEV= 6
##$NOISF1= 3.799351
##$NOISF2= 2.8
##$NSP= 1
##$NTH_PI= 0
##$NZP= 0
##$OFFSET= 15.70392
##$PC= 1
##$PHC0= -19472.82
##$PHC1= 8.2008
##$PH_mod= 1
##$PKNL= yes
##$PPARMOD= 0
##$PSCAL= 0
##$PSIGN= 0
##$REVERSE= no
##$SF= 200.130013532006
##$SI= 16384
##$SIGF1= 3
##$SIGF2= 2
##$SINO= 400
##$SIOLD= 16384
##$SREGLST= <1H.CDCl3>
##$SSB= 0
##$STSI= 0
##$STSR= 0
##$SW_p= 3612.71676300578
##$SYMM= 0
##$S_DEV= 0
##$TDeff= 0
##$TDoff= 0
##$TI= <>
##$TILT= no
##$TM1= 0
##$TM2= 0
##$TOPLEV= 0
##$USERP1= <user>
##$USERP2= <user>
##$USERP3= <user>
##$USERP4= <user>
##$USERP5= <user>
##$WDW= 1
##$XDIM= 8192
##$YMAX_p= 0
##$YMIN_p= 0
$$ End of Bruker specific parameters
$$ ---------------------------------
##NTUPLES= NMR FID
##VAR_NAME=  TIME,          FID/REAL,        FID/IMAG
##SYMBOL=    X,             R,               I
##VAR_TYPE=  INDEPENDENT,   DEPENDENT,       DEPENDENT
##VAR_FORM=  AFFN,          ASDF,            ASDF
##VAR_DIM=   8192,          8192,            8192
##UNITS=     SECONDS,       ARBITRARY UNITS, ARBITRARY UNITS
##FACTOR=    0.0002768,     1,               1
##FIRST=     0,             0,               0
##LAST=      2.2672688,     0,               0
##MIN=       0,             -209484,         0
##MAX=       2.2672688,     131906,          0
$$ Real data points
##PAGE= N=1
##DATA TABLE= (X++(R..R)), XYDATA
$$ [...]
1799B01J24k8k94k39l64J81K64M93K37n9j20m08m49n5J59K62N35m2R7l41m87m9
1821c82j59K18J11K66K92L0k29k43k76J01q3K41M04K46j24q5k40m87j2M4M13k7
1843A9O01l89k9m48m5o1j08L48L48M14l05k73j29n68J11M50j02N94j48Nk21n4
1865A0l51L7N1K40L26m9O4l56l04R9M1J21J76J97L70l27k56k00j05k82M43M8K57
1888B50J41k03l5k86l60K00K62K70j69M86j59m13k01l69K03J18N55L3M5j57j86
1909B5j99j03j27K13L50K91l06J37l57j96n8jK61K25K21j7j04k74r6l17K48r7
1931b81L99L26l16J25k61k72R0l5N6J87L38q2j45J1m79L9K6Q3M38J45o0l79J09
1954F2m91L34j76J45J31M56m8m50q3j11l8M3K60J61jK67j89m34k03L1L0L53L16
$$ plain form
1799 201 325 297 3 -236 -600 -419 -155 338 575 516 396 -12 -461 -516 -357 -95 440 398 495 154 -333 -382
1821 -382 -541 -323 -212 54 346 376 147 -96 -372 -271 -354 -113 291 537 413 328 88 -399 -411 -367 46 19
1843 19 620 231 202 -246 -291 -352 -460 -112 236 650 345 72 -57 -625 -514 -64 -166 428 280 285 64 10
1865 10 -341 -304 -253 -13 313 264 328 -28 -332 -233 -192 -71 105 302 672 345 89 -111 -216 -498 -55 -7 250
1888 250 391 188 153 -133 -493 -293 -31 239 70 556 397 -16 -217 -586 -383 -265 290 323 368 211 25
1909 25 -174 -277 -404 -191 159 450 144 281 -76 -272 -330 -331 -70 155 376 359 255 -19 -115 -432 -184 -281
1931 -281 118 444 128 253 -8 -280 -190 -225 -169 18 356 274 129 140 -339 -300 -274 -191 247 392 332 -47 62
1954 62 -429 -95 -271 -126 5 461 413 -37 -120 -231 -269 -226 34 195 194 461 272 -162 -365 -334 -304 49 365
1977C65m28J60j05j74k8N8n2J82O3N66m96R0o37J04J13K00P9P3J76k01j07q3m15
2000d97R6L07m8M20K43j07n07O7l56j71L87K66J94k57M11m70k03J48j06KM91j64
2022A46j80L31p3m86q1J25KM12q2M3k17J49k22j23K70l35M74q9K04k8k9m17k92
2045d98K84L4J94o1K42L2m54M96p46K99J58J58L9N3j36l40j3K9k08PL12L4K69
2068A84J81m58n0r7j07K67N83k13k76J3j41j94P2K26j55K36L38l15j38J95m14
2089b63J18K03J20o4J14k1j44j1l58M4J36J42R4L27k01m73J83o7pp8J41L03J32
2112C70p7J14n71j80L72k46L99k25M41j61j86j53j27P7R4M4K19j18M1k52J58k52
2134b19J91O1j17K07J78l62M2O7l14j2K06J59j18K92k65j37j06N6j9J59J91RK45
$$ plain form
1977 365 -63 97 -8 -182 -210 -152 -204 -22 41 607 111 201 -436 -332 -219 -19 60 133 309 108 1 -82 -497
2000 -497 -401 -94 -142 278 521 414 -93 -26 -382 -553 -166 100 294 37 448 -22 -225 -77 -183 -181 310 146
2022 146 -34 297 224 -262 -343 -218 -216 196 114 157 -60 89 -133 -256 14 -321 153 64 268 240 211 -206 -498
2045 -498 -214 -180 14 -47 195 227 -227 269 -477 -178 -20 138 177 230 94 -246 -259 -230 -438 -431 -119 -85 184
2068 184 365 -93 -143 -240 -347 -80 503 290 14 27 -114 -308 -236 -10 -165 71 409 94 -44 151 -263
2089 -263 -145 58 178 114 228 207 63 52 -306 -262 -126 16 110 437 236 -237 -54 -121 -128 -206 -65 238 370
2112 370 293 407 -164 -344 28 -218 181 -44 397 236 50 -103 -230 -153 -59 -15 204 86 127 -125 33 -219
2134 -219 -28 33 -84 123 301 -61 -19 48 -266 -278 -72 87 -31 261 -4 -141 -247 -191 -210 -51 140 149 394
2157C94l24k09J42k13J74J68J91l73N35k28l25j05k1j8R0M26k44l9J46O9l74j08
2179b46L23l08R6L04J5k42K32k67j23J82J93l14J87J84k12j94J14k44N9J94J67
2200A00L25l89K72k85J62n08J93J95K78k59l3L5k47J84l8k31K52K36p6j08R8k05
2222d9l03J99J95p3M3J78m02M85k04l24L49J76l31L76p4j71K9P4k93O6J46J5K7
2245A34j60L38k27j30j74J3M3L13L1k28J85J5k14J4J25l26L76m2l2jj06m28M71
2268a0o7lJ60k0M4j53M2K20l58Q6K1NK64K4m4k66l3m8j45J14K69J6L9J37l04j28
2294a38J34K6K2m7P3J33j64r0j82K2K43p2Q8P0R8j39m21J28k8K93n8J60J31r5
2318A87j27j7k29k5K08N1J65q1k16M2r4R5j81J00J95J03jQ3k06j56Qo3M1n8K54
$$ plain form
2157 394 70 -139 3 -210 -36 132 323 -50 485 257 -68 -173 -194 -212 -122 304 60 21 167 236 -138 -246
2179 -246 77 -231 -135 169 184 -58 174 -93 -216 -34 159 -155 32 216 4 -190 -76 -320 -261 -67 100
2200 100 425 36 308 23 185 -323 -130 65 343 84 51 86 -161 23 -15 -246 6 242 166 58 156 -49
2222 -49 -352 -153 42 -31 12 190 -212 273 69 -255 94 270 -61 315 241 70 99 173 -120 -54 92 107 134
2245 134 -26 312 85 -45 -219 -206 -163 150 181 -47 138 153 -61 -47 78 -248 128 86 54 53 -53 -481 -10
2268 -10 -77 -80 80 60 104 -49 -7 213 -145 -59 -38 -33 231 255 211 -55 -88 -136 -281 -167 102 118 157 294 -10 -138
2294 -138 -4 22 44 -3 70 203 39 -51 -233 -211 32 -40 48 118 216 77 -344 -216 -244 49 -9 151 282 187
2318 187 60 43 -186 -211 -3 48 213 132 -84 -42 -136 -41 -222 -122 73 176 175 258 52 -104 -96 -159 -118 -176 78
2343G8O6k71K24k94L3J34J19O2j24K94j84p5j08j05K56j67j4j3L3JK25j7j47n7
2367e1J70J0j76q2K00K5q7J7j71O4L1L6J29n4l6k00J61j36K27L0Jj21K46J1o41
2392c97L89j38J80J1n2L80j79p9l75J85j66k1M33o6O0ol14j15R6L59j89O6R1J24
2416B77l14Kp1j65J46K35Ql94M61m6m11L94l59L07j49R3rk8K8j58j26J12R1N10
2440D34o32K6J98j20O9j44J64j88K89j90K39k29K40k57p4K03j6j32K74j24k0K36
2462B46j82j59RK16j35LR0j18M5k26K98l14L16r7K48j65J7j34J12j39l2j29J51
2485g9M0J35k00K2K95m83L42l0n9k5K67j7m6j39l15M90j58K21k49J56K19k53j82
2508d8J31l16K00R9l42L11J36k47K20k69j36Q8K95O0k13j36R2J17pP2o1O4K39
$$ plain form
2343 78 144 -127 97 -197 -164 -30 89 151 27 321 137 62 -46 -151 105 -62 -76 -89 -56 -55 170 153 6 -51
2367 -51 119 129 -47 -129 71 96 9 26 -145 -81 -50 -14 115 61 25 -175 -14 -150 77 107 108 -13 233 244 -397
2392 -397 -8 -146 34 45 -7 373 194 115 -260 -75 -241 -262 171 105 165 159 -155 -270 -174 185 -4 62 153 277
2416 277 -37 -35 -106 -271 -125 110 118 -276 185 139 -272 122 -237 70 -79 14 5 -23 5 -153 -279 -167 -76 434
2440 434 -198 -172 26 -94 -25 -169 -5 -193 96 -94 145 -84 156 -101 -175 28 12 -120 154 30 10 246
2462 246 64 -95 -86 130 -5 -2 88 -30 15 -211 87 -227 89 -8 240 75 92 -42 70 -69 -101 -230 -79
2485 -79 -39 96 -104 -82 213 -270 72 42 -17 -42 225 208 162 23 -292 198 40 261 12 168 387 134 -48
2508 -48 83 -233 -33 66 -276 35 171 -76 144 -125 -261 -173 122 182 -31 -167 -75 42 35 107 46 110 349
2531C49j75k19K5j65K70q4j77L8J68no6J92q0k29K51j49O4Kp2J37j62J81j43N3
2555Do4J77j12N0J8j49L31k16o0q0J09N1J80j23R0j58l1k47J88q6J71J29l88P1
2579a45K25l08J49n1R3q0J80o1k36J89K16r6j15J90j05j03L4R0p3J0J63k90K23
2602I9l69M14k83jM40m90J67j0n9n8L30l55J33n1j37J03K00n7j9K62o8k26P3K
2626D0j81K10J16k16m6Q9j43J69o7R7J6J74j04%j35lN6J19l65K28j15Q7j32J61
2650E5J73j15r9J46n79M54M4Oj4R5k17J4K46o7k55K69j12kK10k21k20R5O8l28
2674c54M72q0L2m1J10q4J21j02J69r8p1j44P7j36J31P0n3q4m2J34l8ll0mj95L51
2700A08k69K4P7K48k41k98N67j43K4K8o7j67J34k13Q1J19J16k88K04n4J10Q2l17
$$ plain form
2531 349 174 -45 -20 -185 85 1 -176 -138 30 25 -41 151 71 -158 93 -56 8 10 -62 75 -87 94 -49 4
2555 4 -60 117 5 55 73 -76 255 39 -21 -101 8 59 239 116 206 48 17 -230 -42 -128 43 172 -216 -145
2579 -145 80 -228 -79 -130 -37 -117 63 2 -234 -45 171 75 -40 150 45 -58 -24 66 -7 3 166 -124 99
2602 99 -270 144 -139 -140 300 -190 -23 -33 -92 -150 180 -175 -42 -93 -230 -127 73 16 -3 259 191 -35 38 40
2626 40 -141 69 185 -31 -77 12 -131 38 -29 68 84 258 154 154 19 16 72 191 -174 54 -61 26 -106 55
2650 55 228 113 14 160 -419 35 79 85 71 166 -51 -37 209 142 -113 156 44 42 252 31 -189 -94 -26 -354
2674 -354 118 38 70 29 139 55 176 74 243 145 74 -70 7 -129 2 72 19 -65 -107 27 -11 -14 -44 -48 -243 108
2700 108 -161 -137 -60 188 -53 -351 216 73 97 125 58 -109 25 -188 -107 12 128 -160 44 -10 100 182 -135
2723a35P0J39km7p0j16L15J4j60K02r8k20M37m3j94k62K53j39n9K82j48j08K04
2746A15j20N7l21J29K21P3m00L71O1j65k88K78kM4J14jj99j87L28j52K16j72n
2769el12K07J44k14J30j56J63k7j79K30k42J82K71j34J10k84K4J5J85j57N4K40
2791B45j76q8k25R9J94n6J56l9L0j76K6j68J40R5m6N0j13p2R9P9r2J34J4j21j51
2816a62J75J50j27j27j4j29K04N0N6J21k29J10n1J79M7m3l06K5K30J8l45K74l0
2839G6l54K88l8j17J46Q4j77J96j2j4j3l1K5m8Pl1j66L98j33j42k55J87K58o1
2863G3q2j51J9O5K22j85K9K09k19J80k03j1n4R2K7k20J54K45j92l8Mj07NM5P3
2888b0O8J38m15M32q6j69q9J38o9K90m38J32j29J12n8Q7J2K22J85k92j58j24K33
$$ plain form
2723 -135 -65 74 72 25 -45 -161 154 168 8 210 112 -108 329 286 92 -170 83 -56 -115 167 19 -89 115
2746 115 -5 52 -269 -140 81 154 -246 125 186 21 -267 11 9 53 167 166 -33 -220 108 -44 172 0 -5
2769 -5 -317 -110 34 -180 -50 -206 -43 -70 -249 -19 -261 -79 192 58 168 -116 -92 -77 108 -49 5 245
2791 245 69 -19 -244 -145 49 -7 149 110 140 -36 -10 -178 -38 57 11 61 -52 -124 -25 54 -38 96 110 -11 -162
2816 -162 13 163 36 -91 -105 -234 -30 20 76 197 -32 78 27 206 253 210 -96 -71 159 177 -168 106 76
2839 76 -278 10 -28 -145 1 85 -92 104 92 78 65 34 59 11 18 -13 -179 219 86 -56 -311 -124 134 73
2863 73 -9 -160 -141 -76 146 -39 -10 199 -20 160 -43 -54 -108 -16 11 -209 -55 190 -2 -40 -36 -143 -138 -93 -20
2888 -20 48 186 -229 203 117 -52 -141 -3 -72 218 -220 -88 -217 -105 -163 -76 -64 158 343 51 -107 -231 2
2911BJ04K21m60K40l38M40j01l11K80k10J47J4p7p9L73k45n4l4l5J50j41K06j28
2934c6L20k40j9J71m7l27J65j18J73l0M5J89k82L02j17J58m29J88M0m2J70j72
2956F2l8n2J98j17J05n9k74K75k42N2J06O3KR6l71J38J99Q2l35J86j55P0j55K14
2980E0Kj10K90m68K68K47k33jj39k3J22M2N6n9L5L5o6k91L39l9k36J14P5J34j15
3005B9n5j47J07O9R9M0p9%kM4p2m18J63K88j03j26K00j55K62k30j3J64J36m3k36
3030g8K21l58M53o9R1m93J92N4j7k1q3J60M7q2p7J96k05K0J08k07L50j90k9r5
3054a12k4j37N69k91J56j54J49k17q8K54j78K52j11O2J2j46q1J14j28J63o0q6
3076h2L5M68m24j1k7K15r6J53l86L41J68n55K42r2r7J48p7J78j29k4p9K27r8J58
$$ plain form
2911 2 106 327 -133 107 -231 209 108 -203 77 -133 14 28 -49 -128 245 0 -54 -88 -123 27 -114 92 -36
2934 -36 284 44 25 196 149 -178 -13 -131 42 12 57 246 -36 266 149 307 -122 66 106 64 234 62
2956 62 24 -28 170 53 158 99 -175 100 -142 -90 16 79 81 177 -194 -56 143 225 -110 76 -79 -9 -164 50
2980 50 52 -58 232 -236 32 279 46 45 -94 -117 5 47 103 44 79 114 48 -243 96 57 -179 -65 10 144 29
3005 29 -26 -173 -66 3 102 142 63 63 61 105 33 -385 -222 66 -37 -163 37 -118 144 -86 -99 65 201 158 -78
3030 -78 143 -215 238 169 260 -233 -41 13 -4 -25 -108 52 99 17 -60 136 -69 -49 59 -148 202 12 -17 -112
3054 -112 -136 -273 296 5 161 7 156 -61 -149 105 -73 179 68 130 142 -4 -85 29 -99 64 4 -82
3076 -82 -47 421 -3 -14 -41 174 78 231 -155 186 354 -201 41 -51 -148 0 -77 101 -28 -52 -131 96 -2 156
3100A56j18k04K21j57m4K5k3K48l5M5n9J5l28J92K57j81K9j60O1J75j33R4ko9
3124EJ83k34J24ll3P9j47M3oq1N7J53k50j57M31k57nK37r5j43l3LJ59p0k73K18
3150i5n6k30M88J29j36j60L7l95K70n6J42L44k55j80K65j25K78k35r8Q8o5K77
3172B32l10j17K42J2J91m50nK04P2j6j27j40M52q7m02K11j55L89k56L57l37Q3
3194D3l86M32j69j44J62J46Lj53J38j03J9J4Q4q7K00R2j96M8j15P0r4J97O6k41
3218B6K9l1k8J11k36j40J82KK75j06k39K58k09K72j16M5k26J66k50M27j18j57
3240f3J97j53K1j36O0P4j97k4J14J15m0N1J32r3Q0J77k71j18L1Q1J82k68J58j37
3264b7N2o5K7N5j54J83r6j22J62p7q3n3J96J60k5k80J74j42L4N3J8o7K18j68J04
$$ plain form
3100 156 38 -166 55 -102 -146 -121 -144 104 69 114 55 70 -258 -66 191 10 39 -121 -60 115 -18 76 74 5
3124 5 188 -46 78 75 42 121 -26 17 11 -70 -13 140 -110 -267 164 -93 -98 139 44 -99 -132 -129 30 -40 -313 -95
3150 -95 -151 -381 107 236 100 -60 -23 -418 -148 -204 -62 282 27 -153 112 -13 265 30 -68 20 -45 232
3172 232 -78 -195 47 59 250 -200 -205 -1 71 55 -72 -212 240 153 -249 -38 -193 196 -60 297 -40 43
3194 43 -343 89 -80 -224 -62 84 87 -66 72 -31 -12 2 86 -1 199 291 95 143 28 98 4 201 267 26
3218 26 55 24 -4 107 -129 -269 -87 -85 190 84 -155 103 -106 166 50 95 -131 35 -215 212 94 -63
3240 -63 134 -19 2 -134 -74 0 -197 -221 -107 8 -32 19 151 58 138 315 44 -74 -43 38 220 -48 110 -27
3264 -27 25 -40 -13 42 -112 71 -25 -147 15 -62 -145 -198 -2 158 133 -147 27 -115 -81 -28 -10 -77 141 -27 77
3289G7L66n17K58k82J34k30N4J16m2J54O5J25k03r1p3N8l5n0j87K1K02J77l2k67
3313b02J68Nq0K18p3j49J40k06l4J96n5J56k6j5l42K02O7n1O3K45l10R9J23j47
3337hl9O8k32J71L48k20l2j11Q4q3K05k47J8Q5kN0j59J89k35J81j82J73P6j6J12
3362A94j17j82p5L5l8K28k28L3J14J59j94K3O7P6K05j99j41J16j03J51k0m0k19
3385a55K99P5k59L0L21m17n3M9J0j73K91J02k23K05k00Q9q7m2lLK40P9j90L7K8
3410E6r8J17j9j87J42Mo8K71J68l64n9O4L2r8J68j97M4p8r2R3J55O9N9J97m67
3435h8R6K7k12L04r6l2Q3j75L48k02k52K75Jj99Q7K25l4q1k05K52k17J9Q8j2q3
3460h3K26l05K26k02M1K48j72j23L44k33j50J80MK10k59j76L95Q3k24j0M0j93
$$ plain form
3289 77 443 -74 184 -98 36 -194 -140 -24 -66 88 153 278 75 -16 -89 -31 -66 -116 -303 -282 -80 97 65 -202
3313 -202 -34 -29 -109 109 36 -113 27 -179 -213 -17 -72 84 58 43 -299 -97 -30 -81 -18 227 -83 16 139 -8
3337 -8 -47 21 -211 -40 308 88 56 -55 29 -54 151 -96 -78 7 5 55 -104 85 -150 31 -151 22 98 82 194
3362 194 77 -105 -180 -145 -183 45 -183 -150 -36 123 -71 -48 19 95 300 101 -40 76 -27 124 104 64 -155
3385 -155 144 219 -40 -10 311 -106 -159 -110 -100 -273 18 120 -103 102 -98 -9 -96 -138 -141 -138 102 181 -9 28 56
3410 56 -42 75 56 -131 11 15 -53 218 386 22 -37 27 59 -39 129 -68 -24 -102 -194 -101 54 123 182 379 -88
3435 -88 8 35 -177 127 31 -1 82 -93 255 53 -199 76 77 -122 -35 190 156 75 -130 122 -95 -76 12 0 -83
3460 -83 143 -162 64 -138 -97 151 -21 -144 200 -33 -183 -3 1 211 -48 -224 171 254 30 20 60 -133
3482a33J09oj01J5J23J4q3L7j34K49K4q4R7j70K77O3n14k2J41M8N2P6O4n5l47
3507b60N6J58nR2L5J76j81L94m49J25j40k15J8R1J50R4j25o4j43k2L26k06O5m1
3531g1P1j42l4K96k12J7P8QJ03j56j9L9k33L02lO0j56L9O9K1o2k45J1J01m7J59
3557fj5P6j19J86l07J04K02j9J93j26j00k58kK36j89L77j32j33L93j38l61j34
3579b72J33P7J99L9j51K13l78J60j05M90m33K39j87m0m2K9J84l3k03K55k34J60
3601A00L7j30K1k5p3M2P5j22K34k36L14r2l75L59J54j94K70m76m5P4J3J69j73
3624g9n0m4K31m6j4L8k47L31j97J1L50l26P2o2JL06j45k21J54j37j00R7K14m5
3648I2l42R8K20m6j96J24J47j21P8p8J31Q6l90M7J82kN9J32l32K84Q7l22jM6j99
$$ plain form
3482 -133 -24 -30 -131 -116 7 21 -62 -25 -159 90 114 30 127 -43 234 297 -217 -239 -98 -50 2 78 142 87 -260
3507 -260 -204 -46 -51 41 76 252 71 465 16 141 1 -214 -196 -105 45 139 14 -50 -193 -215 111 -95 -30 -71
3531 -71 0 -142 -176 120 -92 -75 3 11 114 -42 -61 -22 -255 47 44 104 -52 -13 56 77 15 -230 -219 -118 -165 -6
3557 -6 -21 55 -64 122 -185 -81 121 102 295 169 69 -189 -191 45 -144 233 101 -32 361 223 -138 -272
3579 -272 -139 -62 137 176 25 238 -140 20 -85 405 -28 211 24 -16 -58 -29 155 122 -81 174 -60 100
3601 100 137 7 28 3 -70 -28 47 -75 159 -77 237 145 -230 129 283 89 359 -117 -162 -88 -75 94 -79
3624 -79 -129 -173 58 12 -2 36 -211 120 -77 -66 284 -42 30 -32 -31 275 130 -91 63 -74 -174 -77 137 92
3648 92 -250 -152 68 22 -174 -50 97 -24 54 -24 107 193 -197 -150 32 30 89 221 -111 173 260 -62 -63 -17 -216
3673b16L01j69P8M0J8j38n0J09N5p0q3K14j06N8R1l54K73J50Jj76j9p6P8j41J17
3698a5O2n5J4K6k9J64k87J52o2J71n6j92K96j54ok21K29k14J96j13L51k28m4p3
3722h8j29L00j11M8l0O9j9l5n3r7K43l9j9m1j34J46k35L19k54K05P2k77L91j13
3746A19q0J54l39L09j59M7j21m7K62J2j98l18K93J43j40K19j02R5m8k54L07k29
3768g5j18lL94k00j28P5L04m01K06j73q0J16M4K61j14j62p6J85L9j25%K39p5l32
3792a99K12J07k48J20k21K63j74K16q8k20J05J66j6Jq8K46k09RJ93k06O4n9R2
3815F6r5p6K09p8n4J81r9k13L88j12k24P1m1O9l73N31K9j38p9R1J84l48l3L79
3839B35j23j47j01J62P0j24q6j44M64j56k1r9L01k96R5J3K54l35k42K19j19j2
$$ plain form
3673 -216 85 -84 -6 34 52 -86 -136 -27 28 -42 -125 89 -17 41 132 -222 51 201 202 26 7 -69 9 -132 -15
3698 -15 47 -8 6 32 3 167 -120 32 -30 141 85 -107 189 35 29 -192 37 -177 19 -94 257 29 -15 -88
3722 -88 -217 83 -28 20 -10 59 40 5 -48 -145 98 59 40 -1 -135 11 -224 95 -159 46 118 -159 232 119
3746 119 39 193 -146 163 4 51 -70 -117 145 157 -41 -359 -66 77 -63 156 54 149 101 -153 154 -75
3768 -75 -193 -196 198 -2 -130 -55 249 -152 54 -119 -199 -83 -39 222 108 -54 -130 55 94 -31 -31 208 133 -199
3792 -199 13 120 -128 -8 -229 34 -140 76 -12 -232 -127 39 23 24 -64 182 -27 -18 175 -31 33 -26 66
3815 66 -29 -105 104 26 -28 153 54 -159 229 117 -107 -36 -77 -8 -381 150 179 41 -38 53 237 -111 -144 235
3839 235 112 -35 -136 26 96 -28 -114 -258 206 50 29 -70 231 -65 30 43 297 -38 -280 -61 -180 -192
3861a92L46k80K94j37l0J68k32K79p1N8k37M4J10j43O5q3M1J24N7k51K02j2k3
3884I7J24j28J25l35J26K90k61j00j8P3k5J58j18O4Q1k63J16N1R1r3N5m47N40
3907B03j75k4j91k6N7n6o7L06Q4m8q5kJ7K62p4r9K07l76J23j72LL05l66j53M86
3932A39k42J36j11K0J41l60J23J96j10k28K60Q2j72Q9j6j42J14J33ok1p1J35j07
3955a8j8O8j22k07K71o2KOJ09J01l93P1K14pj86p6J04K11k4J01J75n16L48r1o9
3980hl2j25L9mP3o6K86j86K71k23p6q4K92o5J22J8k05j75Q7N5j65J78N8j62M7
4005e0O7j12J74j12J93j90q2K72k92o2L11j94l2o1J60j90J92L2j14J50j28J73
4027A05o6J00l17Q4Q7r8M2J21j70M4J69j00J79j05k7m1Kj70J14j32J50J57p9K2
$$ plain form
3861 -192 154 -126 168 31 1 169 -63 216 145 203 -34 10 120 -23 42 -41 0 124 181 -70 132 120 97
3884 97 221 93 218 -117 9 299 38 -62 -80 -7 -32 126 8 72 153 -110 6 57 148 55 110 -337 203
3907 203 28 4 -187 -213 -156 -212 -279 27 111 63 -22 -24 -7 255 181 82 289 -87 36 -136 -133 172 -194 -347 139
3932 139 -103 33 -78 -58 83 -277 -154 42 -68 -296 -36 46 -126 -37 -53 -195 -81 52 46 25 -46 89 -18
3955 -18 -36 32 -90 -297 -26 -88 -86 -80 29 130 -263 -192 22 15 -171 -247 -143 68 44 145 320 -196 152 61 -8
3980 -8 -40 -165 -126 -130 -57 -123 163 -23 248 25 -51 -135 157 92 214 232 27 -148 -61 -6 -171 7 65 -97 -50
4005 -50 17 -95 79 -33 160 -30 -112 160 -132 -194 117 -77 -109 -170 -10 -200 -8 24 -90 60 -68 105
4027 105 39 139 -178 -94 -7 -105 -63 58 -112 -68 101 1 180 75 48 7 9 -161 -47 -179 -29 128 49 71
4051G1n2j02L4j57J95j44J46J52k98J09r6J42Q6m6p1J15j54Q2J70k13j11K8K20
4074A06L1j33Lk1j77J86j03j6J25l46M71l78L30J97k99N7k3q0q4P7J15rq8J75
4098A16k62J45O4j46P2Q9l73K95r5M9L3j95N31j80j80q0q5K56m9J16J71k44o4
4121a6n5O9p5K56j93K3O1j24P0m4K19j98j00J31J9j03L3j79L38q6l3N5L71l38
4145A01j56j47j23N6J94K53l91N9K61L5n2k80J05J59l1j49j44L13k20L22l05K99
4167A59l93M2K61k25K8K97k26m0L35l5k55n4K96j26j05q9J86l9l00L76k48Q6j4
4190h3J50O7j70K44j33K1K2n1j82J54J6j46J84j86P6L5J19k43K25L3mm02L21o
4214F1o0r7J40P9R4k63q6L02l75P6Q0pQ6j43l3M4J55M5k57J76J0q2j35J44j5j83
$$ plain form
4051 71 19 -83 -49 -206 -11 -155 -9 143 -155 -46 -142 0 86 40 -31 84 -70 12 182 -31 -142 -114 106
4074 106 137 4 7 -14 -191 -5 -108 -124 1 -345 126 -252 78 275 -24 33 10 -70 -154 -77 38 29 -59 116
4098 116 -146 -1 63 -83 -11 78 -295 0 -95 -46 -13 -208 323 143 -37 -117 -202 54 5 121 292 48 -16
4121 -16 -71 -2 -77 179 -14 9 70 -54 16 -28 191 -7 -107 24 43 -60 -27 -206 132 46 13 68 439 101
4145 101 -55 -202 -325 -269 -75 178 -213 -154 107 142 90 -190 -85 74 43 -106 -250 63 -157 165 -140 159
4167 159 -234 -192 69 -156 -128 169 -57 -97 238 203 -52 -106 190 64 -41 -130 56 17 -283 93 -155 -69 -83
4190 -83 67 134 -36 208 75 96 118 67 -115 39 55 -91 93 -93 -17 18 137 -106 119 152 148 -254 67 61
4214 61 1 -96 44 123 217 -46 -132 170 -205 -129 -49 -56 30 -113 -146 -102 53 98 -159 17 27 -55 -190 -46 -61 -244
4240b44R4M6J20K09j78L7r0L3O9j75J30LN4K6j46k4lK2N2J14l35Op7K73k5Nk86
4267b90J82N4l1m6J18JJ47o7J04j68k45K55J4j38J30m4j6K4r7j3J18j60J22L08
4291B62l32m0J17r4R0k38n5K49J08j36m6J31J23j83K79l6j54q2N7L6q9J57l01
4314a77L40n7J53l43M3R5j51R3k29J18M9P9m1P3K43m23J4K6Q4Q1Pk4K16l79K16
4339A06j7l13L67p8J9k22M0J82k53K99o6n6j26P3K18p8K3L8J82k96J52j49K7P8
4363A50l1l52J52l37L42l5j69M20N3j34j28j26o1L5K29rj00K64k81P7N2O6K30
4386C07j43k33j32K73n7oj43L59j92j78L31j86q3J34j32m7J95p9K6J1O1N6k1m1
4410H0m68L24M5K03j19j54j28J63j48rL80j96M6J34o6o2Q3j56K9Q7N5j62q3j44
$$ plain form
4240 -244 -150 -104 16 225 47 84 -6 27 96 -79 51 54 108 134 -12 -36 -39 -17 35 149 -186 -180 -257 16 -9 -4 -290
4267 -290 -108 -54 -85 -131 -13 -12 135 68 172 4 -241 14 28 -110 20 -24 -40 -16 -113 -126 -8 -168 -46 262
4291 262 -70 -110 7 -87 3 -235 -290 -41 67 -69 -115 16 139 -44 235 199 45 -37 20 56 -33 124 -177
4314 -177 163 106 259 -84 -41 54 -97 -4 -233 -115 -66 13 -28 45 288 -135 -121 -95 -11 70 77 53 269 -110 106
4339 106 89 -224 143 65 84 -138 -98 84 -169 130 64 8 -118 -45 173 95 118 156 338 42 194 45 72 150
4363 150 119 -233 -81 -418 -76 -111 -280 140 193 59 -69 -195 -256 -221 8 -1 -101 163 -118 -41 11 77 307
4386 307 164 -69 -201 72 15 9 -134 225 33 -145 186 0 -83 51 -81 -128 67 -12 14 25 86 142 121 80
4410 80 -388 -64 -19 184 65 -89 -217 -54 -202 -211 169 -27 19 153 87 25 108 -48 -19 68 123 -39 -122 -266
4434b66J71R3Q0J00m12J21m4K32l3j95L25q4k05J35J11k20P1Q8o4L0k04K3K81
4457A34j48lJ68J02k46j22K05j16J4j22J94j35J01J64k13J74r4j03N5q8K38k47
4479h8j71K63P0J10j82RqM9j23L15k02R5k93K00K75k74r6Oj35L19N0j90j18J90
4503G1Pj87k00L94j45q9J03r6J06L6k5j42L36J2Q5m15Q4k57K98J91j68J54l32
4526a79L41n6j29p7rn5j18M47k51J03j14O5J6O2K25r4j99p7J15k35J99K0k3Q2
4550E9r9J34P6m13L23r3J02m5J59k3j45j55J12J78j61l5m7O5J61j16j82J47j3
4573a1l8K23j39r6j53J50n5L77j83k05O7j5K39l38J99k08K25j13K70j48K4K63
4595C35j32m03K90k62K03r2K4J00R7l32K60j12K00j97K73k41J79k58K41j61k37
$$ plain form
4434 -266 -95 -2 78 178 -234 -113 -157 75 42 -153 172 88 -117 18 129 -91 -20 68 4 34 -170 -147 134
4457 134 -14 -17 151 253 7 -115 90 -26 -12 -134 60 -75 26 190 -23 151 57 -46 9 -79 159 -88
4479 -88 -259 4 74 184 2 11 3 52 -71 244 42 137 -156 44 319 45 -51 -45 -180 139 189 -1 -119 71
4503 71 78 -109 -309 85 -60 -149 -46 -142 -36 0 -25 -167 169 181 266 -149 -65 -322 -24 167 -1 153 -179
4526 -179 162 106 -23 -100 -109 -164 -282 165 -86 17 -97 -32 -16 46 271 177 -22 -99 16 -219 -20 0 -23 59
4550 59 -40 94 170 -243 80 -13 89 44 203 180 35 -120 -8 170 9 -26 -73 -8 153 37 -145 2 -11
4573 -11 -49 174 35 -61 -214 -64 -119 258 75 -130 -63 -78 161 -177 22 -186 39 -74 196 48 72 335
4595 335 203 -200 90 -172 31 -61 -37 63 160 -172 88 -24 176 -21 252 11 190 -68 173 12 -225
4616b25M50r5k09J71j35k8o2J14J25kj19q7J85q9PM6k74J56rJ23J89l0j56O4m9
4641F1j62j3J43J31J0j29j6q2J91l58J36L04k30J7r0K47k5r6n2J27k17M24l63
4664d2j9J59n4J33k56L0r0J68Lk4K14l17mL3O6J21j72j1K73l44q4J81L41R4m92
4689i3K88k74J24K15l05J22m8Ok8J09k79L36n5O5j38k19K26k17K67o3J94l31n6
4712a54J1L11k63K18Q7k42K09k83l9Q6K65j19Ok16K47j27j76J75k9O6j00N7N9
4735D9J11o9L0k68J2j05L34j03J21k41n7J05K15o1j12L52l74K54k82J63k47J6
4757a57k48N31j50p7K10k07K4o0o1J00j43J27J9J08J36n7j49Jr7J2N5K44l3l2
4781I6n2m8j86J74K46m09K74n6q5Qn8K44l14M0K72j38J63j17O3l20K75j65N8R
$$ plain form
4616 -225 225 130 -79 92 -43 -71 -133 -19 106 104 -15 -102 83 -6 1 47 -227 -71 -80 43 232 202 46 110 61
4641 61 -101 -114 29 160 170 41 25 -57 134 -224 -88 216 -14 3 -87 160 135 39 -13 114 -103 321 -42
4664 -42 -61 98 44 177 -79 -49 -139 29 32 8 222 -95 -99 -66 0 121 -51 -62 211 -133 -217 -36 305 399 -93
4689 -93 195 -79 45 260 -45 77 29 35 7 116 -163 173 118 183 45 -174 52 -165 102 39 233 -98 -154
4712 -154 -143 168 -95 123 210 -32 177 -106 -145 -59 206 87 93 -123 124 -3 -179 -4 -33 33 -67 -10 49
4735 49 160 91 121 -147 -135 -240 94 -9 112 -129 -186 -81 134 73 -39 313 -61 193 -89 74 -173 -157
4757 -157 -405 126 -24 -101 109 -98 -74 -134 -195 -95 -238 -111 -92 16 152 95 -54 -53 -150 -138 -83 161 128 96
4781 96 44 -4 -190 -16 230 -179 95 39 -46 -38 -96 148 -166 -126 146 8 171 54 117 -203 72 -93 -35 -26
4805b6J12k75K56J20j94J46j35k62L50j87L39k67k87L57K1l03K22pj53L5L79j44
4827I7l41L8K81j87r4L14o6O6k3J0p9lk57K70J15o7j04N8j27J58L2L1j6m8k20
4852a62N2K76k68M8K58l06K99p4J29j72L3k4Q3k03J51j67R8k5P1j22k33L59j46
4875d5N8Nl9k5R5j59J05P5j00J64j06j7K86k55O1p2J6j16J54o9k63R5L61rk89
4900h9J95l53K74O2j76K53m12J6M94k64NK03l1l05J48k49L34k55K86j59o0J90
4922A07j43l7L8J42m00J58J49k67K23J6K66j66l20K77n8k3K81j45o3J39k8n7l9
4945E0O7j91j20L45K59k57j78k12L0J38K6L3j0j34L30l33P9k22r6O66m49J71l2
4968d0k18nJ52j17N38l50P0L4n5K9lo8J22j56K90l23J87j22J81p7n4J2L5j38K24
$$ plain form
4805 -26 86 -189 67 187 -7 139 4 -258 92 -95 244 -23 -310 47 68 -235 -13 -20 -173 -138 241 97
4827 97 -244 -206 75 -112 -206 108 42 108 85 95 16 13 -244 26 141 74 -30 28 -99 59 91 122 106 58 -162
4852 -162 -110 166 -102 -54 204 -102 197 123 252 80 113 89 172 -31 120 -47 51 26 97 -25 -258 101 -45
4875 -45 13 18 -21 -46 49 -110 -5 70 -30 134 28 11 297 42 103 31 47 -69 85 16 -247 -152 209 200 -89
4900 -89 106 -247 27 89 -87 166 -246 -230 264 0 5 208 177 -128 20 -229 105 -150 136 -23 -83 107
4922 107 -36 -73 -35 107 -293 -135 14 -253 -30 -14 252 86 -234 43 -15 -38 243 98 35 174 146 89 50
4945 50 117 -74 -194 151 410 153 -25 -237 -207 -69 -43 -10 -20 -154 176 -157 -78 -300 -396 270 -179 -8 -40
4968 -40 -258 -263 -111 -228 310 -40 30 64 9 38 35 -33 89 -67 223 -100 87 -35 146 69 15 27 62 -76 148
4993A48k17N7P0j46K47k83L6j2L08k69J17p9N4K1m3K8k78L19k31L36j89J10p0
5016C4n2l2K71k47j87K32JL5k6j34J40r4L5K0K91m83J17K05j46j94N6K02M1k35
5040a50M19k59j91K58q2j29J29J01k06J90j11j78l7M45r2o2j86K23k22J37K2k91
5062b72K58j0j04R8l0L18j98J30k01M3o2j70J97j81J29J5L3k8J90j98L16m12L91
5085B52j93j6J7k65P0K4q6J59m8J47k3Q7n6l0j02P1RM4m0k09M41j42j03p4N3P7
5111F4r5R5p8J18K8j61r5J54j24J55j81k33L88K66k51m8l9J08q1l90K35L36k14
5134d3kJ50j27m0j67R2N03l59q8l9L83m36K84k38J40P4j35k08L81j8k2j06j99
5157b20K68j2nL9k00J27o0j50L28k30M35j37j78J23j59j14l9N4J06j2J34l3KL9
$$ plain form
4993 148 -69 -12 58 -88 159 -124 -88 -100 208 -61 56 -23 31 52 9 37 -241 78 -153 183 -6 104 34
5016 34 -18 -50 221 -26 -213 19 20 55 29 -105 35 -59 -24 -4 287 -196 -79 126 -20 -214 -158 44 85 -150
5040 -150 269 10 -181 77 -5 -134 -5 96 -110 80 -31 -209 -246 199 107 45 -141 82 -140 -3 19 -272
5062 -272 -14 -24 -128 -30 -60 258 60 190 -11 32 -30 -200 -3 -184 -55 -40 -7 -35 155 -43 273 -139 252
5085 252 59 43 60 -205 -135 -111 -197 -38 -86 61 38 125 69 39 -63 8 17 61 21 -188 253 111 8 -66 -13 64
5111 64 -31 64 -14 104 132 -29 -124 30 -94 61 -120 -353 35 301 50 2 -37 71 -10 -400 -165 171 -43
5134 -43 -45 105 -22 -62 -229 -137 366 7 -81 -120 263 -173 111 -127 13 87 -48 -256 125 107 85 -21 -220
5157 -220 48 36 31 70 -130 -3 -63 -213 115 -115 320 183 5 128 -31 -145 -184 -130 -24 -36 98 65 67 106
5181A06k31L32k82rK97q1j01p7j8J3j63J6L66l97K31l72L63k26q4R3J94K0J05
5204I5j29k06J62J54J46m33J62m3J10N0j28K14k5j52K76l96L8l2N6j4j30K19n3
5227e9K78j90OR6m22L93r4J73k99J14o3o3L31o0k09j02K27Pk02K24n0m1o3p1Q2
5252e7J53l37K38j92K68k39J54n5k4N9J84k53J23j90L04k60M1J68M4o4nl89J75
5275a54L04j72M1J05k46R8Q7j7l9J31m27rM77O0j28l49K89L1j1L1m8k04L4K81
5299A65k97J43jJ04r1j63J41K1Q1nj35P8P1j83J12m7Jj27K86j27j20K52p0j55
5323f6J58o0n5pj13O8j18K51M9j03P6m71M97Lk38q8M23j11k69O2l2J66RqL9p4
5349a2k5o6R4L1J74j6k31J89n6r7o9K96j17j00jj58M01l27mR9Qm5J31k07J69j02
$$ plain form
5181 106 -125 207 -75 -84 213 132 31 -46 -64 -51 -214 -198 168 -229 2 -370 -7 -233 -317 -224 -30 -10 95
5204 95 -34 -240 -78 76 222 -211 -49 -92 18 68 -60 154 129 -23 253 -143 -105 -137 -81 -95 -225 -6 -59
5227 -59 219 29 35 131 -291 102 8 181 -118 -4 -67 -130 201 141 -68 -170 57 64 -138 86 36 -5 -68 -139 -57
5252 -57 96 -241 -3 -195 73 -166 -12 -67 -91 -32 152 -101 22 -168 136 -124 -83 85 129 65 60 -329 -154
5275 -154 150 -22 19 124 -122 -24 63 46 7 138 -289 -298 179 239 111 -238 51 82 71 102 54 -150 -116 165
5299 165 -132 11 10 114 23 -140 1 22 103 98 -37 41 112 -71 41 -6 -5 -132 154 27 -93 159 89 -66
5323 -66 92 32 -23 -30 -143 -75 -193 58 107 4 80 -391 106 109 -129 -217 206 95 -174 -112 -144 22 31 23 62 -12
5349 -12 -37 -103 -9 22 196 180 -51 138 82 -15 -84 212 95 -5 -6 -164 237 -90 -94 5 13 -32 99 -108 61 -41
5375d1k53L03J18j68P4J45Ml56L78q3J21k25K86l76O4J73j70L1k00M26l68J78
5397F1L1p7P6j37J82k64K12K2R6j14j61n3J11K0K0j6j18K72j44j01K78j14k46
5420a64K77q6j33K19l81J84J82P2j96P3p4K0M1J22k24K65m14m3J96k77J59L14
5442A32m8p9O7j62J79j56r2K68j67q7J20O2n4k0K7N6J2j76J1k9J91j9L1J9J28
5467B14j99jk25L21k75kK96j24k09J39l0L04q6k01K57j87r7J82J05j35k18L12
5489A41mo8M9n9j81K1l2j32K73L6j85K41k05N3K6k83J51J84l9j82P8LQ3J32J6
5514A17q2j35p9K85O7k36K92j13q9K56l44J6M4J73k41K18l66K77lj57j09K46j11
5537g4K3J1Q6J11l13M47l93J54o9l2J06k3R9j28P1J10j38J3j00J52n1j59J76j10
$$ plain form
5375 -41 -294 9 127 -41 33 178 182 -174 204 121 242 17 303 -73 -9 164 -6 25 -175 251 -117 61
5397 61 92 15 91 -46 136 -128 84 106 202 88 -73 -126 -15 5 25 9 -109 163 19 -82 196 82 -164
5420 -164 113 27 -106 113 -268 -84 98 170 -26 47 -27 -7 34 156 -68 197 -217 -260 -64 -341 -182 132
5442 132 84 5 72 -90 89 -67 -159 109 -58 -145 -25 37 -17 -37 -10 46 58 -118 -107 -136 55 36 67 86 214
5467 214 15 14 -211 110 -165 -167 129 5 -204 -65 -95 209 123 -78 179 -8 -105 77 182 47 -171 141
5489 141 137 69 118 59 -122 -101 -133 -265 8 44 -141 100 -105 -52 -26 -309 -158 26 -13 -195 -117 -114 -31 101 117
5514 117 35 -100 -179 106 173 -63 229 116 27 283 -61 -45 -1 172 -69 149 -217 60 57 -100 -209 37 -74
5537 -74 -51 -40 46 157 -156 291 -102 52 -17 -49 57 34 133 5 76 186 48 61 -39 113 62 -97 79 -31
5561c1J17J61k64J1K5r2J77On9p7Q8j48J73m35L42J97j18l8Q4l77L86m0k60K17
5585D5pK1M3j76j31K22n8P0J49r9k5l9o6lJ90N3k10j03K26K04l76K1k03K45m6
5610e3K70L1k18l09L33J31o7k94O6N9k29J30j06P2J19q8K0PK12l2O3k78Q2o1M70
5635C30m76J08K58k79l3k5K54k56M2J85mr0k09K85j62j76K07Q6L8M3j64J52o5
5658D9J04k20J08l61L75Q3K3j01j58J50j62l2k8O3K13K5p2j37MJP9L5j04L89k94
5683C2k37L4L25k47K20J8l52J13K14j80K3m2K48j36Kj99K30J77J72m64J59j40
5705c0o7M0J71j64J22k8O7k65J69Q8k22J05n2J61k1K5q1j16n0K40K9k10j60O1
5729a88J40N0J51r4k85M58j12O6l93K98j2nj04L7J13k59K08J07km60K69j96K98
$$ plain form
5561 -31 86 247 -17 -6 19 -73 104 110 51 -26 62 -86 87 -348 -6 191 73 35 119 -258 128 88 -172 45
5585 45 38 59 102 -74 -205 17 -41 29 178 79 54 15 -51 -54 136 189 -21 -124 102 306 -70 -49 -252 -7 -53
5610 -53 217 248 30 -279 54 185 118 -176 -110 -51 -280 -150 -256 -184 -65 -153 -133 -126 86 54 117 -161 -79 -140 330
5635 330 -146 -38 220 -59 -92 -117 137 -119 -77 108 104 14 -195 90 -72 -248 -41 45 83 126 -38 114 49
5658 49 153 -67 41 -320 55 138 161 60 -98 52 -110 -142 -170 -107 106 131 59 -78 -74 -73 6 41 -63 326 32
5683 32 -205 -171 154 -93 127 145 -207 -94 120 -60 -37 -79 169 33 35 -164 66 243 415 -49 110 -30
5705 -30 -97 -57 114 -50 72 44 111 -154 15 103 -119 -14 -66 95 74 99 18 -98 -148 92 121 -89 -249 -188
5729 -188 -48 2 153 59 -226 232 120 186 -207 91 79 74 -30 7 120 -139 69 176 174 -286 -17 -213 85
5752H5q6j63J83R6q7M1m0j23J24j61J61K12m10L22O4k98L70k84n4k7k5K8o7k1
5776a60J18K91J13j59k22j26o4K74R6j87K04P8m72J55j15K98j72J16k50N4Q7j20
5798a63M13p7o7k20K65j77Q2j29J21J46j09j49O9K8q9N7j56J92J14N7oj43L9p9
5822A9J73j92j9j13J79j84j8K06r3K04j16l34L36k54J77M2J36p9N4j32j29N05
5844C68k37Q5k29j64K7K96k55q8L59j78%J21j50J24k9j27jR2R3j42K8N3j06J1
5868d9L0n5o1j9J72j63J34pp3J43k31J92j7J92l63L9J77l7J18k48K90R7l01J68
5892A28k18K64l5n3q7K4j1L5K40n05M41k24J7J50K0Ol36L08j0n4m48J17K26n3
5916e8N4j18K74R6m45K60j67N6L25j89j96K52J11j60k98N2J57k3j34J94K14l17
$$ plain form
5752 85 -1 -164 19 115 28 69 29 -94 30 -131 30 242 -168 154 218 -80 290 6 -48 -75 -100 -72 -139 -160
5776 -160 -42 249 362 203 -19 -145 -209 65 161 -26 178 256 -216 -61 -176 122 -50 66 -184 -130 -43 -163
5798 -163 250 173 106 -114 151 -26 56 -73 48 194 85 -64 5 33 -56 1 -155 37 151 208 202 59 98 19
5822 19 192 0 -19 -132 47 -137 -155 51 -42 162 46 -288 48 -206 -29 13 149 70 124 -8 -137 368
5844 368 131 216 -13 -177 -150 146 -109 -197 162 -16 -16 105 -45 79 50 -77 -78 14 107 -35 -7 46 -60 -49
5868 -49 -19 -74 -135 -154 18 -145 -11 -18 -91 52 -179 13 -4 188 -175 -136 41 4 122 -126 164 261 -40 128
5892 128 -90 174 139 86 -1 23 12 47 287 -218 223 -1 16 166 186 192 -144 164 154 100 -348 -231 -5 -58
5916 -58 -4 -122 152 248 -197 63 -104 -48 277 88 -108 144 255 95 -203 -151 6 -17 -151 43 257 -60
5938f0qk4K99j68j58O4K00j53N0k12J93K6J1j24m8M7pQ5n9K64k55j96J15j2J11
5963a9n9J20K2j80K32r7rj13mJ31K60k72j81K84j66n8P3O2q4K3K49o7k56Q2L16
5988B89k29j87PK3J26o9K37l45l7L18K6k52J12l05L7L12k25K23k2j99J33J3j6
6011c0k81J37L08j65p6L1J56j71j36R9K09j41J56Kj65L05j76M5pl04M41k68J08
6034G7Q6o1N8j53N8k66R1J57k00J09P4Q8l34K85O6j33L5m7p0J18j55J66O5k2l02
6059b10K60j33R1K74l0q2k32j30J24J32Q1j05K76m06K53k48n8J5L67k6k45o5R7
6082@RR8j16L6R1j31J05j00q7K27l12M36l15J31j12M2K3p5K85k82J87k43l2J25
6106a0J54J41k50r1J08k19K06r2N1o9J33j09j0q3R9r2m6J42K18j66R5r0l9r3K59
$$ plain form
5938 -60 -68 -92 207 39 -119 -55 145 -8 42 -170 23 49 60 -64 -112 -65 -72 13 -46 218 -37 -233 -118 -130 -19
5963 -19 -78 42 64 -116 116 19 10 -103 -107 24 284 12 -169 115 -51 -109 -36 26 -58 -35 214 147 -109 -27 289
5988 289 60 -127 -120 -97 29 -40 197 -148 -185 133 159 -93 19 -286 -249 63 -162 61 39 -160 -27 -14 -30
6011 -30 -311 -174 134 -31 -107 -76 80 -91 -227 -128 81 -60 96 98 -67 238 62 107 100 -204 237 -31 77
6034 77 163 102 160 7 65 -201 -110 47 -153 -44 30 118 -216 69 135 2 37 -10 -80 38 -117 49 114 92 -210
6059 -210 50 -83 8 282 252 170 -62 -192 -68 64 145 40 316 -90 163 -85 -143 -128 239 213 -32 -97 0
6082 0 9 107 -9 27 118 -13 92 -8 -95 132 -180 256 -59 72 -40 2 25 -50 235 -47 140 -103 -135 -10
6106 -10 144 285 35 -56 52 -167 39 -53 -2 -71 62 -47 -57 -140 -41 -133 -179 -37 181 15 110 20 -19 -112 147
6131A47l90K56rOJ80m4N2m44L08J05m53J34J84p3J78J1k18J68lK4m9k2J6P9k15
6156g2O3J11j00pR3j11q7M81n21J72r0N0j06N4J3J47q0K28k65k12K19J67k43J63
6180F7L28m70r8J73O3J02k55K2m1j76M05p5J90j20L0m3j69J86j28KN3nk46K86
6204H1j33K69k05q0J51o7J5k03M0K90N8l29%K06l01K57l73J01Q1L50J01k37l7
6227C5M9k30P8M3K14m3r3N3j06M4rK02j95N2k03j19P9oK19o3l1J09K6R7k83M71
6253C90n31j8J32R5k18J61J85p2j28o0j10L0Q3Nm4K81j53N3M3l28L46q9k19J54
6277a2J71j68K12k49k48K05m8J43k6k49L57j96lQ6P8J1k56L38k10o6k82J85K19
6300hJ75j17j95k5L89Q7m20K6K8QP2j1J21o6M5Q7j19L0O9k12j3K61j69Q9L5P9
$$ plain form
6131 147 -243 13 4 10 190 146 198 -246 62 167 -286 -152 32 -41 137 148 -70 98 95 119 70 48 64 143 -72
6156 -72 -9 102 2 -5 88 -23 -110 371 -150 22 -68 -18 -124 -70 -57 90 10 238 -27 -239 -20 147 -96 67
6180 67 395 -75 -173 0 63 165 -90 -68 -109 -285 120 45 235 115 145 102 -67 119 -9 -7 46 41 -205 81
6204 81 -52 217 12 -68 83 16 31 -172 -132 158 216 -113 -113 93 -208 49 -324 -223 -142 208 309 72 35
6227 35 84 -146 -68 -25 189 146 53 106 0 44 35 237 42 94 -109 -228 -149 -155 64 1 -30 79 105 202 -81 390
6253 390 -141 -159 -27 68 -150 11 196 124 -4 -64 -174 -144 -61 -56 -100 181 28 81 124 -204 142 53 -166 -12
6277 -12 159 -9 203 -46 -294 -89 -137 6 -20 -269 88 -108 -111 -25 53 64 -192 146 -64 -130 -412 -227 -8
6300 -8 167 50 -145 -170 219 306 -114 -88 -60 -52 20 9 130 64 109 196 77 107 176 -36 -49 212 43 132 167 246
6326B46l64L12j15j37R8n4k6K6K3k66M1J90M6j84K23M0j57R6K3j61N2j16J08K29
6350A73k07j24K58l17J67l4J36k22O1R8J79j14k90L32k50R9J15L2j56o8K04j79
6372a07J69k02K20l4j04J26j11Rm7J71k49J64k0n6M12l49k3K92k16KO5p9K5j83
6396a25RJ79J12j98j29J81m7J75j67J17j89K03k31L44k53j77L61n1N1j7o8j69
6418h9J96j4j2L4n4k37qL33k15j2J37j83J03k21R1Q3k3J12j13J51j27o6J86j6
6442C6l5k69L72j43j85K65Q0j26k7q3n8K30j25J10rj03j07J82O8r3j22J29K52
6465B39m08K72k18K41K5l16J34J83j10LJ08j89J97j40J87k40M2J17m7k03K88J28
6487B93j30j70q6J72o1j9K3J10J36k98J55p9j37p5K81q2j50qJ99jJ15k85J12j07
$$ plain form
6326 246 -118 194 79 -58 40 -14 -40 -14 9 -257 -216 -26 20 -164 59 99 -58 38 61 -100 -48 -164 -56 173
6350 173 -34 -158 100 -217 -50 -84 52 -170 -109 -11 168 54 -236 96 -154 -55 60 92 -64 -132 72 -107
6372 -107 62 -140 80 46 -58 68 -43 -34 -81 90 -159 5 -15 -71 341 -8 -31 261 45 47 112 33 58 -125
6396 -125 -116 63 175 -23 -152 29 -18 157 -10 107 -82 121 -110 234 -19 -196 165 114 165 148 80 -89
6418 -89 107 93 81 115 61 -176 -184 149 -66 -78 59 -124 -21 -242 -151 -68 -91 21 -92 59 -68 -134 52 36
6442 36 1 -268 104 -39 -224 41 121 -5 -32 -115 -173 57 -68 42 33 -70 -177 5 73 -20 -142 -13 239
6465 239 -169 103 -115 126 151 -165 -31 152 42 45 153 -36 161 21 208 -32 10 127 80 -123 165 293
6487 293 163 -7 -93 79 18 -1 22 132 268 -30 125 46 -91 -166 115 33 -117 -125 74 73 188 -97 15 -92
6511i2J50J36j27m6Q1nk04P2J09p6k66J90J19o1K08n3k10Q2r8l5J45K23k95P0
6535A7l94N31j29k84K28J12k29O4M2J37j25k63J22J49j82L45L6j68j38o2M39j96
6557E2r9j03K21J56n26J24L52j69J4j02J17JJ48l53L81l10K50r5k15K73M5j24
6579C8j59J43l0l10M54l66L17q0k62J96r8K40n1J50j77j70j24L26j03J47J47k49
6601b1j39J46J72M6k20%n9J71j3j6j24j85K79o1o7J54k57K30L2j37j9K8j63N8
6625a65Rj13K34j49M11j64P8m07J49j01J04L03l19J71Q5j22k1%K08k40l5L32l98
6648a50l3L4P2L54k69j7L4J41m68M47j24j64J86n1k3j84K71Pj29L7K60l10L44
6671B65l96O4j09J20J83l03L31l55J69J40r9j05j95K62m8K14j64K23p6k15K8J59
$$ plain form
6511 -92 58 194 67 21 102 97 -107 -35 74 -2 -268 -78 41 -20 188 135 -75 7 -91 -126 19 242 -53 17
6535 17 -377 154 25 -259 -31 81 -148 -84 -42 95 -30 -293 -171 -22 -204 141 177 9 -129 -191 248 52
6557 52 -47 -150 71 227 -299 -175 177 8 22 -80 37 38 186 -167 214 -96 154 59 -156 117 162 38
6579 38 -121 22 -8 -318 136 -230 87 7 -255 -59 -157 83 32 182 5 -165 -289 37 -66 81 228 -21
6601 -21 -160 -14 158 204 -16 -16 -75 96 83 67 -57 -242 37 -24 -91 63 -194 36 68 -69 -88 -60 -223 -165
6625 -165 -156 -269 -35 -184 227 63 141 -266 -117 -218 -114 189 -130 41 126 4 -17 -17 191 -49 -84 248 -150
6648 -150 -183 -149 -77 277 8 -9 25 166 -302 145 21 -143 43 -8 -31 -215 56 63 -66 -29 231 -79 265
6671 265 -131 -67 -176 -56 127 -176 155 -200 -31 109 10 -95 -290 -28 -76 138 -26 197 121 -94 -66 93
6693I3o5n2J10j2p9J9m9QP1m9J27k17K68m8j04K9k31L93l36J68n0m6k9J71q9j61
6719a60J99Rn2j04O5K17o5J5k34J33K96k11J3k34L57k28n2K07j8l84K31n9K73
6742B14k20n6Q7p9J11j51J7k1o3J58l52L77l7p7L24l21R3J24r0j73qJ43J7k74
6766b57K50P8j16j96K6K87p5K3k9k19J37k5K31k72J15K10j79mr4K73r0Klj26n1
6791a04K57k47k8J99j89r3K14J01j36N3K4Q7k04j14K39j13R9j83K08J72j46l1
6813F5m3N6j44M15j70l10R8J1k1K08R2k41R9J00n1k67J9J52o7n0k3J0P6k23J92
6838a7K20k52J8j18J53L2J07j67P8J2K6j58l3k9j01L24l25M29k17O7j19J93l45
6861b22J74J04q5n1k3M6J13k72K89O7j19P8j12k9m6J43j57j03L66k47O8KR9j14
$$ plain form
6693 93 28 -24 86 74 -5 14 -35 -27 44 -5 122 -95 173 125 21 50 -181 212 -124 44 -6 -52 -81 90 1 -160
6719 -160 39 48 -4 -108 -43 174 109 124 -110 23 319 108 121 -113 244 16 -36 171 153 -231 0 -59 214
6742 214 -6 -62 25 -54 57 -94 -77 -98 -161 -3 -355 22 -15 -92 232 -89 4 128 38 -135 -143 0 17 -257
6766 -257 -7 71 -45 -241 -215 72 -3 20 -9 -228 -91 -116 115 -157 -42 168 -11 -15 -109 164 74 76 73 -53 -104
6791 -104 153 -94 -122 77 -112 -205 9 110 -26 27 51 138 -66 -180 59 -54 45 -138 70 242 96 65
6813 65 22 78 -66 349 179 -131 -33 -22 -43 165 257 16 115 215 164 -103 -84 68 1 -49 -72 -62 14 -209 -17
6838 -17 203 -49 -31 -149 4 36 143 -24 54 66 92 -66 -99 -128 -229 95 -230 199 -18 49 -70 123 -222
6861 -222 -48 56 -29 -80 -103 -57 56 -216 73 140 21 99 -13 -42 -88 55 -102 -205 161 -86 -18 -16 83 -31
6885c1M8J62k38PJ82k9R3k21k16K31N2L9j46R8P8j26K56k2k89r6QM72k27l40K03
6910e2J95k46R4j3K30l06K03j25j07R6O5j8j71L3o2J82j33N1k5N9K4k31L35k10
6934a32K72J9J85n07N5k0J30o6L4O0j24j61J60J81l32J00K39k4l72L55J48P2m13
6957a41j24J37j92N21j58P4k56J69m3j60L15j04J14k54j18R0J44J48m5k27qJ18
6979@O8J45l21J71j13K86j39j61K72j42K88m42J74k81L72l85J78K3p6K99k52J22
7001H6k12L54r5q4k21K9M14k33J30l85K66J2J58k90J21J8j86J77r0j46M7J18j75
7024a87K23K09j97l32K56j44M10k81N3N1Qj7M4m4J80j06j04K79l93J60j85L20
7046B03k57l3P0J04J98k44R0K2k47K94l82J93n2J75k00m2K03J05k71l1J71Nq1
$$ plain form
6885 -31 17 179 -59 -52 130 101 194 -27 -243 -12 40 79 -67 31 109 -17 239 217 -72 -168 -160 312 85 -255 -52
6910 -52 143 -103 -9 -22 208 -98 105 -20 -127 -31 34 16 -155 -122 -184 -2 -135 -84 -109 -50 -26 -257 78 -132
6934 -132 140 159 344 -163 -108 -128 2 -64 -30 30 -94 -255 -95 86 -246 -146 93 69 -303 52 200 272 -141
6957 -141 -265 -128 -320 201 43 117 -139 30 -13 -173 142 38 152 -102 -220 -130 14 162 117 -110 -118 0
6979 0 68 213 -108 63 -50 236 97 -64 208 66 354 -88 86 -195 177 -208 -30 -7 -83 216 -36 86
7001 86 -126 228 133 49 -172 -143 271 38 168 -217 49 61 219 -71 50 68 -118 59 -31 -177 -130 -12 -187
7024 -187 36 245 48 -284 -28 -172 238 -43 10 61 69 52 96 52 232 126 22 301 -92 68 -117 203
7046 203 -54 -87 -17 87 285 41 131 153 -94 200 -182 11 -41 134 -66 -108 95 200 -71 -102 69 74 -7
7069gQ9j86R8q9J80l02m7K9J71K57j48j81J14M5q4P5n9J91l64L82K7k94J36P2
7093A05j29j0P1k28Q2L11m28J88J45k9Qj11j84J74K80j14k41L33j87j08J49k48
7115a71M12m09J63M8J2n3m3J3O8o4J06q4J11j18k47K43r5J79p0j70j33K75M6j8
7139AMmj32K46j02j11K36K3k51%M8K1N3M0k12K31M4l77L31K28o85N78n52L43j15
7164a14kJ55n4K02l11J91N7K5K8M9j75j11N3j43J46J21l39L10o0r6j6L7k1K9j17
7189a56K27N8k70J50j19J91j34q8J80o9K22j90K3O3Q5j80l9K74j77k25J13K45
7211A84M6k19J14jj28j88L50k41n2m1J90J15k0k58J64M7m4o7M06m68j40R0K26
7234F5j34mq4J97O8k81J24Pl8J30j83N2L13j05pj45O2j33R2q6K05k60J94P8k9
$$ plain form
7069 -7 82 -104 -6 -95 85 -217 -264 -235 -64 193 45 -136 -22 23 -61 14 -45 146 -218 164 191 -103 33 105
7093 105 -24 -34 37 -191 -109 202 -226 -38 107 78 86 -25 -209 -35 245 131 -110 223 36 -72 77 -171
7115 -171 241 -168 -5 43 55 2 -41 -28 40 -24 82 -2 109 -9 -256 -13 -108 71 1 -169 -302 -27 19 1
7139 1 5 1 -131 115 13 -98 138 161 -90 -90 -42 -21 32 72 -140 91 135 -242 89 317 -368 210 -342 1 -114
7164 -114 -116 39 -15 187 -124 67 124 149 177 226 51 -60 -7 -150 -4 117 -222 88 28 -68 -84 -47 -68 -39 -156
7189 -156 71 129 -141 9 -110 81 -53 -141 39 -30 192 2 25 88 173 -7 -46 228 51 -174 -61 184
7211 184 230 11 125 124 -4 -192 158 -83 -135 -176 14 129 109 -149 15 62 18 -49 357 -111 -251 -161 65
7234 65 -69 -73 -157 40 108 -173 -49 -42 -80 50 -133 -81 232 127 120 -25 37 -96 -4 -90 115 -145 49 127 98
7259I8K69l89m3J65J10k89J64j03qJ36r7J34j13J73k38J6j41K82j18p8lJ23J84
7282B34l63M5R4J18k74J69r5P4J60k45L37r2l86R9J64j11N6j23J23j42L03k21
7304g6K11Q6k46M5l4J8j1J45J51m55L76k79L7K16PK9l45K01j08K87l51J8K09m81
7328c50N38k41j3J67k34J10k11K20q1J96j82LJ19K35L8j80j65J88k26J27J81l10
7350g1j69M20j02o2J02n9K21j32l1k59K56j58L55n95J74k4J33J11L8k76j00L05
7372G7j17J46K2n1l8L82l25j76J89n8j77L46m34J43QN9K2q5n7L67j70n5n6M0L7
7397C9n5J01J46k24k25M01m21K19J73j27j86M56k24k77K23q3j42m6K89j81K74
7418A30l97M22k18K77l62K91l7j0J11l0m1J9Q3n2L8l33K13k48K26j76r1K07n4
$$ plain form
7259 98 367 -22 -65 100 210 -79 85 -18 -26 110 13 147 34 207 -31 -15 -156 126 8 -70 -73 50 234
7282 234 -129 -84 10 128 -146 23 -72 2 162 -83 254 162 -224 -125 39 -72 -16 -139 -16 -158 145 -76
7304 -76 135 221 -25 20 -14 4 -7 138 289 -166 210 -69 -32 184 191 220 -125 76 -32 255 -96 -78 131 -350
7328 -350 188 -53 -66 101 -133 -23 -234 -14 -95 101 -81 -78 41 276 314 134 -31 157 -69 58 239 -71
7350 -71 -240 180 78 16 118 59 280 148 117 -142 114 -44 311 -284 -110 -134 -1 110 148 -128 -228 77
7372 77 -40 106 128 77 39 421 96 -80 109 51 -126 220 -214 -71 -63 -4 18 -67 -124 243 73 18 -38 2 39
7397 39 -16 85 231 7 -218 183 -238 -19 154 27 -159 297 73 -204 19 -64 -206 -252 37 -144 130
7418 130 -267 155 -63 214 -148 143 106 96 207 177 136 155 238 186 224 -109 104 -144 82 -94 -185 22 -32
7441c2K26k29j70J32K58p3j49n3P6Jj94M36r9o7k66J09R3J68j41R7m9k65J56m9
7465h4J82K7N5j12M5Q3k87R8j10O5J15J64l18P7P4k93M3K82j22K73l50M6L6k16
7489b27M18l07J70m8J2M2J06k46j90K54O9K91l03J25r9k96K22K20j63k3p4KJ22
7512G7J35J11k77o0j45LJ83J23l77J87L73o08P5L01J04k90j78M06O6k65J67j12
7534aR9j76J70R3l32L75l29J4J78J39j47l8O4j23rN1Q8r7P8o3j17L6K14l19J84
7559C2j10J08O9j32l03L18j82k35N14j15J04p3K7K15j48j1l38J88J11j55J26J32
7581A42k17o7k8L44j90j18N7J8k1J10q4J40J85l16L11j64j33r4J74J3j41P3kK00
7605A92k56L81k20j94pj05K83j83j30L08j56K26k22n5J21l0L19n21K79p5K79m98
$$ plain form
7441 -32 194 -35 -205 -73 185 112 -37 -90 -14 -13 -207 229 130 63 -203 -94 -1 167 26 123 74 -191 -35 -84
7465 -84 98 125 180 68 113 196 -91 7 -103 -38 77 241 -77 0 74 -219 -176 106 -16 257 -93 -47 -11 -227
7489 -227 191 -116 54 6 18 60 166 -80 -270 -16 53 344 41 166 67 -229 -7 213 50 27 -47 -45 77
7512 77 212 323 46 -14 -159 -156 27 150 -227 -40 333 -275 -200 101 205 -85 -263 143 209 -56 111 -1
7534 -1 98 -78 92 185 -147 228 -101 -87 91 230 83 45 109 -14 -23 28 116 19 97 34 -83 -47 167 -152 32
7559 32 -78 30 99 -33 -336 -18 -200 -435 79 -36 68 -5 22 237 89 78 -260 -72 39 -116 10 142
7581 142 -75 -142 -170 174 -16 -134 -77 -59 -80 30 -54 86 271 -45 266 102 -31 -125 49 62 -79 -6 -8 192
7605 192 -64 317 97 -97 -104 -209 74 -109 -239 69 -87 139 -83 -138 -17 -47 272 -249 30 -45 234 -264
7627b64J34J30q6j2J90p6Q9NL15m44r3K43j32j13O4Q2rj64K72j0k23M5j63J13
7651a07K32j87k0KJ44J8j56R5j53q2M32m49K72j73K04j00lK37k96K25j69O6k08
7674a76K77j16K9j9%k5J16k16K98M9p4m36K93o8o9l3J74j5jm6l4K14j83L0L0l6
7700c7N0J10J05k47k66M49m58L00mk53M09l00J81p6K34j51p1J59l48L48Nj47p8
7723h6j58K56j16L9J30K38k55k3p8oJ98p6Q0o1r1n6j12J84Ok97K10J37q5k07K97
7748F8ol0J26j35rj07K74k21N9N9Q1J22m94K52r0J93l03O6o0N8R5r2L98l44J19
7773G9j38N1o7pL5J02L4m06L36N6k02K33j59n0j58O07m80J09l3q1K73q4j1K41
7797B80k24k46J62r1J34k8p6k32L59k58L72p4l90M08k19k74M50P6l85J98o0n4
$$ plain form
7627 -264 -130 0 -86 -98 92 16 105 110 425 -19 -112 131 -1 -114 -50 32 23 -141 131 121 -102 -57 -220 -107
7651 -107 125 -62 -82 -80 64 82 -74 21 -132 -214 218 -231 41 -132 72 -28 -31 206 -90 135 -34 32 -176
7674 -176 101 -15 14 -5 -5 -30 86 -130 168 217 143 -293 0 -68 -137 -170 4 -11 -12 -58 -92 122 -61 -31 -1 -37
7700 -37 13 123 228 -19 -285 164 -294 6 2 -251 158 -142 39 -37 197 46 -25 134 -214 134 139 -8 -86
7723 -86 -244 12 -104 -65 65 303 48 25 -53 -59 139 63 143 82 -9 -65 -177 7 13 -284 -74 63 -22 -229 68
7748 68 62 32 158 23 14 -93 181 -40 19 78 159 281 -213 39 -51 142 -161 -95 -155 -97 -2 -94 304 -40 79
7773 79 -59 -8 -75 -82 -47 55 89 -317 19 75 -127 106 -53 -103 -261 346 -134 -25 -58 -139 134 50 39 280
7797 280 56 -190 -28 -119 15 -13 -89 -321 38 -220 152 78 -312 96 -123 -397 53 129 -256 -58 -118 -172
7819a72M3K61K7N4k13P9j84J66l16K42K26n17J89L76Ql64k7M9l6J15P7Qm76L52
7843c3j36K6L11j90J21j23K16k69J0K2j2k0K8L88m74K28J03m78K84R4r3k9k38
7866b64L25j12R6k83K65L9J50n2p7j04j19J25k80K36N0Q9q3J89j68n3Q0j61J58
7889D6l7j28M2L00k15j52N4J73j68K37j02j27J55k16R0J3j96M49l08p3K26J14
7911A77L1J5o2Jl18K5J20K4l18M71MJ19k34l2k00JM9L55l82L5O7mj27K57M3k73
7937a56L23m9k45L07l38K62j40k0J07m3p9p9K42J7j13r9J44K2k8K2L2n2m2o1j55
7962b21J29J11j40K87k09j23p3K32J02l60L05J3j97J24P7q3J34k19j05J74k04
7983b46K17K3J29q8K08k30K5j63l6K83j71K24o5J09m63M80k90rj27L9Q4k13J59
$$ plain form
7819 -172 -129 132 159 213 0 79 -105 61 -255 -13 213 -304 -115 261 269 -95 -122 -73 -109 6 83 91 -385 -33
7843 -33 -169 -143 168 -22 99 -24 192 -77 -67 -45 -57 -77 -49 339 -135 93 196 -282 2 96 3 -26 -264
7866 -264 61 -51 45 -238 27 66 216 164 87 -17 -136 -11 -291 -55 -5 84 1 190 22 -31 49 -112 46
7889 46 9 -119 -77 223 8 -144 -90 83 -85 152 50 -77 78 -138 -48 -35 -231 218 -90 -163 63 177
7911 177 208 223 161 162 -156 -131 -11 13 -305 166 170 289 55 23 -177 -176 -127 228 -154 -119 -52 -56 -183 74 117 -156
7937 -156 167 118 -127 180 -158 104 -36 -56 51 8 -71 -150 92 109 -4 -103 41 63 35 57 89 37 -5 -66 -221
7962 -221 -92 19 -121 166 -43 -166 -239 -7 95 -265 40 53 -144 -20 57 -26 108 -111 -216 -42 -246
7983 -246 -29 -6 123 35 243 13 38 -125 -161 122 -49 175 110 219 -244 236 -54 -63 -190 -151 -67 -280 -121
8006a21K36J05k39k11L16Kk13J04Q9j30k30J97j6K3j45M0J30N8J21j74j0n8K02
8029G6k53L72k68m4L32j05M3k3n8r7J17k66K53l29M07j70K28l02kK21j88LR2j7
8053B2Q4k06J26j21L70Rk61j3J25m7j5n3O8j08l9J70M2k13J26o2J32j9j31R1m7
8078C0J77k75j53L75l4k13j15J67n8m4L0J66M8mJ5J5O1l13J32KN3m74M16m9J47
8103A02k68L95k91K17K94l91P0O7j32M0j98P2o4J51j22J78j15j37K31k55K22j69
8125a03K96l27j00nK85k5q2k40K24L1o5j21K18M33k45L9o4j10Mp9k51J70R6K35
8149B14k49l4Q1R4k6Qj67n8K70k45M23j26k68J78p8j15K61M0k18j16L25p7j78
8172f1r5J49j25J24K17j83J66j03k30J39r3r4L21K1j82j85L89j90%
$$ plain form
8006 -121 115 220 -19 -230 86 88 -125 -21 68 -62 -292 -95 -111 -88 -233 -193 -63 -5 116 -58 -68 -126 76
8029 76 -177 195 -73 -117 215 110 153 130 72 -25 92 -174 79 -250 157 -13 215 -87 -89 132 -56 -53 39 22
8053 22 106 -100 26 -95 275 284 23 10 135 88 73 20 88 -20 -59 111 153 -60 66 4 136 117 -14 77 30
8078 30 207 -68 -221 154 120 -93 -208 -41 -99 -143 -113 53 101 97 112 127 188 -125 7 9 62 -412 4 -45 102
8103 102 -166 229 -62 155 449 58 128 195 63 103 -95 -23 -87 64 -58 120 5 -132 99 -156 66 -103
8125 -103 193 -134 -234 -239 46 21 -61 -301 -77 -46 -111 -232 -14 419 174 213 149 39 43 -36 -287 -117 -21 214
8149 214 -35 -69 12 106 80 88 -79 -137 133 -112 311 185 -83 95 17 -98 163 203 -15 -131 194 117 -61
8172 -61 -156 -7 -132 -8 209 26 192 89 -141 -2 -95 -189 132 153 -29 -214 175 -15 -15
8191a5
$$ Imaginary data points
##PAGE= N=2
##DATA TABLE= (X++(I..I)), XYDATA
0@%%%%%%%%%%%%%%Qj6J6j6J6j9K7l2L5m3N0n8O9p7Q8j04J20j36J52j71J95k19
36a15K45k76L08l41L80m21M65n16N71o31O95p68Q48r31J023j127J242j371J517
55G97j681J867k084K338k639L000l447M017m766N804p332R796j4392K5671j00508
70h3559j25925K50881n0188q0403J99569r87j45109R4249l1816j64208P0520P4298
82G322m7587J03791N4573j10762N43Q909j23327J7772J10024j5517P961P4835
94H8537k7824o2180k4308m3841q422O1468M3859K0347J6024j9526m6525l7504
106c9895j1035N932O437M4911O4120p880l7349o520n5316n6154N6157N0508j6663
119b747L6065M2036m1172l8328k3635m3246J6472N7479J8322K2481J8442l9964
$$ plain form
0 0 0 0 0 0 0 0 0 0 0 0 0 0 0 0 8 -8 8 -8 8 -11 16 -16 19 -24 26 -32 37 -40 48 -56 64 -72 80 -91 104 -115
36 -115 130 -146 162 -179 201 -220 245 -271 300 -331 364 -404 444 -487 536 -591 651 -720 797
55 797 -884 983 -1101 1237 -1402 1598 -1849 2168 -2598 3206 -4126 5670 -8722 16949 -83559
70 -83559 -209484 41397 -8791 -89194 110375 109388 -35721 58528 26712 -137496 -66976 7322
82 7322 -40265 63526 118099 7337 7880 16789 -106538 -88766 21258 5741 13702 88537
94 88537 60713 -1467 -25775 -69616 -78038 -16570 27289 47636 63660 44134 -2391 -39895
106 -39895 -50930 -44998 -38561 6350 70470 62590 25241 18721 -36595 -92749 -36592 13916 -2747
119 -2747 33318 75354 34182 -4146 -27781 -71027 -54555 2924 21246 43727 62169 22205
131B2205l4837j1178l2708K965N3077K6436R746J8746j7595m8201l3021r043J6226
144c7182L3233L1319J9912o346k1790j9089l6309k5759L0969L2719J3850L7069
156E2596K542n3462j7379m309l7784J9423N5752k14J2069L2384m3612n0435O258
169b6171j6595l309O1955K3381j6489J7066j3899n4265q071O709q778L6994M5387
182D3915o134j0410r503l7919k3401J0374J2933K0116L0415J1642j1206k2826
194G996k5925j8626l925J9660L2625J7678N925k238k8837l1120k762j534M670
207b6413L7484K5123o829l17j6150m4352q332J8421K787K3205L4948p243j5994
220A6338m560l2430k5089K0157J7557J1120L1622N906k8327j2820j3752k5938
$$ plain form
131 22205 -12632 -23810 -56518 -53553 -476 25960 35706 54452 36857 -11344 -44365 -53408 -37182
144 -37182 -3949 27370 47282 40936 19146 57 -36252 -62011 -31042 1677 15527 52596
156 52596 55138 1676 -15703 -20012 -57796 -38373 17379 17165 29234 61618 18006 -32429 -26171
169 -26171 -42766 -46075 15880 39261 22772 39838 25939 -28326 -36397 -29688 -38466 -1472 43915
182 43915 37781 27371 17868 -20051 -43452 -33078 -20145 -29 30386 42028 30822 7996
194 7996 -17929 -36555 -40480 -20820 11805 29483 35408 33170 4333 -26787 -29549 -31083 -26413
207 -26413 11071 36194 29365 29048 12898 -31454 -39786 -21365 -18578 4627 39575 32332 16338
220 16338 11778 -20652 -45741 -25584 -8027 3093 34715 40621 12294 -526 -14278 -40216
232d0216P929K9858J2671J4939J4455j9434k9135j0145j1318k942K6258K6410
244A9330P161L399q213k8038k0625j624L738J4789K7411J5213n120j1098j9566
257c243k4338m752J2412J4514J9493J8627m067j7951j5803j8513j0394J3247K1100
270C32J4402J4129J358k0411k0207j1299q196P176K4597J7745O105N86j3924k5262
284a2869j3263P11O095J8452K2105P346o673j2842j9702j6247K0J1611J6441J8497
298A9682Q987o784j5516j7636j4626j074J3673J6986J5484Q727o636j7376j6541
311a2650j1784j292J2764J8913J4129N802n788j6840j7808r729R66J1299J8183
324F165J4797M383p749j5758j6310r761J397J2914J7369J3541L503p677j6094
$$ plain form
232 -40216 -32287 -2429 10242 25181 39636 20202 -8933 -19078 -30396 -33338 -7080 19330
244 19330 26491 29890 21677 -6361 -26986 -28610 -24872 -10083 17328 32541 27421 16323 -3243
257 -3243 -27581 -32333 -19921 -5407 14086 32713 28646 10695 -5108 -23621 -34015 -20768 332
270 332 14734 28863 30221 9810 -10397 -21696 -29892 -22716 1881 19626 25731 26317 12393 -12869
284 -12869 -26132 -25421 -19326 -874 21231 28577 21904 9062 -10640 -26887 -26867 -15256 1185 19682
298 19682 28669 21885 6369 -11267 -25893 -26967 -13294 3692 19176 27903 21267 3891 -12650
311 -12650 -24434 -25726 -12962 5951 20080 25882 20094 3254 -14554 -24283 -23317 -12018 6165
324 6165 20962 25345 17596 1838 -14472 -24233 -22836 -9922 7447 20988 24491 16814 720
337G20j6599q062L085J2653J6707J2535J696p687j5166j6710o717M679J1853J5670
351H657J3309P09j0608j3687j4076q072N244J4211J4301J0632J154j0476j4935
364c637j2038o705M097J5068J4919P947R09q870j7481j1938j887L606J1551J7210
378A2751Q230l252p649j4402j4558j183P097R504J5810R979o088r302j0305j5135
392a8503l514J2028R289J0267J2597m055j3910r495j1122n563J1421J3140Q554
405A1134Q594k360j4459j0186p999m728Q945J4149R143P278l190j3948j0431q166
419a6224l456J1310J2643O637P945k534j6298q438n304p291J2115J7025K875N456
433A6461J305j9279j1200K210o714N382K1677L520j876O591j5634j9979M639J368
$$ plain form
337 720 -15879 -23941 -20856 -8203 8504 21039 22735 15048 -118 -16828 -23545 -18866 -7013 8657
351 8657 21966 22675 12067 -1620 -15696 -23768 -18524 -4313 9988 20620 21774 11298 -3637
364 -3637 -15675 -22380 -18283 -3215 11704 19651 20560 11690 -5791 -17729 -19616 -16010 -4459 12751
378 12751 20981 17729 10080 -4322 -18880 -20063 -12966 -3462 12348 22327 16239 6937 -3368 -18503
392 -18503 -22017 -9989 -700 9567 22164 18109 4199 -5296 -16418 -21981 -10560 2580 11134
405 11134 19728 17368 2909 -7277 -15276 -20004 -11059 3090 12233 19511 16321 2373 -8058 -16224
419 -16224 -19680 -8370 4273 10910 18855 16321 23 -8415 -13719 -21010 -8895 8130 11005 16461
433 16461 17766 -1513 -12713 -10503 -17217 -11835 9842 13362 11486 18077 2443 -17536 -12897 -11529
447a1529j303K0630J1406r357J010m666k1414l023R716o50J2238J8073o179j0127
461D825j440j4221r758J1363P479K695J3898N091j3337r136o019r664L593J5187
475E56P482L451M773p220j4623m316k207l701J2136J5580N14k4o26j7351j1481
490a7057P297Q88K430J7179M788p372J013q957j8377L586Q736Q84J4373J0142
504A9553j1168o339j555j4007k537J0893L358P700J1695m871j0441o339j0005
517a4063j335J0964N789N519P594m268p270n444j0843k257R905O759Q427P850
531A7327q941j0171j080q966k827J2078M122K956J2223l767j5468k752o000n879
545a7145J4009J0840j586N361J62j3524m860j412n929O466J3804M268J868k690
$$ plain form
447 -11529 -12832 7798 19204 9847 10857 6191 -15223 -18246 -8530 -9180 3058 21131 14952 4825
461 4825 3385 -10836 -20594 -9231 -1752 943 14841 19932 6595 -2541 -8560 -18224 -14631 556
475 556 8038 11489 16262 9042 -5581 -9897 -12104 -15805 -3669 11911 12425 12401 11775 -5576 -17057
490 -17057 -9760 -8872 -6442 10737 15525 8153 9166 209 -18168 -14582 -5846 -4962 9411 19553
504 19553 8385 2046 491 -13516 -16053 -5160 -1802 5898 17593 12722 2281 -4058 -14063
517 -14063 -15398 -4434 1355 6874 14468 10200 2930 -2514 -13357 -15614 -5709 1050 9477 17327
531 17327 8386 -1785 -2865 -11831 -14658 -2580 1542 4498 16721 12954 -2514 -5266 -11266 -17145
545 -17145 -3136 7704 6118 11479 11641 -1883 -6743 -8155 -14084 -7618 6186 10454 12322 9632
559I632j2023p109l83m8O217Q231K943M643j944j1673o588l268j741J0889J0996
574H774j91J281r23j2653m455J420n000N732J4277J648m43O34j3694r547N989
589g151K29J700J3417K627n471K871o531j4385J011N970J462J1143P978p970n394
604A506j094r236l010P216K725M490R944r02j0036m752m705m455N755R617K401
619E464K594K193o951q253j802k683n95J1341Q626j428j033l168j0995l585N307
634d968n58K909J1313J866n020j301p088r962M009O841J723P296M490p107m438
649Ej666p928j089Q188M025M124O221m536r262l080k774j460O464N965K241K878
665H316n07p547o239k197k98M651P663M568p21k808m808o056k071J179L864N549
$$ plain form
559 9632 -2391 -9500 -9883 -9931 -3714 4517 7460 12103 10159 -1514 -8102 -11370 -13111 -2222 8774
574 8774 8583 9864 8941 -3712 -8167 -6747 -11747 -6015 8262 9910 9467 10101 -3593 -13140 -7151
589 -7151 -6922 -5222 8195 10822 5351 8222 1691 -12694 -11683 -5713 -4251 6892 14870 6900 1506
604 1506 412 -8824 -11834 -4618 -1893 2597 12541 11639 1603 -3149 -7854 -12309 -6554 3063 5464
619 5464 8058 10251 3300 -4953 -6755 -9438 -10033 1308 9934 8506 7473 4305 -6690 -10275 -4968
634 -4968 -5526 -2617 8696 10562 5542 4241 -2847 -12809 -8800 -1959 -236 7060 11550 4443 5
649 5 -1661 -9589 -10678 -2490 1535 5659 11880 7344 -1918 -4998 -7772 -9232 -2768 3197 5438 8316
665 8316 7809 262 -5977 -8174 -8472 -3821 3842 8410 7689 4881 73 -5983 -8054 -6875 -3011 2538
681B538N575R64m324n561n392k549K180N600M089L594J552l649n835m052l145
696h415P70O339N857K904o5l260o508l298j378J287M564N420L206L86m084o010
712b285m262j208K107N644M821J819K83l315o370l184q54P37N718N983J543j028
728F149k654o950l389R21R88L977O735J571k223j937n607n894J929L336K512N784
744E248K988l637l210l258n450n68N517L234K947M512k750n810k280l668j300
759g485M819N198J435K550r9o377l760j917j161L250O761K213M82p35m511n472
775d809r67O53J581N861L928o54j454l276n512j755J845J940M449M528j03k851
791C404l218m347k346J437L421L673L670P37l187l898l618j951J508L305L876
$$ plain form
681 2538 8113 9077 4753 -808 -6200 -8749 -6569 -969 3120 6714 8266 4617 -1218 -5270 -8415
696 -8415 -7645 -1306 4551 7455 7390 4130 -2378 -5676 -7054 -5767 -1203 4217 7423 7809 3725 -2285
712 -2285 -6547 -7755 -5648 -4 4817 6636 6919 3604 -2766 -5950 -6804 -6067 -349 5634 7177 6149
728 6149 3495 -3455 -6844 -5923 -4935 -958 5777 7348 5125 3188 -2419 -8313 -6384 -3048 -536 5248
744 5248 8236 4599 1389 -1869 -7319 -7887 -2370 864 3811 8323 5573 -237 -2517 -6185 -7485
759 -7485 -2666 2532 3967 6517 6418 41 -3719 -5636 -6797 -3547 3214 5427 5909 5174 663 -4809
775 -4809 -5776 -5123 -3542 2319 6247 5593 4139 863 -4649 -6404 -4559 -2619 1830 6358 6255 3404
791 3404 186 -4161 -6507 -5070 -1649 2024 5694 6431 3244 -654 -4272 -6223 -4715 -1410 2466
806B466K953O22k901l869m111j193J827L553L506K480L49k905m074k904j527J500
822d228M172L195K205j50k949l854k937j049J283M256L785J454k30l018l646k916
838d627n27R73M124L729J348l58k684m141k527k50J761L222L589J933j046l171
854A348l780k176m71K032L730K854J394n83l067l949k008J54J763L811K907O81
870D640j168k177m035k234N44K246L375L044O04j804k451l362k151P39K251L090
886A151L035Q34k180k557l142j644O74K165L116K656N18j709l200k885j299Q02
902c665K441L051K364N4j608k895l216j563J721K608K254K528N10k277k727k889
918c309j547J538L188K063J709P03k701k621j944j706R52L632K597J397p0j962
$$ plain form
806 2466 5419 6041 3140 -729 -4840 -6033 -4206 -653 2853 5333 5682 2777 -1297 -4201 -5728 -4228
822 -4228 -56 3139 5344 5194 2245 -1609 -4546 -5595 -4312 -56 3729 5183 4953 1935 -1711 -4627
838 -4627 -5154 -4181 -57 3672 5020 4662 1978 -2163 -4690 -4940 -3179 43 3632 5565 4519 1348
854 1348 -2432 -4608 -5079 -3047 683 3537 4931 4348 1281 -2668 -4676 -4522 -2759 1052 3959 4640
870 4640 3472 1295 -2740 -4974 -4430 -2184 1191 4235 4839 3035 584 -2778 -4929 -4190 -1939 1151
886 1151 4186 5020 2840 283 -2859 -4503 -3829 -1664 1452 4108 4626 2917 -283 -3168 -4467 -3665
902 -3665 -1224 1827 4191 4245 2637 -258 -3474 -5037 -3316 -708 1546 4074 4584 2307 -420 -3309
918 -3309 -4856 -3318 -130 1933 3642 4345 1644 -977 -2921 -4627 -3675 -43 2554 3951 3881 1919
934A919l508j800n05P98K673K824J475r0j875l253k105o06J571K666K555J119
950C858j92k740k313j988p07J649K909K150J026q5k316l743q67j65J133L249J949
967B807K60L5j674l621j677M99J101K829L103K41k150n54k585k408N39J759J555
984E9K855J400j911k448j764j776j42L268J698P08J999r63l600j090r12j434K268
1001a785M089M51K51J63l697k760J016k30K71L881J696j128P70k416m469K09K309
1018a379J47K333L271k033j618M5k758k352J882J970J012L680n91l199j473p23
1034a786k016J743K806J84J129J769k172l133n89j135N43K795K226J04J85j277
1050A376k744p72j66m10J980L008J125j087r56k516k305O86J982R52J400J403
$$ plain form
934 1919 -1589 -3389 -3894 -3096 -423 2401 3876 3786 1911 -1342 -3447 -4053 -2482 184 2739 3858
950 3858 3666 926 -1387 -3375 -4082 -2433 476 2626 3652 3567 1251 -2492 -3359 -3524 -2391 858 2807
967 2807 3067 3102 1428 -2193 -3870 -3371 -2270 559 3662 3903 1753 1199 -1386 -3794 -3255 -1496 59
984 59 2914 4314 2403 -45 -1809 -3585 -3727 -459 1239 1947 3946 2983 -617 -1707 -2619 -4053 -1785
1001 -1785 2304 2755 3006 3169 -528 -3288 -2272 -2502 -2231 1650 3346 2218 2988 572 -3897 -3688 -1379
1018 -1379 -1232 1101 4372 2339 721 766 -1992 -4344 -2462 -492 520 4200 3609 410 -1063 -1786
1034 -1786 -3802 -2059 747 931 2060 3829 1657 -1476 -2065 -3200 -2657 138 2364 2468 2653 1376
1050 1376 -1368 -2140 -2306 -2716 -736 2272 3397 2310 1354 -1162 -3467 -2781 -799 153 1553 2956
1066B956p41j209j624k303p32J946K064J747J013r95k376q58o31j238J307K237
1082E63J400J089p2k631k371n84k9J431K330P66O4Q7j354k431n06k14O24K873
1100A035J739m53o73j667k517J18J002L44J256K302q2q34n57k969j472J622J175
1117f31J462J844r7j957j47j640j806R71J646O82K226J009k844j777j66j607P97
1134b035K546m7O48J980j578k673j43r97n53L033J973p82O82n90k674n31N64j239
1152b416J432L291k7o71J49k705k012J488M67Q4K502R19j515L13j062k876J16
1169b523J709M95J544J783j295k015j06j095j339J916J230M10J888o8k475j170
1185a111m88r61J275K316L24R9M34j540j642r2n43K14K168J543J11m30j229k099
$$ plain form
1066 2956 2215 1006 -618 -2921 -3653 -1707 357 2104 3117 2122 -254 -1112 -1743 -2981 -1674 563
1082 563 1963 3052 2980 349 -2022 -2606 -2635 -1204 1126 1892 1956 2043 689 -1742 -2248 -2462 -1838 1035
1100 1035 2774 2321 1648 -19 -2536 -2418 -1416 -1072 184 2486 2404 1570 1013 -1956 -3428 -1806 -631
1117 -631 831 2675 2578 621 474 -1166 -2972 -2001 -355 327 2553 3562 718 -1059 -1225 -2832 -2035
1134 -2035 511 464 1112 3092 1514 -1159 -1302 -2299 -2852 181 2154 1372 2054 1464 -1210 -1741 -1177 -2416
1152 -2416 -984 2307 2280 1609 1758 -947 -2959 -1471 -1004 -920 1582 2501 986 1299 237 -2639 -2523
1169 -2523 -814 -319 1225 3008 1713 -302 -408 -1503 -2842 -926 304 714 2602 2534 59 -1111
1185 -1111 -1599 -2560 -1285 1031 1355 1454 1888 348 -1294 -1386 -1929 -1715 453 1996 2107 1677 448 -1651
1203a651k01N40L9J608J210L29l49r96j822p76L72R38J353J180J55o10j387j172
1221a240p78L56Q44J435J086K73m44j573j643l08N43R93J032J369m62n81p32j391
1239a221r92N44J388R32J325m07o09j280r22o64M83J429Q89J118k41j064j080
1256c72p57q33P16J239J183L50K99j050j561o68k72J73J695R32N28k4j074j310
1274h06p95p1L89J371Q75M05J75q35j412p35M6O7J612J094K1q9o85j501o02R1
1294a385O40P23J293K34m47m63j627p06MJ084R89J109J47n08p29j179r65M44P32
1313f10J113O90L82l59j393j005n48J61J015J137O73J77l55j190q61m83K68P91
1331c97R46Q20Q3n65j176p05o41L64Q67J114P00l5n14j126j074k66L72P51J234
$$ plain form
1203 -1651 -1852 -1312 -1273 335 1545 1874 1525 529 -1293 -2069 -1697 -759 594 1774 1929 1319 -68 -1240
1221 -1240 -2018 -1662 -818 617 1703 1976 1532 -41 -1684 -1992 -1449 -456 576 1945 1483 902 170 -1221
1239 -1221 -2213 -1669 -281 651 1976 1569 960 -320 -1242 -1906 -1423 6 895 2013 1772 708 -372
1256 -372 -1129 -1962 -1246 -7 1176 1526 1825 775 -786 -1454 -1726 -1553 142 1074 1602 1578 504 -806
1274 -806 -1601 -1672 -1283 88 963 1368 1543 708 -704 -1439 -1393 -1326 286 1380 1401 1312 627 -874 -1476 -1385
1294 -1385 -745 -22 1271 1505 1058 595 -1032 -1738 -1734 -650 339 1448 1595 1087 358 -821 -1786 -1342 -610
1313 -610 503 1193 1575 1216 -177 -1182 -1730 -1569 -554 583 1256 1433 1078 -112 -973 -1456 -1188 -397
1331 -397 549 1369 1452 887 -289 -994 -1635 -1271 -404 710 1410 1375 861 -265 -1339 -1605 -1233 -482 752
1350G52N44J30q36o55j105j43pJ130J199L91j57l65j203p82l00N07Q39R73M73
1369A385l71n45p88p84k99O81Q43P30O19j53j027p80r35Q7L44R27J213J38q1p14
1389D90r47n47p2J85P92J016L07m39m08r51p05n1O38J166M33M09l44q20l55j117
1409a320J64P24N46R33J31m24p71p54j00m53J062P98M45N6l83p69m91m73nO47
1429d37Q44M29M79l96r32r55k92L58M42P06R69j27m01p06o84m24P1Q49P83O12
1449A188n9m97r56n05j23p2P87N82N53L73n38q83p29j96K15J076K88M12j06j20
1469F90q16q53j82M5R45R90J91l42k73o74j061J27K54O43Q79O18l37l64q93q54
1489a267J30M97N84Q55M63n28o43k53q32J00M45L40O20Q62n23p42o58k70K3N56
$$ plain form
1350 752 1296 1426 590 -65 -1170 -1313 -1320 -190 1009 1400 1243 878 -325 -1107 -1407 -900 -61 912 1385
1369 1385 1014 469 -319 -1103 -1402 -721 122 852 1471 1318 291 -489 -1424 -1337 -993 -66 1147 1285 1204 490
1389 490 -457 -1004 -1076 -891 -99 917 1224 785 377 -574 -1279 -1330 -692 474 907 1316 972 152 -203 -1320
1409 -1320 -1156 -432 114 1047 1178 754 -17 -771 -871 -1324 -262 536 981 1037 654 -115 -606 -1079 -1084 -437
1429 -437 407 836 1315 919 -13 -968 -1260 -902 -460 246 1215 1088 687 -19 -703 -1127 -1056 -207 576 1188
1449 1188 1129 632 -324 -829 -952 -1024 -237 345 898 1271 733 -150 -879 -1075 -860 216 504 916 810 690
1469 690 -126 -979 -1161 -1116 -171 819 1010 668 395 -279 -1340 -1213 -959 -316 563 1181 844 480 -413 -1267
1489 -1267 -1137 -640 -56 799 1262 734 91 -162 -994 -894 -449 -109 511 1373 850 108 -550 -820 -797 -241
1509b41N06M31M89k26r99n32j50l61P92J028L1J00j79o54p78M28k95q3R21R29
1529A157k24L2j005q40q6M69k9M87R80j15l65J5j042p40O65O06J13J106p0j265
1549a51K21k24j028N72N68j46J215K37p24j082J32l73m02J346M07m50Q26j54j165
1568c75Kj88m51R16R61k22j3q8p73o14N31j71M5Q39K34R5j98n56q80j4N45L85
1590A0M60L15k56l85k97l40l86O43K2N16Q07m68o22n69k21JM51N72J52M90j83
1611G12l13p47l77OL75L91P64J0m79l75l17n6k05L0N08O17L59m83n06k25n79M08
1633d82K43L58L54K13j84m28j13r63P7O43N38M34Q1k12r33Q6m28j67O83L39K28
1654C67O32l48p80m75J20j79L45J036j93n0P5n87m64j2J9J18P51L41j69j99l77
$$ plain form
1509 -241 265 696 1185 959 -40 -572 -722 -1083 -291 737 768 868 689 35 -743 -315 -610 -693 228 1157
1529 1157 933 965 -40 -880 -966 -497 -526 -39 941 826 461 476 -566 -1306 -641 -35 78 1184 1114 -151
1549 -151 70 -154 -1182 -610 -42 -188 1027 1264 540 -542 -410 -783 -1185 161 568 118 944 790 -375
1568 -375 -373 -561 -1012 -96 865 643 630 542 -231 -845 -314 -485 -440 399 633 728 530 -26 -906 -920 -375 10
1590 10 470 785 529 144 -153 -493 -879 -236 -214 302 1109 641 19 -550 -771 -770 -319 253 405 895 712
1611 712 399 -348 -725 -719 -344 47 811 821 342 -33 -350 -406 -611 -581 -73 544 903 420 -86 -311 -890 -482
1633 -482 -239 119 473 686 502 74 -39 -1002 -925 -282 256 690 771 559 -374 -288 -716 -883 -200 139 367
1654 367 999 651 -129 -604 -484 -663 -318 718 525 475 550 -37 -501 -513 -494 -376 375 716 547 348 -29
1675b9o01J18K33J69M59M96l92k18J96j075j41M43L55J47O23k56n59j60j40n02
1695h34J09R10M4L87N43q71o33j54q8K8Q35qj74O66k22q53l4N2l01P26O38k09
1717E57k54p3l98m11KL3N05N44J10q3p5n83l31q6L60K94K43J72p0k05l61l35p3
1740e18K66N51L42N4j67n70k08j39j31L21L94J45J29l26j22l97k35M6K08N25L34
1761E02j46J32n09l89p7N0J68M82L58j12j50k49n83j92L41J39L72L85K5k60j79
1782A08l14l95K53K76L83J25J10l60l49N9m14J14K17M69MJ78l59l10k61J08NN86
1804B33K26M3j41J53m55n41l21N74L02M88j55J9n32L2n65L4N95N0J69N22j16m89
1826A25l99j09L5PM22L3L81k61l24o4l34K8K23K65K77qJ65n27l45k49K79PL87
$$ plain form
1675 -29 -630 -512 -279 -110 349 845 453 235 431 -644 -785 -342 13 160 783 527 -32 -192 -332 -834
1695 -834 -725 185 229 616 1159 288 -345 -499 -587 -559 276 268 94 760 538 -315 -349 -297 -598 128 766 557
1717 557 303 230 -168 -579 -577 -544 -39 505 615 532 457 -126 -457 -543 -183 111 354 526 456 251 -110 -445 -518
1740 -518 -252 299 641 695 528 -42 -250 -389 -520 -199 195 340 469 143 21 -376 -611 -565 -357 168 502
1761 502 356 488 -21 -410 -487 -437 -269 213 571 459 309 60 -523 -715 -374 -235 137 522 547 287 108
1782 108 -206 -601 -348 -72 311 436 546 186 -163 -104 -518 -404 -187 282 286 464 105 -205 -466 -358 -353 233
1804 233 459 502 361 514 59 -482 -803 -229 73 561 406 425 -107 -75 -640 -606 -11 39 208 730 614 125
1826 125 -274 -383 -348 -341 81 114 495 234 -90 -154 -488 -460 -237 28 305 297 462 -65 -410 -659 -380 -373 14
1849A4J85K89m9n10M6m77J6K42L63L21q7R4m14k97o4JK32K78L08q1k72j33n2m01
1873d48J24r6O24k7K81l36k79j10l32N59L2J27K60K58o34O5m05n8J14K17P1L84
1895C91K53l70l77j62q2l2M06K97J7j23k05k36J04j10k86M41J23K76j10J57n27
1916a55l39j58M78K38J96j52K58k50j87k52KQ9J79K40K35K17m67n58J83k5q4L36
1938B4L35J23l0m39J60m28j08P2N70K4K26j14m2o05o7j39O5N76K70l9l19J7k59
1961a27n6J18K37k7J18R7k1m07J59n94K48P0K46Q9K21j16l98J23l83J75K81JM8
1984A02J87k02oO8j91k67L19L41j57K7l80K30n3j00R9l32M66K95j04P3n81m03
2006e69J42M66k29L38K36p2r1l75J45k49qJ99K53K19j44l79J65Ok85J53k50K38
$$ plain form
1849 14 199 488 439 -71 -25 -502 -486 -244 119 440 353 447 33 -264 -328 -327 -95 183 491 410 138 5 -47 -448
1873 -448 -324 -420 204 177 458 122 -157 -267 -599 -40 -8 119 379 637 3 68 -337 -395 -281 -64 7 391
1895 391 644 274 -103 -265 -347 -379 27 324 341 218 13 -223 -119 -229 -515 -74 49 325 215 372 -155
1916 -155 -494 -652 -174 64 260 108 366 116 -71 -323 -321 -232 -53 187 422 639 172 -386 -203 -228 -312 24
1938 24 359 482 452 13 173 -255 -363 -291 279 303 529 415 373 -232 -299 -438 -373 203 473 434 115 132 -127
1961 -127 -183 -65 172 145 263 360 339 -68 91 -503 -255 -185 61 150 371 255 -143 -20 -403 -228 53 54 102
1984 102 289 87 81 149 -42 -309 10 351 194 221 -159 71 18 -82 17 -315 151 446 342 415 -166 -569
2006 -569 -427 39 -190 148 384 312 221 -154 -9 -258 -266 -67 186 405 261 -118 47 53 -232 -79 -329 -91
2028i1N75j15k61k40j20J18O3K34J26k74n0M75m67J1k45J33K7M83m9j63L73o18
2050g5k0j33K36J05j89J97J44j33Q7m77O3M6J29K16K66l79jok33J05L1j36J16
2073d1N40l37k28k36K96j30j10M29o6J63R1j54r7k25J19j61J78L6R2l8K8n59M84
2096G4j33k82N52O3j41N6l16l05L01K5j48J54M91k96j02M8P5l39k1L02L1k2K32
2119B99k71l1L0j88K42j85j27M48J07k30k15Lj55J07K27K1J54k20J15k77J56n8
2141d8j49J98j10N61l30k4r5n8rj70P5K19k21K47J69j46l33M9J19R9l7J91k4N4
2165B27j33l60p5K19n8J26J66K60n43J24L9j31r5J37L6J96J11j38j68j12N8q2
2187a96L47Q9k56J46j37kk90J42J00O4L99j04k96m0j26r5K37J26j02R4J12r2K5
$$ plain form
2028 -91 484 369 108 -132 -252 -134 -71 163 289 15 -35 440 -27 -16 -261 -128 -101 382 333 170 543 -75
2050 -75 -95 -228 8 113 -76 121 265 132 219 -258 -195 -149 -20 196 462 83 82 76 -157 -52 -21 -157 -41
2073 -41 499 162 -66 -302 -6 -136 -246 183 117 280 371 217 120 -105 14 -147 31 67 159 121 149 -410 74
2096 74 -59 -341 211 274 133 189 -127 -432 -131 -106 -254 -100 391 95 -7 41 116 -223 -244 58 89 67 299
2119 299 28 -3 27 -161 81 -104 -231 217 324 94 -121 -118 -273 -166 61 82 236 16 131 -146 10 -48
2141 -48 -197 1 -109 452 122 98 3 -55 -64 -234 -159 60 -161 86 255 109 -224 -175 -56 43 6 197 173 227
2165 227 94 -266 -341 -122 -180 -54 112 372 -171 -47 -8 -139 -234 -97 -61 135 246 108 -60 -172 -114 -196
2187 -196 151 240 -16 130 -7 -9 -299 -157 -57 7 406 302 6 -34 -160 -255 -18 108 6 100 212 120 145
2210A45j67j79J73j46Q3J10J52N3k57k07o7J24J97j6K25n1K1k15j24J93k64J10
2232a07J29J40l3j68J58p7o4K79l52K01J84K1l61K07m77jK80J12J4j51J15K27
2254B76l13O4k67J17k4J56K01k51K74l08j55n3J73k0K9L44j18k27J64j74j11n5
2276b78J77K74j21J66j78j69M8k6n5K68m4J36j16J80k09j03O5j6j10K04j87l3
2298a27J69lk01l4mqL17K65k12k2k90J67k6j18M8J26p4J57k71K20p0l02J45L12
2322A64k42p4K77k54L47n69J86K08j55J44J20o1j07Kk41L48j83J75r4J55%M7m72
2345b79L65j43k14M37l63L36J03j10m68O9J02k8M5J88j54L13j98K70m75M09m65
2366b60K75j58K88R9q6m0j41l7M2K0K03L3k16M5j89p9K0J30p8M04Q7l65J56k49
$$ plain form
2210 145 -22 -201 -28 -174 -91 19 171 224 -33 -240 -307 -183 14 -2 223 172 193 -22 -146 47 -217 -107
2232 -107 22 162 129 -39 119 42 -22 257 -95 106 290 311 -50 157 -320 -321 -41 71 85 -66 49 276
2254 276 -37 27 -240 -123 -147 9 210 -41 233 -75 -230 -283 -110 -130 -101 243 125 -102 62 -112 -223 -278
2276 -278 -101 173 52 218 40 -129 -81 -107 -162 106 62 198 82 262 53 -50 15 -1 -111 93 -94 -127
2298 -127 42 39 -162 -196 -200 -208 109 374 162 140 -150 17 -9 -127 -79 47 -27 130 -141 79 9 -293 -148 164
2322 164 -78 -152 125 -129 218 -351 -165 43 -112 32 152 91 -16 -14 -255 93 -90 85 -9 146 146 193 -279
2345 -279 86 -57 -271 166 -197 139 242 132 -336 -267 -165 -193 -148 40 -114 199 1 271 -204 205 -260
2366 -260 15 -143 145 244 158 118 -23 -60 -18 2 205 238 22 67 -122 -201 -181 -51 -129 275 362 -3 153 -96
2390i6r5o9M23l6O6N4l70K47k44J34n7K1J36j43J2K13l7j41l97K91K0J60mj63
2414g5n5J00o0m9Q3JL94k09j92rR1j87J26J21j06k9J51K72k05j36j30J32%o3K46
2439B12k88j07K42l41K85j44J7L9Q9J34l3j73qQQ1p0K90k66K64j35j6l60K53l4
2463f1j8J55m0m1j11J58j53K24j67j03K90j42oj39Q6j5lJ8J83j60J17Q5o4q6j51
2488a44J13j77p6J90K85o4j96r6J70j04J0K7J13O9K0P5k97P6r6k14K65L39j74
2511A14jO5r1J9k66L12m9k24K40l2O1k5m4O9j83M79n47L04j28j6k1J0j56j00J28
2536h2J63r2l0J50J2j69J24j80K23j98J28j56K76P2l07k9J85km8j23J34J52l80
2559a77J42Q8O9J11J01l18J55p4j00J9j2k04M30j66j48L38j04Rl53j5L42k11J73
$$ plain form
2390 -96 -191 -260 163 127 193 247 -123 124 -120 14 -43 -22 114 -29 -17 196 159 18 -379 -88 -68 92 88 -75
2414 -75 -130 -30 -90 -139 -56 -55 339 130 -62 -71 20 -167 -41 80 -26 -55 96 368 163 27 -103 29 29 -34 212
2439 212 -76 -183 59 -282 3 -141 -124 -85 4 138 105 -68 -76 -68 13 -57 233 -33 231 96 80 -280 -27 -61
2463 -61 -79 76 36 -5 -116 42 -111 113 -54 -157 133 -9 -15 -154 -68 -83 -86 -68 115 -45 72 157 93 7 -144
2488 -144 -31 -208 -284 -94 191 127 -69 -165 5 -99 -89 -62 51 120 140 215 -82 -6 -102 -316 -51 288 114
2511 114 113 178 87 106 -160 152 103 -121 119 87 148 123 79 148 -35 444 -103 201 73 57 36 46 -110 -210 -82
2536 -82 81 -11 -41 109 121 -48 76 -104 119 -79 49 -107 169 241 -66 -95 90 88 40 -83 51 203 -177
2559 -177 -35 53 122 233 334 16 171 97 -3 16 4 -200 230 64 -84 254 150 159 -194 -209 133 -78 95
2582I5k68K73k8j77K8n4%J40J25k23J68K9k48j23K43j30j05K82L92m28j18J1K62
2605A46j87J67N9l36L83l66J73q5J07j63J12p0J00j71J24K25o9k89n9P4O8k2J27
2628D8M6k3k68J20J59k43J67J67j93J5j9J99k72J06j47o9K79J4k0j27k07L5K46
2651A3K37j2j84R3j42p4K01m23J10K42l9n4L8M8k27M1R7j02L2J87k36J35J63m2
2675A02j53l6j86M54j50n0j55R1J97j07M6j38j44K33K53l48J42r1P7j9p7K6j62
2698a95J65K87l89J64K53m01R0N3M0K62l74J44j19k5j73K70k17J67J87n0m0k49
2720a50Q1j13M38l82R8R9r2M7p3p7J31k05K64J16k62mJ11j11k61K22J3j48M66
2743B08r3j66J58k17J14k30J98jO0P6k33K05j45p6j1RJ78J01q8j53L8j40R1K56
$$ plain form
2582 95 -173 100 72 -105 -77 -131 -131 9 134 -89 79 108 -140 -263 -20 -150 -255 27 419 -9 -127 -116 146
2605 146 -41 126 185 -151 232 -134 39 -46 61 -102 10 -60 40 -131 -7 218 149 -140 -199 -125 -57 -79 48
2628 48 94 71 -197 -77 82 -161 6 173 -20 -5 -24 175 -97 9 -138 -207 72 86 66 -61 -268 -233 13
2651 13 250 238 54 147 5 -69 132 -291 -181 61 22 -32 6 54 -173 -132 -35 -137 -105 82 -154 -19 144 102
2675 102 -51 -87 -273 181 31 -19 -174 -83 114 7 53 -85 -229 4 257 -91 51 -40 37 18 -59 -33 -195
2698 -195 -30 257 -132 32 285 -116 -26 27 67 329 -45 99 -20 -45 -218 52 -165 2 189 139 99 -150
2720 -150 -69 -182 256 -126 -28 71 -21 26 -47 -124 7 -198 66 182 -80 -84 27 -84 -345 -123 -110 -258 208
2743 208 115 -51 107 -110 4 -226 -28 -29 31 107 -126 79 -66 -142 -153 -144 34 135 47 -106 -68 -208 -117 139
2767A39j23n3r8L01p7J62k22r3k7M1j03P5j3j1J11j83J82k79K43M1M1n4J3k08
2791a95K69K8j79L0M9l6N6P2k00M5j14J00J80j15j48L87j57j72P3K72n12M29k43
2814h1q4J40o8P3j30k8L16K3j67J53P4J12n18L60l74K36k61K77p9l3J46k54L10
2837A43j68l3L32j70R8j94M00n93J82j17j6J32L84l82J7N5k2j4j17K14j34J4k
2860Ij76L27j13k84q4L28m4Q1J95k26o8Q8k9K5J62l61L28R3k08r0Mn7K39j06N0
2885H3L8j16k71K30o5L77k27m9R1o8J23j09l62N42j82j75L76l27m5j1K52j47j06
2908a48K01l30L70l18K33K92n39K95j0j99J0J17p9K22j49L7r1J49k12K59l02L13
2930A21j18l3J4K06q0j89L83m14J37K10j23o8j2j27J08N8k46K52k2Q2K14l34P7
$$ plain form
2767 139 16 -37 -135 166 89 251 29 -64 -91 -50 -153 -78 -91 -102 9 -174 8 -271 -28 13 54 0 13 -195
2791 -195 74 102 -77 -47 2 -34 22 94 -106 -61 -175 -75 105 -10 -158 229 72 -100 -27 245 -267 162 -81
2814 -81 -165 -25 -93 -20 -150 -178 138 161 -6 147 221 333 -185 175 -199 37 -224 53 -26 -59 87 -167 143
2837 143 -25 -58 274 104 202 8 408 -185 -3 -120 -136 -4 380 -2 15 70 48 34 -83 131 -3 11 9
2860 9 -167 160 47 -237 -321 7 -37 44 239 13 -55 33 4 29 191 -170 158 251 43 -47 -43 -100 139 33 83
2885 83 121 5 -266 -36 -101 276 49 0 91 23 146 37 -325 217 35 -140 236 -91 -136 -147 105 -42 -148
2908 -148 53 -277 93 -225 8 300 -239 56 46 -153 -143 -26 -105 117 -32 5 -86 63 -149 110 -192 121
2930 121 3 -30 -16 190 110 -79 304 -110 27 237 114 46 34 -93 15 73 -173 79 57 139 353 19 96
2953I6q4j47J37R4j93L33k53j19rQ1l0N6J31l38K51k0K50k90j7J96j39n4J73r8
2977Gn6r0L8M8l9n0J29l2j02p3J94j2P3m4Q3j04k22J37l35L50J95j68L8P3O6p6
3003B8l27K24K3P8K06j66N6j80N6k18K12J7l4m5N8QJ9k88L40Q3j08J16l51M22
3027B29j9J22j6k61P7q8j35mJ72j21j57O3J97p2j26K32j19j43L90j54j31K69l54
3050a49K11l5P8JJ0j37k9k3J6K0r5K17Nl4K03l35p2J55J38q4j65P9Q2K4O7k07
3076e9j06M1PJ81J25j09r8K33j21o6j58K58j67Q7k75Q6O0K48j86J69q3O0k86L49
3100A90k8k32LN0p3M3M6j60K61l12n3M0M07k32k4N3j48J38j23O8L4K40j95j23
3124a30K68k18K36k06L5k37O28k37k43J40j33L35j46j04j30J90k09L73j68k7n4
$$ plain form
2953 96 12 -135 2 96 -97 236 -17 -136 -145 -64 -94 -38 93 -245 6 -14 236 -54 -71 125 -14 -68 105 7
2977 7 -49 -139 -101 -53 -92 -142 -13 -45 -147 -220 -26 -38 35 -9 74 -30 -252 -115 -450 -100 95 -73 -35 38 104 28
3003 28 -299 -75 -52 26 232 66 122 -58 -2 -220 -8 9 -25 -70 -12 -4 15 -273 67 150 42 158 -193 229
3027 229 210 332 316 55 132 44 -91 -95 77 -44 -201 -138 59 -13 -139 93 -26 -169 221 67 -64 205 -149
3050 -149 62 27 105 106 116 -21 -50 -73 -57 -37 -132 85 90 56 259 -76 -148 7 145 61 -104 -25 57 81 148 -59
3076 -59 -165 -124 -117 64 189 80 -18 215 94 28 -130 128 -39 48 -227 -141 -81 167 -19 150 67 127 -159 190
3100 190 162 -70 -67 -17 -90 -47 -1 -161 100 -212 -265 -225 182 -50 -74 -21 -169 -31 -154 -86 -52 188 -7 -130
3124 -130 138 -80 156 -50 -15 -252 376 139 -104 36 -97 238 92 -12 -142 48 -161 212 44 17 -37
3145c7j65J34p5K29q9k5K43Pjj86K09k08r9R9j53L13l92J27nK36l64J39j14K94
3169A17j43L08k34K36r9l53J00L3Q3k3K4n9L47l08j8r2O8n1N4pk3J56k1p7k72
3194b54K03K71k32O3n0l3m9K43k52K6J82k11L13j76j62L00j77J77k96J86N5m5
3216H2j78K4J29m5K1J03q5j55O9J95M2k41j62M73n20O2K98P6nk72J21K24n11K80
3240B5k3J32j94j21N4NK37o8j73K98k15oJ07K5k25l2J40J98K8Lj82k63P5Q4K93
3265B02l65k9J78O7L1K3j20m1J74o9p8j70J58J06j25q8J50k8m4N5m0l7l0J80o9
3290ik58J26K24Jl05K55J32r3L7J1P5j50J03m09K46J80j51l3O2l0j0J65j59J62
3314A72k21j77L30j98l7K45k7j50P8K24j74R6J5j78L1j45p8N8k17L29p5K79k06
$$ plain form
3145 -37 -202 -68 -143 86 -3 -28 215 222 221 35 244 36 -63 36 -117 196 -196 -69 -74 162 -202 -63 -177 117
3169 117 -26 282 48 284 185 -168 -68 -35 48 25 49 -10 337 29 11 -81 -13 -64 -10 -17 -40 116 95 18 -254
3194 -254 -51 220 -12 51 1 -32 -81 162 -90 -64 118 -93 220 44 -118 182 5 182 -114 72 127 82
3216 82 -96 -72 57 12 33 136 51 -104 -35 160 202 -39 -201 272 -248 -186 112 188 183 -89 32 256 -255 25
3240 25 2 134 -60 -181 -127 -122 115 47 -126 172 -43 -49 58 83 -142 -174 -34 164 192 195 13 -250 -175 -91 202
3265 202 -163 -192 -14 53 84 107 -13 -54 120 51 -27 -197 -39 67 -58 -146 4 -24 -68 -13 -53 -90 -120 60 -9
3290 -9 -267 -141 83 84 -221 34 166 73 110 121 196 46 149 -260 -14 166 15 -18 44 14 4 169 10 172
3314 172 -49 -226 104 -94 -131 114 87 -63 15 239 65 161 176 -2 29 -116 -194 -136 -353 -24 -99 180 -26
3337b6o3K29r9q1l4J15R1j37M5j4j27O0J24M5L8N5m05K72l65K78om6q4J71l9r6
3363i9K78k83J19k42K41k9n9J0j29O0J77M8p4j01j45N4J38l4K44k54K54R3l12
3386d5j07J66N0q4j1qMK00q2k77Q7K68l66K05m7N6K5j06K0R9R0l15j03N35k7l05
3412g8K04k04M4K47j61k91L65k8l4N9K3j71K5NM2l3j86K34k56K83j02j81j9K81
3436F8r7R3M7m9k52L71l18j35J80K04K6r9k22J86K67m69L17k69J86J07l36L38
3458A44L0l23N7J94M6j65k78N42k10M7k3k25n4J2L73r8J90l16M5mLQ8r1J18j3
3483H9n2q6k8r8J02l03M51j56K02k22K04q8J6k16O9O9Q5J55j8l2k08q5K90K08
3507C48m04P7oP2K8K4l10K47j78k19L29po7l0K00l52K12k53M37k24J07J98k6o3
$$ plain form
3337 -26 -89 140 41 -40 -74 41 132 -5 40 26 -101 -41 83 128 166 221 -184 88 -277 1 -5 -51 -135 36 -3 -99
3363 -99 179 -104 15 -227 14 -15 -74 -64 -193 -133 44 92 18 -83 -228 -174 -36 -70 174 -80 174 267 -45
3386 -45 -152 14 64 -20 -31 -39 -35 165 83 -194 -107 161 -205 0 -47 9 34 -72 -52 47 137 -178 -281 254 227 -78
3412 -78 126 -78 -34 213 52 -239 126 98 64 123 146 -25 0 5 47 14 -172 62 -194 89 -13 -194 -213 68
3436 68 -29 64 111 62 -190 181 -137 -272 -92 112 138 39 -183 3 270 -199 118 -151 35 142 -194 144
3458 144 174 -149 -92 102 148 -17 -295 247 37 84 61 -164 -218 -206 167 69 259 -57 -12 -16 -13 75 -16 102 89
3483 89 37 -49 -77 -175 -73 -376 75 -81 121 -101 103 15 31 -185 -116 -47 38 193 175 143 -65 -150 140 348
3507 348 -56 21 15 87 115 139 -171 76 -102 -321 8 1 -66 -96 104 -248 -36 -289 148 -76 31 229 203 140
3531A40J43l63K09l74J53K27J8J7k53r0L6K59q8l7nk9j15K08N2k55J20J5j1o4
3555h7O2Q5k20K73K1k51r4L93j12N2Q4J14l18m8k29K39J02l1k34K54j32J57k02
3578a22j37L45L3J1M3k97O5qK75k58J05j68J30R1j26J52k5k89J53J46Q7k03P3
3601G6J41j82k17R2J14l5J30L7m01K48J25j58j66n1K44k41J33K15k62J62j92L63
3623A75k20k05J38J94j14k4J43k45J6K16j74M0J70j76J16L3r8q9o7J15J16k38
3645a78J97N5lR9j04J48j26j62J19p3n1R2n6K30l11L49k99K2l6L39j52j71J77
3668A05m5k96L03J8r5j46J49j17L01k98L1J63j9OK09l48j31L64j37k53J93K08
3690A65k02nm6m8J83l11O5j3K00J85J45k2k14n2l23M11J4k46J05p0n9J51K4o0
$$ plain form
3531 140 283 -80 129 -245 -92 135 153 170 -83 -173 -137 122 34 -3 -8 -37 -152 56 108 -147 -27 -12 -23 -87
3555 -87 -25 60 -160 113 134 -117 -211 182 70 122 206 320 2 -46 -275 -36 66 35 -199 55 -77 80 -122
3578 -122 -259 86 119 130 173 -124 -59 -67 208 -50 55 -113 17 108 -18 134 109 -180 -27 119 206 3 76
3601 76 217 35 -182 -90 24 -11 119 156 -245 3 128 -30 -196 -247 -3 -244 -111 104 -158 4 -188 175
3623 175 -45 -250 -112 82 -32 -56 87 -158 -142 74 -100 -60 110 -66 50 83 -15 -104 -171 -56 60 -178
3645 -178 19 74 71 170 66 214 88 -74 45 -28 -79 13 -43 187 -124 225 -74 -52 -88 251 99 -72 105
3668 105 60 -236 67 85 -10 -156 -7 -124 177 -121 -90 73 54 60 269 -79 -210 154 17 -236 -43 165
3690 165 -37 -42 -88 -136 47 -264 -199 -212 -12 173 318 296 82 30 -293 118 132 -114 -9 -79 -138 13 37 -23
3714b3O4Oo4k48J43M6j1n0N4K21j92j38K08J85j59J26k82J00L6J5R3j77k64K93
3738a8K35m04L4L86k12j09J59j11J17n1Pj89J09Q0K5j99J73N1j18K05j05j76K78
3761A67j9qj41p8K86m70J57R9j89N72j64j50j71M0j4k2j6J34j04k86J07M37p8
3784H9l02M27k92J87p6K25m14P6J95m6q6p4K96k81J88j43m7MJ47j35M32n59K70
3807H1J8r7q6J88J17j90r3l90M68K30j11j95o1K18j07L7j73J02J23M1o8k63J16
3830i5R0j1J14O3j28J32pN3l86N2O2L1k11J15J67j88K54k47o7L44k11J89j74J37
3854G8j92L6k1J04M4n5k0j42K98k72k2L15J22k14k24K8J41K4kMJ14j80Q0K93l50
3879a3P4l61M08j11pk9PM2k46J26L4Q7NLR0j71M1J82j93k45K95K15k23k0K36j63
$$ plain form
3714 -23 41 47 -17 -265 -122 -76 -87 -137 -83 138 -54 -192 16 201 42 168 -114 -14 22 37 130 -47 -311 -18
3738 -18 217 -187 -153 233 21 -88 71 -40 77 26 33 -156 -47 33 58 -141 32 83 -35 170 65 -111 167
3761 167 148 140 -1 -79 207 -263 -106 -7 -196 376 212 62 -109 -69 -83 -105 -121 13 -91 -377 -270 167 89
3784 89 -213 214 -78 109 33 258 -156 -80 115 69 -17 -91 205 -76 112 -31 -78 -74 73 -62 370 -189 81
3807 81 99 2 -84 104 221 31 -62 -452 16 246 135 -60 -121 97 -10 27 -146 -44 79 120 52 -211 -95
3830 -95 -5 -16 98 161 33 165 158 211 -175 -123 -61 -30 -241 -126 41 -147 107 -140 -207 137 -74 115 -59 78
3854 78 -114 -78 -99 5 49 -6 -26 -168 130 -142 -164 151 273 59 -165 -137 4 28 26 30 144 -36 44 337 -13
3879 -13 61 -300 108 -3 -10 -39 -32 10 -236 -110 -76 11 16 19 109 -62 -21 161 -32 -277 18 233 10 -10 226 63
3905F3k32J50J83o5k10L94l49k3J16M8j32J00j00Q3q1P3J28n0j0n6j23K04q4j30
3929a03R0P0l4R0j01K49j98Q6k18p5K85m17K71j98K12P6j23j98K24J51K09o89
3951c41L91j13K7p2K64j08jm8J01o5j35J92j94J90J43j21L9j01k5N5j0k45K7N3
3975i7K67J7k9n0k8q8J68m5j59L00n15j04L27J9O7L3K8k75L29q6l6L6j61J38J28
4000A84k59J63L3l2j23l0o0k8L20l31K39P6p1j0j70K99l38m0J2K54j84m3j14K71
4024A8j16l4J7L33q7k33J57k13L70l56K28O6k5p4k77K71j11J98J0l1j57K25k3
4047A56p0l5j40j8N4m0J90o7QM5l9P8j59K5K04k52K78k49N8o4J93l06J47K08j65
4072D0j25P7p3N4q2J13j00j38L73k2l02Q0O9J05q7O3m5m8L6J25k47j50M09j05
$$ plain form
3905 63 -169 -19 164 99 -111 283 -66 -89 27 75 -57 43 -57 26 -55 18 146 96 86 30 -93 111 27 -103
3929 -103 -13 57 23 113 12 261 63 149 -69 -144 141 -276 -5 -203 9 85 -38 -236 -12 139 348 -341
3951 -341 50 -63 -36 -108 156 48 47 -1 100 35 -100 92 -102 88 231 110 149 48 23 78 68 -177 -150 -97
3975 -97 170 187 158 108 80 -8 160 115 -44 256 -259 -363 -36 -17 50 83 111 -164 165 79 43 79 -82 56 184
4000 184 -75 88 121 89 -34 -64 -124 -152 168 -163 76 152 81 71 -99 200 -138 -178 -166 88 -96 -139 -253 18
4024 18 -98 -132 -115 218 131 -102 55 -158 212 -144 84 150 125 51 -226 45 -66 132 142 111 -46 179 156
4047 156 86 51 -89 -107 -53 -93 97 30 38 83 44 122 -37 -12 192 -60 218 -31 27 -37 156 -150 -3 205 40
4072 40 -85 -8 -81 -27 -109 4 -96 -234 139 117 -185 -105 -36 69 -18 45 0 -48 -12 113 -134 -284 125 20
4096B0N7n2m5K24m07J11J40q8j67K74m7L3L9J53l84J05K13o37N59j57J24j86L55
4119B37j7k54J2N6J02k41K27K5m32P6J39L33l44k20K20J87l2j72K58j20J16k09
4141e3m1J97j59p8K62J9k71J13oO5L0n7J07j25N1k33L76j88p4r6J12M3J81k51
4165g6M23l86J22r6J24J28m00KJ88M9p8j0J65j50j08J09J66j2j34j17J07j40o6
4188a90J46K15j3J6k25J98MM8j84j83J30K54l92J07l1j08M93j88j04K3p8M0K76
4211B54m68K43n6k95J85K27l2l51J13OM86m43K50MK0j7J27l77O8L1m2L01o6j40
4235B8J47m90L06k01K88k58J14j10J07L3j27l7L42l25J80J06o4o7K61j59q4R0
4257H0k7k01o7J71j07J81J2J50k68J99Q0l41O5K21l40L19m8k56Q2J79Jr4K05n9
$$ plain form
4096 20 77 25 -20 204 -203 -92 48 -40 -207 67 20 53 92 245 -139 -34 179 -458 101 -56 68 -118 237
4119 237 220 -34 -22 34 136 -105 122 147 -285 -209 -70 263 -81 -301 -81 106 74 -98 160 40 156 -53
4141 -53 -94 103 -56 -134 128 147 -124 -11 -17 48 78 21 128 3 54 -179 197 9 -65 -161 -49 -6 175 -76
4165 -76 347 -39 83 -13 111 239 -161 -159 29 78 0 -10 155 5 -103 6 172 160 26 -91 16 -124 -190
4188 -190 -44 171 158 174 -51 147 151 199 15 -168 -38 216 -176 -69 -100 -208 285 97 -7 16 -62 -22 254
4211 254 -214 29 -27 -322 -137 90 58 -293 -180 -174 312 -131 119 123 143 126 253 -124 -56 -25 -67 234 168 28
4235 28 175 -315 -9 -210 78 -180 -66 -176 -69 -36 -163 -200 142 -183 -3 103 39 -28 233 74 -10 80
4257 80 53 -148 -215 -44 -151 30 42 192 -76 123 203 -138 -73 148 -192 127 79 -177 -95 84 85 -9 196 137
4281A37j47N3K0m4L80m31J73k28J65J37k17K71j02j47n1O3o7oJ22k91K80J13j72
4304A1o8L85l64n4p0J91j04J10k57K23K22pk19M4j56K43j82J66J67l22J72q9j14
4327g2kK69p6j31P0k17K2K04M9n6p1J19j75M7j57J03J35q7j50L28j74jl7J3O6
4352A9L7p3J23Q9j52J68k50R6j28J7J38j06O4K0r1j25Q2K79m57K27K55p0p5j27
4376d0K51l91J89K2Pn3r2L3J12P1k40J63n7J82k29K99k06l5K5Q8j13k24J91l1
4400g8K88k24k6J54J95l61m1J11o3K50j18q4p5J38q5M1J22k07P7O4j34L1o7K72
4424A80k17J85l9o3j80L13m16L38j24l14J53Q3L72k90RJ17k69K70%k31K11J0j33
4447c5Lk7J53q1j31N6M0K5q4J9N3j14J15n7M7p1NJ35j31n4J30J57k27n0M8Q1m3
$$ plain form
4281 137 -10 43 63 19 399 -32 141 -87 78 215 -2 269 167 20 -31 32 -35 -41 81 -210 70 183 11
4304 11 -57 328 -36 -90 -160 31 -73 37 -220 3 225 218 -1 43 -113 130 -52 114 281 -41 131 42 -72
4327 -72 -74 195 119 -12 58 -159 -137 67 116 60 -11 108 -67 -20 -177 -74 61 -26 -176 152 -22 -23 -60 -47 19
4352 19 56 -17 106 195 43 211 -39 57 -71 -54 84 -22 42 62 -29 -154 -72 207 -250 -23 232 162 87 -40
4376 -40 211 -180 9 31 38 -15 -107 -74 38 109 -131 32 -25 157 -72 227 21 -14 11 99 -14 -238 -47 -78
4400 -78 210 -14 -40 114 309 -52 -93 18 -45 205 87 3 -72 66 -19 22 144 -63 14 78 -56 -25 -92 180
4424 180 -37 148 109 46 -134 179 -237 101 -23 -337 -184 -101 271 -19 -10 107 -162 108 108 -123 88 98 -35
4447 -35 -32 -59 94 13 -118 -62 -22 3 -81 -62 -9 -123 -8 -65 -18 -89 -84 51 -80 -134 -4 153 -74 -124 -76 5 -38
4474c8M1o4p8J60M2j92J06j02K13k38J44O3j52kR9j69L50k92J00O4N9k95L7L02
4498A58M1j61j27L06k89P2j89J62j7J42j80Q3q6K7J86j20j00K62j83K5M3j62L35
4521B28k34j55J23J43k93K71j69o7Q2Q4k8k09J44j16R7J10J0j40M19m66K45j27
4543d8LK45k62m8n6L56j70m8J72k44J73R6r3o1R9j58L66j50j71N0J76k26k3R1
4567F9m5j87J83m7Ol0j56L86k4k50J47j33l2q0K61k40K11J04j4p5j40j1N3J46
4591A02ol38J13L26m00L19l27L71p9nj47J8K71k50l5rNJ83j84J68P3k74K38k45
4615a12K48J0o9j8J70j88m4J65j53j38K36j47N1M7j7l33L48J1j48K41l09K23j53
4638g9K64k47l8q0Q6p5K79J37k94J14n3J65k19q1q6M7J80j73K19n5j16K3J73l2
$$ plain form
4474 -38 3 -61 -139 21 63 -129 -23 -125 88 -150 -6 57 -95 -97 2 -167 183 -109 -9 55 114 -181 -144 158
4498 158 199 38 -89 217 -72 0 -189 -27 -44 98 -82 1 -85 -58 128 8 -92 170 -13 12 55 -107 228
4521 228 -6 -161 -38 105 -188 83 -86 -153 -71 13 -15 -224 -80 -196 -99 11 21 -119 300 -166 79 -48
4543 -48 -45 200 -62 -110 -166 190 20 -28 144 -100 73 169 76 15 114 -44 322 172 1 51 227 1 -22 69
4567 69 24 -163 20 -27 -21 -51 -207 179 155 -95 52 -81 -113 -193 68 -172 39 143 129 54 -86 -97 -44 102
4591 102 96 -242 -129 197 -203 116 -211 160 81 76 -71 -53 218 -32 -67 -76 -71 112 -72 96 169 -105 133 -112
4615 -112 136 146 77 59 229 41 -3 162 9 -129 107 -40 11 58 41 -292 56 67 -81 160 -149 74 -79
4638 -79 185 -62 -100 -180 -94 -169 110 247 -47 67 14 179 -40 -121 -207 -160 20 -153 66 11 -105 -82 91 59
4662E9n4R2j88J3N0O7J24k1k44m2J07ll36N28j05j05N8m7p7J40j09J17nJ97k11
4687Ej01L15k06O6oP0j69j50J69j95P2J24k9K44r6j75K6P2j5p8K21o8j7p0K4k8
4713Em7J36j32k71M07Q6l01K0J70l8N4m8j27M1J62j82J54J3j15j19q1J4J24J8
4737e7k7K15J45k59J90l58L51j58K17j92l9J67l16j16K50r3R3j52K12j91J45j87
4759a60r1L11K1l04L21q3j14m2r1L55m6m6j47M97m25J49R9l55J75j95J61n2P5
4782A3J05j85K11k15J91k04N5J51j0lJ28o04M14j33j88K81J09j8r6j23J71k9p9
4805e8J98k13K40j05K2K5j53l2L78m69K62k27L38k91k31L07r6J35j62k2K52kk58
4828a62L80oj76r0J07qM1l0L8l87K58k8j5jK86r6j36n8Q9k28O73l79J9j35J58
$$ plain form
4662 59 5 97 -91 -78 -28 39 163 142 -102 -144 -37 -40 -376 152 47 -58 0 -47 -124 16 -93 24 19 216 5
4687 5 -96 219 13 79 73 143 -26 -176 -7 -202 -130 -6 -35 209 113 -62 -36 36 21 -57 164 96 79 9 33 5
4713 5 -42 94 -38 -309 98 184 -117 -97 73 35 89 41 -86 -45 117 -65 89 102 -13 -132 -213 -199 -75 -57
4737 -57 -84 131 276 17 207 -151 200 42 259 67 28 195 -121 -237 13 -80 13 -139 73 -118 27 -160
4759 -160 -251 60 81 -223 98 15 -99 -141 -232 123 77 31 -116 381 -44 105 204 -151 24 -171 -10 -62 13
4782 13 118 -67 144 -71 120 -84 -29 122 112 109 237 -367 47 -86 -274 7 116 98 2 -121 50 21 -58
4805 -58 140 -73 167 62 84 109 -44 -76 302 -167 95 -132 206 -85 -316 -9 -105 30 -132 -154 98 96 -162
4828 -162 218 212 36 -54 53 45 86 56 94 -293 -35 -63 -78 -79 207 111 -25 -83 6 -222 451 72 91 -44 114
4853A14l17M5K94k28L35j86j81J13q6J49J39l49K06j44K13P0j00k8k15K93q7k37
4875a87J41J6J44m2J04j76K45j19k4j96K16J30l90r3L82k57j66L29j45o2L30k77
4897i7N9R2k93L92m7j35m5L24l53j12L03k33K97m98L33L36l59N7K67k89lJ45l70
4920b29M17l98M20j25l3l7r0K82q5O1k79P7j0J1O4l10L14r6K38l95L89p9k28L00
4944A79k43L1o2j65M20k32N6K0P3J42m18R7J48j41P0p0J67j76J47k33K94J59l91
4967a28K09pj30o7M2M0J27J17k81K46j38n5r6N8j55J45Q2K63l46O0J14j29k3o
4991e8mJ23j19J6m8J41L4m4M6K1j74K9J70Q4k00Q0n9j32J61Q2q6l3r7l4K98l57
5017a60L11j55n9N4j16j01J33K11m0l3l5k40N6K67n2p7P3J69l9j92m8p0R1O1n2
$$ plain form
4853 114 -203 -158 136 -92 243 57 -124 -11 -97 52 191 -158 48 -96 117 187 87 59 -156 137 50 -187
4875 -187 -46 -30 114 72 176 0 245 126 102 -94 122 252 -138 -231 151 -106 -272 57 -88 -150 180 -97
4897 -97 -38 54 -239 153 106 -29 -74 250 -103 -215 88 -145 152 -346 -13 323 -36 21 288 -1 -4 141 -229
4920 -229 188 -210 210 85 52 15 -75 207 122 183 -96 -19 -29 -18 46 -264 50 -46 192 -203 186 107 -121 179
4944 179 -64 -33 -95 -260 160 -72 -16 4 77 219 -199 -102 46 -95 -25 -95 72 -104 43 -190 104 263 -128
4967 -128 81 74 -56 -123 -81 -41 86 203 -78 168 30 -25 -121 -63 -218 -73 9 272 -74 -14 100 -29 -52 -58
4991 -58 -62 61 -58 -42 -90 51 85 41 87 108 -66 -37 133 217 17 97 38 -94 67 149 63 30 -67 -101 197 -160
5017 -160 151 -4 -63 -9 -125 -226 -93 118 78 45 10 -230 -174 93 41 -36 37 206 167 -25 -73 -143 -52 9 -43
5042d3k67J24J32L44j16j85J34r5j05K08j41oK53q5j14k76M19j80j9K7j08j15
5064b14J46K3J18o3k3J42k36L2M1K4R0n6Q8n2o6R1oL0j65o1J33q2j51O6O0M43
5090C52l62l4J12J50O7l61j02J50R9k47p1M98o5j88K39q5k88K38k11L82m27J62
5112Hr8K61l61O07n62j74L61M2j7J2l19K18J59n0l26K31J09J95n0j10j2r9l0P1
5136F6j67J05L22k73J54m49J83M3L4j71pK29m4j84l0J0K63q1P3R0m18N7K00J04
5160A09l47J01K60k13R8p0J07o3j72J87k12L67l58R0J70J14R9k19n6l0k2R9K3
5183F2o2J35J14j23k85q8O5N0R4J41j39L1j43J72rn7j18K90k42J32K35k02J45
5206A98k57J26j42J94k58J59J83k93j30K16K55q9j57r3J1L0M4n0p1r9K54o7l06
$$ plain form
5042 -43 -310 -186 -54 290 174 -11 123 28 -77 131 -10 -16 237 152 38 -238 181 1 -18 9 -99 -214
5064 -214 -68 -45 73 10 -13 129 -107 -75 -34 -10 80 24 112 60 -6 85 79 109 -56 -117 16 -66 -217 -151 -91 352
5090 352 -10 -44 68 218 285 -76 -178 -28 71 -176 -247 251 186 -2 237 152 -136 102 -109 273 -154 8
5112 8 -90 171 -190 417 -145 -319 42 84 67 79 -240 -22 137 87 -239 -8 101 296 246 136 124 25 -5 66
5136 66 -101 4 326 53 207 -242 -59 -16 18 -153 -160 69 25 -159 -189 -179 84 3 76 166 -252 -195 5 109
5160 109 -238 -137 123 -90 8 -62 45 -18 -190 -3 -215 152 -206 -116 54 168 267 48 -8 -38 -60 39 62
5183 62 0 135 249 126 -159 -247 -182 -132 -38 103 -36 -5 -148 24 15 -42 -160 130 -112 20 255 53 198
5206 198 -59 67 -75 119 -139 20 203 -90 -220 -4 251 162 5 -88 -77 -47 -3 -53 -124 -223 31 -36 -342
5229c42J68O0J63o7NJ39j33M1M5K5Nk89K46j11l0j43J35K35k60J15O4J2r7j35
5253a49Q3J89l9j54O5j12Q0l69N93n7M7l7m7m8q2jj08O3PLM5M6j39l2J30k4J12
5280F5j49L4j86J48K88j03J43k94J64k01l4K55l23L02l60K04o4J11J62J13k40
5301C5o5Q2P1j82m1p9p2L49j9M5K1k24m8J32K16k51J19m2o8J59l0k5k28P1K05
5326A31l01J03O9J03j11M9J35j35M6j91N8J72o8J0l12L41j27K45m78K99n3j1J48
5349A22l04K48j1Lm02J32L76k22l1K13j54O6r9L47j66j28O9O2m20L38j4j8q3j43
5373b19O5J78J15J1O7l18j00N26l30p5J72j25J70k70J18Rj04J93N0m4J0j90J40
5396D9m1K8l4n9J0J21p7M0J37j70M0j0r5J55k53L9J70l5j02J43J21k25K12k13
$$ plain form
5229 -342 -174 -114 49 -18 -13 126 -7 34 79 104 109 -180 66 -45 -75 -218 -83 152 -108 7 71 83 -14 -149
5253 -149 -66 123 84 -70 -5 -117 -37 -406 187 130 177 140 93 45 -37 -38 -146 -83 -76 -73 -28 18 -121 -153 -23 -47 65
5280 65 -84 -50 -236 -88 200 97 240 -54 110 -91 -125 130 -193 109 -251 -47 -111 0 162 275 35
5301 35 -30 52 123 -59 -100 -179 -251 98 79 124 145 -79 -127 5 221 -30 89 47 -21 138 108 83 -145 -74 131
5326 131 -170 -67 2 105 -6 43 178 43 89 -102 -44 128 60 70 -242 99 -28 217 -261 38 -15 -26 122
5349 122 -182 66 55 58 -344 -212 164 -58 -89 124 -30 36 -63 284 118 -10 59 121 -299 39 25 7 -76 -219
5373 -219 -154 24 139 150 217 -101 -201 325 -5 -80 92 -33 137 -133 -15 -6 -110 83 133 89 99 -91 49
5396 49 8 36 2 -57 -47 74 -3 37 174 4 44 34 -61 94 -159 -120 50 15 -87 56 177 -48 164 -49
5420d9N2k17L59l1J36k97p5M28l79l6K05k51M02o19L82rq4l4L5J80j99O6l5L0
5444d0J90r1lk79J57Q5L9o9L4o3N2K19k73J08j24K21j9l00J15R2N0O5m20M99j16
5469A29l78K42J56j07J27k17Q9J85k93k42J73L53q0L5j52n1K43j57M7j73M1K37
5491B07k86J47q1p1k7L6k0K26Jj19k15J98J14j80J67n2o8K7J2j59J26Q9K7m0R
5516F8j30J17j10Q6k66K20k21J68qj14R4L5NL9r4O9Rj84M1l5J24P3J77k38J83
5541A08J15k50K44k12j82R1P5j00J53k85L08j04J5J00k4j52K34j21J33Q0m49K44
5563B1j64K82q0l6K63k5m49L4K75l6k06l6J28N2k3L39j36m98M47k68L32O3k35
5586D4o5J93l52K4K07M8m47L15k76L08J57k91M6j51J38K49k61l8K25j96J77j74
$$ plain form
5420 -49 3 -214 145 114 250 -47 -122 306 -73 -109 96 -155 247 -372 10 1 -83 -117 -82 98 -101 -35 -70 -40
5444 -40 150 59 56 -223 -66 19 58 -11 23 -40 12 231 -42 66 -58 163 144 -156 -41 51 101 166 -254 245 129
5469 129 -249 -7 149 42 169 -48 41 226 -67 -309 -136 217 137 172 20 -31 212 55 102 -71 -30 207
5491 207 -79 68 -13 -84 -111 -75 -95 131 132 13 -202 -4 110 -70 97 45 -23 4 16 -143 -17 72 99 59 68
5516 68 -62 55 -55 31 -235 -15 -236 -68 -76 -190 -96 -61 -56 -17 -111 -42 -33 -217 -176 -211 -87 -14 163 -75 108
5541 108 223 -27 217 5 -177 -86 -11 -111 42 -243 65 -39 -24 76 52 -100 134 13 146 226 -223 21
5563 21 -143 139 59 23 286 261 -188 -154 121 85 -121 -157 -29 23 0 339 203 -295 152 -116 216 279 44
5586 44 -21 172 -180 -156 51 99 -348 -33 -309 -1 156 -135 -89 -240 -102 147 -114 -152 73 -123 54 -120
5608a20R4j37O1J84j0n5K0R3q8J8o1P8l78J94Q4L9j10k16J60J71Jj09K71l50L20
5633A54j97J45J0k88K97k23j8M6J9n5K57j38kM8p7J99n0k06K62k14J25K05l01
5656bj8Qk13K80n7K11k25R5j06j07j22K95r8J87O0j56j00L12j33j61N9N3j89J68
5680D1j21M3Qr3J23L02m60J46j16Q7j43J81J91k48Q3j1K04j94j05R2j3r1K03k7
5704H2m7J14j02l2L6k00J90k07K20k87J53j92K49K04k30j5k42L18K41n08K35J05
5726H5k2j11j8L4J99l20K81r5L9P5l04J85n2J64k39L50k91J41K24j99p2j08K01
5749A47l14O3M62k92j5K61n54K55p8j00K27k8K01l79J25p2j33L26l79M69J5k58
5771e1j6R0j34K97j71J22K02l08J35j89M0j37L01k89K92l50J77J73k94j79L69
$$ plain form
5608 -120 -26 -163 -102 82 72 17 37 130 42 60 -1 77 -301 -107 -23 16 -94 -310 -150 21 22 -87 184 -166 154
5633 154 -43 102 112 -176 121 -102 -120 -74 -55 -110 147 9 7 55 -22 177 127 -79 183 -31 94 299 -2
5656 -2 -20 -12 -225 55 -2 209 -16 79 -27 -134 -256 39 -59 128 188 32 -68 244 111 -50 9 62 -127 41
5680 41 -80 -37 -29 -122 1 303 -157 -11 -127 -40 -183 -2 189 -59 24 13 217 23 -82 10 -3 -94 109 82
5704 82 35 149 47 15 51 -149 41 -166 54 -233 -80 -272 -23 181 -49 -64 -306 12 253 -255 -20 85
5726 85 63 -48 -66 -32 167 -153 128 33 72 147 -157 28 -24 140 -99 251 -40 101 325 126 54 -54 147
5749 147 -167 -104 358 66 51 312 -242 13 -65 -165 62 34 235 -144 -19 -91 -224 102 -277 192 207 -51
5771 -51 -67 23 -111 186 15 137 339 31 166 -23 17 -120 181 -108 184 -166 11 184 -110 -289 80
5792H0l24L51n6R3p8k04J1K22o6Q5m1m0j07K16j12q3J32k37L78k15l29Q6M09k41
5816g0J08q0J01K0j10r4k7M62k95P5Qk82M36m96J34L18m01J34K69k87P5J63m5
5839A16j74J08k94K05o7K70rj96l3p5Q3J29m6k24L28p6nq0rk07K95J33l9k08L0
5864d5lL37k58o8r1L6q4J67O7j56m1L59k37o2P0K49j50l2m0j50M2J92j30jj83
5889b12K84L23l29j07j98J83p2J56j87m8K30j25J08R3k99L5K37k83O43k72n5m8
5911E7j82l6j07K62K66m04J61L9n7K55j63j37j03K72k78L82Lk57O2K3k05J28J78
5934A59j12k0j88K95j39K5k7rj31J32q2J34j96K15nM6jk01J07j47N09m06j39L04
$$ plain form
5792 80 -244 107 51 144 66 -138 -127 95 29 114 73 33 -74 142 30 -53 79 -158 220 5 -324 -238 171 -70
5816 -70 38 -42 59 79 -31 -125 -152 310 15 90 98 -184 252 -244 -110 208 -193 -59 210 -77 -2 161 116
5839 116 -58 50 -244 -39 -106 164 155 -41 -74 -149 -66 63 17 -207 121 45 40 -40 -49 -256 39 172 133 -75 -45
5864 -45 -48 289 31 -37 -128 -92 -176 -9 58 -98 -139 220 -17 -79 -9 240 90 58 18 -132 -90 102 -28 -29 -212
5889 -212 72 395 66 -41 -239 -56 -128 28 -159 -207 23 -102 6 99 -200 -165 72 -211 432 160 105 57
5911 57 -125 -161 -268 -6 260 -144 17 56 -1 254 91 -46 -149 123 -155 227 230 -27 35 58 -147 -19 159
5934 159 47 27 -161 134 -5 20 -7 -16 -147 -15 -97 37 -159 56 51 97 96 -105 2 -145 364 -42 -181 123
$$ [...]
8191f7
##END NTUPLES=NMR FID
##END=
