##TITLE=1H_SR158H
 D2O
 8 sc, 
 24.3.2023
##JCAMPDX= 6.0         $$ Bruker NMR JCAMP-DX V2.0
##DATA TYPE= NMR FID
##DATA CLASS= NTUPLES
##ORIGIN= UXNMR, Bruker Analytische Messtechnik GmbH
##OWNER= root
$$ XWIN-NMR		Version 3.5
$$ Fri Mar 24 15:43:09 2023 Russian Standard Time (UT+4h)  she@DPX200
##.OBSERVE FREQUENCY= 200.13135
##.OBSERVE NUCLEUS= ^1H
##.DELAY= (6, 6)
##.ACQUISITION MODE= SIMULTANEOUS
##.ACQUISITION SCHEME= undefined
##.AVERAGES= 8
##.DIGITISER RES= 18
##SPECTROMETER/DATA SYSTEM= spect
##.PULSE SEQUENCE= zg30
##.SOLVENT NAME= D2O
##.SHIFT REFERENCE= (INTERNAL, D2O, 0, 15.7039)
##AUDIT TRAIL= $$ (NUMBER, WHEN, WHO, WHERE, WHAT)
$$ ##TITLE= Audit trail, XWIN-NMR		Version 3.5
$$ ##JCAMPDX= 5.01
$$ ##ORIGIN= Bruker BioSpin GmbH
$$ ##OWNER= she
$$ F:/spectra/data/she/nmr/H-F/1/audita.txt
$$ ##AUDIT TRAIL=  $$ (NUMBER, WHEN, WHO, WHERE, WHAT)
(   1,<2023-03-24 15:42:02.14 +0400>,<she>,<DPX200>,
      <created by zg, POWCHK disabled, PULCHK disabled
       configuration hash MD5:
       00 E9 B6 7A A2 85 ED C7 34 08 36 98 17 FE 4E 26
       data hash MD5: 16K
       8C E1 C4 0F 1C 4C 22 D9 10 64 1D 5A 67 25 16 01>)
$$ ##END=
$$ 
$$ hash MD5
$$ BD D3 50 B3 62 F8 8E 14 36 25 F4 41 3B FF 4C 9D
##$RELAX= 
##$RELAX= 
##$RELAX= 
##$RELAX= 
##$RELAX= 
##$RELAX= 
$$ Bruker specific parameters
$$ --------------------------
##$DU= <F:/spectra>
##$EXPNO= 1
##$NAME= <H-F>
##$PROCNO= 1
##$TYPE= <nmr>
##$USER= <she>
##$AMP= (0..31)
100 100 100 100 100 100 100 100 100 100 100 100 100 100 100 100 100 100 
100 100 100 100 100 100 100 100 100 100 100 100 100 100 
##$AQSEQ= 0
##$AQ_mod= 1
##$AUNM= <au_zg>
##$AUTOPOS= <>
##$BF1= 200.13
##$BF2= 200.13
##$BF3= 200.13
##$BF4= 200.13
##$BF5= 200.13
##$BF6= 200.13
##$BF7= 200.13
##$BF8= 200.13
##$BYTORDA= 1
##$CFDGTYP= 0
##$CFRGTYP= 5
##$CHEMSTR= <none>
##$CNST= (0..31)
1 1 145 1 1 1 1 1 1 1 1 1 1 1 1 1 1 1 1 1 1 1 1 1 1 1 1 1 1 1 1 1 
##$CPDPRG= <>
##$CPDPRG1= <>
##$CPDPRG2= <>
##$CPDPRG3= <>
##$CPDPRG4= <mlev>
##$CPDPRG5= <mlev>
##$CPDPRG6= <mlev>
##$CPDPRG7= <mlev>
##$CPDPRG8= <mlev>
##$CPDPRGB= <>
##$CPDPRGT= <>
##$D= (0..31)
0 1.2 0 0 0 0 0 0 0 0.06 0 0.03 0 0 0 0 0.0002 0 0 0 0 0 0 0 0 0 0 0 0 
0 0 0 
##$DATE= 1679658121
##$DBL= (0..7)
120 120 120 120 120 120 120 120 
##$DBP= (0..7)
150 150 150 150 150 150 150 150 
##$DBP07= 0
##$DBPNAM0= <>
##$DBPNAM1= <>
##$DBPNAM2= <>
##$DBPNAM3= <>
##$DBPNAM4= <>
##$DBPNAM5= <>
##$DBPNAM6= <>
##$DBPNAM7= <>
##$DBPOAL= (0..7)
0.5 0.5 0.5 0.5 0.5 0.5 0.5 0.5 
##$DBPOFFS= (0..7)
0 0 0 0 0 0 0 0 
##$DE= 6
##$DECBNUC= <off>
##$DECIM= 32
##$DECNUC= <off>
##$DECSTAT= 4
##$DIGMOD= 1
##$DIGTYP= 9
##$DL= (0..7)
0 120 120 120 120 120 120 120 
##$DP= (0..7)
150 150 150 150 150 150 150 150 
##$DP07= 0
##$DPNAME0= <>
##$DPNAME1= <>
##$DPNAME2= <>
##$DPNAME3= <>
##$DPNAME4= <>
##$DPNAME5= <>
##$DPNAME6= <>
##$DPNAME7= <>
##$DPOAL= (0..7)
0.5 0.5 0.5 0.5 0.5 0.5 0.5 0.5 
##$DPOFFS= (0..7)
0 0 0 0 0 0 0 0 
##$DQDMODE= 0
##$DR= 18
##$DS= 0
##$DSLIST= <SSSSSSSSSSSSSSS>
##$DSPFIRM= 0
$$ [...]
##$SUBNAM2= <"">
##$SUBNAM3= <"">
##$SUBNAM4= <"">
##$SUBNAM5= <"">
##$SUBNAM6= <"">
##$SUBNAM7= <"">
##$SUBNAM8= <"">
##$SUBNAM9= <"">
##$SW= 18.05172834244
##$SWIBOX= (0..15)
0 0 2 0 0 0 0 0 0 0 0 0 0 0 0 0 
##$SW_h= 3612.71676300578
##$TD= 16384
##$TD0= 1
##$TE= 0
##$TE2= 300
##$TE3= 300
##$TEG= 300
##$TL= (0..7)
0 120 120 120 120 120 120 120 
##$TP= (0..7)
150 150 150 150 150 150 150 150 
##$TP07= 0
##$TPNAME0= <>
##$TPNAME1= <>
##$TPNAME2= <>
##$TPNAME3= <>
##$TPNAME4= <>
##$TPNAME5= <>
##$TPNAME6= <>
##$TPNAME7= <>
##$TPOAL= (0..7)
0.5 0.5 0.5 0.5 0.5 0.5 0.5 0.5 
##$TPOFFS= (0..7)
0 0 0 0 0 0 0 0 
##$TUNHIN= 0
##$TUNHOUT= 0
##$TUNXOUT= 0
##$USERA1= <user>
##$USERA2= <user>
##$USERA3= <user>
##$USERA4= <user>
##$USERA5= <user>
##$V9= 5
##$VALIST= <valist>
##$VCLIST= <CCCCCCCCCCCCCCC>
##$VD= 0
##$VDLIST= <DDDDDDDDDDDDDDD>
##$VPLIST= <PPPPPPPPPPPPPPP>
##$VTLIST= <TTTTTTTTTTTTTTT>
##$WBST= 1024
##$WBSW= 4
##$XGAIN= (0..3)
0 0 0 0 
##$XL= 0
##$YL= 0
##$YMAX_a= 132826
##$YMIN_a= -193505
##$ZGOPTNS= <>
##$ZL1= 120
##$ZL2= 120
##$ZL3= 120
##$ZL4= 120
##$ABSF1= 10
##$ABSF2= 0
##$ABSG= 5
##$ABSL= 3
##$ALPHA= 0
##$AQORDER= 0
##$ASSFAC= 0
##$ASSFACI= 0
##$ASSFACX= 0
##$ASSWID= 0
##$AUNMP= <proc_1d>
##$AZFE= 0.1
##$AZFW= 0.1
##$BCFW= 1
##$BC_mod= 2
##$BYTORDP= 1
##$COROFFS= 0
##$CY= 11.3945322036743
##$DATMOD= 1
##$DC= 2
##$DFILT= <>
##$DTYPP= 0
##$F1P= 2.36226072786647
##$F2P= -0.459571619588291
##$FCOR= 0.5
##$FTSIZE= 0
##$FT_mod= 4
##$GAMMA= 1
##$GB= 0.15
##$INTBC= 1
##$INTSCL= 1
##$ISEN= 128
##$LB= 0.24
##$LEV0= 0
##$LPBIN= 0
##$MAXI= 10000
##$MC2= 0
##$MEAN= 0
##$ME_mod= 0
##$MI= 1.114404
##$NCOEF= 0
##$NC_proc= 0
##$NLEV= 6
##$NOISF1= 3.799351
##$NOISF2= 2.8
##$NSP= 1
##$NTH_PI= 0
##$NZP= 0
##$OFFSET= 15.70392
##$PC= 1
##$PHC0= -19105.65
##$PHC1= 5.20079
##$PH_mod= 1
##$PKNL= yes
##$PPARMOD= 0
##$PSCAL= 0
##$PSIGN= 0
##$REVERSE= no
##$SF= 200.130013532006
##$SI= 16384
##$SIGF1= 3
##$SIGF2= 2
##$SINO= 400
##$SIOLD= 16384
##$SREGLST= <1H.CDCl3>
##$SSB= 0
##$STSI= 0
##$STSR= 0
##$SW_p= 3612.71676300578
##$SYMM= 0
##$S_DEV= 0
##$TDeff= 0
##$TDoff= 0
##$TI= <>
##$TILT= no
##$TM1= 0
##$TM2= 0
##$TOPLEV= 0
##$USERP1= <user>
##$USERP2= <user>
##$USERP3= <user>
##$USERP4= <user>
##$USERP5= <user>
##$WDW= 1
##$XDIM= 8192
##$YMAX_p= 0
##$YMIN_p= 0
$$ End of Bruker specific parameters
$$ ---------------------------------
##NTUPLES= NMR FID
##VAR_NAME=  TIME,          FID/REAL,        FID/IMAG
##SYMBOL=    X,             R,               I
##VAR_TYPE=  INDEPENDENT,   DEPENDENT,       DEPENDENT
##VAR_FORM=  AFFN,          ASDF,            ASDF
##VAR_DIM=   8192,          8192,            8192
##UNITS=     SECONDS,       ARBITRARY UNITS, ARBITRARY UNITS
##FACTOR=    0.0002768,     1,               1
##FIRST=     0,             0,               0
##LAST=      2.2672688,     0,               0
##MIN=       0,             -193505,         0
##MAX=       2.2672688,     132826,          0
$$ Real data points
##PAGE= N=1
##DATA TABLE= (X++(R..R)), XYDATA
$$ [...]
1846h5k48M88k86R7J15j5l02L49J42k14j0P2rl52K83j34K16j79J40J42m13J76
$$ -85 -333 155 -131 -34 81 66 -236 113 255 41 31 103 94 -258 25 -109 107 -72 68 210 -203 -27
1868b7m2J76J22k90j17L46k40K15p0M4oj61q1J10L27l32j05Q6j6P5Q8j57n4q2
$$ -27 -69 107 229 -61 -178 168 -72 143 73 117 111 -50 -131 -21 306 -26 -131 -45 -61 14 102 -55 -109 -191
1892a91J54J01j16K27j08K70l06r2L30k46j26L10l20K15l08L96l41J88m5r0m4
$$ -191 -37 64 -52 175 67 337 31 -61 269 23 -103 207 -113 102 -206 190 -151 37 -8 -98 -142
1913a42L51l1j85O0q2J4j85L20k42J46J70l40L54k64J1O4k36J4L55j87R1j55J3
$$ -142 209 178 -7 53 -29 -15 -200 120 -122 24 194 -146 208 -56 -45 19 -217 -203 152 -35 56 -99 -86
1936h6L91k63k52M70j76o7P2k52J80lN3r7J25k45M3R7J14j99J38j05N11m01J63
$$ -86 305 42 -210 260 84 17 89 -163 17 14 67 -30 95 -150 -107 -10 104 -95 43 -62 449 48 211
1959B11k95j24J81K9j59K21j74K59K1l07J50l33K20J69j12m7K14r1j49M0K15k97
$$ 211 -84 -208 -27 2 -157 64 -110 149 170 -137 13 -320 -100 69 -43 -90 124 33 -116 -76 139 -158
1981a58R6J51J0j87K50j92K9K35l45j10J83J28k42K77J17P3k74J2p6j32j3K98
$$ -158 -62 89 99 -88 162 -30 -1 234 -111 -221 -38 90 -152 125 242 315 41 53 -23 -155 -168 130
2003A30q1j51J44k22J68K64m25P0o1J8J67k46L60k44K38J65m2l1l9r9Mj59J30
$$ 130 49 -102 42 -180 -12 252 -173 -103 -164 -146 21 -225 135 -109 129 294 252 221 182 83 87 -72 58
2026E8k12P5R5K23k21p8J12Q4j44r2J49k87J19J26Q4k36k2L69Qj70m1L2M8q8p6
$$ 58 -154 -79 16 239 18 -60 52 136 -8 -100 49 -238 -119 7 91 -145 -167 202 210 40 -1 31 79 -9 -85
2051h5K85l32J00J6QQj22k8R7j0j91L28k02J78o3J18k8j4j37r6M53j41J58l20
$$ -85 200 -132 -32 -16 -8 0 -122 -150 -53 -63 -254 74 -128 50 -13 105 77 63 -74 -170 283 142 300 -20
2075b0K46j72J22Jn8j14R1j07M0r1J45Q1j4j84J04R9l12K97j29K6k62r1L96K6
$$ -20 226 54 176 177 119 5 96 -11 29 -62 83 164 150 -34 70 169 -143 154 25 51 -211 -302 94 120
2099A20N1j6m2k6j70J09m22N23oK12l02Q2j50M1J3k25m5L39P7O8k90l9K86l31
$$ 120 171 155 113 87 -83 26 -396 127 121 333 31 113 -37 4 17 -208 -253 86 163 231 -59 -98 188 -143
2123a43j42L98k87K20j69K26n1k38L25m2k81m8J68P6r9k34L9J69Q4K0k4o3K44
$$ -143 -285 113 -174 46 -123 103 52 -186 139 97 -184 -232 -64 12 -87 -321 -282 -113 -29 -9 -33 -96 148
2146A48Q5j14k0k01mJ82o5Q1J45r1l96K7K26M0K8j87J82KJ48j93Q8J2j26k67L51
$$ 148 233 119 99 -102 -106 76 11 92 237 146 -250 -223 3 43 71 -116 66 68 216 23 111 123 -3 -270 81
2171H1N7P3o8j5k77N43n20K05Q2p0J5m7k4j52J10L7o8QK28r4N3j55k6J27j10j52
$$ 81 138 211 143 128 -149 394 -126 79 161 91 106 59 35 -117 -7 30 -38 -30 198 104 157 2 -24 103 -7 -159
2197a59k2K52j44J80r2J44j54K18j94q6L13m36Q6O6L3J7j75M4L12k84J37o4o1
$$ -159 -181 71 -73 107 15 159 5 223 29 -57 256 -180 -94 -28 5 22 -153 -109 203 -81 56 -8 -69
2220f9k18J25j4K23N3l3K65l21n6J72j88j8j72J53K98J7j25m2j12J49r8L12j21
$$ -69 -287 -162 -176 47 100 67 332 11 -45 127 -61 -79 -251 -98 200 217 92 50 -62 87 -11 301 180
2243A80r8L8nk87J27J23k45L49k00J09L9Q5m66J92J44k97K65l8k8j86R4M0J58
$$ 180 82 120 115 -172 -45 78 -167 182 -18 91 130 215 -251 -59 85 -212 53 15 -13 -199 -105 -65 93
2266I3j14j30QR5KJ43j82J79l78P6L10j53p0J74jj50J98qm9j21P8O7j3o2O5J00
$$ 93 -21 -151 -143 -48 -46 97 -85 94 -284 -208 102 -51 -121 53 52 -98 100 92 43 -78 0 67 54 -8 57 157
2292A57n0l30J08J98l8j07j85K66K86l11J26o0q3J2K40k9l77J84J3n4q8R3j12
$$ 157 107 -223 -115 83 45 -62 -247 19 305 -6 120 60 -23 -11 229 200 -177 7 20 -34 -122 -29 -141
2315a41J84j67Q3J37n8J36j38Q6j61J98j73K2J80l47M17r4k53J16r4J46j80r5
$$ -141 43 -124 -41 96 38 174 36 122 -39 159 -14 8 188 -159 258 164 -89 27 -67 79 -101 -196
2337a96J72j40K91p2k12K89m2p5K90k76Lk17M01k80R4j76l7P2J28P4j07j78K44
$$ -196 -24 -164 127 55 -157 132 90 15 305 29 32 -185 216 -64 30 -146 -183 -111 17 91 -16 -194 50
2360E0m7j57K60k51Q9J11P3k62K98j36M3j51L3P6n5N1j30J6J1M7K23j37k43L12
$$ 50 3 -154 106 -145 -56 55 128 -134 164 28 71 -80 -47 29 -26 25 -105 -89 -78 -31 192 55 -188 124
2384A24j43k12J31K68k79Q8J00m68N06j3J90l71p7K25j22k0O5pl8K46l22R1K74
$$ 124 -19 -231 -100 168 -111 -23 77 -391 115 102 292 -79 -156 69 -53 -73 -8 -15 -53 193 -129 -38 236
2407B36m35L05lK7O9k16K54m29rJ73O4J33p7k6Q4O7k18p7R1Ro0Lp9K35k41K81
$$ 236 -199 106 103 130 199 -17 237 -192 -201 -28 36 169 92 66 150 217 -1 -78 13 22 -38 -35 -114 121 -120 161
2433A61P7j55j54J48o4J98j61j81Q1l14M33R6l50L41j39n6l3n1J72j40J50j68
$$ 161 238 83 -71 77 13 211 50 -131 -50 -364 69 165 -185 156 17 -39 -72 -123 49 -91 59 -109
2455a09L41j98j07M5k08Q6R7J05k58J91K4j10K03j40Mm9L1j2n5K71O9m63K32L5
$$ -109 232 34 -73 -28 -236 -150 -53 52 -206 -15 9 -101 102 -38 -34 -83 -52 -64 -119 152 221 -242 -10 25
2479B5k3L2m3J11j87N3k68O22j77k08K23k10j55K64r4j68J53J87l9q4P8p7o6j07
$$ 25 2 34 -9 102 -85 -32 -300 322 145 -63 160 -50 -205 59 -35 -203 -50 137 98 14 92 15 -51 -158
2503a58R7q5K81l15K05q5j6q4J94kj5r0j22j01L30j66J18j37l7J07J78Q3n32L29
$$ -158 -61 -146 135 -180 25 -60 -76 -160 34 32 17 -73 -195 -296 34 -132 -14 -151 -188 -81 97 180 -352 -23
2527b3Q3J39j92n1K54k73Q5K00j98O3r6j56K89p2j53J18j94J85j01mNJ18n2M1
$$ -23 60 199 7 -44 210 -63 22 222 24 87 -9 -165 124 52 -101 17 -177 8 -93 -97 -92 26 -26 15
2551A5J52j60k03K22J43j38qJ9j84j36L4L54nj26P5p6o7J2J62j76J62j07K00l39
$$ 15 167 7 -196 26 169 31 23 42 -142 -278 -244 110 105 -21 54 -22 -89 -77 85 -91 71 -36 164 -175
2575a75O3J24o2j40J71K96m06J23k1J78j55J56r0j29O8O3k24J76O4J30j2k87N
$$ -175 -112 12 -50 -190 -19 277 -129 -6 -27 151 -4 152 62 -67 1 64 -160 16 80 210 198 -89 -84
2598h4J10j0K8j08p1M2k5J14P9n9N1j7j41r2J30L47l48l0j0J29K48l38j5J56j35
$$ -84 26 16 44 -64 -135 -93 -118 -4 75 16 67 50 -91 -183 -53 294 -54 -84 -94 35 283 -55 -70 86 -49
2623d9n2N0J13L5j50j08N8P7K38r8l32K19j01J97O9r5l13M27j96r9N8J86l58K88
$$ -49 -101 -51 62 97 -53 -161 -103 -26 212 114 -218 1 -100 97 166 71 -242 185 -11 -110 -52 134 -224 64
2647F4l08L61N1j01J05k32J89J33j33p1ML9q4M8j71OJ09J44O4l44k5n2O0q5K10
$$ 64 -244 117 168 67 172 -60 129 262 129 58 62 101 17 65 -106 -100 9 153 217 -127 -152 -204 -144 -229 -19
2672a9J59j38o4J96r9j09O1j67K35j6K55l61kK9k57L27J29R5m89L33r8kJ5K7Q
$$ -19 140 2 -62 134 35 -74 -13 -180 55 39 294 -67 -69 -40 -297 30 159 254 -235 98 0 -2 13 40 48
2697D8j75qJ59Q5j6j40J80j38j64M28k98J54n2Pj48K51o1k07R0r0J15P6k96J97
$$ 48 -127 -135 24 109 93 -47 133 -5 -169 259 -39 115 63 70 -78 173 112 -95 -5 -95 20 96 -200 -3
2721cj10L62m68K17o3O4k08J70J19n9J07p0j38L8r9O9R0j29J99rK4j43J89o5m9
$$ -3 -113 249 -219 -2 -65 -1 -209 -39 80 21 128 58 -80 -42 -141 -72 18 -111 88 79 103 -40 149 84 35
2746C5K8k72J68r0q6L35L9p2K8r9J42r7k6o8J27k45j42L58k30OJ77J61oj57K0
$$ 35 63 -209 -41 -131 -217 118 157 85 113 14 156 59 33 -35 92 -153 -295 63 -167 -161 16 177 171 14 34
2771C4j16K65k88J35m0k12L71k35J20Ml48R7J36KK52q0l90K76Q9k88J44K77l32
$$ 34 -82 183 -105 30 -10 -222 149 -86 34 38 -310 -213 -77 -75 177 97 -293 -17 72 -216 -72 205 -127
2794a27m3J76J04O8J02m75J97k3Q3j4j52Ol4K22q5O8K9k58m9J79J46l22J28kj26
$$ -127 -170 6 110 178 280 -195 2 -21 62 48 -104 -98 -132 90 5 73 102 -156 -205 -26 120 -202 -74 -76 -202
2819b02K95j26O5m0n0J70Q2jj38q1J34j86O9q4j23k9J09J15K08k78J09l6M3%j31
$$ -202 93 -33 32 -8 -58 112 194 193 55 -26 108 -78 -9 -93 -216 -245 -136 -21 187 -91 18 -18 25 25 -106
2844a06l7K84J4j65J21j47J56k30M3J4P2n0N5m8j96N15j98k2j01J4RQj04k7M6
$$ -106 -143 141 155 -10 111 -36 120 -110 -67 -53 19 -31 24 -24 -220 295 97 75 -26 -12 -3 5 -99 -126 -80
2869h0j3O2K2m8k6J53N3R7k58L03k41l6P2J24j70J58j36J47j18m5J19J4p4j78
$$ -80 -93 -31 -9 -57 -83 70 123 220 -38 265 24 -12 60 184 14 172 36 183 65 20 139 153 79 -99
2893i9l0m8L1J66mr1R8qK96m22j08L45r8O3J55n00K13m9J06p8j54L94P1k20N1
$$ -99 -129 -177 -146 20 16 -75 23 15 311 -111 -219 126 28 91 246 -254 -41 -90 16 -62 -216 178 249 29 80
2918H0j03L2O9j76J40r0L97k89J19k9j53o6J18j25m7K00p1mO6P3R1J96n69j8R2
$$ 80 -23 9 78 -98 42 -48 349 60 179 150 -3 -69 49 -76 -123 77 6 2 68 141 232 428 -141 -159 -67
2943f7lmMM9J47j42P1Q7j97J63oo6J51r3l80K13J74j31P3m8k4j18R4O2j7j3j78
$$ -67 -70 -74 -70 -21 126 -16 55 142 -55 108 102 36 187 94 -286 -73 101 -30 43 -5 -29 -147 -53 9 -8 -21 -199
2970a99M00k03k38J08J64J14l07L05o7j5m0J56j46J7j01k23K45P8m7ML1J7o2P7
$$ -199 201 -2 -240 -132 32 146 -161 144 77 62 22 178 32 49 -52 -275 -30 48 1 5 36 53 -9 68
2994F8j41n6j0J42K03o3k16P8j34K45q5j67J72k3l2j1p2p3J95j8K30k54l1K7L0
$$ 68 -73 -129 -139 3 206 143 -73 5 -129 116 31 -136 36 13 -19 -30 -102 -175 20 2 232 -22 -53 -26 4
3019Dk08K2K9L25n8Q4j6k58o2j10K78o7K56l01J88j29N7L7Kr8o3o6p0J92P6k73
$$ 4 -204 -182 -153 172 114 198 182 -76 -138 -248 30 -37 219 -82 106 -23 34 71 73 -25 -88 -154 -224 -32 44 -229
3045b29J43J55l32J63j0k1M5J32K5k3k03M4J78P7j02M3j55J31J99k13k76L37j40
$$ -229 -86 69 -263 -100 -110 -131 -86 46 71 48 -155 -111 67 144 42 85 -70 61 260 47 -229 108 -32
3068c2P0p9l6ML4J24k63K95L0k16j64K12k2J80l75J68J24pJ74l49P4k0J76k26
$$ -32 38 -41 -77 -73 -39 85 -178 117 147 -69 -233 -21 -43 137 -238 -70 54 47 221 -128 -54 -74 102 -124
3092a24J34k69L40J65k04L3J8l0j76J66l8j1J31k82K28j96L6O7k78K50JK48j69
$$ -124 10 -259 81 246 42 75 93 63 -113 53 15 4 135 -147 81 -115 -79 -12 -290 -40 -39 209 40
3115D0q8J30k56J28K99l86K54k27K08k7r7j21K70l09N8J77P4j57J36N5k43l5J64
$$ 40 -48 82 -174 -46 253 -133 121 -106 102 75 -22 -143 127 -182 -124 53 127 -30 106 161 -82 -117 47
3138D7K2k15L7L28k67K31l24M8L30l87J23k01Q1Q7n9j3J09J97Ro2j27m2J12j32
$$ 47 69 -146 -109 219 -48 183 -141 -93 237 -150 -27 -228 -147 -60 -119 -132 -23 174 183 121 -6 -48 64 -68
3162f8N8J8q8R1j75M54k68k54J89N8n2j02K1J87J38l78M0J96r4J62j12r2J51j67
$$ -68 -10 8 -80 11 -164 290 22 -232 -43 15 -37 -139 -118 69 207 -171 -131 65 -29 133 21 -71 80 -87
3186h7j12L33j89J52p4j26K62l87L00j95J37M1K36j65r7R3n6k98K90K65l10J47
$$ -87 -199 134 -55 97 23 -103 159 -228 72 -123 14 55 291 126 29 122 66 -232 58 323 13 160
3208A60k31n8J37P0l6j53K54k93L62j17O5j00J17k92L84m03L18M5l43J26q0j1
$$ 160 -71 -129 8 78 42 -111 143 -150 212 95 160 60 177 -115 269 -134 184 229 -114 12 -68 -79
3230g9l8Q2J48j56o1J98k45J45L3lj39K54q2J45k07M9m06J55K15j88M4J40K71
$$ -79 -117 -35 113 -43 -104 94 -151 -6 27 24 -115 139 57 202 -5 44 -362 -207 8 -180 -136 4 275
3253B75m56L66k19J48j06J38j22j00J51n5O6j5p4r3J0J41Q8r2l5o7k16M00o5j95
$$ 275 -181 185 -34 114 8 146 24 -76 75 20 86 71 -3 -96 -86 55 143 51 16 -51 -267 133 68 -127
3277a27kJ75k26L50j92Q7Q1r5l43K32L6j5K57j20L1k16J53j16K2l2J09M4l23K50
$$ -127 -129 46 -180 170 -22 65 146 51 -292 -60 -24 -39 218 98 129 -87 66 -50 -28 -60 49 93 -230 20
3301B0o4L06k77K75j75p0J61l70P0K92k02l8L58m12J60J52l2k78K8J68m2J3J33
$$ 20 -44 262 -15 260 85 15 176 -194 -124 168 -34 -72 286 -126 34 186 154 -124 -96 72 30 43 176
3324A76k43J49n5j03L66k19m08K55k3J34j5o6j24K24j79K07j59J85K74l86N5l35
$$ 176 -67 82 27 -76 290 71 -337 -82 -105 29 14 -52 -176 48 -131 76 -83 102 376 -10 45 -290
3346b90L22Q4n4K6m02M81r6j87J84n8q3R2Q4k64K82j35J75j17j65J76k43K89j01
$$ -290 32 116 62 88 -314 167 71 -116 68 10 -73 19 103 -161 121 -14 161 44 -121 55 -188 101 0
3369@M1R0l75K30j55nK54L5J3k46k4J62J02j86O6l1K23q8j08j75K13l8R6p4j55
$$ 0 41 131 -244 -14 -169 -174 80 115 128 -118 -142 20 122 -64 2 -29 194 106 -2 -177 36 -2 94 20 -135
3394a35J91j63J01N2k94K11r1L13k89J43j13J04o2r8J93l06K34N4k8j11n5J10
$$ -135 56 -107 -6 46 -248 -37 -128 185 -104 39 -74 30 -32 -130 63 -243 -9 45 17 -94 -149 -39
3416c9p3J80k9J65k20R4j27J20k30L17j21j58K06O1N7l56j98K39J73O8J70j55
$$ -39 -112 68 39 204 -16 78 -49 71 -159 158 37 -121 85 146 203 -153 -351 -112 61 129 299 144
3438A44l25J2L10k39J60j82P1J63j92M7J90l32QJ73J66j20j36j12J64m6L2j91
$$ 144 -181 -169 141 -98 62 -120 -49 114 -78 -31 159 -173 -165 8 174 54 -82 -194 -30 -76 -44 -235
3460b35L17l3j03r9K30j80J10p1K38j96q8Q9K36l59K40ml50K18k5j05L29j45k32
$$ -235 82 49 -54 -153 77 -103 7 -64 174 -22 -110 -21 215 -144 96 92 -258 -40 -65 -170 159 14 -218
3483b18L41O6j12j06N6K9j25K69m25J94l0J1K03k07o0J62k95L14k6m61K10L48
$$ -218 123 189 77 -29 27 56 -69 200 -225 -31 -61 -50 153 -54 -114 48 -247 67 41 -420 -210 138
3505A38r7j02K01m3j12R9J5j93j5K12L13m52L52l86j28K02j4M0n3l7M21pm20J12
$$ 138 41 -61 140 97 -15 84 99 -94 -109 103 416 -36 316 -70 -198 4 -10 30 -23 -60 361 354 -66 46
3529D6j6l6l0J17qk10J18j98K41P3k54K18k08L69j41k3r3J31o6J59k85J00L8j56
$$ 46 30 -6 -36 81 73 -137 -19 -217 24 97 -157 61 -147 222 81 58 -35 96 30 189 -96 4 42 -114
3553a14j04J68k72L40op8J84k2Jj5LJ22j67j21K17k97J51J8J26j74J12J69m03
$$ -114 -218 -50 -322 18 12 -66 118 96 97 82 85 207 40 -81 136 -161 -10 8 134 -40 72 241 -162
3576a62K00j39oL8n2K17j00J02k63K03j31N1rJ60k5N3N2q3L5k53Q8Rj9K87j39
$$ -162 38 -101 -107 -69 -121 96 -4 98 -165 38 -93 -42 -51 109 84 137 189 106 141 -112 -24 -15 -34 253 114
3601A14O7k12r9N00n87K01K64k34K9j08L8j39K03j17r5K21j11L30j64k00J80j74
$$ 114 181 -31 -130 370 -217 -16 248 14 43 -65 -27 -166 37 -80 -175 46 -65 265 101 -99 81 -93
3623i3K56j72J6r8J91r9N2j69j20J50K85k62m7N5J05r1k2J06rM1q1j68K23J76
$$ -93 163 -9 7 -91 100 1 53 -116 -236 -86 199 -63 -110 -55 50 -41 -63 43 34 75 -6 -174 49 225
3647B25l73K51j84K41k94J07K02j90L02l51Lo9K34k17J84N9k91K54k31J96r3p7
$$ 225 -148 103 -81 160 -134 -27 175 -15 287 -64 -61 -130 104 -113 71 130 -161 93 -138 58 -35 -112
3669a12K08k62J61l9J34j75K6j6j2K06j76L05l30J65J75k38J4j25J32M1k43K56
$$ -112 96 -166 -5 -44 90 -85 -59 -75 -87 119 -57 248 -82 83 258 20 34 -91 41 82 -161 95
3691I5l39R9L9J53Lk0M8j33O7R0j4k03K60J54k91j7k4M3j4R5L88k18j03l21P2
$$ 95 -244 -145 -106 47 50 30 78 -55 12 102 88 -115 145 299 8 -9 -33 10 -4 91 479 261 158 -163 -91
3716i1J64j69L82l36mj93L60k38L5J45j20J32J8j09p4j19J62P6o9j07K25o7l98
$$ -91 73 -96 286 -50 -54 -247 113 -125 -90 55 -65 67 85 -24 -98 -217 -55 21 -48 -155 70 3 -395
3739c95K85J77PJ50k34K10Pn4j46J05o6j03J16k88J1J09J9q6m4L4K48K7mN7j88
$$ -395 -110 67 74 224 -10 200 207 153 7 112 46 -57 59 -229 -218 -109 -90 -176 -220 -186 62 89 85 142 -46
3764d6k13L20j47QkQ2Q5j36P1M2j56J08l72L66L1j9K01l04j54O1J38kj72JL18
$$ -46 -259 61 -86 -78 -80 2 87 -49 22 64 -92 16 -356 10 41 22 223 -81 -235 -174 -36 -38 -210 -209 109
3789A09l6k2p5j89K16J55j45m9j66P1J3J80j77L71J10k25j21K25j83J1j25k6J87
$$ 109 73 51 -24 -213 3 158 13 -36 -202 -131 -118 62 -115 256 366 141 20 245 62 73 -52 -78 109
3812A09k83J98M0K05j78M0k43K61j43k7Q8J26n7k01j04L06o0o9j42M13k61k2L38
$$ 109 -174 24 64 269 91 131 -112 149 6 -21 67 193 136 -65 -169 137 77 8 -134 279 18 -4 334
3835C34m14q4L76j16j5M7j64JO0k5J28n2p4J84j79J94l46J08K14j86N7M4J6k82
$$ 334 -80 -164 212 96 81 128 -36 -35 25 0 128 76 2 186 7 201 -145 -37 177 -9 48 92 108 -174
3859a74m1O1J54k9J93k10M2j70J3R3j20K20l53L83J87j93q9l0K7J78l9k09l7J49
$$ -174 -215 -154 0 -29 164 -46 -4 -174 -161 -68 -188 32 -321 62 249 56 -33 -63 -36 142 103 -106 -143 6
3883Fk67K24k52L15J57k23J72k01QJ36j3k30rJ41J63j60n6K65j95L3j69J38k1
$$ 6 -261 -37 -289 26 183 -40 132 -69 -61 75 62 -168 -177 -36 127 -33 -89 176 -19 14 -155 -17 -38
3906c8l8j2k1P1o1K00k38K8K81k68j1J23j03k9q0M77l24k0J38l69K84j9P4m2J14
$$ -38 -76 -88 -109 -38 -99 101 -137 -109 172 -96 -107 16 -87 -116 -196 281 -43 -63 75 -294 -10 -29 45 3 117
3931A17j72Q4j32k6N8J8K80l68R7j1O9j17q3J45K13j15m29L20J4j69L87o6j81
$$ 117 -55 29 -103 -129 -71 -53 227 -141 -44 -55 14 -103 -186 -41 172 57 -372 -52 -38 -207 180 114 -67
3954f7M5m5j05L14J41k41k62J78M5k57L14k09J67K43m58L14J27j79j93L17j59
$$ -67 -22 -67 -172 142 283 42 -220 -42 3 -254 60 -149 18 261 -197 117 244 65 -128 189 30
3975C0L6k9p5n8K93l96K03j4J67k26J49j01k59K14k8j69M54l87J66J45R7j59N9
$$ 30 66 37 -38 -96 197 -199 4 -10 157 -69 80 -21 -280 -66 -94 -263 191 -196 -30 115 212 53 112
3998A12J64m52J88r3J27L8R5j33J13j48p0j1j22K17M4k13j74L95Pk8pk7l20L11
$$ 112 276 -176 12 -81 46 84 179 46 159 11 -59 -70 -192 25 69 -144 -318 77 84 56 49 22 -298 13
4022A3o9K20l24N4L60l6j42k4n8K11k68j08K36k9Q3k27K49r9j15K8J20L0l4L7
$$ 13 -56 164 -160 -106 254 218 76 52 -6 205 -63 -171 65 36 119 -108 141 42 -73 -45 75 105 71 108
4046A08j56J3qJ2m0Q7j06J73j57M6K9K17l16R7J80M3l60J76J43l26K55k04K9J39
$$ 108 -48 -35 -43 -31 -71 16 -90 83 -74 -28 1 218 -98 -1 179 222 -138 38 181 -145 110 -94 -65 74
4070G4K77j86k73L85j64k27R1j43J68J6k33K22J49j04j09j11L77n0l3k59P7M0
$$ 74 351 165 -108 277 113 -114 -23 -166 2 18 -215 7 156 52 -57 -168 209 159 126 -133 -56 -16
4092a6mp6L08l24l3Q1K61k76j05K50j51J12J46l29J34j99K69J40j64j42k51K50
$$ -16 -20 -96 212 -112 -145 -64 197 -79 -184 66 -85 27 173 -156 -22 -221 48 188 24 -118 -369 -119
4114a19K41J83o40K20J1p4Q2K68j63l37N22l70K54j3j63J35k54OQ5KJJ39K1j45
$$ -119 122 305 -335 -115 -104 -178 -96 172 9 -328 194 -176 78 65 -98 37 -217 -211 -126 -124 -123 16 37 -108
4138a08O1k05J05J74Q2J08m30O6K25J94j39l52K15j65M70k69N4k3J4j85J82K12
$$ -108 -47 -252 -147 27 109 217 -213 -147 78 272 133 -219 -4 -169 301 32 86 63 77 -108 74 286
4160B86l83j07J57K96l01P3K6P8j6r9J1J31k99J83j0N8r2m9K47j80J65j95j56
$$ 286 -97 -204 -47 249 -52 21 47 125 109 10 21 152 -147 36 26 84 -8 -57 190 10 175 -20 -176
4183a76J57N1k4k4Nj63K58M9k61K63l1k07L42l41J93k84J36J5M6K69m30J61Q0
$$ -176 -19 32 8 -16 -11 -174 84 133 -128 135 104 -103 239 -102 91 -193 -57 -42 4 273 -157 4 84
4206H4n9J88rk22p9K26k41J19l1p1J61k3M3j29K4Q2j77K56k32LJ04j87J60J58
$$ 84 25 213 204 -18 -97 129 -112 7 -24 -95 66 43 86 -43 -19 63 -114 142 -90 -87 17 -170 -10 148
4230A48k54r6K54j41O5j62o8M85j85M5j96J74K2p0q1K26j55Q5k77J28L10j11r8
$$ 148 -106 -202 52 -89 -24 -186 -254 231 46 91 -105 69 91 21 -60 166 11 96 -181 -53 257 146 48
4253D8QL1j49j04L06j01j94J32Q7j38J65n0j1n8K4n6J63LL7k82K21o7P4R4j56
$$ 48 56 87 -62 -166 140 39 -155 -23 64 -74 91 41 30 -28 -4 -60 103 106 143 -139 82 15 89 183 27
4278B7k40K81j85J87Mj01MJ39k85R6r6K80n0p2M1j60K62j60J39k88J96K1j7R2
$$ 27 -213 68 -117 70 74 -27 -23 116 -169 -73 -169 111 61 -11 30 -130 132 -28 111 -177 19 40 23 115
4302A15j2J02j89o0M8k26P3J27k65K26O5l2m4K27j28K3O9j02O9n3m2L37k36R7
$$ 115 103 205 16 -44 4 -222 -149 -22 -287 -61 4 -28 -72 155 27 50 119 17 86 33 -9 328 92 189
4326A89l28J63p2J6K1P0pk17L38k1j18n4q6K3J65j96J72j6o6l14K96j65K83k9
$$ 189 -139 24 -48 -32 -11 59 52 -165 173 152 34 -20 -106 -83 82 -114 58 42 -24 -338 -42 -207 76 47
4350D7R8j21N8l43L15J5j01n1J16j09J64k34j21M8M64m05K39n8k01p4J79J2j40
$$ 47 145 24 82 -261 54 69 -32 -83 33 -76 88 -146 -267 -219 245 -160 79 21 -180 -254 -75 -63 -203
4373b03L05J47k66j44J24k5K97p5j94o6J30k62J12P7J90j20l33K87m2J01lj11
$$ -203 102 249 -17 -161 -37 -62 235 160 -34 -100 30 -232 -120 -43 147 27 -306 -19 -61 40 37 -74
4395g4R3po6m4L64k83J75j83n0L3q6P1l5O1K8J70P6N3j1l49J15k22j09K75j32
$$ -74 19 12 -54 -98 266 -17 158 -25 -75 -42 -128 -57 -92 -31 -3 167 243 296 285 -64 51 -171 -280 -5 -137
4420a37J73q4J10r5O8j63P6Q9k31rO3K7K09j54J25J08l92J84J11k6k2j43O9Kj31
$$ -137 36 -48 62 -33 35 -128 -52 37 -194 -203 -140 -113 96 -58 67 175 -217 -33 78 52 30 -113 -44 -42 -173
4445a73L15l5j05l25J16M24n37J16J13l7K44j71j8K41j69J64k05No6o0K34j38
$$ -173 142 107 2 -323 -207 217 -320 -204 -91 -128 116 -55 -73 168 -1 163 -42 -37 -103 -163 71 -67
4467f7K11j04j16K29k43K6j86J57K90j87JK27p9l42L38k92K3R2J40j56k51K49
$$ -67 144 40 -76 153 -90 -64 -250 -93 197 10 11 238 159 -183 155 -137 -114 -22 118 -38 -289 -40
4489d0J64R0j74L57l98j27K70j51K5r4K42k23J54M1j12K52k88o7J72Q1j27N6k06
$$ -40 124 214 40 397 -1 -128 142 -9 16 -78 164 -59 95 136 24 276 -12 -79 93 174 47 103 -103
4512a03l1N5P9J02l04N81n11o1L13j51J40J70m65K07k60K98J03j92k88L31O9k59
$$ -103 -134 -79 0 102 -202 379 -132 -193 120 -31 109 279 -186 21 -239 59 162 -30 -318 13 82 -177
4534a77R2J02Q9n1r4K34j04J05k24J82k56J16M3r1R7j45L3J49m4r2L02l22r4J16
$$ -177 -85 17 106 55 -39 195 91 196 -28 154 -102 14 57 -34 63 -82 -49 100 56 -36 266 -56 -150 -34
4558c4J15L8l35J95K7k0N7j63j15J81p4L24j68o2R9j09n4n7J24N4o9oJ13k85J38
$$ -34 81 119 -216 -21 6 -14 43 -120 -235 -54 -128 196 28 -34 65 -44 -98 -155 -31 23 -46 -52 61 -224 -86
4583h6K20j55j53L66j16q6M4j76N1L4l4Q5J38j12J62k18l1r0L30j01K20k90oj0
$$ -86 134 -21 -174 192 76 -10 34 -142 -91 -57 -91 -6 132 20 182 -36 -67 -157 173 72 292 2 -4 -14
4607a4k39J06J76j01LJ60j69J49J28j72j4J55j43j91J34J87j41J08M8j53K8k05
$$ -14 -253 -147 29 -72 -69 91 -78 71 199 27 13 168 25 -166 -32 155 14 122 170 17 45 -160
4629a60Q6Q6Ol03K54J45j52P0l08L31o6K82l50k07N12j21k79J47J86p7n8k61M38
$$ -160 -74 12 18 -285 -31 114 -38 32 -276 55 -11 271 -79 -286 226 105 -174 -27 159 82 24 -237 201
4652B01l36J94j91O2j52J82J65l11K35j39L6j91N94m48K27j68P9n3j20O8Q2J35
$$ 201 -135 59 -132 -70 -222 -40 125 -186 49 -90 -54 -245 349 -99 128 -40 39 -14 -134 -66 16 151
4674A51k41J81o0P0L20n98L47l54P0L28j62N2j73J6j26M2J53n5K4j97K63r8j76
$$ 151 -90 91 31 101 421 -177 170 -184 -114 214 52 104 -69 -53 -179 -137 16 -39 -15 -212 51 -47 -223
4697b23K9J63R4O3oL0q6j00K33q5m4n0L3j73K20j35LJ12j26Q8J64J5n1k72N4M3
$$ -223 -194 -31 63 126 120 150 64 -36 197 112 68 18 51 -122 98 -37 -34 78 -48 40 204 219 168 -104 -50 -7
4723gP1J01j18L2j44J97K4n6j63m2J68K3j72K27l77J62j17M20l48l7K72m1p4k91
$$ -7 64 165 47 79 -65 132 156 100 -63 -105 63 86 -86 141 -236 -74 -191 229 -119 -156 116 75 1 -290
4747b90kJ60K38M5q4J70l66J20Q2l9J5J39l44J41K67m31J53J03j60L61m10n0J40
$$ -290 -292 -132 106 151 67 237 -129 -9 73 34 49 188 -156 -15 252 -179 -26 77 -83 278 -132 -182 -42
4770d2jM4P0L7k95K17q6j78LQ6LP2n7J88L2n2k78J90O7k42K49l36L89k62K34J04
$$ -42 -43 1 71 108 -187 30 -56 -234 -231 -145 -142 -70 -127 61 93 41 -237 -47 20 -222 27 -309 80 -182 52 156
4796A56l03K50O8l16J06PJ9K73j92j30N5m8Q7l39L58Pj57J47j4O8l3l8J60m06
$$ 156 -147 103 171 -145 -39 -32 -13 260 68 -62 -7 -55 32 -307 51 58 -99 48 34 102 69 31 191 -215
4820b15J28k7J54k1j9p7J49Q7j45j2l5J9j2j24K0J59N1m4j78J61K89l62j29M7
$$ -215 -87 -114 40 19 0 -77 72 159 14 2 -33 -14 -26 -150 -130 29 80 36 -142 19 308 -54 -183 -136
4844a36o0L04R1j74q3J57j12N3l4j05J67Q7j50j10L2j02N49m00J12N3p5j58r5
$$ -136 -196 108 199 25 -58 99 -13 40 6 -99 68 155 5 -105 -73 -175 374 -26 86 139 64 -94 -189
4867a89L32j04j77p0K44Q6k7l1j3n8J18m00N14m08J66L7J09j35r9J90j48J21j55
$$ -189 143 39 -138 -208 36 122 95 64 51 -7 111 -289 225 -183 -17 20 129 -6 -105 85 -63 58 -97
4890i7K75k25j6L2J7L9p4K31k63M2p9K29j58O2j56J10k4n1K51k74J15q7R8J07
$$ -97 178 -47 -63 -31 -14 25 -49 182 -81 -39 -118 111 -47 15 -141 -31 -55 -106 145 -129 -14 -101 -3 104
4914A04j0j44K8K09k35P4R8o5o6J84l95M64k60J7n3Q8J8q7l6%K65k61j2J84q5
$$ 104 94 -50 -22 187 -48 26 124 59 -7 177 -218 246 -14 3 -50 38 56 -31 -67 -67 198 -63 -75 109 24
4939B4m9J98k51j34K20P6q9Rn7J72J11q9q0L5k34p9J13L5J54j99L48j46j12K24
$$ 24 -25 173 -78 -212 8 84 -5 4 -53 119 230 141 61 96 -138 -217 -104 -69 85 -114 234 88 -24 200
4963B00k63j01K2R2J08k01k14M02Nj3J18k82L11k60K34j48j08p2J08p4L43j32
$$ 200 -63 -164 -142 -50 58 -143 -357 45 50 37 155 -127 184 -76 158 10 -98 -170 -62 -136 207 75
4985G5Q9o1j76J27N5j98k12K39J0K18k08J26j75R4j59L45k38M7J34j03L8k3k45
$$ 75 164 103 -73 54 109 -89 -301 -62 -52 166 -42 84 -91 3 -156 189 -49 -2 132 29 67 44 -201
5008b01J02P2L62m11L8m5Q9L37k58j92p5J75j69K32k31J67K23k48j3j4PJ36r8
$$ -201 -99 -27 335 -76 -38 -83 6 343 85 -107 -182 -7 -176 56 -175 -8 215 -33 -46 -60 -53 83 -15
5031a5J6j21J44j03K19j34K20k98K88k20j29K19Q6l91M02k65K58k3m32L41p3j62
$$ -15 1 -120 24 -79 140 6 226 -72 216 -4 -133 86 172 -219 183 -82 176 153 -279 62 -11 -173
5053a73PK21LJ35R7k51j65L1J23n3k29R4j7N17l35J04J6J0j26j56j32L02j29n
$$ -173 -166 55 58 193 290 39 -126 -95 28 -25 -254 -160 -177 340 5 109 125 135 9 -147 -279 23 -106 -111
5077a11QJ75M4q1j62J03k8K52l17J4K78j71n9J25j03K03k54J41L18l74J02J0r7
$$ -111 -103 72 116 35 -127 -24 -52 200 -117 -103 175 4 -55 70 -33 170 -84 57 375 1 103 113 16
5100A6j41K4K19j61K8K20l52Q0K3pO7j05J01n2K47j66l5ML39l16p4K5R3K4k61
$$ 16 -125 -101 118 -43 -15 205 -147 -67 -44 -51 16 -89 12 -40 207 41 6 10 349 33 -41 -16 77 101 -160
5125a60J60k1mJ8J87lk43J62k20L23p1J60j28o3J16k83J7K55j88jJ28o2N5j14
$$ -160 0 -21 -25 -7 180 177 -66 96 -124 199 128 288 160 97 213 -70 -53 202 14 13 141 79 134 20
5149B0J00J62j01q1j60j3q9o3PJ41K12l42P1J4J2k9J82k34K8K6J66j62K19q4j53
$$ 20 120 282 181 100 -60 -73 -162 -225 -218 -77 135 -207 -136 -122 -110 -139 43 -191 -163 -137 29 -133 86 2 -151
5174a51K03n7K41l34J41J08k89N76p46L98k30K34J39j06j01Mj66L81m9k53j41
$$ -151 52 -5 236 -98 43 151 -138 438 -308 90 -140 94 233 127 26 30 -136 245 196 -57 -198
5195a98J35J20Mj4j98ON3p3K86k72K24kj8k79J40K4J01N4Q6Oj05k25K40r3J73
$$ -198 -63 57 61 47 -151 -145 -92 -165 121 -151 73 71 53 -226 -86 -62 39 93 179 185 80 -145 95 2 175
5220A75j23K72k40l24K95j04J47l4n5k13K59k9K31k09o2l1J14K9j68J30o2J74
$$ 175 52 324 84 -240 55 -49 98 64 9 -204 55 26 257 48 -14 -45 69 98 -70 60 -2 172
5242A72m11L37m5q5J79m7p4j14j26L25j16K2J78k57J16m7J22k5L8p6j02k68K58
$$ 172 -239 98 53 -32 147 100 26 -88 -214 111 -5 17 195 -62 54 7 129 104 142 66 -36 -304 -46
5265d6p7n6J76NL20m99K63j25n8J63m8O5J26k41r7K70k58P7j00J13J75l93K65
$$ -46 -123 -179 -3 2 322 -177 86 -39 -97 66 18 83 209 -32 -129 141 -117 -40 -140 -27 148 -245 20
5288B0K11l71L02k66K05J57j77R2j94n1l09M94L8j21K78l6n05N0q5K25K22j08
$$ 20 231 -140 162 -104 101 258 81 173 -21 -72 -381 113 151 30 308 272 -233 -183 -268 -43 179 71
5310G1K50j31k26n2J66o1J7j10J88j27Q9k0n5o1m8L15k97N5P8q1J66j9k23J24
$$ 71 321 190 -36 -88 78 17 34 -76 112 -15 74 54 -1 -62 -110 205 -92 -37 41 -40 126 107 -116 8
5334HJ50q8Q0j16J09m2p8J98j68j59K44L2l68J73J6P0o8K40k62k0J29k99M5R4
$$ 8 158 70 150 34 143 101 23 221 53 -106 138 170 -198 -25 -9 61 -7 233 -29 -49 80 -219 -174 -80
5358h0o2J39j56K2K21k29Q8L34k92p5rJ48j37Q2l5p2L3k41L38k16K12N6j16k3
$$ -80 -142 -3 -159 -137 84 -145 -57 277 -15 -90 -99 49 -88 -6 -41 -113 -80 -321 17 -199 13 69 -47 -70
5382g0l4%K8K11m5J47p8k64J79k3j33j23L5K38k64N62n67K28j9m01N76j0j12N6
$$ -70 -104 -104 -76 135 90 237 159 -105 74 51 -82 -205 -170 68 -196 366 -201 27 8 -393 183 173 61 117
5406A17J9P8l22r2J26R3r0l9K92l29L3j42K53o1o2M1j5J11p0L5pK46j57K5o3l6
$$ 117 136 214 -108 -200 -74 19 -71 -110 182 -147 -114 -256 -3 -64 -126 -85 -100 11 -59 -24 -31 215 58 83 20 -16
5432a6m2j60M32j43p5Q4j05p8P8n7J59o0Q3k52M22Qk82q0L5K6q1O3R7k17K86j07
$$ -16 -58 -218 214 71 -4 80 -25 -103 -25 -82 77 17 100 -152 270 278 -4 -84 -49 -23 -104 -41 56 -161 125 18
5458A8n2J39j4kj5J51l9k20Q2k02K32k7M07l34O0j32l13J64K0J95m31M09k33L76
$$ 18 -34 105 91 89 74 225 186 -34 48 -154 78 51 458 124 184 52 -261 -97 -77 118 -313 96 -137 239
5482B39k20J10k20J63J71k71K23P0j51lj57K6p9J29j99J92K24k14k14L62k21j3
$$ 239 19 129 -91 72 243 -28 195 265 114 111 -46 -20 -99 30 -169 23 247 33 -181 181 -40 -53
5504e3J32k98M96l06j7o2K10n5j26P6J40j24j84Q6J82L6j33jK29j40o9L28l60
$$ -53 79 -219 277 -29 -46 -108 102 47 -79 -3 137 13 -171 -85 97 133 0 -1 228 88 19 347 -13
5527a3J81n8j77L77j22j04j62O3J94qm47K97R2Q0j31J20j76M0j30O5J30k54L0
$$ -13 168 110 -67 310 188 84 -78 -15 179 171 -276 21 113 193 62 182 6 46 -84 -19 111 -143 -113
5550a13J65j88m6L02j75K13J14k92r0K45k69Q2P5Pk08J32R2j30L03k8N5l20R8
$$ -113 52 -136 -182 120 -55 158 272 -20 -110 135 -134 -52 23 30 -178 -46 46 -84 219 191 246 -74 24
5573B4p3L32j94j89j02K23J26j99j5q5K11r4L1N7j33j18k1L54j22j05J18j23N1
$$ 24 -49 283 89 -100 -202 21 147 -52 -67 -152 59 -35 -4 53 -80 -198 -219 135 13 -92 26 -97 -46
5596d6J02j33J05J77J0l90J62OJ26J97l6K5m40J52n5J94q1qN4j04l56J54K58o2
$$ -46 56 -77 28 205 215 -175 -13 -7 119 316 280 305 -135 17 -38 156 75 67 121 17 -339 -185 73 11
5620A1M87o28K28q7M8k9q9m8J72p4o1n7L53k46J26j40M3J49j71p9J20O3L50m39
$$ 11 498 -130 98 11 59 30 -59 -107 65 -9 -70 -127 226 -20 106 -34 9 158 -13 -92 28 91 441 2
5644Bk43K39K69j50l39M47k81o9J33k73M3L42J93k88J06q8L2j65Q2R0m02J65K81
$$ 2 -241 -2 267 117 -222 225 -56 -125 8 -265 -222 120 313 25 131 43 75 -90 -8 82 -320 -155 126
5667A26k11M5J94r6p1P8k12j9j1K86q4J76N2m17K51j26J6J03j27o6MN6o7j39M53
$$ 126 -85 -40 154 58 -13 65 -147 -166 -177 109 25 201 253 -164 87 -39 -23 80 -47 -113 -109 -53 -120 -259 194
5692A94l82o2J82j86K13J25J44P0k71N5J28k85P9j0j22J28j48M16l71JM40k90
$$ 194 -188 -250 -68 -254 -41 84 228 298 27 82 210 -75 4 -6 -128 0 -148 268 -103 -102 338 48
5714D8p0K25j72o6j50O8n0O6K89r0l2k25L33j29J68m01M73l97J47j3k92L7K97
$$ 48 -22 203 31 -35 -185 -117 -167 -101 188 98 66 -159 174 45 213 -188 285 -112 35 22 -270 -233 64
5737F4jp1j90K48o1l3o3L6J4J4J69j80K61m40K34N3l22N9K57k15J51J43j86J22
$$ 64 63 -8 -198 50 -11 -44 -107 -71 -57 -43 126 -54 207 -233 1 54 -268 -209 48 -167 -16 127 -59 63
5761F3j8jj39p5J68J70l7j50J45m44K20q2L56k74J24j34J38n9O4Rk01J69K4J36
$$ 63 45 44 -95 -170 -2 168 131 -19 126 -318 -98 -180 176 -98 26 -108 30 -29 35 44 -157 12 36 172
5785A72j41k20J45Ql8J15jk75K38N6N8m6R0n3n8j60J11L44k33k70J70M1r5q4L5
$$ 172 31 -189 -44 -36 -74 41 40 -235 3 59 117 71 161 108 50 -110 1 345 112 -158 12 53 -42 -126 -91
5810i1K01k73J12P5J52k47L06j12j35J13k55K72j01j9j21K06J21k15k4M9l5j95
$$ -91 110 -163 -51 24 176 -71 235 123 -12 101 -154 118 17 -2 -123 83 204 -11 -35 14 -21 -216
5832b16K26j28j34L30Or9j12M8o8J31k37M1K54O9j06O0j92l1N1J10lk79N05l62
$$ -216 10 -118 -252 78 84 -15 -127 -79 -147 -16 -253 -212 42 111 5 65 -127 -158 -107 3 0 -279 226 -136
5856a36m3N65m30P5j42L2K17j62N6L06k11Qk29J27oj57l1K70qK02j96j68oJ00
$$ -136 -179 386 -44 31 -111 -79 138 -24 32 338 127 135 -94 33 27 -130 -161 109 101 303 107 -61 -67 33
5880C3k01J76j54J68P9j42L78j15m6j34J46l06K17k2r6j0J78L8j84m5L7M3J07
$$ 33 -168 8 -146 22 101 -41 337 222 176 42 188 -118 99 77 -19 -29 149 187 3 -42 -5 38 145
5903A45Q5l00J14K24k13q0n1j9K11k8P4l23o8K71l9J97j91j00J83l01L11k92M26
$$ 145 230 -70 44 268 55 -25 -76 -95 116 88 162 -161 -229 42 3 200 9 -91 92 -209 102 -190 236
5926B36k49J01l5k16LK06P1l01K64j23J53j77m8M2J43j67L61l03j48K68p7n2j2
$$ 236 -13 88 53 -163 -160 46 117 -184 80 -43 110 -67 -115 -73 70 -97 264 -39 -187 81 4 -48 -60
5949f0K52k44J30k11O7p8L78k93M4jj20%J80J45o8J07m38J62j3J02j68J68k41
$$ -60 192 -52 78 -133 -66 -144 234 -59 -15 -16 -136 -136 44 189 121 228 -210 -48 -61 41 -127 41 -200
5972b00K18j83K26k6O9j85L18j94L7Q6m74K40J24K38n05K20m6J0K31m38K36J1
$$ -200 18 -165 61 35 104 -81 237 43 80 166 -308 -68 56 294 -211 9 -37 -27 204 -234 2 13
5994A3M7j28J9J60N3k70Q9o6k3L76k34J05k32J88n3J96m88L27J04k16J40j78j54
$$ 13 60 -68 -49 111 164 -106 -17 -83 -106 270 36 141 -91 97 44 240 -248 79 183 -33 107 -71 -225
6017b25J73Q0J55l28L11j60J28k98J59N9j82J17n6k5k80O18k88J19k16K52l1K5
$$ -225 -52 28 183 -145 166 6 134 -164 -5 54 -128 -11 -67 -92 -372 246 -42 77 -139 113 82 107
6039A07k9k34J16OK81l53O0O0j02K7j18J66O7l5k43K35Kk04J57j1n1N6K40q1N
$$ 107 78 -156 -40 -34 247 -106 -46 14 -88 -61 -179 -13 54 19 -224 11 13 -191 -34 -45 -96 -40 200 119 124
6064A24Lj81J16O4m0n2J74j21K0r6j21j3K43k92K13j06L52k17M4j31P0k17K36
$$ 124 127 -54 62 126 86 34 208 87 107 11 -110 -123 120 -172 41 -65 287 70 114 -17 53 -164 72
6087G2J20k39K1j49J72J5n9l45L70K64k45km0L05k00L6l5m9l2m2N5k89L70Qj21
$$ 72 192 -47 -26 -175 -3 12 -47 -392 -22 242 -3 -5 -45 260 60 96 61 12 -20 -62 -7 -296 74 82 -39
6112c9R2r3l4J49l03N60m59QK50l6m1k42M16m01L5J8K16j87J43j17J06k87J79
$$ -39 53 -40 -74 75 -228 332 -127 -119 131 95 54 -188 228 -173 -138 -120 96 -91 52 -65 41 -246 -67
6135f7k58K27L55j06j85K49r5o4Pj61O8L9Q1j72j34L5L11q6l65K74J14mP0j11
$$ -67 -325 -98 257 151 -34 215 120 56 63 -98 -30 9 90 -82 -216 -181 130 44 -321 -47 67 63 133 22
6159B2J33j49J65m42M25j47k6qN5P8Q2j2k79L23l11n9K06j69R7j49j1J42r7M9
$$ 22 155 6 171 -271 154 7 -19 -27 28 106 188 176 -103 220 -91 -150 56 -113 -16 -165 -176 -34 -131 -82
6183h2J16q3Lp0J89j98J21n9l9K44k87J89K47k35O6k65J12K36k52R8l66N79j15
$$ -82 34 -49 -46 -116 73 -125 -4 -63 -102 142 -145 44 291 56 122 -143 -31 205 -47 51 -315 264 149
6206A49j65J57j61K0M2N3K5o4j94J2L24j70r4K31j00j07O5L7l97K43M6J07J17
$$ 149 -16 141 -20 0 42 95 120 56 -138 -126 198 28 -66 165 65 -42 23 60 -337 -94 -48 59 176
6229A76n3k8pj76j6K69m49N30k6l61J37j37q8L65k37k24N27j88J28j11N0j4n5
$$ 176 123 95 88 -88 -104 165 -284 246 220 -141 -4 -141 -229 136 -101 -325 202 14 142 31 81 67 12
6252A2K2L8j90L9J7jJ36j9l66M47k45L72l47P8m4M0P6j52R4p8pJ20m9O1K20j07
$$ 12 34 72 -118 -79 -62 -63 73 54 -312 135 -110 262 -85 -7 -51 -11 65 -87 7 -71 -78 42 -7 54 274 167
6278A67j85M3K01j27M8j1j63n4K45n35M12J5o3J8n1J77k0o0j61N7K26q4p6l8j23
$$ 167 -18 25 226 99 147 136 -27 -81 164 -371 41 56 -7 11 -40 137 117 57 -104 -47 179 95 19 -19 -142
6303a42K26o3j95K11k92L52J0j85k53M43m75L09J23Pn6o7J21J87k08K1l18J83
$$ -142 84 21 -174 37 -255 97 107 -78 -331 112 -363 -54 69 76 20 -47 74 261 53 74 -244 -61
6325f1L2j70K20j18K15l78K04r9P6l9k1J67K01m12K33l22J80J33P0j90pR0QJ01
$$ -61 -29 -199 21 -97 118 -260 -56 -155 -79 -118 -139 28 229 -183 50 -272 -92 41 111 -79 -86 4 12 113
6349A13k81L8L32n31M51j77J10n9j09K64l09M44k82m8K27J48l20K33l31N0n5j14
$$ 113 -168 -130 202 -329 122 -55 55 -4 -113 151 -158 286 4 -44 183 331 11 244 -87 -37 -92 -206
6371b06L02l08K28k76L40k4M6k26q8J88j6K5LJ02p0k01J24J40k10M90m02j61n0
$$ -206 96 -212 16 -260 80 56 102 -124 -212 -24 -40 -15 -12 90 20 -181 -57 83 -127 363 -39 -200 -250
6394b50K90MN9j85J12j05J35rM9j30O4n2n3n3K68j29j04j2L62L8l45J7Q4m2l48
$$ -250 40 44 103 -82 30 -75 60 51 100 -30 34 -18 -71 -124 144 15 -89 -101 261 299 -46 -29 55 13 -335
6419c35M88N6j32k44L89k87K01k60K91j10Q3O0k34P8j65o9L0J04K03n8r6k3q5
$$ -335 153 209 77 -167 222 -65 136 -124 167 57 140 200 -34 44 -121 -190 -160 -56 147 89 -7 -30 -115
6442a15j13M67j78j95MJ73n2L3j60N39l99L42j88k08K40l04r8M17n00K01M5J61
$$ -115 -228 239 61 -134 -130 43 -9 24 -136 403 4 346 158 -50 190 -114 -212 205 -295 -94 -49 112
6464A12J76m29J22J02l57L85j3k04K62k23m2J79J33m5j13j83J78k62L07jm4K0
$$ 112 288 -141 -19 83 -274 111 98 -106 156 -67 -109 70 203 158 45 -138 40 -222 85 84 40 60
6486F0k44R1N4Q6j1k71J28J18J65l14J06Q9m85L58J23Nr2j19L4K51m05J81m7J47
$$ 60 -184 -93 -39 47 36 -235 -107 11 176 -138 -32 57 -428 -70 53 58 -34 -153 -119 132 -273 -92 -139 8
6510Hj17K45r1J9kk54K33j5j31J87j0J42O2q0k44k21L15N0K3O8k86PJ00K00l55
$$ 8 -109 136 45 64 62 -192 41 26 -105 82 72 214 276 196 -48 -269 46 96 119 187 -99 -92 8 208 -147
6535a47R1J51j4k74J60J70j75L5l5j30P2J77J47j29k5O8j54J63p2%k20L06o0J06
$$ -147 -56 95 81 -193 -33 137 -38 -3 -38 -168 -96 81 228 99 74 142 -12 151 79 79 -141 165 105 211
6559B11j32j00L3q5j24Q4L3J36j41J33P3l74L62l09L60k35q6J64M7j03r2J54m6
$$ 211 79 -21 12 -73 -197 -113 -80 56 -85 48 121 -253 109 -200 160 -75 -161 3 50 -53 -145 9 -37
6582c7k0K11k40Q2P9l03L56J57j46l2l0J33m82O04j88%J19l56J47m1P9n6j9Q6
$$ -37 -57 154 -86 -4 75 -228 128 285 139 107 77 210 -272 332 144 144 263 -93 54 13 92 36 17 103
6606A03j96j09L90k84k4k1J62r5J65k61K36j46%L63l12k2J18M4j82K56k18K63
$$ 103 -93 -202 188 -96 -120 -141 21 -74 91 -170 66 -80 -80 283 -29 -51 67 111 -71 185 -33 230
6628B30l04o5j12J57O6qJ64k5J85k69k08J19J27m4J3k47l4J87N9K43n44L73l6
$$ 230 -74 -139 -251 -94 -28 -36 128 103 288 19 -189 -70 57 13 26 -221 -255 -68 -9 234 -310 63 27
6651B7n5R8m47L62O4p4K03l1k61J93m1J0k4J5q6k4K51k98K58k36P2j40K74k3l6
$$ 27 -28 70 -377 -15 49 -25 178 147 -114 79 38 48 24 39 -47 -71 180 -118 140 -96 -24 -164 110 87 51
6676E1Q6l25L57j13K4J33k33K32j32k72J07k58L46K17j83m6k1J97k61%K94j30
$$ 51 137 -188 169 56 80 213 -20 212 80 -192 -85 -343 3 220 37 -9 -30 167 -94 -94 200 70
6698G0j23k5nM9l7K2O8J33l69J97k2J66k54L35j11nlk61J24P6K1jm5j3r5QJ49
$$ 70 -53 -78 -83 -34 -71 -49 19 152 -217 -20 -42 124 -130 205 94 89 86 -175 -51 25 46 45 0 -13 -108 -100 49
6725D9k5R9k83j24J51J81p6rJ04j77J3n0K41J9Qj57O4k12J44J90k54J21r3K3K5
$$ 49 24 123 -160 -284 -133 48 -28 -37 67 -110 -97 -147 94 113 121 -36 28 -184 -40 150 -104 17 -76 -53 -28
6750b8R3j84j16J12K31l5l98M30k10Q0l4N9Q0l4k14N2N0R6J10Q1k22J16k09J74
$$ -28 65 -119 -235 -123 108 73 -325 105 -105 -25 -59 0 80 46 -168 -116 -66 30 140 221 -1 115 -94 80
6774H0j99K05j40J74k37J67L7j03k20K37j59J45K27j98J31l37L13l04K23J20k69
$$ 80 -119 86 -54 120 -117 50 87 -16 -236 1 -158 -13 214 16 147 -190 123 -181 42 162 -107
6795a07J30J03m31L09O1M7k92j4L74q2O2k9j89m4L16k22J55p5n3O6N6j5l26K7
$$ -107 23 126 -305 4 65 112 -180 -194 180 98 160 131 -58 -102 214 -8 147 72 19 85 141 126 -200 -173
6819a73L99l11J37l42J25J37J86l37K1J94j08K88l20K40Ok4j5k5j50K08j98J30
$$ -173 226 -85 52 -290 -165 -28 158 -179 -158 36 -72 216 -104 136 142 118 103 78 -72 136 -62 68
6841F8k74J82j57K65J39R3k90j0o9L30j96K54m82P1p7K94M2l00K6m4J47j65K50
$$ 68 -206 -24 -181 84 223 316 26 16 -53 277 81 335 -147 -76 -153 141 183 -117 -91 -135 12 -153 97
6864I7k28L5m3K82k52K86j77N0j17Q4l1J40j37j1K74j07M6j28K7r3J41j32k12
$$ 97 -131 -96 -139 143 -109 177 0 50 -67 17 -14 126 -11 -22 252 145 191 63 90 -3 138 6 -206
6887b06J13M45m60K67l12N5N8K0M0j49K63j60R2k00N2K57J07n15L94L8k29j27
$$ -206 -93 352 -108 159 -153 -98 -40 -20 20 -129 134 -26 66 -134 -82 175 282 -233 161 199 -30 -157
6909a57J17L2J0J29l91J72L9j28M82j63j29L8k79J25K08j52J50j24m2N4K42J05
$$ -157 -40 -8 2 131 -260 -88 -49 -177 305 142 13 51 -228 -103 105 -47 103 -21 -63 -9 233 338
6931C38k96R2j26Q1j6k39K81k82J76k82J30J44j27K13p1Q4M8l8n4j62R5J04j94
$$ 338 42 134 8 89 73 -166 115 -167 9 -273 -143 1 -126 87 16 100 148 110 56 -106 -11 93 -101
6954a01L19k45J32k17J57J15K40n88K78o2J62n1n7M9l5K28k99k1J8Mr2q7L46j44
$$ -101 218 -27 105 -112 45 160 400 -188 90 28 190 139 82 131 96 324 25 4 22 26 -66 -153 193 49
6978D9K91j86j74J46Q3j29l8o9l52L84j36N8j0n9J72Rj51J00j25J0J47K74k72
$$ 49 340 154 -20 126 209 80 42 -27 -379 5 -131 -73 -83 -142 30 39 -112 -12 -137 -127 20 294 22
7001B2K5M4j53J47j62J57j18jL1j20J37J51j77p1J5K02k61K77P0l25pK12j05q2
$$ 22 47 91 -62 85 -77 80 -38 -39 -8 -128 9 160 -17 -88 -73 129 -132 145 215 -110 -117 95 -10 -92
7025i2K2j47M66m88K30j44k0o6J52P9J11j73K39j40l08L79p9j30M0K74j76o3Q6
$$ -92 -70 -217 249 -239 -9 -153 -173 -239 -87 -8 103 -70 169 29 -279 100 21 -109 -69 205 29 -34 52
7048E2qm9J76k26K46l14L30l20j55J61J71k4k24K44J3l77J49nJ90K4N3K1l24m7
$$ 52 44 -5 171 -55 191 -123 207 -113 -268 -107 64 40 -184 60 73 -304 -155 -160 30 54 107 128 -196 -243
7072b43P6J73l2K15k69R1pq5j55J91r6J67n2J23j88MJ12l47L04mR2P9l00P4L28
$$ -243 -167 6 -26 189 -80 11 4 -81 -236 -45 -141 26 -26 97 -91 -87 25 -322 -18 -22 70 149 -151 -77 251
7097B51l68K40n9l5oM3kl35K14Jj32J66K31j79j58K05j22J41j56R0N2r6K44j79
$$ 251 -117 123 64 29 23 66 64 -271 -57 -56 -188 -22 209 30 -128 77 -45 96 -60 30 82 -14 230 51
7121E1J2j61J02nJ12k23J05O4n0k5j87J6L80q6k55k03L56O5l2j14L82m11K60n
$$ 51 63 -98 4 -1 111 -112 -7 57 7 -18 -205 -189 191 105 -150 -353 3 68 36 -78 304 -107 153 148
7145A48k57J68k29M16l80NJ02J00K2j22m4J61mj24q4J84l9j47K1M39m75j01K15
$$ 148 -109 59 -170 246 -134 -129 -27 73 95 -27 -71 90 86 -38 -122 62 23 -124 -103 336 -139 -240 -25
7168b5j39J68l93K49q5K22J45j07N7k85J76M3L5j09J90j62l5R8l11L19q7Q5j42
$$ -25 -164 4 -389 -140 -225 -3 142 35 92 -193 -17 26 61 -48 142 -20 -55 43 -268 51 -36 49 -93
7191i3PJ35k20J99j05J97j68J33k66K55J80l60L21n0j6m09K38K36R3m18M8K82
$$ -93 -86 49 -171 28 -77 120 -48 85 -181 74 254 -106 215 165 149 -260 -22 214 307 -111 -63 219
7213B19k89J81j45K34Ol33o2J30K9L09r9j12j06K5J11K28k46r0j94J88m2J80l82
$$ 219 -70 111 -34 200 206 -127 -189 -59 -30 279 180 68 -38 -13 98 326 80 -10 -204 -16 -58 122 -260
7236b60L43J32q0j35k84J35K12j30N9n9Q9r7k40L10j40J47J75j67J4k31K98J87
$$ -260 83 215 135 0 -284 -149 63 -67 -8 -67 22 -75 -315 -5 -145 2 177 10 24 -207 91 278
7258B78L8j05j17N2l31L43k27O4r3R3J8q7K0mj4J79j50r5J79k6J43p4J24k50L01
$$ 278 316 211 94 146 -185 158 -69 -5 -98 -5 13 -74 -54 -58 -72 107 -43 -138 41 15 158 84 208 -42 259
7283B59k24J79k18j07K26k94J54j23L03J54m71K44l08J36J51m0j38J21K67k08
$$ 259 35 214 -4 -111 115 -179 -25 -148 155 309 -162 82 -226 -90 61 21 -117 4 271 63
7303F3K62k63k3j3q2J13K16m29L1K13r1M6o8J32j27K39j09o5p0k14R0N4o5M9M6
$$ 63 325 62 39 26 -56 57 273 -156 -125 88 -3 43 -25 107 -20 219 110 45 -25 -239 -149 -95 -160 -111 -65
7328f5Lk32K59K66j81j92L41j72J62m6j38r7J65r8mN3j79J12p1j7J86k42K13q5
$$ -65 -62 -294 -35 231 50 -142 199 27 189 143 5 -92 73 -25 -29 24 -155 -43 -114 -131 55 -187 26 -59
7352e9j04K70j36J12m0qQJ19J7k54J20r3O8k35QL28k35J85k25J6K17L3k53k3K82
$$ -59 -163 107 -29 83 43 35 43 162 179 -75 45 -48 20 -215 -207 121 -114 71 -154 -138 79 112 -141 -164 118
7377A18k49oL04j04l1k40K19J29J87n01L21p1j36K62k40p1N3J87J02j16j91p7
$$ 118 -131 -137 167 63 32 -208 11 140 327 -174 147 76 -60 202 -38 -109 -56 131 233 117 -74 -151
7399a51J23n5j00M54j29j80j76J94j17j32L3L34j02K65k75rr1L16k63k8P1L51
$$ -151 -28 -83 -183 271 142 -38 -214 -20 -137 -269 -236 98 -4 261 -14 -23 -114 202 -61 -89 -18 333
7421C33l17j85k7J44J21K7j18j41K69k26L09J39k92k70K07Q4N3j95K11j69K18
$$ 333 16 -169 -196 -52 69 96 -22 -163 106 -120 189 328 36 -234 -27 57 110 -85 126 -43 175
7442A75m5l50N24j72K17k42k23L23k61j25N9K98l14L60k28r7Q1j3j94K21n6O9
$$ 175 130 -220 304 132 349 107 -116 207 -54 -179 -120 178 -136 224 -4 -101 -20 -33 -227 -6 -62 7
7464Gk62J1K74mP6j30j33K07J72r1k08K26j96K27k33J10j65K18q1J32J6k35Q4
$$ 7 -255 -244 30 26 102 -28 -161 46 218 127 -81 145 -51 176 -57 53 -112 106 25 157 173 -62 22
7487B2k46N49m80o5K74J5k23l7R7O4K7j11P4M6K33j13L9R4j80j92J54n3J82k22
$$ 22 -224 325 -155 -220 54 69 -154 -191 -94 -30 -3 -114 -40 6 239 126 165 259 79 -113 41 -12 170 -52
7511e2J16j37l39L87j65K94l13M52k28nP9j11j11M7r4K27p8Mj2J39l08J51q2R1
$$ -52 64 -73 -412 -25 -190 104 -209 243 15 10 89 -22 -133 -86 -180 47 -31 -27 -39 100 -208 -57 -139 -48
7535d8j51K73J4k96K10j02Q0J72k06qJ83k83J08R6M5l3l08K57J81n48N30r2K2
$$ -48 -199 74 88 -208 2 -100 -20 152 -54 -62 121 -162 -54 42 87 54 -254 3 184 -364 166 74 96
7558I6P1j51K62m00J73j17o2M54k02q1j6J53j6k53J88mj98j6n1J21J32J72k60
$$ 96 167 16 278 -122 51 -66 -128 326 124 43 27 180 164 -89 99 95 -103 -119 -170 -49 83 255 -5
7581el2K20q2P7l16K51j2m0k50o3O4R6k2K48j36J64kk52r3L84j65J91l78J53J33
$$ -5 -37 183 101 178 -138 113 101 61 -189 -252 -188 -92 -114 134 -2 162 160 -92 -185 199 34 225 -153 0 133
7606A33k13L9J32k40K08J2j22j7Q3J3r2K23n6j1j66Q7M24k46J83m32J30j8j03
$$ 133 -80 -41 91 -149 59 71 -51 -68 15 28 -64 159 103 92 -74 13 437 191 374 -58 72 54 -49
7629d9P4k78K30j69L10k64k38K58K39j05O4k3n6j05L5j48L5K14l6K1K2J65N7k66
$$ -49 25 -253 -23 -192 118 -146 -384 -126 113 8 72 49 -7 -112 -77 -225 -190 24 -12 9 31 196 253 -13
7653a3K22J43n65K33k87J35K08n6r8m4J20N5k82J77L35l51n7R3M5J43k54J02r2
$$ -13 209 352 -213 20 -267 -132 76 20 -78 -122 -2 53 -229 -52 283 -68 -125 -32 13 156 -98 4 -88
7676h8J01J0j52m0K88l24M4K18j68P9M3rr4R7L2J4k76J68K33j64PJ51r0l24J56
$$ -88 13 23 -129 -169 119 -205 -161 57 -111 -32 11 2 -92 5 37 51 -225 -57 176 12 19 170 80 -244 -88
7701h8qM8Q4k19L19Q2m12K77k87K84l50R3J04l6p5L73q1l20L16r7j45J09j14L66
$$ -88 -96 -48 36 -183 136 218 -194 83 -204 80 -270 -177 -73 -109 -184 189 108 -212 104 7 -138 -29 -143 223
7725B23l45P0m1K45j85J3P0R2j76K0j43q1K46J48k38M9o0j64K73j10L39m25J79
$$ 223 -122 -52 -93 152 -33 -20 50 142 -34 -14 -157 -238 8 156 -82 -33 -93 -257 16 -94 245 -180 -1
7748aJ64k41J82J2k56L69j83j00l1K5J40j11K5J47L6l30L09K7j44n2L8K30J22
$$ -1 163 -78 104 116 -140 229 46 -54 -85 -60 80 -31 -6 141 177 -153 156 183 39 -13 25 255 377
7771C77l75j0NJ25lJ34k11M0j21j03L86j81R7j64L0OM9k3m4j62J58K35l8j38J34
$$ 377 2 -8 -3 122 119 253 42 82 -39 -142 244 63 160 -4 26 32 81 58 14 -148 10 245 207 69 203
7796B03l01k7Kj3r2L48k54L07k50j30J80K20j63J18k96J83O0k6J84k53J20J43
$$ 203 -98 -125 -123 -136 -228 120 -134 173 -77 -207 -27 193 30 148 -148 35 95 69 253 0 120 263
7818B63k61J04J07k58Q9m2j04j73L63l2M6l03O7o2L86k67J41N4j32p6M2L30j08
$$ 263 2 106 213 -45 44 2 -102 -275 88 56 102 -201 -134 -196 190 -77 64 118 -14 -90 -48 282 174
7841A74k68o2K85m22K10N3J37J30j60j22p9rP1M0J40m6J93j14Qk9k17K46k55J6
$$ 174 -94 -156 129 -293 -83 -30 107 237 77 -45 -124 -133 -62 -22 118 72 265 151 159 130 -87 159 -96 -80
7865h0lP1o3n7Q9l9J79j70J1n6J59J24k31K4j8J59k3m4j46Q4K56j79O0l37M55
$$ -80 -83 -12 -75 -132 -43 -82 97 -73 -62 -118 41 165 -66 -42 -60 99 76 32 -114 -30 226 47 107 -230 225
7890B25k89P8j16J99j13M5k02K16O8qo1j69L9J52j28Q5Rj70p9J76OJ98l98N08
$$ 225 -64 14 -102 97 -16 29 -173 43 111 103 42 -127 -88 64 -64 21 30 -140 -219 -43 -37 161 -237 271
7914B71k90jL77l54j87K94j34J3J35j87K66j95J09K1J6k84K62j62P4J18k09%R6
$$ 271 -19 -20 357 3 -184 110 -24 -11 124 -63 203 8 117 138 154 -130 132 -30 44 162 -47 -47 49
7937D9k72N11n08k6L05K8k67K20j42J03L04n26J77K94k63k58J32J6K35R0j7k14
$$ 49 -223 288 -220 -246 59 87 -180 40 -102 1 305 -221 -44 250 -13 -271 -139 -123 112 202 185 -29
7959b9j15q1L53l6P9k47M5q2k5M09j17k57J70j53l9j0N2J17K4n5R7n3r2pJ04J26
$$ -29 -144 -225 128 92 171 -76 -31 -113 -138 271 154 -103 67 -86 -125 -135 -83 34 58 3 100 47 -45 -52 52 178
7985A78j32j37K91N0l49K35l40K27k34J08M2M3l4L4M2j60O5Q4J15L3j0l33M6K67
$$ 178 46 -91 200 250 -99 136 -204 23 -211 -103 -61 -18 -52 -18 24 -136 -71 13 128 161 151 -182 -136 131
8009A31j7Nk26k0L2Q3K7P6j23N0L3l1j09L54l31k13K33K1Q3Q2J13k45lm2m3K00
$$ 131 114 119 -107 -127 -95 -12 15 91 -32 18 51 20 -89 265 -66 -279 -46 -25 58 140 253 8 5 -37 -80 120
8035A20j87K15q4nk4j27J27j00rk0J00J4k72JL71pj12J23l47K25K17p0Oj05J32
$$ 120 -67 148 64 59 35 -92 35 -65 -74 -94 6 20 -252 -251 120 113 1 124 -223 2 219 149 155 50 182
8060A82l85J51p3P0M8Mj51R6O5K13j74Q7k23j32K52m41O35j42k02J18l0l9J89
$$ 182 -203 -52 -125 -55 -7 -3 -154 -58 7 220 46 133 -90 -222 30 -411 224 82 -120 -2 -32 -71 118
8083A18rR3k40L3J3J39k51R1J0j66K68m08K41J78j40J4j88J9L15r3l0O7J18m76
$$ 118 109 202 -38 -5 8 147 -104 -13 -3 -169 99 -309 -68 110 -30 -16 -204 -185 130 37 7 74 192 -284
8107b84M93j50j83k2j8oJ43J32k62k09L13J75O8p1k29J03J07k77l7L12o5q8r4
$$ -284 209 59 -124 -146 -164 -170 -27 105 -157 -366 -53 122 190 119 -110 -7 100 -177 -214 98 33 -55 -149
8130a49M9P2L42l79j92K15L0N9j35Mn3J06O0J11j33j00J26j4K35l35M7J8J14j31
$$ -149 -100 -28 314 -65 -257 -42 -12 47 -88 -84 -137 -31 29 140 7 -93 33 19 254 -81 -34 -16 98 -33
8154c3K4K51j34j47m6J21j72J13j19K3J68k20K33p3L45k54l9J75m6j96NP8j06
$$ -33 -9 242 108 -39 -85 36 -136 -23 -142 -119 49 -171 62 -11 334 80 41 216 170 -26 -21 57 -49
8177d9J77l9J41j05j77J3J37j92j9J56J30l10K3J65
$$ -49 128 89 230 125 -52 -39 98 -94 -113 43 173 -137 -114 51
8191E1
$$ Imaginary data points
##PAGE= N=2
##DATA TABLE= (X++(I..I)), XYDATA
0@%%%%%%%%%%%%%%%%Qj6J6j6J6k3L1l2L6m4M8n6O5p3Q7r9J09j22J39j58J79j99
$$ 0 0 0 0 0 0 0 0 0 0 0 0 0 0 0 0 0 8 -8 8 -8 8 -15 16 -16 20 -24 24 -32 33 -40 47 -52 57 -65 74 -84 95 -104
38a04K21k47K74l04L38l74M13m56N03n54O09o70P39q15Q98r91J095j215J352j507
$$ -104 117 -130 144 -160 178 -196 217 -239 264 -290 319 -351 388 -427 471 -520 575 -640 712 -795
58g95J690j907K169k495K911l461M220n343P170j0614J9195p6940j29305J71087
$$ -795 895 -1012 1157 -1338 1573 -1888 2332 -3011 4159 -6455 12740 -64200 -193505 -22418
72b2418o729m2955J63893M1035j07306K4618m4652j34038L2912P5492K52Q3944
$$ -22418 -29147 -72102 91791 132826 25520 50138 5486 -128552 -95640 -20148 -19896 64048
84F4048N4638o7146k7477k9352j04597K764R1151K4841K6801O1726j7235o9795
$$ 64048 118686 51540 24063 -5289 -109886 -107122 -15971 8870 35671 97397 80162 10367
96A0367m9002l7078q755M2847O1543M2320J1817j0008m5351p3859k7137K6737
$$ 10367 -38635 -75713 -84468 -41621 19922 62242 74059 64051 18700 -55159 -82296 -55559
108e5559J5227M4045P6833j52m2232j1621o2287o8908M7110N4100n93N3949M5228
$$ -55559 -40332 3713 80546 80394 38162 26541 -35746 -104654 -57544 -3444 -4037 49912 95140
121I5140n2967m6236k4726n2777Q729O9073K5904K1205L4903l1565n8771k4072
$$ 95140 42173 -4063 -28789 -81566 -72837 -3764 22140 43345 78248 46683 -12088 -36160
133c6160k7537n467N5721M7961J0541J5037q144n9344m7153j071Q310K3364N6389
$$ -36160 -63697 -69164 -13443 34518 45059 60096 51952 -7392 -54545 -55616 -47306 -23942 32447
146C2447L2403j7497j5053k4158o0301j9873L9523J9561K4630N5777o027n1454
$$ 32447 64850 47353 32300 8142 -52159 -72032 -32509 -12948 11682 67459 61432 9978
158I978j2040k8271m4961L6352N0339M17L2648K6819n5829l9723j94l3708M706
$$ 9978 -2062 -30333 -75294 -38942 11397 11814 44462 71281 15452 -24271 -24465 -58173 -53467
171e3467O6392K0847j271K4855k7857n9633p547j365q146M4681M5564l119l077
$$ -53467 12925 33772 32501 57356 29499 -30134 -37681 -39046 -47192 -2511 43053 39934 36857
184C6857r251m6654l0225R273J1611K1988M0505J6912j7339k1743k3942k9846
$$ 36857 27606 -19048 -49273 -40000 -28389 -6401 34104 51016 33677 11934 -12008 -41854
196d1854o143K6707K5956J9787K2627n844l7557k4427j1121j3607J9043M1522
$$ -41854 -47997 -21290 4666 24453 47080 41236 3679 -20748 -31869 -45476 -26433 15089
208A5089J4737N055N635l1400l9265l160Q4M900L8672K7181o370k211j4706m1007
$$ 15089 29826 34881 40516 9116 -30149 -33309 -33225 -28325 10347 37528 31158 28947 14241 -26766
222b6766j4621J4127Q476K2929L4096o98j8859j1371k6132k3388J1246K1817J5408
$$ -26766 -41387 -27260 -18784 4145 38241 37543 18684 7313 -18819 -42207 -30961 -9144 6264
235F264K4163J0070k0623k2307j4941j7843N75K6662K2217J1154Q855j0403k9170
$$ 6264 30427 40497 19874 -2433 -17374 -35217 -34642 -7980 14237 25391 34246 23843 -5327
248e327j8692m826m77J6929K9275J2997j731o902k2629k5629l200Q206J2182K4094
$$ -5327 -24019 -28845 -29322 -12393 16882 29879 28148 21246 -1383 -27012 -30212 -22006 -9824 14270
262A4270J8364n982j2858j4992k2755r075J3560J5288J6022J8425p88j9304j6166
$$ 14270 32634 26652 13794 -1198 -23953 -33028 -19468 -4180 11842 30267 29479 10175 -5991
275e991j4279j1553J0335K1875J4144J0250L046j6557k1695j0497n352N286K0648
$$ -5991 -20270 -31823 -21488 387 14531 24781 27827 11270 -10425 -20922 -26274 -20988 -340
288c40J8690O259j225j2129k1580j3391J6O986J6085J9238O958n799j0992j7339
$$ -340 18350 24609 23384 11255 -10325 -23716 -23700 -16714 -629 18609 25567 19768 8776 -8563
302h563j5495j02J1049J3971J6278Q563o545j4011j4595j2619j877J1839J5703
$$ -8563 -24058 -24160 -13111 860 17138 25701 19156 5145 -9450 -22069 -23946 -12107 3596
315C596J3014O651m487j5136j4561r680j227J0040J6464J2711M650n440j3530
$$ 3596 16610 23261 18774 3638 -10923 -20603 -21830 -11790 4674 17385 22035 16595 3065
328C065j4905q853Q78J0161J4743J1849M389o206j3508j3892q041J832J0267J4385
$$ 3065 -11840 -20693 -19815 -9654 5089 16938 21327 15121 1613 -12279 -20320 -18488 -8221 6164
342F164J0800K895o009j3411j3450o338K148J0111J3895J0383J525o598j2093
$$ 6164 16964 19859 13850 439 -13011 -19349 -17201 -7090 6805 17188 18713 12115 22
355B2j2894o276L624R793J2674J0086N72p870j0956j1309o596M328J1014J1004
$$ 22 -12872 -19148 -15524 -5731 6943 17029 17601 9731 -1225 -12534 -19130 -14802 -3788 7216
369G216Q580K165r062j2479q557m538K094J1830J1983N588J262o689j3980q816
$$ 7216 15796 17961 8899 -3580 -12137 -16675 -14581 -2751 9232 14820 16082 9393 -4587 -13403
383a3403j368K029J0094J3370M403j875m499j2159j1624L63M978O559J2974O803
$$ -13403 -14771 -12742 -2648 10722 15125 13250 8751 -3408 -15032 -14669 -9691 -3132 9842 16645
397A6645n030o180q171j1922q62Q315N740R821Q434m971q692o595r857k507Q798
$$ 16645 11615 5435 -2736 -14658 -15520 -7205 -1465 8356 16790 11819 3127 -3468 -13325 -15832 -7034
412g034P998P346O843l223r131p520p794j857P354Q371P438N970m284q818o645
$$ -7034 964 8310 15153 11930 2799 -4721 -12515 -14372 -7018 1353 8791 14761 10477 1659 -4986
427d986p804p90Q695O861O143O622m962r751m678o423l214J0437P943K695P189
$$ -4986 -12790 -13580 -4885 1976 8119 14741 9779 28 -4650 -11073 -14287 -3850 4093 6788 13977
442A3977k970j3030m054l004m706Q924J1398N70L850N14j3244p079Q27l724N546
$$ 13977 11007 -2023 -6077 -9081 -13787 -4863 6535 7105 10955 11469 -1775 -8854 -8027 -11751 -6205
457f205J3265K380j290J294r243j0174R81J071K121J0611O341k172k480o346r233
$$ -6205 7060 9440 8150 9444 201 -9973 -8992 -7921 -5800 4811 11152 8980 6500 154 -9079
472i079j659L657L764P207O619o59n105n637o338l912L027P589N067L710K004
$$ -9079 -10738 -7081 -3317 3890 10509 9850 4745 -892 -7230 -11142 -8115 -526 4541 8251 10255
487A0255n167q615k916k381J13P997O553J357K658m045j0733k613Q04j815P407
$$ 10255 5088 -3527 -6443 -8824 -8711 -714 5839 7196 9854 5809 -4924 -7537 -6733 -8548 -1141
502a141R395j181n07l64r831n184J884K79M852R734L02k392j220q346n469L308
$$ -1141 8254 7073 6566 6202 -3629 -8813 -6929 -6650 -1798 7936 8238 5846 4626 -3720 -9189 -5881
518e881L20L814R132Q51k536j126q184o244M446Q06L383R568m35m434R65o925
$$ -5881 -5561 -1747 7385 8236 5700 4574 -3610 -9854 -5408 -4602 -1219 8349 7914 3480 4445 -2480
534b480p906M815K610O96R893K027o976q72l642p923L642N224o28P092M020o240
$$ -2480 -10386 -5571 -2961 -2265 7628 9655 2679 1807 -1835 -9758 -6116 -892 -1520 5572 9592 3352
550C352k836k427p094J901O339J356M862L057m885l744k331m813P77M893K453
$$ 3352 516 -1911 -9005 -7104 -765 591 5453 8510 3625 -119 -2450 -7263 -6486 -1593 860
565H60N488K141o153k470k258n957K621O618j26L330M747n707m975l89m857l13
$$ 860 6348 8489 2336 -134 -2392 -8349 -5728 890 764 4094 8841 3134 -1841 -2230 -7087 -7400
581g400Q204K172M76M054m145o550K64k301j621N898N355o7J412j649n941l118
$$ -7400 804 2976 3452 7506 3361 -3189 -2925 -5226 -6847 -949 4406 4339 5751 4102 -1839 -4957
597d957j20M58L782M518J195j88j653m155l792p57J606L579L578K761j217l490
$$ -4957 -5077 -4619 -837 3681 4876 4688 3035 -1120 -4912 -5669 -4063 -484 3094 5855 4638 1148
613A148k162k977j918K384M213J793K494O15m574l436j126k168K038N392J488
$$ 1148 -1014 -3991 -5909 -3525 688 2481 4975 5590 1016 -2420 -3546 -5714 -3676 1716 3204
628C204O29J340l670m410o15j184N32N166L343l53K28k766m264j313M65O98L311
$$ 3204 3833 5173 1503 -2907 -3522 -4706 -4174 992 4335 3982 4210 1444 -2820 -4133 -3668 -2970 341
645C41L400P09p78k441l650j964k43K276L783J907N81j00l467l001m57j266J582
$$ 341 3741 4450 3672 1231 -2419 -4383 -4626 -2350 1433 3340 3921 3821 354 -2647 -3104 -4370 -2788
662b788M975J781p47R02l761m383Q17O32j74M387K601j627J88j450m914q17J959
$$ -2788 2187 3968 3221 4123 362 -4021 -3204 -2572 -2746 1641 4242 2615 2803 1353 -3561 -4378 -2419
679b419J37L485L637j314j942r63l066j961J848J583K193K376O32k413k184k432
$$ -2419 -2282 1203 4840 3526 1584 621 -2445 -4406 -2558 -975 1218 3594 4226 1813 -371 -2803
695b803j050J132K259K089J869q9j240k529k731l64J014J359L002K156j660j440
$$ -2803 -3853 -2721 -462 1627 3496 3407 2167 -362 -3093 -3457 -2443 -1084 1918 4074 2414 974
711I74p96l245q59K657P05J619L201j049l125j23k796j461L273J631j41K872K80
$$ 974 178 -3067 -3926 -1269 -564 1055 4256 3207 82 -41 -2837 -4298 -1025 606 465 3337 3617
728C617l819j038J30l336K146L922M7O65J636l407k940J027j045m07L849J577
$$ 3617 -202 -1240 -1110 -4446 -2300 1622 1669 2334 3970 563 -2377 -1350 -2395 -2802 1047 2624
744B624q01J169j295l664q50R41j61K066L118o53j105o5k799j529J001O77J270
$$ 2624 1823 2992 1697 -1967 -2817 -1876 -2037 29 3147 2494 1389 1324 -1475 -3004 -2003 -1326 -56
761e6K775J61j628q71j614j610M39J616J358J413O89p31j833j472r76m2J564J829
$$ -56 2719 2880 1252 381 -1233 -2843 -2404 -788 570 1983 2672 1941 108 -1364 -2340 -2382 -818 1011
779A011O75R58o40j811j965k98J14J048J745J372J29j072j338j547q27P79J161
$$ 1011 1686 2644 2004 193 -1772 -2070 -1956 -908 837 2209 2338 1266 -72 -1619 -2446 -1667 -506
796e06J153J194O20j146j638j133q35K59J528J768N21L96p27k035j175l66K86
$$ -506 647 1841 2461 1315 -323 -1456 -2291 -2032 -504 1264 1785 2181 1454 -581 -1756 -2122 -1836
813a836J155K019L82N7m79j836j511L3N97J007J905P49o77k25j745j579o7J045
$$ -1836 -681 1338 1720 1777 1298 -538 -2049 -2016 -1419 -412 1493 2242 1565 1340 -405 -1984 -2051 -1006
831a006R37J032J124l46j245r84q26n72R06Q54J261P39j68j342j029p69k35P50
$$ -1006 -69 963 2087 1741 496 -488 -1314 -1886 -980 -126 1135 1874 1706 364 -665 -1434 -1669 -919
849i19J027R32P22n8j106j480n70l40J175N51J092P11n45r07j002q71j9O36J128
$$ -919 108 1040 1762 1704 598 -882 -1452 -1792 -617 -66 1026 1737 1192 285 -717 -1588 -1607 -971 157
868A57J170L4K32j427r46q82J84Q29J165Q35K25m42r65j174n00p4J209N07J331
$$ 157 1327 1361 1593 166 -780 -1662 -1478 -649 516 1351 1576 1134 169 -1005 -1505 -1579 -370 137 1468
887A468K04r36n95q00q10O0J025Q26Q03N03j021j228k47o04k3J130J273l29N25
$$ 1468 1672 736 141 -659 -1469 -1409 -384 442 1245 1748 727 -501 -748 -1352 -1375 -245 1028 699 1224
906A224rj652q60M55m63N75J910j45m11N09j304j384M76N83k17J652P01r81lm54
$$ 1224 1215 -437 -1297 -842 -1305 -730 1180 1035 624 1133 -171 -1555 -1079 -496 -713 939 1640 659 656 202
926B02j318k26P35J57P96J104k06j352m4p97r03J033R38M65N51J56r58q20m6j04
$$ 202 -1116 -1342 -607 -450 346 1450 1244 -108 -152 -949 -1852 -819 119 584 1135 1291 333 -487 -533 -637
946f37o26J173J114m93M73m50j133o21P32P4L9J609o6n58k35m39j395N89P79K
$$ -637 -1263 -90 1024 531 1004 554 -579 -1200 -468 -394 -355 1254 1188 630 395 -44 -1439 -850 -71 -69
966f9N91J032j061p26K22r91n58J532M87N9P56j13j750j00J82q41N43J548m4k12
$$ -69 522 1554 493 -233 -11 -1002 -1560 -28 459 518 1274 1161 -589 -689 -507 -1348 -805 743 699 487
986D87O93n26j900N60p3m18J602R95q88l49M37j574l61J257j1m40J704j11j355
$$ 487 1180 654 -1246 -686 -759 -1177 425 1420 532 183 620 -954 -1315 -58 -69 -509 1195 1084 -271
1005b71O12n16j360R61J099n80R46O27j495j96K59j214J24J232K83l07Q76n38
$$ -271 341 -175 -1535 -574 525 -55 891 1518 23 -173 86 -1128 -1004 228 511 204 1080 542
1023E42j213J45J35n98Q19Q79J44l5k38r29o74L00M51J19M07Q24n48n38J18o30
$$ 542 -671 -526 -391 -989 -170 709 853 818 580 -349 -1023 -723 -272 -153 254 1078 530 -8 110 -520
1043e20p06Q11M68J36M68K40j030m07O37q22K5J507n64k59J148m72j802O16L8
$$ -520 -1226 -415 53 189 657 897 -133 -540 97 -725 -700 807 243 -16 1132 660 -1142 -526 -488
1062d88k54R03P45o82N6L01j260J60L54l88P4J632m50n64J09m19p50Q09K71o02
$$ -488 -742 161 906 224 280 581 -679 -519 -165 -553 -479 1153 703 139 248 -171 -921 -112 159 -443
1082d43J057j85j22j44l44p01J91P17L04N2J99m06l70l70J84K0j77Q71M92j97
$$ -443 614 429 307 163 -181 -882 -691 26 330 382 581 175 -195 -565 -381 -361 -538 333 825 628
1102F28j58l65p10k76N48L37j28R38k45q43L83l98p13N98O04q2L92O17j025q81
$$ 628 470 105 -605 -881 -333 4 -124 814 569 -274 109 -289 -1002 -404 200 118 510 1127 102 -779
1122g79R05o50k70J185j17k59N65L35j467J44L57q09N90J268p89m13J024j109
$$ -779 126 -524 -794 391 274 15 580 915 -552 -408 -51 -860 -270 998 209 -204 820 -289
1140b89l37P09m15j46J139K70j033O69k86r61J27R22o56P9J108r60j99P19q86
$$ -289 -626 83 -332 -478 661 931 -102 567 281 -680 -553 369 -287 -208 900 -60 -259 460 -426
1159d26n50J117L87o53P22j96j062P19J80j151M99Q63k66J54M88q10m81N92n61
$$ -426 -976 141 528 -125 597 401 -661 58 238 -913 -414 449 183 337 825 15 -466 126 -435
1178d35j87Q43K53k73L54j49p93j74K92k5L56K49j00R5jn47k27J22L15O6K15K0
$$ -435 -622 221 474 201 555 406 -387 -561 -269 -294 62 311 211 306 305 -242 -469 -347 -32 34 249 269
1200B69J64o73J43k28j03M06R9M28m42K22k50k68J57l15K26L70L02j98m32J61
$$ 269 433 -240 -97 -325 -428 -22 77 505 63 285 35 -233 -76 -391 -165 205 507 309 -123 38
1220C8j96k08O03k20j73P04r3n08K22m06k12O2M31j07L13N6j85n6%l61j39P02
$$ 38 -158 -366 237 17 -156 548 455 -53 169 -237 -449 -387 44 -63 250 306 121 65 65 -296 -435 267
1242B67l91n1O42l21k43J30k67J04j53K47K55q3r2j71j50j20K26J01L08j26l1
$$ 267 -124 -175 467 146 -97 33 -234 -130 -283 -36 219 136 44 -127 -277 -397 -171 -70 238 112 81
1263H1l08J52K04l00l84M25L45j89K23k7k85l2k13K64J21m9J46N7j14k95J56k04
$$ 81 -227 -75 129 -171 -555 -130 215 26 249 222 -63 -95 -308 -44 77 28 174 231 117 -178 -22 -226
1285b26J20QJ23P0J2J02l70n8%j57J78P17j32l94q2O9l47L94J53j48K89j18l12
$$ -226 -106 -98 25 95 107 209 -161 -219 -219 -376 -198 519 387 -7 -89 -20 -367 27 180 32 321 203 -109
1308a09%k30N3J61R1J04QJ16P7l20m0m8K59l26L40j53K17K4r9k76J84j58r9K64
$$ -109 -109 -339 -286 -125 -34 70 78 194 271 -49 -89 -137 122 -204 136 -17 200 224 125 -151 33 -125 -224 40
1332D0J75k6J27k92q7JJ57R4j56K66P0o00L19m36J02J51o5M00K12l08l89K86j56
$$ 40 215 189 316 24 -63 -62 95 189 33 299 369 -231 88 -348 -246 -95 -160 240 452 144 -245 41 -115
1355a15m4J04J74n3rj08K60k66k2j46j1L20O1O3m1k69L55m53N2n8K71M8J4J42
$$ -115 -159 -55 119 66 57 -51 209 -57 -79 -225 -236 84 145 208 167 -102 253 -200 -148 -206 65 113 127 269
1379B69l13l8Q7k36J37K13J45l27K05k37R4O7j06l66N07lJ29k51P8Ol54J26L5
$$ 269 -44 -82 5 -231 -94 119 264 -63 142 -95 -1 66 -40 -406 101 98 227 -24 54 60 -294 -168 -133
1402a33J4K52K03j91k61Q5k26J98J8o4L20M4j30k92Q0J89l20K66j63M81l02J69
$$ -133 -119 133 336 145 -116 -31 -257 -59 -41 -105 215 259 129 -163 -83 106 -214 52 -111 370 68 237
1424B37l75L9P9L38k06n1J84k59J38j49J6l07M04k21N26l29j54K43k62o4j08J10
$$ 237 -138 -99 -20 318 112 61 245 -14 124 -25 -9 -316 88 -133 393 64 -90 153 -109 -173 -281 -171
1446a71K75r2J43o0k2k09j44K27k56K79k9K38k07L76m17k61N72p73M96N4J8J99
$$ -171 104 12 155 95 73 -136 -280 -53 -309 -30 -59 179 -28 348 -69 -330 242 -531 -35 19 37 236
1468B36q0k93Q2l9l1L07r2P5j03mJ1l65R0M61m41J55J39j28N2j22j51L18k74m
$$ 236 156 -137 -55 -94 -125 182 90 165 62 58 69 -296 -206 255 -186 -31 108 -20 32 -90 -241 77 -197 -201
1492b01M81j56j42Kj4k43j0K86k47jL46O8l25L66m05n9K66m1j47M76r9l67L41
$$ -201 280 124 -18 -16 -30 -273 -283 3 -244 -245 101 169 -156 210 -195 -254 12 -29 -176 300 201 -166 175
1515A75k69j17K01Q1o4j7J38m16L86j93K59k75k4M73m15K96l51j67K49l1Q3%J63
$$ 175 -94 -211 -10 71 7 -10 128 -288 98 -95 164 -111 -135 338 -77 219 -132 -299 -50 -81 2 2 165
1538A65l19K07R6l13j44J09Q6K92M7k30k05K39Q6l35L36j8k69M6L58k49k15K49
$$ 165 -154 53 149 -164 -308 -199 -113 179 226 -4 -209 30 116 -219 117 99 -170 -124 234 -15 -230 19
1560A9p8ML42m61J96K86l63j7M6J06l12L96k7k66R3J67m25K35M7j41rM86k67m63
$$ 19 -59 -55 287 -174 22 308 -55 -72 -26 80 -232 164 137 -129 -36 131 -294 -59 -12 -153 -162 324 57 -406
1584d06P39o34M25Q8l36N3J69j46m3L02l31K05J07l4k31L08j96R7k24K79j13k89
$$ -406 333 -301 124 212 -124 -71 98 -48 -91 211 -120 85 192 158 -73 235 39 136 -88 191 78 -211
1606b11L82j33J09J37l83j07K81m1j35L08j01J09j02j44k37J72J47l62K8L63r0
$$ -211 171 38 147 284 -99 -206 75 34 -101 207 106 215 113 -31 -268 -96 51 -311 -283 80 -10
1627a0O2Q1k25j82Q1K33l0M6P9K0K0R7k1l18R3j64j98L07n6M5m5K25k36J19n4
$$ -10 52 133 -92 -274 -193 40 10 56 135 155 175 272 251 -67 26 -138 -336 -29 -85 -40 -85 140 -96 23 -31
1652c1J54J4j05k0r9K19l58J24r8K58k78O8L42k24k38J21J38l44K72O0J3Q4l43
$$ -31 123 137 32 12 -87 132 -226 -102 -200 58 -220 -152 190 -34 -272 -151 -13 -357 -85 -25 -12 72 -271
1675b71K03Q3K13m85K87OM8j38J46p8j89L17o6K09k66Pk00J46R2k35j94L01K16
$$ -271 -68 15 228 -257 30 36 84 -54 92 14 -175 142 76 285 19 26 -174 -28 64 -171 -365 -64 152
1698A52j22j5Oj1J45j66j5M9N2k2j04R6K9j9k17Q2n5J75l8J90j13q1M6o4q2r0
$$ 152 30 15 21 10 155 -11 -26 23 75 53 -51 45 74 55 -162 -80 -135 40 2 192 79 -2 44 -20 -102 -192
1724a92K17jJ6m4o1k32K94Q0j08o4n1J05J35n0j33K30k57J57n1k42Q6k03N49j42
$$ -192 25 24 40 -4 -65 -297 -3 77 -31 -95 -146 -41 94 44 -89 141 -116 41 -10 -252 -166 -369 180 38
1748C8L35l26k69N2J91o1J3K1k65J55J40p2No2J52k42J52J47l5K5j8L9J64r6j45
$$ 38 373 47 -222 -170 21 -40 -27 -6 -271 -116 24 -48 -43 -105 47 -195 -43 104 69 94 76 115 279 183 38
1773C8n9p6K40k95Q2j7j31J18L0J50k06K72j70l03M78l3k29m0n7J91n8R0l9K6
$$ 38 -21 -97 143 -152 -70 -87 -218 -100 -70 80 -126 146 -24 -327 151 118 -111 -151 -208 -17 -75 15 -24 2
1797Bk65M97j74O1O3K6l30P6n5k1J59n9K2o5N1P6L6j07J92k45j83j55K36k04L77
$$ 2 -263 234 60 121 184 210 -120 -44 -99 -120 39 -20 2 -63 -12 64 100 -7 185 -60 -243 -398 -162 -366 11
1822A1N0R8j61J53l85L10k35r0L41l14J9K48J42k22M3k5N6N5k94L39P7q4k47o5
$$ 11 61 159 -2 151 -234 76 -159 -249 92 -222 -203 45 187 -35 8 -17 39 94 -200 139 216 132 -115 -180
1846a80O6L24m2R2j06l83L04j78K81l86K97R1j6j63J8j45M04n7l45J26m4j0O5
$$ -180 -114 210 168 260 154 -229 75 -103 178 -208 89 180 164 1 19 -126 278 221 -124 2 -42 -52 13
1869A3Q2j27q3L6O7r9L05K6l03J44k36K29L13m30K9J48j02kj66K79j15K02k04
$$ 13 95 -32 -115 -79 -12 -111 194 220 -83 61 -175 54 367 -63 -34 114 12 10 -156 123 8 210 6
1892Fn6O4q2M0M6L3j14J35j55R6o3K27j43k77J70j13J18l9o2K71N7l06O5J89j03
$$ 6 -50 14 -68 -28 18 51 -63 72 -83 13 -50 177 34 -243 -73 -186 -68 -107 -169 102 159 -147 -82 107 4
1917Dk47J39J06N5L0l08K34k42L6J6Q9L13p1j7j86J70k64Q2k05J67N2J51j1o5
$$ 4 -243 -104 2 57 87 -221 13 -229 -193 -177 -88 225 154 137 -49 121 -143 -61 -266 -99 -47 104 93 28
1941B8J96o9k04k36K36o0J3K43k36j65L29Q7k97K9O7Q4m0j77K29j70J76r7PK9
$$ 28 224 155 -49 -285 -49 -109 -96 147 -89 -254 75 162 -135 -106 -39 45 5 -172 57 -113 63 -34 -27 2
1965BR6o2K14k85k11O8K09k30M08j17m8j50K20o3J3k9n2M5k18m0L04%j9r4LJ72
$$ 2 98 36 250 -35 -246 -178 31 -199 209 92 44 -106 114 51 64 35 -17 28 -190 -230 74 74 55 -39 -36 136
1991A36j2P4k17k7l5j28L75j23J79m38J40K09j21k44L41l02N5J70N7j35R5n0J22
$$ 136 124 198 -19 -46 -81 -209 166 43 222 -216 -76 133 12 -232 109 -193 -138 32 89 -46 49 -1 121
2014A21n3k32J58j64M5J04J90k20l2J01J13j82K2n4Qn3J46j24N3K23j89M5J41
$$ 121 68 -164 -6 -170 -125 -21 169 -51 -83 18 131 -51 -29 -83 -75 -128 18 -106 -53 170 -19 26 167
2037A67n25K66K0J60j23K05j75K51k01k96M80k88r3L1j56J76L8P6k26J92j38J27
$$ 167 -358 -92 -72 88 -35 170 -5 246 45 -251 229 -59 -152 -121 -277 -101 -63 13 -213 -21 -159 -32
2059c2Kmj80M05j41k26L61q6j55K35k04j12J80Jj22j17K24j32M37j37k46r7J15
$$ -32 -30 -34 -214 191 50 -176 185 99 -56 179 -25 -137 43 44 -78 -195 29 -103 334 197 -49 -146 -31
2082c1PJ18L5o2j33J14K10l20K04l9l15J79p3j9O0J8pR8R2j12j1Q5J97k68O1j71
$$ -31 -24 94 129 67 -66 48 258 -62 142 103 -212 -33 -106 -125 -65 -47 -54 44 136 24 13 98 295 27 88 -83
2108h3p0K22r9L15l83R7O8k62J4O3J44K1L1l00J12j8l3J29L6j4j97l6K56K9q7
$$ -83 -153 69 -30 285 -98 -1 67 -195 -181 -118 26 47 78 -222 -110 -128 -161 -32 4 -10 -207 -243 13 42 -45
2133d5L95j55k58j08Q8J90N1k74K86m03J20k0J21M1m9m4P2N6J97k30l15L05j85
$$ -45 350 195 -63 -171 -83 107 158 -116 170 -233 -113 -133 -12 29 -20 -64 8 64 261 31 -284 21 -164
2156a64O3O9L38l46P1q7J90k20K01j65o8K30j45J14j77kjK81m21J30K87k29J18
$$ -164 -101 -32 306 -40 31 -56 134 -86 115 -50 -118 112 -33 81 -96 -98 -99 182 -239 -109 178 -51 67
2179F7k29J70kj27O0mK05j01j30K49j73J22k39K55j11P2Q9j98k6k05K71J3r9J37
$$ 67 -162 8 6 -121 -61 -65 140 39 -91 158 -15 107 -132 123 12 84 173 -25 -51 -256 15 28 -71 66
2203F6j53J35oJ74l16K77N0n6m36K26j18K66l4m7J5K4n4L6k1J12J1r2l93N09j60
$$ 66 -87 48 42 216 -100 177 227 171 -265 -39 -157 109 75 28 43 67 13 49 28 140 151 59 -334 175 15
2228A5j48K22k43j23K98j84K72j60J39N7K28l01k85L60k06J61Oj29o9j93M42k2
$$ 15 -133 89 -154 -277 21 -163 109 -51 88 145 373 72 -213 147 -59 102 108 -21 -90 -283 159 137
2250A37l58q7L78m3j1m2K0l20L14k17J82J3nJ6j23K57Q2j22%p1k42L9J05j9R8
$$ 137 -221 -308 70 27 16 -26 -6 -326 -12 -229 -47 -34 -39 -23 -146 111 193 71 71 0 -242 -203 -98 -117 -19
2275a9l8J14j02j44J49j7K82j42k45L08n15L45M9o2j70LM45k20k3j61L82j67R4
$$ -19 -57 57 -45 -189 -40 -57 225 83 -162 146 -369 -24 25 -37 -207 -204 241 21 -2 -163 219 52 146
2298A46j83k1J90n8N7k24J74J23j99j24l8O5J43J4M6j26r8L68j86Q3l09J30PJ97
$$ 146 -37 -58 132 74 131 -93 81 204 5 -119 -157 -92 51 65 111 -15 -113 255 69 152 -157 -27 -20 177
2322A77j63N0p7J03M6j45j68K99N2k47P2l2l3l61N50j53N2O5J97m56K09j51J14
$$ 177 14 64 -13 90 136 -9 -177 122 174 -73 -1 -33 -66 -427 123 -30 22 87 284 -172 37 -114 0
2345@K36j96J36j61J40j86j55J64r7J57K06n21J59L8o7N5J27P1o6M9j67p3J74
$$ 0 236 40 176 15 155 -31 -186 -22 -119 38 244 -277 -118 -80 -147 -92 35 106 40 89 -78 -151 23
2368B3K58m66kK41Ol14K55q3L18k97J85r9k37K30PR9J22k56j21K59l16K27l05
$$ 23 281 -185 -187 54 60 -254 1 -82 236 -61 124 25 -212 18 25 124 246 -10 -131 128 -188 39 -266
2391b66M09J09j44j72J9J37J09m20O2L35j75M5Q6l34M4L76j49O0J36l35n1M2k9
$$ -266 143 252 108 -64 -45 92 201 -219 -157 178 3 48 134 -200 -156 220 71 131 267 -68 -119 -77 -106
2414a06N1J46l71L24M7k30J18N5j02k3n0N8N2j43j1J25O4m0K48j13K4j45J02k09
$$ -106 -55 91 -280 44 91 -139 -21 34 -68 -91 -141 -83 -31 -174 -185 -60 4 -36 212 99 123 -22 80 -129
2438a29N4J66j06J51j35p5j74K38J02k73K77k47J17n6O4J37k59J82k01J51P3j72
$$ -129 -75 91 -15 136 1 -74 -248 -10 92 -181 96 -151 -34 -90 -26 111 -148 34 -167 -16 57 -115
2460a15Q7nn7J85K4r3k88J15M0K9n0J28L0J5j99K59k01J11J49l39Q4L09l39L60
$$ -115 -28 -33 -90 95 119 26 -262 -147 -107 -78 -128 0 30 45 -154 105 -96 15 164 -175 -91 218 -121 239
2484B39k18j76K3J45q6L78j31k28K00p6j69P3J99l5j78J16LJ24j13k3j84J09K3
$$ 239 21 -155 -132 13 -73 305 174 -54 146 70 -99 -26 173 138 -40 76 79 203 90 67 -117 -8 15
2507A5j96L06N4%n73M04P4j87L4K7L28jl35L86l62J38l74J34L21j89J08Pk64N5
$$ 15 -181 125 179 179 -394 10 84 -103 -69 -42 286 285 -50 336 -26 112 -262 -128 193 4 112 119 -145 -90
2531i0k36L05mO8j47n2K30j81Pj55K11QMk53K80q9K50r0k3k50J70K18k79P8K1
$$ -90 -326 -21 -25 43 -104 -156 74 -107 -100 -255 -44 -36 -32 -285 -5 -94 156 66 43 -207 -37 181 -98 -20 1
2556Ap3O9K0L02m08pL1K57l55J68n3k99L38j66J87l7k1J53N1j67L2r7J52Ol1j07
$$ 1 -72 -3 17 319 -89 -96 -65 192 -163 5 -48 -347 -9 -175 12 -25 -46 107 158 -9 23 -74 78 84 53 -54
2582e4J40j88L65m58L40k69J39p4j67L20l40L51m2j18j12L34k57J6K58k59J24
$$ -54 86 -102 263 -195 145 -124 15 -59 -226 94 -246 105 63 -55 -167 167 -90 -74 184 -75 49
2603D9L3rO4j46j53K13m8m6j13J00K20k89N1J88j9j03p1p9K11l82K49J7O0j07
$$ 49 82 73 137 -9 -162 51 3 -43 -156 -56 164 -125 -74 114 95 -8 -79 -158 53 -329 -80 -63 -3 -110
2627a10q8J80p2j62K78l31K28n1L63k86q7K58l04j2Q8j82L21K58j76Jl67K12j63
$$ -110 -198 -18 -90 -252 26 -305 -77 -128 235 -51 -138 120 -184 -196 -108 -290 31 289 113 114 -253 -41 -204
2650b04K50j01k56N38l16K55j93j25J68J06M6j85O0%J60k88J41k50L40l99M5J36
$$ -204 46 -55 -311 227 -89 166 -27 -152 16 122 168 -17 43 43 203 -85 56 -194 146 -253 -208 -72
2672g2p1J32l6K68j96m7j53J55J21j08J09L8k66L13l10K38j82J00J5k13J38J70
$$ -72 -143 -11 -47 221 25 -22 -175 -20 101 -7 102 140 -126 187 -123 115 -67 33 48 -165 -27 143
2694A43J30m35R8K73p3m2l47j5J20J42n5l1L44q5k44M3K75n28M95j10o8k8k4J82
$$ 143 273 -162 -64 209 136 94 -253 -268 -148 -6 -61 -92 252 167 -77 -34 241 -287 208 98 30 2 -22 160
2718A60k55M8J01k1L44k42j65J00K57l45pN6pr7J88J84m62jQ3jq5L58j31K0q0
$$ 160 -95 -47 54 33 377 135 -30 70 327 -18 -25 31 24 -73 115 299 -163 -164 -81 -82 -167 191 60 80 0
2743@O2k09L33m52K68J60J17j39j73Q3o7Q7J91j44j55j03L42l11r5Q1L3J74k17
$$ 0 62 -147 186 -266 2 162 279 140 -33 50 -17 70 261 117 -38 -141 201 -110 -205 -124 -91 83 -134
2766a34L7K34k63R9P0m64K34J80Q2N8j86O4M3J78l98J24L5o0R1j29J03l53M83
$$ -134 -97 137 -126 -27 43 -421 -187 -7 75 133 -53 11 54 232 -166 -42 -7 -67 24 -105 -2 -355 128
2789A28j33q4J30k95M16l63J93J44o6j1Lk6m9j24p2J23J81kJ22k28NOpl9K7K4
$$ 128 -5 -89 41 -254 162 -201 -8 136 70 59 62 36 -13 -137 -209 -86 95 93 215 -13 -8 -2 -9 -48 -21 3
2815CJ33j24n8K00m4K44m82K25P0j49j30k6K45k19J86j6j39J7K04n8k04J01M3
$$ 3 136 12 -46 154 110 354 -128 97 167 18 -112 -138 107 -112 74 58 -81 -64 140 82 -122 -21 22
2838B2l9K15j18j70j75K98k91M66k20M5q8J49k15K20J03n22M16j15j15J68M2j91
$$ 22 -17 198 80 -90 -265 33 -258 208 -12 33 -55 94 -121 99 202 -320 96 -19 -134 34 76 -115
2860a15L4J45k19K78k00J04q4m7J67j7k44L47N2k09j38O9K00j30j5L50l89o0J18
$$ -115 -81 64 -155 123 -77 27 -57 -104 63 46 -198 149 201 -8 -146 -77 123 -7 -22 328 -61 -121 -3
2883ck20K35l0R5k1M4k4j6j25n1K20l5K8j95k8j42L98l89K82J35l76K08L0k71
$$ -3 -223 12 -18 77 56 100 76 60 -65 -116 104 69 97 -98 -126 -268 130 -259 23 158 -218 -10 20 -251
2907b51K59m4J1J68k39p2L30k74J78L1j19O8j22j5j1j10L18j14l69K82j35M33
$$ -251 8 -36 -25 143 -96 -168 162 -112 66 97 -22 46 -76 -91 -102 -212 106 -8 -377 -95 -230 203
2929B03j10o9mj19r6K42k23P1mJ40J75k81N8J80k04j73J86J90j2j16j3j11j39
$$ 203 93 24 20 -99 -195 47 -176 -105 -109 31 206 -75 -17 163 -41 -214 -28 162 150 34 21 -90 -229
2952b29J34J30mq7K43j06j32J00j56R3J38J03k59K6J64j8k9j28k16J05j92L71
$$ -229 -95 35 31 -56 187 81 -51 49 -107 -14 124 227 -32 -6 158 140 111 -17 -233 -128 -320 51
2974E1Q9j93J76j38M8J43j43p2j43J98K59m02L40l80J41p4J62q5j14M16l64J76
$$ 51 140 -53 123 -15 33 176 33 -39 -182 16 275 -127 213 -167 -26 -100 62 -23 -137 279 -85 91
2996I1k96N5J86n2N4j77m9n4M34l23J98m67M41j26o9J37K4j18K47O2j38j49J0
$$ 91 -205 -150 36 -16 38 -139 -188 -242 192 -131 67 -400 41 -85 -154 -17 7 -111 136 198 60 -89 -79
3019g9J71Mj52J18K9j38OK60k35n4O7r9n2J43R6k44kK91q5n0J27r3r6J19l05L72
$$ -79 92 96 -56 62 91 -47 -41 219 -16 -70 -3 -102 -154 -11 85 -159 -161 130 45 -5 122 29 -67 52 -253 119
3045A19rJ57k26j12K97l44Q0j4K7K3p9L17k77J64j95j72L39k83K94k97L7L00q8
$$ 119 110 267 41 -71 226 -118 -38 -52 -25 -2 -81 236 -41 123 -72 -244 95 -188 106 -191 -154 146 58
3068E8n3q6L3L3j3K0n0J59q6j15L17k67L62l76J34l9j60R4M2j87K53q4m0pJ04
$$ 58 5 -81 -48 -15 -28 -8 -58 101 15 -100 217 -50 312 -64 70 31 -129 -35 7 -180 73 -11 -51 -58 46
3093D6k62J59J34l3Q4jJ1l31K78m1o4j1K65k97J81j38R3l59L33Q6m18J81J81j14
$$ 46 -216 -57 77 44 128 127 138 -193 85 44 -20 -31 234 -63 118 -20 73 -286 47 133 -285 -104 77 -37
3117c7J10jj30J76o4k73J30l0J56o8N7j43J43o1l18M53j90P0J42p0o6J02j94j38
$$ -37 73 72 -58 118 54 -219 -89 -119 37 -31 26 -117 26 -35 -353 100 -90 -20 122 52 -14 88 -106 -244
3141b44K3L32r7l9j38J53J8j08J64k31K60k35L98%k65j38%J79O6R3m09J55J78
$$ -244 -221 111 14 -25 -163 -10 8 -100 64 -167 93 -142 256 256 -9 -147 -147 32 98 191 -218 -63 115
3164A15j52j1J66J43k33j96J88R5q9o6Q2j25J44J1j52O3q1J61j86q8J93N9j65
$$ 115 -37 -48 118 261 28 -168 20 115 26 -40 42 -83 61 72 -80 -17 -98 63 -123 -211 -18 41 -124
3187a24J35m5N3J87l93K17k95L20J05k37J63j4J7j87k37L38P6L5j33L02j99j40
$$ -124 11 -34 19 206 -187 30 -265 55 160 -77 86 72 89 -98 -335 3 79 114 -19 283 84 -56
3209e6j22J32Q1Lr3K42l78K08R1J06p4k02om0Q4K5j69k30N55j47j26j32K56l54
$$ -56 -178 -46 35 38 -55 187 -191 17 108 214 140 -62 -68 -108 -24 1 -168 -398 157 10 -116 -248 8 -346
3233c46N24j21n4Kq6L2J58j02J78k16J75l55M7K53k28l1J04K70j19l7j48J11l7
$$ -346 178 57 3 5 -81 -49 109 7 185 -31 144 -211 -164 89 -139 -170 -66 204 85 48 -100 11 -26
3256b6J59j81J94L8k3l30K41jR3j50J45j80K02N7l81J14r3L3K33m1k30P1j01J73
$$ -26 133 -48 146 184 161 -169 72 71 164 14 159 -21 181 238 -143 -29 -122 -89 144 103 -127 -56 -157 16
3280A6l01J50J05J79k03j4J25m1J35k7n0j52J57k85J2J1j23M97k17J25Qj40j5
$$ 16 -285 -135 -30 149 -54 -68 57 16 151 124 74 -78 79 -206 -194 -183 -306 191 -26 99 107 -33 -48
3303d8J57k79K40N4l11Q9J8k13N3K54L3o5N9j1O7k32J88j03j83K33M4j40J17J4
$$ -48 109 -170 70 124 -187 -98 -80 -293 -240 14 47 -18 41 30 97 -135 53 -50 -233 0 44 -96 21 35
3327C5o0P5j13o6L27j88k12K24J58k53J52j92m4k4J10l6K40K4k88P8N8J28k86
$$ 35 -25 50 -63 -129 198 10 -202 22 180 -73 79 -113 -157 -181 -71 -107 133 157 -131 -53 5 133 -153
3350a53J95j99N9J53J0l1J4p4K24k42K43M4j94J17l0j13O7J22k05L3j50J08j68
$$ -153 42 -157 -98 55 65 34 48 -26 198 -44 199 243 49 166 136 23 90 212 7 40 -110 -2 -170
3373a70J99O3N5l80J94J36J97l89j50J05J51j37K59pm12K30K35m3j79J68j4n9
$$ -170 29 92 147 -233 -39 97 294 -95 -245 -140 11 -126 133 126 -286 -56 179 136 -43 125 111 52
3395E2N8O6p1p3Q2j02K6k75K41J48j97J16K26k33j83J33k72K73j40J80k11J96
$$ 52 110 176 105 32 114 12 38 -237 4 152 -45 71 297 64 -119 14 -258 15 -125 55 -156 40
3417D0L8l30M19q1J04%k56R7LP0M0k56J84k87J83K50m77L7M9L08m7k48r7M3L88
$$ 40 78 -252 167 86 190 190 -66 31 34 104 144 -112 72 -215 -32 218 -259 -222 -173 135 88 -160 -257 -214 174
3442A74k29J13j1j0o2m2M7k2l1K25k41J84oj47J05j52R6J79m1K8rj90k24J71K16
$$ 174 -55 58 47 37 -25 -67 -20 -42 -73 152 -89 95 89 -58 47 -105 -9 170 129 157 148 -42 -266 -95 121
3467A21p2l7n4K07j43k00K40j03lM1j76K9k59M30J2k67K46PJ66l98L67l86K99
$$ 121 49 12 -42 165 22 -178 62 -41 -44 -3 -179 -150 -409 21 33 -234 12 19 185 -213 154 -232 67
3490F7m5qn8k93J68L26m1J00k91J50J75l61J73k3N9k90J92Rr4P7J63l14j93M50
$$ 67 22 14 -44 -337 -169 157 116 216 -75 75 250 -111 62 39 98 -192 0 9 -85 -8 155 -159 -352 98
3514I8k28r2N81k46k58L22Pk34J12k27K73k76L90n42K89j43K5K07K8q1O9k10J16
$$ 98 -130 -222 359 113 -145 177 184 -50 62 -165 108 -168 222 -320 -31 -174 -149 58 86 5 74 -136 -20
3537b0p9J86k26k7k8J09j50J4L30j17O0J06n2N7j71pN9j67j2q6M05n36K69J97
$$ -20 -99 87 -139 -166 -194 -85 -235 -221 109 -8 52 158 106 163 -8 -15 44 -123 -135 -221 184 -352 -83 114
3561A14nJ27k86R3q7j57L31j96k15J74K01k44J53m6L6J65q0j47J84J23j44r9J65
$$ 114 109 236 -50 43 -44 -201 130 -66 -281 -107 94 -150 3 -43 -7 158 78 -69 115 238 94 -5 160
3584A60j04l89O38m77J50k48K07j97K54j89K89j1j61J46p6Q6k2k36K44J59l46
$$ 160 56 -333 305 -172 -22 -270 -63 -260 -6 -195 94 83 -78 68 -8 78 56 -180 64 223 -123
3605a23l0J09J42j80j40J54P2J34k95L11j55P4J92q2m08Q5K76k67K07o2q1J9m0
$$ -123 -153 -44 98 -82 -222 -68 4 138 -157 154 -1 73 265 183 -225 -140 136 -131 76 14 -67 -48 -88
3628h8k0J99k61J62j11M83m21P0J31K30k15k66J44j56J77l8m1k07J15K02J24j85
$$ -88 -108 91 -170 -8 -119 364 -57 13 144 374 159 -107 37 -119 58 20 -21 -228 -113 89 213 28
3650B8K3J33k04K5R4j86J53j17K42k62J81l24K25R8K8j71j0P1j2K21k76K7n7M63
$$ 28 51 184 -20 5 99 -87 66 -51 191 -71 110 -214 11 109 137 -34 -44 27 15 236 -40 -13 -70 393
3674C93m73l5J46Q2K6k22L8J69Nq8j9j89K71k21J38l1J14k16K96k08J03o0j22
$$ 393 -80 -115 31 113 139 -83 -45 124 129 41 22 -167 104 -117 21 -10 104 -112 184 -24 79 19 -103
3697a03o2K07Q5j21n3K56k05j92P7K6p3K00m8K10j06j67qj03K33j09j08K33J2
$$ -103 -165 42 127 6 -47 209 4 -188 -111 -85 -158 42 -6 204 98 -69 -77 -180 53 -56 -164 69 81
3720H1q0k8j08K74j18kj26J94j40K33k71n5m0J43oR4J15m9j60L9M6pj17N7k48
$$ 81 1 -27 -135 139 21 19 -107 87 -53 180 -91 -146 -186 -43 -49 45 160 111 -49 -10 36 29 -88 -31 -279
3745b79M31K0l14L71J28l09J09j85L6j78J02K14q5j2L2M4j88K53j66j29j01J98
$$ -279 152 172 -142 229 357 48 157 -28 8 -170 -68 146 61 49 81 125 -63 190 24 -105 -206 -8
3767hJ15n0r6K9J88j60j34J41J09j14j28Q2m7J03j57J85j23P0J21k68J88l28K07
$$ -8 107 57 -39 -10 178 18 -116 25 134 20 -108 -26 -73 30 -127 58 -65 5 126 -142 46 -282 -75
3790g5J82j39N3J5J54j4k67K52j22oM4J0j48K8K2Po4K1N0J9k43J77J56k46J18
$$ -75 107 -32 21 36 190 176 -91 161 39 33 77 87 -61 -33 -11 -4 -68 -47 3 22 -221 -44 112 -134 -16
3815a6k6J74J40j11l01J87m1p0O0j59K80l07M6L03j67r4L3R8qJ84j25N7j43J87
$$ -16 -42 132 272 161 -140 47 6 -64 -4 -163 117 -190 -144 159 -8 -102 -69 29 21 205 80 137 -6 181
3839A81r3j11J37k17J6K45k09j02L02k19K4K40j13q3O8J15j58K9j35q4J87k49
$$ 181 88 -23 114 -103 -87 158 -51 -153 149 -70 -46 194 81 -2 66 181 23 52 -83 -167 20 -229
3861b29L01J08Q8l70j5K19l36J55J66j5m5k28j0L77j87J00l09J92n6J98j70Q5
$$ -229 72 180 268 -102 -117 102 -234 -79 87 72 27 -201 -211 166 -21 79 -230 -38 -94 104 -66 19
3883A9J1J14j52j48R4J89k36r6L44n9l5k91L04J07l38lK61J15p4J30j33k54K46
$$ 19 30 144 -8 -156 -62 127 -109 -205 139 80 45 -246 58 165 -173 -176 85 200 126 256 123 -131 115
3906A15k96J83P0M0l07L97m12L16J46k96j8J17P8K62j82m3j25r0K9P1P9q8k84
$$ 115 -181 2 72 112 -195 202 -210 106 252 -44 -62 55 133 395 213 170 45 -45 -16 55 134 46 -238
3929b38M12l59M55j23j28J92L6l46J27J43m70J65Q6j66K16M3n0O2O4j64M18k97
$$ -238 174 -185 270 147 19 211 247 -99 28 171 -299 -134 -48 -214 2 45 -5 57 121 -43 375 78
3951G8o6J31R4j83r1J81l9j59O5k21p4L68j36J03m8j74K24K8J89n7k33L34j54
$$ 78 12 143 237 54 -37 144 105 -54 11 -210 -284 84 -52 51 3 -171 53 81 270 213 -20 314 160
3974A60k86K53j65j66K85MK2j6j07R6j65K76m20L53k05j06K74k19J16k80K99l1
$$ 160 -126 127 -38 -204 81 85 107 91 -16 80 -85 191 -229 124 -81 -187 87 -132 -16 -296 3 -28
3996b8JJ7P8J33q8Q0p6k39O7k3Q7O4j30j0J09n0P9Q8l20P2L61n2l69Q5Q0q5j29
$$ -28 -27 -10 68 201 113 193 117 -122 -55 -78 9 73 -57 -67 42 -8 71 159 -161 -89 272 220 -149 -64 16 -69 -198
4023a98J75j21J04j03J89lK77k55j2j24K3P3j04Nq4M10j75j73J42J7p2M7R9k31
$$ -198 -23 -144 -40 -143 46 43 320 65 53 -71 -48 25 -79 -74 -158 252 77 -96 46 63 -9 38 137 -94
4047i4J23j10J78j29Nr0J42j11R9R8l18q7K69L9n6M2j50L03k64K80j90n4J2J72
$$ -94 29 -81 97 -32 -27 -117 25 -86 13 111 -207 -294 -25 14 -42 0 -150 153 -111 169 -21 -75 -63 109
4071A09k00R9n2L36l60o2J70J38j92P4pk46K66n8J24j94O1QQ7l30K72J26j68M4
$$ 109 -91 8 -44 292 -68 -130 40 178 -14 60 53 -193 73 15 139 -55 6 14 101 -229 43 169 1 45
4095D5P0j52K5j80K04k7J44j26P3qk76J97M02l00J4j5m0p7J45J7l57J64J50k30
$$ 45 115 -37 -12 -192 12 -15 129 3 76 68 -208 -11 391 91 105 90 50 -27 118 135 -222 -58 92 -138
4119a38J76J3j04J68j71J11q4l4K73q9k3J97k60j3k79K39P3k9j2o3j7K10k51J84
$$ -138 38 51 -53 115 -56 55 -29 -63 210 121 98 295 35 22 -257 -18 55 26 14 -49 -66 144 -107 77
4143G7K87n10L31M6n9k62K24J0k69P8M7R0j75J03J19l76K77k73K69J06j42k0j26
$$ 77 364 -146 185 231 172 -90 134 144 -125 -47 0 90 -85 18 137 -239 38 -235 34 140 -2 -22 -148
4166a48J78mO0j67J31M1j53k5p7Q3K25j64J0j27L32l62J54Q1J08j72j36K46l36
$$ -148 30 26 86 -81 50 91 -62 -87 -164 -81 144 -20 -10 -137 195 -167 -13 68 176 4 -132 114 -222
4189b22K68j38M6J78J19k77J07O4j87J45l65J31m3J57j5K2k52N2J4M71k56R1k57
$$ -222 46 -92 -46 132 251 -26 81 145 -42 103 -262 -131 -174 -17 -32 -10 -262 -210 -196 275 19 110 -147
4212a47K60k48J11K9J40j57p3R5n8j23R9j28J32J25O2j13K97k44o1K80n20J71
$$ -147 113 -135 -24 5 145 -12 -85 10 -48 -171 -72 -200 -68 57 119 6 303 59 -2 278 -242 -71
4234g1m0m8P4K02j97j08K37k50J50r6J20K93l96O1j73L57j32M1j43J6M2K97k64
$$ -71 -111 -159 -85 117 -80 -188 49 -201 -51 -147 -27 266 -130 -69 -242 115 -17 24 -119 -103 -61 236 -28
4257b8j38K04j35j50J27R9j14K33k27m6J33j19J93k93J75jK13O8l09M29r8m66
$$ -28 -166 38 -97 -247 -120 -21 -135 98 -129 -175 -42 -161 32 -261 -86 -87 126 194 -115 314 216 -250
4279b50K28pL11l84J72N9j42J69j16K68k73q3J32k54j29L19o2J12j05L09k24J7
$$ -250 -22 -29 282 -102 70 129 -13 156 40 308 35 -48 84 -170 -299 20 -42 70 -35 274 50 67
4301F7j90L25l40J51J29K0q9j55J8J08k65L29l35N9K85j25j43j4M2K3l2J33L5
$$ 67 -123 202 -138 13 142 162 73 -82 -64 44 -221 108 -227 -168 117 -8 -151 -165 -123 -100 -132 1 36
4324C6o9n4K68j72N4m6j8J30k55K89k87R1k10M50r5j64l4p9r7K00L0r0M5J20k76
$$ 36 -33 -87 181 9 63 17 -1 129 -126 163 -124 -33 -243 207 112 -52 -86 -165 -262 -62 -32 -122 -77 43 -233
4349b33J86k9lK23k34L18l55J70J92k49r8K4Q9o2Q6J10j15N4j04J05rJ0J17m84
$$ -233 -47 -76 -79 144 -90 228 -127 43 235 -14 -112 -88 1 -61 25 135 20 74 -30 75 66 76 193 -291
4373b91K70J92j31p0J12k06p9K18J75j23j38K3p4L8L1M9j4j19QM21j82l2J0J66
$$ -291 -21 171 40 -30 82 -124 -203 15 190 67 -71 -48 -122 -84 -53 -4 -18 -137 -129 292 110 78 88 254
4397B54l81K52k29L26k46K01K42l02k6k62k1K76K04l29K49j88J30k89M60j58p5
$$ 254 -127 125 -104 222 -24 177 419 117 91 -171 -192 84 288 -41 208 20 150 -139 321 163 88
4418H8k33J39KK01j38j97K41l79J70J73q6M8J95l76K62n4K26l63k5P8J24k56J31
$$ 88 -145 -6 -4 197 59 -138 103 -276 -106 67 -19 29 224 -152 110 56 282 -81 -106 -28 96 -160 -29
4441b9K03O8k36p8K57k42l2n0J33k28L25r7J24j21m4j26j2L91j59L1J42k4l74
$$ -29 174 242 6 -72 185 -57 -89 -139 -6 -234 91 -6 118 -3 -47 -173 -185 206 47 78 220 196 -178
4464a78K33n9k8l55K9N69l88J73j34J9P9j60J93R0m3j59O4Q8m7N9J94n27K47K4
$$ -178 55 -4 -32 -387 -358 211 -177 -4 -138 -119 -40 -200 -7 83 40 -119 -55 33 -14 45 239 -288 -41 -17
4488a7J12k37L55r7L4k82K45j47M1j06j5J57j52J34K06k24n7p0j9L64k47ln9J64
$$ -17 95 -142 213 116 150 -132 113 -34 7 -99 -114 43 -109 25 231 7 -50 -120 -139 225 -22 -25 -84 80
4512H0j20L2P9n4p4R9P1j66J40K6j70qr7L56j22j34J32j56j56L81q7m19N22l89
$$ 80 -40 -8 71 17 -57 42 113 -53 87 113 -57 -65 -162 194 72 -62 70 -86 -242 139 52 -367 155 -234
4536b34L54j33P0n2J26l39K8J96m2K7nM1p0M5j14L19j19R1j31p6j9J36j00mj00
$$ -234 120 -13 57 5 131 -208 -180 16 -26 1 -4 37 -33 12 -102 217 98 189 58 -18 -37 99 -1 -5 -105
4561a05K50m11K87l07K78j56j8N0j55L44j39k2J42l5M0O6m9j47L14k73R3K13J
$$ -105 145 -266 21 -286 -8 -164 -182 -132 -287 57 -82 -104 38 3 43 109 60 -87 227 -46 47 260 261
4584B61l12L38k62j08J05k29O9K59R3o0k24K20l26J65K8J52l04M38m61J05K95
$$ 261 -51 287 25 -83 22 -207 -138 121 214 154 -70 150 -176 -11 17 169 -135 303 -158 -53 242
4605B42n7k17K2K1Q2P6k6n9k25oJ36k2o5K0j54J24L0m9M5L30p3k68j42J96J75
$$ 242 185 -32 -10 11 93 169 143 84 -141 -147 -11 -33 -98 -78 -232 -108 -78 -127 -82 248 175 -93 -235 -39 136
4630A36m6J5r8Q5O8k93Q0p2L11j34k91K37m8J40J16j08k31L72l63O2J39R7l26
$$ 136 90 105 7 92 160 -133 -53 -125 186 52 -239 -2 -50 90 206 98 -133 239 -124 -62 77 174 -152
4653a52J40l5K1j57r0N88k83M05o63J89Nj7K3J40j51R1K43k37M0k05r5J12N6Q5
$$ -152 -12 -47 -26 -183 -273 315 32 437 -226 -37 -32 -49 -26 114 -37 54 297 60 100 -105 -200 -88 -32 53
4677E3j4r1j79Q4J33J00K30r3k55k58N09J4k61k88L82o1J79k59J75l30L01Nj91
$$ 53 39 -52 -231 -147 -14 86 316 223 -32 -290 219 233 -28 -316 66 5 184 -75 100 -230 71 76 -115
4700a15j85K45K03p5p2o2O5Rj69M79k07O9m6k20J00j43M38j21l54JJ56QN2K24
$$ -115 -300 -55 148 73 1 -61 4 13 -156 323 116 185 139 -81 19 -124 314 193 -161 -160 -4 4 56 280
4724B80l14J35Q3l67J58J97m30J34K47j26M1Q8M0k53K10L3j19L4rn7N1j42J76
$$ 280 -34 101 184 -183 -25 172 -258 -124 123 -3 38 126 166 -87 123 156 37 71 62 5 56 -86 90
4747I0l12K05m8J13J00q5o0p8K5K52j94O8kj76J81j69K27l60L74j7j80j0q0J20
$$ 90 -222 -17 -65 48 148 63 3 -75 -50 202 8 76 74 -102 79 -90 137 -223 151 134 -46 -56 -136 -16
4771a6Pj14J39j42p4R6Q6J37j18k1J14n5n5l2m0L4j19M36j45j99P9Q2m8k99J8
$$ -16 -9 -123 16 -126 -200 -104 -18 119 1 -20 94 39 -16 -48 -88 -54 -173 263 118 -81 -2 80 32 -267 -249
4796b49K43j6J72j47M8j11J0L4K4J95k46j98J39J25K35k19k08K02R3k19K73q3
$$ -249 -6 -22 150 3 51 -60 -50 -16 8 203 -43 -241 -102 23 258 39 -169 33 126 -93 180 97
4818I7l62K25R4L8j17m4j1Q3j04L92j03p8J64P0n61K43l1K60l04N6j91L55k14
$$ 97 -265 -40 54 92 -25 -69 -80 3 -101 291 188 110 274 344 -217 26 -5 255 -49 7 -184 171 -43
4841d3K06k31J83k91J71J05J27l42K24j79N8J0j13K07O5n0j21qj93K65p7LkJ54
$$ -43 163 -68 115 -176 -5 100 227 -115 109 -70 -12 -2 -115 92 157 107 -14 -22 -215 50 -27 -24 -26 128
4865A28j02k87j67N19J19n0j89J05P9j06j35N2K1Q7m7L9j9j3L26j53m26L30k92
$$ 128 26 -261 -428 91 210 160 -29 76 155 49 -86 -34 -13 74 27 66 47 34 360 207 -219 111 -181
4888a81J93N2j75NK36k88J92J83l55K0K29p0o6k20M63j10l15K10j60M4j3L89l66
$$ -181 12 64 -111 -106 130 -158 34 217 -138 -118 111 41 -25 -245 218 108 -207 3 -157 -113 -126 263 -103
4911a03L0K1k76L04R6j68j8K1J89j1j94J51J07k61J70p3K25r0q9j28m1K57k40
$$ -103 -73 -52 -328 -24 72 -96 -114 -93 96 85 -109 42 149 -112 58 -15 210 120 31 -97 -138 119 -121
4934a21J83o1J15k16n4J31r0J53j94J30L12l39Q4j85jO1L14j90j77N6l7L5R9J9
$$ -121 62 1 116 -100 -154 -23 -113 40 -154 -24 288 -51 33 -152 -153 -92 222 32 -145 -89 -126 -91 8 27
4958B7k78R8J15J06k98J18K23j55R6k48K24k5n9J58j81K0L0K49l86M14k38Q1k42
$$ 27 -251 -153 -38 68 -230 -112 111 -44 52 -196 28 3 -56 102 -79 -59 -29 220 -166 248 10 91 -151
4981a51J05K04j72l05L81N8j28L7pj62L21l07R8M4L0p9LN1o9n8K2rl8M11l30r5
$$ -151 -46 158 -14 -319 62 120 -8 29 22 -140 181 -126 -28 16 46 -33 -30 21 -48 -106 -84 -93 -131 280 -50 -145
5007a45K85j98j78K0J65k6L7q9L81l51Q3M0N2q3k35M54j75K0k5j08m2j36J41J78
$$ -145 140 -58 -236 -216 -51 -77 -40 -129 252 -99 -16 24 76 -7 -242 212 37 57 32 -76 -118 -254 -113 65
5031F5l16K97m7j5L28m60R9m9L5o4J63Q7M2k9k03J78K09k46l0M5K92l89J5k5j33
$$ 65 -251 46 -1 -16 312 -148 -49 -98 -63 -127 36 123 165 136 -67 111 320 74 44 89 381 -8 7 -18 -151
5056a51K32j08j27K95l24J55J91l40J82NJ60M0m14M2J72q8J75N0j68Q9k24J58
$$ -151 81 -27 -154 141 -183 -28 163 -177 5 10 170 210 -204 -162 10 -78 97 147 -21 68 -156 2
5078Bj08m4K53k75M4o8K39o4j8J68l21K84j23n6Q0J09K58l35k53M30l92K22j34
$$ 2 -106 -150 103 -172 -128 -196 43 -21 -39 129 -192 92 -31 -87 -7 102 360 25 -228 202 -190 32 -102
5101a02L50l69K18j20O1j33K27L4k86J53j11K0l9R5j12L50j89j76K48O7r9k1J24
$$ -102 248 -121 97 -23 38 -95 132 166 -120 33 -78 -58 -97 -2 -114 236 47 -129 119 186 87 66 190
5124A90l03Q5M2k22L25Q3l02R0lJ00o5J52j07o7k7J29J6j86j0J95q5lm6j26j14
$$ 190 -113 -28 14 -208 117 200 -102 -12 -15 85 20 172 65 -2 -29 100 116 -70 -80 115 30 27 -19 -145 -259
5149b59L30k39o8P2j51L00o7K24K61l64o7r9J97J83k40m6J86p3j38J95q5J54l58
$$ -259 71 -168 -236 -164 -315 -15 -82 142 403 39 -28 -127 70 253 13 -33 153 80 -58 137 52 206 -152
5172a52J26J84k54m5J20p6R9K0j29J43k9M1j8j35k8J31j94K23k6k0j5J43j8j12
$$ -152 -26 158 -96 -141 -21 -97 2 22 -107 36 7 48 30 -105 -133 -2 -196 27 1 -19 -34 109 91 -21
5196b1j33J11q4J76k0j04K17j26q4J76n6j89K23M4k96J31p4l8J86j16r4j10J49
$$ -21 -154 -43 -127 49 29 -75 142 16 -68 108 52 -137 86 130 -166 -35 -109 -147 39 -77 -171 -281 -132
5219a32LK10nk29p8J13K84l01J72k10L92j23oj15l1J93k76J34k02K16j8kJ13K31
$$ -132 -129 81 76 -153 -231 -118 166 -135 37 -173 219 96 90 -25 -56 137 -139 -5 -207 9 -9 -11 102 333
5243C33j82j06j44L5p2J62J64j42j23L9J76j15j64K80m94M52m5j32L02L14q50
$$ 333 151 45 -99 -64 -136 26 190 48 -75 -36 140 25 -139 141 -353 99 54 -78 224 538 -312
5264c12J57J89J72l49j9k6J26k48K15Q0Q5k22M1J51l7Q5k50L09m0l02N8K48Lk07
$$ -312 -155 34 206 -143 -162 -188 -62 -310 -95 -15 70 -152 -111 40 3 88 -162 147 107 -195 -137 111 114 -93
5288i3M15n02J28K2j9o2o0J59N7k5J91L9l64J25k21K60M0P6p8k41J58n4p0M20
$$ -93 322 -180 -52 -30 -49 -111 -171 -12 45 20 211 250 -114 11 -210 50 90 166 88 -153 5 -49 -119 301
5312C01L8k84q6P5q6j10J45J83j19j32P2k60K47nJ12l43L48j31K7j29J54q6J09
$$ 301 339 55 -31 44 -42 -152 -7 176 57 -75 -3 -263 -16 -21 91 -252 96 -35 -8 -137 17 -69 40
5335D0nl2J50p3K50m10J49o3k62K13q9N6J96k44j60m1M35o0J3J17k14Q8k9r6j60
$$ 40 35 3 153 80 330 -80 69 6 -256 -43 -132 -76 120 -124 -284 -325 110 50 63 180 -34 54 25 -71 -231
5360b31K50R8m36K13o1K39j66P8J53k44R4j79M0O1M3K5l4J23J63k99J51j08R3
$$ -231 19 117 -319 -106 -167 72 -94 -16 137 -107 -13 -192 -152 -91 -48 -23 -57 66 229 -70 81 -27 66
5383F6L6N0k20l3R6j09j44L33J73j37Nr4M1j32J65Rl5N3k00M94n22P5P4l16R1
$$ 66 102 152 -68 -101 -5 -114 -258 75 248 111 116 22 63 -69 96 105 70 123 -77 417 -105 -30 44 -272 -181
5408a81K26L5j26M1j0m8q3K28k1j2M8j05P1J90l18J55j95J33j08L9q4K29Mq5K14
$$ -181 45 80 -46 -5 -15 -63 -146 82 61 49 97 -8 63 253 -65 90 -105 28 -80 -41 -125 104 108 23 237
5433B37m02K2J76o7l3L9Pj7J91k73j26K33j28J91p9K37k18p0K88k93O4M1q1r0
$$ 237 -165 -143 33 -34 -67 -28 -21 -38 153 -120 -246 -13 -141 50 -29 208 -10 -80 208 -85 -21 20 -61 -151
5457a51K07n4j18K50m3L9j72j15K25K1j59k1J11J49l25K67k64J43lK36k14Mk7
$$ -151 56 2 -116 134 91 130 -42 -157 68 89 -70 -91 20 169 -156 111 -153 -10 -13 223 9 13 -14
5480a4n7O8P5N0j40J41j64K48j58R3k28r8K05j75J45j79K1J15J32k29K07j28l30
$$ -14 -71 -3 72 122 -18 123 -41 207 49 142 -86 -184 21 -154 -9 -188 -167 -52 80 -149 58 -70 -400
5503d00L13r2m0o7K72p1K03N4k98P2J40P3q0J6k26L20Q6l09Q8o9j13K12j20r2
$$ -400 -87 -179 -219 -286 -14 -85 118 172 -126 -54 86 159 79 95 -131 189 275 -34 54 -15 -128 84 -36 -128
5527a28K29j48J33L1o2k38M08k82J07j50J03J85p4k86JJ97k03K83r2K28j60j4
$$ -128 101 -47 86 117 55 -183 225 -57 50 -100 3 188 114 -172 -171 26 -177 106 14 242 82 68
5549F8p0n2J32k46L22j78n8p3J43m1L6%j89N4J97J2o3n9J34j52L7M9p5K06k58
$$ 68 -2 -54 78 -168 154 -24 -82 -155 -12 -53 -17 -17 -206 -152 45 57 -6 -65 69 -83 -46 3 -72 134 -124
5574a24K85n5j09m55L07L04j11k65L40k74O2J76l32M38O0j13k11p2JK07O3r9j07
$$ -124 161 106 -3 -458 -151 153 42 -223 117 -157 -95 81 -251 187 247 134 -77 -149 -148 59 122 23 -84
5597h4k92M96j00n1r5K03j48R8K48k47j52p1K57o6j71J57q4Q2%k7j3Q5%J48k69
$$ -84 -376 120 20 -31 -126 77 -71 27 275 28 -124 -195 62 -4 -175 -18 -102 -20 -20 -47 -60 25 25 173 -96
5622i6J24k49M39j66k08M03j5l16J39m3k02qJ61L0kJ96j41P2j79j1p8K59j26R
$$ -96 28 -221 218 52 -156 247 232 -84 55 12 -190 -198 -37 -7 -9 187 46 118 -61 -72 -150 109 -17 -8
5646hJ97K3J2m04K43Q8k33K62R4k38J26j2J30k78k54K78j0L6j17N7J44j83j5l24
$$ -8 189 212 224 -180 63 151 -82 180 274 36 162 150 280 2 -252 26 16 52 -65 -8 136 -47 -62 -386
5670c86L13K20j86j31K54k25JK16q5j8J21j46o9K33k71J07%J40J97j22k93J65
$$ -386 -73 147 -39 -170 84 -141 -140 76 -9 -27 94 -52 -121 112 -159 -52 -52 88 285 163 -130 35
5692C5j2j42P2O6j52J88k41J94Ml3J18k57M7K20j53jJP4J89l92J10N4j55l7M42
$$ 35 23 -119 -47 19 -133 55 -186 8 12 -21 97 -160 -113 107 -46 -47 -46 28 217 -175 -65 -11 -166 -203 239
5717B39k05J1j64J10M1J13J54j07j60k56J51lR6o1K9J02j09l5J0pJ5j54J80k0
$$ 239 34 45 -119 -9 32 145 299 192 32 -224 -73 -76 20 -41 -12 90 -19 -54 -44 -51 -36 -190 -10 -30
5741c0j69J56j7J85j11j08j02o6K29K10k07L8K37j98O7k79J70r2R8m1j47J96j22
$$ -30 -199 -43 -60 125 14 -94 -196 -262 -33 177 -30 8 245 47 114 -165 5 -87 11 -30 -177 19 -103
5764a03J46k23J55j46J84L0M4O2k58L9k0J57J4l86K64PJ13k15J1L9N1L9KJ36l92
$$ -103 43 -180 -25 -171 13 43 87 149 -109 -70 -90 67 81 -305 -41 -34 79 -136 -125 -86 -35 4 6 142 -250
5789b50L45k86J55j06J81j68J27MJ19l18L59q4k50L46j48j26K01m6j25J70j66
$$ -250 95 -191 -36 -142 39 -129 -2 2 121 -197 162 78 -172 174 26 -100 101 55 -70 100 -66
5810f6k2r1L30r0j33p2K38j78J24J40rj62j02R0j89K30J67J0j93j03J94j08M9
$$ -66 -88 -179 151 61 -72 -144 94 -84 40 180 171 9 -93 -3 -192 38 205 215 22 -81 113 5 54
5833E4O8lj05p9J0Q3j7L3j44K88j17K5j93pJ38K6K1K25l95J22q5k4L7r0P4Q4M
$$ 54 122 119 14 -65 -55 28 11 44 -100 188 71 96 -97 -104 34 60 81 306 -89 33 -52 -76 -39 -129 -55 29 33
5860C3r4J97j37j3M3j20J21j03J48P6j42m1J63Q1k56J68k65J33Rm25N11K77J0
$$ 33 -61 136 -1 -14 29 -91 30 -73 75 151 9 -32 131 212 -44 124 -141 -8 1 -424 87 364 374
5883C74o51L53o0j82J24J7Q2l5o5L24n8j94L8K27k68J80p5j30K00m2n2j34N9j41
$$ 374 -277 76 16 -166 -42 -25 57 22 -43 281 223 29 67 294 26 206 131 1 201 159 107 -27 32 -109
5907a09K68k40K2J8r7M03k68K22k28J49l09R5Q5j32j27N86n30Q6K83k53M6j87
$$ -109 159 -81 -59 -41 -138 265 -3 219 -9 140 -169 -74 11 -121 -248 338 -192 -106 177 -76 -30 -217
5929b17L45k42J31Kj26J45J98k68J14j85j16M92k39k72J57M1K30l86K58J99m5
$$ -217 128 -114 17 19 -107 38 236 -32 82 -103 -219 273 34 -238 -81 -40 190 -196 62 261 216
5950B16j68k26K61K0O1o0m8K0L4j83P9j62J60m5p0L4J39rM2k5j72L04k16M1r3
$$ 216 48 -178 83 103 164 104 56 76 110 -73 6 -156 4 -41 -111 -77 62 53 95 70 -102 202 -14 27 -66
5975f6j0j41K40Nmj36R3J85j16N4j70L3J58jk62O0K24Kr5l1J39p1j02J11p4K9
$$ -66 -76 -217 23 28 24 -112 -19 166 50 104 -66 -33 125 124 -138 -78 146 148 53 22 161 90 -12 99 25 54
6001E4j82L1j1R6p0j4R7q8M9j5J83j42j04J38K6k19K35m03M76q2O3l72L59o0N2
$$ 54 -128 -97 -108 -12 -82 -96 1 -87 -38 -53 130 -12 -116 22 48 -171 64 -339 137 55 118 -254 105 45 97
6026I7j05k00J72p4J57j98K77r4n4J7j4R3k3k74J72j34K10LJ66n4j44j38K3J03
$$ 97 -8 -208 -36 -110 47 -151 126 32 -22 -5 -19 74 51 -223 -51 -185 25 28 194 140 -4 -142 -119 -16
6050a6J28Q5j56mj31K37j07j52K28j6p4NL1lK6J32l03R7j76L16Kk23K57j15m82
$$ -16 112 197 41 37 -94 143 36 -116 112 96 22 27 58 55 81 213 -90 7 -169 147 149 -74 183 68 -414
6075d14N34r7j11l4p5L61k99K30k68J13P6k21J84J9l4m5K50r7k21j2K84m8j10
$$ -414 120 23 -88 -122 -197 164 -135 95 -173 -60 16 -205 -21 -2 -36 -81 169 72 -149 -161 123 75 -35
6098c5l07K40p1K00Q6k37K05j15J58l43O3J36K5J31j76j51j32M34J40j75j26K01
$$ -35 -342 -102 -173 27 113 -124 81 -34 124 -219 -156 -20 5 136 -40 -191 -323 111 251 76 -50 151
6120A51m23L20K6Kj22J84j49p0o7K12p9J68l65O7L66k44n4n6o1R4J65J57k09P5
$$ 151 -272 48 74 76 -46 138 -11 -81 -148 64 -15 153 -212 -145 221 -23 -77 -133 -194 -100 65 222 13 88
6144H8m04K26K08l77O91o57J92K5k18O6K8J09k2J49j7K0j44Ko2P0J21k70K72k9
$$ 88 -316 -90 118 -259 432 -225 -33 -8 -226 -160 -132 -23 -45 104 87 107 -37 -35 -97 -27 94 -176 96 67
6168F7j6k8N6J0J50j58j1J06k59N9K30k26k53K65jk24J96n9QNK63m49K62J90m14
$$ 67 51 23 79 89 239 81 70 176 -83 -24 206 -20 -273 -8 -9 -233 -37 -96 -88 -83 180 -269 -7 183 -231
6193b31Q6J62R5k09J88pr5r6K18l24J99p8J48j05J08o1K66k14j36p9K71K7k37
$$ -231 -145 17 112 -97 91 84 -11 -107 111 -213 -14 -92 56 -49 59 -2 264 50 -86 -165 106 133 -104
6216a04K30O8j61o9O2R5j39J08j06R5p7K8q8j70L55k8q5k11J51J6n9J16k45J86
$$ -104 126 194 33 -36 26 121 -18 90 -16 79 2 30 -58 -228 127 99 14 -197 -46 -30 -89 27 -218 -32
6240c2j45J73j32J03Q5k24J59r5J18J09L8K6Q7L6k10j59J84J36l05p7J70j04J63
$$ -32 -177 -4 -136 -33 52 -172 -13 -108 10 119 157 183 270 306 96 -63 121 257 -48 -125 45 -59 104
$$ [...]
8191a41
##END NTUPLES=NMR FID
##END=
