##TITLE=1H_SR157_k3
 DMSO-d6
 8 sc, 
 21.2.2023
##JCAMPDX= 6.0         $$ Bruker NMR JCAMP-DX V2.0
##DATA TYPE= NMR FID
##DATA CLASS= NTUPLES
##ORIGIN= UXNMR, Bruker Analytische Messtechnik GmbH
##OWNER= root
$$ XWIN-NMR		Version 3.5
$$ Tue Feb 21 13:52:47 2023 Russian Standard Time (UT+4h)  she@DPX200
##.OBSERVE FREQUENCY= 200.13135
##.OBSERVE NUCLEUS= ^1H
##.DELAY= (6, 6)
##.ACQUISITION MODE= SIMULTANEOUS
##.ACQUISITION SCHEME= undefined
##.AVERAGES= 8
##.DIGITISER RES= 18
##SPECTROMETER/DATA SYSTEM= spect
##.PULSE SEQUENCE= zg30
##.SOLVENT NAME= DMSO
##.SHIFT REFERENCE= (INTERNAL, DMSO, 0, 15.7039)
##AUDIT TRAIL= $$ (NUMBER, WHEN, WHO, WHERE, WHAT)
$$ ##TITLE= Audit trail, XWIN-NMR		Version 3.5
$$ ##JCAMPDX= 5.01
$$ ##ORIGIN= Bruker BioSpin GmbH
$$ ##OWNER= she
$$ F:/spectra/data/she/nmr/H-F/1/audita.txt
$$ ##AUDIT TRAIL=  $$ (NUMBER, WHEN, WHO, WHERE, WHAT)
(   1,<2023-02-21 13:51:51.60 +0400>,<she>,<DPX200>,
      <created by zg, POWCHK disabled, PULCHK disabled
       configuration hash MD5:
       00 E9 B6 7A A2 85 ED C7 34 08 36 98 17 FE 4E 26
       data hash MD5: 16K
       47 5A C2 84 50 A3 8E 19 CF AF 6D F8 60 3F 99 E1>)
$$ ##END=
$$ 
$$ hash MD5
$$ 0B 47 DD 15 03 22 1A 83 09 E9 A4 2A 15 50 26 B3
##$RELAX= 
##$RELAX= 
##$RELAX= 
##$RELAX= 
##$RELAX= 
##$RELAX= 
$$ Bruker specific parameters
$$ --------------------------
##$DU= <F:/spectra>
##$EXPNO= 1
##$NAME= <H-F>
##$PROCNO= 1
##$TYPE= <nmr>
##$USER= <she>
##$AMP= (0..31)
100 100 100 100 100 100 100 100 100 100 100 100 100 100 100 100 100 100 
100 100 100 100 100 100 100 100 100 100 100 100 100 100 
##$AQSEQ= 0
##$AQ_mod= 1
##$AUNM= <au_zg>
##$AUTOPOS= <>
##$BF1= 200.13
##$BF2= 200.13
##$BF3= 200.13
##$BF4= 200.13
##$BF5= 200.13
##$BF6= 200.13
##$BF7= 200.13
##$BF8= 200.13
##$BYTORDA= 1
##$CFDGTYP= 0
##$CFRGTYP= 5
##$CHEMSTR= <none>
##$CNST= (0..31)
1 1 145 1 1 1 1 1 1 1 1 1 1 1 1 1 1 1 1 1 1 1 1 1 1 1 1 1 1 1 1 1 
##$CPDPRG= <>
##$CPDPRG1= <>
##$CPDPRG2= <>
##$CPDPRG3= <>
##$CPDPRG4= <mlev>
##$CPDPRG5= <mlev>
##$CPDPRG6= <mlev>
##$CPDPRG7= <mlev>
##$CPDPRG8= <mlev>
##$CPDPRGB= <>
##$CPDPRGT= <>
##$D= (0..31)
0 1.2 0 0 0 0 0 0 0 0.06 0 0.03 0 0 0 0 0.0002 0 0 0 0 0 0 0 0 0 0 0 0 
0 0 0 
##$DATE= 1676973111
##$DBL= (0..7)
120 120 120 120 120 120 120 120 
##$DBP= (0..7)
150 150 150 150 150 150 150 150 
##$DBP07= 0
##$DBPNAM0= <>
##$DBPNAM1= <>
##$DBPNAM2= <>
##$DBPNAM3= <>
##$DBPNAM4= <>
##$DBPNAM5= <>
##$DBPNAM6= <>
##$DBPNAM7= <>
##$DBPOAL= (0..7)
0.5 0.5 0.5 0.5 0.5 0.5 0.5 0.5 
##$DBPOFFS= (0..7)
0 0 0 0 0 0 0 0 
##$DE= 6
##$DECBNUC= <off>
##$DECIM= 32
##$DECNUC= <off>
##$DECSTAT= 4
##$DIGMOD= 1
##$DIGTYP= 9
##$DL= (0..7)
0 120 120 120 120 120 120 120 
##$DP= (0..7)
150 150 150 150 150 150 150 150 
##$DP07= 0
##$DPNAME0= <>
##$DPNAME1= <>
##$DPNAME2= <>
##$DPNAME3= <>
##$DPNAME4= <>
##$DPNAME5= <>
##$DPNAME6= <>
##$DPNAME7= <>
##$DPOAL= (0..7)
0.5 0.5 0.5 0.5 0.5 0.5 0.5 0.5 
##$DPOFFS= (0..7)
0 0 0 0 0 0 0 0 
##$DQDMODE= 0
##$DR= 18
##$DS= 0
##$DSLIST= <SSSSSSSSSSSSSSS>
$$ [...]
##$SUBNAM2= <"">
##$SUBNAM3= <"">
##$SUBNAM4= <"">
##$SUBNAM5= <"">
##$SUBNAM6= <"">
##$SUBNAM7= <"">
##$SUBNAM8= <"">
##$SUBNAM9= <"">
##$SW= 18.05172834244
##$SWIBOX= (0..15)
0 0 2 0 0 0 0 0 0 0 0 0 0 0 0 0 
##$SW_h= 3612.71676300578
##$TD= 16384
##$TD0= 1
##$TE= 0
##$TE2= 300
##$TE3= 300
##$TEG= 300
##$TL= (0..7)
0 120 120 120 120 120 120 120 
##$TP= (0..7)
150 150 150 150 150 150 150 150 
##$TP07= 0
##$TPNAME0= <>
##$TPNAME1= <>
##$TPNAME2= <>
##$TPNAME3= <>
##$TPNAME4= <>
##$TPNAME5= <>
##$TPNAME6= <>
##$TPNAME7= <>
##$TPOAL= (0..7)
0.5 0.5 0.5 0.5 0.5 0.5 0.5 0.5 
##$TPOFFS= (0..7)
0 0 0 0 0 0 0 0 
##$TUNHIN= 0
##$TUNHOUT= 0
##$TUNXOUT= 0
##$USERA1= <user>
##$USERA2= <user>
##$USERA3= <user>
##$USERA4= <user>
##$USERA5= <user>
##$V9= 5
##$VALIST= <valist>
##$VCLIST= <CCCCCCCCCCCCCCC>
##$VD= 0
##$VDLIST= <DDDDDDDDDDDDDDD>
##$VPLIST= <PPPPPPPPPPPPPPP>
##$VTLIST= <TTTTTTTTTTTTTTT>
##$WBST= 1024
##$WBSW= 4
##$XGAIN= (0..3)
0 0 0 0 
##$XL= 0
##$YL= 0
##$YMAX_a= 69749
##$YMIN_a= -107005
##$ZGOPTNS= <>
##$ZL1= 120
##$ZL2= 120
##$ZL3= 120
##$ZL4= 120
##$ABSF1= 10
##$ABSF2= 0
##$ABSG= 5
##$ABSL= 3
##$ALPHA= 0
##$AQORDER= 0
##$ASSFAC= 0
##$ASSFACI= 0
##$ASSFACX= 0
##$ASSWID= 0
##$AUNMP= <proc_1d>
##$AZFE= 0.1
##$AZFW= 0.1
##$BCFW= 1
##$BC_mod= 2
##$BYTORDP= 1
##$COROFFS= 0
##$CY= 11.3945322036743
##$DATMOD= 1
##$DC= 2
##$DFILT= <>
##$DTYPP= 0
##$F1P= 2.36226072786647
##$F2P= -0.459571619588291
##$FCOR= 0.5
##$FTSIZE= 0
##$FT_mod= 4
##$GAMMA= 1
##$GB= 0.15
##$INTBC= 1
##$INTSCL= 1
##$ISEN= 128
##$LB= 0.24
##$LEV0= 0
##$LPBIN= 0
##$MAXI= 10000
##$MC2= 0
##$MEAN= 0
##$ME_mod= 0
##$MI= 1.114404
##$NCOEF= 0
##$NC_proc= 0
##$NLEV= 6
##$NOISF1= 3.799351
##$NOISF2= 2.8
##$NSP= 1
##$NTH_PI= 0
##$NZP= 0
##$OFFSET= 15.70392
##$PC= 1
##$PHC0= -19109.04
##$PHC1= 13.60078
##$PH_mod= 1
##$PKNL= yes
##$PPARMOD= 0
##$PSCAL= 0
##$PSIGN= 0
##$REVERSE= no
##$SF= 200.130013532006
##$SI= 16384
##$SIGF1= 3
##$SIGF2= 2
##$SINO= 400
##$SIOLD= 16384
##$SREGLST= <1H.CDCl3>
##$SSB= 0
##$STSI= 0
##$STSR= 0
##$SW_p= 3612.71676300578
##$SYMM= 0
##$S_DEV= 0
##$TDeff= 0
##$TDoff= 0
##$TI= <>
##$TILT= no
##$TM1= 0
##$TM2= 0
##$TOPLEV= 0
##$USERP1= <user>
##$USERP2= <user>
##$USERP3= <user>
##$USERP4= <user>
##$USERP5= <user>
##$WDW= 1
##$XDIM= 8192
##$YMAX_p= 0
##$YMIN_p= 0
$$ End of Bruker specific parameters
$$ ---------------------------------
##NTUPLES= NMR FID
##VAR_NAME=  TIME,          FID/REAL,        FID/IMAG
##SYMBOL=    X,             R,               I
##VAR_TYPE=  INDEPENDENT,   DEPENDENT,       DEPENDENT
##VAR_FORM=  AFFN,          ASDF,            ASDF
##VAR_DIM=   8192,          8192,            8192
##UNITS=     SECONDS,       ARBITRARY UNITS, ARBITRARY UNITS
##FACTOR=    0.0002768,     1,               1
##FIRST=     0,             0,               0
##LAST=      2.2672688,     0,               0
##MIN=       0,             -107005,         0
##MAX=       2.2672688,     69749,           0
$$ Real data points
##PAGE= N=1
##DATA TABLE= (X++(R..R)), XYDATA
0@%%%%%%%%%%%%%JrJ6j6J6j7K5l2L8m6N4o2P2q7J01j16J32j50J69j93K22k47K77
36A48l15L53l93M39m89N45o08O73p45Q24r09J004j107J219j343J479j629J796
54I42j983K193k431K701l015L382l817M347n003N844o965Q544j0953J5119k4362
69a5457Q5206l5212q8526R8247j5171l1686J1094k082r611K4385l8577p059M7803
82B3354j8890n9034J9798J5041o36J4153j6860j0109N8069J757n3909K0439M4912
95C8085k7074k4331J4738K1439J2265j7969k1783K9965J4387m1793j4903K1584
107D610m784j0009l631q415J7270J6064k7963j4027K7980M605k2572l399J4554
120i717J6752K322j6873N805K9741m494k7158M559J8237m076j3204k401R493Q713
$$ y = [0, 0, 0, 0, 0, 0, 0, 0, 0, 0, 0, 0, 0, 0, 1, -8, 8, -8, 8, -9, 16, -16, 22, -24, 30, -32, 40, -47, 54, -62, 70, -80, 89, -104, 118, -129, 148, -167, 186, -207, 232, -257, 288, -320, 353, -392, 432, -477, 527, -580, 639, -704, 775, -854, 942, -1041, 1152, -1279, 1422, -1593, 1789, -2028, 2319, -2684, 3160, -3805, 4739, -6214, 8905, -15457, 69749, 34537, -53989, 44258, 29087, -2599, 8495, 6413, -3198, 21187, -17390, -24449, 23354, 4464, -54570, -34772, -19731, -20367, -6214, -23074, -33183, 24886, 26643, -27266, -6827, 38085, 11011, -13320, 1418, 22857, 35122, 17153, -4630, 25335, 39722, -2071, -16974, 4610, -174, -10183, -13814, -22229, -4959, 11105, -16858, -30885, -2905, 1700, -20872, -24271, -9717, 7035, 9357, -7516, -1711, 28030, 23536, -3622, 937, 19174, 15098, 1894, -507, 8986, 17699]
134A7699q723j5658K500J1752p077j9075k986J5413M584j2274m545J2873J0055
147D538o974j2370O749J8730m785j7267J0184J9733k666r729o36M845Q237o199
161A2390k0744O161K0057j5329k0146J4340J1641j0129j0832l212Q787J0389j5086
174a1713j2599K1066J2231j6380k281J3359N211N5q548n386J7676P622k1749l146
188d582K0676k68j5137l192L511O111l547j8161J581J9787o751j8043P047J2308
202A340k855o302m204O490J3778p418j3530J3897J5361j0995q814Q138O884j084
216A0686q382o582J1203Q171j6044q755J4102M115j3403n993M685N700q73j0331
230a1701q73J4560K058j3850M79J2435J674o028k845N142R071q19j0717K490J2533
$$ y = [17699, 8976, -6682, -4182, 7570, 493, -18582, -21568, -6155, -1571, -13845, -18390, -5517, 4538, -2436, -14806, -8057, 10673, 5888, -11379, -1195, 18538, 15872, 6143, 5507, 10352, 18589, 12390, -8354, -2193, 17864, 2535, -17611, -3271, 8370, -1759, -12591, -15803, -7016, 3373, -11713, -24312, -3246, 8985, -7395, -9676, 3683, 8894, 8949, 401, -4985, 12691, 20313, -1436, -4582, 16094, 15826, 689, -2503, 1008, 7119, 3572, -14589, -13008, 6779, 28, -18015, -10968, 1340, -1515, -7817, -12021, -5531, 8247, 829, -12701, 1196, 16557, 5562, -3252, 4886, 11770, 10686, 2304, -4278, 6925, 15096, -948, -9703, 4399, 8514, -4889, -10882, -6197, -497, -1370, -11701, -12574, 1986, 4044, -9806, -9327, 3108, 4782, -1246, -4091, 1051, 10122, 9303, -1414, 1076, 13609]
245A3609l622j2470J025P619K44p693n420N603P657p815j0680N535Q868o078q529
260a2147L969R123J332o241k487R776N511r208n425R010O303o145m681M596O466
275I752j294q527k274P607J05j0400l142P910K994n726m325L533O109l569q000
290i247K049Q368n32o469J475Q464L061n168l628M962M890m914o233M101O847
305H026k711o300N36O148o27q389l626N462K404o530l748O139N377m100n091K994
321d036O099j300o046R50P318K426m594q29O058K651m673m454K660L732k848o178
337c064N78N468M07o682k163M660J221n520l268M373M405k966l871L924O668p91
353C379n335O54O049N06n073n24N503J855m327l320L291L237m252n263P54L781
$$ y = [13609, 9987, -2483, -1458, 6161, 6405, -1288, -6708, -1105, 6552, -1263, -11943, -6408, 2460, -3618, -12147, -8178, 945, 2277, -3964, -6451, 3325, 8836, -372, -5797, 3213, 9516, 3371, -1310, 3286, 9752, 8458, -69, -2343, 5264, 5369, -5031, -8173, -263, 2731, -2995, -7320, -3787, 2322, -1247, -9247, -7198, 1170, 638, -5831, -4356, 4108, 7169, 2001, -1627, 3335, 8225, 3311, -2922, 1179, 8026, 5315, -985, -449, 5699, 5072, -3317, -6943, -1481, 923, -5607, -9355, -3216, 2161, -1939, -7030, -4036, 2063, 763, -5283, -4333, 2985, 5411, 817, -12, 6046, 8697, 4024, -430, 2230, 5962, 3114, -3064, -2486, 2982, 3389, -3293, -5456, -796, 425, -5095, -8363, -3990, 415, -2551, -6422, -2498, 4170, 3379, -1956, -1302, 4747, 5253, 180, -344, 5159, 7014, 2687, -633, 2658, 5895, 1643, -3620, -2866, 915]
369I15j122m661l22M576J069m746j794N131K793m196k917L849M840j116l070J459
385F88M486o89l747M7K971P41l340k677J889L782k357n257R70M187j815m299l15
402d735L940Q48m163j099N091K397m027j368L421K642r13k565N40L920O07m166
418C70K24L518J76l329j898J069K658k498m645J550M268k595l667J828K326J37
434e08j811k096L045L721l326k152M120K290j118j556j8K677J912m453k747N192
450C172J514n413j291L444P56k458k861O8M289j507n635J983M763j747j553P70
466a706J176K522q50m013K960M093l444k128L580J534m88j340k118K299J950n336
482a309k043M713o58l030Q10J22R49J310m371j157N614r63m466K011L178J50L65
$$ y = [915, -207, -4868, -5190, -614, 455, -4291, -6085, -954, 1839, -2357, -5274, -1425, 3415, 2299, -771, 688, 5174, 4485, 738, 785, 3756, 4497, 1157, -1520, 369, 4151, 1794, -3463, -2493, 1694, -121, -4420, -4735, -795, 53, -4110, -5209, -118, 2279, -1748, -3116, 305, 2947, 2034, -531, 9, 3929, 4536, 370, 594, 4112, 4288, 959, -939, 130, 2788, 290, -4355, -2805, 1463, -1132, -4799, -2971, -645, -508, -2319, -4415, -1370, 2351, -975, -3127, 993, 3283, 2165, 609, 591, 3268, 5180, 727, -2020, 3172, 4686, -727, -2018, 1426, 2182, -276, -3137, -3069, 1220, -287, -5922, -3939, 824, -923, -2476, -1706, -530, 1992, 1142, -2871, 89, 4182, 738, -1390, 2190, 3724, 3236, 1896, -222, 2077, 4027, -1309, -3352, 1361, 703, -2327, -1517, -1395, -446, 864, -3507, -4664, 950, -13, -4479, -2468, 710, 860, 1225]
499A225j011n4M089j504m696L043L026l487o32J681j15J513j520l956K039K422
515B063n410j084L729p97q33J629j377J120K654l426j345L815Qj927J813O08J527
532B767J697k579j383L390j130m403J175J061q09L27j187o1K952k122l645K056
548a894Q93k655N57J482K95K754j05k703K911K279m127p76K943l29p87Q56k44
565A350J078R67k859j334J713j277k329Q04M24n4J068m33o87J573N46k430m97
582b377J284Q98j74l32K109J751q70j109J037rj453j031q7J187K79r57l2R11l49
601F76j231r50j013L75N19j271L75K919m6j175J494M17j166K86m26m82J978Q40
619B119j308J246J101j416j09l99k286N56N21k422R21K235j355q98R95k58r49
$$ y = [1225, 214, 160, 4249, 2745, -1951, 1092, 4118, 631, -1, 1680, 1565, 3078, 1558, -2398, -359, 2063, -3347, -4431, -702, -1499, -2332, -703, -2080, -960, 1694, -1732, -3077, 738, 746, -1181, 632, 1240, 2767, 4464, 1885, 502, 3892, 2762, -1641, -466, 595, -214, 113, -1074, -1135, 1817, -305, -3950, -1894, -1001, -3656, -3099, -1617, -1322, 1432, 1327, -1376, 1535, 3814, -313, -1089, 1854, 1525, 738, 1594, 1350, 2428, 3395, 536, -798, 915, -362, -2691, -1887, -1463, -1517, -449, -882, -1569, 4, 550, -1880, -2377, -1093, -195, -369, -701, 1408, 3159, 2289, 1180, 2217, 2208, 755, -276, -363, 824, 1103, 146, 114, 1025, 676, -555, -1505, -2518, -2143, -1624, -2895, -2520, 399, 353, -822, 672, 1089, -77, 209, -217, -699, 1279, 2119, 811, 2057, 3158, 1742, 1633, 1234, -1052, -496, 25, -2397, -1476, 759, -596, -1494, -499, -757, -1706]
636a706J33q01K51K051o00k45K579M40q68L96m18j114J241o32r44J694O83j817
654C23P92M79k195J19k72j966P02J506j651K13J971n12m35Q85n79m97J339k09
672A3p31J785J126j198O87Q37j136j71l37q11M45K62j689K96J230r01p66N49r97
691a507m94N03l09j98K039m62o24J265P36p47M81K51q23J200M69j310N33J100
709B103j339l22N88o77o43J54j234Q6J485j390j000J417j42p01P81J36Q0P51j97
728f4p88J691O61j481K99J333o01l3L21o88K44K54j074j41M50k67j001N13p9l56
748h07K97m55q16R60R0r76N32J227k48J40N01j4P30q5r32J71J191o10n31O71p6
769I60j45Q2n65o46M99o15j011J77N27l43o0O15k18n4J65k32R6P45M1l28Q23N94
$$ y = [-1706, -1573, -2374, -2123, -72, -672, -917, 1662, 2102, 1234, 1630, 1212, 98, 1339, 707, -237, 1457, 2140, 323, 1115, 1594, -601, -482, -754, -2720, -2018, -512, -2163, -1950, 21, -491, -926, -41, -620, -1117, 222, 13, -718, 1067, 2193, 995, 1682, 2519, 1383, 1212, 875, 64, 509, 771, -918, -622, 608, -293, -1059, -510, -1507, -2001, -1498, -1807, -2005, 34, -428, -1052, 213, 949, 202, 683, 934, 111, 1311, 1780, 470, 1003, 2103, 764, 442, 1030, 353, -290, -136, -1370, -1284, 201, -1189, -2189, -772, -914, -1615, -834, -698, -618, 133, -64, -852, 839, 1500, 19, 318, 1651, 1050, 1017, 1338, 650, 894, 1148, 74, -67, 383, 116, -885, -372, -451, -807, -510, -965, -1781, -821, -731, -1707, -1175, 52, -196, -56, 445, 431, 1161, 1076, 144, 315, 1506, 896, 365, 1036, 960, 815, 897, 332, -314, 185, -430, -1441, -1264, -737, -1080, -1140, -525, -743, -797, -632, -864, -768, -23, 18, -310, 513, 1107]
791A107J54K07Ll67K56m35q07O3Q73r79o52L41K72j87p33o19o0O04m87p47J219
812i74R36n71N83M63K85j51l42J39O08M68q21J67Q33k20n07k13l94l66k72q32
832a181k34N87K54o79O33j39J52k11k16r9R16k7k01Q05Q95j6k79J69K45L0q01
853F03o89M03J79l73J88Q7j69n53o8p57Q8j66j80k13R11L79Q0N85m66M53J93o07
875i2N3N71J68J69J97M8J52J32q91p41M02m18l39j03K14M34J85j032j44P85k05
896d55j328M20P92j53P04K44M44N19j91p60L84J80p39O47O0l77N78L24j209L6
916A20M54r96j004O52n6j72P4j00P99O83j272m03J206j28p60R90L81M82N66o85
936H31m77J348l46j711L70P79n57l45j42l4N74o44j076M64O16r09l05O62N76k67
$$ y = [1107, 1261, 1468, 1471, 1104, 1360, 925, 118, 181, 1054, 75, -577, -236, 36, -151, -884, -1503, -1563, -959, -1446, -2193, -974, -38, -609, -26, 437, 722, 571, 229, 368, 976, 1444, 623, 790, 1623, 1403, 896, 683, 289, -77, -349, -1181, -1415, -828, -574, -1253, -620, -759, -607, -818, -1034, -1133, -217, -244, -445, 360, 1255, 1239, 960, 1129, 1374, 1404, 603, -86, 317, 496, 123, 311, 398, 229, -324, -392, -1149, -1061, -1227, -1407, -1620, -709, -330, -250, 335, -131, 322, 515, -92, -39, 532, 700, 869, 1066, 1114, 1266, 1398, 507, -234, 168, -250, -589, -692, -478, -44, 141, -891, -1035, -250, -455, -1783, -1363, -571, -724, -20, 224, 668, 1187, 996, 236, 620, 800, 61, 708, 768, 391, 969, 1293, 84, 120, 574, -422, -1426, -774, -830, -1002, -928, -1028, -229, 454, -818, -1221, -15, -143, -903, 87, 468, 950, 1516, 831, 354, 1702, 1356, -355, 15, 794, 237, -108, -250, -284, 290, -354, -1430, -966, -350, -1259, -1564, -902, -326, -593]
956e93N17j54K74P63k24p81Q10K96Pk74J33L06J17o10n31M20Q1p55m81L5N61o48
978g31k07K73J5K59m07l84P67M58l03j38R48K77o15p4L77L98p0K87o53K71K50
999I98p85l88N47n09k39n4j83l3M24l75o25J316l00p13Q0O19K83J88k28j19J257
1020A161j2j251K29Q70o29M8j6O8J59K09j382L65O82j016n52L26M25j70j68l41
1040i95L63P46m98n83J239j41m86L56N28m3L80o1o65M95N93j359m7O58n26l16
1060c62M18k94L10K56r49m41J145o14p21L59N04K81j57P8N2J090m02r07P10Q09
1080A165p34k98M51q8M7L30m80m09O62o78p67J55L63l24J01K45nJ31j76l20K67
1101c62M20o47R0N87K72K97m9l16L75K94p80k18J53L51o49N12J16j82K12n80m89
$$ y = [-593, -76, -230, 44, 807, 583, -198, 612, 908, 915, 641, 774, 1080, 1197, 587, 56, 476, 557, -198, -679, -644, -83, -731, -938, -665, -650, -391, -798, -1182, -415, 43, -260, -398, 550, 827, 212, 138, 515, 913, 843, 1130, 477, 748, 998, 213, -175, 372, -137, -376, -430, -613, -646, -222, -597, -1222, 94, -206, -919, -839, -220, 63, 251, 23, -96, 1161, 1149, -102, 127, 997, 368, 416, 400, 468, 627, 836, -546, -181, 501, -515, -1067, -741, -316, -486, -654, -995, -632, 114, -384, -967, 272, 131, -355, 1, 529, 486, 866, 805, 140, 635, 1228, -131, -178, 480, -46, -362, 56, -238, 72, 328, -621, -1062, 83, -531, -1252, -893, -389, -108, -265, -187, -135, 955, 553, -354, 356, 1165, 431, 133, 584, 496, 543, 873, 393, -16, 646, -32, -799, -644, -281, -605, -504, -259, -264, -133, -309, -629, -362, 58, -589, -499, 88, 360, 657, 608, 292, 667, 961, 181, -37, 116, 467, -182, 330, 446, 264, 476, -104, -593]
1122e93L99j92q15N02L07qM68l06n6P45j35o82K57K53L6j50K82M80MK85q01k2
1144B58l21n7m84O5P8L64k36KL11k3l30n11N6M50j12j25M69O11M14n12J7L63n37
1167B10l18P8r3N15O6J44l18J39j27k44l37k25j65K76l56L30K09Q0l5P2J38K4
1189F3n25J77o0N24j8N23k16L1K19M7o92P8Kl21j55L67L79l50j81M00o77Q3l20
1212f22l65N77k24O4M72K17l06L72J31p1j95L33l54R9M42k9l11K75k72L09j80
1233C62l57p90O25k14p3K59k13Q5J88j57K48J20k77m83N64M27k84l7K49M1O9J93
1255E45m5m22O38n29j06m3J37o3k15K06k75J36l09k67M28k05l23K51k56P07K37
1276B27l80J49M22k05k95J93J30l7K91k15J41O9N8o01J56K65o81j22L1K12lo9
$$ y = [-593, -194, -386, -1201, -699, -392, -400, 68, -238, -294, 451, 316, -366, -109, 144, 180, 30, 312, 792, 796, 1081, 280, 258, -63, -120, -604, -539, -461, -97, -333, -331, -20, -43, -373, -884, -828, -378, -490, -615, -146, 465, 879, 367, 384, 747, 210, -108, -30, -123, 392, 458, 602, 284, 423, 296, 52, -285, -510, -675, -399, -755, -425, -216, -136, -171, -99, 39, 63, -462, -285, -345, 179, 161, 684, 468, 499, 718, 765, 73, 151, 153, -168, -323, 44, 423, 73, -108, 292, -385, -302, -622, -987, -410, -634, -570, -98, 119, -187, 185, 316, 245, 50, 383, 29, 128, 570, 541, 230, 505, 233, 542, 362, 5, -785, -160, -374, -447, -188, -401, -316, -128, -285, -37, 83, -194, -677, -113, 314, 30, -7, 242, 283, 352, 545, 500, 78, 716, 187, 81, 38, 175, 112, -103, 103, -172, -36, -345, -612, -184, -389, -712, -461, -717, -10, 227, -153, -4, 418, 213, -82, 111, 241, 204, 495, 280, 421, 490, 548, -53, 103, 368, -313, -435, -404, -192, -195, -264]
1298b64k40K78N7j3k92P6J61J35M9J21J53L76r3m39L95O5k98M1m82L19M49m06
1320A48k51L21k39j41l95K34J38l97n8J10O40k92j75K23R0K61m52K28P7L81l29
1341A22p6P1M55p6l52N7r7J31l68l19M7K77l0j82J83%k46L3n53P82n8j79J89K53
1365F4K8J35J2j47L83l07k77J61L26K18n21Q5K10J3l48l81O9K7q8j63K85L9J27
1388e0P3m7r8J04K7l40O8J42M59k03MO66J2n31m38L09N3l37k43J29L72l23P3k66
1412c85L01j78m23K83K86j03k04L61K50L14k95l07K25K00l89R3R9J79L08Ll77
1433B41r0K53n37l41N3M74k87l8P9R7K19j35k19J33j87K14k76m1P28m0k04J02
1455A98L50K9m02k60J84J72l43j81J00L83j69l59M44l69k24K1P5j7M57j77k53
$$ y = [-264, -504, -226, -169, -182, -474, -398, -237, -102, -53, 68, 221, 597, 504, 65, 460, 525, 227, 268, -214, 105, 554, 148, -103, 218, -21, -162, -557, -323, -185, -582, -640, -530, 110, -182, -357, -134, -44, 217, -235, -7, 70, 451, 122, 46, 117, 572, 496, 144, 201, 104, 235, -133, -452, -405, -128, -158, -340, -157, -157, -403, -370, -923, -141, -199, -378, -189, 64, 92, 227, 239, 92, 475, 168, -109, 52, 378, 596, 75, 160, 370, 383, 35, -346, -277, -250, -338, -501, -216, -177, -50, 23, -24, -122, -18, 9, -331, -263, -121, 338, 135, 139, 805, 817, 286, -152, 157, 210, -127, -370, -241, 131, -192, -119, -385, -84, -262, -685, -402, -116, -219, -423, -62, 188, 502, 207, -100, 125, 325, -64, 29, 128, 307, 615, 618, 241, 151, 404, -133, -474, -421, 53, -234, -272, -193, -96, 123, -12, -231, -98, -285, -71, -347, -388, 340, 300, 96, 198, 548, 577, 175, -85, 99, 271, -72, -253, -153, 230, 61, -298, 146, -223, -447, -426, -351, -368, 89, -88, -341]
1476c41O16p4O5k83j97J96oL44n49O61P0l16m2J23K12l00m53N3K61K30o78r6N78
1499G4k4n53%M50k8k73K53M8L00J78m78k2M23J46n60L9K54l5L04n45J46L24l04
1522A17l54M76j73j36n55N96j82j1J80l33O1J91J44m61M04n3J28q1N9L5J98j29
1544A21%K08J18m66o2L59m6N9k68n33O04r4j50j73K72r1k68J15K25J8l1k59K84
1567e8L84j99Mm2J39m0p8k99ON93k09l10k4K95J50j91l92n7L92j08o24M87K25
1590D4k93o6J51M60k75K9M8Jq0q1qM92R6m41J58J50n9k37k54N8K97j19m3Q3J67
1615B78j29m65K2J10o7L6J14k59N59K52o73N47J36n00j38J54J94j12K50k22J65
1636B52J54l17k23K45j39J1n79P38l17K47m16L03O9L49p26kN30l28j28M09J68
$$ y = [-341, 275, 201, 266, -17, -214, -18, -24, 320, -229, 432, 502, 186, 144, 267, 479, 179, -274, -221, 40, 270, -408, -504, 74, 50, -503, -503, -53, -81, -354, -101, -53, 247, 425, -53, -75, 348, 494, -66, -27, 227, 192, 496, -49, 97, 421, 117, -237, 239, 66, -70, -625, -29, -211, -222, -42, -375, -314, -123, 21, -440, -36, -89, 39, -42, 17, 52, 250, 121, 121, 329, 447, -19, -81, 278, 232, 291, 23, -510, 94, 0, -150, -323, -51, -142, -410, -295, -70, -52, -83, -342, -58, 326, 127, 131, 89, 228, 188, 110, -189, -183, 410, 201, -109, -133, 162, 312, 121, -271, -328, 64, -44, -668, -181, 44, -249, -315, -164, 296, 21, 50, 98, 99, 19, -62, -70, 422, 518, 77, 235, 385, 326, 89, -165, -107, 190, 71, 28, 111, 278, 149, -316, -294, -184, -251, -215, -101, -360, 199, 451, -222, 325, 461, -39, -177, -23, 171, 59, 309, 87, 252, 406, 89, -134, 111, -28, -17, -596, 142, -175, 72, -344, -41, 28, 377, -349, -351, 179, -149, -277, 132, 300]
1657C00k40J15J63L9pj65n02K66M00n47P1J15pL23l58j67RK46l63j06K43K06k94
1680b60L04R8j1O9j68k57L04j1l98L67J9L26Q7l19l3N7m8j78k41K02k39pK06J94
1704F3J10l91P1jM45p20M2M58J78q0j96L61j21P2l04k22K43M1j80L1J97M77k68
1727C06k52l47J06j28j60q4N68K8l7j33M52j14l87K9j4J21N5m34M62L90O3o58
1749a68M07K39j83l60l41J41M31l33P7Q6L43m03m42L73M29o48o2J0R6P88o16R4
1771d2K10N58n16p11N11J12j79N8m5J50L07m40J1L53k57k96k64K31O14n0p95J78
1793c02P94l82l71l6L26K86m17j91L23N34k75n43J86Q06l88n19k6N31J0o40Q6
1814b08N52r9l40n35N25M03j48n94K61L68K48o51j01N68J59n01n19P19K16k30
$$ y = [300, 60, 175, 338, 377, 370, 205, -297, -31, 369, -178, -107, 8, 1, 324, -34, -201, -192, 54, -309, -415, -172, 34, -260, 44, 142, 131, 200, 32, -225, 79, 68, -330, 37, 56, 382, 469, 150, 117, 174, 126, -52, -293, -91, -330, -337, -131, 63, 173, -218, -147, -148, 297, -423, -381, 77, 255, 175, -21, 340, 219, 291, -13, -235, 8, 49, -131, -100, 97, 574, 306, 54, -293, -187, -315, -475, -559, 9, 37, 0, -133, 319, 205, -182, -153, -167, -46, 9, -425, 37, 427, 490, -168, 239, 478, 295, -65, -406, -265, 166, -167, -90, -4, 339, -64, -506, -133, 296, -352, -414, -404, -308, 480, -136, -42, 168, 726, 210, -501, 10, 122, -57, 1, -44, 106, 413, -27, -16, 337, 80, -216, -480, -249, 365, 315, -480, -302, 492, 110, -261, -297, 29, 315, -102, -293, 30, 564, 289, -254, -68, 738, 350, -169, -195, 336, 346, -294, -208, 344, 245, -95, -630, -105, 298, 150, -444, -183, 185, 433, -218, -319, 249, 408, -93, -612, 107, 323, 93]
1834I3n67j4R46R3r63J02P44K44q29k23L94J39m56k63M99O52o73n29M17N06j63
1855A49l47r6M65M10l99m96O39M91o68o06L82M72k49q09K75P43J89o12k10N73
1875B96J74n93p44R32P7O8m53K5O49j10n02k2L83K51l06n11L70N18l41o51N23
1896C3N83m55n05J63N43j20o66M2N46J18l21j73J41N65l18n39k56R85j74m23k2
1917b53N36L07p54k38L79L83m15m88K82N27j74l53M9N73l66l62k5K44M31l81n68
1938f66P30J58m2l33k35O86k08n07J93L75J79n88J56L32K58k02o72K75L03m7p49
1959f04J19O06J76o45j2L93K33m17l11L65J31J07k83n8O93jo96k60N84L72p55
1980b63l82O15M62l81l89N08M29n72k19j98P14m4m93k39O17N72o54k88J71O22
$$ y = [93, -474, -488, 458, 551, -412, -310, 434, 678, -151, -374, 20, 159, -297, -560, -61, 591, -82, -611, -194, 312, 149, -198, -294, 171, 581, 182, -314, 325, 816, 148, -458, -76, 396, 147, -662, -387, 356, 545, -67, -277, 296, 470, -123, -867, 65, 142, 210, -243, -218, 431, 321, -181, -203, 180, 431, 125, -386, -16, 502, 161, -490, 33, 616, 161, -344, -181, 362, 242, -424, -382, 164, 282, -39, -212, -71, 494, 176, -363, -619, 366, 192, -231, -253, 283, 590, -164, -402, -23, 360, -55, -543, -261, 266, 92, -261, -212, 361, -5, -367, -392, -148, 283, -98, -666, 64, 222, 180, -153, -388, 298, 90, -417, -224, 151, 330, -258, -102, 230, 488, 286, -386, -111, 192, 145, -604, -485, 121, 297, -348, -360, 33, 266, -151, -462, -97, 34, 141, -142, -200, 493, 492, -204, -464, 120, 492, -263, -645, -30, 432, 51, -338, 170, 599, 27, -192, -390, 324, 280, -213, -452, 165, 737, 83, -205, -34, 588]
2000E88n29k67j11J90J88j37j89O61jo38j17L06r6j1l34J39O26m6m41mM03K8p16
2023e08n7N01L76m08j50K75K90j70m48P0M67rm95J8N17r7j93m41P17J65l79n53
2045e12L17L84j16o42K21R07l43m22k12P62k54l46j27N01L16n06k9J8M45j33m70
2066b41PM83J7l35l32K51M57j62l54K16K89k83k35J22L31p9k77p6L46J75j50m28
2088b58L89K0k30k08K60K01j69m9k72N08n3j19Ro1J05k41j85L06J42k05N1n0K98
2111A89j4m87J18M69k66j52lJ16N20m95k82L67L00n20j74o5M43J54l45J80%o8
2133a5m7p3J08J97l68K29K0J34k80j62K28K52J11n20K14J35N7m48J07O9J36J00
2155A84l45J71J88l30q6J93n1K8q7q4M57N6k89J4M1J62l01JK4K35J12n82J99K28
$$ y = [588, 59, -208, -319, -129, 59, -78, -267, 394, 393, -245, -362, -56, -152, -163, -497, -358, 268, 222, -219, -223, 180, 208, -508, -565, -64, 312, -96, -246, 29, 319, 149, -299, -229, 238, 229, -266, -248, 269, 172, -21, -462, 255, 420, 41, -512, -195, 189, 73, -569, -348, 559, 216, -206, -418, 344, 90, -256, -383, 118, 434, -72, -101, -83, 362, 229, -241, -234, 249, 266, -69, -401, -150, 307, 145, -209, 7, 296, 13, -222, -100, 231, 152, -125, -201, 145, 320, 170, -258, 131, 151, -79, -287, -27, 174, 5, -44, -316, 192, 139, 20, 29, -32, 73, -168, -353, -47, 95, -110, -59, -109, 189, 175, -312, -194, 275, 9, -143, -146, -30, 490, -5, -287, 80, 380, -140, -314, -379, 64, 218, -127, 53, 53, -15, -62, -135, -27, 170, -198, 31, 51, 185, -95, -257, -29, 223, 334, -186, 28, 163, 220, -228, -121, -52, 84, 184, -161, 10, 198, -132, -218, -25, -76, -48, -135, -219, 238, 294, 5, 19, 60, 222, -79, -78, -54, 181, 293, -289, -90, 138]
2179A38r4j40j5P1K58l55k2j01J36L77k99K2R7j57q8J8K24mm3j32J58K41J43n24
2203i1J88K53l01j08J08K05k29J35k87J48N0K8n55K28J14R7m85N18M0J46j79l44
2225c21O29l14k83k5K79K24j27KN6K80j31l29N7J8k82J38j1P3J82j58q4O2k7k0
2249a12k03M17j3n8j39P1J37K1k36jJ47J57k85p6p4R5J66j68J75K26j37l08j3
2272b11K31K97p21J38L56Q9j36k06L27Po7j69k32L56J17k39J71J31P2j57k39J32
2294D7J3l06J62j39L54p7l13M12q8P2k39r1K23K31l91j9J58K97J51m02k75J02
2316a18K89k22j1K04O4j95m5J60j14J57n43K24K29k10j52L45J53j67j99j04L31
2337G6o9L0j66j45K10K5J6n9L21l21J51L83l98lL7k05M16l0j58j63q7J99j56n2
$$ y = [138, 44, -96, -111, -40, 218, -137, -159, -260, -124, 253, -46, -24, 73, -84, -172, -154, 70, 66, 23, -109, 49, 290, 433, -91, 97, 350, 49, -59, 49, 254, 25, 160, -127, 21, 71, 99, -456, -228, -114, -17, -502, 16, 56, 202, 23, -321, 308, -6, -289, -314, -35, 189, 62, 64, 120, 400, 269, -60, -3, 15, -267, -129, -140, -67, 115, -43, -127, -65, -92, -112, -315, 102, 89, 31, -108, -37, 100, 121, -115, -116, 31, 188, -97, -173, -247, -152, 14, -154, 21, 247, 110, -198, -211, 20, 317, -404, -266, 90, 179, 43, -163, 164, 171, 104, -65, -297, 59, 176, -63, 108, 239, 311, 154, -85, 47, 60, -246, -84, -223, 131, 54, -259, 153, 65, 137, -102, -193, 30, 261, -130, -149, 9, 306, 457, 55, -220, -118, 171, -51, -62, 142, 206, 11, -34, 126, 12, 169, -374, -150, 79, -131, -283, 62, 215, 48, -151, -255, 76, 7, 37, -129, -274, -64, -39, -23, -82, 239, -82, 69, 452, 54, 51, 88, -117, 299, 269, 111, -52, -139, 60, -96, -148]
2361a48K6N0J10n1j27q9L39j38O7J2J27o9j07j17Q8N3j34j02M52l09J79l23K5
2384a86K10K51j91l97K89J96k1k88J75J9j09k06K87j66q6J12lK27j22l2J10KP8
2407A49k97K85o74P27k7k80L05pJ55n08J68K75o3m71j0K94k08K50n2k65K96J7
2429E9J7k06J64p1p6O8M37j15r1l13O9Q9N1j99K7rK0J46K8l73M17q5p3N1K2Oj28
2456f8j16L65k32J64k21J87M4l43P1J88L1L0k44J68J28l46L77J7m00K17k40j19
2478c42L95R4K9k47J77P2p0m1J29k21J15j16m9L63m15L00k89J2rJ14Q3q6J00l5
2502F3q8K20l39r3L66n6k07n0K08j24K63n2k42K14j04r3J82j62K41l43J49n5K07
2525A05k08K02J59m59N4J23o9m8K03j92K6J99K41l73O7J00j53J38j04q4K04k70
$$ y = [-148, -122, -72, 38, -13, -140, -229, 110, -28, 39, 51, 178, 109, 2, -115, -27, 26, -108, -210, 242, -67, 112, -211, -186, 24, 275, 84, -313, -24, 172, 151, -137, 38, 57, -52, -258, 29, -137, -223, -111, -114, 113, -9, -41, 69, 71, 149, -148, 137, -537, 190, 163, -117, 188, 181, 336, -172, -4, 271, 208, -263, -273, 21, -187, 63, 11, -254, 42, 59, 76, -130, 34, -37, -113, -45, 392, 277, 186, -127, -58, 31, 82, -117, -90, -99, -79, 67, 95, -278, 139, 54, -19, 32, 54, 60, -68, -184, 181, -51, 113, -108, 79, 123, -220, -149, 39, 70, 100, -144, 24, 152, -194, 183, 200, -200, 17, -223, -342, 53, 147, 176, -71, 106, 178, 108, 67, 196, -25, 90, -26, -75, 288, -127, 173, -116, -104, -113, 1, 84, -2, 98, 63, -25, 195, -144, -237, 129, 73, -134, -184, 24, -100, 163, 111, -131, 83, -21, -114, 68, -94, 147, -196, -47, -102, 105, -103, 99, 258, -201, -147, -24, -93, -141, 62, -130, -104, 95, 336, -37, 30, 130, -23, 115, 11, -73, 131, -139]
2547a39R3J29K52j73j64l06L43k67J12J17L10l84q9J34J22j84l3pM38k89j09K39
2569A45r1J53k36L31l75R9Rj33J7L13j37l14O9K18K0J1l00K52j24K26j70O0j99
2592a56J74J25k71J08j23K41l34j26M35n5OJ19j05P2nk9K10l15j7P9j26M5m9K36
2616A39l26J68p5k23J09l4N2K84l18J71k6L05p0l3R5k24J40k03L2J13K20k51J
2639D6Jo5j46K59l3kJ33m64L05j38o5K91k94K85k6j2k77L39j96J78n7j91L89J56
2663D16l89r1Q6j7j53K25N7M5k37j02R3J73m9j72K11j02r7j43M26k76J91j50J92
2686A37o9L2k31Q9K43k78J42m6K99k80k22L83j70r3P1J1k04j9J20j10M11m67L26
2709G5j50K16j95p2J19J20J22k26R2k62L62l62K34k17J9K65n7P2L0k47JR7L9j39
$$ y = [-139, -46, 83, 335, 162, -2, -308, 35, -232, -120, -3, 307, -77, -166, -32, 90, -94, -127, -134, 304, 15, -94, 145, 54, 207, -29, 302, -73, 26, 35, -98, -81, 232, 95, -219, -150, 68, 88, 99, -201, 51, -73, 153, -17, 43, -156, 18, 143, -128, -20, -143, 98, -236, -362, 73, 18, 24, 143, 38, 110, 105, 76, 286, -29, -46, 33, -93, -48, -97, 139, -187, -19, -94, -317, -208, -242, -190, 94, -224, -53, -79, 226, 156, 123, 218, -6, 134, -69, -37, 76, 296, 45, 46, 47, -18, -164, 95, 62, 60, 193, -271, 34, -104, -169, 122, -172, 113, 87, 75, -202, 137, -59, 119, 62, -129, 260, 416, 27, -64, 22, 5, -148, 77, 134, 179, -58, -160, -67, 106, 57, -115, 96, -6, -103, -246, 180, -96, 95, -55, 137, 68, 100, -131, -42, 201, -77, 65, 19, 318, 38, -184, 199, 29, -64, 7, 18, -186, -205, -85, -195, 216, -251, 75, -75, 141, -54, -126, -7, 113, 235, 9, 101, -161, 201, -161, 73, -144, -125, 140, 83, 155, 185, -62, -61, 36, 75, -64]
2733f4o2K00j21k02P5L31M3j86l37J72K32J26j71O4K82n64J28L4l9K37k51Q2L4
2756D3j5L1j11J52J0j89j8J6O3j0Q4j80k4K09k11J21J99l3m3k92J31K94j64N9
2780A22j14j00K27p5LO7o1L9k86J18q1K24L1j14L9J04k52J00q9J33m5Pj39J45
2804CJ50k43N9k0J53j24KJ19j26p9K8jM2J36q7P2n4n2m15P16k99j43J78q1J66
2829A00qJ2j28Mj10K83j87O9J85j62l46K39M9k6n8J87k45J59J22k23L9ml05J42
2853b12K99O1p1l01L20o6J73j35J7J24k13M9L03l22j2R6l11L70m20M8n4N2j8K57
2877C4j84J19k32J26K21n9R6j38J22k47L14k03J20k17K51j40k24L82j38O8m14
2898c43M58k40N2O4m9Rq5J25j27R7L55l64r0J83J29l66Q9L2J99j56o7J06J14J74
$$ y = [-64, -126, 74, -47, -249, -174, 157, 200, 14, -323, -151, 81, 207, 36, 100, 382, -182, -54, -20, -59, 178, -73, 9, 43, 28, 59, -52, 100, 110, -79, -97, -81, -18, -28, 56, -124, -148, 61, -150, -29, 170, 137, 94, -198, -67, 227, 63, 122, 8, -92, 135, 60, 63, 130, 69, 108, -178, -60, -141, 83, 114, 0, 39, 143, -109, -9, -98, 35, -10, -3, -142, 3, 153, -90, -31, -51, 102, -22, -20, 99, -27, -106, -78, -79, -37, 99, 12, 84, 30, -22, -437, 279, -20, -163, 15, -66, 100, 92, 104, -24, -20, -130, 153, -34, 35, 220, 58, -288, -49, 0, -26, -84, 103, -142, 17, 139, -84, -45, -49, -354, -212, 87, 148, 77, -224, 96, 30, 203, 68, 85, 209, -4, 45, 348, 26, 14, 110, -201, 169, -251, -203, -257, -205, -223, 34, -150, -31, -263, -137, 84, 25, 121, -17, 105, -142, 172, -31, 89, -128, 123, -17, -241, 141, 3, 71, -343, 115, -125, -73, -9, -58, -49, -134, -9, -136, -39, 316, -48, -138, 45, 174, -192, -103, -71, 128, -28, -95, 11, 125, 299]
2922B99j95N2k01J15rj94K38j46m9O3j2j41K39j11Q5k46K68j55r6K97J15n6j94
2945c4k9J04%j64K40p9J21j69K67l4k73j93L09J31j60%p8J10n33M33K11k09j00
2968a29J8q9J53l6J26j33J1l9L45j57m9lJ13Ok15J29Q8j16l0Om8K72j89k36J91
2993a1J11j12n3K58J98m45l8J84k20k2K53q4R6l26J42j69N40k44j10j24K04L9
3015F7N5n6l0r5k5J14p0r6N9q5K74m93M40o6k01K77J15k33J65j58J5L94l98M5
3039A4j47R8o2J23p5K7J12o5k8J17n7o5k64J02J91J37k8m47K36J43R5j12J69j92
3063B2l1J14k68M1L06n1k92P6P2J80m00J40P2K28n5L9j5j78q4rJ55p9j4n9K26
3088A36j08k17rJ86K4J52m12K61L7j95M67n18RK24j09L33j99o0OQ2j70N2j5J7
$$ y = [299, 104, 156, -45, 70, 61, -133, 105, -41, -90, -27, -39, -180, 59, -52, 33, -213, 55, -100, -196, 101, 216, 160, -34, -63, 41, 41, -123, 117, 38, 159, -10, 257, 223, -50, -243, 66, 197, 37, 37, -41, 69, -464, -31, 180, -29, -129, -111, -200, -47, -83, 43, -90, -79, -118, 227, 70, 21, 18, 131, 137, -78, 51, 139, 23, -7, -1, -49, 223, 34, -202, -11, 100, -12, -65, 193, 391, -54, -92, 92, -128, -150, 103, 19, 115, -211, -69, -238, 302, 58, -52, -176, 28, 67, 122, 66, 36, -59, -84, 30, -40, -136, -77, -162, 112, -381, 59, -7, -208, 69, 184, -49, 116, -42, -27, 367, -31, 14, -133, -35, -97, 26, -49, -22, 90, 25, -3, 114, 57, -8, -272, -170, 21, 158, 130, -317, -81, 62, 157, 45, 214, 22, -9, 105, -163, -122, 184, 133, -159, -83, -11, 169, -231, -91, -19, 209, 154, 193, 178, 0, -84, -93, 62, -17, -31, -90, 136, 28, -189, -198, -12, 12, 164, -248, 13, 50, -145, 322, -196, -187, 37, -72, 261, 62, 2, 8, 90, -80, -28, -43, -26]
3112b6o1J78j90o9K92j36N4K44l91J97k55L36L2l05J84l11L05j25K6j06J82Jo3
3135gl1J13l34J98P1j09K0l16L13K87k63K03K5j24n4R7j22L4j99N14k93j09J08
3158B2p8o2K33jKk34o2J96J95j08j62l53L58J17n0j83P4K08j26J00L3k15K55%
3182A59k00L3J41m7J4k32M9J55m0j32M0K36q1j00M6J24mj20p5O7j11L80m42J77
3206C7j64L6J50k5l7j69J94%J56j8m3k73J91j38N9P6P1j63rJ70j33K8O3Q0j30
3231IJ57j72j13OK64k63J89q7M5P9k2r5J70l7j83K57l70P1K03j68k03M44K9l72
3255a62J53N8qM7q2p3j93K73L7j7K66Q5k39p8N7p9j09K27l38J15q3K12q1o2N6
3280a8N7r5K23J8j97j40K25j9j4oJ07J19q3l43J70J20r1r5P8k67M41l21K80k30
$$ y = [-26, -87, 91, -99, -168, 124, -12, 42, 286, -105, 92, -163, 173, 205, -100, 84, -227, 78, -47, -21, -127, 55, 56, -7, -38, 75, -259, -61, 10, -99, -79, -395, -82, 205, -58, 145, 170, 46, -8, 89, -33, 1, -198, 316, 23, -86, 22, -56, -118, 115, 114, 116, -118, -180, 16, 211, 103, -59, -412, -54, 63, 13, -170, -96, 112, -14, 86, 119, -96, 159, 159, -41, -8, 133, 86, 100, -132, -83, 72, 32, -100, -60, 176, 95, -5, 41, 165, 161, 41, -34, 33, -78, 302, -140, 37, -127, -91, 59, 34, -3, -172, 22, 22, 178, 160, 117, -156, 35, -103, -44, 32, 103, -60, -69, 101, -32, -4, 59, 139, 9, 166, -6, -119, -113, 151, -112, 77, -10, 35, 114, 92, -3, 167, 130, -53, 204, -166, -95, 108, -60, -263, 181, 210, -162, -9, 49, 41, 88, 6, -67, -260, 13, 50, 33, 299, 384, 145, 67, 124, 45, -64, 163, -175, -60, -143, 69, -12, -74, -18, 39, -56, 167, 185, -12, -152, 73, 54, 40, 34, 141, 260, 177, -166, 4, 124, 33, -62, 16, -251, 190, -131, 149, -81]
3304h1r1N10m08m4OJ33q9K96r9k22k0J66l8J7k44K83j36J9j02M46k87o1J82j07
3328B9q8J57j46K21k57J80j16q3K07k63l4M9K84l58O7L29k13J4J21j59L48j54
3350A35l18L03r5j66J93P0l69M01j58J00J31k12l3k6J7K23k19PK5p4q6K32K6k00
3374i3j35L5J14M2q7J82N2k93K48p8J74j28K90m45K19O4k1j22k1k54M88l77K36
3397I0r3q7L05l30P5R7o0l9j53J07N6J04j28M3q1K11o5l15J86J96j66O4q2j42
3421b07K79L5j43m6J40j52J86pp2n7r1j54L52n0K6q9M83l36K3j24k24L07p7J30
3445A32l70J49Q4N5o6j05L36m29J72j18p8K10K92l25R9k28J26j84M25l5Kj96K38
3468A86r1k29K28j77J53J7K2o4qn5P4r2Q7O6J3k16K12l53L24l18K21J01L7j34
$$ y = [-81, -172, 338, -70, -114, -108, 25, -64, 232, 133, -89, -109, 57, 19, 36, -208, 75, -61, -42, -144, 302, 15, -46, 136, 29, -59, 98, -48, 173, -84, 96, -20, -103, 104, -159, -193, -144, 140, -218, -151, 178, -35, -21, 100, -59, 289, 135, -183, 120, 25, -141, 52, 122, -247, 154, -4, 96, 227, 15, -18, -44, -27, 196, -23, -16, 9, -65, -151, 81, 107, -93, -228, -193, -79, -37, -124, 58, 110, -183, 65, -13, 161, 33, 323, -122, 97, 161, 140, 18, -3, -257, 231, -146, 90, -3, -90, 215, -115, -40, 57, -3, -42, -195, -88, -32, 72, -56, -13, -94, 117, 52, -263, -77, 119, -47, 17, -65, -207, 72, 107, -36, -82, 58, -94, 92, 85, 13, -44, -135, -289, 63, 13, 39, -50, 433, 97, 120, -4, -228, 79, 2, 132, -238, -89, -5, 50, -16, -121, 215, -214, -42, -160, -238, -28, 264, -61, 38, -190, -64, -248, 177, 142, 144, -52, 186, 95, -134, 94, -83, 70, 87, 109, 45, 37, -18, 56, -36, 51, 117, 130, -86, 126, -227, 97, -221, 0, 101, 138, 4]
3492Dkk4K36m6k42J89m5J04j48M3M2k0Q9j54n7k55M72k38l0K66k99K65k65m1N5
3517a01m5N0K31j71J50q1Pk72J15J08J58k73k9J23r5P0L9o3j69O1J6J58q0j29
3541b22J5P1j16M38l14L29n0j35n2j96K06p4o7o5L15j22R5k25K08M3n9l18J48
3564a47l0L24k09l80K90RK91J07n02J91P2n3mp0k66K70P1j25J41O6n5J22k1j08
3588a6J8J68J50l11k8PKl8j65M39j45qj03n5j8P2J75l13K84r5M6O4j93l0R4N4
3614E5j33R2k45L73j3j89M3PM2j78J66J10m8M8j84j6J23k99R2J60k59M25j65L7
3638D4j40l2P2R8J15j28J2k10K24O0m0l04L29j25n4k68L53k8q1J4J29j56L96l29
3662d9O0K3J00J3k83K51j11O3n3j52L05j18j86J68J59j27M8Pj6r8J4K7j56k4K07
$$ y = [4, 2, -22, 214, 168, -74, 115, 70, 174, 26, 69, 111, 91, 180, 26, -31, -286, 186, -52, -82, 184, -115, 150, -115, -156, -101, -146, -96, 135, -36, 114, 33, 40, -232, -117, -9, 149, -124, -153, -30, -125, -55, -16, -79, -248, -187, -171, -13, -93, -222, -207, -136, -252, 186, -128, 201, 151, 16, -36, -232, -26, -100, -167, -232, 83, -39, 56, -169, 39, 82, 23, -295, -147, -177, 147, -62, -442, -152, -143, 148, 255, -247, -56, 16, -37, -41, -111, -377, -107, -36, -161, -20, 46, -9, 113, 92, -16, 2, 170, 320, 9, -19, -12, -10, -48, -213, 226, 81, 73, -30, -85, -103, -31, 144, -169, 115, 20, 66, 130, -63, -93, 1, 55, -78, 14, -231, 142, 129, -60, -17, -10, 32, -146, 20, 130, 82, 130, -54, -70, 53, -246, -154, 6, -253, 172, 7, 44, -96, -128, -56, 42, 157, 29, 41, -169, 55, 115, 75, -229, 100, -25, -79, -347, 6, -22, -103, -89, 40, -116, 280, -49, 11, 34, 134, 147, -136, 115, 4, 67, 14, -138, 167, 49, -137, 31, 190, 63, 111, 118, 102, 4, 18, 45, -111, -135, 72]
3687G2j1o7k12K85k21R8N7P9J86o84M17q9O2N6M9k43J31J35j39l0J35k9k13R6
3711h0K02j28j79K07J73j45j56J1L31l75L7K87p2J09k51P5j35K22k67K35j01j37
3733a37J11m3q5r7K98j22n5m9J20j33J97j23j6p9Q9L1R6%R7j27J42nl54L68j36
3758a2K0k26J68K39l64K88k74J00K27k73qO8J68k12J45M6j16J79j86K57k27Q0
3780H7N5K1j75j87M35l93L49m36K52MN0j41k45M34j23R4qJ22l10Rm6M03k75j61
3804a85J37r1j55J32J9j72L08p7%J10j52O0J63p0R4rO9p2m8p8L6k0K74l25M30
3829C78m83L45m40K88m8j84J41n6L0k27N1M27j25r5j22R4L4J0J40P8l46j00K64
3852E4J4LJ52n83K12o0K65J48l24K78m1m7j57j4j6M2n4R8k1L1J20k3j05k26K94
$$ y = [72, 61, -6, -218, 67, -154, -56, 1, 80, 266, -418, -1, -90, -28, 28, 77, -166, -35, 100, -39, -69, 66, 37, -176, -80, 122, -6, -185, 22, 195, 50, -106, -95, 236, -139, -102, 185, 113, 222, -29, 46, -89, 133, -134, 101, 0, -137, -26, -69, -154, -251, 47, -75, -130, -179, -59, -192, 5, -118, -134, -213, -124, -93, 3, 3, 100, -27, 115, 110, -244, 124, -12, 8, -218, -50, 189, -175, 113, -161, -61, 166, -107, -115, -47, 121, -91, 54, 100, -16, 163, -23, 234, 7, 87, 142, 163, -12, -199, 236, -157, 192, -244, 8, 12, 62, -79, -324, 110, -13, 81, 73, 195, -115, -106, -152, 251, -24, -185, -48, -139, -294, -162, -143, -315, -7, -84, -84, 26, -126, -66, 97, 27, 121, 112, 181, 109, 61, -17, 19, -1, 273, -52, 378, -105, 240, -200, 88, 40, -144, -3, -59, -29, -256, -205, 222, 97, 2, -120, -26, 8, 18, 158, 236, -110, -210, 54, 68, 71, 223, -360, -148, -208, 57, 205, -119, 159, 118, 71, -86, -100, -116, -74, -128, -30, -51, -20, 100, 77, -28, -254, 40]
3877D0j10l3J36j2J52k55oM5L64n74L04j3p9K21m37K07n2M08l97O5K5K8R1l16
3901a98K57Q8j65qQ3nN3N5l02j39K16k9J51J03r3J8N1j24j73J63L1j15K62k76
3925i6O2k9p5J16j10J63l29Q5O8L65k48J60q7k24K36J9P6k66K45m02J41J30P9
3948G9R1l16J55j6j36OL94l07K3J78j54R2j60q0M10k46K5n4m4O0r5J18K5K43k39
3973E2j23j10K09j06k1M5K92k36j85Q8J4k4M37j77l42J43K15k21J47l0jLj65J01
3997EJ23J80m30K30J36k84J72J18l71R3K68l07M5j3p3M0j19K0J63L7L84k78j73
4020c4k10J00K79k23N0l1o1J30J49j66K76j14k05j33K8J16J3k04K19J02j48O9
4042Bj42J04K12k34R9l88L34j12J47Q9j66J26N0j75J9j80J60p1K25P2r4j09J46
$$ y = [40, -70, -103, 33, 21, 173, -82, -88, -43, 321, -253, 51, 38, -41, 180, -257, -50, -102, 306, -91, -26, -1, 27, 118, -198, 59, 147, -18, -26, 57, 52, 105, 160, -142, -281, -65, -94, 57, 160, 67, 85, 136, 12, -161, 2, 33, -82, 180, -96, -34, -63, -138, -22, -132, 31, -298, -213, -145, 220, -28, 132, 45, -179, 57, 76, 152, -114, 131, -271, -130, 0, 79, 170, -146, 9, -7, -143, -137, 257, -50, -27, 151, -3, 89, -71, -151, 259, 13, 38, -16, -60, 0, -95, 23, 48, 291, 52, -71, -181, 28, -78, -99, -54, 238, 2, -183, -95, -81, -105, 332, 155, -187, -44, 171, -50, 97, 67, 66, 69, -96, 5, 128, 308, -122, 108, 244, -40, 132, 250, -121, -28, 240, -67, -22, -35, -108, -68, -187, -167, -4, 33, 417, 139, -34, -244, -144, 135, -88, -38, -69, -130, 0, 149, -17, 259, 145, -60, -193, -165, -49, -36, -240, -21, 81, -67, 2, -140, -36, 176, -58, 41, -347, -13, -125, 22, 111, -55, 71, 121, -54, -35, -215, -55, -126, 99, 171, 77, -32, 114]
4065A14j95l5J54J01p8m8l7l1k8L21j47J08r3j64K05r2O5l08J45R6k9j03%j69
4089b48N63p79N85K77m04M6j60J09O8o6K9k03K29K18m55J56j99O2K16K8L3P8k28
4112d5K61l69L06l06L08l6j87j42K06N1j50J60j67J28P8j10L9j15K47r5Q1j1k89
4135a57J88k27J67j63L07J55j29J18l42n7Q8P2MJ30m9k38J35%O3n3R8j83r8J34
4159c7M1rN4R9j78k0K30k61J9k02j79N03J40j25J80n6M1K3j60k36J53J58l97L13
4183I4k91J22J59l30P7N5J14J63k07K9M9j7k47K71Q0k76J61k98N15j13q5r5J70
4206A00J06k52K30k72J64O1J69k9j68l27K27J47j16o7J45k1j05J58k45R2j59K16
4228E4K28j06k67o7PJ85j33j05Q4K0J67j11J72j56K97j19k54K05o9j7J22k47L3
$$ y = [114, -81, -116, 38, 139, 61, 13, -24, -55, -83, 238, 91, 199, 106, -58, 147, 55, 120, -188, -43, 53, 24, -79, -79, -248, 315, -464, 121, 398, -6, 40, -120, -11, 57, -9, 20, -183, 46, 264, -191, -35, -234, -172, 44, 72, 105, 183, -45, 216, -153, 153, -153, 155, 119, -68, -210, -4, 47, -103, 57, -110, 18, 96, -14, 25, -90, 157, 62, 143, 132, -157, 31, -196, -29, -192, 115, 270, 141, 259, -83, -140, -52, 20, 24, 154, 105, -133, 2, 2, 65, 12, 110, -73, -171, -37, 4, -5, 49, 148, -30, -50, 180, -81, -62, -264, -443, 60, 200, 75, 255, 199, 240, 263, 103, -133, 20, 178, -219, 94, -197, -75, 84, -246, -169, -114, 0, 163, -44, -15, 34, 17, -230, 41, 121, -155, 6, -292, 223, 110, 25, -70, 100, 206, -46, 184, -88, 76, 137, 306, 277, 109, -218, 9, 156, 40, -27, 118, 97, -8, 150, -95, -3, -162, 54, 282, 176, -91, -158, -151, 34, -99, -204, -120, -100, 67, -44, 128, -28, 269, 150, -104, 101, 32, 15, 137, -110, -77]
4251g7Q0j2m2n5Q7P0j8Q2r7m00N52pm48K07J9r8L42l04J16LkR2j00L9J52k05K93
4278B69l08mJ94j5M4k9j74j18K01o0o6M1L03k96Lk04k4M39k60k31J56J60j51m9
4302a79K76l1l9k36nK80j59j64K69j02j66K45J49j22j79L05m41K38J26k1j25L39
4324B58j41O8k18J68j92J46J42l22oq7L25m9o4j60J73j35LM7KL1M4J97j16k48
4348a34K51p4q0J07l50L68q7j26K68j50P0p8J06j00K2l5J40r7o5N4k2P1o1k25
4372b27K05L09j18j52j73L08k37J42n4K1p9r3k1nM02j41J90k42j61K6J13k76N40
4395B77l78K48K9rr3j54K62m37K42j19K24M3k34J84Q1l40q6K89M9N1k68L20m01
4418b20J04J35j45K61p6j41j36J37n1J43O0m9j55N24l96o6J29k20J49J24K3k21
$$ y = [-77, 3, -9, -51, -106, -19, 51, 33, 115, 18, -382, 170, 163, -285, -78, -59, -157, 185, -119, -3, 0, -2, 90, -10, 29, 181, -24, 269, -39, -43, 151, 136, 180, 151, -23, -141, 60, 0, -66, -25, 278, -18, -15, -219, -243, 196, -64, -295, -139, 21, -130, -179, 97, 66, 27, -209, -214, 66, -93, -257, 12, -90, -256, -11, 138, 16, -163, 142, -299, -61, 65, 44, -81, 258, 117, 185, -33, 135, -57, 89, 231, -91, -97, -184, 141, 92, 28, -132, 41, -94, -91, -44, -42, -11, 33, 230, 114, -134, 117, 43, -37, 70, -280, 88, 1, -125, 143, -7, 63, -15, 91, -9, 13, -22, 118, 21, -44, 10, -12, 59, -2, -227, -22, 287, 169, 17, -156, 152, -85, 57, 3, 24, -55, -148, -169, -174, 228, 87, 277, 35, -126, -100, 13, -263, 277, -101, 147, 176, 167, 74, -80, 182, -255, -13, -132, 92, 135, -99, 85, 166, -174, -260, 29, 78, 129, -139, 181, -220, -116, 19, -126, 135, 59, -82, -218, -81, -132, 11, 71, 22, -133, 391, -5, -71, 58, -162, -13, 111, 134, -87]
4440h7J61l24M00l31L4K54j81K43l47K27n2J21j51m6K42q5j96L6Q1r9J15L7J22
4463A74k32L86k38k98O3L88k19nP2r2J44j92nJ94l0q0Q5K5m6j35K23l4N7l12n7
4488a64K8K80m5M0k17j8O3J63j9n55M35Oj99L13J31l07J27P6l22K12p9J89k87
4511a49J41p3J00o2n9q5J82j00P3P7j99L26l20L81q5l77J20O7L0j90M29m41O5
4534a49k7K6K37P3j64q0J06K10j98k8K30k52k04K09O3mj08l9J6K48j68J1J24k7
4558A05k70K00Q0j06R8j66J29l45M78j46J00j33k50L78l96K52j28M6K99j59j21
4579e5k4N7n0j99L76l29M80j8j02l04K32K9j56J71p5k9P6j95J59L6j8l17J30L01
4603A76q5m6k11L67j17p8j33J33J93j00j35m4J36M7k31K24k00J85k74J08J39J13
$$ y = [-87, 74, -250, 150, -181, -147, 107, -74, 169, -178, 49, -3, 118, -33, -79, 163, 78, -118, -82, -1, -100, 15, 52, 174, -58, 328, 90, -208, -145, 243, 24, 19, 91, -1, 143, -49, -54, 140, 110, 30, 115, 140, 94, -41, 182, 148, 205, -107, -164, -136, 144, 99, 139, -78, -96, -33, 130, 111, -444, -9, -3, -202, 111, 242, -65, 62, 138, -184, 28, -51, 138, -149, -8, -81, 19, -43, -102, -187, -5, -105, -32, 45, -154, 172, -148, 233, 148, -229, -109, -42, -12, -202, 227, -214, -149, -176, -150, 87, 160, -4, -84, 22, 232, 34, 6, 236, -16, -220, -11, 52, 48, -60, -99, -83, 165, -3, 8, 132, 105, -165, 35, 115, 9, 107, -59, 70, -275, 203, 57, 157, 24, -226, 152, -244, 8, -120, -74, 225, 66, -55, -79, -22, -72, -271, 105, -224, 256, 238, 136, -168, 64, 93, -63, 108, 33, 4, 80, -115, 44, 80, 62, -255, -125, 176, 91, 45, -166, 201, 84, 6, -127, 6, 199, 99, -36, -80, 56, 103, -128, 96, -104, 81, -193, -85, 54, 167]
4625A67m20K19o7L67l7j59j57M07m17J72k11J90K4j29J41P5j31k1Jj23J03j83
4647a89J90k65M32l3j17k44M37l87J88j43J09K53m80jJ89J65j35R6j99J62K0P4
4669A22J70l60J45j50j10n3L34j41K99l30N0j51J83J39l71J95J55K9j14n2J68
4690A57j31j09J42k38K98j76J18j36Q3p2J89j0j54k7J31j12K67Q5l68K09O7j79
4712C4K4k2L1N6l00L07j09k69J59K80j06l49N90k39j21j8J42j30K03J57l70K59
4734B09k83m7J15j60K31K78j77k82n6K6J8J37MoK73l56j45J1K46K18k20J35j99
4757c0K5P1j56J52k05K38k09K47m46K78m7J52j90J86Pj36m5K41ql18R7N3J1J69
4781A37j78R5j85K08n2o1P7M8K11k65K02j71j52n9J81m4n6J42l0k4r3J71M3o4
$$ y = [167, -253, -34, -101, 266, 229, 70, -87, 320, -97, 75, -136, 54, 78, -51, 90, 165, 34, 13, 14, -109, -6, -189, 1, -264, 168, 135, 18, -226, 211, -176, 12, -131, -22, 231, -249, -250, -61, 104, -31, 65, -134, 28, 48, 122, 292, -68, 77, -73, -183, -236, 98, -43, 256, -74, -24, -175, 8, 147, -224, -29, 126, 155, 41, -11, 157, 26, -83, 59, -179, 119, -57, 61, -75, 8, -64, 125, 115, -39, -66, 65, -47, 220, 305, -63, 146, 213, 34, 58, 36, 67, 123, -177, 130, 21, -248, -89, 191, 85, -264, 326, 87, -34, -52, 90, -40, 163, 320, -50, 209, -74, -121, -6, -166, 65, 343, 166, -116, -172, -146, -128, 9, 13, 7, 280, -76, -221, -210, 36, 254, 34, 169, -30, -5, 66, -90, 62, -143, 95, -114, 133, -313, -35, -82, 70, -120, 66, 73, -63, -108, 133, 125, -193, -96, -43, -32, 137, -41, 54, -131, 77, 25, -36, 41, 89, 300, 35, 237, 66, -86, -145, 36, -8, -64, 78, 48, 24, -69, 102, 145, 81]
4805H1o5J85k81K28j25j20K24k67K31j07j26j11J14Q3k14O01j88j28l7mJ34j92
4827h4L00l39L25j09l4j91j20K93j39M9o8P6j64J50L2J87j63O0J42Q6l36J22j70
4850i5K25Q1l33J16J29o9j13l4K03K1k20l5K85j62l10M28l61P8J11j1l2R4K23
4873B19l07j1J56j5j08J38j9k45N00j26n6k1q1L61k93j09J12l39J32J02j19J48
4895A9J86j53k0J95j41m2j39J03m1Q3o5p1K02q0j49J13Mq6K19p3l6K5k09K03o9
4920b2R4N2Q6p4j18j19J10J60j68m6k24k6L0L3L79O2m1j5j65R6j33l0N5M4j04
4945h4r5k9K60R0k50J97l32L28K0k53l8N4K22j77J91J52k27N2q0j81J40J17k74
4968a97J92lN5J71k77RP2j57J94k66J39J49k76J54J13L5j70O5j34L2r3k3K26L23
$$ y = [81, 16, 201, -80, 148, 23, -97, 127, -140, 91, -16, -142, -253, -139, -56, -270, 331, 143, 15, -22, -26, 108, -84, 216, -123, 202, 93, 59, -132, -252, 41, -98, -49, -117, -41, -205, -55, -23, 164, 1, 61, 203, 289, -47, 75, -95, 130, 211, -122, -6, 123, 54, -59, -93, 110, 131, -89, -124, 161, -1, -311, 117, -244, -166, -55, -66, -98, -4, 219, -88, -99, 57, 42, -66, 72, 53, -192, 308, 182, 126, 105, 24, 385, 92, -17, 95, -244, -112, -10, -129, 19, 205, 52, 32, 227, 86, 44, -95, 8, -33, 50, -15, -86, 116, 36, -113, 0, 4, -82, 137, 64, 28, 53, -156, 47, -22, 72, 124, 210, 136, 18, -101, 9, 169, 1, -45, -269, -295, -265, -232, 147, 209, 168, 153, -12, 84, -49, -79, -24, 20, -84, -179, -208, 52, 142, -108, 89, -243, 85, 105, -148, -186, -132, 90, -87, 104, 256, 29, 81, 1, -180, -40, 77, -197, -5, -8, 47, 218, -59, -50, 22, -135, 59, -207, -68, 81, -195, -41, 72, 107, -63, 2, -132, -100, -193, -216, 10, 333]
4992C33l57k66M52J23l74K86j57J47j23j22L7j94L37N7l75L8K27J08k01k4n4O2
5014d0N6q9K80k19j65N8L01l25K51j50K84j91k51N05k88J96k94Q9M7K9k48PN2
5037a05K03l12K79J9Qo4j06J64j36L0p6P5r8L15K9j20j75k73M95M4o6L13k60J47
5061C30l13O3L1o5NJ28j48j07QK49j67P9j18N9r6K01r2o1P7lL5j82LL19l83L51
5087B03N9k64NM1J19j55k5J21j48K91l39n9K9L8J70j09P1p3N27l97j54l7M3O2
5111A9J91j29p5M6p0L2k19K62j01L24k78r5K20q0J68k40j84m5J06O8l4K6j70J04
5135a54m3j7J89J41K78m17J72k31K36j39k40K28j03q5K37q5J76j91P9K1j08j09
5157a65J14K24l22N9K30r9j22k60K01K56j42J59j03j83K00k95K78L2p9N3n3m2
$$ y = [333, -24, -290, 162, 285, -89, 197, 40, 187, 64, -58, -21, -215, 122, 179, -196, -158, 69, 177, -24, -48, -102, -40, 16, -73, 207, -12, -177, -119, 182, -143, 108, -42, 242, 51, -200, 305, 17, 213, -81, 8, 55, 84, -164, -157, -105, 98, -214, 65, 84, 92, 28, -78, 86, -50, -20, -96, -21, -119, 196, 225, 105, -70, -343, 152, 196, 130, 443, 183, 330, 17, 80, 111, 46, 51, 179, 31, -76, -68, 181, 14, 93, -25, 34, -62, 139, 47, -14, 63, 60, 95, -87, -84, 235, -148, 203, 262, -2, 3, 44, 163, 8, -17, 104, -44, 247, -92, -151, -122, -84, 86, -23, 48, -25, 502, 105, -49, -86, -43, 19, 210, 81, 6, 52, -18, 14, -205, 57, -44, 280, 2, -93, 127, 47, 215, -25, -209, -254, -148, -80, -114, -88, -258, -154, -197, -214, -25, 116, 394, -23, 149, -82, 154, 15, -225, 3, -100, -185, 52, -33, 143, -48, 31, 52, -56, -165, -51, 173, -149, -90, 140, 41, -81, -341, -140, 116, -26, 133, 30, -153, 47, -248, 30, 62, -17, 36, -17, -59]
5179e9Oq0J59n4j75k6K71J3j54K54j09m3M9j48L15k89J98k26K41j87J75l2j95
5202i6J29N0J34k03j34Q6J0K8j2k1K5N7j32J04p6j81J83J50j49K00k01j98K43
5225dk2M4M4J5j12kK59k06j93J63l7p7R2N4K18l0p2k24o2K36j8J25r0k4j24M4
5251cj44J58L0K40m53l2O8JL3L29m09N0L62k58j53l3J35P5Q0Qj31k8p2K39K45
5276C37j89k21j5K74k33K02j9k47M40O0m01P0k4k55J64pQ0l01L87k00J68K20j90
5299A00l45L28m24L29Q0j50J68J7N1k63j80N69k68q1OP9Nk1K39p4j15l9j3j63
5323a65j11M50l04J37k33K34Q1j90J65k6l0p5Q1j69K83l0k3q9P2k33K99k11L3
5346e4R9k0J95l46K59m29N48m69K55q9k01L07K56l54n7K9K38l57J89J18j7k05
$$ y = [-59, -53, -133, 26, -28, -203, -229, 42, 55, -99, 155, 46, 3, 52, -96, 219, -70, 128, -98, 143, -44, 131, 99, -96, 33, 83, 217, 14, -120, -34, -24, 4, -8, -29, -4, 53, -79, 25, -51, -232, -49, 101, -48, 152, -49, -247, -4, -26, 18, 62, 77, -35, -37, 222, 16, -177, -14, -51, -128, -36, 18, 236, 206, 134, -90, -152, 84, 66, 191, 101, 77, -47, -3, -147, 11, 41, 281, -172, -204, -136, -135, -102, 227, -182, -132, 230, -28, -181, -214, -79, -4, 76, 84, -47, -75, -147, 92, 337, 148, -73, -88, 186, -47, 155, 136, -111, 329, 389, -12, 58, 34, -221, -57, -64, 16, -285, 102, -98, 70, 290, 100, -245, 83, -341, -12, 68, -82, 86, 103, 154, -109, -289, 280, 12, -69, -63, 16, 21, 0, 239, 165, 50, 11, -2, -165, -276, 174, -130, 7, -226, 8, 89, -101, 64, 38, 8, -67, 14, -155, 128, 98, 75, -14, 58, -175, 124, -87, -54, 45, 25, 220, -126, 133, -296, 252, -217, 38, -51, -252, 55, 311, -43, -100, -71, 167, -190, -1, 117, 100, -105]
5368a05K29N0l65L24k18j50rL32K2j40J9j21J33J68j12o8J04l51L19M8k07K26
5390A28k44r9O9J25j48J93J0L44l38j53J57j58J87j60K10k9J25k85J71n0j46L04
5412B13k17l4J15j01K68l16L59l34j70J68k5jK65j35O6n4Q8j39j48L34j35j43
5434g6J07QL5N8Mp6j76J90k27K16l99J85k5K40p7l40K04K13k00J39p9n7K64k14
5458h3K12j00j5O8J4L7j33j48q5K37J46rq0J26j61mo7J97m39J80J52k34M4NJ04
5483c6J27j84M2O1j51j96J46L46j78k34P7j7N7L28k70j06M94k17J57q5l50L16
5505A27o1L2K6k62j4J53o2K17r1m9kLJ87k51Q1O0k27J13K74k54j60L3K29M1M5
5530A88n44M71L1k97L04k56J14J10k72K34m05K88J80k9k91N6L02l79J99J33k75
$$ y = [-105, 124, 174, -191, 133, -85, -235, -244, 88, 110, -30, -11, -132, 1, 169, 57, -11, 93, -258, 61, 109, -98, 128, -116, -215, -146, -21, -169, 24, 34, 378, 40, -113, 44, -114, 73, -87, 123, 94, 219, -66, 105, 55, -91, 213, -4, -38, 77, -24, 244, -72, 287, -47, -217, -49, -74, -75, 190, 55, 121, 67, 155, 16, -132, 202, 67, -76, 31, 39, 74, 132, 136, 60, -116, 74, -153, 63, -336, -151, -176, 64, -13, -353, -149, 64, -136, 3, -76, -133, 131, -83, 129, 29, 14, 82, 96, 133, 0, -148, -233, 4, 150, 141, 61, 187, 26, 22, -45, 152, -287, -107, 45, -189, -145, -140, -36, 91, -93, -51, 10, -141, -337, -191, 155, -23, -257, -180, -197, -140, 188, -82, -188, 306, 89, 246, 161, -189, 127, 66, 98, 124, -138, -152, 1, -61, 156, 65, 16, 14, 17, 204, -47, 34, 94, -133, -20, 254, 0, -160, -127, 102, 143, 188, -356, 115, 146, -151, 153, -103, 11, 121, -151, 83, -322, -34, 146, 117, -174, -118, 184, -195, 4, 137, -138]
5551a38J73J02j64j43K94j61K92L6m58R4K43j65jq7J12J30k71J5J96j17j02O1
5573e9J36j09R8j04J60o5l2j61J94k24K82j81n9K10j32K34m2j59J09j54r6k06
5595c60L14P7r0r9K19n1n6K38l42M0K3J17k24L92j22k27p9K58n5J41k74K49k62
5618a73J86l2P8M6j74J09O8j63K71j39j57n1o4K47q9p8L17k27K10m51K60o1P5
5641HJ05l7j38M7J59l95M63k29N7k12J24L28m64K86l9n2J69j22R0o0L2l03k8K12
5665AJ5m7K73k52j29M9L20l64J14pj20K23nK7N1j04j40K01L4l22K64J13k98L41
5689B38J08m73J79n7k05M79m10J25L20l14j91K17r8rk07L01K2n4K0M1K9n8j61
5712a58K02j49K0J77K54l56mJ29l14KJ90K18k22K37k36o0j08J99j43q7J60QJ67
$$ y = [-138, 35, 137, -27, -170, 124, -37, 255, 291, -167, -73, 170, 5, 4, -83, 29, 159, -112, -97, 99, -18, -120, -59, 77, -32, 66, -38, 122, 57, 25, -136, 58, -166, 116, -65, -124, 86, -46, 188, 146, -13, 96, -58, -154, -360, -46, 31, -59, -158, 61, 10, -46, 192, -150, -110, -87, 30, -194, 198, 76, -151, -230, 28, -27, 114, -160, 89, -173, 13, -19, 59, 105, -69, 40, 108, -55, 216, 77, -80, -131, -195, 52, -37, -115, 202, -25, 185, -266, -6, -67, 8, 113, 76, -62, -15, 144, -251, 212, -17, 40, -172, -48, 280, -184, 102, 63, 11, 180, 58, 148, 88, 120, -183, -211, 1, 16, -31, 242, -10, -139, -90, 230, -134, -20, -27, -147, 76, 71, 98, 149, 45, -95, 106, 140, -182, 82, 195, -103, 238, 346, -127, 52, -5, -210, 269, -141, -16, 304, -10, -201, 16, -82, -91, -298, 3, 25, -29, -9, 32, 61, 3, -158, 44, -105, -85, 92, 346, -10, -14, 115, -199, -197, -7, 211, -11, 226, -10, -70, -178, 21, -122, -209, -49, -41, 126]
5735A26j26M2O6k47r8J83K77j09Kj91O8L6j9M7k03K32k5k93K41k6j9q6K27n2l54
5760c01L12j13J63O6j17q7j61J07j76N43j63J64n51J52J57O4J50m07L47k23n7
5781a31r8M86j38k15J43Q7j49j21m1nQ8K08j4J44n2k17k92N07j49k78R4J49J2
5804A8J5k43K53j17o8j51J61L5K75n2j05J26j78N1j01L5j89N15k74j33K45j14
5826Dj49J17J39K8j87k7nO7R3K11j80l45J69l2o0K00j0p9K63O1k43J23k51QM9
5851c6K8J16m30M99j16j75J40J27m06J62MK10l0o9J49l78R2K03j39L13m3l86L67
5874B02j12j4J79k87J13j50P4qj35M8K03J61m86L43r7P4p3J97l34Q1L7J24r0j48
5898i8j7j49K77j49K65l58J81K3Q8k4q3r0J16r2M1r8J5n2L04j07K57l11L46k01
$$ y = [126, 0, 42, 108, -139, -237, -54, 223, 114, 116, -75, -7, 29, 10, 57, -146, 86, 61, -232, 9, -17, -36, -122, 105, 53, -301, 11, -102, 61, 127, 10, -77, -238, -131, -307, 236, 73, 237, -314, -162, -5, 59, 209, -198, 149, -74, -131, -229, 257, 119, -96, 47, 134, -15, -136, -177, -182, -94, 114, 100, 244, 192, -25, -317, 190, 41, -237, -143, 6, 18, 33, -210, 43, -74, -142, -293, -132, -97, 178, 126, 21, 147, -31, 20, -81, -46, -235, 280, 6, -127, 118, 4, -145, -28, 111, 139, -48, -75, -80, -13, 80, 291, 111, -234, -65, -97, -157, 43, 33, -46, 217, 278, 35, 158, -93, -85, -36, -8, 108, -322, 177, 61, -114, 26, 153, -253, -91, -87, 123, 93, 24, 173, -205, -113, 90, -49, 264, 221, -165, 202, 90, 76, 255, -32, 81, -69, 5, -3, -138, -90, 113, 274, -212, 131, 34, 108, 35, 232, -102, -21, 16, 140, 50, -98, -115, -264, 13, -136, 129, -229, -48, -25, 63, 39, -44, -134, -18, -110, -69, -167, -152, -204, 100, -7, 250, -61, 285, 84]
5922H4j38k1K15m0k38q7N2J99O4J26m70K55j23K7J57k48J47p6L8j91J99J25j35
5945g9j31m7L02K70n57L76m15L91m6J55k91K14j98J33o2j45J2O6K79k81L02k07
5967D1J2j8M1l03o5K60j85L11m8o9j41J36m8j35J18K21j2j28J44j00j22K24l37
5990b03P1K14r9K15l24j34L89j30Q8k67J07K15k62Q5N2J8N2j23r0K30oJ73j25
6013A46K19j86%j33q9J76j37O1j23QK02k77O2J0n5J23R3n6P0o5O7j86J14K14k88
6038c0J36j50J3r5J28j52J59k1J19l0l4N3N5J07l2j98J29P8k14j3PJ91m17L61
6062A50J27l18K7J11k20J24j22J1J10J4M3j67L60p9k09M6j86N50k56r3j05P4L8
6085C0R8o9p9J06k5J25k55j97K54k3N2K11j60m6K99k42k00j03K67K6k9%J81j35
$$ y = [84, -54, -75, 140, 100, -138, -225, -173, 26, 90, 216, -254, 1, -122, -95, 62, -186, -39, -115, -77, -268, -69, 56, -79, -210, -257, 45, 315, -242, 134, -281, 110, 64, 219, -72, 142, -56, 77, 15, -130, -118, -52, 227, -54, 248, 41, 53, 35, 76, -227, -292, -32, -217, 94, 46, -23, -164, -28, -76, -211, -93, 128, 116, -12, 132, 32, -90, 134, -203, -132, 82, -17, 198, -126, -260, 129, -1, 87, -180, -73, 142, -120, -35, 17, 35, 87, -36, -126, 104, 98, 271, 146, 365, 179, 179, 46, -43, 133, -4, 57, -66, -58, 144, -133, -71, -61, -116, 7, 100, 44, 114, 49, 116, -70, 44, 258, -30, 106, -44, -31, -126, 2, -150, 9, -12, 107, 77, 43, 96, 151, 258, 226, 28, 157, 235, 21, 8, 15, 206, -211, 150, 277, -41, -14, 97, -123, 1, -121, -110, 0, 14, 57, -110, 250, 171, -38, 8, -178, 372, 116, 23, -82, -8, 30, 128, 59, -20, 86, 61, 186, -69, -266, -12, -35, 17, 228, 68, 22, 321, 79, -121, -224, 43, 69, 40, 40, 221, 86]
6109H6Q7M8j78P2j72N3M5qk9j1j57L34j23j25L78n03L08p0r0Ko8J75j39oO6J15
6135I0K22o51N24k93K55J02l75J15J53k52K4L4p6J40J04m0O8k7j48PK18j57L7
6158G4j80QP2J06k27P3j3J82J46l5k23j90K04l17M03j80R1R3j97J03o1J98j39
6181iM9j97K36P6j50O8J15m09L21N1J43l55J30j84J08j77L24j94J16k21M26k29
6203C8J6n3j69K68L0N5k44L12m06Q4J09K60k59j62M75n03O2r0J26K70%j13q9k9
6227a2N0k9j30J5J02R1l09K93m77K90R2PJ75J33j18j03m1K44l22K71l37K06k99
6250b08K18N3k2l1RN5J1N3j23j17MK55k63K64k26j04J65j80n9K02k09P8M13j15
6274A23Kk88J10j05L7k4K28J45j42m42M44J1j2j9j07J82J32k06j47j58K18r4j47
$$ y = [86, 173, 221, 43, 115, -57, -4, 41, 33, 4, -7, -164, 170, 47, -78, 300, -203, 105, 35, -55, -53, -121, 54, -85, -91, -25, 90, 312, -339, 185, -108, 147, 249, -126, -11, 142, -110, -86, -52, -128, 12, 116, 76, 144, 117, -31, -24, 194, 37, 74, -106, -98, -26, 80, -147, -74, -87, 95, 241, 206, -17, -207, -3, -320, 83, -97, -6, 87, -110, -7, -68, 130, -9, 40, -157, 79, 155, 5, 73, 188, -221, 100, 151, 294, -61, 69, -115, -7, -184, 140, -54, 62, -159, 267, 38, 54, 1, -168, 100, 130, 185, -59, 253, -153, -69, 40, 300, 41, -121, 354, -149, -87, -177, -51, 219, 219, 106, 17, -12, 38, 9, -121, -106, -4, 87, -222, 71, -406, -116, -24, -17, 158, 291, 173, 70, 29, 273, -49, 222, -115, 91, -208, 10, 63, 41, 10, 19, 74, 85, 138, 15, -102, -98, 157, -106, 158, -68, -172, -7, -187, -246, -44, -253, -175, 238, 123, 125, -163, -53, -158, -121, -145, 83, 228, 86, -356, 88, 99, 87, 68, -39, 143, 275, 69, -78, -236, -18, -112, -259]
6297b59K46K94j07j66k9j5Q5n4M5m7j66m1M22j62l45M89Rl07R4j60J87m0JJJ15
6322I0m92K71O3O0J87o6j29P6jK26j79j01o4K61j9j14j5k29K85k70L32j57j97
6345a82K53j67j11K75k03J47K93N0m66M2O3p3J42k17J51j34K61k01R2J46j43O9
6367H7j52r7J66j56M03k77K1o5J85J36l36R0J83j84Q8M5j08j45N3M8L2R0l5J26
6391A98m7k07J38m9j42R3kl3L15m6l31k0K74j57J07k24J25P9J33o9m04L61O4m31
6415b75K37J17r1on2o8K11QKrj37o4J80oJ38j24r3P3o1L3q3J46j66l8K54m0M3
6442A29J04k03m9L7M3j90J93o2n7J70n6k7J48j81r4N2j00L88j33K4j31q5K94j71
6466D3j23J09P2j0j03j56K02J75K1k05k3r9K5J89j39Pk70L94j8l38K47n6k55K33
$$ y = [-259, -13, 281, 174, 8, -21, -36, 49, -5, 40, -7, -173, -214, 208, 46, -299, 190, 199, -108, -14, -174, 13, -27, -26, -25, 90, -402, -131, -68, -8, 179, 113, -16, 60, 59, 285, 106, 5, -59, 202, 183, 69, 54, -175, 110, -160, 172, 15, -182, 71, -96, -207, 68, -135, 12, 305, 355, -111, -69, -6, -79, 63, -154, -3, -137, 124, -77, 15, 161, 18, 87, -65, -162, 4, -152, 251, -26, -5, -70, 115, 251, -85, 5, 188, 4, 92, 137, 29, -116, -63, -15, 17, 107, 72, 198, 151, -56, 82, 33, -109, -16, -18, -51, 264, 218, -113, -133, 141, -16, 91, -133, -8, 71, 204, 135, -269, 92, 156, -275, -38, 79, -12, -18, -70, -138, 73, 81, 83, 74, -63, -127, 53, 47, 185, 61, -32, 41, -20, 13, -70, 76, -90, -128, 126, 86, 129, 233, 30, -19, 18, 61, -129, 64, 2, -55, 115, 59, 32, 180, -1, -95, -43, -143, 245, 112, 136, 5, -80, 214, 43, -80, 29, 101, 91, -12, -168, 34, 209, 230, 25, 2, -97, -72, 117, -22, -15, -285, 109, 91, -247, 0, -56, -311, -78]
6490g8K02j72r2Q5m1j2K5J38k20L26k44m7L30q0r4J27j46k18J65J78j14j23K35
6513A30j76J82P1q8p6N0l8M3k17J81m9j4M7k04J57n6K2N5J07l67J90j41M06k32
6537a7N3k14N26l49K05%k01J95m33L08k04K83m64M44Q8l89L44l82K36j7k5O6k65
6560b12L6Q9J51j83K02k61K17Q5k13M19k12j50K4K47l43P3M9O3r2j64M8J84J99
6583B56l60J91j15L2j93Q5O1J37l6Nk34J32r1OK38L6j65O3m15N26l2k75J87J85
6607B24m27K07Q9l03Q6j05J96N6j96J75J03j58jJ0K49j66O7k05j98J45J80j46
6629a18J07P6j09J3R2j54J06k25R9MK7L2j30K58K7j47Rj33L10k3k08J59J68k99
6653e9Q3q8K80j59j29K27L5n9j27L1QR9j80P0j67K31j10Q7o4P4o8n2P4J11j8j59
$$ y = [-78, 124, -48, -140, -55, -96, -108, -83, 55, -165, 161, -83, -130, 200, 120, 26, 153, 7, -211, -46, 132, 18, -105, 130, -46, 136, 207, 119, 43, 93, 55, 98, -119, 62, 13, -1, 46, -158, -1, -57, -35, 20, 127, -240, -50, -191, 215, -17, 36, -178, 348, -1, 204, 204, 3, 198, -235, 73, -131, 152, -312, 132, 220, -169, 175, -207, 29, 12, -13, 53, -212, -176, -87, 64, -119, 83, -178, 39, 124, -89, 330, 118, -32, -8, 239, -104, -31, 18, 81, -11, -175, -127, 57, 256, -104, 87, -28, 4, -189, -104, -43, 94, 58, 63, -171, -39, -130, -124, 114, 150, -15, 48, -367, 159, 127, -148, 39, 224, -203, 4, 93, -210, -124, -229, -33, 23, -173, 2, 105, -53, -54, -44, 205, 39, 106, -99, -297, -152, 28, -118, -11, 65, -44, -31, 61, -93, 13, -212, -113, -109, -82, -50, -180, 78, 105, -42, -33, -166, 144, 121, -87, 72, 240, -59, 24, -64, 216, 57, -72, 155, 190, 131, 4, 35, 43, 142, -38, 32, -135, 96, -14, 73, 9, 83, 15, -37, 37, 148, 130, -29]
6679b9K29J09l86K06j93K03K6l65J32j02L6L12l46L03mr0j73q2J51M7Q7j75Q8
6702a6m9K6J36j70j44L72k30J43k7j32K55K5m05K23j1j77O7q7P6K09p4j27J21
6725DJ2o9J51j67l33O83M9k84l7k0K65j53j52O2J59j31k1j64l6K92j2k10K41m
6749A25m0k69K59l24K35OO3RL8j46K57j13o3N1J07k19j2J54j09q5j7L4J17l2L6
6774F2j15o0J79L1j44P8O2o2J13j44j07k4Q7n3K6J65j94rpJ65O4j70j02J92j67
6799a34O3J94l20J87o8J31j41N4J28J0j44N4O0m4N4k20K55l02K68o8r4J67k41
6822a51K30o3K76l33J42J49k64k16L26K3j13J36j26r3J68k46J17K04k37M2Q6n9
6844bJ72k49J58n1l4Q3j63O1K02l2j30J95l35K60j00j29oR3j30P6R2j92L0N2l1
$$ y = [-29, 200, 309, -77, 129, -64, 139, 165, -200, -68, -170, -134, 178, -168, 135, 131, 41, -132, -214, -63, -16, 71, -104, -16, -65, -39, 97, -73, -217, 155, -75, 68, 41, -91, 164, 189, -216, 7, -4, -181, -114, -201, -125, 84, 10, -117, 4, 16, -53, 98, -69, -402, 281, 330, 46, 9, -11, 254, 101, -51, 11, 170, 39, 18, -146, -182, 110, 98, -112, 129, 125, 85, -184, 75, -249, -14, -8, 55, 64, 102, -44, 213, 100, 37, 88, 195, -24, -36, 118, 9, -76, -93, -59, 58, 26, 62, -53, -113, 66, 97, -47, 31, 93, 31, 144, 0, -107, -131, -44, -97, -71, 94, -100, -109, -116, 49, 113, -57, -159, 33, -134, -71, 123, -197, -10, -78, 53, -88, -34, 94, 104, -40, 14, 74, 30, 84, -136, 119, -183, 85, 17, -77, 90, -151, 79, 16, 292, -41, 101, 250, -14, -230, 96, 119, 6, 142, 16, -77, 91, -155, -38, 166, -71, -29, 57, -2, 170, -79, 79, 28, -6, 77, -86, -25, 177, 145, 15, 210, -125, 135, 35, -94, -100, -7, -137, -61, 31, -161, -131, -79, -110]
6869a10J70k16K76j46R3k5k18o6J27L2K0l8J05nj13L84k33l70L63O6k69n0J28
6892i5PJ46k32K1R0R1M6r6L7j81K23P7r9k81M11rj97j1J9J42k32l5K07q2J31N4
6918A52J5n3l22K11j58J04L17l11n7k0K60R0k74P1K8j45L83q8j20k10J26J37k05
6941f9J02m8qj09J77Pq1k1J00m0J14k21L43o7l72P22m80J66j90N0k17P3k95L40
6965b4J23J8j88J00k39j45M20Q4k03o0J49lJ45j33j55m8K46k72J89m6p1J00K3
6988A0L3R9j63j36J78k67K99j38M4J22j36J71j30J17o8M8k87L10r1o7Q3m0j03
7011a12o2J21r4m5J08j4r6lL60R7l54L1J46j49R8J08j37j06K19R9pj04j76M21
7035C49m09N2J58j02j09J24M4P8j52lk22N3L8J12Q6k19L83j44k35K98l59p4J83
$$ y = [-110, 60, -156, 120, -26, 67, 42, -176, -242, -115, -83, -63, -101, 4, -1, -114, 270, 37, -333, 30, 96, -173, -223, -95, -88, 58, -174, -153, -63, 28, 74, -22, 15, -166, 57, 134, 35, -246, 165, 156, -41, -52, -33, 109, -123, -158, 49, -33, 98, 152, 167, 114, -208, 3, -155, -51, 266, -45, -102, -122, 138, 228, -46, 25, 53, -92, 291, 203, 83, -127, -1, 136, -69, 33, -15, -23, -132, 45, 52, -29, -50, 50, 10, 124, -97, 246, 179, -193, 529, 49, 215, 25, 75, -142, -69, -364, -24, 99, 117, -71, 29, -210, -355, 65, 149, -54, -114, 35, 32, 177, 44, -111, -159, 87, -185, 4, -42, -113, -13, 10, 43, 142, -21, -157, 21, -246, 53, -85, -41, 81, -55, 116, -14, 103, 35, 83, -204, 106, 15, -52, 31, -9, -112, -174, -53, -147, -192, -84, -98, -194, -197, 163, 260, -94, -63, 83, -66, 32, 140, 3, -103, 116, 215, 208, 104, -72, 349, -60, -8, 150, 48, -61, 63, 107, 185, 33, 30, -192, -139, -101, 11, 97, -122, 261, 117, -118, 180, -179, -253, -70]
7058g0M6j41KM17l39K58j54K40l32P2j15J0RO2J63O9j70O8N1j17k02M3L23k07
7082a4MJ25k58L45q0K6j26j78K78j18Q6k8J1k01R8l09N18R6l45J43K2m1m1J36
7106A49p0k03K68k03k8K16l8j84J40j74K91j4Q3m43J50J47K1j63k42J95K95k31
7128c8M8l8m41L88K01n5J00N4l30j9N7K4N7j0J09k75J93K24R3k78n7K5J14r0O
7153F2q0j03L14j37K16j69q5P2j25K48q8l37J66J52m3j01J63k02J14r5O5L19k34
7176I2o1o5J51Mj04J12j82K2p0K66n27M49r3j41N1o6Q5k07L87j1Q6j64o0J45j18
7201a9L05k50N7j28J95j9Kj3k66J38O7k71J82l6j73L32p4R5j52LJ90k8k65j4N3
7226h9J18k2L6j18J73k41J77J32p3M1k23J22Q5m9N0o9J51o8N6l84J46M1m2L9L8
$$ y = [-70, -24, -165, -163, 254, -85, 173, 19, 259, -73, -1, -116, -106, -97, -35, 128, 197, 27, 95, 146, 29, -173, -130, 193, -14, -10, 115, -143, 202, 122, 148, 22, -156, 122, 4, 90, 62, 73, -128, -30, -339, 179, 275, -70, 73, 95, 54, 13, 149, 79, -124, 144, -59, -87, 129, 91, -93, 47, -127, 164, 150, 233, -210, -60, 87, 108, -55, -297, -102, 193, -38, 10, -28, -469, -81, 120, 65, 165, 219, -111, -130, -73, -49, 8, -2, 107, -168, 25, 249, 342, 64, 7, 32, 146, 56, 62, -18, -121, 193, 56, 272, 103, 18, 90, -35, 213, 125, -212, -46, 106, 63, -38, 125, -77, 37, -58, 7, 326, 92, 31, -34, 117, 121, 17, 129, -53, -31, -101, 165, -362, 87, -6, -147, -96, -162, -77, -284, 103, 92, 178, 14, -46, 99, -19, 286, 36, 93, -35, 160, 141, 143, 130, -136, 2, 69, -202, -20, -56, -229, 103, 29, 124, -28, -25, 165, 137, -128, -142, -89, 29, 7, 43, -75, 98, -143, 34, 166, 93, 134, -89, 33, 118, 69, 119, 50, 201, 133, 189, -195, -49, -8, -50, -11, 27]
7251B7K5R3l20M0j37M0N49r0m07J31O4L5j18j31J60j22R5l8L8m8J9j14J15J13
7275A9J06j00j05Q2J1J56j45l0j25J59j80j79L17J24Q8j45p9r5J34J5J3O2Rk18
7299a06P6l8K5J35P9p3R1o5j15p3L25k59J60j17K30l23J25J5k8j98K54O4j58K67
7323B93k08N2k59K84k07q5K68j01J21k14J55j72J47J77o08L53j60K57m47M01j54
7344a07J22k08K07OJ25k26R6R7k03J90j70M76p01o6N78k97k1J08o9K18j90j91
7366b26j57N03k3J9j64r4N1j46J89K69l92M6J76J19j65l2K24p6L1Oj97J68n07
7389c78K67K83n0k01L11k47N8j29P3j52L91k55L12l61J35k34L27k26K56l76l3
7410b29N81k77k7j69J97K82m55M4r5j24K94J5j93L58j92k81K50R9k34K44j86L46
$$ y = [27, 52, 145, -175, -135, -272, -232, 317, 227, -180, -49, 15, 50, -68, -199, -39, -161, -66, -104, -66, -114, -95, -209, -94, 19, 125, 25, -80, 2, 13, 169, 24, -6, -131, 28, -152, -331, -14, 110, 198, 53, -26, -121, 13, 28, 41, 103, 112, -106, -30, -68, -43, 92, 171, 98, 189, 124, 9, -64, 261, 2, 162, 45, 275, -48, 77, 92, 64, -134, 120, 184, 26, 293, 85, 137, -122, 162, -45, -130, 138, 37, 158, -56, 99, -73, 74, 251, -357, -4, -164, 93, -354, 47, -107, 15, -193, 14, 20, 145, -81, 15, 112, -91, 99, -71, 405, -296, -362, 216, -81, -102, 6, -63, 155, -35, -226, -383, 120, 97, 116, -48, -142, -91, -237, -48, 221, -171, -125, 51, 170, 5, -27, 197, 121, 152, 158, -39, 129, -378, -111, 172, 122, -79, 232, -15, 43, -86, -13, -165, 226, -29, 283, -78, 57, -177, 150, -76, 180, -196, -229, 352, 75, 48, -121, 76, 358, -97, -53, -148, -272, 22, 37, -156, 202, 10, -271, -21, 78, -156, 88, -98, 248]
7432B48l61O0l4j4L26n32N01k50J69K15l12J97j02j45J93j43J45j4l26K96K01
7453C18m85L0J04M0j15k3K07j08r2N2J51k22J42l0j70J14L4j02J14J55P5k76r
7476i6K7J17j55l7K50k88K74L3q3j06j67K32j12K76j28k1K11j78J7j29rL5j0J33
7500H6k24J74j80K3J80k6q5J20j25j32J65p2O4k7K0j3J56J05k5q9rj42l4M8J16
7525G4Q9k4J10k31L1K60p1k76Q8k07j71J18L86n4o8j39J02K48l46n3r6L21j62
7548g1J5n7K20k63K58L8l9m0j61K49j91j4Q7j81J07p8J60k41K10j09KL78l25k08
7572b54L44j07j06R9K1l3k4n1P3n1J05j42J86o6J52J28l93K52k61M2KL5K15j43
7596B3J21j21o6J91j73k46J88rl4M9MN9J05j50J46J4j32M2J22j75M3Lj82J98N2
$$ y = [248, -113, -53, -87, -101, 225, -307, 194, -56, 113, 328, 16, 213, 111, -34, 159, 16, 161, 147, -179, 117, 318, -167, -137, -33, 7, -108, -131, 76, -32, -124, -72, 79, -143, -1, -31, -201, -87, -53, -155, -41, 114, 189, -87, -96, -69, 48, -107, -144, 106, -182, 92, 125, 42, -64, -231, 1, -111, 165, 37, 16, 227, 49, 66, -63, -72, -37, -47, 86, -138, 36, -144, -121, 59, 33, -52, 68, -57, -189, -24, -96, -32, -59, -39, -52, 104, 209, 184, 95, 86, -56, -90, -42, 74, 163, 139, 249, 18, 49, 309, 238, -38, 50, -157, -328, -210, 176, 122, 54, -85, 17, 265, -81, -134, -230, 91, -71, -56, -113, 107, -156, 102, 140, 101, 61, -100, 149, -42, -56, 31, -150, -43, -121, 39, -202, 8, -101, -99, 279, -46, -254, 90, -17, -123, -24, -3, -36, -60, -111, -38, -89, 16, -126, 60, -6, 146, 274, -119, 133, -128, -86, -84, -49, 166, 23, 144, 23, -43, 148, -25, -271, -83, -92, -126, -77, -73, -14, 91, -59, 87, 101, -31, 11, 133, -42, 1, 4, -178, 20, 72]
7621G2M2m43K35K11R1j16K8K7j27K31l88J77l6q0o3Q9J65k63J26j22R5k2J22P6
7645A27o7n29M81p8j01K09n5j2J23J02j59n9l3J73j68n4J57q5L3q0m1J27j07J51
7669E5m2L4j33P1n7L8O0m7p6J35j22jM9k8P7J37k95J73J52j48q4J46k91J7K13
7694C3L9j62K56n2j92lj00L64q8n5j93N1O9P1m0k7j65L78j50k76M4K8L73N1k16
7719C8r8l3N9J11m7k15K03J25j95L4J26j5n2k03K17m0j77O5O7K0n3K47k27L5J19
7744A11k14J70oj11n1M3K53k07J89k37j26o4K51O7p7J07j09L3j24J99j32j5K2
7767b8J55j63j08J25j71K30Q1k38KJ02K6k58M2J65J59k39P4L14m63K2J62r5J21
7790A7j82r1K67q6K11k25L7J76k5r9K9p2p6J5j07J96K3j09K57r0j02K47l20J26
$$ y = [72, 114, -329, -94, 117, 208, 92, 120, 147, 20, 251, -137, 40, 4, -76, -139, -50, 115, -148, -22, -144, -49, -71, 51, 127, 60, -469, 12, -66, -167, 42, -13, -25, 98, 200, 41, -18, -51, 122, -46, -100, 57, -28, 5, -75, -116, 11, -96, 55, 13, 47, -86, -15, -72, -34, 26, -21, -97, 38, -84, -85, -36, -64, 13, 150, -145, 28, 180, 32, -52, 94, -197, -180, 33, 72, -90, 166, 114, -78, -81, -181, 183, 95, 40, -153, -102, -33, 38, -2, -29, -194, 184, 34, -242, -198, -170, 203, 254, 38, -60, -93, -34, 77, 30, -185, 18, 143, -52, -18, 108, 93, 41, -162, 55, 15, -162, -97, -30, -10, -63, 184, -43, -8, 111, -103, 67, 61, -50, -101, -58, 195, -12, 177, -60, -186, -250, 1, 68, -9, 98, -11, 22, -102, 97, -35, -50, -28, 127, -36, -144, -19, -190, 40, 121, -117, -115, -13, 13, -245, -203, -38, 121, -118, -44, 270, -193, -171, -9, -104, 17, -165, -256, 11, -75, 136, -89, -52, 124, 99, 0, 29, -43, -119, -104, -211, -15, 8, -101, 156, 66, -36, 211, -109, 17]
7814A7q9J16j42lJ23J7k3K80k64p1K55j10k59o8J49O7r3L2K45j47%p1J2j38J82
7839A7N1j46J00J25q7O1M2k2l1l37K75k52K7L26q5mK60k09j11O0k09J32j01K5
7863i3Q7l58K64M26l45q5J13P1l52J99O6J50j27k05L38J1r0j0q8J35J5p9l06J63
7887a00K2K68j68Q3k36N9L6m5J08J02J3r8J71l80L16q5k71j16M37P8j93J32j47
7910a4J67Lj62m4l22K36n6J62Q0K15l4l41K07l0J9q5q1L23M1l99J77J43l31M7
7934g9j20K32k32P3N1n2J14Oj88L0J37Q7j25j51L10kj87JJ8K22k2k01K17o7l34
7959b62J93l69N29o0r2P7k03J19K72k16k5n6J63k17j16M74n2l3m4j1k44K24n9
7982hL6l26K83J24pk30L8q8J82P5k04J69q8k58K84j07R4N9j41K01l4j13j31J70
$$ y = [17, -72, 44, -98, -101, 22, 39, 16, 296, 32, -39, 216, 106, -153, -221, -72, -5, -98, -66, 179, 32, 32, -39, -27, -165, 17, 68, -78, 22, 147, 60, 121, 163, 141, 110, -227, 48, -204, -177, 149, 64, 60, 320, 111, 0, 60, -149, -17, -118, -93, -6, -364, -100, 326, -19, -104, 9, 80, -272, -73, -7, 143, 16, -189, 149, 160, 70, 60, -28, 107, 122, 43, -263, -100, -78, 190, 22, 105, -131, -72, -36, -81, 27, 129, 142, 44, 215, -165, 151, 66, -205, -321, 116, 194, 1, 133, -14, 153, 156, -6, -50, -372, -136, -192, -30, 50, 265, 231, -110, 97, 67, 86, 1, -80, 243, 284, -115, 62, 205, -126, -79, -199, 33, -199, -126, -75, -127, -13, -7, -195, -165, -28, 59, -66, -217, 93, 91, -96, -95, -77, 145, 123, -78, 139, 72, -262, -69, -438, 91, 31, -61, 16, -187, -68, 204, -12, -37, -93, 70, -147, -263, 211, 159, 126, 82, 71, -173, 51, -8, 28, -298, -15, 109, 102, -128, -90, -178, 4, 79, -125, 44, -44, -302, -18, -125, -31, 28, -113, 88, 54, -59, -190, -20]
8006b0K6J21J33l58J79j57J98j54M7J2o4N8k39N0K78l4j39j78M79l07M1kJ86j27
8030B9p7n1j4L19J7j60j13J3J36l8MP5m46L57J29J15k07l6j66J06n3N2N2m7j4
8055a8K15l54J25k62j3M79l16P9R4M1K35j74J28o4j51q3k34K15K74k1r8j29N2
8078B0J66k29m5J21Q8L6M1j16RJ46k24k6j8P5r9J54n04N39k54j55Q5J62K04k8
8102A48n7k30P3J67K03l78M5k2Q4j03j9K46k0j41J97j87r3K45j26k2K35k43j33
8125a31J95l56K02J17n6N7j70K61N0l23l7K01j26J91qo5P8l70L51J61j72j7J34
8148A67j24q9O7JJ15M3k04K8j53J06pJ03M2p4J97j94q5P2k4J31J23j95j22Q3L4
8173D1j47j28K57k32K04k91M82j84m6P1k19L5J69j99P6L18m46J64
$$ y = [-20, 6, 127, 260, -98, 81, -76, 122, -32, 15, 27, -37, 21, -218, -168, 110, 76, -63, -241, 238, -69, -28, -30, 156, 29, -48, -99, -113, 206, 223, 63, -50, -37, 99, 61, 65, 140, -306, 51, 180, 295, 88, 52, -114, -8, -61, -9, 43, -4, -18, 197, -157, -32, -294, -307, 172, -144, -65, 29, 70, 305, 131, 259, 195, 44, -39, -273, -58, 216, 195, 97, -32, 20, 186, -43, -88, 33, 121, 157, 198, 82, 91, 237, 13, -13, -31, 44, -55, 99, -405, 134, -120, -275, -190, -28, 176, 148, 91, -139, -66, 101, 304, -74, -29, -51, 33, -70, -89, 157, 137, -4, 193, 6, -87, 158, 32, 10, 245, 2, -131, 64, -292, -90, 27, -29, 28, -142, 119, 169, -154, -191, 10, -116, 75, 67, 2, 80, -290, 61, 222, 50, 33, 167, 43, -46, 21, 22, 137, 180, -24, 4, -149, -43, -50, 53, 95, 21, 218, 24, -61, 11, -13, 118, 241, 46, -76, 7, 41, -106, -234, 23, -209, -5, -296, 186, 2, -44, 27, -192, -157, 12, -187, -111, 207, -239, -75]
8191g5
$$ Imaginary data points
##PAGE= N=2
##DATA TABLE= (X++(I..I)), XYDATA
0@%%%%%%%%%%%%%%%%%%Oj4J6j6J6j6J6k4L2l2L6m4M8n5O3p1Q0q9J02j13J25j40
40g4J56j73J91k12K34k58K84l12L44l78M17m60N08n61O19o87P64q51R56j081J229
61F55j412J647j958K391l031M067o029J0929m3583p0681J21662L0332n2427K0927
75A3489J9727j5295J9279j7304j9118M1623j0423o3175J9327L4333j6649m193
87A621j1213k0424L5284L514o0574R683N3651k3696l0028K7648K6436L579j4976
100E05j6915K6912K2297l4264j2441L5642O239j5496R65k413N954R257k8200k0296
114b2254K4708O394k7650m177J6974Q508n967j7759J40K4139m087k6704Q342K7384
128G991j027j1069M789J2915O660q602j2742N395J3764n414j5380K147J6028J500
$$ y = [0, 0, 0, 0, 0, 0, 0, 0, 0, 0, 0, 0, 0, 0, 0, 0, 0, 0, 0, 6, -8, 8, -8, 8, -8, 8, -16, 16, -16, 20, -24, 24, -31, 32, -39, 41, -48, 54, -59, 66, -74, 82, -91, 100, -112, 122, -136, 148, -164, 180, -198, 219, -241, 267, -294, 325, -362, 402, -449, 507, -574, 655, -757, 890, -1068, 1323, -1708, 2359, -3670, 7259, -36324, -107005, 14657, 44989, -7438, 13489, 33216, 17921, 37200, 19896, 778, 42401, 31978, -31197, -11870, 22463, 5814, 1621, -9592, -30016, 5268, 8782, -51792, -42109, 11542, -12154, -42182, -14534, 11902, 15481, 505, -16410, 10502, 32799, -1465, -13906, 21736, 27975, 12479, 13444, 11031, 16985, 26242, -1958, -22254, 2454, 8848, -18802, -22979, -6005, 2503, -3464, -21223, -21083, 3056, -1031, -27735, -19393, 7991, 6964, -4105, 684, 13599, 20259, 11657, -1085, 4310, 18074, 12660, -2720, -573, 15455, 16955]
142A6955j7001p905Q933L198j3011j3023O517J5657n071j6870R184K0208o153
155A618j4037L065Q808P056k039j1743Q777K3465r208k1019J4825J4609j5688
168H489j3090J621P124O428j3037j3688J6840J1210k1697r108J3996K253o684
181i343m563j108J5653R837j7581l619K3217K201j7300j57R223N138k014j1150
195a566K387J8915n550k1521M625J2340q490j0869j912N507R013o262j3571J0777
209f177J5164j3366j2251J0984Q986l318m797n53J2094J0185j3310p973J5086
222A0754N345j5015o065Q300N087k910q850j027J1620J13j6573l285J1778l21
236a049r638j330O777P492j026q720K798J2474k561j2223L178J1054N77n751j649
$$ y = [16955, -46, -7951, 982, 4180, -8831, -21854, -15337, 320, -4751, -21621, -12437, 7771, 1618, -12419, -9354, -546, 6510, 4471, -7272, 1505, 24970, 15762, -5257, 9568, 24177, 8489, -4601, -2980, 4144, 10572, -2465, -16153, 687, 11897, -9800, -18908, -4912, -2659, -9343, -13906, -15014, 639, 10476, -7105, -10724, 12493, 14694, -2606, -2763, 6460, 11598, 9584, -1566, 821, 19736, 14186, -7335, -2710, 9630, 1140, -9729, -11641, -6134, 2879, -3383, -16954, -6177, 8987, -4379, -16630, -5646, 3340, 22, -4775, -5328, 6766, 16951, 3641, -4332, 10754, 16099, 1084, -4981, 3319, 8406, 5496, -3354, -4381, 7239, 7352, -9221, -12506, -728, -1049, -10687, -12017, -5240, 2252, 1226, -7494, -4696, 7778, 5217, -7006, -3828, 7226, 7803, 2052, 403]
251D03O974O614p093j0879M653P979q074r855M841P698j200p800k463P740L466
266C004j0343n877R753O249o601l729P253P632j433o959Q8Q307Q13r524j486Q683
282E830L501o715m023M014M452m769q810J207P056k390p808R39P732J721o251
297d314l086N352M755m629n333M978Q081k248n434L064P124k48p116j913O172
312E205K502p106m079N342L896n407n604K629M567l157p173J213N824P83n544
327f109l10O111L363m143k769M761M597k126m748K510N683L31o190j162N210J409
343F418n940l744L987K500n208m773K207N417k240n906J314O296K11n189R4N500
359I44K146l853k247N284M662l016m231K750M344j731n247n98L896M4n004k180
$$ y = [403, 7377, 13991, 6898, -3981, 672, 8651, 577, -9278, -4437, 3261, 2061, -5739, -8202, -462, 3004, -7339, -13216, -3463, 2786, -3815, -7544, -291, 7341, 5908, -1051, -963, 7344, 8157, -1367, -2853, 5830, 9331, 2616, -1407, 2607, 7059, 2290, -6520, -5313, 1743, -647, -8455, -7516, 216, 1937, -4314, -7400, -2048, 2707, -1922, -7255, -2277, 5804, 3556, -1878, 1186, 8310, 8062, 946, -967, 5205, 7707, 601, -3478, 1864, 5760, 353, -5251, -2622, 1945, -1212, -8385, -7172, -1348, -565, -6109, -6419, -308, 3055, -1088, -3857, 904, 5501, 3375, -1373, 1137, 6820, 7151, 961, -201, 5009, 6418, 478, -3266, 721, 3221, -1987, -6760, -4553, 864, -1376, -7282, -5968, 328, 539, -4650, -4556, 944, 3090, -763, -3010, 2274, 6936, 3920, -311, 2439, 6783, 5052, -195, -793, 3103, 3147, -1857, -4037]
375d037M913K122n400l228K701L284k695l832J667M389L84l328J583L973J175
390C671l113k210L008L454j968m103K199M695j112m409L2L286o21n534j702M224
406b03J575m915j589L876K308k088k507K83L254N0l407M86N241J077k635k07K503
423C102K251j917m482J260M298k485l836J814L318j644k135k050J338J996l922
438c094l091L707K842k442q93J617K376J517l088k522N032J984n182j92M972J113
454D656k142j815N49L093k070n627J017M492k148l412J559J603Q09j133l781J758
470b592L591l347l149M710K633j319j43l65K080K628m133k502M776L04l506J010
486F76J497K62M66k985k531M272l03o433J194M168j626o33N7j93L290p88m677
$$ y = [-4037, 876, 2998, -2402, -5630, -2929, 355, -2340, -6172, -4505, -116, 268, -3060, -1477, 2496, 3671, 558, -1652, 1356, 4810, 2842, -1261, 938, 5633, 4521, 112, 144, 3430, 2809, -2725, -4427, -203, 1372, -3543, -5132, -1256, 1052, -1036, -3543, -3260, -6, 44, -3363, -2877, 2364, 3441, 806, 599, 3102, 5353, 3436, -1046, 214, 4512, 2027, -1809, 5, 3323, 1679, -456, -2506, -1168, 828, -3094, -6185, -2478, 364, -2078, -2971, -1354, 1022, 2539, -549, -3071, 1961, 3945, -1237, -1429, 3543, 4656, 2514, 699, 1248, 4341, 2271, -3356, -2339, 2153, 5, -3407, -1848, -245, 564, -569, -4350, -2592, 999, -2348, -5497, -787, 1846, 527, 384, 19, 2099, 4727, 594, -1908, 2868, 3172, -334, 676, 2173, 2435, 2901, -84, -2615, 1657, 1354, -5079, -3885, 283, -1343, -1976, -1919, -2112, 1178, 390, -4287]
503d287K228M524l588j022L576P43N68L00k873J436L352m688k444M269R0l121
519i37J346m82m88J620k828k739L741M9l445J261J947K45J348q47j370L602M27
536B450l711J095K991q66p08O92J12J566r67l873J533J649l533p31J582n15P72
553d62k09k972J917K794l463j869L946O18j544J136Q07M78J432j767j027K777
569B592j86k593J224R90j050J27l88j371Q07L13k247q14J467M87j094r59J358
586a337J421j212r96J622J380r06m13J080J133R3l74l97J111k97r47k71m19L30
604F01N32j688o96K004q12k192O83O97j107P5L72k03J425N83j594R75J520j266
622i1K2J073m84R47J382j974P5J746j042k241J028O4j351J79l54qJ052q79j616
$$ y = [-4287, -2059, 2465, -1123, -2145, 1431, 2174, 2742, 3042, 169, 1605, 4957, 269, -2175, 2094, 2184, -937, 409, -73, -561, 1059, -1769, -4508, -767, -718, -4163, -2902, -955, -710, 638, -209, -1579, 2023, 2450, -1261, -166, 2825, 1959, 1251, 1943, 2055, 3621, 2654, -1219, 314, 1963, -1570, -2301, -719, -1234, -462, -671, -3643, -1726, 1068, -2395, -4264, -318, 300, -1244, -108, 699, 1177, 2609, 842, -185, 2592, 2406, -187, 1037, 2027, 977, 1104, 716, -655, 152, 465, -1782, -2596, -1129, -642, -1736, -2695, -1337, 84, -1128, -2124, -502, 878, -28, -441, 639, 1772, 1865, 1491, 1094, 2205, 1908, 961, 690, 271, 601, 1133, -555, -1251, 753, -59, -2251, -1568, -871, -1978, -1903, -1531, -1734, -309, 274, -1320, -345, 1175, -91, -69, 1004, 520, 1467, 2849, 875, 950, 2696, 1654, -587, 441, 505, -846, -667, -1021, -1029, 23, -856, -2472]
641b472J477L55j505K47Q37j50J320O55r99J448R28j679K96J328j315m65J301
658A607q15J22J279j483j428J302p12j710O36l6p28J172K35j132J068Q70j870
675a623K45J470o17L9Q95N27Q62K92q67k69J422j160j225P70k14o06P59Qj096
694c88N71m10j819N07K57q72L04M93j92J473J281j766M38R47r05m75J401K68m7
713A066R83o36K39Q98j501j873Q03R2j542M46J049p71K58K12j220J023O9j880
731b285J2J740J25l16J329L22m2P33r98m49J013n62r03J241J68m44O11l08j102
750a15P2k29r95k96N90j16l81Q03K24J66J50o07l81J031k03n80P42J077k61Q60
770A551j66k73L47k47r67p7L96m67l4L00k57p7J04r66l30J66l52n35k4J095J7
$$ y = [-2472, -995, -640, -2145, -1898, -1061, -1211, 109, 764, -235, 1213, 2141, 462, 758, 2086, 771, 306, 1607, 792, 914, 2193, 710, -718, 584, -128, -1838, -1202, -1238, -1966, -794, -559, -1691, -623, 247, -1623, -1378, 92, -525, -486, 409, 936, 1798, 2090, 1223, 954, 2376, 1216, -9, 761, 547, -59, 700, 708, -388, 183, -227, -2046, -1539, -1282, -2154, -1850, -1357, -1549, -76, 1205, -561, -123, 824, -81, -556, 845, 1113, 1066, 2049, 1413, 1652, 2550, 1049, -824, -21, 71, -1471, -1025, 24, -747, -489, -277, -1497, -474, -405, -2285, -2273, -533, -408, -724, 605, 927, 885, 1618, 620, 171, 1184, 622, -281, 960, 1128, 684, 1295, 987, -115, -43, -272, -1267, -1563, -973, -1089, -1470, -667, -443, -277, -127, -734, -1115, -84, -287, -867, -125, 952, 691, 1551, 1385, 1112, 1459, 1212, 245, 168, 564, 97, 63, 363, 106, 29, 133, -833, -1163, -997, -1349, -1884, -1908, -813, -796]
791g96N04K09j00R88l79o52L58J004l89l18P05N61L8n13n59L8l2r93j034N20M02
812d38q60j01O27j0j07o2l33N05L79p07L79J399K60k22N14J51r0J01p09k73N29
833I32j73q08L65M7k99l01l08o27L32j60j052N69O75K91j6N0O06Jn9j44K48R64
855A133o12j54Q51K25k48l69j70J08l85o42k4J22k97j37m86K96l9M58p02o1L75
876g58Q0J56K01K80L96N05j78k89P63J62n28mo9J8J81n84n48Q92k51j344N18M18
898A7q89k54J82O2K11Q2n41M88R48o83J54Q14j3o3L94o53P2J071n73n00O95K12
920A233o41m63k87j00M4o07p45J258L8p23K33O41l04o6j79n45R37R02j050N83
940A59J403l55l13j8J24j14n00r67N55J208j046m30Q92l59o76l15n45J7K46L4
$$ y = [-796, -292, -83, -183, 805, 426, -226, 132, 1136, 747, 429, 1134, 1695, 1733, 1220, 661, 699, 667, -326, -1360, -840, -438, -1298, -1399, -772, -782, -889, -951, -1284, -779, -400, -1107, -728, 671, 931, 709, 1223, 1374, 1284, 1385, 676, 403, 932, 759, -49, 316, 363, 64, -237, -545, -1172, -840, -1000, -2052, -1483, -808, -517, -533, -483, 123, 124, 65, -79, 169, 1133, 521, 367, 1218, 1443, 1195, 826, 656, 764, 379, -263, -287, -165, -462, -599, -1085, -789, -828, -370, -1072, -1133, -758, -678, -522, -321, -41, 355, 860, 682, 393, 1156, 1318, 790, 786, 717, 735, 916, 332, -216, 676, 425, -919, -401, 17, -872, -1126, -944, -882, -671, -589, -1130, -642, 306, -377, -223, 591, 578, 515, 909, 256, 328, 1399, 826, 326, 1021, 1233, 592, 129, -158, -258, -214, -821, -1566, -308, -270, -993, -760, -119, -423, -489, -668, -1213, -276, 626, -424, 159, 1562, 1207, 894, 876, 1000, 886, 386, -581, -26, 1182, 136, -294, 598, 239, -437, -752, -1297, -1280, -1034, -1000]
960a000l09J071Q44n65k54k7N65M3o11j66O82R64l01KN48N7o95q59l02M33k07
981h7o89O0O34J32l37k66K8L37p49n43O68J90K79K56M70K32Q45j005l66O03r2
1002F00m90L12L35RM35m74p55N07q4j566N4O80l89m8J73Q9M80M79j347K39J108
1023C47j70p37N99J59M62N35o73L77N81r57j020P52P7m62j29K71k89O62k34j072
1043i21Q08l25j009N38N32n48M97L52k27N69P47r66m86Q96k67j21L60m6J11P81
1063A275q39m87J005n26j230K06K38l55L33j45j8O93q6r89K63O24o08m34P57M00
1083G7J71O02n06j57Q54j65j243O18L28m43K17j01p1J24R4r12J42K58o67n0mM42
1105c92Q0J13o0Q6O49p00l47P49J53m83L56L06L30K66n06l35K85j12n47j41R0
$$ y = [-1000, -1309, -238, 606, 41, -213, -240, 325, 368, -243, -409, 273, 1237, 936, 938, 1486, 1543, 848, -11, -313, 120, -87, -776, -716, -82, 50, -287, -553, -525, -188, -937, -1480, -812, -622, -343, -87, 383, 615, 1460, 455, 89, 692, 600, 110, 422, 757, 766, 1201, 727, -28, 479, 395, -1171, -1117, -437, -826, -874, -701, -612, -132, 347, -1000, -761, 347, 177, -560, 39, 198, 660, 1195, 522, 899, 1480, 523, -497, 255, 332, -130, -259, 12, -277, 385, 151, -921, -113, -438, -1447, -909, -377, -925, -428, -76, -303, 266, 1013, 47, -439, 457, 190, 69, 429, 383, 494, 1275, 436, -51, 954, 428, -802, -596, -358, -713, -380, -525, -543, 150, 64, -925, -662, -38, -646, -1080, -323, 77, 248, 850, 344, 187, 1041, 876, -367, 251, 579, 136, 353, 252, 181, 305, 399, -513, -371, -113, -780, -830, -834, -392, -312, -199, -259, -173, 476, -224, -571, 178, 331, -152, 204, 510, 840, 1106, 600, 265, 550, 438, -109, -250, -160]
1126a60k1l43M82j60K7k14k33m5L30j10k83M80M17o0K14P0k24K15m0m5r5J31L9
1149C72j28L4J78J41m81k65r8K66l17n82K13M82k56r7J77J71P3m27M27K86M9p6
1171A42l5n7K45K73J1l60J15J13j92j15j34L42k63n10jL60j91o3j08j33K78L9
1193b44k54K16J87O1K25n4L98M5m84J97K01K67o87J89J61Jk72j43Q6J29j39n56
1215d70l52N63j78j15K37j73j0O49k46o0J33K55n99K52K58J51J63L0j17L03N8
1236G32o33j47J63p8k68J75m7N23l52n00K01M9k43n65K64K42J68M73j41J8J85
1257B19j53M2J36k0k1lj18K53L29M0k58Oj58n15j23o0L03N7n48J94M59j88p0k04
1281d01J00J99k93k2L21M28M5k39M64K98l40k62J12J56l35j70l58M63J57m32R5
$$ y = [-160, -181, -524, -42, -202, -175, -389, -622, -667, -337, -447, -730, -250, 167, 107, 321, 391, 167, 382, 342, 297, 202, 333, 372, 244, 278, 456, 597, 116, -149, -247, 19, -298, -880, -667, -185, -441, -538, -361, -190, -117, -544, -117, 169, 218, 142, 107, 50, 295, 568, 579, 219, 334, 447, 255, 140, 6, 348, 85, -425, -426, -66, -257, -320, -428, -561, -283, -244, -498, -282, -95, -34, 191, 137, 535, 580, 96, 293, 494, 761, 74, 263, 424, 425, 153, 10, 96, 225, 86, -470, -822, -259, -437, -552, -315, -488, -498, 151, -95, -155, -22, 233, -366, -114, 144, 295, 458, 488, 371, 674, 732, 99, -48, 115, 37, -231, -56, -103, 420, 68, -432, -231, -182, -425, -990, -726, -484, -316, 157, 16, 34, 219, 66, 108, 244, 224, 203, 200, 82, 335, 664, 704, 446, 452, 294, -221, -344, -404, -101, -44, -592, -398, 61, -127, -197, -401, -301, -102, -395, -417, -96, 332, 377, 138, 602, 900, 560, 298, 410, 566, 231, 61, -297, 166, 323, -109, -14]
1302a4j70l1l44J12l66L52L45j49M9L23k1J93j54k37J64K92j96p8M80J67l72j52
1324A93p0L18n03k22Q6L03l16m45K20M09J11k12q5j04R0j21k10K62K27J90J6J41
1346B78K40m9J5l91K62J9j38m65L86K15j72Qm37K25L8q98R5N06K65k34J22n3M02
1369B39l3o84K94O66j99k74K15K51J66j74k47R2L29m69l52PM54m35j73K18P1J55
1391A17n17L04j86J23p4m12N13K18J39j40j9M87P4k39l88J70L31j62k34j88M45
1412C62r2k24j04K57q7k62l78j71K62L03j33K8L95m1j57j97L82l8k38J9J52J58
1434A96J12j69L07J5k61j34j19J4O2j12j55L05j25J72m00J7K23l70p5J9M29j3
1456f2j48k2L67K63O8j79j20M12o14l04M59L34l46j3J06m7Q8k36o96N28K07n55
$$ y = [-14, -184, -215, -559, -447, -813, -461, -116, -265, -216, 107, 86, 279, 125, -112, 52, 344, 148, 70, 550, 717, 345, 193, 123, 441, -62, -284, -198, 105, -211, -656, -436, -27, 84, -128, -213, -317, -227, -348, -558, -296, -69, 121, 137, 278, 518, 469, 484, 93, 355, 374, 236, -229, 157, 372, 200, 208, -229, -4, 34, -864, -769, -263, 2, -232, -110, -163, 239, 206, -478, -184, 482, 283, 9, 224, 475, 641, 467, 220, 312, 641, 172, -180, -173, 281, -154, -327, -109, -38, 117, -400, -96, -282, -159, -233, -645, -132, 86, 225, 85, 66, 553, 627, 388, 0, 170, 501, 339, 105, -83, 362, 270, 46, -58, 199, 112, -150, -528, -699, -437, -134, -267, -239, 156, 115, -42, -239, 143, 105, -133, -114, 38, 196, 308, 139, 446, 461, 200, 66, -53, -39, 23, -89, -244, 61, -64, 108, -292, -275, -52, -422, -497, -478, -49, -62, -210, -232, 135, 398, 466, 287, 167, 579, -35, -339, 120, 454, 108, 95, 201, 154, 242, 6, -690, -162, 45, -510]
1478e10K5M69kK75J1l67K03k22J8k54M32L62k55K21Q2M0J53o26k43J85L74p30
1500c59j82N68J46j24Q1j55N6j81k56Q0L06p0m6J91K3L36m8j64k78J01J39m89
1522c25K88N33k15m0L86l05n6k32m90n5J54J16l17N42M13j24k02l60%K93m7l13
1544c56J13M59o1PK18K69m67M3j97L1K19r7m18M41K53k22j8p2L0l63l86J51J86
1567b37j0J0J97M51j51j56l39N5O1J30j29K29M48r5Kj23J32n1l03n21M3M77l48
1590b28l19N23K40j18l14N5J76o4o31J46M90M59l67O6K62j55P4m55J16L39p6q9
1612A30j78J45K48m54M39j46ln72L0j55L70j3k76K80M21m68J87M2R1l16M8J52
1634Bm2L27l28L4K68O5k78m47N58J12n73K66m4Q2K86k06m24L18j16l10M05K60
$$ y = [-510, -485, -16, -18, 257, 268, -99, 104, -118, -100, -354, 78, 440, 185, 406, 488, 528, 681, 55, -188, -3, 371, -359, -541, 27, 173, 49, 130, -25, 31, -150, -406, -326, -20, -90, -136, 55, 78, 414, 366, 202, -76, 25, 164, -325, -37, 496, 281, 241, 627, 322, 266, 34, -456, -511, -357, -241, -558, -16, 397, 273, 71, -289, -289, 4, -43, -356, -243, 216, 155, 162, 380, 649, 182, 225, 28, 59, 278, 181, -237, 204, 457, 235, 217, 145, 175, -188, -574, -423, -237, -247, -237, -40, 411, 260, 104, -235, -180, -119, 11, -118, 111, 559, 464, 466, 343, 475, 424, 121, -400, -357, 120, -228, -547, -24, 216, 98, -216, -161, 15, -49, -680, -534, -44, 415, 48, 114, 376, 221, 295, -160, -44, 295, 219, 130, -48, 97, 345, -109, 330, 184, 181, -391, -361, -516, -146, -159, -435, -155, 266, -202, -15, 27, 118, -198, -150, 2, -40, 287, -41, -7, 261, 326, 48, -399, 159, 271, -302, -36, -80, 2, 288, 82, -342, -24, -140, -450, -45, 215]
1656B15l20pM4P1L36j14k43J94k4k47k28L90M8n0P1k1N2K38l88k60L01J9l39J31
1680a31l4L58k2l71l56Q17Q7n22r4O7M20j64O3J45K11j83k71K73R5l70j6K39K6
1703B67j43P2j83J01q2j55l11K55L56n83K82R7j33N5m7O5J77J80l56J6M27lk71
1726H3m1r8L92J5n09R0N02k82l89j17M76l5j50n54N57K16m1m74J67M51l98j26
1748b65M1K90J3k36l35P05L43n15l75L53K57l18k06K90K59q5m30l7M08j48l29
1769c20l7K55L82m24j17L95q3L68n85j80K35M03l38n8K74L50k37m80M59N8k85
1790C5l63P8P23k10o05J73M06K88n31n59M95N22o59l99O81J65m7l06J26M24k7
1811D10n80N1L26K38o19k78P60L22o34j2J86K40k36o43QO46J06m62K6J21P74o40
$$ y = [215, -105, -112, -68, 3, 339, 225, -18, 176, 152, -95, -323, 67, 115, 65, 136, 115, 167, 405, 17, -243, 58, 77, -262, -131, -165, 193, 171, -200, -556, 261, 348, -174, -268, -201, 219, 55, 118, 263, 474, 291, 20, 293, 388, 18, 2, 241, 267, 124, 196, 13, 114, 32, -123, -434, -179, 177, -406, -124, -27, -160, -105, -152, -87, 90, 270, -86, -70, 357, 354, 83, 42, -56, 336, 351, -158, -68, 434, 152, -237, -354, 122, 87, -63, -617, -60, 156, 115, -359, -192, 259, -139, -265, -224, 66, 79, -157, -492, 213, 556, 41, -334, 19, 276, -42, -248, 42, 301, 216, -214, -251, 157, 9, -320, -357, -102, 280, -144, -261, 134, 51, 419, -166, -346, -111, 292, -46, -104, 170, 520, 283, -197, 262, 320, 35, -328, -250, 473, 263, -342, -169, 237, 525, -6, -565, -70, 452, -207, -606, 75, 240, 193, -113, 13, 437, 410, -170, -119, 207, 445, -174, -452, 308, 630, -4, -16, 170, 410, 174, -469, -461, 185, 291, -171, -145, -24, 750, 110]
1833A10o94L50O43r2q23L09P89r9p74L09L11J56n23m43N66K90k90n85N36L4K63
1854C43q29J48M53J48p59k89O35L01l90J98pO57m74o19k5O64J51o66Q4N73J77
1875D74m92m37M63O11n03p30%R59n2n06l39N97M42l22p94M28O96m69k13J75O50
1896F38m47k81j03O20J3p40N3L76j61k48L9M65J90k35o61L52M52j67m09j6L41
1917G1K02o17l10O54M95j96o47J08L89m5o27O1Q01K10q28Q7K51M86q61m25P51
1938A0N37o71k41J63P37j14q79K07L82L72q36k02P28L79l80l88J95P47n91n94
1958d39m0P65k01l36j48N53J63m59l03N67J91k99l39J27N64q7o13L5N15L30q19
1979b73RK01N14m74n36L46M06k4m35L2P51j35o00j76L56Q7j60l10J93M78j21m06
$$ y = [110, -584, -234, 409, 317, -506, -197, 592, 493, -281, 28, 339, 495, -28, -471, 95, 385, 95, -490, 46, 80, 343, -486, -338, 115, 263, -496, -785, -150, 151, -239, -41, -48, 609, 135, -484, -509, 155, 306, -360, -276, 297, 474, -18, -455, 8, 619, 116, -614, -614, 345, 293, -213, -552, 45, 487, 165, -629, -201, 495, 26, -187, -12, 638, 191, -90, -193, 427, 440, -300, -247, 129, -32, -280, -241, 224, 414, 179, -482, -130, 322, 155, -254, -270, 71, 273, -344, -654, 0, 495, 299, -348, -240, 149, 104, -523, -462, 339, 549, -279, -192, 59, 545, -316, -741, 10, 547, -124, -365, -202, 535, 421, -458, -251, 131, 503, -333, -535, 193, 572, 192, -196, -1, 746, 155, -439, -479, 286, 85, -251, -399, 154, 317, -142, -445, 122, 313, 14, -325, -198, 366, 279, -334, -299, 216, 546, -273, -264, -63, 451, -23, -559, -213, 193, 169, -266, -234, 517, 382, -218, -394, -38, 49, -111, -421, -228, 250, 129, -277]
2001b77M9O73l60n07K61M10J07m37m63R46J4n11k79K35L72L9q17N20M00j48j38
2022H9o29O83J11k82m49L67L46n04M1R0N59p1m06r0M05P4m89j26L56J17k07l57
2044c72M03M57l14k25k48M69j38k49j48N72J0l78m0M06J61l65l51J80K27J29n39
2065c53K42K89O9k91r2L28Km28l82M81O80m82m86L48J31K09l68k20L05Ol31P3
2087b70L95J67k60L5P5r4k17j09J07M37P1k75l38O23J48n89n4L21k01o9l8O8K20
2110A53J8l19j17L54L1j81j45L56N6l15K04k15L39R0m43K45J0m5l93K92r7N2o8
2133a38K1L48j7j36l91J44M75m60k84L88M6k3j08L03p9o9K58n82pL85l45K3J47
2156a01K08J50l58r7M01nm83P3L98J50m41q4K22J74J01o11N76M0m71J3J96J67
$$ y = [-277, -228, 445, 85, -422, -161, 249, 356, -81, -544, 402, 416, -95, -374, -139, 233, 272, -545, -25, 375, 227, 89, -540, 143, 254, -28, -477, -110, 236, -268, -227, -137, 422, 351, -55, -145, 260, 334, -155, -281, 75, 192, -15, -372, 31, 488, 174, -51, -299, 170, 32, -217, -365, 207, 217, -161, -201, 205, 366, 1, -350, -170, 57, 186, -353, -111, 178, 247, -44, -136, 192, 194, -234, -616, -135, 545, 63, -423, -75, 56, 265, -103, -323, -18, -12, -343, -270, 125, 292, 32, 67, 142, 48, -169, -278, -171, 266, 337, 62, -276, 347, 495, -94, -148, 173, -28, -97, -135, -67, 153, 171, -148, -265, 89, 120, -61, -206, 150, 206, -109, 95, -120, 219, 309, -134, 111, 121, 76, -317, -25, -122, -70, -138, -117, 231, 214, 78, -313, -169, 306, -154, -438, -50, -4, -27, -135, 168, 89, 20, 278, -304, -311, 74, -271, -248, -101, 107, 257, -101, -198, 203, 198, -285, -212, 186, 336, -105, -189, 33, 207, 308, -303, 273, 313, -158, -145, 51, 218]
2178B18K34n74j4M21Jk84m21N82j38k9k66q1P30k13n4l25L46j24kj05K20k05J6
2201f7oJ52Q9q6p7l86M28J74P3l27K83L5l67L4L71k86J3r7K4N1n8m8J72j3j09
2226b8k0L2J62j62j60JL45J22pk11j18M98j22k90n56P82j91k04JL70j38m82K48
2249a28K39J43l54j06J66J88J0p4m08M21J04k53j89J46L82k98l04K64M05j74k09
2270b9k5M9L20n28J22p6O1L3m1K90l3pl93L01K22m43k2L3J43K83q6j22K17J80
2294D49m88K36j76J63k54n5K24r3K12j08j56J50J07j91r0q4J21k3q7N4J49J28
2316A88r4l53M06j85q4k0J83Q5l12L29j66J71j24L8k19L27M5o5m20M05Pn0k39
2339a47R1L2j34O1q9pJ45J82m25M12O2o1j02J15j01J37j42j81K54m8q5j04J02
$$ y = [218, 452, -122, -136, 285, 286, 2, -419, 163, 25, -4, -270, -351, 379, 166, 112, -213, 133, 9, 7, -98, 122, -83, -67, -73, 79, 168, 82, 5, -381, 47, 221, 294, -33, 250, 285, -82, -48, 323, 37, 50, -47, -23, 28, -30, -78, 94, 81, -28, -48, -16, 146, -16, -176, -175, 170, 292, 285, 74, -44, 454, 332, 42, -514, 268, 77, -127, -126, 244, 106, -376, -128, 111, 254, -100, -206, -40, 148, 158, 84, -324, 97, 201, -52, -241, -95, 287, -11, -315, -51, 354, 180, -29, -54, -5, 315, -213, -91, -167, -106, -73, -114, 176, 143, 136, -257, 44, 266, -177, -199, -166, -23, 260, 174, 52, 269, 449, -39, 197, 21, 184, -70, -125, 99, 6, 218, 110, -46, 104, 211, 20, -70, -154, -33, -56, -143, -89, 60, 188, 94, -259, 147, -38, -122, -142, 41, 126, -186, 143, -23, 148, 24, 62, -157, 170, 215, 150, -270, 135, 142, 92, -147, -56, -24, -158, -97, -186, -193, -48, 134, -291, 121, 183, 122, 20, 135, 34, 171, 29, -152, 102, 54, -31, -135, -33]
2362c3K59k37j36l0M3J08l62J83N68o0m24O5O5J35K3l47J79o5J12rN0K94j26N9
2386C14l68K31j99M7k48J80O4qqj6O4j69j04J19L40k67J1J13r7K34k80O2p8L23
2410B60l67k35L30J30j36mJ41k21O4J05k54K50J29n38J48K90m2K9k91q4P34m08
2432C0k71K73o1n5J91p9L4L52m81O1j85J48L44k89J37J9K3m43K04j37J01o1J84
2455C9k52K56J9m6j99P8K36m50J99k83M01O1k12K93j28J21k18K03K67m69K71l07
2477a20j00M00m53J87J47r1J52L9j84q4LoJ10K33K4k19K9R4J85k32k6j56J37R6
2501A65j98j46LL1L45k60P3j08J54j77r7K78j02R8Q5j16k1J94k34j96J65R8K99
2524C33k60lK33p6k79R6j19R8Q2r6J35nk06O9q4Jj33M31k52M09m44j80O40l00
$$ y = [-33, 226, -11, -147, -177, -134, -26, -388, -205, 363, 303, -121, -56, 9, 144, 167, -180, -1, -66, 46, 37, 87, 381, 255, 314, -54, 177, -22, 25, -223, -43, 21, 13, 5, -11, 53, -116, -220, -101, 239, -28, -17, 96, -1, 233, -47, 15, -63, 260, -107, -342, -12, 118, -18, -22, 119, -102, -38, 67, -187, 63, 192, -346, -198, 92, 50, 79, -212, -296, 438, 30, -241, 32, -29, -84, 107, 28, 62, 414, -67, -6, -191, -43, 301, 12, 149, 168, 191, -252, -48, -185, -84, -145, 39, -213, 43, 62, 16, -183, -105, 131, -319, -120, -403, -2, 59, -153, 140, 12, 133, -85, 118, 385, -84, 187, -120, -220, 180, -273, -86, 61, -30, 122, 161, -23, -107, -104, -110, 0, 233, 257, 38, 67, 161, 346, 114, 88, -68, 69, 165, -33, -179, -176, -145, 200, -60, 13, -95, 59, -118, -215, 63, -39, 59, 144, 28, 7, 201, -33, -229, -64, 34, 333, 73, 70, 303, 227, -52, 44, -75, 23, 105, 9, 144, 139, -67, 2, -82, -81, -214, 217, -35, 374, -70, -250, 390, 90]
2548I0j87K9O9k7LR7l97L78j16o6L04p6k79J06J12J16q0j19j5K43k35P3l7k67
2572b81Q9L33J97k91j17j07P9J66qQ4j76J99l3j83L1K7j01j23K16K13k36JN9j61
2596a23oK09K32l33k13L96j61j80L50j74j06Rl2L67r8k43K67j21j23K89l36K46
2618A16j60M3k42J26K08l23J65j36m2M39n1r3J83n3l52J58o1J6N2p3R7Q1r0J77
2642A85j59l9J38M9j08m3O3r4J60k06N4mp1j74J10L55l27J23j20R4q3L4K88l3
2666A92m04L42j81j30l2L38l85N05k74j54M55k15R1n64L94n4jJJ27k49J65K00
2688A67k37J46r8l8l84L10K88M2j21p3j13K16Pj74K51j75J8q0p4M8J06k77J10
2711a35L99l82j54L48m12K35J64J42l03K7K87Mm19M03J45l13K48p9o1k10N7K7
$$ y = [90, -97, -68, 1, -26, -23, 74, -323, 55, -61, -127, 177, 101, -178, -72, 40, 156, 76, -43, -58, 185, -50, 23, -14, -281, -192, 141, 338, 47, -70, -177, -98, 68, 60, 144, -32, 167, 134, -49, -18, 9, -92, -215, 1, 214, -22, -21, 38, -123, -129, 80, 312, -21, -234, 162, 1, -179, 171, -3, -109, -100, -132, 235, 137, -106, 161, 40, -83, 206, -130, 116, -44, -1, -243, -117, 91, -232, -67, -203, -245, 194, 143, 50, 233, 180, -172, -14, -75, -59, -7, -80, 17, 98, 8, 185, 26, -13, 125, 174, 66, 23, 86, -8, 152, -54, 0, -4, -75, -249, -139, 216, -111, 12, -108, -14, -97, -63, 225, 192, -212, 130, -51, -181, -213, 125, -260, 245, -29, -183, 272, 57, 148, -416, -22, -76, -77, -76, 51, -198, -33, 167, -70, 76, -22, -60, -444, -134, 154, 196, 75, 2, -111, 105, 112, -62, 189, 14, 32, -48, -122, -74, 32, -245, -135, 264, -118, -272, 76, -336, -101, 63, 205, -98, -71, 216, 220, -199, 204, 349, 36, 284, 205, 144, -66, -9, 18]
2733A8j13J51m0l4J54k31J43K0j85J97q6kj73L47j57Jj31K04R5r9q1K32q9m3L91
2758D89o35q3Q0L5O4P7q0j44J70j64K50j52R8j17j06L41j91j30J63J89k82K23
2780I5lj72o2K35J46j88K8k12K29j14Ro2J02P8j47P0l08L48J33k13n5j31J87j59
2804a66J21kL87k70j69K41l00K91L7j56J38R6J62n34jJ1J20J05J0M9k21J22k44
2827a73N5J43q8J27j02l3K57q7R7j11j72L47l73R0n1m2K99l35J8J98j65K84j01
2850H2n1Kj85J53M2k9j99L90l53K50M5k39P7jJ61l77K55J07j6k21J97k55K19k04
2874a50J44O2O6l12K58j71J97J99j81j28J68j87l5q7p1L91j43n5m0J69j00J13
2896A07j50J37N4r4J79J04l13j55K61j14JJ44o9j99o1J66j27J48L9k1k39J56J06
$$ y = [18, -95, 56, 16, -18, 136, -95, 48, 68, -117, 80, -6, -8, -181, 166, 9, 10, -121, 83, 178, 79, -2, 230, 141, 98, 489, -146, -229, -149, -114, -50, 27, -53, -197, -27, -191, 59, -93, 5, -112, -218, 123, -68, -198, -35, 154, -128, 95, 92, -80, -142, 93, 239, 51, 79, -133, 96, -18, -9, -71, 31, 109, -38, 32, -276, 72, 205, -8, -63, -194, -7, -166, -45, -47, 340, 70, -99, 142, -158, 133, 170, 14, 152, 248, 410, -124, -125, -114, 6, 111, 121, 170, -51, 71, -173, -118, 25, -63, 64, -38, -71, 186, 99, 196, 85, -87, 260, -113, -23, -74, -116, 183, -152, -134, 64, -101, 183, 82, 31, 33, -152, 1, 43, 14, -185, 205, -148, 102, 147, -92, -15, -16, 145, -232, 23, 130, 114, -107, 90, -165, 54, -150, -6, 56, 122, -190, 68, -103, 94, 293, 112, -16, 152, -35, -70, -157, -228, 163, 20, -35, -75, 94, -6, 107, -43, 94, 148, 54, 233, 337, 24, -131, 130, 16, 17, 161, 92, -107, -168, -2, -129, 19, 58, 37, -202, -46, 60]
2919F0Ok24K96k75Q9P3N5n8LR7j11M1j3o1K9Q1N1j21r7j42J55N2L6J85m09K17
2945A5k3m1j11L22p3j07k22J26J95l28M62l61K47M6j93R5J8k48M06j20j33k3Q2
2968C1k9J64l83J15K03l30P8j14M38k22j8M5J38jLjo9M4j75J89q3K37k20N6P3
2993A69p5n5o4q9n9L34l50K3R3MJ4QJ31j47K27j38k05R0M3KK3J21J42j13K3k62
3019a10j33K10Qj20n8J24J36J39n6l30J59p8Q9J7k88M61k11L77l81m3K00K1k46
3042a13m0K85j7J23j63R7l04K00n2j26J58j74r1K42j64P8K6r2L94j50j24l52L02
3065e7J13K21k83j0NK70l41knJ9j7K86k00j91J79OQ2j97L33l55k5K40m8J88j61
3090E0q9J40n9J23k93K32o1L3n4r3%K90P7j91j71PJ31k14M1J19m7ql29M59k24
$$ y = [60, 66, -158, 138, -137, -48, 25, 80, 22, 25, 122, 11, 52, 39, -22, 7, 88, 139, 18, -79, -221, -66, -14, 22, 207, -202, 15, -8, -49, -160, 162, 89, -18, -240, -114, 81, -247, 215, -146, 101, 147, -46, 49, 67, -181, 225, 105, -28, -51, 31, 2, 166, -217, -102, 101, -229, -151, -265, 173, -49, -67, -22, 116, 115, 118, 117, 48, 92, -83, 106, 23, 260, 40, 96, 169, 94, 39, -25, -114, -173, 161, -189, -166, -73, -69, -55, -47, 84, -63, 164, 26, -179, -89, -46, -44, -21, 100, 242, 129, 152, -110, -243, -33, -25, -145, -203, -79, 57, 196, 140, -190, -31, -109, -20, -3, -291, 170, -41, 336, -45, -88, 112, 133, -113, -153, 132, 115, 238, 75, 172, -132, 68, 16, -110, 48, -126, -217, 25, -139, -61, -35, -127, 267, 117, -7, -359, -57, 56, 277, -6, -16, -11, 259, -82, -84, -89, -70, -87, 199, -1, -192, -13, -7, 75, -122, 211, -144, -169, 71, 23, 211, 50, -39, 101, 42, 165, -128, 104, 43, 76, 22, -71, -71, 219, 296, 105, -66, -59, 72, -142, -101, 18, -29, -37, -366, 93, -131]
3115a31r4J32j5O9k13J78M2j25J76k53L41j22K31l86K06L5j41j10K87j10Q4Mj05
3138b0K77j26l03J41N0m8J67rk10J15M5m3L57k55j26k69K61q2J73p8J35k62J05
3161eR1q1j94J47J54p9j4n4m0j40J90O6J02j53J54l71K89n1M1l6p2m2J63j49L51
3186B67l54O0n5k5P9Q2j12l7J9R9K48k08l5k00j95J77Q6O5J38M5j78J84j80K9
3210aM0j79P0N5j34J54N7J24N2l54J95J79l13L98l43J30j19m7%Pj67K13k2kn4
3235f1K70l86N2k7L1K35m1j61K87j88K03k46P2j22L49j73J5P4l96K25QR0o4k17
3259a71K90l27M3L90k89Q4j67j81K10J94j63k00L04J27j8K9j43J65l56JL17j13
3281B6o9J86l16p7L30k35L19l03R3J46R2j58N4n0j22L4O3L7J56k75J10Q0l01M66
$$ y = [-131, -225, -93, -108, -39, -252, -74, -32, -157, 19, -234, 107, -15, 216, -170, 36, 71, -70, -180, 107, -3, 81, 85, -20, 257, 131, -172, -31, 19, -29, 138, 129, -81, 34, 79, 36, 393, 138, 12, -257, 4, -78, 95, 17, 152, -110, -5, 86, 5, -189, -42, 112, 33, 19, -35, -75, -215, -25, 41, 143, -10, 144, -227, 62, 11, 52, 16, -56, -98, 65, -84, 267, -87, -27, -82, -107, -28, 54, -58, -95, -76, 23, 271, 63, 28, -172, -367, -190, -104, -39, 99, 144, -34, 150, -30, -1, 39, -140, -70, -15, -149, 5, 62, 186, 238, -116, 79, 258, -55, 343, 0, 130, 11, -36, -36, -29, -196, 17, -5, -7, -61, 209, -177, -125, -152, -121, 114, 73, -88, 199, 11, 214, -32, 40, -82, 267, 94, 109, 183, -213, 12, 20, 110, 46, -171, 119, -208, -165, 225, -64, 20, -147, -328, -118, 76, -87, -287, 17, 144, 126, 155, 12, 177, -179, -178, 139, 26, -43, 143, -173, -250, 80, -155, 164, -139, -46, 100, 192, 34, 88, 38, -84, -50, 13, 50, 206, -69, 41, 121, -180, 286]
3305B86m03J40J16m6l5j67L68p4m91L67n7o6j15K36o6N5j85J70KJ16j62J37r6
3328C0o0J19l79N7K49J37m20L06j67o9J50J43j33J31j78K3M2j66J72j39K71j02
3350A7J1J51j34m9o2K27j71k4j36L05k00j40J64P2J75l54QK63K79k98j86Q0M7
3373D5q0m8K17K0p2Qj1j97kR1J79j52k46J34J04m6j69J16N05j46l40N2qm8J74
3398H0k32J31r3J31j20J48r9nJ45j72K10j38J5j2J44j95M1N8j67J10m3J53j9J95
3422B66k44k93J83ql3L24k14J19j41L8o0N2k43J01L50o33L67J67j5j58L2k6Ln6
3446a22L25p4j61L1j91K95j38O9J38Rj86K5K1P1j92O3M4M2j29J37n0mJ66m34L58
3471A13j77P7n6J5j93J52O4n7J37j09j98Q9L05k91K12j67R2J45J5n9k05J71OJ72
$$ y = [286, -117, 23, 139, 93, 58, -109, 259, 185, -306, 61, 4, -62, -177, 59, -7, 48, -137, 33, 35, 151, -11, 126, 30, -30, 89, -290, -233, 16, 153, -267, 39, -128, -197, -47, 96, -37, 94, -84, -61, -19, -185, -13, -152, 119, 17, 28, 179, 45, -4, -66, 161, -10, -34, -170, 135, -65, -205, -41, 31, 206, -148, -140, 123, 402, 104, -82, -2, 45, -35, -83, 134, 154, 82, 90, 79, -118, -120, -29, 150, -2, -248, -114, -10, -56, -225, -109, 396, 250, -90, -38, -46, -94, 80, -152, -21, -114, 17, -103, 45, -54, -59, 86, -86, 124, -14, 1, -11, 133, -62, -21, 37, -130, -20, -63, 90, 71, 266, 22, -271, -88, -96, -129, 195, -19, 100, -41, -3, -63, -11, -254, -153, 197, -436, -69, 98, 83, -75, -43, -69, -66, -122, 203, 129, -32, -1, -192, 103, -35, 34, 172, 181, -5, 20, 41, 112, -80, -17, 27, 69, -60, 77, 27, 23, 189, -245, 113, -64, 13, -43, -28, -221, -69, -5, -62, 75, -34, -232, -143, 162, -129, 83, -84, 8, 153, 168, 109, -96, 75, 81, 253]
3495B53k21r7K41O7j21q2k29K80m1nj76L67k11p9J14q1O3QK51n77J66J35O9r9
3519eJ50K6J0k42J4j47Q6rj9L86m07L03j05J1J86j55q5r4K66j64j53L06j44j51
3543a36J37J00k31N0K62j25j96J04P3j80K77J06m12K20K83k57k76L06j56k33L04
3564B0O9j82L73j97j38j35K52n7o6J83j75o8J34j23J00Pj3J2n5j45J82M0j42R8
3588b6J96m6k40j44J71q6K62l4rK79l44n6Mj46L19J25n70N34j55r2K80n28J37
3611a69L41k09K64l92K43R5j73J45kk39J13k34L4L94k33j89J55L05l17K8J59r7
3633B2q2K02l06J56k19N8J06j58J58j35J93r1J13J42k48L3j2J08mP1j97K42k24
3656g2K0J06j57qk03M09j9r2k25K14j42l2J29J75M7j69o7k3K53j73j17K17r1l7
$$ y = [253, 32, -65, 176, 243, 122, 40, -189, 91, 50, 45, -131, 236, 25, -54, 60, -21, 42, 50, 301, -276, -110, 25, 94, -5, 145, 171, 181, -61, -47, -194, -108, -117, -136, 250, -157, 146, 41, 52, 238, 83, -2, -96, 170, 6, -147, 159, 15, -136, 1, 101, -130, -80, 182, 57, -139, -35, 38, -142, 135, 241, -171, 49, 332, 75, -201, 105, -51, -284, 20, 89, -93, 280, 83, -55, -190, 62, 5, -61, 122, -53, -121, 13, -110, -10, -3, -16, -4, -59, -204, -22, 18, -124, -26, 170, 124, -116, -260, -89, -175, 87, 53, 44, 323, -21, -77, -73, -219, 100, 225, -345, 189, 34, -58, 222, -306, -169, 172, -37, 227, -165, 78, 173, 0, 145, 143, -96, 17, -217, -183, 211, -22, -211, -56, 249, -68, -40, 119, 22, -60, 142, -164, -8, -227, -169, -63, -221, -63, -198, -5, -96, 17, 159, -89, -56, -68, 40, 36, 107, -90, 152, -72, -52, 54, -103, -111, -314, 95, 76, -16, -241, -27, -169, -201, -72, 103, 150, -19, -86, -109, 144, -29, -146, 71, -20, -57]
3680e7O4J60nn2l6j17M0p2J24J47j05p4j37J99k36j41N69k90j7m9K18Np3k01J78
3705D2j00J09j16J97m5l56K84J25l69K78j26K91j31o5j39J73j38J0J72j61J3L4
3727a8N2r4j11K00m0K14l69M40k90j07K66K8j38oj48L6J9K01o8J1j01k65K73J72
3751A57j10j88L75k66J67K01j41j85K45l82M7q9j09L08l49M33j49M8K04j74J1
3772E4j06J29j98K8R3J6l57M25k83j15L19j56L66o37M89l62K3R7K57J50k85O3
3794A0l73N52kr2j73O9L1J03k38J31J74j87N2J18l55K08j32O9n7j47L11q4j14
3817a26L88l36J17j85J7K19O2j37p4R2J99o4k79J15j50Q5pk6pj33J90Q7q6j83
3841b22M01j47k17j9K06K46j6l09K10j90N5J7j7K52k36J18j58J28k23J16K5j41
$$ y = [-57, 7, 167, 162, 110, 74, -43, -3, -75, 49, 196, 91, 17, -120, 79, -157, -298, 271, -19, -36, -85, 133, 138, 65, -136, 42, -58, 51, -65, 132, 87, -269, 15, 140, -229, 49, -77, 214, 83, 18, -121, 52, -86, -76, 96, -65, -52, -18, 34, -60, -171, 29, -11, 203, -166, 274, -16, -123, 143, 171, 33, 27, -121, -85, -66, 135, 67, 78, -23, -288, -15, 157, 47, -141, 234, -32, 135, 336, 195, 10, 255, -127, -80, -169, -278, 30, -319, 114, -35, 13, 217, 43, 54, -52, 77, -121, -93, 0, 16, -341, 84, -199, -314, 5, -151, 215, -422, 67, -295, -272, -175, 82, 232, -53, 10, -363, 189, 187, 95, -78, -9, 22, 125, -113, 18, 192, 5, 57, 175, -180, 28, -104, -35, -92, -239, 72, -12, -126, 262, -74, 43, -142, -125, 94, 156, 19, -55, 37, 236, 172, -107, 8, -142, -57, -64, -90, -97, -230, -40, 47, -39, -222, 179, 32, -185, -204, 2, 248, 232, -77, 133, -57, -2, 15, -2, 250, 14, 132, -26, 102, -121, -5, 20, -121]
3863a21Q3j15K43J71k48L0k87K39M0J47k11l2J17J08o9j25K19k28K8n6Q2o4N6
3886GO9j42K25l18L8M8L03k84J59J29k75k1J06O0L3j00j37N7J38r8Jq5Q5J71j42
3911B7p8K10m1j63q4OJ64q0J71K5j40J31j39P0j29jJ35l5L2q2j62L00K9k05j77
3936b16R3j7K04K06j52L0q9k2J18j07j07J17J44l3k60J23j64q0K10J3J76k39J11
3959E9L11l73l5j4J12n6J02m46L49J05j73Q1j0j36J09J08q9J7L9N1j03k6J97k84
3983a05K50Q7l01K96l37J16J35k13q5M3K67q8r2L26m24J04K3J74j32K03k21j77
4005a51P2R9Pj34J8k10N95k42j12j14L32j09j82M96l27l4K34o1j60k4j18R2k08
4028b41%N27m12L4J37k81Q0J94P2J7k22J79j41K68k78L42k94P7JL2K12o05J33
$$ y = [-121, -38, -153, 90, 261, 13, 43, -244, -5, 35, 182, -29, -61, 56, 164, 95, -30, 189, -39, -11, -67, 15, -49, 7, 76, -66, 159, -159, -121, -73, 230, -54, 105, 234, -41, -62, 44, 104, 137, 37, -100, -43, 95, -3, -2, -87, -2, 169, 27, -51, 159, 118, -45, -129, -123, 41, -39, 132, 157, 17, 148, 9, 79, -50, -51, 84, 49, 81, -1, -163, 137, 166, -39, -216, -123, -140, 64, 270, 118, 148, 59, 37, 155, 48, -59, 58, 202, 169, -91, 32, -132, -212, -2, 11, 187, -52, 59, 370, -3, -38, -52, 60, 4, 106, -340, 9, 114, -59, 22, 12, -124, -15, 93, 4, 21, 60, 111, 8, -18, 179, -105, 145, 232, -69, 227, -110, 6, 141, -72, -157, -114, 153, 65, -27, 299, -125, -21, 2, 176, 44, 247, 26, -151, -79, 20, 27, -107, -89, -299, 296, 54, -58, -172, 160, 51, -131, 365, 38, 4, 238, 177, 17, -7, -125, -33, -241, -241, 286, -126, -92, 45, -236, -156, 38, 110, 127, -95, 84, -57, 211, -67, 275, -19, 58, 59, 91, 303, -302, -169]
$$ [...]
8190a4M
8191a0
##END NTUPLES=NMR FID
##END=
