##TITLE=1H_SR156_k
 DMSO-d6
 8 sc, 
 20.1.2023
##JCAMPDX= 6.0         $$ Bruker NMR JCAMP-DX V2.0
##DATA TYPE= NMR FID
##DATA CLASS= NTUPLES
##ORIGIN= UXNMR, Bruker Analytische Messtechnik GmbH
##OWNER= root
$$ XWIN-NMR		Version 3.5
$$ Fri Jan 20 16:40:06 2023 Russian Standard Time (UT+4h)  she@DPX200
##.OBSERVE FREQUENCY= 200.13135
##.OBSERVE NUCLEUS= ^1H
##.DELAY= (6, 6)
##.ACQUISITION MODE= SIMULTANEOUS
##.ACQUISITION SCHEME= undefined
##.AVERAGES= 8
##.DIGITISER RES= 18
##SPECTROMETER/DATA SYSTEM= spect
##.PULSE SEQUENCE= zg30
##.SOLVENT NAME= D2O
##.SHIFT REFERENCE= (INTERNAL, D2O, 0, 15.7039)
##AUDIT TRAIL= $$ (NUMBER, WHEN, WHO, WHERE, WHAT)
$$ ##TITLE= Audit trail, XWIN-NMR		Version 3.5
$$ ##JCAMPDX= 5.01
$$ ##ORIGIN= Bruker BioSpin GmbH
$$ ##OWNER= she
$$ F:/spectra/data/she/nmr/H-F/1/audita.txt
$$ ##AUDIT TRAIL=  $$ (NUMBER, WHEN, WHO, WHERE, WHAT)
(   1,<2023-01-20 16:38:37.20 +0400>,<she>,<DPX200>,
      <created by zg, POWCHK disabled, PULCHK disabled
       configuration hash MD5:
       00 E9 B6 7A A2 85 ED C7 34 08 36 98 17 FE 4E 26
       data hash MD5: 16K
       EA 6E 24 34 E1 A3 F9 B4 C0 34 07 7E 31 5C 3F 23>)
$$ ##END=
$$ 
$$ hash MD5
$$ 25 5F BE 84 38 63 AA 8A 74 92 D4 FC 1B 7C 6A 5A
##$RELAX= 
##$RELAX= 
##$RELAX= 
##$RELAX= 
##$RELAX= 
##$RELAX= 
$$ Bruker specific parameters
$$ --------------------------
##$DU= <F:/spectra>
##$EXPNO= 1
##$NAME= <H-F>
##$PROCNO= 1
##$TYPE= <nmr>
##$USER= <she>
##$AMP= (0..31)
100 100 100 100 100 100 100 100 100 100 100 100 100 100 100 100 100 100 
100 100 100 100 100 100 100 100 100 100 100 100 100 100 
##$AQSEQ= 0
##$AQ_mod= 1
##$AUNM= <au_zg>
##$AUTOPOS= <>
##$BF1= 200.13
##$BF2= 200.13
##$BF3= 200.13
##$BF4= 200.13
##$BF5= 200.13
##$BF6= 200.13
##$BF7= 200.13
##$BF8= 200.13
##$BYTORDA= 1
##$CFDGTYP= 0
##$CFRGTYP= 5
##$CHEMSTR= <none>
##$CNST= (0..31)
1 1 145 1 1 1 1 1 1 1 1 1 1 1 1 1 1 1 1 1 1 1 1 1 1 1 1 1 1 1 1 1 
##$CPDPRG= <>
##$CPDPRG1= <>
##$CPDPRG2= <>
##$CPDPRG3= <>
##$CPDPRG4= <mlev>
##$CPDPRG5= <mlev>
##$CPDPRG6= <mlev>
##$CPDPRG7= <mlev>
##$CPDPRG8= <mlev>
##$CPDPRGB= <>
##$CPDPRGT= <>
##$D= (0..31)
0 1.2 0 0 0 0 0 0 0 0.06 0 0.03 0 0 0 0 0.0002 0 0 0 0 0 0 0 0 0 0 0 0 
0 0 0 
##$DATE= 1674218316
##$DBL= (0..7)
120 120 120 120 120 120 120 120 
##$DBP= (0..7)
150 150 150 150 150 150 150 150 
##$DBP07= 0
##$DBPNAM0= <>
##$DBPNAM1= <>
##$DBPNAM2= <>
##$DBPNAM3= <>
##$DBPNAM4= <>
##$DBPNAM5= <>
##$DBPNAM6= <>
##$DBPNAM7= <>
##$DBPOAL= (0..7)
0.5 0.5 0.5 0.5 0.5 0.5 0.5 0.5 
##$DBPOFFS= (0..7)
0 0 0 0 0 0 0 0 
##$DE= 6
##$DECBNUC= <off>
##$DECIM= 32
##$DECNUC= <off>
##$DECSTAT= 4
##$DIGMOD= 1
##$DIGTYP= 9
##$DL= (0..7)
0 120 120 120 120 120 120 120 
##$DP= (0..7)
150 150 150 150 150 150 150 150 
##$DP07= 0
##$DPNAME0= <>
##$DPNAME1= <>
##$DPNAME2= <>
##$DPNAME3= <>
##$DPNAME4= <>
##$DPNAME5= <>
##$DPNAME6= <>
##$DPNAME7= <>
##$DPOAL= (0..7)
0.5 0.5 0.5 0.5 0.5 0.5 0.5 0.5 
##$DPOFFS= (0..7)
0 0 0 0 0 0 0 0 
##$DQDMODE= 0
##$DR= 18
##$DS= 0
##$DSLIST= <SSSSSSSSSSSSSSS>
$$ [...]
##$SUBNAM2= <"">
##$SUBNAM3= <"">
##$SUBNAM4= <"">
##$SUBNAM5= <"">
##$SUBNAM6= <"">
##$SUBNAM7= <"">
##$SUBNAM8= <"">
##$SUBNAM9= <"">
##$SW= 18.05172834244
##$SWIBOX= (0..15)
0 0 2 0 0 0 0 0 0 0 0 0 0 0 0 0 
##$SW_h= 3612.71676300578
##$TD= 16384
##$TD0= 1
##$TE= 0
##$TE2= 300
##$TE3= 300
##$TEG= 300
##$TL= (0..7)
0 120 120 120 120 120 120 120 
##$TP= (0..7)
150 150 150 150 150 150 150 150 
##$TP07= 0
##$TPNAME0= <>
##$TPNAME1= <>
##$TPNAME2= <>
##$TPNAME3= <>
##$TPNAME4= <>
##$TPNAME5= <>
##$TPNAME6= <>
##$TPNAME7= <>
##$TPOAL= (0..7)
0.5 0.5 0.5 0.5 0.5 0.5 0.5 0.5 
##$TPOFFS= (0..7)
0 0 0 0 0 0 0 0 
##$TUNHIN= 0
##$TUNHOUT= 0
##$TUNXOUT= 0
##$USERA1= <user>
##$USERA2= <user>
##$USERA3= <user>
##$USERA4= <user>
##$USERA5= <user>
##$V9= 5
##$VALIST= <valist>
##$VCLIST= <CCCCCCCCCCCCCCC>
##$VD= 0
##$VDLIST= <DDDDDDDDDDDDDDD>
##$VPLIST= <PPPPPPPPPPPPPPP>
##$VTLIST= <TTTTTTTTTTTTTTT>
##$WBST= 1024
##$WBSW= 4
##$XGAIN= (0..3)
0 0 0 0 
##$XL= 0
##$YL= 0
##$YMAX_a= 88406
##$YMIN_a= -172299
##$ZGOPTNS= <>
##$ZL1= 120
##$ZL2= 120
##$ZL3= 120
##$ZL4= 120
##$ABSF1= 10
##$ABSF2= 0
##$ABSG= 5
##$ABSL= 3
##$ALPHA= 0
##$AQORDER= 0
##$ASSFAC= 0
##$ASSFACI= 0
##$ASSFACX= 0
##$ASSWID= 0
##$AUNMP= <proc_1d>
##$AZFE= 0.1
##$AZFW= 0.1
##$BCFW= 1
##$BC_mod= 2
##$BYTORDP= 1
##$COROFFS= 0
##$CY= 11.3945322036743
##$DATMOD= 1
##$DC= 2
##$DFILT= <>
##$DTYPP= 0
##$F1P= 2.36226072786647
##$F2P= -0.459571619588291
##$FCOR= 0.5
##$FTSIZE= 0
##$FT_mod= 4
##$GAMMA= 1
##$GB= 0.15
##$INTBC= 1
##$INTSCL= 1
##$ISEN= 128
##$LB= 0.24
##$LEV0= 0
##$LPBIN= 0
##$MAXI= 10000
##$MC2= 0
##$MEAN= 0
##$ME_mod= 0
##$MI= 1.114404
##$NCOEF= 0
##$NC_proc= 0
##$NLEV= 6
##$NOISF1= 3.799351
##$NOISF2= 2.8
##$NSP= 1
##$NTH_PI= 0
##$NZP= 0
##$OFFSET= 15.70392
##$PC= 1
##$PHC0= -19121.61
##$PHC1= 23.40079
##$PH_mod= 1
##$PKNL= yes
##$PPARMOD= 0
##$PSCAL= 0
##$PSIGN= 0
##$REVERSE= no
##$SF= 200.130013532006
##$SI= 16384
##$SIGF1= 3
##$SIGF2= 2
##$SINO= 400
##$SIOLD= 16384
##$SREGLST= <1H.CDCl3>
##$SSB= 0
##$STSI= 0
##$STSR= 0
##$SW_p= 3612.71676300578
##$SYMM= 0
##$S_DEV= 0
##$TDeff= 0
##$TDoff= 0
##$TI= <>
##$TILT= no
##$TM1= 0
##$TM2= 0
##$TOPLEV= 0
##$USERP1= <user>
##$USERP2= <user>
##$USERP3= <user>
##$USERP4= <user>
##$USERP5= <user>
##$WDW= 1
##$XDIM= 8192
##$YMAX_p= 0
##$YMIN_p= 0
$$ End of Bruker specific parameters
$$ ---------------------------------
##NTUPLES= NMR FID
##VAR_NAME=  TIME,          FID/REAL,        FID/IMAG
##SYMBOL=    X,             R,               I
##VAR_TYPE=  INDEPENDENT,   DEPENDENT,       DEPENDENT
##VAR_FORM=  AFFN,          ASDF,            ASDF
##VAR_DIM=   8192,          8192,            8192
##UNITS=     SECONDS,       ARBITRARY UNITS, ARBITRARY UNITS
##FACTOR=    0.0002768,     1,               1
##FIRST=     0,             0,               0
##LAST=      2.2672688,     0,               0
##MIN=       0,             -172299,         0
##MAX=       2.2672688,     88406,           0
$$ Real data points
##PAGE= N=1
##DATA TABLE= (X++(R..R)), XYDATA
$$ [...]
1806B50K3o0l78j39K77K56k6m00K82k82M25k92m23O46j62n3j71N90l30p6k68L51
$$ 250 273 213 -165 -304 -27 229 203 -197 85 -197 228 -64 -487 159 -3 -56 -227 363 33 -43 -311 40
1828D0K01l09o1K53K11k30l16R5L65j40k3k92M50k14l26KM09j89m1q5J88K62k8
$$ 40 241 -68 -129 124 335 105 -211 -116 249 109 86 -206 244 30 -296 -294 115 -74 -115 -200 -12 250 222
1851B22k69J02l6L56p08L79J0J02j23j80J18K90k10j23J75J95l86k27J97O69l77
$$ 222 -47 55 19 375 -333 46 56 158 35 -145 -27 263 53 -70 105 300 -86 -313 -116 553 176
1872A76j89o0J18K62j98l18R3Q1K25l05m6M31Kl50j07K30J39k46l28J51N36n04
$$ 176 -13 -73 45 307 109 -209 -116 -35 190 -115 -161 270 272 -78 -185 45 184 -62 -390 -239 297 -207
1894b07J27O5K70l71r8k2J35L48m02k5N4L70k18j64J69l6J21l46o0K74K34O5m80
$$ -207 -80 -15 255 -116 -214 -236 -101 247 -155 -180 -126 244 26 -138 31 -5 116 -230 -290 -16 218 283 -197
1917a97J35L10q2n87L23J55J69l72O7M23l95j69Q6N61k60k74n7R3K60k75J64j67
$$ -197 -62 248 166 -421 -98 57 226 -146 -79 344 -51 -220 -134 427 167 -107 -164 -71 189 -86 78 -89
1939h9N03l39k48k2J54K07j72k25L55j3l00n4K55K68j73m52K32J89l6J03l27J63
$$ -89 414 75 -173 -195 -41 166 -6 -231 124 111 -189 -243 12 280 107 -345 -113 76 40 143 -184 -21
1961b1Q7j54qK56k34QJ8P0L79j93k97m6J69J04j69L3LN7j20j9J84k04L1PK48J09
$$ -21 66 -88 -96 160 -74 -66 -48 22 401 208 -89 -135 34 138 -31 2 5 62 -58 -77 107 -97 -66 -59 189 298
1987B98k70l0k14M40k88q9j59K12J21J09j08j49J93R7o5l05L58N0l4K21j67k09
$$ 298 28 -2 -216 224 -64 -153 -312 -100 21 130 22 -127 66 163 98 -207 151 201 167 388 221 12
2009A2k8k80N35j43l45K5K06J38j96J50L1k83L49r4l84J01L24J82j14j34O2j75
$$ 12 -16 -296 239 96 -249 -224 -18 120 -76 74 105 -178 171 77 -307 -206 118 300 186 52 114 -61
2031f1m63O05p6J51k69J19J33ol3l2l00K62j28o0M65n9j5l96P0L63l55m7k6k3
$$ -61 -524 81 5 156 -113 6 139 133 100 68 -232 30 -98 -158 307 248 233 -163 -93 270 -85 -132 -158 -181
2055a81P35p50l6J97J25J3j57J6L4J1R4m3J08P0l60j73M40k30P6j59J83J35J52
$$ -181 554 -196 -232 -35 90 103 -54 -38 -4 7 101 58 166 236 -124 -297 143 -87 -11 -170 13 148 300
2078C00j90l9J08j53j4j36L17p8L8l22L56O5k59J73l54J30J99k04k76J11M18j87
$$ 300 110 71 179 26 12 -124 193 115 153 -169 187 252 -7 166 -188 -58 141 -63 -339 -228 190 3
2100Cj7O9k81M98m70K8K72j31J05K36j33j81O7K2j9K85m82J06Q6k17J83k96J11
$$ 3 -14 55 -226 272 -198 -170 102 -29 76 312 179 -2 65 87 68 353 -129 -23 63 -154 29 -267 -156
2123a56K75m1qJ67k59q0K29m34N30j33L4j63mO2o1j5NM30k26l77j18O2K61J85
$$ -156 119 78 70 237 -22 -102 127 -307 223 90 124 -39 -43 19 -42 -57 -52 378 152 -225 -343 -281 -20 165
2147A65l51n8L18j36q7L94j7k15J07n7j44J27k30K92Jr3n0j24K30q1m9j28K40
$$ 165 -186 -244 74 -62 -149 245 228 13 120 63 -81 46 -184 108 109 16 -34 -158 72 -9 -58 -186 54
2170E4Q2j63l3k37L55K3J81k50q9M10l04k3j79K76k6j34J7%o9P0K0N7R2k79J58
$$ 54 136 -27 -60 -297 58 81 262 12 -77 333 29 6 -173 103 77 -57 -40 -40 -109 -39 -19 38 130 -149 9
2195Ij34K61o9O6l5K8r4r0j50m7J73J57m8n2K35jl54J63O3r4O4k7R9j21jJ94j6
$$ 9 -125 136 67 133 98 126 32 -58 -208 -255 -82 75 27 -25 210 209 -145 18 81 -13 51 24 123 2 1 195 179
2222A79n7L9k56p4R3L5J32q8j09K09n1k08K76l0k40L9K5L00k60J1Q4k27M1m8L47
$$ 179 122 161 -95 -169 -76 -41 91 3 -106 103 52 -156 120 90 -150 -111 -86 214 -46 -35 49 -178 -137 -185 162
2247A62J5N4j63m93L98O1N2n0j55K75p9k57J50p4m2J51j33K01j01K02l2j91J36
$$ 162 177 231 68 -425 -27 34 86 36 -119 156 77 -180 -30 -104 -146 5 -128 73 -28 174 142 -49 87
2270H7k05p9O0J9L26k82J04J25k71N1q7L92k85J80k34lj94K10q7K13l9k4J72j13
$$ 87 -118 -197 -137 -118 208 -74 30 155 -116 -65 -152 240 -45 135 -99 -102 -296 -86 -173 40 1 -23 149 36
2294C6j70J33Q0k98K2L95j75j92L26j59j10K4j7J6R3k15J89P7O9J16k37q6O0l0
$$ 36 -134 -1 79 -219 -197 198 23 -169 157 -2 -112 -88 -105 -89 4 -211 -22 55 124 240 3 -83 -23 -53
2318e3j28M8L79l59J51l4Q9j2J02n7j11o7j56K50K51j52j20KJ26k9j09q9K60k4
$$ -53 -181 -133 246 -113 38 4 93 81 183 126 15 -52 -208 42 293 141 21 23 149 120 11 -78 182 158
2342A58j00J93k68k1K47j83j3k91K30q5K35K2J96k58Rj89M10j29M2m39K44K6J31
$$ 158 58 251 -17 -38 209 26 13 -278 -48 -133 102 124 320 62 71 -118 292 163 205 -234 10 36 167
2365A67j59k00L14k8m67L45k95L4J89O4J81l51M15l15J78k52J60Q1j5k6j03O2
$$ 167 8 -192 122 94 -373 -28 -323 -289 -100 -36 145 -206 209 -106 72 -180 -20 61 46 20 -83 -21
2387b1K04j94J23k34r6M66j45R7k60J59k13J63L9j73J41K3j42Q7K09k47J44j43
$$ -21 183 -11 112 -122 -218 248 103 200 -60 99 -114 49 88 -85 56 79 -63 24 233 -14 130 -13
2409a3k17J31J20k1N9j00k58M16m33N86j65k72L19l7j49k5J51Q7j85j56P6J19
$$ -13 -230 -99 21 0 59 -41 -299 117 -316 270 105 -167 152 115 -34 -59 92 179 -6 -162 -86 33
2431C3l05K32K06j28k79M94q6k66J11L8J14k23O4p9J66l03J68K22k9KQ0l18J96
$$ 33 -272 -40 166 38 -241 253 167 -99 12 50 164 -59 5 -74 92 -211 -43 179 150 152 232 -86 110
2454A10k69R2j30M8n3R0J65J09k46p8K35p6m6j52K57j44j16P5L14j25j24p7J77
$$ 110 -159 -67 -197 -149 -202 -112 53 162 -84 -162 73 -3 -49 -201 56 -88 -204 -129 185 60 -64 -141 36
2477C6q1l0j42j4K57K47k23J99l51kP5J16K0k67J39j85K65Ql74M53k08K3j39K23
$$ 36 -45 -75 -217 -231 26 273 50 249 -102 -104 -29 87 107 -160 -21 -206 59 67 -307 146 -62 -39 -178 45
2501D5J49j97K6j38J1J10j10L32k31j28K40k26L2K13l00K39m1Ok03N1J59j37m
$$ 45 194 -3 23 -115 -104 6 -104 228 -3 -131 109 -117 -85 128 -172 67 26 32 -171 -120 39 -98 -102
2524a02j3J94j13lp2J31Q5o7j16J54m6L9K09m57J59N8r3K06k6j47j34K45Q7O2
$$ -102 -115 79 -34 -37 -109 22 107 40 -76 78 32 71 280 -177 -18 40 -53 153 127 -20 -154 91 178 240
2548B40j2k32p9O1j32J87o0J22j59J44N6m48N09q3k98K00j1M7j77J88P4k91K63
$$ 240 228 -4 -83 -22 -154 33 -27 95 -64 80 136 -312 197 114 -184 16 5 52 -125 63 137 -154 109
2571A09J30k75M1J8r5j40K96j23R8m8o9N3J75l66N1N0n8L44l86P6L71n60M66k
$$ 109 239 -36 5 23 -72 -212 84 -39 59 11 -58 -5 170 -196 -145 -95 -153 191 -195 -119 252 -308 158 156
2595A56k95J32R2l25j28L73n9nk23K75j42J50k66L66j67n2MJ45K8j06j69LK02
$$ 156 -139 -7 85 -240 -368 5 -54 -59 -282 -7 -149 1 -265 101 -66 -118 -114 31 59 -47 -216 -213 -11
2618a1j52J51K76j25j6m1k33J84J9j22K62l60j44L40m1o6j39K76K49k76J83K13
$$ -11 -163 -12 264 139 123 82 -151 33 52 -70 192 -168 -312 28 -13 -79 -218 58 307 31 214 427
2640D27m82p6L86j23l15N5K92l4r0J67l11J14J32j14k8J5Q1l7J55P2m70N7K88
$$ 427 -55 -131 255 132 -183 -128 164 130 40 207 -104 10 142 28 0 15 96 59 214 286 -184 -127 161
2663A61j93j2n9r3K29o3k52L62j67J94M7k02M6QP5j79P8nj91J46K37r8j75K28
$$ 161 -32 -44 -103 -196 33 -30 -282 80 -87 107 154 -48 -2 6 81 -98 -20 -25 -216 -70 167 69 -106 122
2687A22k45q8J09p6k6k3j2J5K97J86k8m15K00j01MJ34k53N13j67J5j46Qj10Q2
$$ 122 -123 -211 -102 -178 -204 -227 -239 -224 73 259 231 -184 16 -85 -81 53 -200 313 146 161 15 23 -87 -5
2711en3q9K98l05K06l4q5p8L84o33J23J60q6K42J08k50J02j69K54l07J24J01j60
$$ -5 -58 -147 151 -154 52 18 -67 -145 239 -394 -271 -111 -197 45 153 -97 5 -164 90 -217 -93 8 -152
2734a52K00NK02l96RPL54l49J72K9k1p2Q0k45L07j9J09k42J81j9l04J61J78j31
$$ -152 48 53 255 -141 -132 -125 229 -120 52 81 60 -12 68 -177 130 111 220 -22 159 140 -164 -3 175 44
2758D4k84L49J16k69J2J52k27L84l59r0K58j68N2K18j43qJ12r5n2N6n2M9j73J61
$$ 44 -240 109 225 -44 -32 120 -107 277 -82 -172 86 -82 -30 188 45 37 149 54 2 58 6 55 -118 43
2782D3N7o9O6l03l5L46l5o5k39l4J55J46j90L13R8m23K79k44J24K66l16n5k6K19
$$ 43 100 31 97 -206 -241 105 70 5 -234 -268 -113 33 -157 156 254 -169 110 -134 -10 256 -60 -115 -141 78
2806G8kj03J3n9K13k3J03J19k32N3p4Q4J15j42j68p3K8J84j3l05L53J91l18j41
$$ 78 76 -27 -14 -73 140 117 220 339 107 160 86 170 285 143 -25 -98 -70 114 101 -204 149 340 22 -119
2830a19R7J39k31J56K1J90j38k34j2OL76l81m8L4M84l94j19L10k36j30M09k21
$$ -119 -22 117 -114 42 63 253 115 -119 -131 -125 251 -130 -178 -144 340 -54 -173 137 -99 -229 180 -41
2852d1O2l0J1M7j33K20k64o8j0J23oJ30O3k20L16k43q0K26o7k6J4n6J18l27M73
$$ -41 21 -9 2 49 -84 136 -128 -196 -206 -83 -89 41 104 -116 200 -43 -123 103 36 10 24 -32 86 -241 232
2877B32l32K79l97M01k54L18j49J69k44o5K17j97J34j25N4j34J69k65K25k31J68
$$ 232 -100 179 -218 183 -71 247 98 267 23 -42 175 -22 112 -13 41 -93 76 -189 36 -195 -27
2898b7J7M7K5j31L55l08j9J39Kp6q0J4J19k05nK54n6K23j85j11J20l8m7P0J83
$$ -27 -10 37 62 -69 286 -22 -41 98 100 24 -56 -42 77 -128 -133 121 65 288 103 -8 112 74 27 97 280
2923B80m52MJ58n7Q6J46m91J99P6O3p5n9J20J31q8o2J1J40l3j47L7Q8m4j79J54
$$ 280 -172 -168 -10 -67 19 165 -326 -127 -51 12 -63 -122 -2 129 41 -21 -10 130 97 -50 -13 75 31 -148 6
2948FQ4k44J10J11o1K14l23J07l1q4r0J08O6O1j48N7K01M2q5j32nO3Nk34L26j01
$$ 6 90 -154 -44 67 6 220 -103 4 -27 -111 -201 -93 -27 34 -114 -57 144 186 101 -31 -36 27 32 -202 124 23
2974B3K48p4j89M7l5o0m3j50P3J54k15M23l75p7K24LR5j29N8K93l68L40o44J03
$$ 23 271 197 8 55 20 -40 -83 -233 -160 -6 -221 202 -173 -250 -26 -23 72 -57 1 294 -74 266 -378 -275
2998b75L24L9k13j00P1K11O0j55l4j1K08q2o4K5N4O3j96K52l36M3L96n75K68P6
$$ -275 49 88 -125 -225 -154 57 117 -38 -72 -83 125 43 -21 4 58 121 -75 177 -159 -116 280 -295 -27 49
3022D9n2Q6j96L7K86k68k12N64l47K5K10j47K63m64P6n7K60j4k61K12k52J9K52
$$ 49 -3 83 -113 -76 210 -58 -270 294 -53 -28 182 35 298 -166 -90 -147 113 99 -162 50 -202 -183 69
3045F9o6P2L6k17R3R4L6j38j46K79j97r6L13O8j49k1k5J02j42k3L2p5K06j24K44
$$ 69 3 75 111 -106 -13 81 117 -21 -167 112 -85 -181 132 200 51 30 5 107 -35 -58 -26 -101 105 -19 225
3070B25k42K50n33L60j97J20L55l35k9J80k63J32p4J61k78K62R6j68n3K20j41
$$ 225 -17 233 -300 60 -137 -17 338 3 -26 154 -109 23 -51 110 -168 94 190 22 -31 189 48
3091D8N5L9l21kk5P5J71P5P7j36O0k30m1K01J70l7q8R4l38J07J66q2K51l76NP2
$$ 48 103 142 -179 -181 -206 -131 40 115 192 56 116 -114 -155 46 216 179 91 185 -153 -46 120 38 289 -87 -82 -10
3117a0j1L8J28l73R6j15L07k47l6K90m2J26r5j57L34k92P0rj4j91K37J45l37q2
$$ -10 -21 17 145 -228 -132 -247 60 -187 -223 67 25 151 56 -101 233 -59 11 2 -12 -203 34 179 -158 -240
3141b40k03K71L39j22J03j88J41p7M7p0O5r2J34l08J71P1k9J15j33j18nK98l40
$$ -240 -443 -172 167 45 148 -40 101 24 71 1 66 -26 108 -200 -29 42 13 128 -5 -123 -128 170 -170
3164a70J11j09L28M0J0m78K58J77j96L33j90p0k30q0M6NL75k45K71k01n0k25K19
$$ -170 -59 -168 160 200 210 -268 -10 167 -29 304 114 44 -186 -266 -220 -215 160 -85 186 -15 -65 -290 -71
3187g1j14K51l05M39k49rL09l94J11K3J38m74L79J13n0oj77Q4J37r7J02j24M5
$$ -71 -185 66 -239 200 -49 -58 251 -143 -32 -9 129 -345 34 147 97 91 -86 -2 135 38 140 16 61
3210F1K1r4p6O8L93k93j28J23j86J23J41J76j75r5O9k15Q1J11K61k02k70R0n8
$$ 61 82 -12 -88 -20 373 80 -48 75 -111 12 153 329 154 59 128 -87 -6 105 366 164 -106 -16 -74
3233g4k6J20q9K31j96j1k95L90j65P2J81r4J38k10p8P0k07L62l34P8J26j06J13
$$ -74 -100 20 -69 162 -34 -45 -340 50 -115 -43 138 44 182 -28 -106 -36 -243 119 -215 -137 -11 -117 -4
3256dq4L18l44j6J47j21K57k91K58j60m1J0J29J9j04j17L5J50J14n3j71L14JK7
$$ -4 -88 230 -114 -130 17 -104 153 -138 120 -40 -81 -71 58 77 -27 -144 -109 41 155 102 -69 245 246 273
3280B73j93k68J7J61k81K76p5QQR8J01k32J01m1J28M7l80L13J36l87K88k02N4
$$ 273 80 -188 -171 -10 -291 -15 -90 -82 -74 24 125 -107 -6 -47 81 128 -252 61 197 -190 98 -104 -50
3303e0K01k25J32l25K23p2O08o70p9L17l6j24k19K61J7J31j88o1J17J07j43LJ90
$$ -50 151 -74 58 -267 -44 -116 492 -178 -257 60 24 -100 -319 -58 -41 90 -98 -159 -42 65 -78 -75 115
3326A15k09j15J4K88K5l13K94n6j59J50j12N9o8p6K39M6r5L4K1n2j58M62l59J2
$$ 115 -94 -209 -195 93 118 -195 99 43 -116 34 -78 -19 -87 -163 76 122 27 61 82 30 -128 334 -25 -13
3350a3K72l45L3J64o3L1jm5J27q2kN0k69K15Mj07K14n82K54K21j46j0j3Q3J1R0
$$ -13 259 -86 -53 111 48 79 78 33 160 78 76 126 -143 72 76 -31 183 -399 -145 76 -70 -80 -93 -10 1 91
3376I1k46p2J19J52l9J8L36j95k69K98k81L28j95r4j07L4J05J69O0j86L18j96
$$ 91 -155 -227 -108 44 5 23 359 164 -105 193 -88 240 45 -49 -156 -122 -17 152 212 26 344 148
3398A48l9j12K6j94p4K53j79N7J02J3L40n62M84j78r4j28L90l31J49n6K01j46
$$ 148 109 -3 23 -171 -245 8 -171 -114 -12 1 341 -221 263 85 -9 -137 253 -78 71 15 216 70
3420G0j18K3j6N6L0l05J52J46J63l91K86p4j62O5j0K67r7R0j96L1j67J03K07J19
$$ 70 -48 -25 -41 15 45 -260 -108 38 201 -190 96 22 -140 -75 -85 182 85 175 -21 10 -157 -54 153 272
3444B72m4k60J45k24k3o0M9J33J8R8k41J17p6J02K43j56k85K16j15J84n8j39N9
$$ 272 228 -32 113 -111 -134 -194 -145 -12 6 104 -137 -20 -96 6 249 93 -192 24 -91 93 35 -104 -45
3467d5K20l44J70p8J33j60J12j88L87m25J53J31K1j57O3k32L73P4k03M8l8J40
$$ -45 175 -169 1 -77 56 -104 8 -180 207 -218 -65 66 87 -70 -7 -239 134 208 5 53 15 155
3489A55k48l7K46k09J34J94p9j90J4j06J67p4J87k22J53k38L50Lj38p7J90k8r9
$$ 155 -93 -130 116 -93 41 235 156 -34 -20 -126 41 -33 154 -68 85 -153 197 200 62 -15 175 147 48
3512D8q1j32K27K66k36n22N12rj10J8N3J08l18M02l22j13L64k5k52K37q6M0k7
$$ 48 -33 -165 62 328 92 -430 82 73 -37 -19 34 142 -176 226 -96 -209 155 130 -122 115 29 69 42
3535D2K17l13J34p1J10j13Q3J33l27J17L1j06k80L83J63J02m33L20k75J25j44
$$ 42 259 -54 80 9 119 6 89 222 -105 12 43 -63 -343 40 203 305 -128 192 -83 42 -102
3556a02K02l25J13k26M88j38J31k07K03j27q1K14j73J51k28K23k57M3m6K26P3
$$ -102 100 -225 -112 -338 150 12 143 -64 139 12 -69 145 -28 123 -105 118 -139 -96 -142 84 157
3577A57J39m70M73k58l7J05k15J49J1J99Ll19K5M7n9J44j67l26K26J29R7l5J10
$$ 157 296 -174 299 41 4 109 -106 43 54 253 256 -63 -38 9 -50 94 -73 -399 -173 -44 53 18 128
3600A28q3q5J40J62k32O8j75K41l65P9L21r2j73j24N31n74K62J27j53j97M52J3
$$ 128 45 -40 100 262 30 98 -77 164 -201 -122 199 107 -66 -190 341 -233 29 156 3 -194 258 271
3622B71l00p7J03r3J6j71K02m8j4J11n6NP2L48m92J06p3j1L7k4J31j62P7J34j90
$$ 271 -29 -106 -3 -96 -80 -251 -49 -97 -111 0 -56 -51 21 369 -123 -17 -90 -101 -64 -88 43 -119 -42 92 -98
3647i8R2j59L13l01L76m05J46N0n7K20k77K90j36J04l78K15n6R5J24l41L29j88
$$ -98 -6 -165 148 -153 223 -182 -36 14 -43 177 -100 190 54 158 -220 -5 -61 34 158 -183 146 -42
3669d2J14k19J22j52K66j08Q3J06j98p0P3J74l32L42o4n4Q3j19m2j22J19L9K39
$$ -42 72 -147 -25 -177 89 -19 64 170 -28 -98 -25 149 -183 159 95 41 124 5 -37 -159 -40 -1 238
3692B38m76L63q8j03MK03j23rj19l0p7J44J70k83K81l16K63J53j85r2O8M4j82
$$ 238 -238 125 37 -66 -62 141 18 9 -110 -140 -217 -73 97 -186 95 -221 42 195 10 -82 -14 30 -152
3715a52m8M69l54K0L4P7r8k9J51j27J37j90K74k45K65k46J74l0KP2l18J83j42
$$ -152 -200 269 -85 -65 -31 46 -52 -81 70 -57 80 -110 164 -81 184 -62 112 82 84 156 -162 21 -121
3738a21J13M0Kr1K84k97k7O4J70k90J76n2J9kJ36p1q2M8j08l0J46J31l2j66l6
$$ -121 -8 32 34 -57 227 -70 -97 -33 137 -153 23 -29 -10 -12 124 53 -29 19 -89 -119 27 158 126 -40 -76
3763g6k09J87K34j68Q1k49K14k32M72q4l45K91k45K75p9J41J3j80m9k37J75k38
$$ -76 -285 -98 136 -32 49 -200 14 -218 254 170 -175 116 -129 146 67 208 221 41 -8 -245 -70 -308
3785c08K36L4J43K48k87m3k70J5J53K92K7l83J06M7j66N6K08j86K33j17k99L66
$$ -308 -72 -38 105 353 66 23 -247 -232 -79 213 240 -143 -37 10 -156 -100 108 -78 155 38 -261 105
3807A05j15J88k71q0M29O5l34j59K41k61N49m43K09j31N6r7J52k63M66o07K47
$$ 105 -10 178 -93 -173 256 321 -13 -172 69 -192 357 -86 123 -8 48 -49 103 -160 306 -301 -54
3828e4K73j79J84j48j29M2P3o1n1K06M1j65J89n2k1k86J32j58K54n1P1l45J81
$$ -54 219 40 224 76 -53 -11 62 1 -50 156 197 32 221 169 148 -138 -6 -164 90 39 110 -235 -54
3851e4n0M6j46J78m1j72J8K68j5k99J78J49k08Q1m4L71k59J28J24n08J99j02O7
$$ -54 -104 -58 -204 -26 -67 -239 -221 47 32 -267 -89 60 -148 -67 -111 260 1 129 253 -255 -56 -158 -91
3874i1L12k54lQ9j81K85k32L1l2p5J3J47J81j72J24k40Q8K31j33k71K75J08j59
$$ -91 221 -33 -36 53 -128 157 -75 -44 -76 -151 -138 9 190 18 142 -98 -10 221 88 -183 92 200 41
3897D1j03m0K15l62Q0q7L59j32J30k88Q4j23L04j58L45j1j66N1j57L6k63K83J2
$$ 41 -62 -102 113 -249 -169 -256 103 -29 101 -187 -103 -226 78 -80 265 254 88 139 -18 18 -245 38 50
3920E0M9r6L17k31j11J03l2q9J93j95PR6N8Pj17j91j9K69J48n08K76K3rjO1j93
$$ 50 99 3 320 89 -22 81 49 -40 153 -42 -35 61 119 126 9 -182 -201 68 216 -292 -16 7 -2 -3 58 -135
3946a35K66n2q4k4J45j67P3M0j00J0O0j08q9J91j48o5P8J20K5j49L19l65P9J21
$$ -135 131 79 -5 -29 116 -51 22 62 -38 -28 32 -76 -165 26 -122 -187 -109 11 36 -113 206 -159 -80 41
3970D1J01p9j19m3j05J98m9j06J86l5J33n2j22J35j47Q6K4Q0m8p5J07k16L57k78
$$ 41 142 63 -56 -99 -204 -6 -55 -161 25 -10 123 71 -51 84 -63 23 47 127 79 4 111 -105 252 -26
3994b6J26j83K41j20J75r4j47j13J79K03l66l3O6Q5K48j85p2q9J84no4l3n1L05
$$ -26 100 -83 158 38 213 119 -28 -141 38 241 -125 -158 -92 -7 241 56 -16 -105 79 74 10 -23 -74 231
4018B31k94J13Q2J04k31j11K65l81K04j84K83q3n9qK27m0j80J78m41N28p1j41
$$ 231 -63 50 132 236 5 -106 159 -222 -18 -202 81 -2 -61 -69 158 118 -62 116 -325 203 132 -9
4040iJ10J87j68O3k13N5lkn2K27k73K61j96K8J73k51J39r8O3k86K29J4K38j71
$$ -9 101 288 120 183 -30 25 22 20 -32 195 -78 183 -13 15 188 -63 76 -22 41 -245 -16 -2 236 65
4064F5p4P2R4l09r0K38J18O0k78K69n5KJ25l64K93l29K27k30J51j08j48L46M5
$$ 65 -9 63 157 -152 -242 -4 114 174 -104 165 110 112 237 -127 166 -163 64 -166 -15 -123 -271 75 120
4087A20r3l71L64N5Q9j05k61J45J52l92K48K51l29J56J43k81J81K5j97L42k76
$$ 120 27 -344 20 75 164 59 -202 -57 95 -297 -49 202 -127 29 172 -109 72 97 -100 242 -34
4108c4j3O8p6K12j33j00j11K71N0qj12J00Q9k11l2L9OJ59l52J58l8M63l99m9R1
$$ -34 -47 21 -55 157 24 -76 -187 84 134 126 14 114 203 -8 -40 -1 5 164 -188 -30 -68 395 -4 -53 38
4133C8J07j28J73k16o3j06K82K24k91J10j7l35L62p9j13k66L80m2k38L51l06L76
$$ 38 145 17 190 -26 -89 -195 87 311 20 130 113 -222 140 61 -52 -318 62 20 -218 133 -173 203
4155B03l21J73N0k00j8K60j98n7j6J14J73n5j73N3j34l8J27j32J93pj09Q2j4P3
$$ 203 -118 55 105 -95 -113 147 -51 -108 -124 -10 163 108 -65 -12 -146 -184 -57 -189 4 -3 -112 -30 -44 29
4179B9j47N4J06k98J07j19M60j31Rp8j27j0K27j68K37j03j9j76J64J19k36J75
$$ 29 -118 -64 42 -256 -149 -268 192 61 70 -8 -135 -145 82 -86 151 48 29 -147 17 136 -100 75
4201G5k71K5L07j63J2J95l62J29j7j37L10j9N6l00J66K33l18J71j87R1m4k3k16
$$ 75 -196 -171 136 -27 -15 180 -182 -53 -70 -207 103 84 140 -160 6 239 -79 92 -95 -4 -48 -71 -287
4224b87J71L20l04L94l4l63l4J65j04l4l7J71j0j65J14L07j76P3k82L19O9l34
$$ -287 -116 204 -100 294 260 -103 -137 28 -76 -110 -147 24 14 -151 -37 270 94 167 -115 204 273 -61
4246f1j69L12j00j81J85P0M0J06j31K9q0o6K24j33k60K30K22n26N98m25J66j78
$$ -61 -230 82 -18 -199 -14 56 96 202 71 100 20 -46 178 45 -215 15 237 -289 309 -116 50 -128
4268a28l6q8K93k33J72O5j1j10R6o2J15L9k31R5j00j40J65j13J51P0K8j05l5L20
$$ -128 -164 -252 41 -192 -20 45 34 -76 20 -42 73 112 -119 -24 -124 -264 -99 -212 -61 9 37 -68 -103 217
4292B17j06j99N1J0n7J55Rl29L25K7l95N10n34L18L7O5p1M8P8p0O0l09L45k05
$$ 217 111 -88 -37 -27 -84 71 80 -249 76 103 -292 218 -316 2 39 104 33 81 159 89 149 -160 185 -20
4316b0p2J84j44j16L45k77J9K53J16l67r4J66l8K84k99K69k89k4J38j02J27j02
$$ -20 -92 92 -52 -168 177 -100 -81 172 288 -79 -173 -7 -45 239 -60 209 -80 -104 34 -68 59 -43
4338d3J4p5K58n4j85K16k19J5j89j12M68K2P3j57j60K67k1m26J78m6J75J17j38
$$ -43 -29 -104 154 100 -85 131 -88 -73 -262 -374 94 116 189 32 -128 139 118 -308 -130 -176 -1 116 -22
4361b2K15j65r4P3k3k4l8R1M4k06N3Lj05N77l87r4J44J55k17r0J41k65L84j35
$$ -22 193 28 -66 7 -16 -40 -78 13 57 -149 -96 -93 -198 379 -8 -102 42 197 -20 -110 31 -234 150 15
4385A5k63J78J49o5Q6RR9p5m9j90O7j44K04R3j63N0l7J76k57L64k97k3M7J26L7
$$ 15 -248 -70 79 14 100 109 208 133 84 -106 -39 -183 21 114 -49 1 -36 140 -117 247 -50 -73 -26 100 137
4410A37P3l88J39p4K79j93J82k21j32M43r4l27J34j79K89J26j71k9J06l28J48
$$ 137 210 -178 -39 -113 166 -27 155 -66 -198 245 151 -176 -42 -221 68 194 23 -6 100 -228 -80
4431h0O3O5P8k60J70j03P0k8K31l28J19j32J22j5m5j91N18j10j12L44k70j20j61
$$ -80 -17 48 126 -134 36 -67 3 -25 206 -122 -3 -135 -13 -28 -73 -264 254 144 32 376 106 -14 -175
4454a75J74j55J51K18M0p2o8j12L56l77Q4j07J48j87M19j26m49LN05j85K6k11
$$ -175 -1 -156 -5 213 253 181 113 1 357 -20 64 -43 105 -82 337 211 -238 -235 270 85 111 -100
4476a00N9J8j9j75M19j37m7J19j17l8j9P1m3k5q1P0J81j37K58j42k9J14K2l57
$$ -100 -41 -23 -42 -217 202 65 18 137 20 -18 -37 34 -9 -34 -115 -45 136 -1 257 115 86 200 222 -135
4500a35L98o3k71L97k08J05O6l10k9N9p0N2J97r2k02K17P2p2r7L9L9j93j16O0
$$ -135 263 200 -71 326 118 223 289 -21 -50 9 -61 -9 188 96 -106 111 183 111 14 53 92 -101 -217 -157
4524a57m3M66p1k62J58j01j8m3J61J34j01l34L43J40m31K59J37j8j71Q5j61J49
$$ -157 -200 266 195 -67 91 -10 -28 -71 90 224 123 -211 132 272 -159 100 237 219 48 133 -28 121
4546A21n2l14J06j31L94k40J90j68o7J45K27l14J99J59j71p6k5n5J25R4l99J27
$$ 121 69 -245 -139 -270 124 -116 74 -94 -161 -16 211 -103 96 255 84 8 -17 -72 53 147 -252 -125
4568a25R8j35m8K49n8K51l95K19k36L25j70K9j09O8R6j47L56j98Q8k67L33j99
$$ -125 -27 -162 -210 39 -19 232 -163 56 -180 145 -25 4 -105 -37 59 -88 268 70 158 -109 224 25
4590B5k09J71J71n0J54j34k27R5M9j28P8K6J84k41j23n9K29L3R2l23J62J38r3
$$ 25 -184 -13 158 108 262 128 -99 -4 45 -83 -5 21 205 -36 -159 -218 11 44 136 -187 -25 113 20
4613B0j21K8K14J38m02j48L10p0Q5P5j91j28N7R5l5j21M9M2J38r9J53k81K72j44
$$ 20 -101 -73 141 279 -123 -271 39 -31 54 129 -62 -190 -133 -38 -73 -194 -145 -103 35 -64 89 -192 80 -64
4637f4J03J9j53K36l28L0K63J58m48L67k33K67k06n6M0j54J47oj78K02L4J96k05
$$ -64 39 58 -95 141 -187 -157 106 264 -184 183 -50 217 11 -45 -5 -159 -12 -18 -196 6 40 236 31
4660C1N5l13K50J32k63J48p4j43N5J06J97j29n7J31l37J17j78P5K4M03k86K38
$$ 31 86 -227 23 155 -108 40 -34 -177 -122 -16 181 52 -5 126 -211 -94 -272 -197 -173 230 -56 182
4682A82o0J4j64j02J36L1l8J6j12L4J59p8J61j70K09k42P0K11k96N41l31j02K37
$$ 182 122 136 -28 -130 6 37 -1 15 -97 -63 96 18 179 9 218 -24 46 257 -39 502 171 69 306
4705C06m04L90k73J58l72J78K39j72q2K31k17l9K60j64j79M3j01J16nL23j15k89
$$ 306 -98 292 19 177 -195 -17 222 50 -32 199 -18 -57 203 39 -140 -97 -198 -82 -87 236 121 -168
4727a68n4K02k71K37J20j81o2J91N2k31J70J61p6o8k05m4L22k16J16j34j47L40
$$ -168 -222 -20 -291 -54 66 -115 -177 14 66 -165 5 166 90 22 -183 -227 95 -121 -5 -139 -286 54
4749E4n6k14J71m1K61j61j50N5K14k33J00p7K03k58m9L46m0l45J81L2n7q7p4J95
$$ 54 -2 -216 -45 -86 175 14 -136 -81 133 -100 0 -77 126 -132 -181 165 125 -220 -39 -7 -64 -151 -225 -30
4773c0R0j40L07l52J56K22j16m5k5p0N9k4j60J17nJ23j82o2K48N2k10l5J12k69
$$ -30 60 -80 227 -125 31 253 137 92 67 -3 56 32 -128 -11 -16 107 -75 -137 111 163 -47 -82 30 -239
4797b39m2J29k2L80m76M09j90M0K18k59k0l9L0J99k15p4K44Ko0j0N4O9l40Q0O3
$$ -239 -281 -152 -174 206 -270 139 -51 -11 207 -52 -72 -111 -81 118 -97 -171 73 75 15 5 59 128 -212 -132 -69
4822f9J40k37J67J11L6j33j43K00j82K25k14R5O8J99l06j86L25o6O4r0K00k89
$$ -69 71 -166 1 112 148 15 -128 72 -110 115 -99 -4 64 263 -43 -229 96 30 94 4 204 -85
4844h5l1M8O6Q4J46m63K68K69j78l08J44R9k35K56kk15p2J36q5J50R7M1l11M0
$$ -85 -116 -68 -2 82 228 -235 33 302 124 -184 -40 59 -176 80 78 -137 -209 -73 -158 -8 89 130 -181 -141
4868a41K23J29j72k60L97l84J89%KJ86Q8k74j26L15l60K5K64M2k14K36k89M5K3
$$ -141 82 211 39 -221 176 -208 -19 -19 -17 169 257 -17 -143 172 -188 -163 101 143 -71 165 -124 -79 -56
4891e6L2K6m8j70J13J6J86j97K43j32l08L17j67K38j89J9R7r4J3J77k72N7j9J96
$$ -56 -24 2 -46 -216 -103 -87 99 -98 145 13 -295 22 -145 93 -96 -77 20 -74 -61 116 -156 -99 -118 78
4915G8k16m8J79J61q8j36n4M53k76k54n2K81J20k7j45j33M21m68J13l3J53L8L67
$$ 78 -138 -186 -7 154 66 -70 -124 329 53 -201 -253 28 148 121 -24 -157 264 -204 -91 -124 29 67 434
4938D34j00j97k94j96L81K01k89L0J40k39N9N2L1j6K23k08J1m1J03j86N2o0n3
$$ 434 334 137 -157 -353 28 229 -60 -30 110 -129 -70 -18 13 -3 220 12 23 -18 85 -101 -49 -109 -162
4961a62J92j30o2J76J14l1k6j16J33k59J98J43l43K93l70M09r5k9L9j6j70K00
$$ -162 30 -100 -162 14 128 97 71 -45 88 -171 27 170 -173 120 -250 159 64 35 74 58 -112 88
4983H8O6p9k76J03L8J06j1MJ8J40R7Q5n84P4K7L15m48M2L01k2rj64J80k32L00
$$ 88 154 75 -201 -98 -60 46 35 39 57 197 294 379 -205 -131 -104 211 -237 -195 106 84 75 -89 91 -141 159
5008A59l20L13j71K8J25P5k32J39j35J4k35L18J2k4J34l11K05j49J00n4j5J35
$$ 159 -161 152 -19 9 134 209 -23 116 -19 -5 -240 78 90 66 200 -111 94 -55 45 -9 -24 111
5030A11j1P3j54N1L9J0j99J73j40K35k32p0m6L53j07j11n5Q2Q5k12K12J8j44O8
$$ 111 100 173 19 70 109 119 -80 93 -47 188 -44 -114 -160 193 86 -25 -80 2 87 -125 87 105 -39 29
5054B9O9q4M5k43J25K91m96L41O5j47K6J21l0p7j97K11j39P5l0K7q2P0mJ65j59
$$ 29 98 14 59 -184 -59 232 -264 77 142 -5 21 142 112 35 -162 49 -90 -15 -45 -18 -100 -30 -34 131 -28
5079b8J30j86n5P4m1J24j74J41j74J23K19j61K6j51k7K4K48P7P0l06k23J25J42
$$ -28 102 -84 -139 -65 -106 18 -156 -15 -189 -66 153 -8 18 -133 -160 -136 112 189 259 -47 -270 -145 -3
5102cj04j49K62j55O2J77j42l4K6N9L0K2J19qj61K69q7j82K50k86k33N3J89J96
$$ -3 -107 -256 6 -149 -87 90 -52 -86 -60 -1 29 51 170 162 1 270 183 1 251 -35 -268 -215 -26 170
5126A70k54NQO3j27K15j37n7J6K12l29K03k4q3p8K42J17j86J81p8K9k01M3J43
$$ 170 -84 -79 -71 -8 -135 80 -57 -114 -98 114 -215 -12 -36 -119 -197 45 162 -24 157 79 108 -93 -50 93
5150I3k02q1K21j26J57K3k74P0L3Q7k33K30l63K99j5P4k9lJ39k42P8r4L59J22
$$ 93 -109 -190 31 -95 62 85 -189 -119 -86 1 -232 -2 -365 -66 -81 -7 -36 -39 100 -142 -64 -158 201 323
5174C23j09K0p3J13l29j5l4J30p8K17Nk42K65k07m7q0K20k89K28p1N2j33K38j07
$$ 323 214 234 161 274 -55 -70 -104 26 -52 165 170 -72 193 -14 -61 -141 79 -210 18 -53 -1 -134 104 -3
5198cJ00k57J36O0j9j22O4J66j30j96J29J7P6j42K5R8K5r5L13j63j57k7L15l48
$$ -3 97 -160 -24 36 17 -105 -41 125 -5 -201 -72 -55 21 -121 -96 2 27 -68 245 82 -75 -102 213 -135
5222a35r4L99j89q2J20L32l42R2j85J84Q6k65k9J3j66L74j48Q3L2k8P9Q1l57l8
$$ -135 -229 170 -19 -101 19 351 9 101 -84 100 186 -79 -108 -95 -261 113 -35 48 80 52 131 212 -145 -183
5246a83K44j89J59K24m65N1K57R0j76p0k3J03J26j10o2k08J79P2K9j79J44j32
$$ -183 61 -128 31 255 -210 -159 98 188 12 -58 -81 22 148 38 -24 -232 -53 19 48 -131 13 -119
5268a19N0K6J7R9m6o2P2Q0O8k90N5j09L83l03J32j1J69l59L05oo0l14R5K97j26
$$ -119 -69 -43 -26 73 27 -35 37 117 185 -105 -50 -159 224 -79 53 42 211 -148 157 151 91 -223 -128 169 43
5293D3p8K5k15J99K59k74L03o4j86K15q0k57P3k15L91j02m3o0p2J61o2O2j07J39
$$ 43 -35 -10 -225 -26 233 -41 262 198 12 227 147 -110 -37 -252 139 37 -6 -66 -138 23 -39 23 -84 55
5317E5j16M4K30k34o7J23jN4l99n5N61k79n6K76k59kK26Nn0Qj18M7J00k44K85
$$ 55 -61 -17 213 -21 -88 35 34 88 -311 -366 195 -84 -140 136 -123 -125 101 106 56 64 -54 -7 93 -151 134
5342A34NOk73K37l04K20l4K51J44k73j29P7l34M37j41m4N6j09O3O3J37r4Kp4n
$$ 134 139 145 -128 109 -195 25 -9 242 386 113 -16 61 -273 164 23 -21 35 -74 -11 52 189 95 97 23 18
5367A8M5j11Q6m2m3J33l5r8P1P5k18J77o9k5j26M46m09J7n8P0K87m2k36P9O6n2
$$ 18 63 -48 38 -4 -47 86 51 -47 24 99 -119 58 -11 -36 -162 284 -125 -108 -166 -96 191 149 -87 -8 58 6
5393FP0j35p1J17K54k20J96q8Pk37K04J08k62K9j06L42j83q5K32k10J27k38K62
$$ 6 76 -59 -130 -13 241 21 217 129 136 -101 103 211 -51 -22 -128 214 31 -54 178 -32 95 -143 119
5416A19r2j43J41k24K80K1j46K97k54L2r9j9M68r3k39M6m0P2k66L81k81J52m8
$$ 119 27 -116 25 -199 81 102 -44 253 -1 31 -68 -87 381 288 49 95 55 127 -139 242 -39 113 65
5439F5O6J8m6j3j4n2k93K05m9K31k27O8l2j81K79K35k51J40k00k6k59M02n1j62
$$ 65 131 149 103 90 76 24 -269 -64 -113 118 -109 -41 -73 -254 25 260 9 149 -51 -77 -336 66 15 -147
5463a47L92j89j27m6P5n9O9K52j92M9K78m53J70p0K53k33J28m12L68j50Q9lk3
$$ -147 245 56 -71 -117 -42 -101 -32 220 28 77 355 -98 72 2 255 22 150 -262 106 -44 45 42 19
5486A9J18k32J38p7K29j53k11J58l2o6K02r6m8p0K25O4J02l90K99k05k06J11Q6
$$ 19 137 -95 43 -34 195 42 -169 -11 -43 -109 93 -3 -51 -121 104 168 270 -120 179 -26 -232 -121 -35
5509c5P7k34J90J83k12j58Q0J16n1n2L14m38J10J54r2R5r3J07J61j65K6jj09M6
$$ -35 42 -192 -2 181 -31 -189 -109 7 -44 -96 218 -220 -110 44 -48 47 -46 61 222 57 83 82 -27 19
5533A9rK78j95j71Mk16M84k98J00J48j82p4K11o3j70K85l71Q3L20j94J21l8l46
$$ 19 10 288 93 -78 -74 -290 194 -104 -4 144 -38 -112 99 36 -134 151 -220 -137 183 -11 110 72 -274
5556b74J86K63k52K85j15mp4l0j6M0M5k38o6J78j54K61nn7Q8O2l4P0k33j29J45
$$ -274 -88 175 -77 208 93 89 15 -15 -31 9 54 -184 -250 -72 -226 35 30 -27 61 123 89 159 -74 -203 -58
5581e8R9l7K05k44j18J65r4J82m25L7J16L17k00Q0j16J56j74R7J17o2mj99J62
$$ -58 41 4 209 -35 -153 12 -82 100 -325 -288 -172 145 -55 25 -91 65 -109 -12 105 43 39 -160 2
5604Bk2L20j39k39J9m25M23L1J37L5J29m78L40j28L5R8j82O9L25m80J30J38l6
$$ 2 -20 300 161 -78 -59 -484 -61 -30 107 142 271 -207 133 5 40 138 -44 25 350 -130 0 138 102
5627A02j20p1K29l63J50M50l86NK9L18m58J08R1k00L8J32k33K21J78j06j58j62
$$ 102 -18 -89 140 -223 -73 377 -9 -4 25 343 -115 -7 84 -116 -78 54 -179 42 220 114 -44 -206
5649b06J14J51R9j16o9rp4o1J66j5q6L32j85P2j78j67K66r1K97k43J20k79L35
$$ -206 -92 59 158 42 -27 -36 -110 -171 -5 -20 -106 226 41 113 -65 -232 34 -57 240 -3 117 -162 173
5672A73k69p0K28l82K79j58K68p6R1j6k44R5K9K00j29Q0m9o0j26K39p4j24K51
$$ 173 -96 -166 62 -320 -41 -199 69 -7 84 68 -176 -81 -52 148 19 99 50 -10 -136 103 29 -95 156
5695A56k33j13J35L27m00K42m49J30M08J3j70O1k69K86k52o1J26J53k88n5L36
$$ 156 -77 -190 -55 272 -128 114 -335 -205 203 216 46 107 -162 124 -128 -189 -63 90 -198 -253 83
5716H3J00k84J81M4l6j12k35K48q1Q7J77j55J50j59k6k21J64o5L37k53k28L50
$$ 83 183 -101 80 124 88 -24 -259 -11 -92 -5 172 17 167 8 -18 -239 -75 -140 197 -56 -284 66
5738F6j28k1R7l77K75j9K7K0j19M82k88K21k71j33J48j3P3J7r6j47M5O2L3r3J60
$$ 66 -62 -83 14 -363 -88 -107 -80 -60 -179 303 15 236 -35 -168 -20 -33 40 57 -39 -186 -141 -79 -46 -139 21
5763B1l11N00j8k84O2M9j3j95lQ4RK64k46J31k9R4lj35J86j33k40O2K32R1m51
$$ 21 -290 210 192 -92 -30 19 6 -189 -192 -108 -99 165 -81 50 21 115 112 -23 163 30 -210 -148 84 175 -276
5788b76L49rr2j6n1K13r1k35k01M94Lj16Q7Rk0j30O5L9J6n3p9r8M80Jm63L22l29
$$ -276 73 64 -28 -44 -95 118 27 -208 -409 85 88 -28 59 68 48 -82 -17 22 38 -15 -94 -192 288 289 -174 148 -181
5815a81M32k79k15J56J56l44K24O1J81k82N4K12j17rj41o0K97n8L00k73j77J50
$$ -181 251 -28 -243 -87 69 -275 -51 10 191 -91 -37 175 58 49 -92 -152 145 87 387 114 -63 87
5837H7j45K58o6j60r0M17l72Q8J68k28q2J52k5n0J46m03K83L24l52Q3j49R9K70
$$ 87 -58 200 134 -26 -116 301 -71 17 185 -43 -125 27 2 -48 98 -305 -22 302 -50 33 -116 -17 253
5860B53j94m49O56l56K11k29K31j95J21J1Lj92N4N6J10PJ32k33l63J63O8J00r6
$$ 253 59 -390 266 -90 121 -108 123 -72 49 60 63 -129 -75 -19 91 98 230 -3 -366 -203 -135 -35 -131
5883a31K23j16j86R9J5J63j8K86n28L2j16K02M2j2o8J13j61r0N19k24j81J13R2
$$ -131 92 -24 -210 -111 -96 67 49 335 -193 -161 -277 -75 -33 -45 -113 0 -161 -251 268 44 -137 -24 68
5906F8k21K73P1j19j24n2K61l94K91l2m7N7J50K8r4j41q1K85j55o2j65L31o0r4
$$ 68 -153 120 191 72 -52 -104 157 -237 54 22 -25 32 182 210 116 -25 -106 179 24 -38 -203 128 68 -26
5930b6m8L50k82j42K84j62J18P8k56L14j98R6k55L34k69K60k85j52N25k00k09
$$ -26 -74 276 -6 -148 136 -26 92 170 -86 228 30 126 -129 205 -64 196 -89 -241 284 84 -125
5951a25K76k35L4R4j19j86K24Q0j31r0K25Km9P5k00K03j81K53k74J60p1J92j79
$$ -125 151 -84 -50 44 -75 -261 -37 43 -88 -178 47 49 0 75 -125 78 -103 150 -124 36 -35 157 -22
5974b2k4K5J69k07K60o4k69J69j47J42rn8kj30J60N4j53L14k57j4p4L4M5R9J4
$$ -22 -46 -21 148 -59 201 137 -132 37 -110 32 23 -35 -37 -167 -7 47 -106 208 -49 -63 -137 -103 -58 41 55
5999E5M7n0j73P7r2kK72p5l1k82L29JQ5j87L7j41K53n7j42J43j32n4O4N3J59j00
$$ 55 102 52 -121 -44 -136 -138 134 59 28 -254 75 76 161 -26 11 -130 123 66 -76 67 -65 -119 -55 -2 157 57
6025E7M6J29m33L52k74M10k34J3j62K02J33j89k28n1L08oj63J96l31J88J00J28
$$ 57 103 232 -201 151 -123 287 53 66 -96 106 239 50 -178 -229 79 73 -90 106 -225 -37 63 191
6047A91m5j88l7p0J05J21j9j19n3L80l65K0j18K97k49M56n22J65K95ok89l9J01
$$ 191 146 -42 -79 -149 -44 77 58 -61 -114 266 -99 -79 -197 100 -149 307 -215 -50 245 239 -50 -89 12
6070A2q6J24p9P9J23l27L1R9J11j56L02k07k10o0L75r9j19J97k24Q9Q6J37l04
$$ 12 -74 50 -29 50 173 -154 -123 -24 87 -69 233 26 -184 -244 131 32 -87 110 -114 -25 61 198 -106
6093a06N9q0K19j68p2N51l94j63L08J34j98K2k05Q2J90k06L42m99K88j50J05j
$$ -106 -47 -127 92 -76 -148 403 9 -154 154 288 90 112 -93 -11 179 -27 315 -184 104 -46 59 58
6115E8m7L94l26j93k21M83r8L2l72L89j58J08j3j32m0J64J57o8k35J78j53nJ54
$$ 58 11 405 79 -114 -335 148 50 82 -290 99 -59 49 36 -96 -136 28 185 117 -118 60 -93 -98 56
6138E6l89L19K72m38J46J3k26J56k27J85J68O9l15O0K3J09J48j20k2l4K4R6J47
$$ 56 -333 -14 258 -180 -34 -21 -247 -91 -318 -133 35 104 -211 -151 -128 -19 129 9 -13 -47 -23 73 220
6161B20m3l01K3K30j21L2j37n6K68j56l3j3P1R9J47j15k66J55j17K75l74K32K7
$$ 220 177 -124 -101 129 8 40 -97 -153 115 -41 -74 -87 -16 83 230 115 -151 4 -113 162 -212 20 47
6184D7k44J61j76K05j23J21n0L28j24j84K4Q3j2k4j04K7o2J13K7k8J69N9k23p5
$$ 47 -197 -36 -212 -7 -130 -9 -59 269 145 -39 -15 68 56 32 -72 -45 -107 6 33 5 174 233 10 -65
6208f5P4J10k73n9K06j7J90k98J08j29J20J43R5l34j41L01j7Lm9J19j83J91N1
$$ -65 9 119 -154 -213 -7 -24 166 -132 -24 -153 -33 110 205 -129 -270 31 14 17 -32 87 -96 95 146
6231A46l26J50k63p1K82K1J42j01L7j75J60J03J17k07j59Q8K05l67J23J93k09
$$ 146 -180 -30 -293 -364 -82 -61 81 -20 17 -158 2 105 222 15 -144 -56 149 -218 -95 98 -111
6252a11J77j91K46j07k12L81l7m76M20J3P0l30k06M51M7k0r2J86k05Q4J54j87
$$ -111 66 -125 121 14 -198 183 146 -330 90 103 173 -157 -363 88 135 115 23 209 4 88 242 55
6274E5J3k15J48J6R7j6k73j03J47L45r7K9lj63K7j66lJ15j12J54m00K88J37NO
$$ 55 68 -147 1 17 114 98 -175 -278 -131 214 117 146 143 -20 7 -159 -162 -47 -159 -5 -405 -117 20 25 31
6299C1M1j34Q7O0p2j50N18o23J33K5L61k69n1K24k7j43K60l17l0q0J45J62N4l30
$$ 31 72 -62 25 85 13 -137 381 -242 -109 -84 277 8 -43 181 154 11 271 -46 -76 -156 -11 151 205 -125
6323a25p8J71M9J85j47j66q1K03n5l3M52l13j32j0j31J76L8J69k64O0q6K85k70
$$ -125 -203 -32 17 202 55 -111 -192 11 -44 -77 375 62 -70 -80 -211 -35 3 172 -92 -32 -118 167 -103
6346a03J75J13l15M27o15L28m8K90j85J3l31M75r2k59J55J24%j99MO4Q7j24K02
$$ -103 72 185 -130 297 -318 10 -38 252 67 80 -251 224 132 -127 28 152 152 -47 -43 21 108 -16 186
6369A86l54J39Ml9J29k90L68m24M43pn8j47k0j04L24k21J51rj01rPL0j32L38l85
$$ 186 -168 -29 -25 -64 65 -225 143 -281 162 155 97 -50 -70 -174 150 -71 80 71 -30 -39 -32 -2 -134 204 -181
6394a81o7K74q5J80k88J53j91K63R2m37L34q0J45%j00j25J51j06j8N3L02o3j31
$$ -181 -248 26 -59 121 -167 -14 -205 58 150 -287 47 -33 112 112 12 -113 38 -68 -86 -33 269 206 75
6417G5j22O9K34m23J36k4J91k33j47k5K28K08l12N5P8K88l87J68j24J06J96l2
$$ 75 -47 22 256 -167 -31 -55 136 -97 -244 -269 -41 167 -145 -90 -12 276 -111 57 -67 39 235 203
6439B03j96R1j46J03R8L2k84j94L62jR1l3k2k74k21J18J75K84j46j2L45m70R9
$$ 203 7 98 -48 55 153 185 -99 -293 69 68 159 126 104 -170 -391 -273 -98 186 40 28 373 -97 2
6462BPL2q8J71j04o9J62m03L74j57L70j68k19J92J08k06L8k18L67k53j13J35l29
$$ 2 9 41 -47 124 20 -49 113 -290 84 -73 297 129 -90 102 210 4 42 -176 191 -62 -175 -40 -369
6485c69L77j16K6o6M07j33j26pJ21k67K33k42J08J96j19L0M7m6j62L37k63p5J13
$$ -369 8 -108 -82 -148 259 126 0 -7 114 -153 80 -162 -54 142 23 53 100 54 -108 229 -34 -109 4
6508DJ72l05K50j33p2L94j13m09N32l96j15Q3n9l4L0K80m4j52J91p2m2j15K38
$$ 4 176 -129 121 -12 -84 310 197 -212 320 -76 -191 -108 -167 -201 -171 109 65 -87 104 32 -10 -125 113
6531A13J26l65K39k47l8K76J26j90l27J74J09K49k73O5Qn9r4J39K10k89J11p6
$$ 113 239 -126 113 -134 -172 104 230 40 -287 -113 -4 245 -28 37 45 -14 -108 31 241 -48 63 -13
6553a3j79J47m6%m3J61j20J51J53j03j48R2L32m00M8q1N4j17O6K6%O1k12K33P5
$$ -13 -192 -45 -91 -91 -134 27 -93 58 211 108 -40 52 384 -16 32 -49 5 -112 -46 -20 -20 41 -171 62 137
6578A37j75J7J06j80Q9j76L85j64q0J47k88L22r8O9q6L9m41M65k41K26r0r0J68
$$ 137 -38 -21 85 -95 -6 -182 203 39 -41 106 -182 140 42 111 25 64 -377 88 -153 73 -17 -107 61
6601F1k8q1j6j10m0K38L1l6j13K34j54K43lj46K0J30k13j11J13M6p2J78l21K45
$$ 61 33 -48 -64 -174 -214 24 55 19 -94 140 -14 229 226 80 100 230 17 -94 19 65 -7 171 -150 95
6625I5J3j1n7m9n0m4K15k12J09J96m56K34K16j67K18k73O6R2P2k66K19l3j36m2
$$ 95 108 97 40 -9 -59 -103 112 -100 9 205 -251 -17 199 32 250 -23 43 135 207 -59 160 127 -9 -51
6649e1k4j18l2P2K73J9k69Q2n3L6K19j25N3no7L06J16l93J87k79J24j63M53l93
$$ -51 -75 -193 -225 -153 120 139 -130 -48 -101 -65 154 29 82 77 10 316 432 39 226 -53 71 -92 361 -32
6673c2M8K9k11K5r9M83k18M0J44J3k8l01J88J81j96J8J13k09j08L60j52l41J75
$$ -32 16 45 -166 -141 -240 243 25 65 209 222 194 -107 81 262 66 84 197 -12 -120 240 88 -253 -78
6696g8j5j13M53m11R9J18J34j92J9R4m61L90L3j0r6J83m6j51n0R7k45M39l88J38
$$ -78 -93 -206 247 -164 -65 53 187 -5 14 108 -353 37 70 60 -36 147 101 -50 -100 -3 -248 191 -197 -59
6720e9K50j35L1j96J90L8l1j83J11P8m5Rl20N53k45m6k26K94k28j97J73J52J76
$$ -59 191 56 87 -109 81 119 88 -95 16 94 49 58 -262 291 46 0 -226 68 -160 -357 -184 -32 144
6743A44k97M69l09j79J52j35K99q9J02k89K06O0m45K70J22J63j82j48Nj2L0K90
$$ 144 -153 316 7 -172 -20 -155 144 55 157 -132 74 134 -311 -41 81 244 62 -86 -81 -93 -63 227
6765B27k07J19j74j32J63n1L10m78K46L3j34K33j13p8K22Q3j90j71O7j45J67K08
$$ 227 20 139 -35 -167 -4 -55 255 -223 23 56 -78 155 42 -36 186 269 79 -92 -25 -170 -3 205
6787B05k09N9j82M0n2O1J88j22L25n38L60l75L25Q1k67J22j4K46k17k2k80K33
$$ 205 -4 55 -127 -87 -139 -78 110 -12 313 -225 135 -240 85 166 -101 21 7 253 36 14 -266 -33
6809c3l0J16j98L28q1P2j36k0P8k3k38J33rk5k38M27o5j21L15l98O1j58K35j82
$$ -33 -63 53 -145 183 102 174 38 18 96 73 -165 -32 -41 -66 -304 123 58 -63 252 -146 -85 -243 -8 -190
6833a90K89k54M55m50J14K97n20K09K5J08K0m8N4p4J37N2j87j47m9Q9o1k24L14
$$ -190 99 -155 300 -150 -36 261 -259 -50 -25 83 103 55 109 35 172 224 37 -110 -159 -70 -131 -355 -41
6856d1M6K6J71l39L97l57M08l15q0L0o0J04O0j62J33m9n9J22L4p2Q4j24j83J41
$$ -41 5 31 202 -137 260 -97 311 -4 -84 -54 -114 -10 50 -112 21 -28 -87 35 69 -3 81 -43 -226 -85
6880h5L8P4Jj18K59l48L50k19K14o0k43J97J22l60R1%k26N45o3l92K18j75M07
$$ -85 -47 27 28 -90 169 -179 171 -48 166 106 -137 60 182 -178 -87 -87 -313 232 169 -223 -5 -180 227
6903B27j04l00R8L1L20k97K12j1j56k20L38l33K48j96J32K18j12k69N9q1J01j42
$$ 227 123 -177 -79 -48 272 -25 187 176 20 -200 138 -195 53 -143 -11 207 95 -174 -115 -196 -95 -237
6925b37L54k31J77O2m68P9J57K12j80L5N2r3j7J88N3K6j07l12R9q9K74O0M8j12
$$ -237 117 -114 63 125 -343 -264 -107 105 -75 -40 12 -81 -98 90 143 169 62 -250 -151 -240 34 94 142 30
6949C0j32L69j24m34K64K30j3l24K72k2j21M6j53k3J62o7J54j51K39m25L57K3
$$ 30 -102 267 143 -291 -27 203 190 -134 138 116 -5 41 -112 -135 27 -40 114 -37 202 -223 134 157
6971A57M1k46J11J68l46K46k12O0k9K1Oj27M19m46n9M62m8J4j07q1j23pl1J63
$$ 157 198 -48 63 231 -115 131 -81 -21 -50 -29 -23 -150 269 -177 -236 226 178 192 85 4 -119 -126 -157 6
6995FJ4N1K10j97k2j08Q3k68L31Q9m1K09l77l59J85L97j21K65m84K64l9r6M8j14
$$ 6 20 71 281 84 62 -46 37 -231 100 189 148 357 -20 -379 -194 203 82 347 -137 127 88 -8 40 -74
7019g4J87l4j0P9j33R4k19M36l38j48J95n8J9m0J81m3k61L52r9m01L24%p5km3
$$ -74 113 79 69 148 15 109 -110 326 -12 -160 35 -23 -4 -44 137 94 -167 185 86 -315 9 9 -66 -68 -111
7044a11R5M6L4j70p6P8J80r4J88j77J9k38L91j37l58K65J49L1j59O0M8J19l32
$$ -111 -16 30 64 -106 -182 -104 76 -18 170 -7 12 -226 165 28 -330 -65 84 115 -44 16 64 183 -149
7067a49L44q5l19L58j64J71k61Q3L01m31l1J72p3K67l48R5K65K9k93r6L02k23
$$ -149 195 110 -209 149 -15 156 -105 -22 279 -152 -183 -11 -84 183 -165 -70 195 224 -69 -165 137 -86
7089h6j56L37j40K07n92L51J94k21m7J17J43j35k13L03kq8j43J57J23K9j66J81
$$ -86 -242 95 -45 162 -430 -79 115 -106 -153 -36 107 -28 -241 62 60 -28 -171 -14 109 138 -28 153
7111A53p6J97k76l2M4o1K81j57o5o8J13Q7j26o4J55j47J93j35mk73K79O1j66P8
$$ 153 77 274 -2 -34 10 -51 230 73 8 -60 53 140 14 -50 105 -42 151 16 12 -261 18 79 -87 -9
7135iO3j09J98l30J15K07l45J55r7R9j16K59J35j09O8l73M32m10K60j10l1J14
$$ -9 54 -55 143 -187 -72 135 -210 -55 -152 -53 -169 90 225 116 184 -189 243 -167 93 -17 -48 66
7157F6J80k23JJ29j51p1O5J34q6L4J72j93J16l45K60K1p3n1K9j27K89M4j8j52
$$ 66 246 23 24 153 2 -69 -4 130 44 78 250 57 173 -172 88 109 36 -15 14 -113 176 220 202 50
7181E0l2l3J3n8J9j63K71M3l33J18L08p8l1n5k88K41O6q3j43J14K60k85K44k83
$$ 50 18 -15 -2 -60 -41 -204 67 110 -223 -105 203 125 94 39 -249 -8 58 -25 -168 -54 206 -79 165 -118
7205a18nK36qr7M3m13K18J72K0m0M5p1J52l96L56l02M30m45J31K52K4j95j04R
$$ -118 -123 113 105 8 51 -362 -144 28 48 8 53 -18 134 -262 94 -208 222 -223 -92 160 184 -11 -115 -106
7229a06j77J94J6K00k0O2j47q5R3j26L9j27M63k00j50J15p2rk27K66j61M31l24
$$ -106 -283 -89 -73 127 107 169 22 -63 30 -96 -57 -184 279 79 -71 44 -28 -37 -264 2 -159 272 -52
7252e2R0j48L10m32L52K7l45K35k66L77N9k79J97j85R7L22l61r5PK63k78q8M83
$$ -52 38 -110 200 -232 120 147 -198 37 -229 148 207 -72 125 -60 37 359 -2 -97 -90 173 -105 -193 290
7275B90m40J80m1N7k50M09j36n1P8j21J37j52l3J40N0o9j51lL36m07J21K35j89
$$ 290 -150 30 -11 46 -204 205 69 18 96 -25 112 -40 -73 67 117 48 -103 -106 230 -177 -56 179 -10
7298a0j25N07j05l45Po5LL05o9k5L4j11k06n2J39O6L16k37j48N0O4k06L42k68
$$ -10 -135 372 267 -78 -71 -136 -133 172 103 78 112 1 -205 -257 -118 -52 264 27 -121 -71 -7 -213 129 -139
7322a39O4j31J77QQ0j40J41J0J6j54J93K7m7j62L45l18R4J24l25K77k23n0m5J38
$$ -139 -75 -206 -29 -21 59 -81 60 70 86 -68 125 152 105 -57 288 -30 64 188 -137 140 -83 -133 -178 -40
7346d0j55L10Rp0p6l4J00j17J7J82m04J26k4J99m5J62j65J22l6J12j67K43j91
$$ -40 -195 115 124 54 -22 -56 44 -73 -56 126 -278 -152 -176 23 -22 140 -25 97 61 173 6 249 58
7369E8k3J32k56k6NM2J47o9n2J3J96k28Q7KL6n9j10K29j52K8J03k24j73L34k48
$$ 58 35 167 -89 -115 -110 -68 79 10 -42 -29 167 -61 26 28 64 5 -105 124 -28 0 103 -121 -294 40 -208
7394b08J30o0K83P4j81J41k94L72j20j13M4j18Q0ok00O7R6P6j51K7J16Qk63L24
$$ -208 -78 -138 145 219 38 179 -115 257 137 24 68 -50 30 24 -176 -109 -13 63 -88 -61 55 63 -200 124
7418A24p9R2j63Q4j28J79j92R6k1K40l16M21l98j76K99k63J28J6J30J27J89l30
$$ 124 45 137 -26 58 -70 109 -83 13 -8 232 -84 337 -61 -237 62 -201 -73 -57 73 200 389 59
7440E9K3j34L7l4n5K50k29n8K8J22j6n2J27l4J01l05K77k00J8J81k8k51K09J45
$$ 59 82 -52 -15 -49 -104 146 -83 -141 -113 9 -7 -59 68 34 135 -170 107 -93 -75 106 78 -173 36 181
7464A81p0j38k91K61q7L09N2k09L9R4N0j92M1J61j03k28J35o5K28m07J68J35l51
$$ 181 111 -27 -318 -57 -144 165 217 8 47 141 191 -1 40 201 98 -130 5 -60 168 -239 -71 64 -287
7487b87L29K13j01j09j16p7j0J48J3k17J96j36K01N0j78j55M37r6j80j24L90m32
$$ -287 42 255 154 45 -71 -148 -158 -10 3 -214 -18 -154 47 97 -81 -236 201 105 -75 -199 191 -241
7509b41L27r1k16L15P3l37Q3o6J63J08l3l19J74J88N4l17J60K4j0J19m8m79N28
$$ -241 86 -5 -221 94 167 -170 -87 -153 10 118 85 -234 -60 128 182 -135 25 49 39 158 110 -369 159
7532A59j97J42p1L5q7j34J57p4J24J44n4O1k98J53RO4j09J11k18M27k17j83j3
$$ 159 -38 104 33 68 -19 -153 4 -70 54 198 144 205 -93 60 69 133 24 135 -83 344 127 -56 -69
7555f9J96l3J7j48j31O0j16J33K10j19O7l10L35K4l36N13k96Q6j62J35j34Q1M3
$$ -69 127 94 111 -37 -168 -108 -224 -91 119 0 67 -243 92 116 -220 293 -3 83 -79 56 -78 3 46
7578D6J93k88m1J04R0k41J58j94K08j00j43L31l8k68J3N8L0J02j17j04J26J87
$$ 46 239 -49 -90 14 104 -137 21 -173 35 -65 -208 123 85 -183 -170 -112 -82 20 -97 -201 -75 112
7600A12k76L78l54K65l41M14l11J35j36J09K8l0P9m9o3q3j47K00L22m9k05k53
$$ 112 -164 214 -140 125 -216 198 -113 22 -114 -5 23 -7 72 23 -40 -123 -270 -70 252 203 -2 -255
7622b55N6L33J74k76Q0p9L1j56j33L34j75J64k32K02j48L8%k73L2L86o1N9o37
$$ -255 -199 134 308 32 112 33 64 -92 -225 109 -66 98 -134 68 -80 -42 -42 -315 -283 103 42 101 -536
7645e36K37J44K15N7l08J75l2KP5j47n4J68l6j43QL01OM0j75j79J88%o2K4N3j33
$$ -536 -299 -155 60 117 -191 -16 -48 -46 29 -118 -172 -4 -40 -183 -175 126 132 172 -3 -182 6 6 -56 -32 21 -112
7671a12J21l7J90j17p3M1J10k69j7L29j84J38j80K48l88J08J02M4K38k22j92K33
$$ -112 9 -28 162 45 -28 13 123 -146 -163 166 -18 120 -60 188 -200 -92 10 54 292 70 -122 111
7693A11p8j04J50J81m60J50j37m1L72j12j38L3J45l21L22q8J79m43L65j24l2R0
$$ 111 33 -71 79 260 -200 -50 -187 -228 144 32 -106 -73 72 -249 73 -15 164 -279 86 -38 -70 20
7715B0J65P7j82l97K77K1k5K29j67J7j78j51K55l08K52k1P7K26k88K27Oj53j21
$$ 20 185 262 80 -317 -40 -19 -44 185 18 35 -143 -294 -39 -347 -95 -116 -39 187 -101 126 132 -21 -142
7738a42J83m2Q3j84K63j63j98o4M49j67j59K84k40K53n18L29p9J40K5L5J56l3
$$ -142 41 -1 82 -102 161 -2 -200 -264 185 18 -141 143 -97 156 -362 -33 -112 28 53 88 244 211
7760B11k84L32l64K57o5J49k19Q0k79K69j44p8qK22R8j97K02k36KJ89j59j50k7
$$ 211 -73 259 -105 152 87 236 17 97 -182 87 -57 -135 -143 79 177 -20 182 -54 -52 137 -22 -172 -199
7783a99J87N6J99l95K47K95m81K15j19j5J89o9M5L4j69mk18J84J51l1kj22K9J7
$$ -199 -12 44 243 -152 95 390 -91 124 5 -10 179 110 155 189 20 16 -202 -18 133 102 100 -22 7 24
7807B4Qj54J48k92K37j57J91J59k99J61J62l24o4l4J47k0J41j27M8R1q7J84k00
$$ 24 32 -122 26 -266 -29 -186 5 164 -135 26 188 -136 -200 -234 -87 -107 34 -93 -45 46 -41 143 -57
7830e7k7L5J09j48n8L0J54L3j91j19K84J25m6l01j1p1K26J80Rk20l5K23j36M6
$$ -57 -84 -49 60 -88 -146 -116 38 71 -120 -239 45 170 124 -177 -188 -259 -33 147 156 -64 -99 124 -12 34
7854C4L79l88j94O3k30L53M6J7k17N2Q3k11L74k02j84L99j42j67O8Q0Nl0j11M5
$$ 34 413 25 -169 -106 -336 17 63 80 -137 -85 -2 -213 161 -41 -225 174 32 -135 -67 13 18 -12 -123 -78
7878g8O9j77J75K07l51R1K15k12jN2J1N4M1l14J43J41N4k42M5J35q1n9J25M0m7
$$ -78 -9 -186 -11 196 -155 -64 151 -61 -62 -10 1 55 96 -218 -75 66 120 -122 -77 58 -23 -82 43 83 36
7903C6Q9k02lM9j08J19K93m32N6J39J14j8l56J44J6K12k12p0K04j89m9O5r3K18
$$ 36 125 -77 -80 -31 -139 -20 273 -159 -103 36 150 132 -224 -80 -64 148 -64 -134 70 -119 -168 -103 -196 22
7927B2j1O5p7N6k24J04mN7k7J65Po3k16K89J84o9m76L69k67Q8J79M5l16L78k6
$$ 22 11 76 -1 55 -169 -65 -69 -12 -39 126 133 70 -146 143 327 258 -218 151 -116 -28 151 196 -120 258 232
7952B32n05L65l12K93k82O78l31k28O0L88o88K59R9K60m24n6J43j06K26j37o7
$$ 232 -273 92 -220 73 -209 469 138 -90 -30 358 -330 -71 28 288 -136 -192 -49 -155 71 -66 -133
7973a33Q7j17L60j93j46j48K00R0m8K61k39RoJ1q9Q0l45N89k64j96J08J68j95
$$ -133 -46 -163 197 4 -142 -290 -90 0 -48 213 -26 -17 -23 -12 -101 -21 -366 223 -41 -237 -129 39 -156
7996a56j8L85k81O1j18J77j53J36j01NJ20K7k04l8M8k6L47k24P1j1k43L19J2M2
$$ -156 -174 211 -70 -9 -127 50 -103 33 -68 -63 57 84 -120 -158 -110 -136 211 -13 58 47 -196 123 135 177
8020A77l67M09P6j57M3k36L17j23k46J66K66m72K21M2O8k30l24N05R0j63J89m12
$$ 177 -190 219 295 138 181 -55 262 139 -107 59 325 -147 74 116 184 -46 -370 135 225 62 251 -161
8042a61L68r5l7j04L3j12O9J08j45J2j37M50n15J69J23ko4K9L11j85J36j91J98
$$ -161 207 112 75 -29 4 -108 -39 69 -76 -64 -201 249 -266 -97 26 24 -40 -11 300 115 251 60 258
8065B58j41j4J3j20J83l01R6J6n7%K01J07l40K5L42k39k04J58j95K48k70L01M6
$$ 258 117 103 116 -4 179 -122 -26 -10 -67 -67 134 241 -99 -74 268 29 -175 -17 -212 36 -234 67 113
8088A13j58K02l96K62l9K34k60J70k54K26P4Lk04L8n6J29j33K47l27R7J51n6j91
$$ 113 -45 157 -239 23 -16 218 -42 128 -126 100 174 177 -27 11 -45 84 -49 198 -129 -32 119 63 -128
8111a28L13m6j72J25m2q9mJ25k22J27j17K29M5Q2l22J56J9L8j06j59P4j0N7J49
$$ -128 185 139 -33 92 50 -39 -43 82 -140 -13 -130 99 144 226 -96 60 79 117 11 -148 -74 -84 -27 122
8135A22m9j70j8p8J42J70m60K79K15L0r1j14J73j43k70M21j49M1o0J90k01j18
$$ 122 73 -97 -115 -193 -51 119 -341 -62 153 183 92 -22 151 8 -262 159 10 51 -9 181 -20 -138
8157a38L50m38L61j56j34n0k5M35M2l82J74O1k7n5n9k28J42K76k27K13j44r3K82
$$ -138 212 -226 135 -21 -155 -205 -230 205 247 -135 39 100 73 18 -41 -269 -127 149 -78 135 -9 -102 180
8180A80l87J54K21l42j05R5L01j29k8P3J18
$$ 180 -207 -53 168 -174 -279 -184 117 -12 -40 33 151
8191A51
$$ Imaginary data points
##PAGE= N=2
##DATA TABLE= (X++(I..I)), XYDATA
0@%%%%%%%%%%%%%%%qJ6j6J6j6J6k4L2l2M0m8N4o2P2q4R3j05J20j37J55j75J96
$$ 0 0 0 0 0 0 0 0 0 0 0 0 0 0 0 0 -8 8 -8 8 -8 8 -16 16 -16 24 -24 30 -32 40 -44 49 -56 64 -73 82 -93 103
37A03k19K46k72L01l35L74m13M54n04N58o15O77p44Q18r03R97j101J218j349J498
$$ 103 -116 130 -142 159 -176 198 -215 239 -265 293 -322 355 -389 429 -474 523 -578 640 -709 789
57G89j669J870k107K390k743L189l773M576n749P637j1144J9739p7582j07722
$$ 789 -880 990 -1117 1273 -1470 1719 -2054 2522 -3227 4410 -6734 13005 -64577 -172299
71a72299J79142M6589n0305K4194J838l0703M2794j2960l7287M7545J4934n6996
$$ -172299 6843 53432 3127 27321 29159 -1544 41250 28290 -8997 38548 53482 -3514
83c514P946K5399q691q035k8494o341N7112j9174o9716L1108M0565l3995j870
$$ -3514 4432 29831 21140 13105 -15389 -21730 35382 16208 -53508 -22400 18165 -15830 -17700
96a7700O51k2202L9782J6227o3028J9750N4426m8446k0195N7425M57k5854L015
$$ -17700 -17049 -39251 531 16758 -46270 -26520 27906 -20540 -40735 16690 17147 -8707 -5692
109e692q842K5276L8648m6402k9960M9613O754k1093J7093j4642j5568L0612j1814
$$ -5692 -14534 10742 49390 2988 -26972 22641 29395 8302 25395 10753 -4815 25797 13983
122A3983k1877L4003j4826m8168L5616K7088l8854n623N504j1310L0881J871n4031
$$ 13983 -7894 26109 11283 -36885 -1269 25819 -13035 -18658 -13154 -24464 6417 8288 -45743
135d5743J8658M9123l1249j9168L0765q76p380R114q442J2427J8478l3279r047
$$ -45743 -27085 22038 -9211 -28379 2386 1510 -5870 3244 -5198 7229 25707 -7572 -16619
148a6619M2998J581k6694k111j667J4539K0386l2778k1022L7535K31l1061J5750
$$ -16619 26379 27960 1266 -845 -2512 12027 32413 -365 -21387 16148 16379 -14682 1068
161A068J0709j8504J824k414n071K6893q635m3930K0545L9064k2199k0442Q049
$$ 1068 11777 -6727 -4903 -7317 -12388 14505 5870 -38060 -17515 21549 -650 -21092 -13043
174a3043L551J5603K243k8312P761K9548j6697j2286K2860J170j2152K142p02
$$ -13043 -9492 6111 8354 -19958 -12197 17351 654 -11632 11228 12398 246 2388 1686
187A686J1776J2103k8163j4176L3518P596k6118m504L593L471R690j2967j4588
$$ 1686 13462 25565 -2598 -16774 16744 24340 -1778 -6282 -2689 782 10472 -2495 -17083
200a7083J7901J717k1130J0741J5963j5210q630N439P056J3306p684k5199J3428
$$ -17083 818 2535 -18595 -7854 8109 -7101 -15731 -10292 -3236 10070 2386 -22813 -9385
213i385K8138j0573j6399N885N480O023J259j2229L627J2888j3878p209K0063
$$ -9385 18753 8180 -8219 -2334 3146 9169 10428 -1801 1826 14714 836 -6373 13690
226A3690R99j9137k198P473P696K616j8465j0962K0499R561j7751n967P340K227
$$ 13690 14689 -4448 -6646 827 8523 11139 -7326 -18288 2211 11772 -5979 -11946 -4606 -2379
240b379Q5k334j562P360l233j1078J1627J4319j0613j2416N088J1769P960r368
$$ -2379 -2294 -4628 -6190 1170 -2063 -13141 -1514 12805 2192 -10224 -5136 6633 14593 5225
254E225j6318Q894J8273p175j2092M239L563j809N07j916J003J913r752k834J4753
$$ 5225 -11093 -2199 16074 8899 -3193 1046 4609 2800 3307 1391 2394 4307 -5445 -8279 6474
269F474K602j6487n652J0657Q254k973j1397l797J2420N425r621k536P637K27
$$ 6474 9076 -7411 -13063 -2406 5848 2875 -8522 -12319 101 5526 -4095 -6631 1006 1233
283A233m698J319O223K140p651o390J0056J1451p127j2908K090J1210M058q550
$$ 1233 -3465 -2146 4077 6217 -1434 -7824 2232 13683 6556 -6352 -4262 6948 11006 2456
297B456q553M139P938k784n494K117J304l554j638M092L757m585q709K094J2244
$$ 2456 -6097 -1958 5980 3196 -2298 -181 1123 -2431 -4069 23 3780 -805 -9514 -7420 4824
312D824J136j1950m308Q527O657l040o238m14N983J739l924Q55M895k100n899
$$ 4824 5960 -5990 -10298 -1771 4886 1846 -4392 -4806 1177 2916 -1008 -153 4742 2642 -3257
327c257L134Q142p61q409l497P333O966m845r286O50P459M50n606k230K423k77
$$ -3257 -123 8019 7258 -1151 -4648 2685 9651 4806 -4480 -3830 3629 4079 -1527 -3757 -1334 -1611
343a611k208J395L293j306n951j237P728O074o645q440L918J0639R66q169k894
$$ -1611 -3819 -2424 869 -437 -6388 -7625 103 6177 -468 -8908 -4990 5649 6615 -1554 -4448
358d448N459L803j508k679R97J106j595j548M004K706n632n821M437P594k418
$$ -4448 1011 4814 3306 627 1624 2730 1135 -413 3591 6297 665 -5156 -719 6875 4457
373D457q376j696N878M068l489n716L67M234J03k444M78J775k114k481L715M900
$$ 4457 -3919 -5615 263 4331 842 -4874 -4507 -273 -170 -2614 -2136 -361 -2475 -4956 -1241 3659
389C659k018o700j26P662M973m835o478K162P285J051m909j880K226K18j098R34
$$ 3659 1641 -5059 -5185 2477 7450 2615 -3863 -1701 5584 6635 1726 -154 2072 2290 1192 2126
405B126R28k125m193o8N495J984p381n082N037N763j163n122k237L752M867j825
$$ 2126 3054 929 -3264 -3332 2163 4147 -3234 -8316 -3279 2484 1321 -3801 -6038 -2286 2581 756
421G56l676J593K156k325J241L575p42l984j293L504N107j682p443n03O948K246
$$ 756 -2920 -1327 829 -1496 -255 3320 2578 -1406 -2699 805 5912 4230 -3213 -3716 3232 5478
437E478l728l762k7M050J442l179m28J047j768j507L767J113l576k955m06M790
$$ 5478 1750 -2012 -2039 2011 3453 274 -154 893 -875 -2382 1385 2498 -1078 -4033 -4439 351
453C51L545n877n645N147M746k090j941p99L02M062M0k431K741r4l850K525N530
$$ 351 3896 -1981 -7626 -2479 2267 177 -1764 -2563 -2261 1801 1841 -590 2151 2057 -1793 732 6262
470F262k996l450n98J005M551K20p550j834O654L36l508oj356N7K456j236l51
$$ 6262 3266 -184 -782 223 4774 4994 -2556 -4390 2264 2600 -908 -914 -2270 -2213 243 -993 -1344
487a344K059l344k277O074J876m131j902j33L361M317l382o052M353L876l013
$$ -1344 715 -2629 -4906 1168 3044 -1087 -2989 -3122 239 4556 1174 -4878 -525 3351 338
502C38P02O50k680J955J892j915J821M55o144J931O739l378m394N13R4K346K427
$$ 338 1040 1690 -990 965 2857 942 2763 3218 -2926 -995 5744 2366 -2028 -1515 -1421 925 3352
519C352o143k650N498n09k714L131j894j898L263J81o50L194l047m043O880L322
$$ 3352 -2791 -5441 57 -452 -3166 -35 -1929 -3827 -564 -383 -1033 2161 -886 -4929 1951 5273
535E273n160o84J299m07M474l65o501J898L812l708R03J845m368o10L105j637
$$ 5273 113 -571 728 321 4795 4430 -2071 -173 3639 -69 834 2679 -1689 -2299 806 -831
551h31J032J861o829N47O666j390m023J348j272J606M676l802m290N270M97l060
$$ -831 201 2062 -4767 -4220 2446 1056 -2967 -1619 -2891 -1285 3391 -411 -4701 569 1066 -1994
567a994M161j37m632K753K209j753K711j540n280M402M275m463j210J102k395
$$ -1994 2167 2030 -2602 151 2360 607 3318 1778 -3502 900 5175 712 -498 604 -1791
582a791K999K410n783m07L347k841Q29L640m744j372L711r79M02K742n387j248
$$ -1791 1208 3618 -2165 -2572 775 -2066 -1237 2403 -2341 -3713 -2 -981 -579 2163 -3224 -4472
598d472P060l86m275K663r66j386N667r47n143L016J059l216M169R54o027J495
$$ -4472 2588 2202 -2073 590 -376 -1762 3905 2958 -2185 831 1890 -1326 2843 3797 -2230 -735
614g35K919k067J592Q1n457J706N206l307j431J609l029J300M281m015j680L152
$$ -735 2184 117 1709 1790 -3667 -1961 3245 -62 -1493 116 -2913 -1613 2668 -1347 -3027 125
630A25j853J8M469k486l725L761K16o63L084k876l531N338J401l324J240o15k223
$$ 125 -1728 -1710 2759 273 -3452 309 525 -138 2946 70 -3461 1877 3278 -46 1194 579 -1644
647a644L951J125m743J469J092l220L178J856n261K5L012k088J294J629n127J98
$$ -1644 2307 3432 -1311 158 1250 -1970 1208 3064 -2197 -2172 840 -1248 46 1675 -3452 -3254
663c254M848j181k177K046k763J73M618j617k808K642q53r26M067o82l579J825
$$ -3254 1594 413 -1764 282 -2481 -2308 2310 693 -2115 527 -326 -1252 2815 2133 -1446 379
679C79O84o84K513j106m134K644K371k614P81l40k620K201K120l312m7J130k452
$$ 379 1063 379 2892 1786 -2348 296 2667 53 834 494 -2126 75 2195 -1117 -1164 -34 -2486
696b486J834K513l121j062K363j265Q00K742l739j553M217m9j319J542k085j127
$$ -2486 -652 1861 -1260 -2322 41 -1224 -424 2318 -1421 -2974 1243 1194 -125 1417 -668 -1795
712a795L666R5k330J137o15j200K882N33k962K20N11q01K278k1l788R31K377j132
$$ -1795 1871 1966 -364 773 158 -1042 1840 2373 -589 -369 142 -659 1619 1598 -2190 -1259 1118 -14
730a4k7J6k520J174K264j216p25P57j291P44K401j322j053Q53o15P71K499k344
$$ -14 -41 -25 -2545 -1371 893 -323 -1048 -291 -1582 -838 1563 241 -812 41 -574 197 2696 352
748C52k068K048Q91o02J098j397j674K135R63j748J78j88j672J704J590k091o40
$$ 352 -1716 332 1223 621 1719 322 -1352 783 1746 -2 176 -12 -1684 20 1610 -481 -1121
765a121L92m43J991P19k565o94J866q9k9K90j835Q9K262k65p88L76p57l32K024
$$ -1121 -729 -1172 819 1538 -1027 -1721 145 56 27 317 -1518 -1429 833 568 -220 156 -601 -933 1091
784A091M43j626j22l22R77J841j259k099N29J060K19K7n91j442R67R46p72n1j43
$$ 1091 1534 -92 -214 -536 441 2282 1023 -1076 -547 513 732 759 168 -1274 -307 639 -133 -184 -327
803c27j251Q42J462l89j146j71l66J539J245j334j430Q08J252Q1j33j006l31J095
$$ -327 -1578 -736 726 337 -809 -980 -1346 193 1438 104 -1326 -518 734 815 682 -324 -655 440
821D40O17o43j78o13m75J033P12n73m45j011P88J393l70j360m95P74N25M06q09
$$ 440 1057 414 236 -377 -852 181 893 320 -125 -1136 -348 1045 675 -685 -1180 -406 119 525 -284
840b84q05oR79N42l07l42n40K52Q21N03m68n37k01N64J115k31j403J14P05M77
$$ -284 -1089 -1095 -116 426 119 -223 -763 -511 310 813 345 -192 -393 171 1286 1055 -348 -234 471 948
860I48K89j253o72N51O55j09m4p38p31P09Q29J11r50o68L01O67N30k02j214K31
$$ 948 1237 -16 -688 -137 518 409 365 -373 -1104 -395 434 545 -405 -1073 -772 -105 425 223 -991 -760
880g60R83M09j32q24JK31O12Q3k7p91n9M89O19j83o27q39O59R94J35j209n75L96
$$ -760 223 632 500 -324 -323 -92 520 603 576 -215 -274 215 834 651 24 -815 -156 838 973 -236 -811 -415
902d15P89J63n57l79l83M12O64Rn73m16j37R37L73l83r70j32J010J020m16r88
$$ -415 374 537 -20 -399 -782 -370 294 303 -270 -686 -823 114 487 104 -866 -998 12 1032 616 -372
922c72l58R76N12j51o41j97J5M38P07j46p77m16m3R05P10j109q34J53Q94L21m59
$$ -372 -730 246 758 607 -34 -231 -216 222 929 783 6 -410 -453 452 1162 53 -781 -628 266 587 128
943A28j189K74J003L5m13j18P1p4K64M85P6p81n94R26Q51j63r85q12R80P62K61
$$ 128 -1061 -787 216 251 -162 -280 -209 -283 -19 466 542 -239 -833 93 944 781 -204 -1016 -36 726 987
964I87j258r0L16K69K66lr19L55J06J80l5j80p00k23R13N52j43j378Q4R74L31
$$ 987 -271 -361 -45 224 490 487 -432 -77 29 209 174 -6 -706 -929 -16 536 393 -985 -901 73 404
985D04j36p47r2K42Q14n0j82l35J11j50L79M93n91m74K15O04M44p49r04K79J126
$$ 404 268 -479 -571 -329 485 435 253 -82 29 -121 258 751 160 -314 -99 505 949 200 -704 -425 701
1006G01K13n02q74R3L36K69l66J68l27k40M53M53j52n82n46R63M94j74o12n21
$$ 701 914 412 -462 -369 -33 236 -130 38 -289 -529 -76 377 225 -357 -903 60 554 380 -232 -753
1026g53N65M71K06p84K62LJ03L94j08n33L37n96L70J081p85q29l2N83N02J13j022
$$ -753 -188 283 489 -295 -33 -30 73 467 359 -174 163 -433 -63 1018 233 -596 -628 -45 457 570 -452
1047d52r6Q50l9p17L18L3l44N98L22n42k14J0j6O27N06r19o27P76L75Q5k23r59
$$ -452 -548 302 263 -454 -136 -103 -447 151 473 -69 -283 -273 -289 338 844 -75 -702 74 449 534 311 -648
1069f48M13P46j73k52m5Q2l76O40m9k49j98n03M28J050n43q50L79R7L52M6m53
$$ -648 -235 511 338 86 41 123 -253 387 338 89 -109 -612 -184 866 323 -527 -148 -51 301 347 -106
1090a06o54Q17M52n62R6O2o97P26N20o08J33l71l25N99O62p10o67O56k35O11L27
$$ -106 -760 57 509 -53 43 105 -592 134 654 46 179 -192 -517 82 744 34 -633 23 -212 399 726
1111G26j388K2J015m93J76L23o20j08N31J78n02n1j5m2J103n77r12J54L40J04
$$ 726 -662 -640 375 -118 58 381 -239 -347 184 362 -140 -191 -206 -248 855 278 -634 -480 -140 -36
1131c6N62j6j279N72N55m61L59R9n70N5Q37o38k7J90p52L94Q79o68o92N49O5J59
$$ -36 526 510 -769 -197 358 -103 256 355 -215 -160 677 39 12 202 -550 -156 723 55 -637 -88 -23 136
1153A36N93r68m99J028n1l62M54l89n34Q02L45l24J06m89k90J000L32j205J17
$$ 136 729 -239 -738 290 239 -123 331 -58 -592 210 555 231 337 -152 -442 558 890 -315 -198
1172a98K76n6L90j17m70m24Q95k94j0l8k87j91Q72N9k38P7q96K22R56k2r08N29
$$ -198 78 22 412 295 -175 -599 296 2 -8 -46 -333 -524 348 407 169 246 -650 -428 528 506 -402 127
1194A27m79K16R45q16p05P60J47j93L66j49q31O43K56m04M12Q4j002N07P75o14
$$ 127 -352 -136 809 -7 -712 48 195 2 368 219 -612 31 287 -117 295 379 -623 -116 659 45
1214D5n0m05J2N99K13p48p3M89j06o8L34m33l88O55O4j26M51o13k89O97M11o74
$$ 45 -5 -410 -398 201 414 -334 -407 82 -24 -92 242 -191 -579 76 140 14 465 -148 -437 260 671 -3
1236cj58L4J03O64l49p73M40K0k9K71J86p52K29M17j20J27k56p98K63Q50j56j92
$$ -3 -161 -127 -24 640 291 -482 -42 -22 -51 220 406 -346 -117 300 180 307 51 -747 -484 366 210 18
1258A8N5p73N40N88q95K47L80q6R5L96m23n48M50QM8K42l14l36K68M30l39q2k90
$$ 18 73 -700 -160 428 -467 -220 160 74 169 565 142 -406 44 52 100 342 28 -308 -40 390 51 -31 -321
1281c21k18Q98K4n84O5N27m18M21k40m56P1K09K30J48J6o39o8N01m4K0k30k39
$$ -321 -539 359 383 -201 -136 391 -27 394 154 -302 -231 -22 208 356 372 -267 -335 166 122 142 -88 -327
1303c27M36L42j43l31R2o5KK60n3k78l55M71l6M8J06m10J06O52l60r6l86k07P14
$$ -327 109 451 308 -23 69 4 6 266 213 -65 -420 51 15 63 169 -241 -135 517 157 61 -325 -532 182
1326A82K40p06K46k07J10l5K13l06J39L15k51K80L96r14L8L09R9K91n09j43J9
$$ 182 422 -284 -38 -245 -135 -170 43 -263 -124 191 -60 220 616 -298 -260 49 148 439 -70 -213 -194
1347a94P74m17k10j27J94J5K1p4Pj37j56M37j39J30k90j55N14o0j99r6L2L46j12
$$ -194 580 163 -47 -174 20 35 56 -18 -11 -148 -304 133 -6 124 -166 -321 193 133 -66 -162 -130 216 104
1370A04k4j97Q0K3K6K19r4j05l47J18L96Q8k05l26J88J31K46k50l39J87K96k98
$$ 104 80 -117 -37 -14 12 231 137 32 -315 -197 199 287 82 -244 -56 75 321 71 -268 -81 215 -83
1392h3p7j13K34k54L39L54k37n12J69M9J86J52l47j03L79j27M98m09KQ8k49J00
$$ -83 -160 -273 -39 -293 46 400 163 -349 -180 -131 55 207 -140 -243 136 9 507 98 100 188 -61 39
1414C9j48K33l15J49P3O1k56O0l65N92Mk33j02R0J25J39Po05L37M6K28j15n0j07
$$ 39 -109 124 -191 -42 31 92 -164 -104 -469 123 127 -106 -208 -118 7 146 153 -452 -115 -69 159 44 -6 -113
1438a13J1J46J25K28m23j19J31M06r9k42j96j35M73J12l63k53K53J45P3K23p86
$$ -113 -102 44 169 397 -26 -145 -14 392 293 51 -145 -280 193 305 -58 -311 -58 87 160 383 -403
1459d03M16p1k27N45k9m97p4M09j8K2p7j03q4M18k79k26J06K7J52K71l12k5J07
$$ -403 13 -58 -285 260 231 -266 -340 69 51 73 -4 -107 -191 227 -52 -278 -172 -145 7 278 -34 -59 48
1482D8r9j72M59q0l73K28J77L12n33j8l4L03l29P3k09J0L01k05K35j3k35M5k04
$$ 48 -51 -223 236 156 -217 11 188 500 -33 -51 -85 218 -111 -38 -247 -237 64 -141 94 81 -154 -109 -313
1505c13M36K6l38r1L93K8K35m20N9K05J90j26k16j68N9PpJ52k23J07j2J5K64k54
$$ -313 123 149 -189 -280 113 141 376 -44 15 220 410 284 68 -100 -41 -34 -41 111 -112 -5 -17 -2 262 8
1529Hj61j22J86M5O3l21L17N6K51k57j50j33j59L34J28j3o6k30O6K10J17l07O4
$$ 8 -153 -275 -89 -44 19 -302 15 71 322 65 -85 -218 -377 -43 85 72 6 -224 -158 52 169 -138 -74
1552g4R3L1M2K15n03J52Q2j00L16n3m60K96L3Q1k78O6o9j0J01M41n03Q1k07O18
$$ -74 19 50 92 307 -196 -44 38 -62 254 201 -259 37 70 151 -127 -61 -130 -140 -39 402 -101 -20 -227 391
1576C91k28j72pj63l3P4R4n6j00j12J18K77j9j67j61K49K46Qj99k34K90r5n9o2
$$ 391 163 -9 -16 -179 -212 -138 -44 -100 -200 -312 -194 83 64 -103 -264 -15 231 239 40 -194 96 1 -58 -120
1600a20P0k07L87L1r9j80Q8J27r1p2J49k76n0M18k55L6J52j35K30k09j45K26p3
$$ -120 -50 -257 130 161 62 -118 -30 97 6 -66 83 -193 -243 175 -80 -44 108 -27 203 -6 -151 75 2
1623BOJ60N5j37r5k19K39L47m55n6k80M91K43k88j65M2J75k03nJ38J40j41k29
$$ 2 8 168 223 86 -9 -228 11 358 -97 -153 -433 58 301 13 -152 -110 65 -138 -143 -5 135 -6 -235
1646b35L87M0j10j03n9L95j77j68l40M66M5k27L05n0k15J10J67m49K67l7m17J92
$$ -235 152 192 82 -21 -80 315 138 -30 -370 96 141 -86 219 169 -46 64 231 -218 49 12 -405 -213
1668b13N32m70O0J27k43O63n11j10M0k9K4m0M13J03m50J46m2K05j09k96K2L08
$$ -213 319 -151 -91 36 -207 456 -55 -165 -125 -154 -130 -170 243 346 -104 42 0 205 96 -200 -178 130
1690A30K23m83j40K95j5M9Kk03K53R0j01j66r1J33k92J91K33j57M9m26J30N23
$$ 130 353 -130 -270 25 10 59 61 -142 111 201 100 -66 -157 -24 -316 -125 108 -49 0 -426 -296 227
1712B27l15j93J27J15K36l67o8M14K01k72j30J79L4l71J82k55J00O12m34RK97
$$ 227 -88 -281 -154 -39 197 -170 -238 176 377 105 -25 154 188 -183 -1 -256 -156 456 22 31 328
1733C28k00K8o7M2j22O5l5J59n2j80k34L28K47m69l16N53O7O5j2m21J44K09lm37
$$ 328 128 156 89 131 9 74 39 198 146 -34 -268 60 307 -162 -478 75 142 207 195 -226 -82 127 124 -313
1757c13L17J38p1Q8L0j60l2j38O0K86J64p45K25L77J45k04l91m8N46m0j92j91
$$ -313 4 142 71 159 189 29 -3 -141 -81 205 369 -376 -151 226 371 167 -224 -272 274 234 42 -149
1779a49J87J26j10o8K94k91r0j33J76L35j28k24j82K45J0j19n2K97j03o0k51L33
$$ -149 38 164 54 -14 280 -11 -101 -234 -58 277 149 -75 -257 -12 -2 -121 -173 124 21 -39 -290 43
1801D3j24O0p7K03Q3k71j54q5M56j6m85l9L06M19k62p8r8L79k6m49R4l6N97m99
$$ 43 -81 -21 -98 105 188 -83 -237 -322 134 118 -367 -406 -100 319 57 -21 -119 260 234 -215 -121 -157 440 -59
1825e9Q0J00j1j16M3k17O26k76n70J98O70m17j73N8k9L6j79l6M46l2j06p5K62
$$ -59 21 121 110 -6 37 -180 446 170 -400 -202 468 51 -122 -64 -93 -57 -236 -272 174 142 36 -39 223
1848B23Q4j70n36L04L93r4k90j85K34K92k14k03K62n1pj21m0K3K06l27J8M50j48
$$ 223 307 137 -399 -95 298 204 -86 -271 -37 255 41 -162 100 49 42 -79 -119 -96 110 -217 -199 251 103
1871A03k84K9J65K75q2k82j93K31J98m47K3L11j03j53K71J44l11p8k89L95K81
$$ 103 -181 -152 13 288 206 -76 -269 -38 160 -287 -264 47 -56 -209 62 206 -105 -183 -472 -77 204
1892B04K4m22K0L44j29l69J79K18j98K73j29R4J10j84k84L21L82l93k70J19K22
$$ 204 228 -194 -174 170 41 -328 -149 69 -129 144 15 109 219 35 -249 72 454 61 -209 -90 132
1913A32M6m70k0K50L93l35k47L31L7M2j89j84M82l70L1j40L13k1n5l70L47N48
$$ 132 178 -292 -312 -62 331 -4 -251 80 117 159 -30 -214 268 -102 -71 -211 102 81 26 -344 3 551
1935E51l46k71j63N31j58n16K43L67j76j02J5n6L8P0l06M39j08o7r9O8J73lR0
$$ 551 205 -66 -229 302 144 -372 -129 238 62 -40 -25 -81 -43 27 -279 160 52 -15 -114 -46 127 124 214
1958B14m51K78K46j65k99K35l5P7j57j9K3J66l00J76J88j99q9o9J03J79j67J24
$$ 214 -237 41 287 122 -177 58 23 100 -57 -76 -53 113 -187 -11 177 -22 -111 -180 -77 102 -65 59
1980E9k61N64m33k32K46K0j2k82J90K07j93L2o2L95J18j88l54n8M99l75J09kJ32
$$ 59 -202 362 -71 -303 -57 -37 -49 -331 -141 66 -127 -95 -157 238 356 168 -186 -244 255 -120 -11 -13 119
2003A19j46l0k08K68K73k22k82J45L78n9l03j91L67k97L40m03L99m1q3l57M13
$$ 119 -27 -57 -265 3 276 54 -228 -83 295 236 -67 -258 109 -188 152 -251 148 107 24 -333 80
2024H0j21L37m08P5NJ22l35J7O43l14j87q4L45l9m6j38J69P5j80np2J61R2l92
$$ 80 -41 296 -112 -37 -32 90 -245 -228 415 101 -86 -170 175 136 90 -48 121 196 16 11 -61 100 192 -200
2048b00K08R3Q8l2j28J19N1l48k2k23P14l45o9J42k26K05j30l28M01J93k68j46
$$ -200 8 101 189 157 29 148 199 -149 -171 -394 320 -25 -94 48 -178 27 -103 -431 -30 163 -105 -251
2070b51L42O1k36r3J93J36j93K17m18L75m9P7k88q8j75L41j87L80M8j74l04N22
$$ -251 91 152 -84 -177 16 152 -41 176 -242 133 84 161 -127 -215 -390 -49 -236 144 192 18 -286 236
2092B36r7j04o8j67J50K17j66j96K05K4k69q9K69O2J9j21J51J73l72q8K12m2Q0
$$ 236 139 35 -33 -200 -50 167 1 -195 10 34 -235 -324 -55 7 26 -95 56 229 -143 -231 -19 -61 19
2115A9j77L48l31M73j75j16l0J87l21L18l73J99k42N2K01K79k64K9k23M8M62k61
$$ 19 -158 190 -141 332 157 41 11 198 -123 195 -178 21 -221 -169 32 311 47 76 -147 -99 363 102
2137A02k14q4M11k02j41k26L26l53M59k10J76p1J94k71K30Q8j79l8j5n9jQ5j91
$$ 102 -112 -196 215 13 -128 -354 -28 -381 78 -132 44 -27 167 -104 126 214 35 -3 -18 -77 -78 7 -184
2160a84%K40j1l04J91J74k6K0k57K30p3K1j75K52K3q6p8L14k13j00q4K47m4J16
$$ -184 -184 56 45 -259 -68 106 80 100 -157 73 0 21 -154 98 121 35 -43 271 58 -42 -126 121 77 193
2184A93l49P7P4J16j88J31j80K69k06j68N19k43k19K06N5K69j75j86k6j59K45
$$ 193 -156 -79 -5 111 -77 54 -126 143 -63 -231 288 45 -174 32 87 356 181 -5 -31 -190 55
2205E5k16J35P3k43K29l49M27J14k70M4J1K8k06K30j68L26l06OM7J81l56j21K59
$$ 55 -161 -26 47 -196 33 -316 111 225 -45 -1 10 38 -168 62 -106 220 -86 -80 -33 148 -208 -329 -70
2228g0j79K24K9j08J37L8j69J82o4MJ32j95l91L67j03J67O3m3Q0q4j84J94j22
$$ -70 -249 -25 4 -104 33 71 -98 84 20 24 156 -39 -430 -63 -166 1 64 21 101 17 -167 27 -95
2251i5k3j05L0L24k15J05j57J45k7o5N7J19j4n7l60L62N5q7qp6K11k54R1J73j93
$$ -95 -118 -223 -193 131 -84 21 -136 9 -18 -83 -26 93 79 22 -338 24 79 -8 -16 -92 119 -135 -44 129 -64
2276f4J07O7j33j48K27J5j73J64l3k95J89k52J37J81K54l47r1M67j92l85R6K19
$$ -64 43 110 -23 -171 56 71 -102 62 29 -266 -77 -329 -192 -11 243 -104 -195 272 80 -305 -209 10
2298A0j75L33m23J95mL86l33KL0j73O4o7K38j53o4J45K08m18J90r2J57j60K50
$$ 10 -165 168 -255 -60 -64 322 -11 -9 21 -152 -88 -155 83 -70 -134 11 219 -199 -9 -101 56 -104 146
2321A46l56L22J8m18L69k32J02Q2p1k13K94j74L26O2l87J90l48K37J82k72l7j7
$$ 146 -210 112 130 -288 81 -151 -49 33 -38 -251 43 -131 195 257 -130 60 -288 -51 131 -141 -178 -195
2343a95P7K64n5N5l50L02O7n2n1j82J83k2q8Km6K62l05O4J20K18l43J62K43o4
$$ -195 -118 146 91 146 -204 98 165 113 62 -120 63 41 -47 -45 -91 171 -134 -70 50 268 -75 87 330 266
2367B66n6m68K15K8J84j82k60M42n19J18R4J25j07L02n3k46M76l76J21O1j66M
$$ 266 210 -258 -43 -15 169 -13 -273 169 -350 -232 -138 -13 -120 182 129 -117 359 -17 104 165 -1 3
2389CJ74j52j36M9K54j18j59L19k59k9K3J26m3q7l26K33MK30R6o8%j52R5J65j34
$$ 3 177 25 -111 -62 192 74 -85 234 -25 -54 -31 95 52 -35 -361 -128 -124 106 202 134 134 -18 77 242 108
2414A08j56J32j9j25k42K06n4M78m44K74k64K38l6j62K36j11rK40j98j27L7j4
$$ 108 -48 84 65 -60 -302 -96 -150 328 -116 158 -106 132 96 -66 170 59 50 290 92 -35 2 -12
2436a2j63M27k76q4o9J94L51j40l84J83l8k54K20j15K76K9p7P4k83j4L38j42J85
$$ -12 -175 252 -24 -108 -177 17 368 228 -156 27 -11 -265 -45 -160 116 145 68 142 -141 -155 183 41 226
2459B26o0k22j17J64p3P0N6k4ok24L20N9k79J56K65k76j5J0j8J81j68J18n7j36
$$ 226 166 -56 -173 -9 -82 -12 44 20 14 -210 110 169 -110 46 311 35 20 30 12 193 25 143 86 -50
2483e0n8J60l01L32L4n64M34j5j51L3R4J15J12k56j91J65j76P6M40j01j69R3K23
$$ -50 -108 52 -249 83 117 -447 -13 -28 -179 -146 -52 63 175 -81 -272 -107 -283 -207 233 132 -37 56 279
2506B79l66K68N2l40J2q0L63k42OR1j94J78j35M38k57R9Q6k37K01k26O9k29J38
$$ 279 -87 181 233 -107 -95 -175 188 -54 -48 43 -151 27 -108 330 73 172 258 21 222 -4 65 -164 -26
2529b6j75J75J23L1k17R7P4r0kr0J48j34j61J40M0K58k52J9J00J25j06k92l4K40
$$ -26 -201 -26 97 128 -89 8 82 -8 -10 -100 48 -86 -247 -107 -67 191 -61 -42 58 183 77 -215 -249 -9
2553iQ6j83L14k30J43Q8q3l06J81J80k61K59kk90L66k98N7P8m04L03j00NK11j96
$$ -9 77 -106 208 -22 121 209 126 -180 1 181 -80 179 177 -113 253 -45 12 90 -314 -11 -111 -106 105 -91
2577i1N2J60p2Q2j54o9R6K02l27J90j45J43j07J53j36k66M75j54p0J31p9M1k57
$$ -91 -39 121 49 131 -23 -92 4 206 -121 69 -76 67 -40 113 -23 -289 186 32 -38 93 14 55 -202
2600b02J39j37L74k40J56q7J09k4j51L20q2j40J49K5q2j48Q8m6J5K58k58j77K81
$$ -202 -63 -200 174 -66 90 3 112 88 -63 257 175 35 184 209 127 -21 67 21 36 294 36 -141 140
2623A40O4k48Q6k02M0L0k2O7j81MK02j75K25k64K78K4j67K60k14K28j22J98j49
$$ 140 204 -44 42 -160 -120 -90 -112 -45 -226 -222 -20 -195 30 -234 44 68 -99 161 -53 175 53 251 102
2646A02l06L16q5M8m7m0P8R3m8j57L7J73j80Q0p9K1p6j24M60m14K50o1J56l27
$$ 102 -204 112 27 75 28 -12 66 159 111 -46 -9 164 -16 64 -15 6 -70 -194 266 -148 102 41 197 -130
2670a30L06j37J09o0p8j44q0K68r3K77j00o5k2R7K9p1o4J31l70J96K76Jj04j60
$$ -130 176 39 148 88 10 -134 -214 54 -39 238 138 73 51 148 177 106 42 173 -197 -1 275 276 172 12
2694A2K39J24m36j42K81l10J70L7q9K50j19j95J47N5q7K8Nm65N80k67K29j03k2
$$ 12 251 375 -61 -203 78 -232 -62 -25 -114 136 17 -178 -31 24 -63 -35 -30 -495 85 -182 47 -56 -78
2717g8K41j10r3J6Q0J2j5j02K07j40P9l25M13k02N8J14rj06j67J54O5N8j64o0
$$ -78 163 53 -40 -24 56 68 53 -49 158 18 97 -228 185 -17 41 155 146 40 -127 27 92 150 -14 -74
2741g4P2M2p0L3J58m1pk88J38J61k31K70k59J31J27N7j23l14J18j43K49J09j52
$$ -74 -2 40 -30 3 161 120 113 -175 -37 124 -107 163 -96 35 162 219 96 -218 -100 -243 6 115 -37
2764c7j1p0k9J6K78N0k43J66k51M24l51L1K7K43k63j15J68J80j09j87K55j43J09
$$ -37 -48 -118 -147 -131 147 197 -46 120 -131 293 -58 -27 0 243 -20 -135 33 213 104 -83 172 29 138
2787A38k29j18J79j74ML87o7k58Q2j04Q3O5m08N58m24L19M2j43J26j17q0o8M07
$$ 138 -91 -209 -30 -204 -200 187 120 -138 -56 -160 -77 -12 -420 138 -286 33 75 -68 58 -59 -139 -207 200
2810B00m01K9K11Q7l17N00m74M34k08K4R0j00o1Q3Q9r6M0k82J96K32k01l86M26
$$ 200 -201 -172 39 126 -191 309 -165 269 61 85 175 75 14 97 186 90 130 -152 44 276 75 -311 115
2833A15j93N9r5P4q7j05J22K85k99J88J05k69J58k98J90J44j85J03o8J13j48q0
$$ 115 -78 -19 -114 -40 -127 -232 -110 175 -124 64 169 -100 58 -240 -50 94 -91 12 -56 57 -91 -171
2855a71o9M64j42P0Nq2j79J5L7J9k98L47kj18J26j66mM1Q7KJ06l05K13m7J27J91
$$ -171 -240 224 82 152 157 75 -104 -89 -52 -33 -331 16 14 -104 22 -144 -148 -107 -20 -18 88 -217 -4 -51 76 267
2881B67k94q7J50j26J46o7K63j80k49N2K78J73M3m88K66k25J96j23J65l3l15J77
$$ 267 -27 -114 36 -90 56 -11 252 72 -177 -125 153 326 369 -119 147 -78 118 -5 160 127 -188 -11
2903a1m8J13j64j4J38R6k1j24o5K90j81L9J1R2k68R5MJ93l68L91k81L77l85J35
$$ -11 -59 54 -110 -124 14 110 89 -35 -100 190 9 48 59 151 -117 -22 -18 175 -193 198 -83 294 -91 44
2927D4K7Kl27K04J15J24k75L76m63K49j17J2lJ74M5j58J56m00N29l18k06M52k09
$$ 44 71 73 -254 -50 65 189 -86 290 -173 76 -41 -29 -32 142 187 29 185 -215 314 -4 -210 242 33
2950C3M8M7ml33N34J99m47j88K72j84j20m4L28l88R2K18k42L06n9K01l31J44m2
$$ 33 81 128 124 -209 325 524 77 -111 161 -23 -143 -187 141 -247 -155 63 -179 127 68 269 -62 82 40
2973D0q5N4j05Q8q0K2J1P7J29l24J15K8L03j44l2J27m02L14j06J06j01jl3L5L1
$$ 40 -45 9 -96 -8 -88 -66 -55 22 151 -173 -58 -30 273 129 97 224 -178 136 30 136 35 34 1 36 67
2998F7r9l4Lj86L82j71N0q6N13n75L9J42M1j18j02Q1nO2N4j8m4K4J80k58j1PM6
$$ 67 -32 -66 -63 -249 133 -38 12 -74 439 -136 -97 45 86 -32 -134 -53 -58 4 58 40 -4 20 200 -58 -69 -62 -16
3025a6K02j77r5M4l5J29j36J27k40M36r7k92N3K01j28J04j30K25l24r1K59j3j0
$$ -16 186 9 -86 -42 -77 52 -84 43 -197 239 142 -150 -97 104 -24 80 -50 175 -149 -240 19 6 -4
3048dk4m2p2L4R8P0k60L12q6r0jJ54q0k5O5R8j76K46j85k74L68j31j86L28o4k13
$$ -4 -28 -70 -142 -108 -10 60 -200 112 26 -64 -65 89 9 -16 49 147 -29 217 32 -242 126 -5 -191 137 73 -140
3074a40J55l3m1j53K92J5J51J7m38P0J89Ok28j59K44O5j28k4N7k6K08k20R0N8
$$ -140 15 -18 -59 -212 80 95 246 263 -175 -105 84 90 -138 -297 -53 12 -116 -140 -83 -109 99 -121 -31 27
3098B7j07N5J01P0j72k31K54j87M48j15q0k89L67j11j07J44l05M11k22L6KJ2P4
$$ 27 -80 -25 76 146 -26 -257 -3 -190 258 143 63 -226 141 30 -77 67 -238 173 -49 -13 -11 1 75
3121G5r7K23j53p1l6j1KJ23j3j6Q0k74J09K00k83J22k7k61L17j54J3J67j44J61
$$ 75 -22 201 48 -23 -59 -70 -68 55 42 26 106 -168 -59 141 -142 -20 -47 -308 9 -145 -132 35 -109 52
3145E2j70K14k14K45j58r2J94O6p3k12R1K69k81N3j4j17K48j8J08j67n8K88l00
$$ 52 -118 96 -118 127 -31 -123 71 137 64 -148 -57 212 -69 -16 -30 -147 101 83 191 24 -34 254 -46
3168d6M6J9J20j84q4K16k30o1K04Q6J6j02J75J6q0k32J14Q7k18K89J20r9m95K80
$$ -46 0 19 139 -45 -129 87 -143 -204 0 86 102 0 175 191 111 -121 -7 80 -138 151 271 172 -323 -43
3192d3J10N0R8q6m0j84K99j93O3j19L21k81O5m2O2o4n7j63K55P8j85J24j51o0
$$ -43 67 117 215 129 89 -95 204 11 74 -45 276 -5 60 18 80 16 -41 -204 51 129 -56 68 -83 -143
3216a43J63j50K84J68l08j30k2J72R2j60J2k24J06J38n0J98j51J1k74M09K9j01
$$ -143 20 -130 154 322 14 -116 -138 34 126 -34 -22 -246 -140 -2 -52 146 -5 6 -268 141 170 69
3238F9K54m60K75j27j32R9O5j49OP9k4Q5j57J82j10K50k43o0RJ28p1j39J26p1
$$ 69 323 -137 138 11 -121 -22 43 -106 -100 -21 -45 40 -117 65 -45 205 -38 -98 -89 39 -32 -171 -45 -116
3262a16JJ73j28O5O5j28J60j3k32J89j29K65j11N4j35J75j67n7K17m78M15j09
$$ -116 -115 58 -70 -5 60 -68 92 79 -153 36 -93 172 61 115 -20 155 -12 -69 148 -330 85 -24
3284b4J7J1%J03k0O4k68J44M9K5r4N1o6Jp0K92J3k72j1K56R4j02j12Pl4J64l79
$$ -24 -7 4 4 107 87 151 -117 27 76 101 7 58 -8 -7 -77 215 228 -44 -55 201 295 193 81 88 54 218 -161
3311a61L68k52k76O70n12L34j47j2J12m01N49j97j00J20j54J7o2K77j71J04j74
$$ -161 207 -45 -321 349 -163 171 24 12 124 -277 272 75 -25 95 -59 -42 -104 173 2 106 -68
3332f8J03j69J31M7j77L26l48L51r7j14rj80p1j11K19j43K19j1K87q4l5k01o8
$$ -68 35 -134 -3 44 -133 193 -155 196 99 -15 -24 -204 -275 -386 -167 -310 -91 -102 185 101 66 -135 -203
3355b03J19q8M07j87k54M46l08J78K1o6j67J6J16o5K88l36Po6J63j05L70j21j23
$$ -203 -84 -172 235 48 -206 240 -68 110 131 65 -102 -86 30 -35 253 -83 -76 -142 21 -84 286 165 42
3378D2R2l32J35K00J72m35J47K1k75R7J12rj62K23k47K67J16j87j47K39j90L30
$$ 42 134 -198 -63 137 309 -126 21 42 -233 -136 -24 -33 -195 28 -219 48 164 -23 -170 69 -121 209
3400B09j98j87L40k35o4p5L91k17M5L01o82L92O5pk94L96P9j08r3Rk25J19m2J63
$$ 209 11 -176 164 -71 -135 -210 181 -36 9 310 -372 20 85 78 -216 180 259 151 58 67 -158 -39 -81 82
3424H2n0l73J23M7Q8r5j1J33K10j46L4j55j01J13J05j03N9O1l2J3k30N1L07k31
$$ 82 32 -341 -218 -171 -83 -178 -189 -56 154 8 42 -113 -214 -101 4 -99 -40 21 -11 2 -228 -177 130 -101
3448a01K6M1J69N2J8k29k1L03l46P6K2J72j74M0l08K98j70j02J20j36K73k77L69
$$ -101 -75 -34 135 187 205 -24 -45 258 -88 -12 10 182 8 48 -260 38 -132 -234 -114 -250 23 -254 115
3471A15Q8m07J34K07L5l40K93k52J49q9K58j25j76N3K50l38J43j02N0J36j1j65
$$ 115 203 -204 -70 137 172 -168 125 -127 22 -67 191 66 -110 -57 193 -145 -2 -104 -54 82 71 -94
3493i4k2K8J26K46k40J27pP5k47K7Ll21L13J0j91K41k60J56J82J50m2j58j04L34
$$ -94 -116 -88 38 284 44 171 164 239 -8 19 22 -299 14 24 -167 74 -186 -30 152 302 260 102 -2 332
3517C32m60J29n8l0J11j73K24p0J05j45P0M5l8j74Q5K33L0k14R3j54N1j5j99K07
$$ 332 -128 1 -57 -87 24 -149 75 5 110 -35 35 80 42 -132 -47 186 216 2 95 -59 -8 -23 -222 -15
3541a5J95k07J2J12j89K19l20K26J2O7K2j91K73O5n64K52Q2k2J18k17K38j26j75
$$ -15 180 -27 -15 97 -92 127 -193 33 45 112 134 -57 216 281 -283 -31 51 29 147 -70 168 42 -133
3564a33l2M04k95J74K9k01K14j73K45j34p1P6j48q9j19M20l2k24j59J67K3j65
$$ -133 -165 239 -56 118 147 -54 160 -13 232 98 27 103 -45 -134 -253 167 135 -89 -248 -81 -58 -223
3586b23K63nN0n7J76j4l25K31j96J75K79o59M45m13J90J75k42K61j86j15N8P7
$$ -223 40 35 85 28 204 190 -135 96 -100 75 354 -305 140 -273 -83 92 -150 111 -75 -190 -132 -55
3608e5k85M54j17j0R9k54M39k32l12L24p3o5j88M98m86J84L19j68j75k7J53oJ01
$$ -55 -340 114 -3 -13 86 -168 271 39 -273 51 -22 -87 -275 223 -263 -79 240 72 -103 -130 23 17 118
3631A18R9m29J57N6q7j06K04k58N11l81L1K05k61L51j90J7j87P1k18M17p5J11
$$ 118 217 -212 -55 1 -86 -192 12 -246 265 -116 -85 120 -141 210 20 37 -150 -79 -297 120 45 156
3653A56m78J95Q2R0j19J08J99m8k98K25o2k38J07L2j14J60J6l7j02j12M21l62
$$ 156 -322 -127 -45 45 -74 34 233 185 -113 112 50 -188 -81 -49 -163 -3 13 -24 -126 -238 183 -179
3675a79J21J96k21K74j58j71J08K51k42k49M89l04k2K02j41Q8K8K65k70K9J41
$$ -179 -58 138 -83 191 33 -138 -30 221 -21 -270 219 -85 -107 95 -46 42 70 335 65 94 235
3696B35k34j28Mp6K06j35L49j38JK7N6k42K52q8j79N1j9k3Mj51L51Q0q2j41N4
$$ 235 1 -127 -123 -199 7 -128 221 83 84 111 167 -75 177 89 -90 -39 -58 -81 -77 -228 123 203 121 -20 34
3721C4J00n3Lk97m7P9J21pN5L5k55K7K15j9q0j48L65k84Q3Jn3J29J99k73J87j22
$$ 34 134 81 84 -213 -260 -181 -60 -67 -12 23 -232 -205 10 -9 -89 -237 128 -156 -73 -72 -125 4 203 -70 117 -5
3747em5j04J65K24m86L18m4P8M4j93L8J63j6Q4k35j02J4J50p8K30l34P8j19J22
$$ -5 -50 -154 11 235 -251 67 23 101 145 -48 -10 153 137 221 -14 -116 -102 48 -30 200 -134 -56 -175 -53
3771e3m4R1K82l90K13j42Pj02Q3lo2K66j73K08k28Q5J3q7rJ31j84K50k50J06q1
$$ -53 -97 -6 276 -114 99 -43 -36 -138 -55 -58 -120 146 -27 181 -47 38 51 -36 -45 86 -98 152 -98 8 -73
3796g3K03P9k20L27l81n4J68j35j49K41P3K09j67j03K2J66k93j22L77j37J40J59
$$ -73 130 209 -11 316 -65 -119 49 -86 -235 6 79 288 121 18 40 206 -87 -209 168 31 171 330
3818C30l50p4J93o4q8J03l17J11n3Q1J03J45l50L00r9J66j48j08L19k08j54J60
$$ 330 -20 -94 99 35 -53 50 -267 -156 -209 -128 -25 120 -230 70 -29 137 -11 -119 200 -8 -162 -2
3840bJ74j76M0k70K63Q5M1m65L30QN9k92L17k3l8j90K63M0l66J68No5j14L49m12
$$ -2 172 -4 36 -234 29 114 155 -310 20 28 87 -205 112 89 51 -139 124 164 -202 -34 -29 -94 -208 141 -271
3865b71L37O9q1J83l20K80Nl7q2j73J32j1L3P5k35j28K34J11n66L62j31q0M32
$$ -271 66 135 54 237 -83 197 202 165 83 -90 42 31 64 139 -96 -224 10 121 -445 -83 -214 -294 138
3888A38k23OJ25k29K56mk11k03M13J29k18Q2L01m90j52L98l00M64n87O5K83k5
$$ 138 -85 -79 46 -183 73 69 -142 -345 68 197 -21 61 362 -128 -280 118 -182 282 -305 -240 43 18
3910A8j33K85j15k08J84l69P0K16j50K41J74l26RJ88l6j57J18J89J15j5n51L36
$$ 18 -115 170 55 -153 31 -338 -268 -52 -202 39 213 -113 -104 84 48 -109 9 198 313 298 -253 83
3932H3nk97J18R2J00P7r8r2j19K76m8k32RM2l7M5K00m3Ll07K92j29q1O6QM13j38
$$ 83 78 -219 -101 -9 91 168 70 -22 -141 135 87 -145 -136 -94 -131 -86 114 71 74 -233 59 -70 -151 -85 -77 336 198
3959A98j47j65K57k14M9j46j44J42M8J48O5l28L09J7j40o4k8K90r5l7J01J15k46
$$ 198 51 -114 143 -71 -22 -168 -312 -170 -122 26 91 -237 72 89 -51 -115 -143 147 52 15 116 231 -15
3982a5J04r3L6j22J31j35k18J99J75p8J05j94J42K4j81L2N9Q7J04k26j60m5J94
$$ -15 89 -4 32 -90 41 -94 -312 -113 62 -16 89 -105 37 61 -120 -88 -29 58 162 -64 -224 -269 -75
4005g5j35M09j19j0M0k23K26k28K29m06L66kj89K92j94J59k17J54K75m99M15k78
$$ -75 -210 199 80 70 110 -113 113 -115 114 -292 74 72 -117 175 -19 140 -77 77 352 -147 268 -10
4027a0MJ21k4j94O9j6J78o2k19L9K51k10q0J45k5p0K40k37R5P0r8j27K89k0q2
$$ -10 -6 115 91 -103 -34 -50 128 66 -153 -114 137 -73 -153 -8 -33 -103 137 -100 -5 65 -33 -160 129 109 27
4052B7N3j48Q3j56jJ91q7K57j94K03m27L3K29k35L06j25K34m78K52k38K59o8J0
$$ 27 80 -68 15 -141 -142 49 -38 219 25 228 -199 -166 63 -172 134 9 243 -235 17 -221 38 -30 -20
4075b0N0n2q1K05m8j4P0k29L36j79k49M33J28l86J53P1j86M5k9k5R9n4J15k37
$$ -20 30 -22 -103 102 54 40 110 -119 217 38 -211 222 350 -36 117 188 2 47 18 -7 92 38 153 -84
4099h4P7J53j07L6J1r2j94L51k6j10J78k08k03K48k6r9J9J40q7j10J73k8L11k87
$$ -84 -7 146 39 75 86 -6 -200 151 125 15 193 -15 -218 30 4 -95 -76 64 -23 -133 40 12 323 36
4123C6qj48M15k74j9J53j00K92n49o7J57M6O7K64m87M62l21J15r3j21L9J29L5
$$ 36 28 -120 295 21 2 155 55 347 -202 -269 -112 -66 1 265 -222 240 -81 34 -59 -180 -141 -12 23
4146B3r5L70j67k02%m0J83k43J90J39k3r8J35N3JP2m46K87p4K1l34L15L4Q6k50
$$ 23 -72 298 131 -71 -71 -111 72 -171 19 158 135 37 172 225 226 298 -148 139 65 86 -248 67 101 187 -63
4171f3O4j87L05r0j42R5l37N72l0j19R1k32k0J29n4j55J33J46J8M4l9j42J28M8
$$ -63 1 -186 119 29 -113 -18 -355 217 187 68 159 -73 -93 36 -18 -173 -40 106 124 168 129 -13 115 163
4195A63l07K8L82m35L07l2l5j12O4l8N3P6k20P1RL53m86L45j82J9M5j44J46l18
$$ 163 -144 -116 266 -169 138 106 71 -41 23 -15 38 114 -106 -35 -26 327 -159 186 4 23 68 -76 70 -248
4219b48M04k53J11PM3k35K44J02j34r8j41L24o6m21L43j53K43j37R7R7o7J06k62
$$ -248 156 -97 14 21 64 -171 73 175 41 -57 -198 126 60 -361 -18 -171 72 -65 32 129 62 168 -94
4242i4J31O6j12j48J88J00l58j88L99L39k01k48K81l44K6j9L14l02L04j40J02
$$ -94 37 103 -9 -157 31 131 -227 -415 -16 323 122 -126 155 -189 -163 -182 132 -170 134 -6 96
4263I6m6j59oK45k16R4lN6j26L30m0k05R7m1J1M3k15p3J76R5N0k90J60po9k03
$$ 96 50 -109 -115 130 -86 8 5 61 -65 265 225 20 117 76 87 130 -85 -158 18 113 163 -127 33 26 -43 -246
4289b46O23l54M8j20j01J85J50j20o0k2O2K16m68L24k96J03o4O3J39j12K02m18
$$ -246 377 23 71 -49 -150 35 185 65 5 -17 45 261 -207 117 -179 -76 -140 -77 62 -50 152 -266
4311b66J73K29j3r2j62L02o7o7o2jK05k01K03k64k8K66j67J35n2L5k44K30j69
$$ -266 -93 136 123 31 -131 171 104 37 -25 -26 179 -22 181 -83 -111 155 -12 123 71 106 -138 92 -77
4334g7R8P2j25J43k49K5j24K10j4J9rL18n30K24L4m8j09M7L29m44L16l0n0J29
$$ -77 21 93 -32 111 -138 -113 -237 -27 -41 -22 -31 287 -243 -19 15 -33 -142 -95 234 -210 106 76 26 155
4358A55J2j09Q2k29Q7r7O5L21k59oL19l99J95J42m03J00J04J25k02l6j76K68o9
$$ 155 167 58 140 -89 -2 -99 -34 287 28 22 341 -58 137 279 -124 -24 80 205 3 -33 -209 59 -10
4381a0j06J98J53pj53r3J9J56j45j3j43J18l2P2J16l70J80j95J18K71k20j80K28
$$ -10 -116 82 235 228 75 -18 1 157 12 -1 -144 -26 -58 14 130 -240 -60 -255 -137 134 -86 -266 -38
4404c8j6K18j56l8L24j29j68K66k86J58l04J50m0K20l3K77k38j51l9J43j63j17
$$ -38 -54 164 8 -30 294 165 -3 263 -23 135 -169 -19 -59 161 128 405 167 16 -23 120 -43 -160
4426a60R5P2O7j81N4k21N27k91O9l4J3P3Ql01K06L29q1j96k8m3k98M81p9n2M1
$$ -160 -65 7 74 -107 -53 -274 253 -38 31 -3 10 83 91 -210 -4 325 244 48 20 -23 -321 160 81 29 70
4451G0L3j64J86l79J57M3J79k2J8J39k59q4K78m33K63j32n9J86j66K46j22L2l1
$$ 70 103 -61 125 -254 -97 -54 125 103 121 260 1 -83 195 -238 25 -107 -166 20 -146 100 -22 10 -21
4474b1K9m5l4J8R7K9K19k05k8nk33L8j00M23j88J77l62J29J66K6j79j21O3L89
$$ -21 8 -37 -71 -53 44 73 292 87 59 54 -179 -141 -241 182 -6 171 -191 -62 104 130 -49 -170 -107 282
4498B82l1k92p9o2J23J83p3Jj58P8M9j63K13P2o2l15J20R4J6K17j27r6n9L50j36
$$ 282 251 -41 -120 -182 -59 124 51 52 -106 -28 21 -142 71 143 81 -234 -114 -20 -4 213 86 -10 -69 281 145
4523A45p7j27K02k20O4k5K6J8m50M72p5M11o04N02m12M05k65n9m5J0M18k47k69
$$ 145 68 -59 143 -77 -13 -38 -12 6 -444 28 -47 364 -240 262 -150 255 -10 -69 -114 -104 314 67 -202
4546b02M96p2m28K18j50L20n8k87J11o4LK95l01L40k59m9o4J61r4QJ80j57J41
$$ -202 294 222 -206 12 -138 182 124 -163 -52 -116 -113 182 -119 221 -38 -87 -151 10 -84 -76 104 -53 88
4569H8L9j26K4K8j94j88K69K73k23J39l79M34j35L0o6K43j34k3L7K3j96J70k52
$$ 88 127 1 25 53 -141 -329 -60 213 -10 129 -250 184 49 79 13 256 122 99 136 159 -37 133 -119
4592a19J0J30K9j66J33m24J73M32K9l25%J23J9Q5k67K72r3k7L4K9o3j1M4K9m48
$$ -119 -109 21 50 -116 17 -407 -234 198 227 -98 -98 25 44 129 -138 134 41 14 48 77 14 3 47 76 -372
4617c72L26K58j21j25O4Q8l92L08j28l6L7K28k03L4J54j18kk13M36j02r6p5j75
$$ -372 -46 212 91 -34 30 118 -274 34 -94 -130 -93 135 -68 -34 120 2 0 -213 223 121 25 -50 -225
4640b25K64Q6J3r4Q2j25M8QL12k36n3L8Q7J41n07M38k73kK61m52L41k31Q6K43
$$ -225 39 125 138 44 126 1 49 57 369 133 80 118 205 346 -161 277 4 2 263 -189 152 -79 7 250
4664B50r5j87K20K62m76J44p5N0j61r8L10k00j32J59k66J57L31o5m31J61K47o5
$$ 250 155 -32 188 450 -26 118 43 93 -68 -166 144 -56 -188 -29 -295 -138 193 128 -303 -142 105 40
4686D0J36k3m4k03L69k94k06L56lk03j45K21M0j27J64K2N1j26Q7j63J43l44k3
$$ 40 176 153 109 -94 275 -19 -225 131 128 -75 -220 1 41 -86 78 100 151 25 112 -51 92 -252 -275
4709b75L45R2l0j26K91k9j30j69J6j67N6J6O9K4K45l9o6o4j54J94k3J7l01K70
$$ -275 70 162 132 6 297 268 138 -31 -15 -182 -126 -110 -41 -17 228 189 123 59 -95 99 76 93 -208 62
4733F2j75n5K90j87k8K34l71L77k00N5R5J17o1k43K23k4p4j03M0k2j90J51J93
$$ 62 -113 -168 122 -65 -93 141 -230 147 -53 2 97 214 153 -90 133 109 35 -68 -28 -50 -240 -89 104
4756A04j61J19Qq7l3p5M7p7K94rj92K99k89No3n0L35P2l80J48N5M7k80J4L7R1
$$ 104 -57 62 70 -17 -50 -125 -78 -155 139 130 -62 237 -52 -47 -110 -160 175 247 -133 15 70 117 -163 -149 -112 -21
4782b1Mq5K65k62J2K07J66k96j5K06k41q2L54j45k09J72K9p0j54j37L44K1K31
$$ -21 -17 -102 163 -99 -87 120 286 -10 -25 181 -60 -142 212 67 -142 30 59 -11 -165 -302 42 63 294
4805B94j62l99R8J56J71l28Q5J16k87L31o8j09J32j14j55K01M5j16r8L72j39k2
$$ 294 132 -267 -169 -13 158 -170 -85 31 -256 75 7 -102 30 -84 -239 -38 7 -109 -207 165 26 4
4827DK3Qj38Q4R0j34K7j03L74l65J87k00J6N6J54k4j45j3M5k8J72m9O1q4J76j2
$$ 4 27 35 -103 -19 71 -63 -36 -139 235 -130 57 -143 -127 -71 83 59 -86 -99 -54 -82 90 41 102 18 194 182
4853A82l40LM4J39L4j89J11k4R2m7o8m9P2J9M4K06j05k9j03J16P4j31J00l10J09
$$ 182 -158 -155 -111 28 62 -127 -16 -40 52 5 -63 -112 -40 -21 23 229 124 95 -8 108 182 51 151 -159 -50
4878e0Q5Qr7K35P9l1l60J20k72L50j76J85j67K59n5k8P6k10J34k10j49K1K19L6
$$ -50 35 43 -54 181 260 229 -131 -11 -283 67 -109 76 -91 168 113 85 161 -49 85 -125 -274 -253 -34 2
4902Bl0J35j94o8O7p5L11j09R7k7k55J61m3j21J85Q9j50K65k99J32k9R8o9k02
$$ 2 -28 107 -87 -155 -88 -163 148 39 136 109 -146 15 -28 -149 36 125 -25 240 -59 73 44 142 73 -129
4926a29J70j01L5m06M73j6p8J59k74J14J22O7r4n4j50J16q8J57K6J62k11p3J20
$$ -129 41 -60 -25 -431 42 26 -52 107 -167 -53 69 136 42 -12 -162 -46 -134 23 49 211 0 -73 47
4949D7k33L16k31K68N5k50k15J68k2J60Mk5j70P5K78k75l0m0L7kj5J89k91J24
$$ 47 -186 130 -101 167 222 -28 -243 -75 -97 63 67 42 -128 -53 225 -50 -80 -120 -83 -85 -100 89 -202 -78
4973g8j49L31j21j25J09J91l31J48k89M44l81J61K38l89J45K58l31J41j65K32
$$ -78 -227 104 -17 -142 -33 158 -173 -25 -314 130 -251 -90 148 -241 -96 162 -169 -28 -193 39
4993C9j78RK04l17K68O1ON6j11k42L21j01LP5O3l67K15p0O8J35L3k67J76l4j02
$$ 39 -139 -130 74 -243 25 86 92 148 37 -205 116 15 18 93 156 -211 4 -66 2 137 170 -97 79 45 -57
5018e7N1rj02J44l4J22j46K34l35L30k80K26j3j95J14j82L84r5R1l12L5J94L9
$$ -57 -6 -15 -117 27 -7 115 -31 203 -132 198 -82 144 131 -64 50 -132 252 157 248 -64 -29 165 204
5041B04k55O5l2J28j18O2m5k8K6j12L06j22l59L9K35o0J39l80K59J03p0J06j51
$$ 204 -51 14 -18 110 -8 54 9 -19 7 -105 201 79 -280 -241 -6 -66 73 -307 -48 55 -15 91 -60
5064f0M6P1m9k61M99j10j38k09M22l10R2R5ML5J0j04r2O3j7N2l1k96J29J35J15
$$ -60 -14 57 8 -253 246 136 -2 -211 211 -99 -7 88 92 127 137 33 -59 4 -13 39 8 -288 -159 -24 91
5089I1j59J67j26l1p2j81K84j37L78j67O0m5O1O6n7j48j37J85j75n3K63R5k53
$$ 91 -68 99 -27 -58 -130 -311 -27 -164 214 47 107 62 123 189 132 -16 -153 32 -143 -196 67 162 -91
5112i1M6P0R9n05K41K04j26r9o0K27K01j57j65J95j14K03k22m1l1J94J52j52j14
$$ -91 -45 25 124 -381 -140 64 -62 -161 -221 6 207 50 -115 80 -34 169 -53 -94 -125 69 221 69 -45
5135d5K08n5j62K2Oj42j37L49Nj22J11O8j68k5J22q8J02j10M9j39K11p5Jj69K16
$$ -45 163 108 -54 -32 -26 -168 -305 44 49 -73 38 106 -62 -87 35 -53 49 -61 -12 -151 60 -15 -14 -183 33
5160C3k7J03R6l30j02J07Q1q4K36QQ8m97K89J9K15k91K42r8r6P5L3q1M3k31rr1
$$ 33 6 109 205 -125 -227 -120 -39 -123 113 121 209 -288 1 20 235 -56 186 88 -8 67 100 19 62 -169 -178 -269
5186b69M98q9k96J23J52j54j41J09K56k02N1l23K09p8K31k27L20M9l25m9q5J50
$$ -269 229 140 -156 -33 119 -35 -176 -67 189 -13 38 -285 -76 -154 77 -150 170 219 -106 -155 -240 -90
5208i0L47j76K05k55l26L50j05O8K53j48k9j17n5R3k3L6j0K9K6o6l5k69P17m56
$$ -90 257 81 286 31 -295 55 -50 18 271 123 94 -23 -78 15 -8 28 18 47 73 7 -28 -297 420 -36
5232c6J47N4m16J84p9L18j50jm9Q2l6j06K46n07O3M03R0j84k16J91l6K28l9o8
$$ -36 111 165 -251 -67 -146 172 22 21 -28 54 18 -88 158 -349 -286 117 207 23 -193 -2 -38 190 151 83
5256H3m5j13K16q8J51q2j26j1L8j12K19k74K49k06O5OJ81j80K08n1j52q3P9m8
$$ 83 38 -75 141 53 204 122 -4 -15 23 -89 130 -144 105 -101 -36 -30 151 -29 179 128 -24 -107 -28 -76
5280g6K14l20K25p9P1j03J29j01L2K25j14r5k02L25r8j34KJ07K2J08j24j08O8
$$ -76 138 -182 43 -36 35 -68 61 -40 -8 217 103 8 -194 131 33 -101 -99 8 30 138 14 -94 -26
5303b6j37J67J60l42j03j23L54L70j71k85n9M49j90j63N2k2J68or8q5pJ44Q0k14
$$ -26 -163 4 164 -178 -281 -404 -50 320 149 -136 -195 254 64 -99 -47 -69 99 93 -5 -90 -97 47 127 -87
5327h7J80p0J13j18J7K54k68j25J26P4q9l8j24J59l47K17P3mL05k11Q5J78j86
$$ -87 93 23 136 18 35 289 21 -104 22 96 7 -31 -155 4 -343 -126 -53 -57 248 37 122 300 114
5350A14k03J41j32N02m60k29K11j39L69k18p9K56k05q6K70p7l9p3O0M5Nqk2Q3
$$ 114 -89 52 -80 422 -38 -267 -56 -195 174 -44 -123 133 -72 -158 112 35 -4 -77 -17 28 33 25 3 86
5374H6j15j60N3o5K40j05K16l3k72j82L92l3J37K1k70K98j67k3p5N3L40k74o6
$$ 86 -29 -189 -136 -201 39 -66 150 117 -155 -337 55 22 159 180 -90 208 41 18 -57 -4 336 62 -4
5397dq7k24L68J28J0n6r6P5j30r8J46J82k99K18O9m29J40O8K61k46l3p8J34K0
$$ -4 -91 -315 53 181 191 135 39 114 -16 -114 32 214 -85 133 202 -227 -87 -19 242 -4 -37 -115 19 39
5421C9m8O1q5m2P0J05j46R6M5q2Q2m16J80J03J51J5l27L17l23K20O7k9l04K88
$$ 39 -9 52 -33 -75 -5 100 -46 50 95 13 95 -321 -141 -38 113 128 -199 118 -205 15 82 53 -251 37
5445C7p2j12J46J17l47O2L08j86j56J37L28k45rn0r4Q4n0M95k62K8m00J56J80
$$ 37 -35 -147 -1 116 -231 -169 139 -47 -203 -66 262 17 8 -42 -136 -52 -102 393 131 159 -241 -85 95
5468I5j81Q6J18j29J25j38J16j38J49Q6k64L93l38Qj13K45l06J75R9j93J91k89
$$ 95 -86 0 118 -11 114 -24 92 -46 103 189 -75 318 -20 -12 -125 120 -186 -11 88 -105 86 -203
5490b03L72j19o9j20P8q6K31l42J71m1k5K49j70K94n3p1j25p2J79l50L80J6j14
$$ -203 169 50 -19 -139 -61 -147 84 -258 -87 -128 -153 96 -74 220 167 96 -29 -101 78 -272 108 124 10
5513A0j06J44k12K20n6l1K38l73O8j86K86J61J1j78j18M94j93j67l16P7L38o2
$$ 10 -96 48 -164 56 0 -31 207 -166 -98 -284 2 163 174 -4 -122 372 179 12 -304 -227 111 49
5535D9LJ42l69L60r9j44L7Q9O2j97M77l86LQn6k04K23k86L51j51r7j38M08o1k67
$$ 49 52 194 -175 185 86 -58 -21 68 130 -67 410 24 27 35 -21 -225 -2 -288 63 -88 -185 -323 85 24 -243
5560b43M13j23j4J67j5k83J84J9J81j45r4n6K04m17J60J01J06l66J29M9K24k66
$$ -243 170 47 33 200 185 -98 86 105 286 141 47 -9 195 -222 -62 39 145 -221 -92 -43 181 -85
5582h5K75k28J31r3r4M11n31R0K44k94J3J04N2L3rJJ56O3k54K21k43pK58m5j87
$$ -85 190 -38 93 0 -94 317 -214 -124 120 -174 -161 -57 -5 28 19 20 176 239 -15 206 -37 -44 214 169 -18
5607a8K5j5J5QPK0j79J42k66L19j56K50l36K2MJ01j88J39K34l44M98r6q6k08J18
$$ -18 7 -8 7 15 22 42 -137 5 -261 58 -98 152 -184 -162 -158 -57 -245 -106 128 -216 282 186 100 -108 10
5632A0j74L27o31M20j03J13l0L4r6O8O1l69K10L27j09j99J91o5j07K76j78K00
$$ 10 -164 163 -468 -48 -151 -38 -68 -34 -130 -62 -1 -370 -160 167 58 -141 50 -15 -122 154 -24 176
5654A76k52m0J93j02J22j30K0J56m19J89K55j21J98j40k07o6L29j78J27n3M2P
$$ 176 -76 -116 77 -25 97 -33 -13 143 -276 -87 168 47 245 105 -102 -168 161 -17 110 57 99 106
5676A06M4KM2l52J01m2K02o2j15K57j72J14j32J97Ok88K94Q6l80O1R7K14j88J30
$$ 106 150 152 194 -158 -57 -99 103 41 -74 183 11 125 -7 190 196 -92 202 288 -92 -31 66 280 92 222
5700B22l45O9J90nj89j61j2K98Qk38L20oj83M5K53k39l08K19k12L86q0J76j82
$$ 222 -123 -54 136 131 -58 -219 -231 67 75 -163 157 151 -32 13 266 27 -281 -62 -274 112 32 208 26
5723B6O5k21r2o5L18r7k57K64k29L10J35j88L3O2J3j88K14%r7j02o3K61q0k44
$$ 26 91 -130 -222 -287 31 -66 -323 -59 -288 22 157 -31 2 64 77 -111 103 103 6 -96 -159 102 22 -222
5747b22L4O4L4K19l58L21K08l91K77q9j12J35j62rj13K7K97j59R6j02O7k23n5
$$ -222 -188 -124 -90 129 -229 92 300 -91 186 97 -15 120 -42 -51 -164 -137 160 1 97 -5 62 -161 -216
5770b16O2L43N3l81O7r4N2J90l31J22K51j83J60r6k22K77n9n9J72j13p1K46j07
$$ -216 -154 189 242 -139 -72 -166 -114 76 -255 -133 118 -65 95 -1 -223 54 -5 -64 108 -5 -76 170 63
5793F3k0K15n53K88J93l46j6j3K6J59K93l97l4J66J01o6j21j62K15K59j04j2o4
$$ 63 43 258 -295 -7 186 -160 -176 -189 -163 -4 289 -108 -142 24 125 59 -62 -224 -9 250 146 134 70
5816G0j1M2j47N2j10K52j85k90M48j14J82k91J51k30N4K2OM0j73Q9OK57k76J68
$$ 70 59 101 -46 6 -104 148 -37 -327 121 7 189 -102 49 -181 -127 -105 -99 -59 -232 -143 -137 120 -156 12
5840A2N0j1J38k04j2J82mj34K9j30k11L49k84K99N3j6k54J27j55J14L3NK50k47
$$ 12 62 51 189 -15 -27 155 151 17 46 -84 -295 54 -230 69 122 106 -148 -21 -176 -62 -29 -24 226 -21
5864b1l5L00k91J18j02J47k71J87k1j01J04k55J78KJ92l34J87m5J37j23j72K49
$$ -21 -56 244 -47 71 -31 116 -155 32 11 -90 14 -241 -63 -61 131 -203 -16 -61 76 -47 -219 30
5886C0j97K50k41k3K50J61o4j6m54K96j52J41j2j80L26k64R2K36j51p4K8k1L3
$$ 30 -167 83 -158 -181 69 230 166 150 -304 -8 -160 -19 -31 -211 115 -149 -57 179 28 -46 -18 -39 -6
5909fQj65J1K32L6k71L46j29Rn6J93l01J46L7j47K62k45K20qj04j12K36P9m06
$$ -6 2 -163 -152 80 116 -155 191 62 71 15 208 -93 53 90 -57 205 -40 180 172 68 -44 192 271 -135
5933a35L09k93J12J3K40k18j24O9m0l6Q0r5oK8j00J49L7J62l15J22m05M18K34
$$ -135 174 -119 -7 6 246 28 -96 -27 -67 -103 -23 -118 -124 -96 -196 -47 -10 152 -163 -41 -446 -28 206
5956B06j58r6J26l30K14n3Nj40K42M9n6j33P7J69j01k0j85K66k82K06J76N9j94
$$ 206 48 -48 78 -252 -38 -91 -86 -226 16 65 9 -124 -47 122 21 1 -184 82 -200 6 182 241 47
5979D7k7k36L96o2p1j1r4ok0Jk46N71p3j13j75J89l18L22nJ32k73LJ40k50K46
$$ 47 20 -216 180 118 47 36 -58 -64 -84 -83 -329 242 169 56 -119 70 -248 74 69 201 -72 -69 71 -179 67
6004F7oj58J96k7J13k47J34j13l5j59J07J75J69l68J70N4P2m4j51P2r8J50J2j33
$$ 67 61 -97 99 72 185 -62 72 -41 -76 -235 -128 47 216 -152 18 72 144 100 -51 21 -77 73 85 -48
6028d8J49j47J41j04o0J67j49j94K98L0J12l1j85K69j26j88K21l06K75k63o9J31
$$ -48 101 -46 95 -9 -69 98 -51 -245 53 83 195 164 -21 248 122 -66 155 -151 124 -139 -208 -77
6050g7j3O5J2k30M55j42p0n3L3K2m4j44R9n5Kk07K78J92pp5Q9j16K73o0m94K17
$$ -77 -90 -25 -13 -243 212 70 0 -53 -20 2 -42 -186 -87 -142 -140 -347 -69 123 116 41 130 14 287 227 -267 -50
6076e0J64k46M0rK82k32l28K36K20mO1j12K48q6j75K5K10l98K34o9ok1j32J56
$$ -50 114 -132 -92 -101 181 -51 -379 -143 77 73 134 22 270 184 9 34 244 -154 80 11 5 -16 -148 8
6100Ho0j0P6K64k44M3j55R6N2j6p9j75J30K83k36j8J92K65n05K42k54L76m22P1
$$ 8 -52 -62 14 278 34 77 -78 18 70 54 -25 -200 -70 213 -23 -41 151 416 -89 153 -101 275 -147 -76
6124g6J93J07l17J52j51n0K66K6j2mq1O7K02l32j82M06k21J59j97j24J37J0J05
$$ -76 117 224 -93 59 -92 -142 124 150 138 134 53 120 322 -10 -192 214 -7 152 -45 -169 -32 -22 83
6147H3j67q9n8M34k54M3J46J12j68k0k9p4J26q6PR0j98j4jK9L35k31m8k3J58R2
$$ 83 -84 -173 -231 203 -51 -8 138 250 82 62 33 -41 85 -1 6 96 -102 -116 -117 -88 247 16 -32 -55 103 195
6173A95k97r4J39j96k4L61o5n7j52J9J33k04L64l00K02K09k61J1k96K90L86l51
$$ 195 -102 -196 -57 -253 -277 84 19 -38 -190 -171 -38 -242 122 -178 24 233 -28 -17 -313 -23 363 12
6195A2k0J9k38j3J96j47M9J93J48j44j10J7J66k38J32J96m80K91r5m8J95j76Q
$$ 12 -8 11 -227 -240 -44 -191 -142 51 199 55 -55 -38 128 -110 22 218 -262 29 -66 -114 81 -95 -87
$$ [...]
8191c5
##END NTUPLES=NMR FID
##END=
