##TITLE=1H_SR152_oil
 DMSO-d6
 8 sc, 
 21.2.2023
##JCAMPDX= 6.0         $$ Bruker NMR JCAMP-DX V2.0
##DATA TYPE= NMR FID
##DATA CLASS= NTUPLES
##ORIGIN= UXNMR, Bruker Analytische Messtechnik GmbH
##OWNER= root
$$ XWIN-NMR		Version 3.5
$$ Tue Feb 21 17:42:38 2023 Russian Standard Time (UT+4h)  she@DPX200
##.OBSERVE FREQUENCY= 200.13135
##.OBSERVE NUCLEUS= ^1H
##.DELAY= (6, 6)
##.ACQUISITION MODE= SIMULTANEOUS
##.ACQUISITION SCHEME= undefined
##.AVERAGES= 64
##.DIGITISER RES= 18
##SPECTROMETER/DATA SYSTEM= spect
##.PULSE SEQUENCE= zg30
##.SOLVENT NAME= DMSO
##.SHIFT REFERENCE= (INTERNAL, DMSO, 0, 15.7039)
##AUDIT TRAIL= $$ (NUMBER, WHEN, WHO, WHERE, WHAT)
$$ ##TITLE= Audit trail, XWIN-NMR		Version 3.5
$$ ##JCAMPDX= 5.01
$$ ##ORIGIN= Bruker BioSpin GmbH
$$ ##OWNER= she
$$ F:/spectra/data/she/nmr/H-F/1/audita.txt
$$ ##AUDIT TRAIL=  $$ (NUMBER, WHEN, WHO, WHERE, WHAT)
(   1,<2023-02-21 17:41:12.26 +0400>,<she>,<DPX200>,
      <continue with go, POWCHK disabled, PULCHK disabled
       configuration hash MD5:
       00 E9 B6 7A A2 85 ED C7 34 08 36 98 17 FE 4E 26
       data hash MD5: 16K
       BB A1 F9 93 9D B2 3F DA 7F 28 9C C7 21 5A D6 E3>)
$$ ##END=
$$ 
$$ hash MD5
$$ BC 6C 45 B3 95 D7 93 D7 62 C7 02 EF 86 32 00 20
##$RELAX= 
##$RELAX= 
##$RELAX= 
##$RELAX= 
##$RELAX= 
##$RELAX= 
$$ Bruker specific parameters
$$ --------------------------
##$DU= <F:/spectra>
##$EXPNO= 1
##$NAME= <H-F>
##$PROCNO= 1
##$TYPE= <nmr>
##$USER= <she>
##$AMP= (0..31)
100 100 100 100 100 100 100 100 100 100 100 100 100 100 100 100 100 100 
100 100 100 100 100 100 100 100 100 100 100 100 100 100 
##$AQSEQ= 0
##$AQ_mod= 1
##$AUNM= <au_zg>
##$AUTOPOS= <>
##$BF1= 200.13
##$BF2= 200.13
##$BF3= 200.13
##$BF4= 200.13
##$BF5= 200.13
##$BF6= 200.13
##$BF7= 200.13
##$BF8= 200.13
##$BYTORDA= 1
##$CFDGTYP= 0
##$CFRGTYP= 5
##$CHEMSTR= <none>
##$CNST= (0..31)
1 1 145 1 1 1 1 1 1 1 1 1 1 1 1 1 1 1 1 1 1 1 1 1 1 1 1 1 1 1 1 1 
##$CPDPRG= <>
##$CPDPRG1= <>
##$CPDPRG2= <>
##$CPDPRG3= <>
##$CPDPRG4= <mlev>
##$CPDPRG5= <mlev>
##$CPDPRG6= <mlev>
##$CPDPRG7= <mlev>
##$CPDPRG8= <mlev>
##$CPDPRGB= <>
##$CPDPRGT= <>
##$D= (0..31)
0 1.2 0 0 0 0 0 0 0 0.06 0 0.03 0 0 0 0 0.0002 0 0 0 0 0 0 0 0 0 0 0 0 
0 0 0 
##$DATE= 1676986616
##$DBL= (0..7)
120 120 120 120 120 120 120 120 
##$DBP= (0..7)
150 150 150 150 150 150 150 150 
##$DBP07= 0
##$DBPNAM0= <>
##$DBPNAM1= <>
##$DBPNAM2= <>
##$DBPNAM3= <>
##$DBPNAM4= <>
##$DBPNAM5= <>
##$DBPNAM6= <>
##$DBPNAM7= <>
##$DBPOAL= (0..7)
0.5 0.5 0.5 0.5 0.5 0.5 0.5 0.5 
##$DBPOFFS= (0..7)
0 0 0 0 0 0 0 0 
##$DE= 6
##$DECBNUC= <off>
##$DECIM= 32
##$DECNUC= <off>
##$DECSTAT= 4
##$DIGMOD= 1
##$DIGTYP= 9
##$DL= (0..7)
0 120 120 120 120 120 120 120 
##$DP= (0..7)
150 150 150 150 150 150 150 150 
##$DP07= 0
##$DPNAME0= <>
##$DPNAME1= <>
##$DPNAME2= <>
##$DPNAME3= <>
##$DPNAME4= <>
##$DPNAME5= <>
##$DPNAME6= <>
##$DPNAME7= <>
##$DPOAL= (0..7)
0.5 0.5 0.5 0.5 0.5 0.5 0.5 0.5 
##$DPOFFS= (0..7)
0 0 0 0 0 0 0 0 
##$DQDMODE= 0
##$DR= 18
##$DS= 0
##$DSLIST= <SSSSSSSSSSSSSSS>
$$ [...]
##$SUBNAM2= <"">
##$SUBNAM3= <"">
##$SUBNAM4= <"">
##$SUBNAM5= <"">
##$SUBNAM6= <"">
##$SUBNAM7= <"">
##$SUBNAM8= <"">
##$SUBNAM9= <"">
##$SW= 18.05172834244
##$SWIBOX= (0..15)
0 0 2 0 0 0 0 0 0 0 0 0 0 0 0 0 
##$SW_h= 3612.71676300578
##$TD= 16384
##$TD0= 1
##$TE= 0
##$TE2= 300
##$TE3= 300
##$TEG= 300
##$TL= (0..7)
0 120 120 120 120 120 120 120 
##$TP= (0..7)
150 150 150 150 150 150 150 150 
##$TP07= 0
##$TPNAME0= <>
##$TPNAME1= <>
##$TPNAME2= <>
##$TPNAME3= <>
##$TPNAME4= <>
##$TPNAME5= <>
##$TPNAME6= <>
##$TPNAME7= <>
##$TPOAL= (0..7)
0.5 0.5 0.5 0.5 0.5 0.5 0.5 0.5 
##$TPOFFS= (0..7)
0 0 0 0 0 0 0 0 
##$TUNHIN= 0
##$TUNHOUT= 0
##$TUNXOUT= 0
##$USERA1= <user>
##$USERA2= <user>
##$USERA3= <user>
##$USERA4= <user>
##$USERA5= <user>
##$V9= 5
##$VALIST= <valist>
##$VCLIST= <CCCCCCCCCCCCCCC>
##$VD= 0
##$VDLIST= <DDDDDDDDDDDDDDD>
##$VPLIST= <PPPPPPPPPPPPPPP>
##$VTLIST= <TTTTTTTTTTTTTTT>
##$WBST= 1024
##$WBSW= 4
##$XGAIN= (0..3)
0 0 0 0 
##$XL= 0
##$YL= 0
##$YMAX_a= 146503
##$YMIN_a= -80931
##$ZGOPTNS= <>
##$ZL1= 120
##$ZL2= 120
##$ZL3= 120
##$ZL4= 120
##$ABSF1= 10
##$ABSF2= 0
##$ABSG= 5
##$ABSL= 3
##$ALPHA= 0
##$AQORDER= 0
##$ASSFAC= 0
##$ASSFACI= 0
##$ASSFACX= 0
##$ASSWID= 0
##$AUNMP= <proc_1d>
##$AZFE= 0.1
##$AZFW= 0.1
##$BCFW= 1
##$BC_mod= 2
##$BYTORDP= 1
##$COROFFS= 0
##$CY= 11.3945322036743
##$DATMOD= 1
##$DC= 2
##$DFILT= <>
##$DTYPP= 0
##$F1P= 2.36226072786647
##$F2P= -0.459571619588291
##$FCOR= 0.5
##$FTSIZE= 0
##$FT_mod= 4
##$GAMMA= 1
##$GB= 0.15
##$INTBC= 1
##$INTSCL= 1
##$ISEN= 128
##$LB= 0.24
##$LEV0= 0
##$LPBIN= 0
##$MAXI= 10000
##$MC2= 0
##$MEAN= 0
##$ME_mod= 0
##$MI= 1.114404
##$NCOEF= 0
##$NC_proc= 0
##$NLEV= 6
##$NOISF1= 3.799351
##$NOISF2= 2.8
##$NSP= 1
##$NTH_PI= 0
##$NZP= 0
##$OFFSET= 15.70392
##$PC= 1
##$PHC0= -19020.17
##$PHC1= 14.00078
##$PH_mod= 1
##$PKNL= yes
##$PPARMOD= 0
##$PSCAL= 0
##$PSIGN= 0
##$REVERSE= no
##$SF= 200.130013532006
##$SI= 16384
##$SIGF1= 3
##$SIGF2= 2
##$SINO= 400
##$SIOLD= 16384
##$SREGLST= <1H.CDCl3>
##$SSB= 0
##$STSI= 0
##$STSR= 0
##$SW_p= 3612.71676300578
##$SYMM= 0
##$S_DEV= 0
##$TDeff= 0
##$TDoff= 0
##$TI= <>
##$TILT= no
##$TM1= 0
##$TM2= 0
##$TOPLEV= 0
##$USERP1= <user>
##$USERP2= <user>
##$USERP3= <user>
##$USERP4= <user>
##$USERP5= <user>
##$WDW= 1
##$XDIM= 8192
##$YMAX_p= 0
##$YMIN_p= 0
$$ End of Bruker specific parameters
$$ ---------------------------------
##NTUPLES= NMR FID
##VAR_NAME=  TIME,          FID/REAL,        FID/IMAG
##SYMBOL=    X,             R,               I
##VAR_TYPE=  INDEPENDENT,   DEPENDENT,       DEPENDENT
##VAR_FORM=  AFFN,          ASDF,            ASDF
##VAR_DIM=   8192,          8192,            8192
##UNITS=     SECONDS,       ARBITRARY UNITS, ARBITRARY UNITS
##FACTOR=    0.0002768,     1,               1
##FIRST=     0,             0,               0
##LAST=      2.2672688,     0,               0
##MIN=       0,             -80931,          0
##MAX=       2.2672688,     146503,          0
$$ Real data points
##PAGE= N=1
##DATA TABLE= (X++(R..R)), XYDATA
$$ [...]
137C75q62M40J036k38n35M3j09q2M3j78j09K39Q8m20j5L04J9k29P3k5L7J55k4
160B6n0J75jm9j64J40j3j2l8l7M2n1P9m8O6Pm6j01k2O7M5K2l5%J42j40j2O4m3
189A3P6j08N6L5l6M1r2O7m9k4J8K6k5l6q1N6J2K9J6J0mp4R6k6M9oj00P9qj9P2
220F3n0j1k9O0oM5n1P%oJO4r6O9m2j9n7L1L5n5J5M0j1P1q1Rm6J30j31J00L0n7
252B2Qm4lL5j01L0k3Q1l6P0o6rM9l8N3k1L3m4O2ol9M9k6K1p6J9Nk6M3J3o5K0m
285a4K9l9k1J02o0J0K0j6m8N5l4pO3kK3o8jN0Qq3k5L5mJ2j7R4p4Q9q1p2P8L6k7
318A1pj8K2L0n1K4K0K5p1m5N9j8M3r8K5O3m2JM4m7k8J12k1m9N3mj0np0k5J03n8
350c2k4M0J9N8jp0J0K0K6j02J27m4M1m9j0o3OK2n5Q2Jj6O7o7nj7K9J0k5J8oJ28
$$ plain form
137 375 -487 -47 989 751 216 259 150 68 111 -67 -176 63 151 -269 -284 20 39 -190 -117 -142 -105 50 26
160 26 -24 151 150 101 -63 77 64 52 14 -23 19 -32 47 -1 65 72 26 -75 -97 -30 15 37 2 2 144 4 -8 56 13
189 13 89 -19 37 72 36 77 -15 52 3 -21 -3 23 -2 -38 -119 -63 -51 -22 -6 4 0 -74 22 -4 45 39 -61 18 10 -9 63
220 63 13 2 -27 33 27 72 21 28 28 22 23 87 -9 60 18 -1 -58 -27 8 -47 -32 8 -3 68 -13 -4 -50 80 -51 49 79 22
252 22 30 -14 -17 18 -83 -53 -76 5 -31 39 -27 -36 13 -25 28 7 40 -4 58 52 13 62 36 57 -19 0 5 -21 22 35 -30 -10 -14
285 -14 15 -24 -45 57 -3 7 27 11 -37 18 -16 -23 40 38 61 -7 -8 42 50 -33 -58 -23 -27 -15 -32 62 -12 77 -4 -76 2 38 11
318 11 4 -14 8 38 -13 11 31 56 -15 -60 -1 -19 24 -74 -49 14 -28 -27 17 -30 -58 54 33 -16 37 33 23 18 -52 -77 26 -32
350 -32 -56 -16 3 61 60 -10 0 20 46 -56 71 27 68 19 9 -54 -48 -26 -81 1 2 -14 53 -14 -19 -36 -7 3 -22 -4 -10 118
382A18k18P3K4K6n4Q9k6L6n1n0L4m8Q0PM8n0M2q7M7K5q1M3m4O0Jp0P9q7M8o9Q0
413B5J4n3k4Kp5J72p3r1R3L8m9%j3M2Np4J18j2n0m%P8k4q8Q6qj8M5m6k7J06j3
445H2m0n8j3M6RnjJ7j03P8m8RR4j35L4M2k7J2j0m1N8k7M7L6o8KN0m9kQ9o0L2q1
478c1N7N2j8j25O4J4L1k1n8N7K0m8J7J2Kj08M3L5j9P3n4j4M1l2n6K8N5M3%l5m1
509a6K4L7p5R5m2J3l9K1N8j08N6K9p2m4J38o6J1MN1j9r2R0q4J5q2J17n3j3rM1
539a4nKJj9nK4J4p4OL0O4m4P6q4oO0K1m3N9o7qj1N3r4J20L3j24M3J6L1k3Ol6k5
573b3P8l0P8j27J41l8r0QpL3m4l5M4j4N2K2j89J06O5q1L5j4KM8K9j8l2k7R4q3
603a7K0L2m1l6O8j0k1N5k6K4j08Q2n2N4N0m4j02P4j1m6J00pr1L0J6K5k4k6o3M3
$$ plain form
382 118 -100 -27 -3 23 -31 58 32 68 17 -33 1 -47 33 40 88 38 80 -7 40 65 -16 27 -17 43 44 -26 53 -34 14 -55 25
413 25 39 -14 -38 -36 -111 61 -12 -103 -10 28 -21 -21 -34 8 13 -61 57 45 -5 -9 -9 69 45 -43 43 35 17 62 16 -11 95 82
445 82 42 -16 -29 17 26 21 20 37 -66 12 -36 -27 67 -68 -34 8 -19 -7 -17 -58 0 -27 20 56 -12 -10 40 -9 -11 78 18 50 -31
478 -31 26 78 60 -65 -1 13 44 23 -35 22 42 -6 11 23 25 -83 -40 -5 -24 49 -5 -19 22 -10 -66 -38 17 60 60 25 -16
509 -16 8 45 -30 65 23 36 -3 18 76 -32 24 53 -19 -63 75 9 20 24 75 56 -36 54 -30 -15 -97 20 -33 -46 -55 -14
539 -14 -19 -17 -16 -35 -40 -16 -2 -76 -70 -40 24 -20 56 -28 -34 26 47 4 63 -4 -12 -23 30 -64 56 89 -35 8 24 55 32 38 2 -23
573 -23 55 25 103 -24 117 79 -11 -3 -10 23 -21 -56 -12 -26 26 48 -141 -35 30 -51 -16 -30 -28 20 49 31 -1 -28 66 -17
603 -17 3 35 -6 -42 26 16 -5 50 24 48 -60 22 -30 24 74 30 -72 2 -9 -55 45 38 -53 -23 -7 18 -6 -32 -95 -52
633e2Q0j8K6j32R3L5m1o1R4N8m8m1K8o6M8j6L5j8O6n6K1L8k6q8J00j5l8j0j0L5
663B1qJ1j6M2o7m3nQ3mn9j4P8j69M3J34k9oN4j28J13p3O2O%j0n2N6n8k6Q3p8M0
695a9j7N8j2ml6P1P8j32qQL3j1j22N3L4j2M0m9K3J5m6O1k1o0L3k2J02m8O8p0O6
726E4p0MP2o6N2l1pKnp1R8o1L4K1J6N4p0nO5n3n4LJ1Pj9K6m7N8L1o7j7O9ln4L6
761A3J1l9P7k3m6J8k4l4P7L9J2p6K9M0k1p7R9j9l1k3N2l5%n0RP0m3l1K6m2L2K8
793A8l7J6p1N4QK1Pn7k4J02J3o6M5k2p7R1l7M0j4l5j4j4J02Oml5k2R1l9O7p5J5
825E3J7o9N9ro9RJ3J3K4j21M0K8Q5mn3m0rO8n5L8r1M2J2J25j00k1kO2m7M2l7P3
857G6l9k7O8l6j1k8K2l6L8kPm6Q5o2m4lO0Nk9O5q0J0nJ0j4J9n2P5k0PL7l6j8K8
$$ plain form
633 -52 28 10 36 -96 -3 32 -9 -70 24 82 34 -7 21 -45 3 -13 22 4 70 14 35 73 47 -41 59 44 6 -4 -14 21
663 21 13 24 8 50 -17 -60 -65 18 14 -45 -59 19 -150 -107 27 -2 -8 46 -82 31 -42 20 26 26 16 -36 20 -38 -64 19 -59 -19
695 -19 -36 22 10 6 -30 41 119 -13 -21 -13 20 9 -113 -60 -26 -38 2 -47 -24 -9 -55 6 -15 -75 -42 -64 38 -10 58 -12 54
726 54 -16 -12 60 -6 46 15 8 10 5 -66 32 -29 5 26 42 96 26 21 86 33 -21 -18 -7 0 -19 7 -40 18 49 -18 -35 34 31 -23 13
761 13 24 -15 62 39 -7 11 -13 -47 30 69 81 5 34 74 53 -24 75 56 25 2 54 19 19 -31 -22 48 5 -26 0 -42 -10 18
793 18 -19 -3 -74 -20 -12 9 16 -41 -65 37 50 -16 29 7 -70 21 -16 24 10 -25 -39 -53 49 55 51 16 -6 85 46 113 38 53
825 53 70 1 60 51 -18 -9 4 17 41 -80 -40 -12 73 69 16 -24 -33 35 -20 18 -73 -31 -19 106 6 -15 -17 45 -2 40 3 76
857 76 37 10 78 42 31 3 25 -11 27 25 32 -14 71 9 -35 -38 22 27 -2 63 -17 -7 -12 -2 -16 3 -49 26 6 13 50 14 -4 24
891B4m7L5M5l1M9j07J7P2q3P0k0o6P5M4j6o7O0pK7o7N2j3m0oL0o7M4J5m3M8o3
922c6J5k2JJ6jm6P9rr5O9Q3j7Jl0K9j1n7J1K2P8o2K4L0p5M5k6J0L0l5N1q6J07
954I3r3K5r2J15o7k3R0p1Lo1J19m3m2R2j07RO4k8j3J7m7J21kp0K2l7J36n3N6j26
984a3Q3o3P7m2p2J20k0k8J9L9r8M4J3%n4N6r9J23j33QK8l7L7l7QM8Qpo3N0n4Q1
1016B2N6r7M1J9m5rL0nrM5n8Q1k8nn4P4m9P0l6n5P0p6L9K5p5j7j8Q8lj5k8M0p2
1049e4L0N6n3j7P5p5P2k4nm6L1LL2l1N3n2kk4Q1Np2R7q6Q4J6r1Q5j34K5Q3q1N7
1081C8KN3j06p2R6%mq1O2m2K6N1n1L9j9l0nL8k8J0j7L2O2q5K3N5q5M7Q7j1j26
1112d1J4L0M5l1N5q4n6OJ74j49J13j06O3pm7j9l8J2J9j6K9j6J2o2M8L9opj3J00
$$ plain form
891 24 -23 12 57 26 75 -32 -15 57 -26 44 24 -42 33 77 61 -6 54 47 74 7 59 46 6 0 30 -37 7 22 -21 27 -36
922 -36 -21 -43 -42 -26 -27 -73 6 -3 -98 -29 54 37 38 8 37 26 -31 -20 2 80 18 42 72 -3 42 16 26 56 21 72 -14 93
954 93 0 25 -67 48 -19 -42 48 -23 -20 -81 38 -5 -47 45 -62 -53 11 -17 -30 -13 -60 61 59 -11 11 -26 110 57 113 -13
984 -13 70 7 84 42 -30 90 70 42 61 100 2 46 59 59 5 61 -38 85 -48 -40 -12 -49 -12 -49 -41 7 15 8 -55 -5 -59 22
1016 22 78 -19 22 41 -4 -13 17 12 3 48 -10 71 43 38 -16 58 9 79 43 -12 58 -18 21 46 -29 -46 -64 24 21 6 -22 18 -54
1049 -54 -24 32 -21 -38 37 -38 34 10 5 -41 -10 -7 25 -6 47 -5 -7 -31 50 55 -17 80 -6 78 94 3 88 -46 -21 62 -19 38
1081 38 40 93 -13 -85 11 11 7 -74 -12 -54 -28 23 -28 11 -8 -38 -43 -5 -33 -23 -40 -8 54 -31 -8 47 -38 9 96 85 -41
1112 -41 -27 3 48 17 72 -12 -68 -62 112 -37 76 -30 33 26 -21 -40 -78 -66 -47 -63 -34 -50 -38 -100 -52 -13 -19 -26 -39 61
1142F1j10P7k3K5K4jp4j0KNO1Q9j04m1R7J8p6n0P7q6l0M2P5J2o1M6m9k5L2k7l9
1173f3L6J3oj4KL9j31Q4l3N1j3k9L9N7j17J16k3p8R6m1o8J55o0N1q1JM9m0L5n9
1203c2OO1p6M8L7o4R1j13N4m4N1j4Jm8J9L4L2p1Kp7R4pk2K1K5k7k6Q0p3J0M7j0
1235Ik1m4J36l8J4p1R8q6NL4l0JqQ6m0n5J41j89N6m3L1m0N4O3m3K7p4N2j34O1
1265d8M2J8N8k8k7J8r8O4k4J17r5L4J3K0j30J14mK8r4L7k7M3M1l1k9M7m4L4q6
1294c7Km9J00k0l2K8N4m9Qn4Rp6N2N0m2Q3k4n6M0l1jP0o6P1J8k6N0o4q7J27o3
1325a5no3J17j5q1J44q8N0N9j09%M8k4n0P3rl0J0r7R5n5M9M5L0r4p9J13Om7m6
1355f8jL8j8L4M6K6q0N4N5j2k1K5m8J5kk3J6j4J1m4O0q9N8o3P6j6L7j34M9k8p
$$ plain form
1142 61 -49 28 5 30 54 53 -21 -31 -29 -24 37 126 22 -19 78 96 20 -30 47 -39 -69 -27 48 60 -1 45 -4 -29 3 -24 -63
1173 -63 -27 -14 -20 -34 -32 7 -124 -40 -73 -22 -35 -64 -25 32 -85 31 8 -70 26 -15 -83 72 12 63 -18 -17 32 -8 27 -32
1203 -32 -26 35 -41 7 44 -20 71 -42 12 -32 19 5 6 -42 -23 11 43 -28 -26 -103 -9 -16 -38 -17 8 -19 -45 35 -38 -28 19 9
1235 9 -12 -56 80 42 56 -15 83 -3 2 36 6 7 -1 85 45 -10 131 -58 -2 -45 -14 -54 0 63 20 47 -27 25 -109 -48
1265 -48 -6 12 70 42 15 33 -65 -1 -25 92 -3 31 44 64 -66 48 44 72 -22 15 -12 31 72 41 12 59 15 49 -37
1294 -37 -35 -84 16 -4 -36 -8 46 -3 5 -49 -40 -116 -64 -14 -56 27 3 -53 -13 -44 -45 25 -41 30 48 22 72 8 -79 48 -15
1325 -15 -20 -83 34 19 -62 82 -6 44 103 -6 -6 42 18 -32 41 32 2 12 -85 10 -45 4 49 79 -15 -94 19 25 -22 -68
1355 -68 -69 -31 -49 -15 31 57 -23 31 86 74 53 78 30 45 43 20 36 22 33 -11 49 -40 18 -45 31 15 52 -82 -33 -61 -68
1386f8R6L4r2L4J6j08R6q0O6p1J27p9M6k7m0N6L7Pl5J9j8pL8n0L0M9j7Rp5N0p
1417C6m6K7P2po9n2J20j41N4J4m3J4o1J48j20K5m0O2m1NL7n4Q3o1Q6j7n1J14p0
1446B4j1K4o1L1JO0j10J31m9j8L5o8k0Q1l8l1K5O5r4J2J4m1K7p3K9J5nM5q4L5
1476d9oQ9n9K1L2j7J4%kj10O2O3n8K8n9J36m4q0N7P7q8K6qJ8m1K2L9m8K4j9L7
1507E7p8OlN2m6k3l0k3P3j01O4J8K0lj6J3j4L5Jjj5k1M5j0O8r6%M2mK6k0rj3l8
1541d4O4l2R4r2l7O5j9k5M8J2p6L0K5k8L1n9kP7l1o8M4O1p6pQ4L1q5p1J07K1j8
1572B4k6J6k3L3j6J9n5K0P2PL6q4k6nj9J03j7j00O0L6j9o3L7j1Kk7N6pkK9o3o
1604a9L8p9N2j8k3L4O7q1O5k1j9P4kM1j5mj3n6r0J00M6K6k4q0J3R7l9j6r8J39
$$ plain form
1386 -68 28 62 -30 4 20 -88 8 -72 -6 -77 50 -29 17 -10 -50 6 43 50 15 34 16 9 47 -3 27 76 59 68 -7 43 36
1417 36 -10 17 89 82 13 -39 81 -60 -6 8 -35 -21 -82 66 -54 -29 -69 -7 -48 -43 -6 -60 23 -38 48 31 -20 94 24
1446 24 13 37 -24 7 8 68 -42 89 40 22 57 -11 -31 50 12 -19 6 71 -23 -11 3 -38 -11 -84 -55 -40 -45 0 -84 -49
1476 -49 -55 34 -25 -4 28 11 25 25 23 -87 -25 38 -20 8 -51 85 41 -39 18 95 7 33 25 43 2 24 63 15 39 20 57
1507 57 -21 -15 -18 34 -12 -35 -65 -88 -15 -116 -52 -34 -14 -17 -33 -20 -34 1 2 1 -14 -35 10 0 68 -28 -28 14 10 36 16 7 -6 -44
1541 -44 20 -12 82 -10 -47 18 -1 -26 22 34 -42 -12 13 -15 16 -43 -45 32 1 -67 -23 38 -38 -45 39 70 -15 -86 21 42 24
1572 24 -2 14 -9 24 8 27 -28 -8 64 71 107 23 -3 -8 -27 76 59 -41 19 55 36 -27 10 -1 1 -26 30 23 21 50 -13 -19
1604 -19 19 -60 -8 -26 -49 -15 52 -29 36 15 -4 70 68 109 94 90 77 21 -69 31 77 103 79 -1 12 109 70 54 -44 95
1634I5p0n5L5q2O4NL6Qo5pLJ01j22m2P4P4N3j31P5o1k1Q5k4Q0q2K6Ok9k6k4J0
1665a1Q0J5q7L3k4lOn8J62j14j3N5Mo4K3K3o8oL7J1j5J8r8J23lJ1k9Jj0LN0q9
1697c7qO9M5K7j39N5J03j51J17p3k6N0Ool3L3l3j6O3p5J7L7o7O4j6j6pJK1p8N6
1728a7R7j31L9J4lQ6j26P4J7m2p4R2L5j13J46p7lR7q1l5P7m2P4j18mK2L9j3KM3
1758G5l1M0k5m9po0J02j49J31j36P6k2N9J2k6l3R5l8J3l4N3J9p0K0j6mj8L8K5
1787D0m4J8L6J0O7j42K5l1P1r1K2J7OKL0K3o3K1q5j1K6j7J6j3O8j11J12o2kO7
1817EJ1%l4oK9j1j9Q6r3QKO6%J4j5o4q0J18j3J5K4o8J7pL6l7lN3J6o5k5PpM6L0
1852C6K6j44J05j1o0p0J26Q6r8p0N3J1J4K5m0M6k6L1l8J7j3K3qM9m4Rk5J7J2L1
$$ plain form
1634 95 25 -30 5 -77 -13 -8 28 36 -29 -36 -33 68 -54 -96 -22 52 105 -26 49 -12 -33 52 28 108 26 52 58 29 3 -21 -11
1665 -11 69 84 -3 30 6 3 9 -49 113 -1 -14 41 45 -19 4 27 -41 -47 -10 1 -14 4 -94 29 26 37 8 9 -1 2 52 -37
1697 -37 -45 24 69 96 -43 12 115 -36 81 8 -18 32 38 32 -1 32 -1 -17 46 -29 -12 25 -42 22 6 -10 -17 -16 5 -73 -17
1728 -17 80 -51 -12 2 -1 85 -41 33 50 8 -66 26 61 -52 94 17 14 111 30 -5 72 30 104 -14 -18 4 43 30 32 75
1758 75 44 84 59 10 3 -57 45 -104 27 -109 -33 -55 4 16 -10 -43 52 14 27 -7 46 65 -5 15 -1 -5 -23 15 40
1787 40 -4 14 50 60 127 -15 10 -21 50 -41 -19 -2 4 6 36 59 -4 17 -68 -79 -53 -70 -54 -67 1 -110 2 -60 -62 5
1817 5 16 16 -18 -24 5 -6 -25 61 -32 -24 -22 44 44 58 43 -21 -101 17 4 19 43 -25 -8 -15 21 -16 -19 34 50 -15 -40 -33 -40 6 36
1852 36 62 -82 23 12 -48 -118 8 94 -4 -74 -21 -10 4 29 -11 35 9 40 2 19 6 29 21 70 26 35 10 27 39 70
1882G0q5K8K9l7K6%k9K0k9j4k2J9L2j6o4M3L0rpqj0L1O2o5N3m4j2R2j68J11N2
1913G9j42J37j3M9r0MM0J4q6J4k8l1R4N1j02k7N5J5j3j2o1K7K4j1L3n9O2J9p0
1942b8k3O5n0L6oQn5M3J12j10N0M2j22K3k0R5j3N3q2j1N5l2j8J33j10l2O9j07
1970c5P1o2L3l6R6j42QQ9j2jRJ0k5j3L2o6K3j2K4jK0J18j40L8O0j07K1M0LJ2p6
2001b1RJ7k1O9L0o3P0l2%o6L1J2n9M6n9J0K3m2J7n7N2m8R8p3L9j7P3o6N1m3L3
2032A3N8n0L4m4J0j3K6m3J05K2m6n9J04l9l2m1M2jk4m9O8Ol9n3N5k4O1q7P0k4
2062FJ5L1q1p7J12k2j26J08nP0Kjr4R4M3q5K7P1k4rl6M6L9o0J1lJj03M5K1j9P7
2094G4q6j4Q8p0J3j02O3P8l4Mp4M1R7j01J2O3j4l2M3K1q4O2Ln1M9n0J0o4R2N2
$$ plain form
1882 70 -15 13 42 5 31 31 2 22 -7 -21 -43 -24 8 -8 -72 -29 1 -8 -15 -23 -33 -2 60 -5 48 4 -8 84 -84 27 79
1913 79 -63 74 61 110 20 24 64 78 -8 6 -22 -53 41 92 -10 -37 18 33 20 8 -53 -26 -2 -13 20 -39 23 42 -28
1942 -28 -51 14 -36 0 -6 2 -53 -10 102 -8 42 84 -38 -15 -35 60 47 100 18 7 62 30 12 145 35 3 72 -35
1970 -35 36 -26 7 -29 67 -75 -67 22 10 9 18 28 3 -10 22 -44 -21 -33 -9 -10 10 128 -12 26 86 -21 0 40 43 55 -21
2001 -21 -12 5 -16 53 83 20 90 58 58 -8 23 35 -24 22 -37 -27 -4 -46 -29 -86 -34 -82 16 -57 -18 -35 38 -28 23 -20 13
2032 13 71 21 55 11 21 8 34 -9 96 118 72 13 117 78 46 5 47 46 22 -27 41 47 8 -45 10 -14 47 -40 30 6
2062 6 21 52 -29 -106 6 -16 -142 -34 -39 31 33 32 -62 32 75 -10 17 88 64 55 19 65 104 44 55 52 53 -50 -5 16 -3 74
2094 74 -12 -26 62 -8 5 -97 -34 44 10 14 -60 -19 78 -23 -11 52 38 6 49 70 -14 48 51 0 49 -1 9 -55 37 89
2124H9p9L3k5K5o2M4K5Kl6p4P2ok9N3j2k8M1%L4n8Jn9k7M5J4%om4L4L5m7K4O6
2157D5p7l1J8M3p3N9k6L7QN1nj1P6j07L7jl3j4R6J6o5j6M9K3m0r1J01q5J0jpo6
2189h0M5O3j41J06k3K9oj4L1K0J3m9pJ6Lj5M9O8r6L7mK0L2n6M0m8mM3o4J1K9N
2221E3J1l9jM1j24J1J08k1o9Q4p0J1k3p0K8M1L2k6m4j2P6K6l6k1M4L2n5LR2r6
2251a4J2O5l8nk2J25Rj00N7q6NK7ok4J7J4j10P1L3M7q1Ol1N3pJ1q6P5l1l4P1p
2283A6n1N9J3l0K1L2n8qP7n0O0M5o0LN3j31P2n8J36j39l5K2K0O7r5o1J04l7l1
2312d4O9J9Lj38M1N5k9l2O8j2k2M1o7N4j5l1J08j05J13j10L4O1o8K7l0K0K9k2
2340A7M3p3M7L0oj4j1Nq4K1J1K3r7J04n9J7N1j02M3L5rj24J04O5n9l5L1K4rL3
$$ plain form
2124 89 10 43 18 43 -19 25 50 52 16 -58 14 8 -21 32 20 -8 33 33 67 9 10 -49 -76 -31 -17 -17 -23 -67 -33 2 -45 -21 45
2157 45 -32 -63 -45 -2 -75 -16 -42 -5 3 54 49 38 114 7 44 43 10 -4 92 108 43 27 76 99 59 -32 69 -16 -6 -7 -14 -80
2189 -80 -35 28 -113 -7 -30 -1 -7 -21 10 30 43 -6 -13 3 6 -9 40 108 12 49 45 65 97 41 81 33 29 72 8 19 48 53
2221 53 64 25 24 65 -59 -48 60 39 -30 54 -16 -5 -28 -98 -70 -29 3 -23 -67 -79 -3 23 -13 -34 10 42 -13 -10 82 -14
2251 -14 -2 63 25 20 -2 123 132 32 89 3 8 35 29 5 22 36 -74 -3 30 77 -4 2 -29 24 17 28 -58 17 -14 -48 23 16
2283 16 -35 24 37 7 28 60 2 -6 71 21 81 126 66 69 122 -9 63 5 141 2 -33 -11 9 76 -19 -80 24 -13 -44
2312 -44 25 44 47 -91 -50 5 -24 -56 12 0 -22 19 -48 6 -9 -40 68 -37 76 -34 0 61 -7 20 -10 10 39 17
2340 17 60 -13 34 64 58 44 33 38 -46 -25 -14 9 -88 16 -43 -26 25 -77 -34 1 -8 -132 -28 37 -22 -57 -26 -2 -11 22
2370B2j13K1J44q1P9rl2k3NJ5J8P9p0o9LMM7p9k3J12m0qm6PJ8n1L5O1o7O0q0L7
2402b4L3ok1N3k4k7o3N1J3M7J1k2R5m3j00jJ0K3K6J6m7k8N8Q1j36m8R8J8k2L3
2432E4J0j8L5m7m9O8m4q3M5jl3j2K4K2L2j7o8O6L3l1j8j0Rk4MM2JP2j7pl2P2o3
2465A5rL5KPp1N8K8Nn9m2M7Ml7R0o3qp5P9p3j7L9k1Pj1K9JO5Rrr2R3n4L4N7k7
2500C6l6J1oO6j8N0r2k4k1L9J7m8QL2R0m8l3k8pM6k8k8k9L2J4j6J7qP8r9kj7j6
2533f8Jl6J32l8m8K6L4k1nN5n4O2o9k0J34M1r2M7Pp6L2jj19Q2JK7r5R3J5n3K8
2564B2j2p0K9qM6j4M3p9M0o1O3k7k6J16p8J06j33R1j03P8r2K06j59K6Q2l9N5l1
2592G1n9N2O8j67M2P1l5O2ro4k4kk3M3pl5q2K0P0l2K9n9J4M6j8n3P6JJ20q0m6
$$ plain form
2370 22 -91 -70 74 -7 72 63 31 8 13 28 46 125 55 -14 -11 -7 40 -39 -62 50 10 2 -44 -37 -19 -70 -35 26 -41 19 -61 -24
2402 -24 9 3 -18 35 11 -16 -79 -28 -15 32 43 21 116 73 -27 -28 -18 5 31 47 0 -28 30 111 -25 -73 25 43 21 54
2432 54 64 46 81 34 -15 53 9 -74 -29 -30 -63 -75 -51 -29 3 -14 -82 -16 17 -14 -32 -42 -33 -57 -53 -11 -10 62 45 38 6 78 15
2465 15 6 41 43 50 -21 37 65 70 11 -31 16 20 -17 73 10 2 -73 6 -67 -84 -45 -66 -59 -70 -41 -40 25 34 25 -67 26 -28 6 63 36
2500 36 0 11 5 71 53 103 11 -13 -34 5 22 -26 -18 14 104 56 23 -5 -12 34 6 -22 -51 -19 -5 -21 -4 -12 66 -33 -35 -52 -68
2533 -68 -67 -103 29 -9 -57 -31 3 -18 -23 32 -22 40 -29 -49 85 126 34 81 88 12 44 43 -76 6 7 34 -61 32 47 -6 22
2564 22 10 -60 -31 -39 7 -7 36 -43 -3 -64 -1 -28 -54 62 -16 90 -43 48 -55 23 -69 137 -22 4 86 47 102 71
2592 71 12 64 132 -35 7 78 43 105 96 32 8 6 -17 26 19 -16 -98 -78 -8 -40 -11 -70 -56 -10 -28 -81 -5 -4 116 36 -10
2623a0Rj7L5l7M7l5J7Np0P1o7Q1MM5J8j25M8k4kL3J6q4M3Qm9m5Q1kL5o3kj4K4
2656b6m0J8L9LM9o2l1O6k7lmJ1J7k4J20p5N7p7Q2r9J1qL9J8l0n1J16r7rP1p9Q1
2688E6m9m1M7l6M8l2l7j4N4j2o1Q8j9%j0p3J8J17l4J4ll3JR3q5m0R3n8O1p2Q6
2719F7n1M1J2o7l7R8k1j8K8q7J5KJ5%l7M4j7j3P5o5m6k4J51qKk4p1k6Q4o8O3J9
2751C6kj6j1P3m1j21J29j8K8OqPj02O1N5J9l9k7Nn7N5kj10O3n5J79p8M6n2J4m7
2782a0n4P3K3l7p7J01pR9j32K7J5r2%P7J9n9M9R5p2j5j2m6P9Qj0j1%N3K7p8m4
2813a1Q8k1r0N1q7j2J75r7q8M0k0J3l9L6LJ7K0j0N4o1pN8M3q7J36j74J4R1l5N4
2843E4o6M5K3m4JpR0q9m6O2O9p8n2jJ31j02k8O0m7O6p3K1ln1P4l5k3J6R1n8o3
$$ plain form
2623 -10 -1 -18 17 -20 27 -8 9 14 -56 15 -52 29 33 78 96 -29 19 -5 -7 26 42 -42 1 9 -40 -85 -4 -6 29 -34 -36 -50 -26
2656 -26 -66 -48 -9 -6 43 -19 -50 16 -11 -14 -18 -7 10 -14 106 31 88 11 93 -6 5 -3 36 54 24 -27 89 -8 -17 54 -25 56
2688 56 7 -34 13 -23 25 -7 -44 -58 -4 -16 -77 11 -8 -8 -18 -91 -73 44 10 24 21 -12 -11 82 -3 -43 50 -8 53 -19 67
2719 67 16 57 69 2 -35 63 42 24 52 -35 -20 -18 -3 -3 -40 4 -13 -26 49 -16 -62 -86 65 57 59 35 -36 -62 22 -46 17 36
2751 36 34 18 7 80 39 -82 47 29 57 63 55 62 -40 21 76 95 56 29 34 -23 32 30 -80 -17 -72 107 29 75 23 37 -10
2782 -10 -64 9 32 -5 -82 19 12 111 -21 6 21 -71 -71 6 25 -34 15 110 38 23 11 -35 44 52 42 31 31 84 111 33 -11
2813 -11 77 56 -34 17 -70 -82 93 -4 -92 -52 -72 -59 -98 -62 -59 -42 -22 -32 22 -39 -46 12 55 -32 104 -70 -56 35 0 54
2843 54 -12 33 56 12 13 6 96 7 -39 23 92 14 -38 -39 92 -10 -38 22 -25 41 -32 -11 -14 -65 9 -26 -49 -33 58 0 -63
2874f3O5m6J2O1l2P0n8M3k9J7L8k5L6n0qjj0O0n8Rj15M4L6lL2l5n8Q6K1l4M6r0
2906c9k6m9K9N4K0l9Q5k8p0RK2k9R7j1Q%N0p7N4k0K0j9j9O4p7l2K9Q3l2p7NR1
2938G6J4j02O0o8j6O3mJ8J6p0l9K8KMpK8Po2L6J6j9K9l5P7q4j3L5K2j22J91l7
2969D4N4rM7j24J1L4q9M1M4j2m9K8joN9ln5K8k6n2J4k1j6K9mk8J3J9m1M9L2l7
3001b7j8K1k3J00k6m0K3Nl0L9JK5K3j04N8J3j18J11L3j05M2M3p3K7L5o2nJ1P4
3030E3m3j9q5N5j7kL4J6o5Nl3J09r9R6J3r1P0l7Pm6J34n3J0J0O4o6Km3R5n7m0
3061b3Q2j06R9j6l2L2L3r6O0r5P6n0Mn4J36l1j7k8j1m3K3k5N5J8q3L6O6n1Q0q7
3091d8O7K5M8n7mN7m9j1kn7qR1p0RJ7l3P5j15O7L1m9L0j7m2K2qo7J13o7M8k8n1
$$ plain form
2874 -63 2 -44 -32 29 -3 67 9 52 23 40 78 53 89 39 31 30 20 80 22 31 -84 -40 -4 -7 25 -10 -68 18 39 5 51 -39
2906 -39 -65 -114 -85 -31 -11 -50 35 7 -63 -54 -32 -61 36 25 33 33 83 6 60 40 60 41 22 86 9 -23 6 89 57 -20 -15 76
2938 76 90 -12 48 -20 -36 27 23 41 57 -13 -52 -24 -22 -18 -25 3 10 -52 -16 0 -19 10 -25 52 -32 -45 -10 12 -110 81 44
2969 44 98 89 136 12 23 57 -32 9 53 41 -8 20 19 13 72 69 14 42 16 -36 -22 -43 -59 -30 -34 -62 -49 -30 -71 -22 10 -27
3001 -27 -45 -24 -47 53 27 -13 10 15 -15 24 25 50 73 -31 27 40 -78 33 66 -39 3 46 -27 0 35 -27 -32 -21 53
3030 53 10 -9 -94 -39 -56 -58 -24 -8 -73 -68 -101 8 -91 5 18 -73 -3 -40 -33 -79 55 2 12 22 86 20 22 -21 74 17 -23
3061 -23 59 -47 52 36 4 36 69 -27 33 -62 14 -36 -32 -86 50 19 2 -26 -37 -80 -57 -82 -27 -9 -92 -56 10 -41 39 -48
3091 -48 19 44 92 35 31 88 39 28 26 -31 -39 52 -18 -9 8 -25 50 -65 2 33 -16 14 -3 -45 -23 -31 -98 15 -52 -4 -32 -83
3123h3R5j3l4K2PQ8j57O0O9l2j5K2OK5q6N5O9m5m7k3P5ll4q8Q7N2j03L0k4k6N1
3154@j4k6J8o2M3p0J24o3OQn3N7K7k5J0J3m5Q7J0o2J5k5Q9l0RL2Mq1N9J7k0l1
3186B1l7P3n8J3L3m4M3n6M6j22Q9N4m9k4l9M6j0N4j77J55j4Qk2O2j5j06N7L1J3
3215B5n7J35o2j24J01L4Jo6N2L0j00L5K6k2K9m6K4N2n3Pm3KJ8n6M7K8n8N5k1J3
3245FL1j21Q0k9m3K4O0J4l2J7JOj16J53m5M9n6M9m1j1J1m9J29o6n2RR6j2Jl3q2
3276e2J29n8j5m1N7p2K0K6l4M1j13Q3j0q6J61j8p7L8K5j9O%Jl3O0M4J8l0n6K2
3306A7L9Qm9M6l1k3K9M9n5K6m7K1o2L0J8k1P8n7j6p3L1J6ql3PK5jrJ3r4J13LK4
3339A4l0M5%l9M0M0p9N1j7m6M8k2O1p1K3K4L3m5JM1q1K0m1J20j43L2oN2mk5J7
$$ plain form
3123 -83 12 -1 -35 -13 -6 82 -75 -15 54 22 7 29 35 60 -26 29 98 53 6 -17 58 55 21 -67 20 72 -31 -1 -25 -51 0
3154 0 -14 -40 -22 -84 -41 -111 13 -50 -44 -36 -89 -32 -5 -30 -20 -7 -52 35 45 -17 -2 -27 62 32 41 73 77 -4 55 72 52 21
3186 21 -16 57 -1 12 45 1 44 -12 34 -88 1 55 6 -18 -57 -11 -21 33 -144 11 -3 5 -17 45 30 -76 -19 12 25
3215 25 -32 103 41 -83 18 52 53 -13 39 69 -31 4 30 8 37 -9 15 67 14 21 -22 -20 -2 -58 -11 17 -41 14 -7 6
3245 6 37 -84 -4 -33 -76 -52 8 22 -10 7 8 14 -102 51 6 55 -1 48 7 -4 7 -42 87 21 -31 -22 74 62 63 30 -52
3276 -52 77 19 4 -37 20 -52 -32 -6 -40 1 -112 -29 -39 -125 36 18 -59 -21 4 -15 -9 -9 -8 -41 19 63 81 51 -5 17
3306 17 56 64 15 61 30 7 36 85 30 56 9 30 -32 -2 16 -5 73 16 0 -73 -42 -26 -34 -67 -60 -35 -36 -45 -32 -126 -13 -10 14
3339 14 -16 29 29 -10 30 70 -9 42 25 -21 27 5 66 -5 18 42 75 30 31 72 -9 11 -30 90 -53 -21 -27 25 21 -4 13
3370A3m%k7N4q6L9K4j6q2M9J3J13q1j4L8r1J30p4mK3mJ8M0j26Q4M4Nk2k8Jq3J0
3402d4O1kL9r2J23r0J9K6%j39J18j0k6m3j3R3m0j3P7o3O0k4L8o4L9o0R0Mq2JL6
3433A9k0Q8Qo7N6n2K3l2Mk5mQ4r2k8L3N9o5J3Oo2P2O8l4j16O6Pm2NO0r0J4K2M1
3466A9J5j5M6k7j01M1l3N5k0K8Ll2kJ05l6j14J01K8Oo4NL5j8k6l3NjK0M3n0j5
3497c2J5Qm0J0R8l9n3K1q9N0J0O5j6m2J7K4M7Lj22Q1k3J6J3ojk3l4O1J7q4N6j
3529GJL2n4pK7j9j4k7N4lJ1%j2ml4L2Ll4N1j6J9K0k1o8M0M2K2k2k5Q8j33L0K5
3562A1J05p3L1m4l6O6o3j5K2Jj1l2N6k9K2m4J7r6NQ6N0q4mrO2pj3M6k3L0r7Q3
3594A3n6J3l0J13P0j00qo1R7l5P4j2k0n6qN3j4m9M9L1n1J5K4o5k3k0pN0m9%k9
$$ plain form
3370 13 9 9 -18 36 -50 -11 13 -3 -85 -36 -23 90 9 -5 33 -58 72 -2 -6 17 13 31 71 -55 29 73 78 56 28 29 -54 -44
3402 -44 17 15 54 -38 85 -5 14 40 40 -99 19 9 -17 -60 -73 20 -20 -33 44 -19 41 17 55 -9 30 -30 60 64 -18 -17 19
3433 19 -1 87 95 28 84 32 55 23 27 2 -2 82 -10 -38 -5 54 -11 2 8 -54 18 86 52 -64 2 9 -33 -28 32 -58 -44 -22 19
3466 19 34 19 65 38 -63 -22 -55 0 -20 8 11 -21 -23 82 46 -68 33 61 67 3 8 43 25 -1 -34 -29 -30 -10 33 -17 -32
3497 -32 -17 -9 -49 -39 59 20 -33 -12 -101 -51 -41 24 8 -34 -17 7 54 57 -65 16 -7 9 22 16 15 -8 -42 19 36 -48 8 7
3529 7 8 40 -14 -21 6 -13 -27 -54 0 -3 8 8 -4 -8 -42 -10 -7 -41 10 -6 13 33 12 -56 -16 26 48 26 1 89 -44 -14 11
3562 11 116 43 74 30 -6 60 -3 -18 4 5 -6 -38 18 -11 11 -33 -16 -112 -107 -21 29 -55 -59 -68 -6 -13 -26 20 -3 27 -70 13
3594 13 -43 -30 -60 53 123 23 15 -46 51 16 90 78 58 2 -6 47 33 -16 33 64 13 28 52 -13 -36 -56 -63 -13 -62 -62 -91
3625i1M6K1O9j06M1M%n6LP9Ll0q5J12K5K1j5p8O3q3R7Lm9L1l0J8M1m3O4p0p9J16
3657D2m2j4N7l4o4N0K5m3M3n3l2R4p7J9M0O3j41L3J2L2K3J8j03M3J3J0l1j1Q7
3686E9m6jk4KQ3o9jJ6K1o8Nm4O8M8p3J03r2OmK5o0rL1jo7P7j5L3l6RO1q6L4o1
3720g6O9M7rj2M3j1r8L4L5n6P5J2m2k1P4l0p2N2k5O6l7M1j8M8j14N7p1J06p2l1
3750c6L0m0J2j8k7R5j39J24p3L4P6j31R0L1k7J7j4L9l7oK4l5O9l5KO8k2n6j4K1
3780B2m2Qm3J05n1k8M2l9J8k3JL2k2J4j11J04o7R2o7j0Q5n4J1k4j4Q1K6n1k2N8
3810C1l3R6r5j3j1l4M7N7l6j6O0m2JLk6pJ1OJ3lm0L8m3o8K0O5n9R0q4J1m1L2N7
3843a3m5J9K5J4ml2O3j7N2r0oR9j9m4j4J22q2n7J09P1j31m6J9J16r3J0j3m1N0
$$ plain form
3625 -91 -45 -24 45 -61 -20 -16 -16 -72 -69 10 13 -17 -102 10 35 56 41 -37 26 -57 40 43 -6 25 -5 13 54 11 75 5 -74 42
3657 42 0 -14 43 9 -55 -5 20 -23 20 -33 -65 29 -48 -29 11 74 -67 -34 -22 10 33 51 -52 -9 4 14 -17 -28 59
3686 59 13 12 -12 -10 73 4 3 19 40 -28 -23 -67 1 49 -24 79 -13 -7 -11 14 -46 -55 -24 -25 -92 -15 -30 3 -33 -24 37 -49 -15 -76
3720 -76 -7 40 31 19 62 51 -47 -13 22 -34 41 53 11 -10 64 34 -38 14 -11 55 18 59 41 89 -25 32 -39 67 -5 -36
3750 -36 -6 -46 -34 -52 -79 16 -123 1 -72 -38 38 -93 -3 28 1 18 4 43 6 0 24 -11 58 23 25 93 71 15 1 22
3780 22 -20 -12 -55 50 -1 -29 13 -26 -8 -31 -30 2 -20 -6 -117 -13 -80 12 -55 -65 20 -34 -23 -47 -61 20 46 -5 -27 31
3810 31 -2 94 -1 -14 -25 -59 -12 45 9 -7 53 11 12 15 -11 -18 -7 -1 12 9 -31 7 -36 -104 -84 -19 -78 12 -72 -61 -102 -70 -13
3843 -13 -58 -39 -14 0 -4 -36 27 10 62 -28 -34 65 46 2 -12 110 28 -29 80 151 20 -26 -7 109 16 26 13 -28 22
3872B2l8Q6o9RQn0j3Q0o4l4O8m8L8l4M1L3m7n9L9J8%K3k0j0K1K4k6qK0L1l2Q9
3904I8o6n8j3N3m5O1K5l1p5mRN5K2j34N4plLR5q8l4K4M8J0m0k1K7l4Q2q0j9mP9
3937a1l4N4MJ2p2L9O9q6M4R9j14j4OrM0n7m6O1L4n8N9r1M6PL1m4Rn9L6l3O0j3
3969c1KlK4jM4p5L8L4n1LM9n2n0R8l4L6J9k9M3q6J07k5n7P0j8o0L9l9K9j7m9J
4001d1j3M0l2K2kQ4j12L6o7J49p9p1L8M2m3QP5n9J4m0P0k3L3k3K5M3r5Q3l6m9
4031b3jKPm1R9n1K4j8M1%n8l9N8o7J0K0K9n5j6J17p0qn7O5J3jO4m6J7l6K1O6m2
4064B4o2Q5k7k2L0PPm3r1J17J0q8N9N9j1o8Q1p3jm9j3M7mP1j60oL9qJLJ03r5J0
4097f8PK2K4o9K2%K5OOJ0M5L1r8O4j2n9P5j4M2l9p8Q2m8K9K4n6P0J8Kj03k7m4
$$ plain form
3872 22 -16 70 1 10 18 -32 -45 35 -29 -63 5 -43 -5 -39 2 35 -12 -71 -32 -14 -14 9 -11 -21 0 24 -2 -10 10 41 9 98
3904 98 32 -26 -39 14 -31 30 55 24 -51 -55 -46 9 31 -103 -49 -56 -59 -56 39 -49 -83 -59 -11 -1 -41 -62 -35 -69 13 -67 -86 -90 -11
3937 -11 -45 9 13 25 -47 -8 61 -25 19 118 4 -10 -4 -13 27 -30 -76 -15 19 -39 20 -71 -25 -18 13 -31 -22 -81 -45 -78 -18 -31
3969 -31 -29 -32 -8 -9 35 -40 -2 32 -19 -16 33 -19 -69 29 -5 31 50 21 64 -22 85 60 3 73 55 -5 34 -5 24 7 -42 -41
4001 -41 -54 -14 -46 -24 -26 58 -54 -18 -85 64 -15 -86 -48 -6 -49 -41 34 -25 -11 -51 19 -4 29 6 31 74 -21 62 26 -23
4031 -23 -24 -22 -15 -56 43 -8 16 -2 39 39 -19 -58 0 -67 -57 -37 -8 -63 -79 38 -32 -40 -97 -32 -19 -20 44 -2 15 -21 0 66 24
4064 24 -38 47 20 -2 28 35 42 -1 -92 25 35 -53 6 65 54 -14 67 -6 -7 -56 -69 -22 -26 45 -115 -121 -82 -90 -89 -86 17 -78 -68
4097 -68 -61 -39 -15 -84 -62 -62 -37 -31 -25 -15 30 61 -37 27 15 -44 31 17 59 20 -58 24 -24 5 29 -27 43 61 63 -40 -67 -111
4129a11Q4k2L9m0k8L6K3k7o2Q4%M8m8LJJ8l1m5P9mN4mn9qJ03o2jK5r9Q6J5J0m1
4162A6K9p2K2K9jl4o1M6oj7J22n1r4N0q9Q2K5J1o7K4JJj2R6j2q9O7j7P2o5K5r
4194B2j7R1q9OK9m1Q8j16L4l4P8M6j01j5P3o2r6L3N5O1p8K1L3o2Qkl3KJ3l5J2
4225g6P4M6r1NL4n6P4K1k0m7M4K1n9J21o1k9N4j0p1kJ54j27n2J43k4n3L9Oo9q1
4255i2J56j53Pl5N2O0kJR2n9l4J2p6K0K7k7Q9mJ0j9j22R3P4j21P4PM4l7mmm0J1
4287@m5P2k9n4Q9j16M6l2Q5l4j7M6j04M0n3J1O6k1M9knK4j2k7L9j8k9kJ9l1q4
4318a29J86j12Q2M3l2M5l3K1j38J01q1M4L5n8O6n1Q3l9l5p2K2PJ7O4j8j9k8J2
4346a7p5R1l7o1Q4rL3n4O6Ll4k8K2N8J8l9Nm8j5O7J7m6%M2kl0nk0L1n9PJ9M0j08
$$ plain form
4129 -111 -27 -49 -10 -50 -78 -42 -19 -46 -108 -24 -24 24 -24 -21 -20 -2 -33 -78 1 -3 51 47 -12 -20 83 21 20 45 -54 32 47 57 16
4162 16 45 -27 -5 24 23 -11 -72 -26 -32 -49 73 22 -72 -22 -111 -29 -4 7 -60 -36 -35 -34 -46 50 38 -51 16 -1 71 6 31 22
4194 22 5 96 7 13 42 1 89 -27 7 -27 51 97 -4 -19 54 -8 -104 -71 -16 45 -33 -12 21 -41 -33 -35 -68 -66 -53 -88 -76
4225 -76 -2 44 -47 -42 -8 -64 10 31 11 -36 8 29 -30 91 30 1 55 45 -26 -28 126 -1 -53 90 66 13 52 58 -11 -92
4255 -92 64 -89 -82 -117 -65 -5 -7 -6 86 27 -7 5 -71 -51 -24 -51 38 34 44 25 -97 -4 70 -51 23 30 74 37 33 29 -11 0
4287 0 -45 27 -2 -56 33 -83 -37 -69 16 -18 -35 11 -93 -53 -106 -95 -29 -50 -1 -3 -8 16 4 -23 16 -2 -31 -33 -14 -45 -129
4318 -129 57 -55 27 70 38 83 50 71 -67 34 -47 -3 32 -26 40 -11 72 33 -2 -74 -52 -45 -28 36 18 -1 -29 -17
4346 -17 -92 -1 -38 -99 -15 -24 9 -45 21 24 -10 -38 -16 42 60 21 26 -22 -37 30 47 1 1 43 41 11 6 -14 17 -42 -35 -16 24 -84
4380h4P1l0LN9M0j53N9j6J4k2k1Q4L6q5K4J5n5N4KOJ0M9l5k7o3Q5JL9l8N8j45
4411f5J14k5%N4r9L6p8%L9N0J4nl2ro1N6K4m5LLrM3k0J4p4M9o0M5LQ5q3M1k3N5
4445D0j0kNj3N0o9K2K7J8r9N5N4q0K3K1mJ4K5p4j6J9K1j9kOj03J11j2n8N1j6Q0
4477F5r4lK7Nl6J5p7P4k8Q0o5N8NL1Nq9M0L3r0M3kn5J16n5N4j43J96j01lj4N5
4508D7j6m7m5j7P2o0K6L9rk9nN0n5R1k6rK6J9m7o7M8Q3nm5m0L6l9K2j0K0K9Lm1
4541aJ14r3p7P6J3m4j4n8J38q1O6n5oj9mN2k7k2L4Kj0OJ1n2N4rP8p2p6J81p5n3
4573b3R3J0l5mL4l7k6Pk3N3JlPn8j2K0J2ro5j0mJ8PR5r9KJ3k6Nl5J63n9%K4j36
4608a00N2N7j4P8n3K4l3JK1m1M8Klk5l3L2j0J04l2o6k1L1J9l6jo4O6m2RMm0p5
$$ plain form
4380 -84 -13 -43 -40 19 59 -94 -35 -51 -37 -59 -80 4 40 -45 -21 -6 -61 -7 -5 1 11 60 25 -2 -65 20 21 60 22 80 -65
4411 -65 49 24 24 78 -21 15 -63 -63 -24 26 40 35 3 -6 -67 -11 13 -32 -29 -26 -35 8 -12 2 -72 -23 -83 -38 -35 50 -33 8 -15 40
4445 40 30 28 33 20 70 1 23 50 68 -31 24 78 -2 21 42 38 52 77 3 -13 6 27 8 6 12 -91 20 8 -50 1 -15 65
4477 65 -29 -32 -5 0 -36 -21 -98 -24 -52 28 -37 21 26 57 62 -27 13 46 -44 -1 -3 -58 58 3 57 -86 110 9 6 -8 47
4508 47 31 -16 -61 -78 -6 -66 -40 -1 -10 -39 -44 6 -49 42 16 7 33 52 5 -62 -14 69 64 19 -21 15 -24 -2 -12 8 37 40 -1
4541 -1 113 20 -57 19 32 -12 -26 -84 54 -27 39 -16 -22 -41 -45 7 -20 -42 -8 -6 -16 -10 1 -51 3 -6 72 0 -76 105 30 -23
4573 -23 70 80 45 41 75 38 12 19 -4 49 50 47 54 -4 -16 4 16 7 -58 -68 -72 -54 -47 48 -51 -49 -36 -62 -57 -92 71 12 12 36 -100
4608 -100 -48 9 -5 73 20 44 11 12 33 -8 40 42 39 14 -19 13 3 107 75 9 -12 19 38 2 1 -63 3 -39 -30 -26 -66 -141
4640a41M2N5k6RJ0M2J7N9j84R8j2m6O7rJ3MM6k5Qm6j6J49j01%L9o9P1m9K6Qn1
4671a2N8q2J02j05l6N8o6k4M1L8K2j6m5j1JL0KpQ0k4n4j9L9N9o1n2J28n1J9M0
4701E2j90J56K8n3K0LQl9P1m5J1J0o5N3jj6k3J7o8M2kj6KP5o2l4J1J8n9M6QJ2
4733c0p1M2K6M6p5L7K4lO2K1J8j9j00J9K7M4o0Q7l0n4jk1J06j40J24p8O6j23m7
4762a03R1jJ6p2K0QN8l3J4n4K7m7L6P0ql2O1q7O4ok3OO5k0k7r0Q8M1o7L5M5m5
4794C0om6RR9q6jL5M1j18QM3J8j8P9k1m4%p1Q2j03O1J0mm3Q5j5lo5J2J00m9k4
4826eRm9J22k0M4o7J6r8P0R2r9M8q2O1j6j9J6pM6n7l3N3n3ml2K8N9m9L7n4j6M6
4858a3n3K9k3M0QO2j7o2j1N1P7r6M1j3m8Q3k5J2L8o7j2k8l1J01jk7nL4K0m5oo
$$ plain form
4640 -141 -99 -44 -70 -61 -51 -9 8 67 -117 -19 -31 -77 -10 -19 -6 -2 44 19 27 -19 -35 114 13 13 52 -17 54 5 31 39 -12
4671 -12 46 -36 66 -39 -75 -17 -83 -107 -66 -28 -6 -22 -67 -78 -77 -47 -45 -52 28 4 -50 -69 -30 29 -32 -84 44 -7 12 52
4701 52 -138 18 46 -7 13 16 24 -15 56 11 22 32 -33 20 19 3 -20 -3 -71 -29 -31 -47 -45 30 -32 -66 -55 -37 -96 -50 -42 -30
4733 -30 -101 -59 -33 13 -62 -25 -1 -4 58 79 97 78 -22 -3 24 68 8 95 65 11 10 -11 95 -45 79 1 67 -56 -103
4762 -103 -12 -13 3 -69 -49 -41 17 -16 -2 -56 -29 -76 -40 30 22 -10 51 -36 28 22 -1 5 70 50 23 -67 21 62 -5 30 75 30
4794 30 24 -22 -13 86 0 -1 34 75 -43 -35 8 26 8 87 66 22 22 -49 33 -70 -9 1 -3 -46 39 24 21 -44 -32 68 19 -5
4826 -5 4 -45 77 57 101 34 50 -48 22 114 15 63 -19 42 26 7 23 16 62 5 -28 25 -28 -32 -64 -36 23 -26 11 -43 -59 -13
4858 -13 -66 -37 -60 -20 -12 50 33 -29 -40 11 88 -8 33 20 -28 55 30 42 80 13 1 -27 -58 43 42 15 10 44 64 19 13 7
4890Gl7KJ8lk2M0m8Jl5L9j8P8j13O9l4R2K3L8r8QJM4J5mn4N0rL2n3p9L8N7kMK4
4925G1p8M4o3rjM2j8n5n9Q4l5J2M7J6Mm5J6l6M8n4l4J39n6k4J6M2l2j0J3J9j4
4956a0L3J0q2J33q7k8N2o8P5%QM5p9PQpj06J06l3k2J4Pj7P1o8j9L8L3o0P9M5o1
4988A7J3j04J43mk5r3J6mM3K3l4K3NO8q7m1P6Km8K4jL8k8k6on4J32j19M5j27J01
5019c2M2p6m4K9M0k9P1m0M9m8JM7n4N9nqP1j23%P8R4q9p5P5m1oR7p4n9M6O6j01
5051c9P1k5l3k7L0M9p0K1K4j07N3K9pq3J23L3o6Kk2K2rR4q8lJ04q5J4j1M1k1n7
5082d3J73j39L4lJ9l0N3J3l2jJ2j5r8Q1K8q1M6o8M3oo9J11j14K3N1J1p3M7L6n
5112DJl7M7J4l8O1o9oJ01p3n2K0K7nJ03j8l9p5M6Ll4R1j9n1KM3l2Pm3j3%N1j48
$$ plain form
4890 7 -30 -28 -10 -13 -35 5 -43 -42 -77 -38 -56 22 -91 -22 -56 36 59 97 -1 7 8 52 67 63 9 59 50 82 29 -50 -12 45 43 47 71
4925 71 -7 37 -26 -35 -36 6 -12 -67 -126 -42 -77 -65 -18 -2 2 -43 -27 -63 -15 -69 -103 36 -20 -44 -28 14 -18 -28 -15 4 -10
4956 -10 23 33 -49 84 -3 -31 21 -47 28 28 36 81 2 9 17 10 -96 10 -23 -45 -31 -24 -41 30 -38 -57 -19 14 -46 33 78 17
4988 17 30 -74 69 65 40 -53 -37 -41 2 25 -9 14 19 87 0 -41 35 37 -11 13 12 50 22 -4 -10 -64 68 -51 -6 -133 -32
5019 -32 10 -66 -110 -81 -41 -70 1 -39 10 -38 -37 10 -44 15 10 2 73 -50 -50 28 122 33 -42 33 -8 -14 83 9 -50 -4 62 -39
5051 -39 32 7 -26 -53 -23 26 -44 -23 1 -106 -53 -24 -31 -114 9 42 -24 -22 -44 -22 -31 63 -25 -28 76 -9 5 -6 35 14 -43
5082 -43 130 -9 25 22 41 11 64 77 45 44 56 41 -57 24 52 -29 17 -51 -8 -14 -83 28 -86 -63 -12 -1 -74 -27 9 4
5112 4 5 -32 15 29 -9 52 -17 -23 78 5 -47 -27 0 -5 98 80 41 -34 12 15 -19 72 53 2 4 47 15 22 -21 -34 -34 17 -131
5145a31Q3J9j8J0kjn0L6MO7Ml9Q0p2j0o9J54l5k2j3M1J7o4P8m2K6n4k5PK8K4J0
5177D1l4l6O1m3ljJ2p7J08p5k4O3m6L7o4O9l2J0l1O2j7K0Rm1J8J5j18J46p1R2
5207E0m4j7O6l5lj5R5l9l3m7J8L9n5l7K7K0L9k4J3m1j7N1l6j7N4k3l4k7J3Q5Q
5238C4n2l6O7j2KM3j1l9oQ3K4r9jLK8l3M4n0N1n0M4Nq7M4l6P4m8l0J12l9p2KO
5271c5o5L4K9M8l3l5L0m1Pl0P8o0PO8o4J17j10P9rJ2j8n9J14m8M9K5p5J3l2K6
5301B2l7M1l7NJ6JL0j03P3q7N9l5N1j7J5j4n1mJ11q8M5j1m2RNL5M4p4LN0jK7r1
5334e0O5J8KkK5o6J8N1n2M4%K5r0J2J0k3l3J4n5J44j35N5N5j15J27j12L0K0L9
5363B1P0o5m6P0j02N2k8j0J8M4j31J58k8l8R2r4L8L1l7J0Mr8J14J6o6j4O2q3l1
$$ plain form
5145 -131 -48 -29 -47 -37 -39 -40 -90 -54 -50 17 21 -18 62 -10 -20 -89 65 30 8 -5 36 53 -11 67 25 51 -3 -28 -21 7 31 41
5177 41 7 -29 32 -11 -14 -15 -3 -80 28 -47 -71 -8 -54 -17 -81 -12 -44 -34 -65 -3 -20 0 9 -32 -14 1 -117 29 -42 50
5207 50 6 -11 55 20 17 2 97 58 25 -22 -4 35 -20 -57 -30 -10 29 5 18 -23 -40 11 -25 -42 12 -11 -45 -72 -59 26 34
5238 34 -18 -54 13 1 3 46 35 -4 -10 73 97 -2 -3 0 28 -5 39 -11 40 -10 34 39 -48 -4 -40 34 -14 -44 68 29 -43 -41 -35
5271 -35 -100 -66 -37 11 -22 -57 -27 -68 -61 -91 -13 -73 -66 2 -62 55 -55 24 15 27 9 -50 64 16 65 90 15 28 -4 22
5301 22 -15 26 -11 -6 10 11 41 -62 11 -76 -17 -52 -1 -18 -3 -17 -68 -72 39 -49 -4 -15 -57 -48 -43 -8 36 -38 -35 15 14 41 -50
5334 -50 15 33 35 33 58 -8 10 61 9 53 53 78 -12 0 10 -13 -46 -32 -87 57 -78 -23 32 -83 44 -68 -38 -18 21
5363 21 91 26 -20 50 -52 0 -28 -38 -20 24 -107 51 23 -15 77 -17 21 52 15 25 29 -69 45 61 -5 -19 43 -40 -71
5392g1J26%p1L3n3ml2Ko8J49o0M6n0j0J04jn1N1l4j3L7n3P3n0Oj6k2J2J1J2J8
5423B1K3K6p6l2J1L0j1Rk9J9o4O3J6l7K4o3j2K2j2M0P6j16RM1j3oMl3O0l0O7k8
5455ao7N7m5P0m4Q0Op1mO9k6o9J36n0J8j01Q1j6jk0M7m0L5p3L7m5R0n7q5P3%K0
5487Dp0J8K5PL2n3K0q9J01k0P8k6J5q6J17j59M9O1M1Qj9j0l4k1M5M3l6M9r1N2
5517E1LJ2q7j0J4K0M0q2m1J23m6k5j4N6m0l7Q1n7N3r1J41pr8R3m0Pq0J27k1l3
5547A2Q2q4J3l4J19l9p8j8Q9n2l2mK0M2J5l6K6q8L3M3oq7J9o4P9Pk4M5l9J7J3
5578a1L6p3K5l8N4j2m6L7Q1k5j09M2P8k9m4N7K1Ql3M6Q1j46RJ1j3KnKOl1M4j7
5610HQj6j2lJo7J06k9l6M9j15O4q2J29rk4K9n1J10r4P2j7o1J5R6n5K9J8m0L7n5
$$ plain form
5392 -71 55 55 -16 17 -36 -40 -72 -70 -138 11 -49 -3 -53 -63 41 40 -11 40 6 -7 30 -23 50 0 6 -10 -32 -20 -9 3 21
5423 21 44 70 -6 -38 -27 3 -8 1 -28 -9 -73 -10 6 -31 -7 -70 -82 -60 -72 -32 44 -72 -63 -22 -35 -41 -37 -70 -10 -40 27 -1
5455 -1 -68 -11 -56 14 -30 50 56 -15 -19 50 24 -45 91 41 59 -42 39 23 22 2 49 9 44 -29 8 -37 53 -4 -89 -16 -16 4
5487 4 -66 -48 -23 -16 16 -37 -17 -106 -5 -25 53 27 42 -44 73 -86 -37 24 65 73 54 44 10 -11 34 77 41 90 -1 51
5517 51 54 66 -21 -31 -17 3 43 -39 -80 43 -3 -28 -42 14 -26 -63 18 -39 14 -77 64 57 -41 52 12 19 -61 66 45 12
5547 12 94 10 23 -11 108 69 -9 -27 62 10 -22 -26 -6 36 51 15 41 -47 -14 29 23 -64 -45 -109 -30 -23 -47 -2 -41 -24 -11
5578 -11 25 -48 -23 -61 -7 -19 -65 -28 53 28 -81 -39 39 10 -34 23 44 52 19 65 146 0 9 20 7 9 4 6 12 -19 25 8
5610 8 16 0 -12 -15 -14 -81 25 -4 -40 9 -106 -42 -124 5 -4 -28 1 -50 60 -34 38 21 -40 -25 71 16 45 63 23 60 5
5641EM0n2l2L4l6M0n8P6o0N1lql3R0o7k3k4O8m9m9J22n9oN3noo9R7m8J2K3j6l9
5674c1N1M3k5L7k1ml6N7p0M2M6l7p8J7j1K3N9o5J2k9qk4oN3n3M6L8l0p6j0P0j4
5706c4k2K7J9L1r5M5O0mok0L5M0q2k9R1No3l7Q4N7q4O8kj15n7R9K7j08K6O4N8
5737G8q9o6O8n0N1J6k7k8q2NJ57jk6n6N0QL2j8J1l8N1m3K4qJ2L3k7L2j14M6N5
5768E6Q1j26jl2M9j3kk2K6l3oK9k6L7q6P1m7L3j3P9j13L5N2J3j68J34M6q2N5k0
5798FNP6n8o7M1l0J24m0n6QJ7J9N7j03m2O6J1o4O1o4K0K7p3L0L0n3QN3l7J9o6
5829g5K5J8J5J3j4O0r3J4O2j0j4R5o2O3j05mJ05j25Q2j5l2KQ5k9M3k0k5r8O6j10
5859h3K8Q2k9J6j11J28j07mN4K0m6O6o4j4N8n8N6j3l2N4m4Q2k3j02J25p9Q5N1
$$ plain form
5641 5 45 -7 -39 -5 -41 -1 -59 17 -43 8 5 -3 -36 54 -13 -36 -60 8 -41 -90 32 -27 -33 20 15 9 -60 37 -11 1 24 8 -31
5674 -31 20 63 38 75 54 50 14 71 1 43 89 52 -26 -9 -20 3 62 -3 9 -20 -28 -52 -58 -5 -58 -12 26 -4 -80 -90 -20 -34
5706 -34 -56 -29 -10 21 -74 -29 31 27 21 1 36 76 -6 -35 56 61 -2 -39 45 102 18 86 84 -31 -88 11 38 -70 -44 20 78
5737 78 -11 -77 -9 -59 -8 8 -19 -47 -129 -124 33 32 6 -50 0 8 40 22 33 -5 46 3 27 19 31 64 37 69 -45 1 56
5768 56 137 11 10 -22 27 14 12 -10 16 -17 -23 6 -20 17 -69 2 -45 -12 -25 54 -59 -24 28 41 -127 7 53 -29 26 6
5798 6 11 87 29 -38 3 -27 97 57 1 9 26 45 102 -1 -43 23 34 -30 31 -33 -13 14 -59 -29 1 -52 -44 9 -28 -9 -75
5829 -75 -50 -32 -17 -4 -18 42 -51 -37 25 15 1 96 34 97 -8 -12 93 -32 50 35 3 5 90 61 104 84 59 -39 27 -83
5859 -83 -55 27 -2 14 -97 31 -76 -80 -26 -6 -52 14 -50 -64 -6 -64 -8 -21 -53 1 -43 39 16 -86 39 -40 45 96
5887I6q2RJm0L5k6K4m2Q8m6J3j3k4J17p1j08M7L4k5L4j1Mn4J2RON6j34J72j20
5917c9J20q4M5L8J5l2n8P0Ml8K0K2n9J9l3Lj9J8q9J23n1K6nJ8l5n1O5l1m4L6M3
5948A7m7L0nl4P3q8kM0Pm9M6l1K0M7K7o6N9l4K2j8m9O8Q7j32O2j8qK9J4J6m9k9
5980EL2K2l5K1n0m0J0J6m2J5Q6J5o6M7j16K7R1l0k8k6K4l0nlQ4l0pR8n1n6L4k
6012A0%Q2p7k7J20m1o8O1%lK5o7L7Rn6l4R6j12O1k2L2m4j4J3jK4k7p1k4N4j4J4
6044f4L5O8n3K9nM7j09M0O0m8P6m5J15j68J41m8nj1q5R6p2o1L1k8R1Kl1l0l4k0
6074h6J5P9M1n1K8k7Lo5K2l2L8Nm1J19J4p0M5o4R2J7p2OK8j8L8J9n4n9L4l2L9
6105A1L3l3K1o9J40o4j8j1k6N5l2P2r0J8k9k0K2N5o6J2N5m0j6M0n1N6oj02J22
$$ plain form
5887 96 14 23 24 -16 19 -7 17 -25 63 17 30 17 -7 110 39 -69 -22 12 -13 21 10 14 -40 -28 -19 -13 43 -91 81 -39
5917 -39 81 -3 42 80 95 63 5 75 79 41 61 83 24 43 10 13 -6 12 -77 46 -5 21 16 34 -1 -52 13 -18 -62 -26 17
5948 17 -30 0 -5 -39 34 -54 -56 -16 -9 -58 -12 -43 -23 24 51 -15 44 10 32 14 -35 33 120 -12 50 32 24 53 67 83 34 5
5980 5 37 59 24 45 -5 -45 -35 -19 -61 -46 40 55 -11 36 -80 -53 38 8 -20 -46 -22 -52 -57 -60 24 -6 -13 85 34 -22 12 10
6012 10 10 92 15 -12 108 67 -1 60 60 57 82 15 52 61 5 -29 67 -45 16 -6 26 -18 -32 -19 -20 4 -23 -94 -118 -64 -78 -64
6044 -64 -29 39 -14 15 10 57 -52 -12 48 0 76 31 146 -22 119 71 66 55 -30 66 -6 -67 -36 -64 27 29 -2 -32 -66 -86
6074 -86 -71 8 49 -2 26 -1 2 -63 -41 -73 -35 -30 -71 48 62 -8 37 -27 65 82 10 16 44 26 64 83 29 -30 4 -28 11
6105 11 44 11 32 -37 103 39 21 10 -16 39 7 79 -11 7 -22 -42 -20 35 -31 -19 36 -4 -20 20 -31 25 19 -83 39
6134C9jLj6L3l1O5o7P8q3PJ1J1l1M8j36K6O6m5j7O6n8J3Qj8rM2j0Ko6O9Mk9K7
6167Am2LN2j0l0l1K6L2j00J48lOl3N5r0O6p1J4J08n2l4QM8q3J6Q3j9j74J19j12
6197i9P8K9n1J2N1l6kOj8n3P6K4j1q9L1Q6j9n1M6j2lom9M2M4M9j8r0J1O6K8m2
6229C0Nk6LL3qm8L3j0k8l5P7kp1L8J0m5LM5k4n7M9o7L4M6l2l7J00p8M3j5L3L4
6261C3n9J00p7N2qk5O6p6R5j07PJ21qr5N5o6M0J1qo6j8jK6l7M4M6Jj6n1l2O6j5
6293bk0l2KlK1Qj4P9n2k3M2p0L8l0O0j1L8n0J00m3o3Q4k9K0n8K0J6L0p2m1N7j4
6325a2r0K2N1J6L3Qj62R1j5N3m0L1k9J8l9R2q4lN3m9K9M2N6o9pJ21q9Q4m8r7j9
6356e2L2L1j0KL5r6K9Q3n4K1nm0J7Kl0k4K8J6k6m5L6L3m9O6L7p3J8M%p1J13q6
$$ plain form
6134 39 38 41 25 58 27 92 25 103 20 27 38 49 18 66 -70 -44 22 -23 -40 26 -32 -19 -11 -29 -38 4 -6 -4 -70 -1 3 -26 1
6167 1 -41 -38 14 4 -26 -57 -31 1 -99 49 46 52 19 74 -16 50 -21 -7 101 49 15 23 71 -12 4 87 68 -106 13 -99
6197 -99 -21 8 -43 -31 20 -16 -18 -12 -30 -83 -7 17 6 -83 -52 34 15 -36 10 -2 -5 -11 -60 -18 26 75 57 -33 -22 44 72 30
6229 30 35 9 12 45 37 -11 22 12 -16 -51 26 24 -47 -9 1 -44 -41 4 -20 -77 -28 -95 -61 -15 -47 -84 16 -62 -19 -34 -1 33
6261 33 -26 74 -3 49 41 16 82 6 101 -6 1 122 114 19 74 8 48 59 51 -15 -33 -34 -8 -45 -1 45 46 30 -21 -53 13 -2
6293 -2 -22 -54 -52 -55 -34 -26 -40 39 -13 -36 6 -64 -26 -56 4 -7 31 -19 81 38 -25 59 30 50 -8 12 28 58 -14 -55 2 -12
6325 -12 -102 -80 -29 -13 20 28 -134 -43 -58 -5 -45 -14 -43 -25 -64 28 -56 -59 -6 -55 -26 16 72 3 -4 117 28 112 64 -33 -52
6356 -52 -20 11 1 3 38 -58 -29 54 0 21 16 -24 -7 -5 -35 -59 -31 -15 -41 -86 -50 -17 -66 0 37 -36 -18 -14 -14 -85 28 -58
6388e8R2k9l0L1N4K6j05j5jN2n0P8p3K1P0m9M7k3l0lR1j70R0j3q8J12n5m0R8j11
6418h1L4J6l8pQK3N4K3K4m8o0Q2Pm5O0o0l4R3Jj3K5p3J0k9N9P1k6n9m6J17o3r2
6450f7M9L6n0j3PN1Ln8K9m3l2J41k4j09J1K8M3Kr4J15Np1Q7r4k3Q9RMn5L7O1o7
6482GqL5Rk4j4K2n1l5Q1n0P3m0o3o6J20l4L2m0PR5q1K0l9K2M6m8M5m2L2m5rmL
6515d4mP0Q3j04mj0L4P7m8l8J1P5j12O0q0P4k2L8rM9p9l1%k4j3k8J10q2M4M1r7
6546f3rJ6%O0l6J8k7M3Jl5O8m4N8n6K8KK5j3j9L0J5o9j1O8N2o7o8qJ25j18L5r
6578hm4KM6j8n8M7MJL7l1M8n4J8L3l7O9p7nJ5nM1j2j5j2nR4j3k8L6p2O4Ll0j8
6612A6K5j09J08oQo5M0K4Nl3o2O1q8M5L1RL4q7K1l3M3n9M4ll8R7n2O5J9p5L3L
$$ plain form
6388 -58 34 5 -25 6 60 86 -19 -34 -35 17 -33 45 -28 -7 63 14 61 38 8 5 96 -74 16 3 -85 27 -28 -68 30 -81
6418 -81 -47 -31 -69 -76 -68 -45 9 32 56 8 -52 30 37 -8 52 -8 -42 51 52 39 64 -9 1 -28 31 102 76 17 -29 88 25 -67
6450 -67 -18 18 -32 -45 -38 13 16 -42 -13 -56 -88 53 29 -80 -69 -41 2 4 -90 25 30 -41 46 -48 -71 18 27 31 -24 13 74 7
6482 7 -1 34 43 19 5 27 -24 -59 22 -28 45 5 -58 -124 -4 -38 -6 -46 -39 56 -25 -5 -44 -22 24 -24 21 -21 11 -34 -43 -47 -44
6515 -44 -48 22 105 1 -3 -13 21 98 50 12 23 98 -14 46 -34 40 18 56 47 96 17 -14 -14 -38 -51 -79 31 -51 -7 34 -63
6546 -63 -72 -56 -56 4 -32 -14 -41 2 3 -32 36 -8 50 -6 22 24 49 36 17 47 62 -7 -18 50 102 35 -33 -41 84 -34 1 -8
6578 -8 -52 -50 -4 -22 -80 -33 -29 -28 9 -22 26 -28 -10 23 -14 55 -22 -27 -12 -17 24 12 -3 -15 -20 74 61 33 69 -3 61 64 34 16
6612 16 41 -68 40 34 42 -23 17 41 46 13 -49 12 -76 -31 0 9 43 -44 -23 -56 -13 -72 -28 -31 -69 28 -24 41 60 -15 18 21
6644B1l0L7oj8M8jl2O0p8K0NL5K0o6p2R2or9RL8L3j05L4N3l9j2N4j5j5K9n0k8
6676h4M5o7J13m4O2p9K8O8q1k0O6lJ03m4K4l1Op4N1n9O7n7O9j01K1K4m7O1mL0
6706D3n2o1N9l2QMn8M1J4pqL9m1PN4o9O4nK5j2M1r8P0j5k9J00m1m8L3K7K0p0P0
6739G3m3k6J6Jj6J6j6Jn5M3J9j0K6n3Rk8k0J9N3Ol6n3J6M2K9j1j1O6o5q4O3J7
6771a2O2j8o0L1l3O3m1Mj6O4o3J4M7r9Q9m7Q2m1N1j14PlL0J3j00N6qq3N4kN8J6
6803Am4N2K2r1N6no1J20Qq9N3k1Q1q2N0Mp3K8j0J8jL7J3p4K3l4P3m1j4ml7N1n1
6836d2k0O5k2jKk5k0N1n5O9or3N7Q3j39P9j1N3J5o1J8K5k6K1J0ro6J13nl2%l1
6868cM5l5J2M0j9k8l8n4OJ04Or0K8J4n3M5J5M3q5K4o5Q4m2J01r4N1n2N2L6M7m3
$$ plain form
6644 21 -9 28 22 4 52 51 19 79 1 21 26 61 81 15 -57 35 29 -70 -61 -23 10 -95 -61 -8 -47 -59 -5 -20 -35 -6 -56 -84
6676 -84 -39 -106 7 -37 25 -54 -26 42 -39 -59 7 4 107 63 87 56 62 -12 39 -20 47 -10 59 -42 -21 3 -44 17 13 43
6706 43 -9 -70 -11 -43 -35 -31 -89 -48 -34 -41 -49 -10 -51 -44 10 -59 5 0 25 13 54 -44 26 11 -18 82 41 -7 26 53 73 3 73
6739 73 30 4 20 21 5 21 5 6 -49 -6 13 3 29 -24 -15 -43 -63 -44 9 15 -21 -74 -58 -16 13 2 -9 57 -8 -92 -29 -12
6771 -12 50 32 -28 3 -30 33 -8 -4 -20 44 -19 -5 42 -57 32 -15 67 26 77 -37 -30 -33 -3 10 -90 -34 -42 -125 -71 -73 -15 1
6803 1 -43 9 31 -60 -4 -9 -70 50 58 -31 22 1 82 0 50 54 -19 9 -1 17 16 53 66 -8 15 -19 54 13 -1 -5 -42 9 -42
6836 -42 -62 3 -19 -20 -18 -43 -63 -12 -67 2 -4 -97 -40 43 -96 -17 -28 25 40 -21 -3 22 -4 17 27 18 -48 65 60 28 28 -3
6868 -3 42 7 19 59 40 12 -26 -80 -74 30 36 -54 -26 -12 -65 -20 -5 38 -47 -23 -88 -4 -46 55 -39 12 -40 12 48 95 52
6899E2k7j10J38n5RQj5J3%m9P0N6p0k5nl4N7Rp1O1p4J62j10J8k9n4M2Q7q7j0L9
6930dl1%K9L7r7O9lK4N6j27L9J6n2J48j12K0Q0j22KJ8O9q1j2N0j4kN3n0%K7q2
6961e2Q7j27P5l9L3Oop0J92j65N8m7K5j8k8J18n1J3j3mRl3J5l4Q1K5p7O9j1j6
6991A5MJ01r9k4O0n9N7j31O2M1J3m8J2n2okM3k7P3p3qj3O8p1K5M6J0p0J5L9m4
7022d3K5M0L8m9m0O6jn8J4J5l2k0J18o8L9J8k2l0l6K3M8n5k0rp1J18m4M2n7l9
7052i0O9q0M2O0J7l9K5m7J4N5oNj02R0Lk0%Q2n4j2L7m1k2K3O4k9M0o7m3N4l3K
7084cJ5n9O0o1O1k2L8qo7n9M1N8n9N8l1J6L0n6P0r6R2NJ0L6p3K7M7j3j05J72j60
7115c6Q2l4P5q8M4n5m2J38lo5j5LJ2k2k4K1L9o8QNM5j00R4j0r6J09p7K4Q3o1K0
$$ plain form
6899 52 25 -85 53 -2 7 15 0 13 13 -36 34 90 20 -5 -10 -44 13 22 -49 12 -62 100 -10 8 -21 -75 -33 54 -33 -43 -4
6930 -4 -35 -35 -6 31 -66 3 0 24 80 -47 -8 8 -44 104 -8 12 92 -30 -28 -10 59 -22 -34 16 2 0 53 3 3 30 -52
6961 -52 35 -92 -17 -56 -23 -17 -23 -93 99 -66 -8 -55 -30 -48 -76 42 -9 4 -9 -13 -4 -37 -22 -56 25 50 -27 42 31 15
6991 15 19 120 21 -3 57 -2 55 -76 -14 27 40 -8 4 -48 -54 -56 -13 -40 33 -40 -48 -61 7 -64 -39 7 17 -53 -38 1 -43
7022 -43 -18 22 60 11 -29 37 36 -22 -8 7 -25 -45 73 5 44 62 40 10 -26 -3 45 -10 -30 -39 -110 8 -36 6 -51 -90
7052 -90 -21 -101 -59 1 18 -21 4 -43 -29 26 20 25 -77 13 16 -4 -4 78 24 12 49 8 -14 9 73 44 84 17 -26 28 -5 -3
7084 -3 12 -47 13 -48 13 -9 29 21 -46 -105 -64 -6 -65 -7 -38 -22 8 -48 22 -74 18 23 33 69 -4 23 70 57 -48 124 -36
7115 -36 46 12 87 -1 43 -12 -54 84 81 16 1 4 16 -6 -30 -9 30 -38 -30 -25 20 -80 14 4 -92 17 -60 -36 47 -14 6
7146Fm6O4q9J07pl5P8n6l4K2M2Rl0pl1N1M1l4mM5j21J3L4K9l6N1j07k2L6M0K4
7177C3l9M5j61J43j12K8P8K5j00P8n9j2O0Nl7N4N8j00J7O5j05R5p8PM2j7m1J1
7205a7l4N3J5l4R1n1j1p0J1J7l6lk4L5O2l8L0j5kqJ5R7k12O7O5Om3P6n6N6J3m8
7237GL8p4N0K3p0N9j5J02o8m8k4L6M2o4J2p4J08k6J2K5n2k7J01j50M0M8m3n2M7
7266c7L6n0Pj6O0m2m3J07p3K3M4jK7p1Q2r2Q0K9n5L2NR2j07J1Kj09M4QnK2k3%
7298a3J5l5K0j6kJ8m7K2oNK6N6j0p5jk1J8O1P3j13PM1m8K1J5J7m5N2%j8%mj8M9
7332D4M2m6j8o7L7M1O1m4l4j4p0Q9l9R%k1j4L2j4q7M8J5n7J40j6r3O5L1J28j67
7362a9LO5p7J9k2Q2M4l1pLk6k0Q2Qj30O4m5L2k6k9K1k5rQ9L1j14nJ9k4m8J8J8
$$ plain form
7146 6 -40 24 -65 42 35 0 78 22 -12 10 52 61 31 24 -7 44 85 51 47 92 -29 -16 18 47 11 62 -45 -67 -31 9 33
7177 33 -6 39 -122 21 -91 -63 15 40 -60 18 -41 -53 7 12 -25 29 87 -13 4 69 -36 59 -19 -12 30 13 -28 -17
7205 -17 -51 2 17 -17 74 23 12 -58 -47 -30 -66 -69 -93 -58 4 -34 -4 -19 -21 -29 -14 83 -129 -62 3 9 -34 42 -14 42 55 7
7237 7 45 -29 21 44 -26 33 18 120 52 4 -20 16 58 -6 6 -68 40 14 26 51 -1 -28 73 -77 -37 11 -32 -84 -37
7266 -37 -1 -51 -44 -60 0 -42 -85 22 -51 -28 16 15 42 -29 53 -39 41 70 15 47 52 144 37 48 50 -59 -15 -7 -12 10 -13 -13
7298 -13 2 -33 -13 -29 -31 -13 -60 -38 -44 -39 -13 43 33 -42 -43 -64 -46 15 88 -25 -18 23 -25 -4 11 28 -17 35 35 17 17 13 -5 44
7332 44 86 40 22 -45 -8 33 94 50 16 2 -68 21 -18 -9 -9 -30 -44 -12 -26 -113 -65 -50 -107 33 17 -76 -11 20 148 -19
7362 -19 -16 49 -28 -9 -31 51 95 64 57 60 34 14 96 104 -26 38 -7 25 -1 -30 -9 -34 -43 46 77 -37 -42 -23 -47 -95 -77 -59
7394e9PL8m0J42j13N7q8M9M0Lq5O7N8m6o1R7nq5O2J1k8M9o1K3Kl0m0l4J28p9k9
7425e0l6N1N4o2M3k6KN7rn3J0J1Pl1O1m3n8M5J3l4J44p7l4L0J5N9q6L9l9L5mk7
7457GK6J0r8Q3j04J00j0n3l8J40p9M9n0m1K2KM2k5m1J7l8P9J4k1K6o5N6k1L1k8
7487hK1Kj9J2J8l5J3L0p1L6j8j5NR5k4l4N0j5J2o8NM2j31J30m9j2kjK6m9K1K5
7519hm0j1j5MR0m4J0m3jM6krO7nm7N1qn9K5P0k8M9ko4m8O5k0k7ok5LN0j5o5J2
7554e0j8N9N7m0n1%J3K2n2L0mK8L7o3J7M4p7J22p2n4Q9l6Q0j15K6lRrN0m1QN9
7586F5nQmq6K7p0R6K3j16J24p0l5oL9O6p2J4K1j7j7j3l7K1M8K5J7j16P0kj6l3
7617e1N3QJ2Rk9pj1K6L8J0q1O6o2K2M8p3O3j11L3O6m3k3j1N5j0j5n8N4K0k5P2
$$ plain form
7394 -59 -52 -14 -54 88 -25 32 -56 -7 33 36 -49 18 76 30 -31 66 61 -24 38 49 21 70 9 32 34 4 -36 -70 58 -21 -50
7425 -50 -86 -35 19 -43 0 -26 -24 33 24 -29 -19 -8 -1 -32 29 -14 -72 -27 -14 -48 96 19 -15 15 30 89 3 42 3 38 34 7
7457 7 33 43 -55 28 -76 24 14 -39 -77 63 -16 33 -17 -58 -36 -34 8 -17 -58 -41 -79 0 14 -7 19 -46 10 -11 20 -8
7487 -8 13 15 -4 8 26 -9 4 34 -37 -1 -19 -34 -29 66 42 8 58 43 55 -13 -8 34 -97 33 -16 -28 -30 -31 -5 -54 -33 -8
7519 -8 -48 -59 -74 -70 20 -24 -14 -57 -58 -12 -14 -23 44 39 -8 43 35 -24 1 71 43 92 90 26 -22 43 23 -4 -10 -35 -32 18 3 -62 -50
7554 -50 -68 -9 48 8 -43 -43 -30 -8 -60 -30 -34 -6 31 -32 -15 29 -48 74 2 -52 37 1 81 -34 -8 -11 -2 -11 39 -2 6 65
7586 65 60 68 64 -22 5 -65 31 54 -62 62 -8 -43 -49 -10 56 -16 -2 19 2 -15 -28 -65 -44 4 29 46 -70 0 -2 -18 -51
7617 -51 2 10 22 31 2 -5 -16 10 48 58 -23 43 -19 3 51 -22 41 -70 -37 29 -14 -37 -48 7 -3 -18 -76 -22 -2 -27 45
7648D5j7q9j6O7J6Nm2o4J41J5o5O7o2m4JN2j7N5j15J22l4k9N8r7O8K2nL2Pk8j2
7679C7%M4j36mL0k9N3k8K1k1k2j3NO2j4r%mk2k7R3q0N6rOO1RKj9l1p9P7L1q8P7
7714B9J9k9jm0Lj9M2r7M7KK9m4L5L1k7lJ23j25K1%k3N5rj07P4%K8M5j15L7L8N9
7746G8o9Q6j22J32j32O5k6J0Q5j02N1l8ql4q8Q3K0J8ko8K6o9J25p4L0M8q8P9q1
7775f5K8Qj7N4j4K1n7L0m9O5J41j45MN9l8L1m1J1N3r0J8qN8ll4J7K8p7l1M6M2
7806D5no6mMj4j4R6j5k6o1KM4q3Q5K7l7L4n1m7Q7J8m8K6k4M2l9J03n3K1l9j1n1
7838e4L7O0p9N8m6qP3n7j0O6k2Jn1M0l7nj7M1m6NrL8L0n5L5j6J2k3K5j6O4n8J05
7871H1J6l9l9O1r9MJ26p8J8kl8l1Q7m4n7Q1q2M3j4KP1r3P3j24%J10n8k7R8l5p
$$ plain form
7648 45 28 -61 -77 -10 6 11 -31 -95 46 61 -4 63 1 -43 -42 10 -7 48 -67 55 21 -8 50 -47 21 43 38 70 77 49 37
7679 37 37 81 -55 -59 -29 -58 -5 -33 -12 -33 -55 -68 -63 -1 -15 -24 -24 -28 -50 -77 16 -64 -8 -17 -11 50 59 61 42 11 -68 9 40 -48 29
7714 29 48 19 18 -22 -19 -38 4 -93 -46 -44 -15 -59 -24 7 -20 -23 100 -25 -4 -4 -27 28 19 -88 -14 -14 14 59 -56 -19 19 78
7746 78 9 95 -27 105 -27 38 12 22 107 5 56 18 10 -24 -112 -29 -9 9 7 -61 -35 -104 21 -53 -23 25 -63 16 -65
7775 -65 -37 -29 -46 8 -6 15 -42 -12 -61 4 145 0 4 63 25 56 15 26 79 -11 7 -1 57 54 20 37 65 -12 -43 3 45
7806 45 40 -26 -30 -26 -40 -54 42 27 1 -60 -58 -14 -97 -12 15 -22 12 -39 -86 1 19 -29 -3 -27 15 -24 79 26 47 8 -3 -54
7838 -54 -17 43 -36 22 -24 -32 41 -16 -26 40 18 19 -32 8 -29 -34 -51 -10 -56 -51 -60 -22 8 -47 -12 -28 -16 -39 -14 -30 34 -24 81
7871 81 97 58 19 80 -19 -15 111 33 51 49 11 -20 67 23 -34 47 -35 8 -6 -4 67 -26 47 -77 -77 33 -25 -52 46 11 4
7902Dn7N9o3k4J9L2Q9q6K7M6K3j29P6m5N1J02j65j2J5P3j0kj9K9n4j3O9Oj07J21
7932E5p4j8J06%p9K7m5mm9Q4jJ1m0J4M9q9m2J34o0K3J02j57L2P5n4o6L6m6Q1r
7962dO6k3k0KK2J7JrL3j51O4l4K9j9l6K8P9n7p4N9K0N4n3m1nJ4pR2l9L5j28K8
7994e7R5j3J5j4j0K9j09R7Pqq2K3J09Kn9O9r2M1j6k2m4M9L6o7l5%n6J25K1m0k9
8025c5K4m7L0M2j20J46p4N0q9J1pJ9J5J5O4l2j2k5N7lL7k8j5j16J26Nm2L0l2L5
8055B9Kn4J0%l9L8n7J8L1n4O9j7K1m3P1J0q7p2J05J2K5K1j14R6o2j9J02n7K4L9
8085D8m6J3pkK2K8j2k1m4Q5o6rK6J6moP5q6l8J0k0O5N2j36L8k8M0k8L6j1p2R1
8117Iq5J5P1L4j09Q2qo3MP2O5p1jN7k9j05P0j9K8K2l5P5o9k4M0l8L4q5LO3n4P
$$ plain form
7902 4 -53 6 -57 -81 -62 -30 59 -27 0 46 69 -60 16 -29 22 124 -41 -53 -38 35 25 23 4 33 -21 -34 35 41 -66 55
7932 55 -19 -37 69 69 -10 17 -28 -32 -81 3 2 13 -27 -13 36 -53 -95 39 -21 2 104 -53 -21 54 0 -66 -30 -76 5 -4
7962 -4 62 39 19 21 43 60 61 52 85 -66 -2 -36 -7 -26 -62 -34 45 -12 -86 -27 -7 47 -6 -47 -52 -38 -45 47 8 43 -85 -57
7994 -57 38 25 40 26 16 45 -64 33 40 32 -50 -27 82 84 25 94 2 43 27 5 -39 10 46 -21 -56 -56 -112 13 34 -6 -35
8025 -35 -11 -58 -28 14 -106 40 -34 16 -73 -62 -69 -50 -35 -20 44 12 0 -25 32 29 66 38 23 -93 33 38 -4 26 -6 29
8055 29 31 -23 -13 -13 -52 -14 -71 -53 -22 -76 -7 -24 -3 -46 25 35 -52 -124 -19 -7 18 39 -75 21 -41 -60 42 -15 9 48
8085 48 2 15 8 6 28 56 44 23 -21 64 -2 -11 15 31 27 21 96 10 -28 -18 -38 27 79 -57 -19 -47 -7 -35 1 -10 -82 9
8117 9 -76 -61 10 44 -65 17 9 -54 -50 22 87 16 15 72 43 -62 8 -11 17 39 4 79 10 -14 26 -12 22 -63 -60 3 -51 -44
8149d4Mj0k7K8J3m6P7m6K6j2J00k8J3j52J17o5J01k4m3L9j0P9n0k0nk2J1j6k9
8178d1P7j3k1l%k9qO4l8PK7q7J2
$$ plain form
8149 -44 -40 -50 -77 -49 -36 -82 -5 -51 -25 -37 63 35 48 -104 13 -52 49 25 -18 21 11 90 40 20 15 -7 4 -12 -41
8178 -41 36 23 2 -1 -1 -30 -38 26 -12 -5 22 -65 -53
8191e3
$$ Imaginary data points
##PAGE= N=2
##DATA TABLE= (X++(I..I)), XYDATA
0@%%%%%%%%%%%%%%%%%%%%%%jO5j28J28j28J28j28J28j92K56k56K56l20L84l84
37a92M48n12N74o38P04q17Q81r59J081j202J328j456J587j742J931k141K347k576
55a354K871l183L523l942M428m997N686o541P644r108J1171j4329J9788l1931
69b0274J10487l8542j32602J13084K554m7606L142L8180k2344o752j7872r910
81b8455K2291K8810k9782j7869J1109N284o633J4440M774J007O627m023j8521
94a0941R005J5979p668j0105R257q34q375L723N865m845M14J243p278l489O917
109a132J179l630K050K732k434o10J561O1J162J271k513j237K940N62k006J025
125I81J501j454j576J84k9J32L23o48m17R62R9q73K78J068l70o32J66L48N4J49
$$ plain form
0 0 0 0 0 0 0 0 0 0 0 0 0 0 0 0 0 0 0 0 0 0 0 0 -1 64 -64 64 -64 64 -64 64 -128 128 -128 128 -192 192 -192
37 -192 256 -256 318 -320 384 -433 448 -511 570 -632 696 -760 827 -915 1016 -1125 1222 -1354
55 -1354 1517 -1666 1857 -2085 2343 -2654 3032 -3509 4135 -4973 6198 -8131 11657 -20274
69 -20274 90213 51671 -80931 32153 34707 -12899 -9757 28423 6079 -673 -18545 -28455
81 -28455 -6164 22646 -7136 -25005 -13896 -8612 -15245 -805 3969 4976 11603 7580 -10941
94 -10941 -1936 14043 6375 -3730 5527 4693 -3682 41 5906 1061 1475 2718 -4560 -8049 -1132
109 -1132 47 -3583 -1533 1199 -1235 -1845 -284 -223 939 2210 -303 -1540 1400 1962 -44 981
125 981 2482 1028 -548 -364 -393 -261 62 -586 -1003 -41 58 -815 -537 531 161 -471 -305 43 97 246
145B46j3r8K81k1n00O7K89j35k15ML7j9P6K7j20P6L8j18n0L4J76j02O0l2L4N2
171G4K0n9pN4J1q2l7J17j05j7J36o0m9l3k0P7m6k1j4J06m8Om9L6%K5k4k6P3Ql3
202A3J6K0m8k7R4j31J03K1m5o8N9l8mN7Nk9L9n3L1Kmj4N3j67J42L8j05K4K6o2
232e2L6J03k8r0K7O0p3P4j03J21p9O9m9j0L3L0j2n1l4N0o8LJ05k3k7K7n4L9P4
261I8q3j2p2Q7n1K3RLM8j15kl4R3l4J4O9kK2j09L3L0l8J1R0j69M5pl2Q5L0l4M7
293D3l8j0N2j0o5MJ0K2Rk4O0J2r2K8K4m5L8J5j5j9l7j6O9n2l3N6nP8k5M9r8Qj1
326a8P3m6n2nKJ08r2Pm1P4p2P4K1L7k1k2J4K7o6M0k6k3%o3L8L2j01J96j74Q2L6
357C9o3P1N2j42O6p9P3K0o8K3J9J0q0J05n7M2n7k6J1N4J9k9j3J03q9k7j3k4Q3
$$ plain form
145 246 233 135 416 395 -105 -38 251 116 -99 -95 -58 -77 -1 26 -94 -18 20 -98 -148 -114 62 -40 20 -12 22 74
171 74 94 35 28 82 93 11 -26 91 -14 -31 105 45 -4 -37 -57 20 -26 -47 -61 45 -3 3 -46 -10 -10 15 -9 -35 38 46 13
202 13 29 49 1 -26 68 -63 40 61 16 -52 7 -31 -35 22 27 -2 37 -16 15 17 13 -1 52 -115 27 65 -40 -16 10 -52
232 -52 -16 87 59 -31 -4 56 -17 57 -46 75 -4 65 16 6 39 69 57 6 -28 22 -46 -43 62 39 12 39 -15 24 98
261 98 15 3 -69 18 -33 -10 -1 2 50 -65 -67 -101 -8 -42 -28 41 39 61 -48 -15 15 -23 -12 78 -91 -46 -53 -85 0 30 -4 43
293 43 5 -5 47 37 -28 -24 -14 8 17 -7 53 65 -27 1 25 -20 18 33 18 -1 -38 -54 15 -37 -70 -14 -19 59 34 83 -15 -7 -18
326 -18 55 9 -43 -48 -46 62 -30 -23 -64 10 -62 12 33 70 49 27 41 68 2 42 16 -7 -7 -70 -32 0 -101 95 -79 3 39
357 39 -24 47 99 -43 23 -56 17 37 -31 -8 11 21 -59 46 -11 31 -26 -52 -41 13 32 3 -10 93 4 -23 -36 -60 23
386B3J0kq5Q2jq1J15o0J1kO6j14J3LL7L6l3%r8K0J0N2o1J2O4n2J4L4kn0R2p5P7
419E5r7P3m9RK0l8R3j47J53r2M0o5J4M4rr6J24m6j0L3m4N1M2r0K0K1o7K4M5Jl4
450b2m6J42m9j8m5N5j2Jom8J13Qm6N9oj09K7R0o8K7n3J3l6P8Ml0qj4K0n7N2K7
482D3n1qj1L1m7Q4L0j15RJ1L9k5m9P8j3Rj5r5J30m9L8j3m4N2p0O7J8l6n6R4m8
513a2j7R4Pj14K8J9oKn1Nnk4O5PJ2j09M6K6J5Q0j20Q0M0j7q9Q5l2K8n5q5O6Q2
545E1%q7l7R0Mj7m6M3j9O1l0M1j37j5N5jJ0l3J16l0Ol2J7n6P7j05RoJ39Lj22N8
577Gnp8O1J1O2q4L2Q6k5r7L3j4rN8r3L8j4kNM4J5J4m5m3K9K0P1r5p5J34l4m5j7
610e5J13q3On7J12p8O2k3J4oLL2k1J4l2k8KP9m4L2j5l5j7L7K2m4K9L8Pl5lp7j6
$$ plain form
386 23 33 31 -54 28 27 -54 61 1 12 10 76 -38 -25 -22 15 51 18 18 -80 -60 -50 2 -59 -47 17 -35 -21 13 11 -39 53 -22 55
419 55 -42 31 -18 -9 11 -27 66 -81 72 -20 20 -45 -31 13 4 -92 32 -14 -24 9 -35 16 58 -32 -12 9 -58 -34 11 12 -22
450 -22 -68 74 25 7 -38 17 5 6 0 -48 65 73 27 86 80 -29 -2 88 20 47 -6 7 -29 49 53 23 15 1 21 -36 16 43
482 43 -8 -16 -27 4 -43 41 71 -44 -35 -24 15 -10 -59 19 6 15 0 -95 35 -14 24 11 -33 19 -51 16 34 -2 -58 36 -12
513 -12 -29 65 72 -42 -14 5 -1 1 -50 -45 -50 -74 -9 -2 10 -99 -53 -27 -12 68 -52 28 68 51 -38 47 15 43 -12 -97 -31 51
545 51 51 -36 -73 17 21 4 -42 1 -18 43 13 54 -83 -98 -43 -44 -34 -67 49 19 25 -7 10 -46 31 -74 -65 -71 68 71 -51 7
577 7 2 -76 -15 -4 58 -26 6 92 67 -30 3 -11 -20 38 -55 -17 -31 -33 -28 16 31 45 0 -43 -14 6 77 -18 -93 41 7 -38 -55
610 -55 58 -25 -19 -76 36 -42 20 -3 11 5 8 40 19 33 1 -27 -25 54 10 42 27 -8 -25 12 34 -10 19 57 64 29 26 -51 -67
643f7O7jj4k9L9J4o2J19o7m4P8m9Q2o4N4j32P5k3J8k6j2O0n5n3J49r2PP3l6K6
673C5q9L4%lj9pP2n1K4L9r5O0Nm4j5K6j2RO0K4q5L5Pq8O9Lj7Qk5N1nj8lJn3N6
709a1k9%L0J0Jl7M2rm1J02q1K4J0k4M9k5M0p6rpJ08k3n8Q2n3R2q2j6j8O0j24O3
741a0k4R3j20J5P7p4N1K3n6jQm3P5m1QP4o4l7J4Nk0J05r8PL8jL8j6n7N7k3m9Q6
774D0k0oJ1n4N6m7Q9q9mp5J10R5o1j6j1N4q2nj6J32r1p9L0L3LJ7J5npJ7m5N9p2
807b4P3K2j09M3m6J2O8k8m2M1k6lR3r5lO2m1p8O9J3RM4m0N5q0L2K1k0J6j5kJ3
839C4l3m0M7K9j6mn9J6Q2j4l1K0k1joQm2J6L6K6J6m6l5n1J27p2K0q4K1J42o8k7
871a0j0m7M7O9m7%L1j6l8K4J7k8K9j8K4ko5J8N6m4Op0P0j4l6P6p1P1Rp1M6K5o0
$$ plain form
643 -67 0 -1 -15 -44 -5 9 -53 66 -1 -45 33 -16 66 2 56 -76 -1 -24 -6 -32 -44 16 -39 -92 57 -35 -28 45 9 35
673 35 -54 -20 -20 -23 -42 -49 23 -28 -4 35 -60 0 5 -39 -54 -28 -40 -31 29 53 -32 3 10 -78 -9 -6 -23 -15 -40 11 6 -12 -15 -14 -67 -11
709 -11 -40 -40 -10 0 1 -36 6 -3 -44 58 -23 1 11 -13 36 11 51 -25 -34 -41 67 44 -14 68 15 107 25 9 -9 51 -73 -10
741 -10 -34 59 -61 -46 31 -43 8 31 -25 -26 -18 -61 14 -27 -19 55 -9 -46 -32 -27 -47 58 -40 -33 5 4 42 26 -31 26 3 -46 40
774 40 20 14 25 -29 27 -20 69 -20 -24 -99 11 106 45 29 18 72 -10 -15 -31 101 10 -69 -39 -6 -3 14 29 24 17 34 -11 48 -24
807 -24 49 71 -38 5 -41 -29 39 11 -31 10 -16 -19 74 -21 -24 38 -3 -81 -12 1 10 54 14 69 -11 21 42 22 38 23 21 34
839 34 1 -39 8 37 21 17 -42 -26 56 42 11 31 10 9 3 11 -31 -15 21 47 63 17 -18 -69 58 -14 6 -78 -57 85 17 -10
871 -10 -20 -67 -20 49 2 2 33 17 -21 3 20 -8 21 3 27 25 -40 -22 34 -10 -4 -74 -4 -18 -54 22 -49 22 31 -40 6 31 -29
904b9L9l0P7p5K1j5j9M8J1n2LN6p0L7N3j22N2j8J00p1o5K2J34o1L0p1Kk6L4l0
934c5J1J41j45Q2q7K8kq7L5J08r9R5j0n0pL1MN2n8k7lj5L4l9MQ4J8p2J9j7m9p
966f3N5J7p4L1L7M9l8L8n1R3j32J9N4Ro2O1nm9K7J8Nn9Q6q1L4j2n7N0rLJ5j7L5
999B7l9L6kn1P7q6K4nOQm6N0j4P2n5p3J26n9K3j8o2O7j5O9l0om3L3l8N2k5MN4
1032F1n7j2l5J05j28j0M1J7k9O1l1K3p1M7M6J8N0j10N5m4J0K3l1n4N4N7p5k7L0
1061a6OL0prl0jR0j06P2q7O1r2L6P1j0k7J8L9k8j5j3L2Oo3P3m7Mm6Q5NJ1q0M3
1094Ej9NL5l9N6N5rj01Lj6J4M9k7Nk9Q2q2P6l8LMr1J6N0l2rK7k3K3M3m0q5J25
1127C6o3j4mJ9k1MJ04p7J3L1l1L1On1O3pnK5l9l5O5q0O2J6q2N5m9N2%Oq4M7K0
$$ plain form
904 -29 10 -20 57 -18 3 -12 -31 17 28 -24 -21 35 -35 2 55 -67 -15 -33 67 -4 -69 -47 87 26 56 -15 -13 -39 -5 -35
934 -35 -24 117 -28 54 -33 -5 -7 -94 -59 49 -50 45 35 -15 -22 9 13 65 7 -20 -23 -38 -4 -43 -39 45 63 -9 10 -7 -56 -63
966 -63 -8 9 -65 -34 3 52 14 52 1 94 -38 -19 35 44 -18 43 38 -11 16 34 39 -20 66 -15 19 7 -50 0 -9 -6 9 -8 27
999 27 -12 24 22 -29 48 -38 -14 -19 -13 -5 -51 -1 -15 57 2 -71 55 -4 19 1 -61 6 -9 60 30 24 -19 14 -24 28 3 7 61
1032 61 4 -8 -43 62 -66 -76 -35 -18 -47 14 -17 6 -65 -18 28 46 96 -14 41 -3 7 30 -1 -55 -1 56 -19 -46 -16
1061 -16 -10 20 13 4 -26 -27 63 -43 29 -58 3 -89 -53 18 8 -19 -1 38 10 -5 -18 14 20 -43 30 -17 -13 -59 26 31 42 -38 5
1094 5 -14 -9 26 -13 43 98 89 -12 -9 -25 -11 38 11 16 -13 69 -13 63 25 28 32 -59 -43 7 -25 -34 -7 -30 -7 36 -4 -89 36
1127 36 -27 -41 -45 -26 -47 -43 61 -16 -3 28 -3 28 34 -17 46 39 34 59 20 -15 50 -30 32 48 -34 21 -28 24 24 30 -54 -7 13
1160A3J5j5j0O2p1q8J39j2o1L5jL5J5k7lJ1k5r3R9l8j2M8Jk4p9P7o7J33j4l3r9
1191h9R4n9J0K9j1K2L2L8K3r4o5P7Qm3K2o8k3J27Jq3J04o1L0K8n9l6Q4n9L0r3
1221h4O3j0M8ln5KK8O4j2j01N5p4K7R8K3no6k8n0N2L8p2%R9q3M9P3k4n3J9o5O3
1253A6L4l0o4j1R9mNl1L5p5K9j4M1o0P0j9J6r2L3J8L3l4k0L6K3l8K6k9M6k6M6
1284E9j9n4J9J1o3P6k6Nj1%N9l4R8j66J19p3k1j5j3Q4mn5OJ5K0q7L2P2m3K2l5
1315b2Q9j00J15p9Mn1l3J52j13QN4p0N4N5k8m0kl5LM0k2L1MKrJ4k2jj7j6k3O0
1347BJ00j25M4QM0q5N0p2K3R5j68J02Jl1J01l6q0L2m0RP5o9nRJ7K5q1L2m0L9K4
1378dk1K1L1r8J23o1J9k0J5n2P6l0j9M6Qkj08J07po1l8J6M7Mo4p%P8n4R3r8mj5
$$ plain form
1160 13 28 13 3 65 -6 -94 45 33 -28 7 6 41 56 29 26 37 12 -81 18 -20 -32 16 17 -7 -86 -9 -76 57 43 10 -89
1191 -89 5 -54 -44 -15 -26 -4 28 66 89 -5 -70 7 15 -28 -6 -74 -97 30 31 -52 52 -9 21 49 -10 -46 38 -21 9 -84
1221 -84 -21 -31 17 14 -41 -39 -11 53 41 -60 -5 -79 -52 46 69 64 -2 -30 -80 -28 10 -62 -62 37 -46 3 76 52 -1 18 -47 16
1253 16 50 20 -44 -55 44 40 45 14 49 -26 3 -11 30 -30 40 21 37 -55 -22 -4 29 -5 -25 11 34 -4 22 -7 39 13 59
1284 59 40 -14 5 16 -47 29 3 8 -3 -3 56 22 120 -46 73 0 -21 -36 -49 35 31 -24 -18 -3 17 -70 -38 34 -9 13 -22
1315 -22 67 -33 82 3 7 -44 -77 75 -38 -30 24 -46 8 63 35 -5 -7 -42 -39 1 -21 10 14 16 7 21 -1 -2 -19 -35 -58 2
1347 2 102 -23 21 29 69 -16 34 -38 -15 80 -88 14 15 -16 85 49 -31 1 -39 -30 45 -24 -29 -20 -3 22 -59 -27 -67 -28 -4
1378 -4 -25 -4 27 -71 52 -9 10 -10 5 -47 29 -1 -20 26 34 32 -76 31 24 -37 -75 -59 -12 -8 -72 -79 -79 -1 -55 38 -60 -64 -79
1411g9M1J4M8p5M7K3n0J3lJ3l1K7M0kj9m8J7q1O6P5k3K8L6o5noK3J4k5Kk3Q9o7
1444A4J3k8L8l1RK1j5jj1J4K3Kq2M9Qn6Lo3R7k6K5l9O6m9P1q7QP7r1J1lN8J7r4
1478e2R5k6M6o2L8j13M7N1N9k5no4k9N9K2J3j3o3M5n5L2M6q2P4r3Q8k4m0O4k9
1508DK7m1L4m8mN7l3N2j2k0j4m5O8o6N4r8Q3p3M6M1l4m1N9N8j02L1M0o7l0J25
1538E1o2K4k4k6R0m8qk4J4m4L0K5j3M3p2J05m2j8N3K7q4O1j9o3k4M0N2l2l3J9
1568bO0k0o1k9L9M0K2j01J1N8J6m2M3p0N6r5M0k5L8RJ1L2o3rK9J7j7k0l3R7Pm
1600C4o2P2l5P6j82P5K7l1j3P4p2J9lM9l2o6j3P7L7mo7O8o3J8m7P6L8j28J27o4
1630a5N1l5J4k9j5O7k2j5n6J39j24R3o0j8Q5j64J01j7K7o8L3J01o3l7O5k5J2m1
$$ plain form
1411 -79 -38 -24 24 -51 -4 19 -31 -18 -21 -8 -39 -12 28 26 7 -41 -24 -105 -39 36 13 41 77 12 7 1 24 38 13 15 -8 81 14
1444 14 27 -1 37 6 15 36 21 20 9 23 46 48 -34 15 23 -33 -30 -93 4 -22 3 -36 30 -19 52 -35 -27 50 -41 -30 -33 25 42 -52
1478 -52 43 17 63 1 39 -74 -27 24 83 58 53 -11 -40 19 41 54 41 -22 23 -32 0 46 -36 38 -55 33 9 -31 33 4
1508 4 31 -10 24 -24 -28 29 -4 48 36 16 2 -43 25 -41 13 -85 -2 -75 -29 12 -22 -63 -4 54 -48 -17 23 -44 -74 51
1538 51 -11 13 -11 -37 53 5 -3 -27 -13 -57 -27 -2 -15 28 -44 61 19 1 54 81 -3 58 39 -24 -48 -8 44 12 -21 -2
1568 -2 58 38 -23 -52 -13 27 49 -52 -41 17 33 -9 34 -36 20 -75 -35 -60 -22 -13 -2 30 -33 -42 -13 4 -13 -33 -66 31 38 34
1600 34 -28 44 9 85 -97 -22 5 -26 -39 35 -37 -18 -21 28 -4 -70 -83 -6 31 27 -40 28 -35 -17 -64 12 50 -78 49 -15
1630 -15 36 1 15 -14 -29 38 16 1 -55 84 -40 53 -7 -25 60 -104 -3 -20 7 -61 -28 73 10 -27 38 13 25 -16
1658a6K1p3L0L4J0m8P8o4L8m9M3n5M7m7L5L2n6P9o4J01j10J0N1o7L3Q3j2Jm9J9
1688C5J3o5kM8p4L3Rj1k8P8p6OJ02k3n5J3j9K0l9kjK2K8J4j4q4O2RrpJ0N6m3K3
1722B9O8j37J6M1Kj0J1q7O3M5%m5p7J34k4k2L3j02J07j8J6p2J02o8P1n8l6L1l0
1751a7kJ7L9m9l5l0O5J7l3MqRPL0nRO7j08J38n3n9N7n8k9l2J17r0J4Q8o9J7k3
1783eL1k0rn4O0Kj2K8k4j7R6q0J1p1L9jNJ19r1n1K8M0l3jM5k2ol3q8J00N6l5L3
1816D0j3l9N6p1J74j51l0K5N8rM0q5M5j9k5Q8j45J44o6q9J09o7j3n4Q0o8O9m2
1844e8L0l4L9K6m4j6L5P1l4nj9J07q9K5qL1l7K5o7J8M3l3N2r7P4m8P6q5jJK7l2
1876b7M9n2L0m0M6k1Ko8J19n3j4L8l3R3p6Om7Q6q8J6k2l9J11K4k4k9N0j2o0Q5
$$ plain form
1658 -16 5 -68 -38 -4 6 -42 36 -28 10 -39 4 -51 -4 -51 -16 16 -40 39 -25 76 -34 -24 27 -40 -7 76 64 65 16 35
1688 35 48 -17 -19 29 -45 -12 -3 -14 -42 36 -40 -34 68 45 -10 3 -16 4 -35 -37 -38 -16 12 26 12 -72 -10 -1 -10 -17 -7 49 6 29
1722 29 97 -40 -24 17 19 9 20 -67 -4 41 41 -4 -81 53 29 7 40 -62 45 27 43 -29 73 5 76 18 -18 13 -17
1751 -17 -19 -2 37 -12 -47 -77 -12 5 -28 -24 -32 -23 -16 14 9 18 85 -23 115 62 3 60 2 -27 -59 58 -32 -18 70 1 18 -5
1783 -5 26 6 -3 -57 3 5 -7 21 -3 -20 76 -4 7 -64 -25 -26 -21 98 7 -44 -16 24 -9 -10 35 13 7 -26 -114 -14 42 7 40
1816 40 27 -12 44 -27 147 -4 -34 -9 49 40 80 -5 40 21 -4 84 -61 83 17 -72 37 -30 -43 -97 -17 -85 -16 -58
1844 -58 -28 -62 -23 3 -41 -57 -22 49 15 10 -9 98 9 34 26 57 20 45 -22 -4 39 6 58 -39 35 -13 63 -22 -23 -22 5 -27
1876 -27 22 -30 0 -40 6 -15 -13 -81 38 -15 -29 9 -24 69 -7 -1 -48 38 -50 -34 -56 -95 16 40 16 -13 37 25 -35 50
1906E0L0p0k5K4n6M3O1q1j2K0Kk6J5J2k6pM3OK7o5k6Q7o8N6k3rl0OM7K2Kk7k0
1939a8N1J1n8J00p1mO0q9L4p8J2O6m4J2J5p7j5J04J1l8J3L8r9M3k9JN6L3p6L8
1969Bm8N9k4R8m7L8j20M8L7J9j04j8L6O7Pj19J18k4k3R6j1j08Q9m3Lq4M7k6N1
1998A6l8L7J4J5n8l2N2Pk0j18J53r3J26n9M2r2N1j6R1r4k4K0J6rJ7m8M5J5J3o7
2028c8P1p8J06lj24R0n0j4QQ3q3P3n7P0p3L2n4Q7l3k9J7lk8K7rJ4L5K3q4J4lO6
2060E3%l4l5N2l9m6L4Nl0L1M3m1j5L4NQrm3L9j4Jk2L%l1JJ13q8k9N9pN6n6l4O7
2095C1lj7rm5P3o0O4n0M3rQ1j22j9L7N4j26J19m2k1n8M5l2N6k8K1K6N2J8r5R0
2125G4j48L8K5nO5n8KL4j9ql6L8rk3j0J9J0rk3J06o3m0K2K0L8n7L7j0l4O1M1j28
$$ plain form
1906 50 80 10 -15 9 -47 -4 57 -24 -36 -16 -14 -40 -25 -13 -39 -46 -3 3 30 -35 -61 26 -42 14 -9 -18 -48 -42 5 27 29 2 -18
1939 -18 33 44 -14 86 15 11 71 -18 16 -62 -50 16 -28 -16 -1 -78 -93 11 22 -16 -3 35 -64 -21 -50 -49 7 40 -36 2
1969 2 -46 13 -11 87 40 78 -42 6 43 62 -42 -60 -24 43 50 -69 49 25 2 98 87 -21 68 25 28 -56 -9 -35 16
1998 16 -22 15 29 44 -14 -46 6 13 -7 -125 28 -65 61 2 44 -48 3 -13 78 -16 -40 -20 -4 -13 4 -44 1 16 29 -38
2028 -38 33 -45 61 58 -66 24 -26 -40 -32 51 -32 41 -16 54 -19 13 -41 46 13 -16 1 -2 -30 -3 -12 2 37 60 -24 -10 -13 53
2060 53 53 19 -16 36 -3 -49 -15 -10 -40 -9 34 -7 -22 12 17 25 16 -27 12 -2 -1 -23 -20 -20 -51 -50 63 -25 -54 5 -2 54 -2 -36 31
2095 31 28 11 2 -43 30 -30 34 -16 27 18 99 -23 -42 -5 49 -77 42 0 -21 -79 -34 -66 -10 -38 -17 9 61 79 -16 74
2125 74 -74 -36 -11 -16 49 -9 -7 27 8 0 -36 2 -7 -30 -40 -21 -11 -20 -43 63 0 -40 -18 2 40 -17 20 10 -24 37 78 -50
2157e0R4k8k7O5k7R5o8r2l4J28j60J31K6q1M9o5M4lp4P5O4p6n1K9N2J2J6m5K0
2186A9N1jj15M2r1Q0N1k5k4K8Ok3kO6j4j9JnN1Rp4r7N9O7p4M8Pn0M6r3N9o2LL0
2220d6J0NRj4P1m2N9n7p2J54j5j2j27Q8K0p1mK2J05j8n1n8J06r7M0nJ4J2K9J3
2250F8m0m2l3M7m5j8Q3J4j0K6j1o2J6L7kj6o5O7k0N1K1p9j1M6o5O3k9m7M1l7M0
2281a2L0J5o2J60j35K9Lo0N2Ok7l4Mj5l4P6j9m9L2O1p3M5l3KoN4r3N8k2J0nO3
2313B1J4j66N6J06qm1M4K4l3qj02J21n1j7L1pR8l0j00J66j34lL3p0J8M0j6P4j03
2342d3N9J6k4NLJ4Nn0l0k3J41j08rM3n6K7O9j25J21ok3K5m3O5o9N1j4m3J38r2
2372B4lK6m1Ol2J05o6l7L3j3m8R0j24J20Jr1J19p2L4n2PJ7j2K1l0l6qR0k4rO4
$$ plain form
2157 -50 44 16 -11 54 27 122 54 -38 -72 56 -104 27 53 -28 21 -44 0 -3 -77 -2 62 -14 -65 -36 16 28 44 -1 19
2186 19 70 69 -46 -4 -95 -15 36 11 -13 15 21 -2 -4 62 48 29 30 25 76 85 11 -86 -27 40 -34 14 21 -29 17 -76 -17 -79 -76 -46
2220 -46 -36 -31 -22 -36 35 -7 52 -5 -77 77 62 50 -77 11 31 -40 -44 -22 83 65 14 -44 62 -35 5 0 14 26 55 68
2250 68 28 -14 -47 0 -45 -63 20 34 24 50 39 -23 -7 30 28 12 -53 14 -6 45 66 -13 -24 22 -43 20 -9 -56 -15 -52 -12
2281 -12 18 33 -29 131 -4 25 28 -32 20 26 -1 -35 -31 -46 -80 -4 -23 -72 -40 21 -52 -7 -40 -38 -44 10 -83 -25 -47 -37 -42 21
2313 21 35 -131 -75 31 23 -18 26 50 17 9 -93 28 -23 -40 -9 -16 82 52 -48 118 -16 -19 14 -56 -38 2 -14 60 -43
2342 -43 16 32 8 13 16 30 35 -15 -45 -68 73 -35 -44 -1 -57 -30 39 -86 35 29 6 31 -12 53 -16 35 21 -22 116 24
2372 24 21 47 6 12 -20 85 19 -18 15 2 -46 44 -80 40 41 -50 69 -3 31 -21 -14 3 -9 12 -18 -54 -62 28 4 -5 59
2403E9ko5kj4K2j3%R8r1J4N0op9OJ3LJ6J6l1L5l7K0k3jL6l3k1N9m1N9l8j4K7M4
2437F6m1JN1q9j5L9M3n8j2J1j6L7k4N7o8K8J8pnP1j04N2j9l5j2nJ6j4P1o7KNn6
2470g9M1K2L3k0k1m4R1o2LJ7J5rJ5l1kQ1r0LL8n0J11n9j7k5L3O7n3k6K4M7j6k2
2502A5K2qJ2o1P0n4K7q9J22k9q0J7Q4j31L1Q1m5Nj2PJ6n7M3nm9L2N1rJ1m9MM8
2534B0n7Q8Ml8j8OL9q2J5K0M4q9L5J6j6k0M2j4p2J4J5P1k0p7JR8j1p8M6K3k2j9
2566c6K6K2M9l5j4M1l2L2k7L9o9j6P3o1M2N2j10M5Nj7On3LN1m2N9JOk4o0j4k0
2598g8L5J6l2K5O3Ll8m6M5J0k5jK1p8O3m2O5k1lN3o3N1kJ7j1n4L2o7J22k7j2r7
2630g6J68j16O8p3L6L2k1O5l2j1pl2L1nL1p5P0Jj01O3l9L6KN0p1orM4jK4m1l0
$$ plain form
2403 59 57 -8 -10 -24 -2 -15 -15 83 -8 6 56 50 -29 -23 -10 -7 9 25 -6 29 -8 12 -11 -12 24 -9 -30 29 -12 47 9 -5 22 66
2437 66 25 26 77 -12 -27 12 55 -3 -15 -4 -20 17 -7 50 -18 10 28 21 16 87 -17 35 16 -19 -31 -36 -20 -34 37 -30 -28 -23 -79
2470 -79 -38 -16 17 -3 -24 -68 23 -39 -36 -19 -4 -13 2 -29 -31 50 -40 -37 1 -49 62 3 -14 -39 -6 61 8 -18 6 53 37 15
2502 15 37 29 41 -20 50 -4 23 -66 56 27 -53 -36 48 -83 -52 29 -16 -11 -23 -16 0 -57 -14 -19 -68 -36 15 6 17 -32 -28 20
2534 20 -37 51 55 17 -1 5 44 -38 -23 -3 41 -48 -13 3 -13 -33 9 -5 -77 -63 -48 23 3 -74 -73 25 14 -64 -18 5 -17 -36
2566 -36 -10 12 61 26 12 53 21 53 26 65 -4 -20 53 -8 34 86 -24 21 26 9 15 -38 -35 16 -26 33 34 40 16 -44 -58 -78
2598 -78 -43 -27 -59 -34 29 32 -6 -52 -7 3 -22 -23 -2 -80 -17 -59 6 -15 -18 35 -28 23 21 38 27 -27 5 -62 60 33 21 -76
2630 -76 92 -24 44 -29 7 39 18 83 51 40 33 1 32 27 58 -17 53 54 -47 16 -23 13 15 65 -6 -12 -21 23 22 46 5 -25
2662b5RJ6L2p8N9KN4p6kM4r8L7oO2l7M5J1j07Q5J8q4M8p1O0o2J05m8R9j30K6P6
2693F4j2M3j02N9JK3j02J8L9l5J4m6R8l6NL9J8j14lpM7%K1J9n1J6o3M8P2o4k0
2724a1Q2q9RJ3k5j7J9M0m3j8O6k9L1j1M9m2p1K4kP2n4L3k8m5M7N7p3K0m5J8J37
2755A14j03m3M3J9l3j2J4K1l3l1L4N2j18J67j10K7m4J7L5J5j1o4j5J41q4k4K5
2782aK9q0K1O9m2qJ7Q6r2M9J3p4J2J4J9l9K7o3K5n3M8JP9o2l4pK2O4Qm0K4j9j2
2815AP8r5K4l0N7l0N4m2M4l8J4k8j2L0o9J09q8P1j13Q6k4l1mL9P3j09M7M6j31
2844g1Q1n3P7M6n7M1j8J5m6N0m2k6%j7L5j1m4m0J27K3n8p1R4j9J0J4j0q3J13r6
2874c6M4l4M9PQk3r3P4L5k3k0L6n1k0N1O1q6QO6j7l9l1O8K0j02M0oj5J06o6m7
$$ plain form
2662 -25 -16 0 32 -46 13 15 69 -7 -9 35 -63 -26 -32 30 -7 38 49 -58 27 45 -39 9 -62 -2 -64 41 -7 92 -38 -12 64
2693 64 52 95 -7 52 53 76 -26 -8 31 -4 10 -36 62 26 31 70 88 -26 -29 -36 11 11 32 51 0 16 -47 1 73 9 -11
2724 -11 71 -18 -9 4 -21 -38 -19 21 -22 -40 26 -3 28 17 66 24 -47 -23 -25 47 -7 26 -2 -47 0 57 -16 4 -41 -23 114
2755 114 11 -32 11 30 -3 -15 -1 20 -13 -44 -10 42 -76 91 -19 8 -36 -19 16 31 20 -44 -59 82 -2 -26 -1
2782 -1 28 -52 -31 38 -4 -12 5 91 -1 48 61 -13 -1 13 32 -7 20 -43 -18 -71 -23 -22 57 -5 -39 -46 -24 40 48 8 32 13 1
2815 1 79 -16 8 -22 35 5 59 17 61 23 37 9 -3 27 -42 67 -21 50 -63 23 -1 -32 -36 3 76 -33 14 60 -71
2844 -71 10 -43 34 80 23 64 46 61 15 65 23 -3 -3 -20 15 4 -40 -80 47 70 12 -59 35 16 26 40 30 -53 60 -36
2874 -36 8 -26 23 30 38 15 -78 -4 31 8 -12 24 -27 -47 4 65 -21 -13 53 36 -3 -34 34 54 -48 -8 -14 -29 77 11 -36
2905c6M4om6Q1n0N9p4N1O0p5N0q4rN5j1M7j10L6k2Q3k6p4O7j6K7n2L6K8p4J15
2935G4r3O9n6n6M2P1J4p6L6m1O5k8Pj3m1J0mL5k3l6j6R6o3Q2l7L5n0m1M6k0j3
2966b5M2q1O8m5L0J2J6m5K0jk2N6K0j8n4O1j00N4j5J2J6M0Kl2q6J26j8Nk0rnL6
2998D0K7p1P3p3M7l9klO5o3mr1J59p2O9lk3J4Rl3m8k0N8m6L4l4R9k1q0M7o5Qj6
3031e8J12l5K2k4MM9l0Ok6lM0k8L5j00P8j0l4K2K1j8l6L7m9O8m4k7M1m4j8J7N2
3062B0r0M5k5M7Lj2o3P8l5J8J6l4L8r9J64j12O1j9K2k8O1m2J2j2Jl3O6k0j00J58
3092H6j47J52j45O0O7j35%L8N4p9O2p4P7J5n8N0p4m2N6M3k8J3j0N6k1q0N8Q0n3
3121B1J3l1N0m1K3O6k8J0o8l0j8J59j34R4j26K2o7J01L1j07J05p7rmJ3M6L6k1
$$ plain form
2905 -36 8 2 -44 37 -13 46 -28 23 83 8 58 -26 -35 20 9 56 -54 -18 -40 43 17 -57 10 -6 21 -31 5 33 -41 74
2935 74 -19 50 -6 -62 -20 51 65 -11 25 -16 49 21 28 15 -26 -16 -20 15 -8 -44 -60 36 -27 55 18 53 3 -38 8 -12 -25
2966 -25 17 -64 4 -41 -11 1 17 -28 -8 -9 -31 25 45 27 -27 34 -66 -12 -27 -15 1 41 43 11 -75 51 33 38 18 9 4 40
2998 40 67 -4 69 -4 43 4 2 -1 64 1 -3 -94 65 -7 62 59 36 50 59 26 -22 -42 16 -30 4 -30 69 48 -32 15 -50 -42 -58
3031 -58 54 19 41 17 21 70 40 46 20 17 57 29 64 -36 42 32 -2 20 41 23 -13 24 -25 43 -1 -28 13 -31 -49 -32 20
3062 20 -70 -25 -50 -3 0 -12 -75 3 -32 -14 2 -32 6 -93 71 -41 20 1 23 -5 56 14 26 14 15 -18 48 28 -72 86
3092 86 -61 91 -54 6 73 -62 -62 -24 30 -49 13 -61 16 31 -27 23 -51 -93 -37 6 -22 -9 -19 37 16 -64 -6 74 21
3121 21 34 3 53 12 35 101 73 83 15 -15 -33 126 -8 86 -40 -18 -85 16 47 -60 45 -32 -41 -45 -32 14 50 29
3149B9j5Ol9%K4Q3oo8k4k8J36j22Q9l4P2q9J1K2l1NQL5Lj1n4L7Pj7j4Np8M3j7
3182c2n1L3N1lM1kml5K6m9M3Rq3P9qk6l0J28m5l6NK5j11M2M3J2N2l3K8p5k9N9
3214B4K0qk3Ro2J04m5p8QQ9p9O1j3O8o6o3N9Q7j22N7m0L7r2N2k7j2Q2n7R3r2N3
3245B4l7j8M8K3q3J5k6O6K0KN6r2N0m0O8p8J3p4R9L8r7J4j7J13q8l5j1N4pQN0
3276E8m0k7P3q4K7n2J29j10l5J16q3L9P6n6L6q3K9L8k8m4N9n6N4J3k8o8J25j1
3304F7p6j0N6j18J01j7k4L5%J8o2N3o2Oj7K8M3l1Oj7O7m6mk0O8p5R8k2n0M2n5
3335a8k5P1M6j23L5qm2Q0Jo4J9QP9J4q9M6o4j5L5Q2n9j1K0K7j01%R2l0Nrm1RL6
3368Fl9k5J5J2N7n1J05n9k8RPN5p1O0o0L4K6p1J3R2k18J37LLN8o0%j0J9pL2m0
$$ plain form
3149 29 14 20 -19 -19 5 88 82 14 -10 -38 98 -24 65 31 103 14 25 47 16 21 29 64 67 56 2 39 46 29 15 20 -58 -15 -32
3182 -32 -83 -50 1 -2 39 37 33 -2 24 -25 18 27 -56 23 15 -11 -41 87 42 6 11 36 -75 -33 10 22 74 41 69 -6 -35 24
3214 24 44 36 13 22 -40 64 19 -59 -51 38 -41 20 7 75 9 -54 5 92 -30 27 -13 24 -68 -16 -43 -55 27 -30 63 -29 24
3245 24 -13 -31 17 40 -43 -28 -54 12 32 34 90 -2 48 8 76 -2 11 -63 36 74 -23 -9 -26 87 -1 -36 -47 7 0 8 58
3276 58 18 -9 64 -20 7 -45 84 -26 -61 55 -28 11 87 31 67 -16 13 51 23 -21 38 -18 36 49 21 -47 78 67
3304 67 -9 -19 37 -81 20 3 -21 14 14 32 -30 23 -39 -33 -50 -22 21 -10 -4 -21 46 0 -4 -24 44 -31 67 45 -5 37 -18
3335 -18 -43 28 74 -49 -14 -22 -64 16 17 -47 -28 -20 59 73 -16 30 -34 -49 -14 68 9 -2 18 45 -56 -56 36 6 11 2 -39 -30 6
3368 6 -33 -58 -43 -31 26 -25 80 21 -7 2 9 64 -7 53 -7 27 53 -18 -5 87 -131 6 9 12 70 10 10 0 19 12 44 4
3400DJpl7J13n2k7M0r2J06k4j39N9K7RK8N9Pl8l1J0L2K0j4pJ3K2m8k9K0K1o7J0
3432a1oRL1j6k8L3j4Pk5k3N9m4l1k2J22ll4K8m2OK3Om9k8R1j0J2N1n9m7J4K1k2
3465ao0J13r2O2n0k9J57q0K7qp5J26j45PJ9P5p1Q5n5M0K0J8k2j01QJ6N5k0o3k3
3495f7Q9K2p2L0K4mn1Nk6J04o9k7P5n1L9j2n3LL4j2m6J22N7j12K1k5RK7o0M9l0
3526gqK1lJ8q5M2mJ1M6j3j3qo0nRM5k1P6l5J6M6j12R7q0J00L2j09K7m9MJ05l6
3558D7l2j4rJ6m9L9Pj8J1mL1m1m6j3R3m7K8j5J5l8L2M2q3O8m3N6m6k1L3l2k9O6
3590DM6q2Q2o3K0ln3MN4m1o4O4K9Rq2lJ24r3K0o3P8J1K3K7m3rl7RJ03m8q0K2N8
3623B3o8O7r2J02qk5J8m2J2mN6o7K6O8j5k6K7j5K9r8%PR4p4jj8K7m5M2jKO2j07
$$ plain form
3400 4 5 -2 -39 74 22 -5 35 -57 49 25 -114 -55 -28 -19 9 68 75 37 6 16 48 68 54 47 60 82 34 5 25 46 -21 -11
3432 -11 -17 -8 23 7 -21 12 -2 5 -20 -43 16 -28 -59 -81 41 38 4 32 -10 -4 19 25 -24 -52 39 29 41 92 33 -14 0 21 -1
3465 -1 -61 52 -40 22 -28 -57 100 20 47 39 -36 90 -55 -48 -29 46 -25 60 5 45 65 83 61 -40 -32 -16 39 19 -44 -67
3495 -67 22 44 -28 2 26 22 -29 -24 -50 54 -15 -42 33 -18 21 9 -44 -41 -7 -19 -65 57 114 2 23 -2 7 34 -26 23 -7
3526 -7 -15 6 3 21 -64 -22 -26 -15 31 18 5 -3 -63 -68 -59 -14 -35 41 6 22 68 -44 53 -27 73 105 -4 23 -26 -22 83 47
3558 47 15 1 -8 8 -41 -2 5 -13 -2 -6 25 -16 -62 -75 18 -29 -1 -16 -1 -39 -7 35 -48 20 -23 33 -13 -34 -1 -33 -62 4
3590 4 50 -32 50 -13 7 4 -49 -45 9 -32 -96 -32 -3 6 -76 -79 45 -48 -28 -91 -13 -2 21 48 5 -4 -41 -32 71 23 -57 -35 23
3623 23 -45 22 -70 32 24 -1 17 -25 -13 -17 39 -28 -2 66 51 25 52 37 66 -32 -32 -25 69 -5 -6 -24 3 -42 0 -1 1 63 -44
3656d4L4k2O5q5K8N0l1P6o8l2k2O5MMk1k1J0K8l1N8K1k2Mj9m2P8q0J4lj6N8k2
3688A6kp1L1Km5O2KJ0l3O8m4qK1p0R9jJl7m0l6J33n5M8n6J7m3L9Q1m0k1QJ5l6
3721A5K6oRj9lp0M9L7j01K0J1M1k2l4J24m3l1P4j25RqL8NM1k1l8oK3l8nO9j1J8
3754B8krn6M9M2K2q5K8N0l9j9kj9Q9j3m7j4j8M3l4l5J0m0J17l5k0j3K3k7n0R3
3785A7k3M7Km6jN1p3N2n4j0m2J62j35K2Q0k1j07N1P6j1n%Mn9P3p8J2%j3j9O1j9
3817fJ5J9j01J32j08J2l2Q0Lq6M9M7m0p0J10l3k6R5j00J7k6P2P6j57J08q7J1N8
3845C2p4N5KN4j16O7P8r1L3p5M2L3q2M0L9K3n7k3n1QQ1l7L5k8O2k7j13R1m9m0
3875h8N2O0j0KJ8J1Rm2M2m2M5m6J6j3j44J58j1K8k7K4j7K2J2o3R4n1n3l1L3M5
$$ plain form
3656 -44 -10 -32 33 -52 -24 26 -5 71 3 -29 -51 14 18 22 1 -20 -10 18 -13 45 66 44 48 29 -13 65 -15 -1 -4 -20 38 16
3688 16 14 -57 -26 -24 -69 -7 -5 5 -28 40 -4 -12 9 -61 38 37 38 1 -39 -75 58 3 51 -5 12 -31 8 89 49 28 36 51 15
3721 15 41 35 44 25 22 -48 1 38 -63 -43 -32 9 -13 -47 77 34 3 77 -48 -39 -47 -9 -4 37 16 -22 -28 -5 -43 -48 21 10 28
3754 28 26 17 -39 10 52 74 -11 17 67 28 9 7 -12 77 64 17 3 -15 28 -6 -41 -31 -71 46 11 -9 -22 1 -26 -76 17
3785 17 -6 41 43 -3 -4 47 -26 26 -28 -38 -80 82 -53 -31 49 28 -79 -28 48 37 32 32 36 -23 50 -28 -16 -16 -29 -48 13 -6
3817 -6 9 28 -73 59 -49 -37 -69 11 14 -72 -23 24 -16 -86 24 -9 -35 60 -40 -23 -49 23 99 -58 50 -37 -26 32
3845 32 -42 13 15 69 -47 20 98 7 40 -35 7 40 -42 -2 37 60 3 -20 -71 -63 18 -19 16 -12 50 23 -90 1 -48 -88
3875 -88 -36 24 14 16 34 45 54 12 54 12 57 11 27 14 -130 28 17 45 18 42 25 47 59 -4 90 39 -14 -45 -12 33
3905C3n4l5R3k4m4J00o5N6p6o8Q4j1m1M7qJ16p3m1J9n5k8R1M8qm8jk4j1N7qkM4
3937F3J2o6J9L2r3O4k8k0K1K1j4l5kl6P9n7K6P8q1Lj3J1Q5p8k5p3J65r2J8L9o2
3968c9P2k5P8j66J22r7J14k3k5Mjqjk5L7q9J19Kj20K7Q4p8M1ql9O4rk9j0J5j1
3999b4m0%P9P7n7l6Q9j71J06q9J08KLk3l0l3J02l1J2L3l8N8j38J49o8j6r4O1m
4028a3Jm8N0m6J0J9J5J5l7Q1m3n3O3%oqN8j0m3j8N0O3r5PJ1Pp2J09m2j17J26p
4060B7J1K4r5M7J5m8n3P7m8O3p6L3l0K8LRm1J08q3j13J40j0rj4pM2M0J8j05J04
4090E7k8j3L4p4j4O0l6k2O4k8O3j2n5l8N9Kl6M2pK0Mn5n7M7k4M2Qk2j9j8Rj1O3
4123Ej4K2m8M6k4nl1L1N6Mo4Q3r4K1m4J32nr2O1m4Jlk6O3p9P7p7L4K4J3rm1Qr
$$ plain form
3905 33 -21 -56 37 13 -31 69 4 60 -16 -84 0 -11 -52 -5 -13 103 30 -11 8 -47 -75 16 64 56 8 7 -17 -28 29 21 19 63
3937 63 75 9 28 60 -33 31 3 -17 4 25 11 -24 -26 -62 17 -40 -14 64 -17 -14 -27 -16 69 -9 -34 -107 58 -34 -16 23 -39
3968 -39 33 8 86 -80 42 -55 59 36 11 15 14 6 5 -20 17 -72 47 49 -71 -44 40 -38 3 -5 -44 20 11 -18 -28 -13 -24
3999 -24 -64 -64 15 92 35 -1 88 -83 23 -66 42 44 47 24 -6 -39 63 32 44 77 39 97 -41 108 40 24 -70 -9 -13
4028 -13 -12 -60 -10 -56 -46 -27 -12 3 -34 47 4 -49 14 14 8 0 58 48 5 -13 37 100 5 12 23 30 -42 67 25 -92 34 27
4060 27 38 62 -33 14 29 -19 -72 5 -43 20 -56 -23 -53 -25 -22 -13 -54 54 -29 -142 -2 -12 -21 -35 -42 0 40 58 -47 57
4090 57 29 16 50 -24 -38 22 -14 -36 28 0 63 51 -4 -42 17 19 -17 25 18 38 42 -13 -70 -23 -47 -5 3 -19 -38 -56 -47 -58 5
4123 5 -9 13 -35 11 -13 -18 -49 -18 38 42 -22 61 -33 -12 -56 76 71 -21 40 -4 -3 -6 -32 31 -48 29 -48 -14 10 23 14 -27 -19 -28
4157b8J4M4k1K0l9l9Q6o6o5O5k6m3L2R9o9J11m9n8l9J07j05Q5L1K7k7j24J48o3
4185Hk7M7ko2O6j0q1L7j2m0N1N9o1OJ9n9L4PK9k7n0J9L1k1J5R4r0j4J9N5m3mR
4218Bm5Q6m1J6l7m5R6N8k2p9OP1j27R7p4R0n9K8j7m1Mkm2J6Q9n8K2kM0o5%RN2
4251B6m7j7m1J10K7j04k1J44k9mj08N8on7rQ7L2k0j4J5ljN3ql5j5k4m7P0J9l2
4282an5M9%o3K0j2Q1k2pJ6m2L7J12j70L5N1n9J22k0n5m4J2j5M4j6KJ2J5n1K4K3
4313B3m5K3Q5j03o6J11l4K0L6J6j3r7j6O3M0m4oNM2l6jO7p5m8O9qJ8%o6J01o1
4344@O1o7O4l6m3R6j11K7K8nj2L9opp1R0l4Mj1m2J06q8O1j1K1j41l7J05P0l2r1
4375g3J55j62J2O3k6L1qMl0J4N5q6P5j1k9qKJ03o1K2JP4j56J9P6kp7K7k8OO2p9
$$ plain form
4157 -28 -14 30 9 29 -10 -49 37 -29 -94 -29 -55 -98 -66 33 -36 75 26 -32 -71 36 -69 16 47 74 47 -77 71 8
4185 8 -19 28 26 -36 30 20 -61 -24 -36 -76 -25 34 -27 -21 -2 -61 -27 -20 9 -18 -68 -49 -18 -39 -24 70 -20 -34 -15 40 -3 -7 2
4218 2 -43 43 2 18 -19 -64 32 90 68 -11 -5 66 -61 36 -38 52 -7 21 4 -37 -33 -35 -77 -61 28 -30 -8 -10 30 -35 -35 -26 26
4251 26 -21 -38 -79 31 58 -46 -67 77 48 44 -64 -6 -12 -69 -78 9 41 21 7 22 19 18 71 63 28 13 -11 -58 12 31 -1
4282 -1 -56 -7 -7 -70 -50 -62 19 -3 -10 6 -36 1 113 -57 -22 29 -30 92 72 17 -27 -15 -30 14 -2 0 12 27 -24 0 23
4313 23 -22 1 86 -17 -83 28 -6 14 50 66 53 -44 -60 3 43 -1 -7 -2 40 4 3 70 -5 -53 16 8 26 26 -40 61 0
4344 0 61 -6 58 22 -21 75 -36 -9 19 14 2 41 35 28 -43 47 13 17 6 -36 70 -18 43 32 53 -88 -125 -20 50 18 -73
4375 -73 82 -80 -68 -5 -31 0 -8 -4 -34 -20 35 -51 24 13 -16 -24 -22 81 20 42 43 117 -39 -20 56 54 -23 4 -24 -18 44 -35
4407c5j7Q2k2L2j02N4K1l6j9R6p1p8J05J3m9P7k3k4Jpm5M5L2Mk1K6o4M8Rj24J27
4438C5Qn0L9L8r0mK4m2JJ7K0Ll4NN4l5O2n1KK6n6%N7m8m8J09l6J0N0o2l5Q6m0
4471A5J6j35J35rj8n6MM6j9M5k3k3J08j19L5J3n2J12o5Mq5O1j8K9j3K6L8r3J1
4500c0M1j3K0M2r9K5K7J1r9N3O2l4K8n0N6k8l8K7R4p9j0N6l5o2P9j5n2N7m7O4
4530E1k2J8l7O6k8p1K8M7o8jN5l7n3M6o2P9K3m7l8P0k8K4Q9j12L9m6R5l0k3K8
4560E5j0Lj6l1J04o8r5M3O1l4J4l0J8J8Mq4J0R1l1k7m1J7Kn7P8L1n3j2mM1ql6
4592d7O6L3K6o9j13R3K6K5J9p8L0k6N3Nk8m9L7j8n5R0k7j4N5l9K3K6jq8J04r4
4622c5J6m7O8l3k4M4p5Q2j7O6o8P6o3l0m1J04Q9j11k0O0n3M5k6n8J7N3oJ6j5l3
$$ plain form
4407 -35 -52 30 8 40 -62 -8 13 -23 -42 54 -17 -95 10 23 -26 51 28 4 5 -2 -47 -2 30 34 13 39 -25 23 32 -92 35
4438 35 43 -7 32 70 -20 -24 0 -42 -41 -24 -4 -1 -35 -30 24 -11 51 0 2 28 -28 -28 29 -19 -67 42 6 16 66 4 -31 55 15
4471 15 31 -104 31 22 4 -52 -48 -2 -21 24 1 -22 86 -33 2 15 -37 75 10 14 -71 -10 -28 1 -12 14 52 -41 -30
4500 -30 11 -2 18 60 -39 -14 13 24 -75 -22 40 6 34 -16 40 12 -26 1 95 16 6 62 27 -35 44 29 -23 34 -13 51
4530 51 29 47 10 76 48 -23 5 52 -16 -17 38 1 -52 -6 -68 11 34 -13 -51 19 -9 15 104 -8 31 -15 80 50 27 55
4560 55 45 48 32 1 105 37 -58 -15 46 12 26 -4 14 32 36 -48 -38 53 22 -5 -46 -29 -27 -84 -6 25 -28 -40 -44 -3 -11 -47
4592 -47 19 52 78 9 -104 -11 15 40 59 -19 11 -15 38 43 15 -34 3 -15 -70 20 -7 -21 34 -5 18 44 43 -45 59 -35
4622 -35 -19 -66 2 -31 -55 -11 -86 -4 -21 45 -23 53 -10 -40 -81 23 112 1 -19 41 -12 33 7 -51 -34 19 13 29 14 -19
4652a9M9K9j30K00j36R0p4q7L6N4rq0Q2l6N7k5j9k6JM5j9l6J5PJ9L3J9n1J6j8
4682a3K7l0Q5l4O7p2l7J2L7j8Lk4M2r8N9Nr8L1J03p7MP9m1j08J15r6mP8k1L7j7
4713dk6o5P5M5q6J07j01O6N2p8P9q9J3P0j7o6J03q7R5q4JL8L7j02M8j7n1J30j38
4742e2Q7m9m2J44r7L6j01J35m7n8Q6m1k9qn5N0P2p2P7k6pN4q4O5j6l9L0Pk0NO
4773A1P8j36R3j08O9P0r8L8KJ3n7L4J00m3n5j4n2K5L8Lm1L7m5K8K9Q5j61J15j20
4802f2R1l7Rm6N2n1L3N3l0L1j7m7L6Q3l8j01O8j9k8P9n5K6J3l5N9p2Q3m6rOL7
4833F6j30PN0o0J18q8qMN8Oo1N1pL4j8j0Jj9P2q9L0M4r8M3l2K5O2Rqjj09K6K3
4866iO1p3P7k4l4J6oo6L2J8L4%n9k8k7J07r3O2J8J7o4J7k2J6O6p3J70j28o2J14
$$ plain form
4652 -19 30 59 -71 129 -7 83 9 -78 -42 12 3 -77 5 -31 26 1 -18 -44 -43 2 -17 -53 -38 -31 -12 21 40 -11 5 -13
4682 -13 14 -16 69 35 102 30 -7 5 42 24 27 3 45 -53 6 11 -87 -56 47 -30 -26 53 12 -96 19 -77 -81 -3 -24 13 -4
4713 -4 -30 -95 -20 25 -61 46 -55 11 63 -15 64 -25 -12 58 41 -25 78 -9 86 2 3 41 78 -24 24 7 -44 86 -52
4742 -52 35 -14 -56 88 -9 27 -74 61 14 -44 42 1 -28 -36 -91 -41 31 -41 36 10 3 57 -27 38 22 -17 13 20 0 5 11
4773 11 89 -47 46 -62 7 77 -21 17 19 32 -25 9 109 66 11 -3 -55 -30 8 11 -30 7 -38 -10 19 104 -57 58 -62
4802 -62 29 -8 1 -45 7 -44 -11 42 12 43 26 -21 15 98 60 -41 27 8 -20 59 4 30 43 8 67 -5 78 32 23 29 66
4833 66 -64 -57 -7 -67 51 -37 -45 -41 17 23 -38 13 6 40 22 12 13 -6 66 -23 7 51 -47 -4 -36 -11 51 60 52 51 -58 -32 -9
4866 -9 52 -21 56 32 -2 14 8 -58 -26 -8 26 26 -33 -61 -88 19 -74 -12 6 23 -41 -24 -46 -30 36 -37 133 5 -57 57
4896E7l9K0J4M0p9L2N4n4n0K6OM4k0q6O2K9m7K0Jn4P5p9o6M2k2QO8j3j1j5n3J12
4928B2l4K5o4jJ55j28P0n9Q0o9J9nL2J0n4RqP3j36J16j9m9O9j6m4JL9ok8m4N2
4959HJ1K3o8K1L2Lj31J27m1K5M0n7J21n7p1L4o2J2K5J4j1p1J13m4p5N8MN1k1P0
4989H3p6l0P2Jl6K6p7K8N3K1p8m8O1j6k8L4rQ1o3L0N8j12m3P1K8k5J1nJ1L0M0
5020I3l1k4n3O1P6j05n2M7m9M3N0k8l2R0m7M5r7LJ39j74R9o0M3J6k7om2k7oO9
5050A4j5L1k2kmOn2N1QqK5N9r9n9J2J01J2N1r7O0k7jO0j10M9l3JRm5O8m4k2Q7
5083F4p7j5J2J4Kl7L3L9k3MnJ21j25N1o5l9M7k3o1P8K7n4Q0j7o6Pj0Q8p6LK4L2
5115C3m2K2lj0Q9r4JKQj13R5P7j24j2P4Po0lmR5n2j0l8L2nR3Nq4R2j0n5K2j9L6
$$ plain form
4896 57 18 38 52 92 13 45 99 45 -5 21 27 71 51 -35 27 56 9 29 30 -24 51 -28 -94 -52 -74 -66 2 -11 -22 -37 -90 22
4928 22 -12 13 -51 -52 103 -25 45 -14 66 -3 16 11 43 53 -1 8 0 73 -63 53 34 -15 54 38 -6 -5 34 28 0 -44 8
4959 8 19 42 -26 -5 27 30 -101 26 -15 10 50 -7 114 57 -14 20 -42 -30 -5 9 -2 -73 40 -4 -79 -21 -17 34 13 83
4989 83 7 -23 49 50 14 40 -37 -9 44 65 -13 -61 0 -16 -44 -10 -19 62 -1 29 87 -25 -68 3 31 6 17 12 23 53 93
5020 93 62 38 -15 46 122 17 -35 12 -37 6 56 28 -4 86 39 84 -13 -10 129 -45 54 -6 37 53 26 20 -22 -49 -55 14
5050 14 -1 30 8 6 2 8 -44 7 15 7 32 91 -8 -67 -55 46 58 109 12 72 45 44 104 -6 43 10 11 20 -25 43 -1 -23 64
5083 64 -13 -28 -16 -2 0 -37 -4 35 12 16 11 132 7 58 -7 -46 1 -22 -83 -5 22 -32 48 31 -35 -28 -38 50 -26 -23 1 33
5115 33 -9 13 10 0 89 -5 -4 -2 6 -107 -12 65 -59 -71 3 10 -50 -53 -57 38 -14 -24 -62 -30 -35 58 63 -21 71 61 6 28 9 45
5149D5j0j0p3N1n3J12m5O9r1L7n5M3J0n0Q4o0K9O2q6j1m2%J3QP0j35K9P3j6m0
5179d2J8L3m5qK9K3m6R7m0Pl4l1M9K9o5Q5l7P2L2r6l0k4J26m4K7n5r8J02%N1l5
5210E0j5k5Jn9P4p7P1pn0M5Rl7J1Jl1K7J4NO2p2k7j4Q7M1rr4M5OjL5J2nk1n9l3
5245d0O0n8O9n6J7N2k6L5p8J9j8j3L7Jk6J1J2l1m4P9Jj8k4J1J20j00j1Q8j5n2
5275BM2J9j2j5k1j2o9J19P5m6j12M6L1M2q0J7J0l8N5Kj12J12k9K8j8m5l8mP5j16
5305i2R1m8K2pL5m7R3q1N1m9K2j5k6O9r8J16rmL8m6P1j58J19l1Jl0J14j08J9Q6
5335I8Jo3k6N5o7l5J9pJ15q9j9M7m1L1k0pp8J16L2n0l2N8PJ6p7RK7L2p0K3M6r0
5367c9J02%p0L4rj1L0j8j9K1k1M5K4q1M9n4O4l5j3mj0M1k1l0Rk0O3j1k0No4N8
$$ plain form
5149 45 35 25 -48 3 -50 62 17 86 -5 32 -23 20 30 -20 64 4 33 95 9 -2 -44 -44 -31 -23 47 -88 -59 14 -2 -42
5179 -42 -24 9 -36 -44 -15 8 -38 59 19 26 -8 -39 10 39 -26 59 22 94 126 30 0 -24 102 58 85 30 -68 34 34 85 50
5210 50 35 10 11 -48 26 -51 20 13 -37 8 17 -20 -9 -8 -39 -12 2 7 69 -3 -30 -44 43 84 75 -19 26 32 31 66 78 73 52 -7 -40
5245 -40 20 -38 31 -25 -8 44 18 53 -25 -6 -24 -37 0 1 -25 -14 -2 -33 -77 2 3 -15 -39 -28 92 -8 -19 69 54 2
5275 2 44 63 51 36 15 3 -66 53 128 82 -30 16 47 89 9 26 36 -2 53 55 -57 55 26 54 36 -9 -47 -51 24 -92
5305 -92 -1 -49 -27 -34 1 -46 47 -34 17 -32 -10 -25 -51 18 -80 36 27 23 61 15 86 -72 47 16 17 -13 101 -7 12 98
5335 98 99 36 10 65 -2 -37 -18 -25 90 1 -18 29 -12 19 -1 -8 -86 30 62 12 -20 38 45 61 -16 -7 20 52 -18 5 51 -39
5367 -39 63 63 -7 27 18 7 37 19 0 21 0 45 69 -12 37 -17 47 12 -1 -5 -15 26 5 -25 -16 -36 27 16 -4 1 -63 -5
5399eOk4L2p7R2L2m0OM7p5Q7np9M1j0lm9K5PqK4P5r1k5mJ8qK8NJ2L4pm9N3l2R4
5435A27q3m5N9k7P2o2lj8J8j1o2K9N7l3k9O6K9l2n4m3J33j26l5O5k2N4m0R5n1
5464B8j22J12L9q8m3J23q0J5n9R7o8O0Rk4k6K9N6l8K8p4J8k3LJ13Pko2n1O1mK
5495C6n9O8l0K3p3k0J4R5j9Kq4N4j8qJ2L8o7J8P8j1k5p2QN9N7j51R9k0n8Q3M9
5526G8j17J15kj12Q5K5p3Q5j07k4M7p4R2k4n9J41p5N1j3Qj6l9L5l4m2J2K0j11
5554a28J50r4O4l6j0O9K4j04P7oj8o4J0J6P5j0K6j03J23ln9n3R4K7q9O0l5k7N0
5583B6L9o3l4M8%m7M7ol0Mj4L3LmP3r4O4j5m4j3K9l2nJ9J0kj8R1p8O9j09O3m4
5616c4M5oJ26r2k1lNrj2k5J09p2k4P5p9l2QQK6L8o1P2p2kP1r3J0k0Q5l7N3n2Q
$$ plain form
5399 -5 1 -23 9 -68 24 56 16 22 69 -6 81 76 -3 38 28 25 -24 1 8 0 24 99 8 -17 -21 -3 -11 17 22 34 68 61 12 65 33 127
5435 127 44 -1 58 31 103 41 38 20 38 27 -35 -6 51 18 -11 55 84 52 -2 -45 88 -38 -73 -8 -30 24 -16 79 28
5464 28 -94 18 57 -31 -74 49 -31 -16 -75 22 -46 14 23 -1 -27 2 58 20 48 -26 -8 -31 -28 85 92 90 28 -23 38 34 36
5495 36 -23 45 15 38 -35 -55 -41 54 35 37 -47 7 -11 -19 -7 31 -36 -18 60 49 24 -48 -40 19 76 -75 24 4 -54 29 78
5526 78 -39 76 74 -38 47 72 -1 84 -23 -47 0 -74 18 -6 -65 76 1 52 39 47 31 -8 27 -7 -49 -37 -17 -128
5554 -128 22 -72 -8 -44 -54 15 39 -65 12 6 -12 -76 -66 -50 25 15 41 -62 61 58 -1 -54 40 67 -22 38 3 -24 26
5583 26 65 2 -32 16 16 -31 16 10 -20 -16 -30 3 6 2 75 -19 45 30 -14 -27 2 -30 -35 -16 -6 -8 -26 65 -13 56 -53 10 -34
5616 -34 11 5 131 39 18 15 20 11 -1 -26 83 11 -13 62 -17 -49 -41 -33 -7 31 -30 42 -30 -32 39 -54 -44 -64 21 -16 37 -15 -7
5649gL0r1O0LJ6J0nLKo5P1qj8Q4p7rOj8L1o0K2k2O7m6K9JK7q0M2J5K6n0M4l4m1
5684d2P1r9J4n1N4K0J1J1k1%O4jL2k7o8J14j6j14R0o5J27j27KN5mo7R6k4rM0r8
5715c2Q5j04K2J7N9j5l8J2J2J7m2k8K3m3Q7o7Q7q6L2K9q1P8n7R4j24J03n7K6j1
5744bP2r6R2l6nL9j23P3q4j0L8P8n9Pj4J9p6O1J3mO5l3m3k4N2K5l0J1K6J8n6o6
5776g2J04L6j00K0Q2j2J0j4l7L7l5M2J4Nr5L2k2Q2j00O2m8pM0Mj8l4n0Q3nr7J26
5807C3nR0j73N5m2k8P3NJ1o3P3NpO0j33J0O5j6j1n1K0M9j0N6p1K4P9l4j06J02
5837F0o9O0o8K2O6j46R2j9R5r8j3Np0R5n4Q9k6K1m9j24J07k9K4P3L3j29P9mk4
5866aJ7L2Qj54J39p2R0j41O9L8j5m3J24n0l4Q2j06OJ3j8O1j1m2Nj3q3J35j03P9
$$ plain form
5649 -7 23 -68 -8 -5 11 21 16 19 21 -44 27 19 1 85 8 -1 5 -13 18 -42 -20 -42 25 -21 8 9 36 -44 -2 13 39 -11 33 -1 -42
5684 -42 29 -70 -56 -107 -53 -33 -22 -11 -32 -32 32 31 63 36 -32 82 66 -48 42 -23 104 -23 -21 34 30 -37 59 35 26 66 -32
5715 -32 53 -51 -29 -12 47 32 -6 6 18 35 -7 -35 -12 -55 32 -35 52 -34 -2 27 -54 24 -33 61 -63 40 -17 9 -2
5744 -2 70 -26 66 30 25 64 -59 14 -70 -80 -42 36 -23 -16 -30 -11 -87 -26 -13 -17 48 15 -28 -52 0 25 -5 6 32 50 -6 -72
5776 -72 32 68 -32 -12 70 58 68 54 17 54 19 61 75 80 -15 17 -5 77 -23 39 -9 -16 24 28 10 -24 -74 9 4 -93 33
5807 33 28 118 -55 0 -42 -70 3 8 19 -44 29 34 27 87 -46 -36 29 13 2 -49 -29 20 10 66 -5 19 98 64 -42 60
5837 60 -9 51 -17 5 71 -75 17 -2 93 -5 -18 -13 -83 12 -42 47 21 42 -7 -131 -24 -53 -29 44 77 -52 27 23 -1
5866 -1 16 48 56 -98 41 -31 59 -82 -13 25 10 -33 91 41 7 89 -17 -11 2 -16 45 34 -8 -3 -16 -99 36 -67 12
5895A2L8%q2%J2K1j9L8p2k3R3mm0N8n6K2n9O4J8J8n0Q2nK0j44P6Lj4J5L1o1J6
5927HM2m7L6n7M4kj6r0P1L4rqMK2m5P5p6M5Qk6j00J37j3k4p6N9Qk4O5l1Qk1J5
5960A6J7m2O9k7j6m2N8k1L9o5M9j9m4O1m0j3k5oK5L8p1qP2j5l3N9m8j3o6J21J3
5991B3N1j15K5l5P9n1J9K3N2o4P9p6J3Mk2O6l2r8L9k1O1qj7J0q4J06j7k9n9J7
6021f1J54r4j6M7p3J08j42J17m1L1k3O4r9QO5j11L2M3l6M0R6j61J24r6N9L9q5
6048a1%K3n4k3N1L9%j7n5%O7J6j00L7L4o1R4r0P9L1n6Qo3MJ23j43L1L3pRQN3n2
6081Hk9N3J2lP1q7l5R4j13R6q4K5Km4K7J3n0L5N8q7K0L1J5l2P1o0J02j34J47j51
6111b9N3j8n3K1O8k6M9l3L0n1K8rq9N9mJ8nJ31j53J1M9p7R4n5J6j3n5J21r3M8
$$ plain form
5895 12 50 50 -32 -32 -20 1 -18 20 -52 -75 18 14 -26 32 -24 -2 -61 3 21 39 -11 71 66 86 -58 18 21 7 22 53 -8 8
5927 8 50 3 39 -18 26 24 8 -82 -11 23 14 6 10 32 -13 62 -14 31 39 13 -87 50 37 13 -63 -4 4 -20 45 14 22 1 16
5960 16 33 -9 60 33 17 -25 33 12 51 -14 35 16 -28 33 -7 -20 -45 -51 -26 12 -59 -67 5 -10 -43 16 -32 -45 -111 10 23
5991 23 74 -41 -16 -51 28 -23 -4 19 71 7 86 10 23 27 5 71 39 -59 -20 -41 20 12 -5 5 -79 27 10 -19 -78 -61
6021 -61 93 -1 -17 30 -43 65 -77 40 -1 30 7 71 -28 -20 45 -66 -34 9 -27 13 109 -52 72 -24 35 74 -11
6048 -11 -11 12 -42 -65 -14 25 25 8 -47 -47 20 36 -64 -27 7 -54 40 -50 29 60 4 12 -51 -47 76 -67 -36 -3 -10 -1 7 60 8
6081 8 -21 32 44 41 112 25 -10 84 -29 67 -17 8 10 -34 -7 6 -44 -9 49 -38 -18 13 28 -4 67 7 109 -25 122 -29
6111 -29 24 6 -47 -26 42 16 65 32 62 11 39 30 -59 0 -4 14 9 140 -13 -2 47 -30 64 9 25 12 -43 78 -15 33
6141C3%m8j9Q9q0K5L7k2O9j43N9%J1M4o7K4l1P8Op7L1j4O1j33J08no2J07j07J8
6171hN0K5o4M8k8L7K7q2j7M3o0N6K8p4R6j13KL9J9op5L8RN6k2m2N5k1J5ol3n1
6203e9N3P6L2q7J1n8M6j1n4K4M7o9O9Oo9M1L7l6pP3o9J8q7R7j3J1m0j6N6p4K9
6234b3Q6q4Q2p4J2M0P3q6rMM3m8N4l3k4M1o5K3m6P6Mn8J00j2q2N3k7l3J50j76
6264c9l9L8N5k1mrM0m6lL3m9K1P5p4kJ6M8K7n0J8OK4j4q1N2M2Jn3Q4j4o3k5j6
6297b2M3l4j6OJ05O9j17RM9o5n2K9j8j3mj1J0LlO4rJ0j7j2m3N5oj6K8m6j6N2n4
6330d2J78j17j8Kk6L6m6J31q0L4l9l8L6J6O4n1m1l0N7qn9N9n6K3L7n7N2J0l7m2
6360e2P5o2M4pL5M6p8k2K3J09j07M9o5K3p4O5N3J3k6p3M2k8l5N1R0j4r3JM2n4
$$ plain form
6141 33 33 -15 -34 55 -25 0 37 15 84 -59 0 0 11 55 -12 12 -19 59 65 -12 19 5 66 -67 41 36 -26 81 -26 -8
6171 -8 42 67 3 51 23 60 87 5 -12 31 -29 27 55 -19 77 -36 -34 5 24 18 -57 -19 -10 46 24 -18 37 16 31 25 -8 -59
6203 -59 -6 70 102 15 26 -32 14 3 -51 -27 20 -49 20 26 -43 -2 35 -1 -8 65 -4 14 -73 24 11 22 -18 -34 22 -52 -23
6234 -23 63 -21 61 -13 -1 39 112 26 17 21 64 16 70 37 13 54 -11 12 -34 42 46 -12 88 76 -6 47 20 -13 137 -39
6264 -39 -78 -40 15 -6 -10 -19 21 -25 -28 5 -44 -23 52 -22 -24 -8 40 67 17 35 41 65 51 -30 22 64 65 12 96 82 19 -6 -22
6297 -22 21 -13 -29 -23 82 151 34 43 92 27 -25 4 -14 -27 -31 -42 -32 -29 -32 32 23 33 16 4 -39 16 10 -6 22 -24 -40 12 -42
6330 -42 136 19 1 3 -23 13 -33 98 18 52 13 -25 11 27 91 40 -1 -31 26 18 -41 18 -38 -15 22 -35 17 27 -10 -52
6360 -52 23 -39 5 -2 33 79 1 -21 2 111 4 53 -12 11 -63 2 55 68 42 -31 11 -17 -52 -1 89 75 -18 -17 25 -29
6390b9m0J24k2j36J16j5L7j5k5R4j21rN1K8j8K0m6m4M5K1J1jljJ1J5kN9j71L2
6420c4O4j7j1J37j47M9J3m9K1M8m7m6M6n2NJ2J7N0j9l1j3l0N1p8o3J10%N3p3M3
6450IK2n6P8m7m0L2Nl9L5RjRP0r7L7l9Q8n9l7j7N5l9L8J2Kk5l9nK4L7m7Rk9O5
6484B0Qo0K8M1m7k4N7L5k4j2m2L6rk1pM6m7N3l5n4J05l2L2j6k8On4R0JQ2r4m3
6516ik2K0Lk1K5k4L4l4m1M6NL0m8j7J6oQj8%Q0k3L1J5r0O9n9k5Q5n7N8M6ojj17
6550d7O0n8J4NM6L1p5N2o0RL4Rk7L4p9L2%K0jl5l0J11m4j4n5L4P9p3m6R6n6qL6
6583fl4K5mM5N0n0mM3Jm8RM3p4Kj5N9m8j6Pk0N2p6P4k1N2Pj14O9k5m9R7k3K8o8
6617c2J8n1Q2lJ5N6j16LN3N9j26R4o1N4oj2N4k7L0m6K1m4M8o7p4K5R0m7L3L6k7
$$ plain form
6390 -29 -69 55 33 -103 13 -2 35 20 -5 89 -32 -41 10 38 20 40 -6 -50 -5 16 27 26 23 22 33 48 46 105 -66 -34
6420 -34 30 13 2 139 -8 41 54 5 26 74 27 -19 27 -25 -20 -8 9 59 40 9 -4 -34 17 -61 -124 -14 -14 39 -34 9
6450 9 31 -25 53 6 -34 -2 3 -36 -1 8 7 16 86 -11 26 -13 75 16 -21 -38 17 -22 16 28 30 5 -34 -39 -15 22 -25 -16 -45 20
6484 20 28 -32 -4 37 -10 -34 23 58 34 22 -20 16 7 -14 -21 25 -22 31 -4 -58 47 15 47 31 3 9 -45 45 46 128 34 -9
6516 -9 -31 -11 -8 -29 -4 -28 6 -28 -69 -23 -18 12 -36 -53 -37 -43 -35 -53 -53 27 4 35 50 -40 29 -30 -55 30 -27 31 77 71 70 -47
6550 -47 13 -45 -31 -26 20 51 -24 28 -32 -23 11 20 -7 27 -52 -20 -20 0 -1 -36 -66 45 1 -13 -68 -34 45 -28 -74 22 -34 -42 -6
6583 -6 -40 -15 -19 26 76 26 22 65 66 18 27 70 -4 -2 -17 42 -6 -22 -15 -35 17 -59 15 -6 46 53 -61 8 -17 -66 31 8 36 -32
6617 -32 -14 -65 17 14 29 85 -31 -28 25 84 -42 52 -9 45 39 27 81 54 84 38 59 15 63 -4 -78 -53 37 -10 23 59 32
6648C2k0n0K7P8j00o7N3P5k5M3j16J12q2nN0J1J0K4o8L5m3P5m3L4M5m1l9L2Pj38
6678i4J19K2j5L9q6J2nP4j6m5K9j2J2r0K9m0J18p4l0L6k2P6N9j70O8OK4j9l9L5
6708ANk5P0Nq0k8O0noK6q2P7n1L3m3J18m6r7P2m0M7Qp4Q9q2K5j1p2Q9J0j3n2K4
6741d8LK1J13j15NL8m9mN9k2l9R0p6L1N4j4o1L0Rj2k2M4j30J70q7m1R1q0Q4k9
6771A3Mr3O2J1j3j2j9L0J1MJL2qn3k4M3n6R3m6l9O7jkpp6J36o0j8K4N6j15M3q1
6804i3L8KLL0P4n9M7j2j9P6j17N2j24P4N0k3qK4n7K6mK8L9k3o1l5k2J36n2kL2
6835B0%l2J9J8j0k0mLm9P4J2J6K4n0k8j4M6m6m7L7J2N8j3J6n3M3q0P8l1o1L2O4
6867C4K0j8j23L4MJ9k7K5L1j2M1r2L0O7jj20Q7qOkNM5K9p2Nn3K7lNO8o3P8o3n3
$$ plain form
6648 32 12 -38 -11 67 -33 -100 -47 28 3 46 -70 42 -40 -45 5 16 26 50 -18 17 -26 49 6 40 85 44 5 37 44 -94
6678 -94 25 47 32 71 -15 -3 -8 66 50 5 34 22 34 -56 -27 -67 51 -23 -53 -17 -39 37 96 -74 -6 0 24 5 -34 1
6708 1 6 -19 51 56 -24 -52 8 3 -3 23 -59 18 -33 0 -43 75 29 -68 4 -36 11 19 -55 34 -48 -23 -34 -106 -17 -7 -20 -72 -48
6741 -48 -45 -24 89 -26 -21 17 -32 -36 23 1 -38 52 -24 7 61 47 -14 16 25 13 -9 35 -95 75 -12 -53 38 -42 42 13
6771 13 17 -76 -14 -3 -16 -28 -47 -17 -6 -2 -1 31 23 -30 -54 -11 -67 26 -20 -59 8 7 5 -2 -78 58 -2 -20 4 60 -55 -12 -93
6804 -93 -55 -53 -50 -20 54 -5 42 30 11 87 -30 22 -102 -28 22 -1 -9 15 -42 -16 -20 8 47 24 -37 -72 -94 42 -10 -12 20
6835 20 20 -12 7 25 15 -5 -9 -6 -55 19 31 47 71 21 -7 -21 25 -21 -68 -31 -19 39 26 42 -11 32 -48 30 -1 -62 -30 34
6867 34 54 36 -87 -53 -49 -30 -57 -32 -1 -13 28 -64 -34 33 32 -88 -1 -9 -3 -5 0 45 74 2 7 -46 -19 -22 -17 51 -12 66 3 -50
6901e0qJ85j90O8J0m1k6M2K1l0J9j2Nk9nK1Mp7R7o4P8j5Pk0l3O7%q5O3m6J11j49
6933h2M5M6k3M6K2j41Q7L3p5nP5J0Np9N6Qn5l1P4l2M1o6K9JJ9l5rK3MJL8J2j5
6966B7l8L5nl7N4n6JN8l0Rk7ol5N4k9O0p1mJ03j09Q1j01Q3j44J02Ml9O8k2P7j01
6997c8J3q1J21m4qLM9j8k4P7ql3j9JR4r8KJ04n1jn5m2N0l6J5L1J5Ko5R2j48N5
7029d5N5L3ql3o3Q9k8j13K8Q9n7K0J7p0P4K7o4l0L0M7p5J04L9m6l5l1R2k6m2M1
7059A9JN0j26qN1q3P3M7n1O7p4j1R3p4MMl6Q4l8n2M9K5L6q5Q2q1k0L6m2Q4k2p5
7091g3Q5L5k9k7J5Lm3J4L0O4m4p2J5M7qo5L0J7K1k5J1k3j22J61q6L8k4K6nk6Q3
7122B3l6k3N5r3jJ17r0N4M3lj9j4l0L9m0R0r4Q1l8l2M8k9L0q7O5n8J5K2JK0jk9
$$ plain form
6901 -50 -58 127 -63 5 15 -26 -52 -10 11 -19 0 -12 -7 -36 -41 -20 -16 -93 4 -60 18 3 10 -10 -43 24 24 -61 2 -44 67 -82
6933 -82 -37 9 -14 32 54 -87 0 33 -42 -47 28 38 43 -36 20 28 -27 -58 16 -16 25 -41 -12 -11 8 -27 -36 -13 -9 -8 30 42 27
6966 27 -11 24 19 -18 36 -20 -19 39 9 18 -9 -15 -50 4 -25 35 -36 -40 63 -46 35 -66 17 -127 -25 -21 -60 8 -14 63 -38
6997 -38 -25 -106 15 -29 -37 -34 15 -3 -27 50 42 9 -10 -9 85 -13 -11 93 42 41 -14 -56 -6 -42 -27 4 19 21 -44 48 -100 -45
7029 -45 10 43 35 2 -61 28 0 -113 -85 4 -53 -33 -16 -86 -12 15 -49 -79 -49 -2 -77 27 66 20 -15 -46 46 20 -22 19
7059 19 20 70 -56 -64 -13 -96 -23 24 -27 40 -34 -45 48 -26 -22 -18 -54 30 -8 -60 -11 14 50 -35 47 -34 -54 -18 -60 24 2 -73
7091 -73 12 47 18 -9 6 9 -34 -20 10 74 30 -42 -27 20 12 -53 -23 -6 15 -10 1 -22 -144 17 -69 -31 -55 -29 -34 -60 23
7122 23 -13 -36 19 -74 -75 42 -48 6 49 46 27 13 -17 22 -18 72 -22 59 21 -11 37 8 38 -49 16 -42 -27 -5 -4 16 15 -14
7154a4k5P1j1Nj0l1m7M6K9j5o3N9n8O9k6LR4n6J9l2L3p0J4P7j7j3m3K9l0O0k6
7185B1Mm7Q0j1k7L1n6q6O9J00j97J36K8rm1L7L1j07J3O6l6pm6RJ4N1MN4p1M2n2
7216cn2jJl9J29n1k5J06P1j27P7m5kk3L7k9j5N0Qq2M4m4l6J8Pl0K9O2pmj0k7J
7249a2k3K2rP1o4K9MJo9LO7JM7ll3j4MK7j7n0M8m0N2l7N3J3q6L4M4p8K1l1J4K2
7283A1J0p0O3o4l0J12o9J01R8j55K1q3K5k4P5l1K0o5M4J4K8l6N9p7M9k1P4m4m5
7312a0N3j03Q1m8L0j22J87j26P7r0J15p0OM2k3Lk8L2M5k9j8j9j4k4K3L3o2PQ7
7341C5Ln1K0k6L5R5j09K6K1l5Q5j40J0j1j9K6l2J18l9m4J11m4P4m1p8k9LpP0j15
7371h8O7K6j13L3N1l5L4M4j4K8n0mrLJ5J02p0M6p5NRj66J36O0j5o0M5J0N0k2j01
$$ plain form
7154 -14 -39 32 21 26 16 -15 -62 -16 13 -2 -65 -6 -64 5 -21 -18 76 20 39 7 40 -30 -16 61 44 31 -12 17 -13 47 21
7185 21 25 -22 58 47 20 51 -5 -91 -22 78 -119 17 45 36 -5 32 63 -44 -31 35 -1 -8 -54 -45 -31 20 24 78 7 49 -3
7216 -3 -55 -56 -55 -94 35 -16 -41 65 136 9 86 41 39 16 53 24 9 59 67 -15 29 -15 -51 -33 -26 -56 -27 35 28 24 14 -13 -12
7249 -12 -35 -13 -22 49 -15 14 18 19 -50 -47 20 21 68 65 32 18 22 49 32 -18 30 -10 42 5 58 71 -15 19 63 -15 6 -25 -11 11
7283 11 21 -49 14 -50 -80 32 -37 64 162 7 28 -55 -30 -54 21 -10 10 -55 -11 3 31 -5 54 -23 26 5 79 35 -10
7312 -10 43 -60 21 -27 3 -119 68 -58 19 -71 44 -26 -20 22 -1 2 -26 6 51 22 4 -15 -29 -53 -30 3 -59 -52 35
7341 35 38 -13 7 -19 16 111 2 28 49 14 99 -41 -31 -42 -61 -35 -67 51 12 -32 79 35 109 68 -10 -39 -36 -43 27 -88
7371 -88 -21 5 -108 -75 -24 -59 -25 19 5 33 -17 -21 -30 -27 -12 90 20 66 -9 -4 5 -161 -25 35 20 -40 5 15 65 43 -58
7402e8P0k3l1J5P0l0j3p6J04M2l5n0l8K4L8m3N8Qj4k1N3qr5O9L1p9L4l1N2M0M6
7433A09r4Ok7k6R3k7j2K3o7R2o7l2P4m3l5J02j16L2O0m3l3J02r2l7R8m9nk2L7
7462Al8N3Q9j59K5rK3M5n0KN4n9K1Q1l7k9j7N6l1p0Q2q9R6j7J3k2K6LM1o9j00
7493h5PP0L1l7p0O3O3o7R8lo2K7n4OL2p1J07p3N7k0K2M5n9jj7rJk6J20q2k1J1
7525CM7o6N0n1j8O3N9j08K1K5k1oqmK2k2M4m5l0P9k9J4j3l0L5J7K1n5K1m2L4l8
7557c1l9KJ0O0K9j02P2L5k4l2N0l0PqK1j8k6N5j4J9j5l6J6p8R7k6j4P6n4M3m0
7588Em5M1qJ8l3M3N7j46P7m2L5j4l0J20n2p2Pj5L3O9m0m8J44j09m2O7j7L7k2m2
7618b4jLoO9p5J1J5L3j11O4M9q2O8lll7R0p5l3L9n4O6l2Q6m1M4kn4P5p5Q9j25
$$ plain form
7402 -58 12 -11 -42 -27 43 13 0 -76 28 70 35 -15 -53 -29 9 -34 24 32 18 -3 50 42 -53 16 47 -32 2 -29 23 63 109
7433 109 15 21 -6 -32 61 34 22 45 -22 70 3 -29 45 2 -33 69 -47 -15 45 2 -31 71 -21 -58 40 -9 -14 -36 1
7462 1 -37 16 105 -54 -29 -38 -15 30 -20 -18 36 -23 -2 79 42 13 -4 52 21 -49 33 -56 40 23 36 14 40 43 84 15 -85
7493 -85 -78 -8 23 -14 -84 -21 42 -25 73 70 8 35 -19 -13 19 -52 55 -18 39 19 41 86 27 26 9 0 1 -25 95 13 -8 3
7525 3 50 -16 34 -17 -35 28 87 -21 0 25 4 -2 -10 -14 8 -14 30 -15 -45 34 5 19 6 -24 11 28 49 -6 15 -27 7 -31
7557 -31 -70 -68 -58 2 31 -71 1 36 12 -20 30 0 7 -1 20 2 -24 31 17 36 21 -15 1 -77 20 -6 -20 56 2 45 5
7588 5 -40 1 -7 11 -22 21 78 -68 9 -33 2 -12 -42 78 26 -46 -39 -54 -21 48 8 -40 104 -5 -47 20 3 40 18 -24
7618 -24 -25 -22 -28 41 -34 -23 -8 25 -86 -22 27 -55 13 10 7 -30 60 -15 -48 -9 -63 3 -29 57 16 60 58 4 79 4 93 -32
7650c2J70j38M4j6rL7k6ql7J10n5q9O4l8j5M8j9k2R1r0O3j7m8m7J21o6P8J2j30
7679f4m3J37j4J7M2j77J57Rk5l5Pn8M5J7M1m2O2m5M2j34M3N2Lkp0J08o0N7o4o
7709@n6j4P2L3N9j34M7n5L4O7m0j3Ro9j9M8j5J4o9Q7m7R4l5m2J7K9QK1k6k0N6
7740D1kJ6m3P2p3L0kq4j7J9K1J2p2J13o5L3k9l2J08r1L0L3k6L1n5K9kN2k0J7M8
7771I2j37Q1njn8M0K3m7M1j2M9r0J5M2r5M5L2K9L2j50O0k4M7j2pN2n2J9k7L3m
7802A1oM2K6q6j4PL6J9J0o8N4K6r1K4P0n1P6n5l3M3m8M0m5O0m7k6M4l3KjP3m9
7834A0K8k7p9L4M1p1Q5Mj4j0lM3j11j2J08L3r9M5Jj7N8rnm9L9k3K5k8j5L4J6r5
7866f3J04p5N7m8N8n3k4K8j2nl7J14m7o1J13j25P4K6m7M8m5J1k6nN8m6N9j5J2
$$ plain form
7650 -32 138 0 44 28 19 56 30 22 -15 95 40 -49 15 -23 -38 10 -9 -31 60 -30 33 16 -32 -79 42 -24 54 66 -64
7679 -64 -107 30 16 33 75 -102 55 64 39 4 11 -47 -2 15 56 14 76 31 73 -61 -18 34 37 35 -35 73 13 70 6 0
7709 0 -56 -70 2 35 94 -40 7 -48 -14 53 13 0 9 -60 -79 -31 -46 -32 -101 -14 -61 33 -2 -44 -27 2 10 31 5 -15 41
7740 41 39 55 12 84 11 41 39 -45 -62 -43 -22 -10 -82 31 -34 -1 -30 -62 46 -45 -15 18 -8 23 -32 -3 -5 47 27 44 92
7771 92 -45 36 31 30 -28 12 35 -12 29 17 66 -24 -9 33 -62 -17 15 44 76 -74 -14 -38 9 -3 -10 42 -10 9 -18 15 11
7802 11 5 47 73 -13 -27 -20 16 35 45 -23 31 57 -34 -10 60 9 85 30 -3 40 -8 32 -13 47 0 -26 18 -15 -13 -14 59 10
7834 10 38 11 -68 -34 7 -64 21 25 11 1 -2 41 -70 -82 26 59 -40 5 6 -11 47 38 33 -16 23 0 25 -3 -18 16 32 -63
7866 -63 41 -34 23 -25 33 -20 -44 -16 -28 -33 -70 44 -3 -64 49 -76 -2 24 -23 25 -20 -9 -35 -40 18 -28 31 16 28
7895B8o2P2QNorM2m8n2N8k9K4j9l6j3M2m9M9P6m8n5J7N5j4r9M0P3j23J23J4m6
7926A8p4N5K1k7n9oN2Pk2J2l2qJ04l1O1l9L1p1n6J13q2Q5l4k0l0J3M7q8M1RM8
7957C8n4P9j11M8oj3J0o4J17j2L7j04N3M3o5K4o7N3K1Rj4n3N8j8LK7NK4q8O8o9
7988b1K3l2LJ4Mk5N7L2o1o8R9PkKj18R0Qo6J9J3nL3K6l5q3J23p3L3M4m9J9oMN7
8022F6o3J7k7R5M7r7l0j4N2L8p0J6n4j2K9M8m3L8j00J15k8k3J5m4L8k8l0m3J27
8051C5q6K2QJ06p9nK6l7K7J1ML0p2M0n5pN3n0k8O0mrjN4L0m1k9J0M2q9O5j9m8
8084c6Q6o5KJ1M4m0o0L8K8P6r3m2L0L5J7Oql8K1%O5q2jJ6j7RnL0k0J7l3j4O5m
8118C8l6j24J14L3n9L6oo0%L0M8J0jl1k1L6J4n8jj2L7N8m2J4o6N8O9j19L2M9o0
$$ plain form
7895 28 -34 38 46 51 45 36 78 30 -22 36 7 31 12 -24 -37 5 -44 5 81 33 -22 -5 50 36 -63 -23 50 -73 50 64 18
7926 18 -56 -1 20 -7 -66 -72 -20 -13 -35 -23 -55 -63 41 10 71 32 63 -8 -64 49 -33 52 18 -2 -32 -19 28 -60 -19 -10 38
7957 38 -16 63 -48 0 -6 -19 -9 -73 44 32 69 -35 18 61 -4 20 -47 6 27 36 22 -31 27 9 12 39 44 68 -20 48 -21
7988 -21 2 -30 -27 -13 -9 -34 23 55 -6 -74 25 32 30 32 -86 4 12 -54 -35 -22 -27 6 32 -3 -86 37 -36 -3 41 -8 11 5 9 66
8022 66 3 20 -7 88 135 38 8 -6 46 84 14 30 -24 -36 -7 41 -2 36 -64 51 23 0 15 -29 9 -19 -49 -92 35
8051 35 -51 -29 -21 85 6 1 27 -10 17 28 32 62 -10 30 -25 -32 21 -29 -57 3 -1 -10 -11 43 73 32 3 13 55 -34 31 12 -36
8084 -36 50 -15 -13 -2 42 2 -58 -20 8 84 -9 -51 -21 14 31 37 29 -9 12 12 77 -5 -6 10 -7 2 -3 27 7 24 -9 -23 42 38
8118 38 2 -122 -8 25 -34 2 -4 -64 -64 -34 14 24 23 -8 -29 7 21 -37 -38 -50 -13 45 3 17 -49 9 78 -41 -9 40 -20
8149b0j%N2m1L4p7M1qM8rj2K8q8Q3M5j35L2K2k4P5q6jL5J1n7N8j4k8L9M4k9q2
8181f5O1K7k9J0jMj5J07Pj66
$$ plain form
8149 -20 -21 -21 31 -10 24 -53 -12 -20 28 19 7 35 -53 30 75 -60 -28 -6 -30 45 -41 -42 -7 4 -53 5 -9 -37 2 46 17 -65
8181 -65 -4 23 -6 4 3 7 -8 99 106 -60
8191f0
##END NTUPLES=NMR FID
##END=
