##TITLE=1H_SR152_TFA3
 DMSO-d6
 48 sc, 
 23.3.2023
##JCAMPDX= 6.0         $$ Bruker NMR JCAMP-DX V2.0
##DATA TYPE= NMR FID
##DATA CLASS= NTUPLES
##ORIGIN= UXNMR, Bruker Analytische Messtechnik GmbH
##OWNER= root
$$ XWIN-NMR		Version 3.5
$$ Thu Mar 23 14:06:00 2023 Russian Standard Time (UT+4h)  she@DPX200
##.OBSERVE FREQUENCY= 200.13135
##.OBSERVE NUCLEUS= ^1H
##.DELAY= (6, 6)
##.ACQUISITION MODE= SIMULTANEOUS
##.ACQUISITION SCHEME= undefined
##.AVERAGES= 48
##.DIGITISER RES= 18
##SPECTROMETER/DATA SYSTEM= spect
##.PULSE SEQUENCE= zg30
##.SOLVENT NAME= DMSO
##.SHIFT REFERENCE= (INTERNAL, DMSO, 0, 15.7039)
##AUDIT TRAIL= $$ (NUMBER, WHEN, WHO, WHERE, WHAT)
$$ ##TITLE= Audit trail, XWIN-NMR		Version 3.5
$$ ##JCAMPDX= 5.01
$$ ##ORIGIN= Bruker BioSpin GmbH
$$ ##OWNER= she
$$ F:/spectra/data/she/nmr/H-F/1/audita.txt
$$ ##AUDIT TRAIL=  $$ (NUMBER, WHEN, WHO, WHERE, WHAT)
(   1,<2023-03-23 14:04:57.00 +0400>,<she>,<DPX200>,
      <continue with go, POWCHK disabled, PULCHK disabled
       configuration hash MD5:
       00 E9 B6 7A A2 85 ED C7 34 08 36 98 17 FE 4E 26
       data hash MD5: 16K
       ED 67 65 29 1C 9A B0 D1 D0 B0 63 7F F0 C5 30 57>)
$$ ##END=
$$ 
$$ hash MD5
$$ 52 D3 B7 02 EC ED 7B AE DE 01 EF 28 1E 4A 10 31
##$RELAX= 
##$RELAX= 
##$RELAX= 
##$RELAX= 
##$RELAX= 
##$RELAX= 
$$ Bruker specific parameters
$$ --------------------------
##$DU= <F:/spectra>
##$EXPNO= 1
##$NAME= <H-F>
##$PROCNO= 1
##$TYPE= <nmr>
##$USER= <she>
##$AMP= (0..31)
100 100 100 100 100 100 100 100 100 100 100 100 100 100 100 100 100 100 
100 100 100 100 100 100 100 100 100 100 100 100 100 100 
##$AQSEQ= 0
##$AQ_mod= 1
##$AUNM= <au_zg>
##$AUTOPOS= <>
##$BF1= 200.13
##$BF2= 200.13
##$BF3= 200.13
##$BF4= 200.13
##$BF5= 200.13
##$BF6= 200.13
##$BF7= 200.13
##$BF8= 200.13
##$BYTORDA= 1
##$CFDGTYP= 0
##$CFRGTYP= 5
##$CHEMSTR= <none>
##$CNST= (0..31)
1 1 145 1 1 1 1 1 1 1 1 1 1 1 1 1 1 1 1 1 1 1 1 1 1 1 1 1 1 1 1 1 
##$CPDPRG= <>
##$CPDPRG1= <>
##$CPDPRG2= <>
##$CPDPRG3= <>
##$CPDPRG4= <mlev>
##$CPDPRG5= <mlev>
##$CPDPRG6= <mlev>
##$CPDPRG7= <mlev>
##$CPDPRG8= <mlev>
##$CPDPRGB= <>
##$CPDPRGT= <>
##$D= (0..31)
0 1.2 0 0 0 0 0 0 0 0.06 0 0.03 0 0 0 0 0.0002 0 0 0 0 0 0 0 0 0 0 0 0 
0 0 0 
##$DATE= 1679565734
##$DBL= (0..7)
120 120 120 120 120 120 120 120 
##$DBP= (0..7)
150 150 150 150 150 150 150 150 
##$DBP07= 0
##$DBPNAM0= <>
##$DBPNAM1= <>
##$DBPNAM2= <>
##$DBPNAM3= <>
##$DBPNAM4= <>
##$DBPNAM5= <>
##$DBPNAM6= <>
##$DBPNAM7= <>
##$DBPOAL= (0..7)
0.5 0.5 0.5 0.5 0.5 0.5 0.5 0.5 
##$DBPOFFS= (0..7)
0 0 0 0 0 0 0 0 
##$DE= 6
##$DECBNUC= <off>
##$DECIM= 32
##$DECNUC= <off>
##$DECSTAT= 4
##$DIGMOD= 1
##$DIGTYP= 9
##$DL= (0..7)
0 120 120 120 120 120 120 120 
##$DP= (0..7)
150 150 150 150 150 150 150 150 
##$DP07= 0
##$DPNAME0= <>
##$DPNAME1= <>
##$DPNAME2= <>
##$DPNAME3= <>
##$DPNAME4= <>
##$DPNAME5= <>
##$DPNAME6= <>
##$DPNAME7= <>
##$DPOAL= (0..7)
0.5 0.5 0.5 0.5 0.5 0.5 0.5 0.5 
##$DPOFFS= (0..7)
0 0 0 0 0 0 0 0 
##$DQDMODE= 0
##$DR= 18
##$DS= 0
##$DSLIST= <SSSSSSSSSSSSSSS>
$$ [...]
##$SUBNAM2= <"">
##$SUBNAM3= <"">
##$SUBNAM4= <"">
##$SUBNAM5= <"">
##$SUBNAM6= <"">
##$SUBNAM7= <"">
##$SUBNAM8= <"">
##$SUBNAM9= <"">
##$SW= 18.05172834244
##$SWIBOX= (0..15)
0 0 2 0 0 0 0 0 0 0 0 0 0 0 0 0 
##$SW_h= 3612.71676300578
##$TD= 16384
##$TD0= 1
##$TE= 0
##$TE2= 300
##$TE3= 300
##$TEG= 300
##$TL= (0..7)
0 120 120 120 120 120 120 120 
##$TP= (0..7)
150 150 150 150 150 150 150 150 
##$TP07= 0
##$TPNAME0= <>
##$TPNAME1= <>
##$TPNAME2= <>
##$TPNAME3= <>
##$TPNAME4= <>
##$TPNAME5= <>
##$TPNAME6= <>
##$TPNAME7= <>
##$TPOAL= (0..7)
0.5 0.5 0.5 0.5 0.5 0.5 0.5 0.5 
##$TPOFFS= (0..7)
0 0 0 0 0 0 0 0 
##$TUNHIN= 0
##$TUNHOUT= 0
##$TUNXOUT= 0
##$USERA1= <user>
##$USERA2= <user>
##$USERA3= <user>
##$USERA4= <user>
##$USERA5= <user>
##$V9= 5
##$VALIST= <valist>
##$VCLIST= <CCCCCCCCCCCCCCC>
##$VD= 0
##$VDLIST= <DDDDDDDDDDDDDDD>
##$VPLIST= <PPPPPPPPPPPPPPP>
##$VTLIST= <TTTTTTTTTTTTTTT>
##$WBST= 1024
##$WBSW= 4
##$XGAIN= (0..3)
0 0 0 0 
##$XL= 0
##$YL= 0
##$YMAX_a= 1154316
##$YMIN_a= -1462484
##$ZGOPTNS= <>
##$ZL1= 120
##$ZL2= 120
##$ZL3= 120
##$ZL4= 120
##$ABSF1= 10
##$ABSF2= 0
##$ABSG= 5
##$ABSL= 3
##$ALPHA= 0
##$AQORDER= 0
##$ASSFAC= 0
##$ASSFACI= 0
##$ASSFACX= 0
##$ASSWID= 0
##$AUNMP= <proc_1d>
##$AZFE= 0.1
##$AZFW= 0.1
##$BCFW= 1
##$BC_mod= 2
##$BYTORDP= 1
##$COROFFS= 0
##$CY= 11.3945322036743
##$DATMOD= 1
##$DC= 2
##$DFILT= <>
##$DTYPP= 0
##$F1P= 2.36226072786647
##$F2P= -0.459571619588291
##$FCOR= 0.5
##$FTSIZE= 0
##$FT_mod= 4
##$GAMMA= 1
##$GB= 0.15
##$INTBC= 1
##$INTSCL= 1
##$ISEN= 128
##$LB= 0.24
##$LEV0= 0
##$LPBIN= 0
##$MAXI= 10000
##$MC2= 0
##$MEAN= 0
##$ME_mod= 0
##$MI= 1.114404
##$NCOEF= 0
##$NC_proc= 0
##$NLEV= 6
##$NOISF1= 3.799351
##$NOISF2= 2.8
##$NSP= 1
##$NTH_PI= 0
##$NZP= 0
##$OFFSET= 15.70392
##$PC= 1
##$PHC0= -19107.66
##$PHC1= 9.200749
##$PH_mod= 1
##$PKNL= yes
##$PPARMOD= 0
##$PSCAL= 0
##$PSIGN= 0
##$REVERSE= no
##$SF= 200.130013532006
##$SI= 16384
##$SIGF1= 3
##$SIGF2= 2
##$SINO= 400
##$SIOLD= 16384
##$SREGLST= <1H.CDCl3>
##$SSB= 0
##$STSI= 0
##$STSR= 0
##$SW_p= 3612.71676300578
##$SYMM= 0
##$S_DEV= 0
##$TDeff= 0
##$TDoff= 0
##$TI= <>
##$TILT= no
##$TM1= 0
##$TM2= 0
##$TOPLEV= 0
##$USERP1= <user>
##$USERP2= <user>
##$USERP3= <user>
##$USERP4= <user>
##$USERP5= <user>
##$WDW= 1
##$XDIM= 8192
##$YMAX_p= 0
##$YMIN_p= 0
$$ End of Bruker specific parameters
$$ ---------------------------------
##NTUPLES= NMR FID
##VAR_NAME=  TIME,          FID/REAL,        FID/IMAG
##SYMBOL=    X,             R,               I
##VAR_TYPE=  INDEPENDENT,   DEPENDENT,       DEPENDENT
##VAR_FORM=  AFFN,          ASDF,            ASDF
##VAR_DIM=   8192,          8192,            8192
##UNITS=     SECONDS,       ARBITRARY UNITS, ARBITRARY UNITS
##FACTOR=    0.0002768,     1,               1
##FIRST=     0,             0,               0
##LAST=      2.2672688,     0,               0
##MIN=       0,             -1462484,        0
##MAX=       2.2672688,     1154316,         0
$$ Real data points
##PAGE= N=1
##DATA TABLE= (X++(R..R)), XYDATA
$$ [...]
2353G56q35K23l03M0K35p78L11O17k34L50j040O92o30P94q7K43M4o07L95L69n21
$$ 756 -79 144 -159 -119 116 -662 -351 266 32 382 -658 34 -596 198 111 354 398 -209 186 555 34
2374C4J77l3k50j89M51r5k59j73O3J07K22K07J21q15J65N79J15k2k40O43m48q09
$$ 34 211 178 -72 -261 190 95 -164 -337 -274 -167 55 262 383 -432 -267 312 427 405 165 808 360 -449
2396d49M37j90L80N02q78L43q8K80j95l6q09M46Q32m22l22p9J44k14P00m49M30
$$ -449 -12 -202 178 680 -198 145 57 337 142 106 -703 -257 575 153 -169 -248 -104 -318 382 -67 363
2417C63l11K8O88m92q20P20j27k24k45N86K67l12P3l13P25l99q72N05l35K39R55
$$ 363 52 80 768 276 -544 176 49 -175 -420 166 433 121 194 -119 606 207 -665 -160 -495 -256 699
2438F99n85q06O89j5Nj8N23qq33M12P47r88K78L19M3j86m54N83n82j58m4M30j13
$$ 699 114 -692 -3 -18 -13 -31 492 484 -349 63 810 -178 100 419 462 276 -178 405 -177 -335 -379 51 -62
2461f2K71N9k49R6n32o9Q09n76N76J85l86q2m70L82L89p55J038o82m28j76N67
$$ -62 209 268 19 115 -417 -486 323 -253 323 508 122 40 -430 -48 341 -414 624 -58 -486 -662 -95
2482i5m51K77L75k41J082r35K20m18K34M88o37J19M45l78kK40o00M35m60Q77K51
$$ -95 -546 -269 106 -135 947 12 232 -186 48 536 -101 18 463 85 83 323 -277 158 -302 575 826
2503H26p60J7k10k48O38lq3j79m01O47o42P06j102J486j198J12N9M68j99L28k31
$$ 826 66 83 -127 -375 263 260 177 -2 -403 244 -398 308 -794 692 -506 -394 -335 133 -66 262 31
2524C1J81k16k13K73p38M89L02K46n65N8l9k54J28K86J4O01j219P27J55m52k19
$$ 31 212 -4 -217 56 -682 -193 109 355 -210 -152 -191 -445 -317 -31 -17 584 -635 92 247 -205 -424
2545d24J43L3j58O02p18J169n91P11n13m40L35n58J49K59k17J69J03J6Mk48R30
$$ -424 -281 -248 -406 196 -522 647 56 767 254 -186 149 -409 -260 -1 -218 -49 54 70 74 -174 756
2566G56j358K16N09O2n70O24q05M35L9J38rm6K1J59J13j78n14P97r8l52k41Q5
$$ 756 -602 -386 123 185 -385 239 -566 -131 -92 46 37 -9 12 171 284 106 -408 389 291 -61 -302 -217
2588b17q0l30Q49o17L49k83l90O17Q50n60L6j96l92O07l40P14o64P9k62k70M73
$$ -217 -297 -627 222 -395 -46 -329 -719 -102 748 188 224 28 -364 243 -97 617 -47 32 -230 -500 -27
2609b7K03m02JL30K33l00k42K31P53m43m59J5n58P31J61j80k17k67Q01k18l3J19
$$ -27 176 -226 -225 105 338 38 -204 27 780 337 -122 -107 -665 66 227 47 -170 -437 364 146 113 232
2631B32m33J72L59m38j81P35j76o30q0J65nK18K33j81J56L06m28k76j61r3QO84
$$ 232 -201 -29 330 -108 -289 446 270 -360 -440 -275 -280 -62 171 -10 146 452 24 -252 -413 -506 -498 186
2653A86n1n0J69n22R78q21o6N06n33J06j81o8P41j028Q70p36M4P9K85n5Pk51L19
$$ 186 135 85 254 -268 710 -111 -177 329 -204 -98 -279 -347 394 -634 236 -500 -456 -377 -92 -147 -140 -391 -72
2676g2J46L92k98l37K06j97l32L36j3l58j40j1J070m06o9K65K48q30J0M79rN44
$$ -72 74 466 168 -169 37 -160 -492 -156 -169 -527 -667 -678 392 -14 -83 182 430 -400 -390 89 80 624
2698F24p80M02j27J03o51Q43M5K88j396N56l50J80L85m93N54p47K61r4L7O89k83
$$ 624 -156 246 119 222 -429 414 459 747 -649 -93 -443 -263 122 -371 183 -564 -303 -397 -360 329 46
2719D6k19J32n06L23O7L87o18k04P05l38l9O63l28k1j77p3j72K86K81j60J6J10
$$ 46 -173 -41 -547 -224 -157 230 -388 -592 113 -225 -264 399 71 50 -127 -200 -372 -86 195 35 51 161
2741A61J55l31L4J90m99O24l60j64N74m70j47L7L09Q8L49o55K74M12j281N49K57
$$ 161 316 -15 19 209 -290 334 -26 -190 384 -86 -233 -196 113 201 550 -105 169 581 -700 -151 106
2762A06j50O09m78K29Q6p04N55l49m1L69J14l00l48M16j93K15j1n55R07N3p81
$$ 106 -44 565 87 316 402 -302 253 -96 -137 232 346 46 -302 114 -79 136 125 -430 477 530 -251
2783b51Lj60Q48j94l57m70O05m18Q50r21K15O85o57p3M0L44L38q02P85m51L32
$$ -251 -248 -408 440 246 -111 -581 24 -394 456 -465 -250 435 -222 -295 -255 89 427 -375 410 -41 291
2804B91l90mM77n11K29L4K59m32P1j37K90k34R6J9K68q4p38N27om20O74N54n41
$$ 291 -99 -103 374 -137 92 126 385 -47 24 -113 177 -57 39 58 326 242 -496 31 25 -395 279 833 292
2827B92l19Q7o9L33P60j334m75P22k86O27n47P05l26k68J07K13j05K05k59m30
$$ 292 -27 60 -9 324 1084 -250 -725 -3 -289 338 -209 496 170 -98 9 222 117 322 63 -367
2847c67R61m76j4N2m77J36m37J011p59J93M11N2Q7l05j49M44p8P5P1k54J21J49
$$ -367 594 118 104 156 -321 -185 -622 389 -370 -177 234 286 373 68 -81 363 285 360 431 177 298 447
2869D47L01o67l47K65O29j90o0j27r1r54R12j79L70o26L0K18NK2p18J6N36R09
$$ 447 748 81 -266 -1 628 438 378 251 160 -794 118 -61 309 -317 -287 -69 -64 -42 -760 -744 -208 701
2891G01m24r8q0J29l6kj23m92N36k87rJ72n17O51J71j41l35J24p4K69N74p11L46
$$ 701 277 179 99 228 192 190 67 -425 111 -176 -185 -13 -530 121 292 151 -184 -60 -134 135 709 -2 344
2914C44o06Q35p15JJ93j11n30P63L22j225Q24o61J125j81o9m96O36n58q13J009
$$ 344 -262 573 -142 -141 52 -59 -589 174 496 -729 95 -566 559 378 309 -187 449 -109 -922 87
2934H7j71M25r82N87k55p1M9L34N3K84k91L91k57m87J71o1M55p0l13j76J22M06
$$ 87 -84 341 -641 -54 -309 -380 -331 3 56 340 49 440 183 -304 -133 -194 261 191 -122 -298 -176 230
2956B30k97r08R64O90n8r18m1L09N79O8m73k26J38n04K98P5N05k19Rq28N80J09
$$ 230 -67 -975 -11 679 621 -297 -338 -29 550 618 145 -81 57 -447 -149 -74 431 212 221 -607 -27 82
2978H2l70j59K07K34K14m4O5j20l5n21P09n98M85p21O03J066j596P98n08J27N23
$$ 82 -288 -447 -240 -6 208 164 229 109 74 -447 262 -336 149 -572 31 1097 -499 299 -209 -82 441
2999D41m89M13m43M95p13L20j78K83K49n01j27J4M42M69r58O17j008L35P05k97
$$ 441 -48 365 -78 417 -296 24 -154 129 378 -123 -250 -236 206 675 -283 334 -674 -339 366 69
3019F9k69L18p2l87P02o87N40o58M01N50o55n2j2L94o70O61K95j325J238l85l10
$$ 69 -200 118 46 -341 361 -326 214 -444 -43 507 -148 -200 -212 182 -488 173 468 -857 381 -4 -314
3040c14N76j33j57j40L52q72K45j32J355m96m55M19l75j83M01L1l14k44n7M47
$$ -314 262 129 -28 -168 184 -688 -443 -575 780 284 -171 248 -127 -310 91 122 -192 -436 -493 -46
3060d6K74l61J95O2j49k49K42J58j61J37o0m71P67m79P25k62k1m36K54J95r14
$$ -46 228 -133 62 124 -25 -274 -32 126 -35 102 42 -429 338 -141 584 322 301 -135 119 314 -600
3081f00L42M10l41n76Q11J31j64P0j16J31m13R6m8M15o26N44l0L05J09j384J435
$$ -600 -258 152 -189 -765 46 177 13 83 -33 98 -315 -219 -267 148 -478 66 36 341 450 -934 501
3102E01k35K6l33n28J17o1M96j70L55K3l7j33J56q41N68j70M39n66P54p00J26
$$ 501 266 292 -41 -569 -452 -513 -17 -187 168 191 154 21 177 -664 -96 -266 173 -393 361 -339 -213
3123b13K03L42K95j10q67L13o34J057n38O83k96M80r39K53J26Jp2k83K17j55k27
$$ -213 -10 332 627 517 -350 -37 -671 386 -152 531 235 715 -224 29 155 156 84 -199 18 -137 -364
3144c64Q33p1p4p29L85l87k7Q28N0l93P1j35j92q4l6N62q72J323j096l1N74L73
$$ -364 469 398 324 -405 -20 -407 -434 394 444 51 122 -13 -205 -289 -325 237 -635 688 -408 -439 135 508
3166E08l67j4Q51n09q70N15m7j52K24m06k66R64o95J28j1P7P44j544J201k2J87
$$ 508 141 127 978 469 -401 114 67 -85 139 -267 -533 431 -264 -136 -147 -70 674 -870 331 309 496
3187D96q2m49J88K08k13q9l22J25q5P52p11M09n34N03M32j33p91L12k70M01m47
$$ 496 414 -35 153 361 148 59 -263 -138 -223 529 -182 227 -307 196 628 495 -296 16 -254 147 -300
3208c00J13L31M60m57q4jK39o09P3K27n70M94l17k7Q1M62o07K31Q98k22m02J87
$$ -300 -187 144 604 147 63 62 301 -308 -235 -8 -578 -84 -401 -428 -347 115 -492 -261 637 415 13 200
3230B00O8m24K52l14j40O38n38L13l33N53j33J69m14l59J83O22m49p3k71P96k37
$$ 200 268 -156 96 -218 -358 280 -258 55 -278 275 142 311 -103 -462 -279 343 -106 -179 -450 346 109
3251A09k61k23j79Q92n57L69M25n45J40M22m15l57N33m91q54J261p27M84M6p3
$$ 109 -152 -375 -554 338 -219 150 575 30 170 592 177 -180 353 -138 -992 269 -458 26 72 -1
3271aK52J04k97M31k26N56k74n10K96M8K39q45J56k25R3j39R39o72l08J057q19
$$ -1 251 355 58 489 263 819 545 35 331 379 618 -227 -71 -296 -203 -342 597 -75 -383 674 -145
3292a45J4P3k60O67j067L21M50j42m40P28K72o88k21O30k60N5P0k85J97n68P74
$$ -145 -131 -58 -318 349 -718 -397 53 -89 -529 199 471 -217 -438 192 -68 -13 57 -228 -31 -599 175
3313A75R8J53m84k95O93n32M94l09j4j33O20o94O96m15K98p94M65k0m56K83K99
$$ 175 273 426 -58 -353 340 -192 302 -7 -21 -154 466 -228 468 53 351 -443 22 2 -454 -171 128
3334A28L58o11p1m9O52n59j7K71O3q75M54K52r8M5j7r2J75j51K06M6r6J46j09
$$ 128 486 -125 -196 -245 407 -152 -169 102 165 -710 -256 -4 -102 -57 -74 -166 9 -142 64 110 14 160 51
3357E1o45N21Q8j07o6n7N82j011Q05R4o51O64L6k3o8O52p43k23Q11p20m0L87p96
$$ 51 -594 -73 15 -92 -158 -215 367 -644 161 255 -396 268 304 281 213 865 122 -101 710 -10 -50 337 -459
3380d59N01J53n04o1J71J39K41n23M45Q7K90r50R1L08J7j91j194J857n54K36L78
$$ -459 42 195 -309 -370 -199 -60 181 -342 103 190 480 -470 -379 -71 -54 -245 -1439 418 -136 100 478
3401D78m88o1O9K18k53J72J10L2l2P1r2P2o17J217k18n92OP7%L9K62n80l03O07
$$ 478 -10 -71 -2 216 -37 135 245 277 245 316 224 296 -321 896 678 86 92 169 169 208 470 -110 -413 194
3425A94k7m15r1j13j02L90N63m1k43j96j62J50j96O26r53J294p41j22N02M5o67
$$ 194 167 -248 -339 -452 -554 -164 399 358 115 -81 -243 -93 -289 337 -616 678 -63 -185 317 362 -305
3446c05m6N96n91L1J05N97o18L01l04K92L22M37p61l7M36j18o87K36K03q90J772
$$ -305 -351 245 -346 -315 -210 387 -231 70 -234 58 380 817 56 19 455 337 -350 -114 89 -801 971
3467I71j197K47k6p39R99n49N55k50O65q76R2J049q59J14j85k28J89M13k57n19
$$ 971 -226 21 -5 -744 255 -294 261 11 676 -200 -108 941 82 196 11 -217 -28 385 128 -391
3487c91K30J13j26J29m09l8Q26L18l20m44K53o76Q08p92Q54m52L05n8l1N32n84
$$ -391 -161 -48 -174 -45 -454 -492 334 652 332 -112 141 -535 273 -519 335 -117 188 130 99 631 47
3508D7M28J3o6l73m80O28m65O16k41m70N80m8J3J9J3n02M62K27m91j43j14j59
$$ 47 475 488 422 49 -431 197 -268 348 107 -363 217 169 182 201 214 -288 174 401 -90 -233 -347 -506
3530e06O69k38M68n07M38P37m32n59j19o26O46k6l37j36p3Q29n47j29O0M15m63
$$ -506 163 -75 393 -114 324 1061 629 70 -49 -675 -29 -55 -392 -528 -601 228 -319 -448 -388 27 -436
3551d36Q49o42q8N32J51m73L01P5n76Q58q95M98l20J7N76n35J19l25J96N73l67
$$ -436 413 -229 -317 215 366 -107 194 269 -307 551 -344 154 -166 -149 427 -108 11 -314 -118 455 88
3572H8k21P9o29R43l84k31L27K15J42m38l23J71L16p7j3K43O5l83J0J75k87K94
$$ 88 -133 -54 -683 260 -124 -355 -28 187 329 -109 -432 -261 55 -22 -35 208 273 -110 -100 75 -212 82
3594H2P44r39N79j16j83L42j87o53Q02k93j89m85M08J2j58L61n05Q36Lm74k12
$$ 82 826 -113 466 350 167 509 322 -331 471 178 -11 -496 -88 -76 -234 127 -378 458 461 -13 -225
3615b25O0P16n27j58j88M31m30k24N94R1j95J59n1l57r4K38k8l0O9L66M72m47
$$ -225 -165 551 24 -134 -322 109 -321 -545 49 140 -55 104 53 -304 -398 -160 -188 -218 -149 217 689 242
3637B42J5l79M3M89n34j56N90L76o76j43K84m52K21N9Q7J42o8L09k70j83j32J96
$$ 242 257 -122 -79 410 -124 -280 310 686 10 -133 151 -301 -80 -21 66 208 140 449 179 -4 -136 60
3659F0J47m05K26J83j61M14n65J61n93P97K74o00k18j37M04K88j71p77P52O1l7
$$ 60 207 -198 28 211 50 464 -101 60 -533 264 538 -62 -280 -417 -13 275 104 -673 79 140 103
3680A03K57k06l05mr8L5O50Q5j05o18L10K47j008N00q8R25j206K34N68k06K65
$$ 103 360 154 -151 -155 -253 -218 432 517 412 -206 104 351 -657 -157 -245 680 -526 -292 276 70 335
3701C35m83K9J25mo6J67q8J52J12p30M15q2O5J21m18K25K16m83L18L4R9L77r33
$$ 335 -148 -119 6 2 -64 103 15 167 279 -451 -36 -118 -53 68 -350 -125 91 -392 -74 -40 59 436 -497
3724d97L18L85k76n61J519o50j40j75L38k61j26m02L87L84j316P80P37Mj34q24
$$ -497 -179 206 -70 -631 888 238 98 -77 261 0 -126 -528 -141 243 -1073 -293 444 448 314 -510
3744e10N93m00j04L74l0M90q73P00J02p60L81p5j7KK3J53j40j51L52K85l26j97
$$ -510 83 -317 -421 -47 -77 413 -460 240 342 -418 -37 -112 -129 -127 -104 49 -91 -242 110 395 69 -128
3766a28R22l97r90N22m39P70j38l02l24J36N07J06o64O50k59R4Q1l48J48j80O53
$$ -128 794 397 -593 -71 -510 260 122 -180 -504 -368 139 245 -419 231 -28 66 147 -201 -53 -233 420
3787D20m60J68L32n36L01l73M06j48j94J54L10J93n19J84j50j12M6K37n29L27
$$ 420 -40 128 460 -76 225 -148 258 110 -84 70 380 573 54 238 88 -24 22 259 -270 57
3807E7l8J77j2n64N96Oq04Q67K39j095J175p58K57j04J32M4l47N71j63m56R22
$$ 57 19 196 184 -380 216 222 -582 285 524 -571 604 -154 103 -1 131 175 -172 399 236 -220 702
3828G02j280N54L99o16k16L01N71j14J19l73l60O9P91m60K6j04M1j10n63J31K66
$$ 702 -578 -24 375 -241 -457 -156 415 301 420 47 -313 -244 547 87 113 9 50 -60 -623 -492 -226
3849b26k83L12L38J07J43r81K21O47n93K03K68k23k13L37P0Q6m99Q13n62K0j06
$$ -226 -509 -197 141 248 391 -590 -369 278 -315 -112 156 -67 -280 57 127 213 -286 527 -35 -15 -121
3870a21L46j58k51M11n78J75P23r10N0O64K81l46n31J12p0J80J57p62M54L87m11
$$ -121 225 67 -184 227 -351 -176 547 -363 -313 351 632 286 -245 -133 -203 -23 134 -628 -174 213 -198
3891a98k48n7L78R1n26L30j13M43L52m6l15j09M60l17q5K43M70q32j2M00K46o02
$$ -198 -446 -503 -125 -34 -560 -230 -343 100 452 406 91 -18 442 125 40 283 753 -79 -91 309 555 -47
3913d7J7J14m86O60m9J64l89K36o64N89q2j0j13k84M09R7K00p18J80J99m80Q13
$$ -47 -30 84 -402 258 209 373 -16 220 -444 145 63 53 -60 -344 65 162 362 -356 -176 23 -457 356
3935C56Mj92L46q38k7O93q4k48J36K28k02K37l81j20N2o05M00K63K08j59j9j22
$$ 356 360 168 514 -324 -351 342 258 10 146 374 172 409 28 -92 -40 -645 -245 18 226 67 48 -74
3957g4k93M97K20q4J6k94k92L19o6l94O64J6m87N91M29j79o69K42m57m86R39n82
$$ -74 -367 130 350 266 282 -12 -304 15 -51 -445 219 235 -252 339 768 589 -80 162 -295 -781 158 -424
3979d24R3P59n44J2k83M9N48o48M78l61O46j05K64j078P57J83r18l5J322n96o23
$$ -424 -331 428 -116 -104 -387 -338 210 -438 40 -321 325 220 484 -594 163 346 -572 -607 715 119 -504
4000e04K74L32J9j48L1n18O97P1p7m6q2k88J32P31p57M63k77K86l17m37N0k02
$$ -504 -230 102 121 -27 4 -514 183 254 177 131 49 -239 -107 624 -133 330 53 339 22 -415 -365 -567
4022e67O74p23R46j38k98J3J14m96P1n17R22m60M34O0j5N08l83n33K03K96q9J71
$$ -567 107 -616 330 192 -106 -93 21 -475 -404 -921 1 -459 -25 35 20 528 145 -388 -185 111 22 193
4044A93m46L66L63m66K09j33N2p3L7L09n50M24o2k15r4L30m34J09N63n74O19o54
$$ 193 -253 113 476 10 219 86 138 65 102 411 -139 285 223 8 -86 244 -190 -81 482 -92 527 -127
4066a27L12o8r9L71l29M63p75L65l68M42m09O54j65k76K25n46l0J10M67o88p2
$$ -127 185 117 18 389 60 523 -252 113 -255 187 -222 432 267 -9 216 -330 -360 -250 217 -471 -543
4087e43j08R02l94p4J1O86o60K35K70p15M6k02O57J15j72j11j19j58K62K37k52
$$ -543 -651 251 -143 -217 -206 480 -180 55 325 -390 -344 -546 111 226 54 -57 -176 -334 -72 165 -87
4108h7K56j02n4n6j02rL29m27m9M7L62J26q16L85O05n03k67M15k80P59n45L05
$$ -87 169 67 13 -43 -145 -154 175 -252 -301 -254 108 234 -582 -197 408 -95 -362 53 -227 532 -13 292
4130B92k54k0K18k47J82M6J66j75k82q9j05N15p9n98K34K84k83J23p6J7J02l77
$$ 292 38 18 236 -11 171 217 383 208 -74 -163 -268 247 168 -430 -196 88 -195 -72 -148 -131 -29 -406
4152d06M24n32O17K30n57j23O23j56p54P68K4l13N18K77n05p6o73J72N26m74O37
$$ -406 18 -514 103 333 -224 -347 276 120 -634 134 158 -155 363 640 135 59 -614 -442 84 -390 247
4173B47n8j12j73P79j498J051k31j98R09o14k74M54r0K75j50K00p64L4K45K1J97
$$ 247 189 77 -96 683 -815 236 5 -193 716 102 -172 282 192 467 317 517 -247 -213 32 53 250
4194B50k32n49P73o3L0L9L15J33k77k37M04o22R2p1k9k95O59m96N73r5o09O99
$$ 250 18 -531 242 179 209 248 563 696 419 182 586 -36 56 -15 -44 -339 320 -176 397 302 -307 392
4216C92J28k48r02Q03l17k66K20l61M09k97N04J72k17J10K85n10m37R23p16J40
$$ 392 520 272 -630 173 -144 -410 -190 -551 -142 -439 65 237 20 130 415 -95 -532 391 -325 -185
4236a85l72Q06o24N05l51j58L12R3R0n23L20J20m63N08j43k50K05l11L97j88l59
$$ -185 -557 249 -375 130 -221 -379 -67 26 116 -407 -87 33 -430 78 -65 -315 -110 -421 -24 -212 -571
4257e71M04Q43p67K04l8L83j59n57N46k76n7J20o10M17L11n5M53o00L45o13M54
$$ -571 -167 676 -91 113 75 458 299 -258 288 12 -45 75 -535 -118 193 138 591 -9 336 -277 177
4278A77j62j29J1j50J28J53K55K43o12n0m23J01N54P6K55J7n88l02R1Q90p93P95
$$ 177 15 -114 -103 -253 -125 28 283 526 -86 -136 -559 -458 96 172 427 444 -144 -446 -355 535 -258 537
4300E37j244J039m6l26O76o96o9K6N63n37L34m6n30P37j97q45O73J60N3m8k52
$$ 537 -707 332 286 -40 636 -60 -129 -103 460 -77 257 211 -319 418 221 -624 49 209 262 214 -38
4321c8J57K73m75J90l15l1j72O25j42m39K66j08j12L50k23j69L22L01j65l51J131
$$ -38 119 392 -83 107 -208 -239 -411 214 72 -367 -101 -209 -321 29 -194 -363 -41 260 95 -256 875
4342H75q80J41J95r0k41l49R2K56k59O85r61O64Q1j57j92l44P80l45J43L52r4
$$ 875 -5 136 331 241 0 -349 -257 -1 -260 425 -536 128 209 52 -140 -484 296 -49 94 446 352
4363C52m39N32M48o16o16K77J74l8K04o43N14m59Q51m70j3L04q48O88o04m4K37
$$ 352 -87 445 893 277 -339 -62 112 74 278 -365 149 -310 541 71 58 362 -486 202 -402 -446 -209
4384b09J13n5K89J56k59k37L95k56o60N67J45J77N1q4k23j9J49R9J3k97j39q0
$$ -209 -96 -151 138 294 35 -202 193 -63 -723 -156 -11 166 217 133 -90 -109 40 139 152 -145 -284 -364
4406c64M85k86j07P27k82N9%p93PK21N24q49R21k44N19n41O24o03M4l0o22R22
$$ -364 121 -165 -272 455 173 232 232 -561 -554 -333 191 -658 263 19 538 -3 621 18 62 32 -590 332
4428C32J28p20N10n39O07l24J44j02k39J471j580J17k4j60Q7K36J98n76M54j50
$$ 332 460 -260 250 -289 318 -6 138 36 -203 1268 -312 -195 -219 -379 -292 -56 142 -434 20 -130
4448a30L18K22r04J175j023L84J68l92L17m36J82O8L22L0k80l82P36M4j67J11
$$ -130 188 410 -494 681 -342 42 210 -182 135 -301 -119 -51 271 301 21 -361 375 419 252 363
4468C63m74m22N22J01l16j82L06J69p7J37K3K28m25k8l15K0P72N5p81O50n33J67
$$ 363 -111 -533 -11 90 -226 -408 -102 67 -10 127 150 378 -47 -75 -390 -370 402 457 -324 326 -207 -40
4490d0j76J25J18k16j90K56j15R5L15j38k07l6K19o13J016m33K83q3n53O14o19
$$ -40 -216 -91 27 -189 -379 -123 -238 -143 172 34 -173 -209 10 -603 413 -20 263 180 -373 241 -378
4511c78J17r3O83k80j80J72n01M32n76R71k85m99J332j381J114o51m38L37R85
$$ -378 -261 -354 329 49 -131 41 -460 -28 -604 367 82 -417 915 -466 648 -3 -441 -104 881
4530H81r86j63K60p13P68l54K02J58R8m80P39n27J21J04o59R31q84O94m78m08
$$ 881 -105 -268 -8 -721 47 -307 -105 53 151 -329 410 -117 4 108 -551 380 -504 190 -288 -696
4550f96Q18K31q85N69l05k17O74M28O2m66q99P42n17O39m1j82P7j58O30l99l95
$$ -696 122 353 -532 37 -268 -485 189 617 679 213 -686 56 -461 178 137 -45 32 -126 504 105 -290
4571b90O63j82N0K90j57p8o75O47m55O12m17n41k26N52J31n69J201l99M47K47
$$ -290 373 191 241 531 374 296 -379 268 -187 425 8 -533 -759 -207 -76 -645 556 157 604 851
4591H51j120j58l3O3J95J038j257O93L8n88j62J151r02J76k45J79o5k02K55M04
$$ 851 -269 -427 -460 -397 -202 836 -421 272 310 -278 -440 711 -191 -15 -260 -81 -146 -348 -93 311
4611C11j128J195N3l2n78m53L09P60m59l60O36k85J33n86O98m38K55j87L33n34
$$ 311 -817 378 431 399 -179 -632 -323 437 -22 -382 254 -31 102 -484 214 -224 31 -156 177 -357
4631c57M28l74J20J09j92P7l0j97K81K28Q1p33O06k63J08J8K22p25N30K80l87
$$ -357 71 -303 -183 -74 -266 -189 -219 -416 -135 93 174 -559 47 -216 -108 -90 132 -593 -63 217 -170
4652a70M29L12m00k03r2K11k68N97P8p73Q07l18k12l5M27L8j50K19j535J034K03
$$ -170 259 571 171 -32 -124 87 -181 416 494 -279 528 210 -2 -37 390 428 278 497 -1038 -4 199
4673A99k91k2o95R29k95O84r84P16M28l92m43K83l26O34k52N6L08j135N99M98
$$ 199 -92 -114 -809 120 -175 509 -475 241 669 277 -166 117 -209 425 173 229 537 -598 1 499
4693D99r21N20N85o41M30l05P0J81q67O07l42M37k29m67L41m62P52n28p2N25J64
$$ 499 -422 98 683 42 472 167 237 418 -449 158 -184 253 24 -443 -102 -564 188 -340 -412 113 277
4714B77m12M02o6o10N8M99qn51Q89j044P63k22P74o58L60p36L88O7K39o91P97
$$ 277 -135 267 201 -409 -351 148 140 -411 478 -566 197 -25 749 91 451 -285 103 170 409 -282 515
4735E15j192J136n85K95q45j24Q68m79R3N38l09k06P62l03N23q60k01N04J63k73
$$ 515 -677 459 -126 169 -676 -800 68 -411 -318 220 -89 -295 467 164 687 -173 -374 130 293 20
4755B0R8l42N2l71N41J70j2R7o23J03O9K50k74M9O0K68j047P45P17j074O79J02
$$ 20 118 -224 -172 -543 -2 168 156 253 -370 -267 -198 52 -222 -173 -113 155 -892 -147 570 -504 175 277
4777B77q48O15L01m6j66K9k30L03n38R67q28N26m55L6J41l98M14J18r87J098O4
$$ 277 -571 44 345 299 133 162 -68 235 -303 664 -164 362 -93 -57 84 -314 100 218 -769 329 393
4798C93j79L92q54K67M48m17l03L98K41l91j99P0r9K04l84L46J91m45L38l18O17
$$ 393 214 606 -248 19 467 50 -253 145 386 -5 -204 -134 -233 -29 -413 -67 124 -321 17 -301 316
4819C16n0J71l83m60KM96n57K27j42O27l23l9m8R2J91n1N62j11q26O75l43J53
$$ 316 266 437 54 -406 -404 92 -465 -238 -380 247 -76 -115 -163 -71 120 69 631 520 -306 369 26 179
4841A79l32K85J96j40L75r32K41j14N5O53q73O13J6J01o9J69k31n1R4j7k21L53
$$ 179 -153 132 328 188 563 -369 -128 -242 -187 466 -407 206 222 323 254 423 192 141 235 218 -3 350
4863C50m71L57o1l2L77n29j21M84k2j39J79o20M92k82r58Q44J4N81n94m48J482
$$ 350 -121 236 175 143 520 -9 -130 354 332 193 372 -248 244 -38 -996 -152 -138 443 -151 -599 883
4884H83n71m51J2M78p4J77j24l8k2l52p6K04JM43j83l20N31q67P09m31J15j27
$$ 883 312 -139 -127 351 277 454 330 292 270 -82 -158 46 47 490 307 -13 518 -349 360 -71 44 -83
4906h3J51j61J93p14P49j86R6L18q13O67J76r21M72L37l21K49R3j39L3Q7q86L15
$$ -83 68 -93 100 -614 135 -51 45 363 -450 217 393 -528 -56 281 -40 209 302 163 196 283 -603 -288
4928b88M16j4J8N65q98K96o01R64k72K15k80n23N47m44N56k09P00m43l17p4j95
$$ -288 128 114 132 697 -201 95 -506 458 186 401 121 -402 145 -299 257 48 748 305 -12 -86 -281
4949b81j26M75k53L47l4j42P8L60n48Q30j265P08j93M15k91L30l18l42l20K79
$$ -281 -407 68 -185 162 128 -14 64 424 -124 706 -559 149 -44 371 80 410 92 -250 -570 -291
4969b91M24L6q5k20N00J34j005L55K06k0J09l56K7J59l10N94p12M37p18Q74j5
$$ -291 133 169 84 -136 364 498 -507 -152 54 34 143 -213 -186 -27 -337 257 -455 -18 -736 138 123
4990A23J5K3K1Ol39l70P32k44k28L98n12r2J199n31q06Q15k74L2J85k30k49L42
$$ 123 138 161 182 188 -151 -521 211 -33 -261 137 -375 -467 732 201 -605 210 -64 -32 153 -77 -326 16
5012A6J18J24K28j42j08o94J195o36j64O33j04k26m48J21Q1o8R5K26j29qk61J59
$$ 16 134 258 486 344 236 -458 737 101 -63 570 466 240 -208 -87 -6 -74 21 247 118 110 -151 8
5034Hl80L40j59M27k09l10K33NN27p40M40q7k48j5J17m58j46O59l45O12l56L10
$$ 8 -372 -32 -191 236 27 -283 -50 -45 482 -258 182 95 -153 -168 -51 -509 -655 4 -341 271 -85 225
5056B25p85J249q00l04K98qN91r00O56Lj3n71P67o46K77L37m08J17L72n61R5j67
$$ 225 -560 689 -111 -415 -117 -125 466 -434 222 225 212 -359 408 -238 39 376 -32 85 457 -104 -9 -176
5078a76n46P43k07M05p7M4n09K16M15m00K02k36l59L98k07L65k92l02L63N59n64
$$ -176 -722 21 -186 219 142 186 -323 -107 308 -92 110 -126 -485 -87 -294 71 -221 -523 -160 399 -165
5099a65K91j56l35R13j116k9M99M41J59n86k45M56m48L10N9j46n65L3k91O39K67
$$ -165 126 -30 -365 548 -568 -597 -98 343 502 -84 -329 127 -321 -11 48 -98 -663 -630 -921 -282 -15
5120a5M6N3K09j01M7p71K3K13M68l49O09k46j52R9J92k99j0O97j050j7L42K27
$$ -15 31 84 293 192 239 -532 -509 -296 172 -177 432 186 34 133 325 26 16 713 -337 -354 -12 215
5142B15l93j35R99o96Q2j83K70k19N61l99M4o27N35l65j9Q55o27j9j28J43l49
$$ 215 -178 -313 686 -10 72 -111 159 -60 501 102 146 -481 54 -311 -330 525 -102 -121 -249 -106 -455
5163d55M56l2k31M17L66r76R17K15l28l37j30l16O88j99Q5m89M27l60K21l30M88
$$ -455 1 -31 -262 155 521 -455 462 677 349 12 -118 -434 254 55 140 -349 78 -282 -61 -391 97
5184I7r6M09k62k14o3o1M80n69O39p48O69M5J77o15N33o96M9J21J3K85n00N45
$$ 97 1 410 148 -66 -129 -190 290 -279 360 -388 281 326 503 -112 421 -275 -226 -105 -92 193 -307 238
5206B38m42p2l60M92j5J41O62l57J17K69k11l12L5j071J334j003P56l09k98J38
$$ 238 -204 -276 -636 -144 -159 -18 644 287 404 673 462 150 185 -886 448 -555 201 -108 -406 -268
5226b68m33L03P11l56J93k87N10k38o3k82RJ57K21p05M65Q6j118J442K73n54n2
$$ -268 -701 -398 313 -43 150 -137 373 135 72 -210 -201 -44 177 -528 -63 23 -1095 347 620 66 14
5247A4j82q3M42l74O77o65O80o80N54k75L35K09q89N10k00K75n67O12l61N06j068
$$ 14 -168 -251 191 -183 494 -171 509 -171 383 108 443 652 -237 273 73 348 -219 393 32 538 -530
5268e30K42N59K79q94J6R96o51q1J30q55O72L52m39J0m9K34q0K15R2k14n28O81
$$ -530 -288 271 550 -344 -328 668 17 -64 66 -789 -117 235 -204 -194 -243 -9 -89 126 218 4 -524 157
5290A57J11j89N7K30k68L65m91M82M90m72n23L90m76j38J78k30K92l27M47M23
$$ 157 268 79 136 366 98 463 -28 454 944 472 -51 339 -137 -275 -97 -327 -35 -362 85 508
5310E08l95L00o69L53l35N93n48K51q42O12j08K96m08L12Q1J10l18J75L66j5o34
$$ 508 113 413 -256 97 -238 355 -193 58 -784 -172 -280 16 -392 -80 1 111 -207 -32 334 319 -315
5331c15K41J31j46p00N58M96m86M97J19n80N23o57L13K18l62k07Q18l12j479J589
$$ -315 -74 57 -89 -789 -231 265 -221 276 395 -185 338 -319 -6 212 -150 -357 461 149 -1330 259
5351B59K13l10k3J6p94J002p1J9j41K0Q97j079l27K51L19n95L79p47R28Q6k81
$$ 259 472 162 139 155 -639 363 292 311 170 190 1087 8 -319 -68 251 -344 35 -712 216 302 21
5372B1J15m12J08Q7J85R02o46n62M06L12l99n2j80j04M40o86N5q8K85N11K40k56
$$ 21 136 -276 -168 -81 104 1006 360 -202 204 516 117 65 -115 -219 221 -465 -410 -498 -213 298 538 282
5394B82k80K1j06M01q36P93J94q37m17J027k11j67M51q43K35M8l21N60l84R61
$$ 282 2 23 -83 318 -518 275 469 -368 -785 242 31 -136 315 -528 -293 -245 -566 -6 -390 571
5414E71n56J56J19M20p70k00N84k4p42L51L01j71k69j7k14P86q12N79j77M91n6
$$ 571 15 171 290 710 -60 -260 324 300 -442 -91 210 39 -230 -247 -461 325 -487 92 -85 406 350
5435C50n03L68o29K92J1J23n14m8K84K84j61J31J02m10J16j98Q69j317M33J13
$$ 350 -153 215 -414 -122 -111 12 -502 -550 -266 18 -143 -12 90 -320 -204 -402 467 -850 -417 -304
5455c04J14l0O5K07r7K34k56j09L6n36K51R3L54L9K26n06k74L43k3j14L43J14
$$ -304 -190 -220 -155 52 -45 189 -67 -176 -140 -676 -425 -332 22 61 287 -219 -493 -150 -173 -287 56 170
5477A70m53L6M41N56r12N47J48k3o01J3K17k7n39L97N3p2L19m84j86J162n35k97
$$ 170 -283 -247 194 750 -162 385 533 510 -91 -78 139 112 -427 -30 23 -49 270 -214 -400 762 227 -70
5499g0K40Q0M13p63K68p10k95J058q81O06n41M48n5K78m94L82L66p04O87m41m26
$$ -70 170 250 663 -100 168 -542 -837 221 -660 -54 -595 -147 -202 76 -418 -36 330 -374 313 -128 -554
5520e54O99n60J70P53r69M77k73M94Q6p77M18M28m41Pl8Q72o11r02J256j172L54
$$ -554 145 -415 -245 508 -461 16 -257 237 323 -454 -36 392 -49 -42 -80 792 181 -721 535 -637 -283
5541b83N09k07K1K22M28j336P13K93q31K79K57o1l7R3r9m40N85L09p39o5M53m7
$$ -283 226 19 40 262 690 -646 67 360 -471 -192 65 4 -33 60 -39 -479 106 415 -324 -389 64 17
5563A7N60p53N68m94J84O6J07j85K05n10N6O0m0L78m28O79m96k35N63k54K96q65
$$ 17 577 -176 392 -102 82 148 255 70 275 -235 -179 -119 -159 219 -209 470 -26 -261 302 48 344 -521
5585e21N33N11m67L1J0k13k33M75l1K05l10R0L41m53L18n23mL66M6k77k47L83
$$ -521 12 523 56 87 97 -116 -349 126 95 300 -10 80 421 -32 286 -237 -241 125 171 -106 -353 30
5607C0k70n19N26J181m38j28k11M00r6k5j7r13J054k31m05J50J9j52K39l15l57
$$ 30 -240 -759 -233 948 510 382 171 571 475 450 433 -480 574 343 -62 88 107 -45 194 -121 -478
5628d78N4J28j40K46R6M74j8k08k62O40n00K91l44j98P60r94j67N43J07M51j025
$$ -478 -424 -296 -436 -190 -94 380 362 154 -108 532 32 323 -21 -219 541 -453 -620 -77 30 481 -544
5649e44L16j85O67n71Q21p21J65o3J71p83J276o36N46m36M6k5M66o22J92o4j16
$$ -544 -228 -413 254 -317 504 -217 -52 -115 56 -727 549 -87 459 23 69 44 510 -112 80 16 -100
5670a00J60l67J22P37l77l52k29J26L22n64Q76k23L4J20K4l98M10qj34L08m83
$$ -100 60 -307 -185 552 175 -177 -406 -280 42 -522 354 131 165 285 309 -89 321 313 179 487 4
5691DJ16l00J89K44L58q65L35j044J16J407o63n3K0R7L74Q00j104J41r27J104
$$ 4 120 -180 9 253 611 -254 81 -963 -847 560 -103 -156 -136 -39 335 1135 31 172 -755 349
5711C49l28j89l60l38O53K3K96j08K41n06j8O46p77M25m18Q56j19k95j03N78m34
$$ 349 21 -168 -528 -866 -213 -190 106 -2 239 -267 -285 361 -416 9 -409 447 328 33 -70 508 74
5732G4o46J127j59j02p37Q73o98N64m87O50q73L98j25L64j67p19N88m36L33J77
$$ 74 -572 555 396 294 -443 430 -268 296 -191 459 -414 -16 -141 223 56 -663 -75 -511 -178 -1
5752ak45Q62o49K36J47j74J15j48k2j54j0O58p10P9N11p66M00k46K4j78J3L45
$$ -1 -246 616 -33 203 350 176 291 143 121 -33 -43 615 -95 -16 495 -271 129 -117 -93 -271 -258 87
5774H7r2k72K53K02j46j96J19k25Q62l79J79j2r49J069n85J03J56J21k72o75M76
$$ 87 -5 -277 -24 178 32 -164 -45 -270 592 213 392 380 -569 500 -85 18 174 295 23 -652 -176
5795a76J41k85N54n23Q51j97n72n5o30O39n07J529q21J51J37p48K36q2O7R86o44
$$ -176 -35 -320 234 -289 562 365 -207 -262 -892 -253 -760 769 -52 99 236 -512 -276 -358 -291 695 51
5816E1n31N90j40l6J76J7k1M4o66KL26K08L04O8q6k79M23qJ93r71M80J07k36j25
$$ 51 -480 110 -30 -66 110 127 106 150 -516 -514 -188 20 324 392 306 27 450 442 635 -336 144 251 15 -110
5840a10L94M70l17k30J80l1O7r8j59J91r61L59j53N02n65N51j00L67p04J12jj21
$$ -110 284 754 437 207 387 356 423 325 166 357 -604 -245 -398 104 -461 90 -10 357 -347 -235 -236 -357
5862c57J50J242m81l21k96O6j51Q0N3q9J91k6L11j80m50J99M62q25N14k69RL15
$$ -357 -207 1035 554 233 -63 3 -148 -68 -15 -104 87 61 372 192 -258 -59 403 -422 92 -177 -168 147
5884A47Q9n79J62M78k86j94j04M86l51j4P26q24L23j25J9j82l38J023o72m7P09
$$ 147 236 -343 -181 297 11 -183 -287 199 -152 -166 560 -264 59 -66 -47 -229 -567 456 -216 -263 446
5905D46j8j57m85j52m9Q84o27N29K96l33k73m80N90l5q7J36m44K10J05r37J092
$$ 446 428 271 -214 -366 -415 469 -158 371 667 334 61 -419 171 136 49 185 -259 -49 56 -881 211
5926B11r53J88M82P9R6R2k7m2n8K7L8m72J29j65J032r29N9M87J30j76n03O3P06
$$ 211 -742 -554 -72 7 103 195 168 126 68 95 133 -339 -210 -375 657 -272 -213 274 404 228 -275 -212 494
5949D94n74p7L26o25J182q79j48k44Q15mQ62j186M87n16P70j003L14k38p4J44
$$ 494 -80 -157 169 -456 726 -153 -301 -545 270 266 1128 -58 429 -87 683 -320 -6 -244 -318 -174
5969a74R07o28k35k81N27o29oJ37M12K31L59m29o9k20k15J078o75K58k21j21N21
$$ -174 733 105 -130 -411 116 -513 -519 -382 30 261 620 191 122 -98 -313 765 90 348 127 6 527
5990E27m40K03n32O39l36o7K70l18J09m86N05R4K76l94nk72q1m30M82Q75o60j50
$$ 527 87 290 -242 397 61 -6 264 -54 55 -431 74 168 444 50 45 -227 -308 -738 -256 619 -41 -191
6012a91rJ15m80m5M70n16K93Q81o70j43L41O09o58r3L32N21q70J38j83N65q55
$$ -191 -200 -85 -565 -610 -140 -656 -363 518 -152 -295 46 655 -3 -96 236 757 -113 25 -158 407 -448
6033d48K41K33O28j67Rl34n74O47P5p11M14j98j50L27L36r4j4m37N19k64j25k05
$$ -448 -207 26 654 487 496 162 -412 235 310 -401 13 -185 -335 -8 328 234 220 -217 302 38 -87 -292
6055b92N68l4k74nr5k0J48K48L38k10n11K29m44O88M9p94K68j05K77l63j87L69
$$ -292 276 242 -32 -37 -132 -152 -4 244 582 372 -139 90 -354 334 383 -411 -143 -248 29 -334 -521 -152
6077a52K01J46j50p2m25P35K74q00O32l12n44J77M45q7n21R15m93k98k0N76k14
$$ -152 49 195 45 -27 -452 283 557 -243 389 77 -467 -290 155 68 -453 462 -31 -329 -349 227 13
6098A3k34K51k20J38k59j25M86J51n23R24l85k88m05M77K60l61J28n66J088o51
$$ 13 -221 30 -190 -52 -311 -436 50 201 -322 602 217 -71 -476 1 261 -100 28 -538 550 -101
6118a01M33m64O30l30L50k63K2m94J99l87N11j095Q50Qqq8k97P02k71K71r3P6
$$ -101 332 -132 498 168 518 255 277 -217 -18 -405 106 -989 -139 -131 -139 -227 -524 178 -93 178 85 161
6140A61n60m32P12J64L01l21j60K67l55N10r09J140p72Q31k47l03K89l72N62j76
$$ 161 -399 -831 -119 45 346 25 -135 132 -223 287 -622 518 -254 577 330 27 316 -56 506 330
6160C30j85n56k28M79Q8L7L20l20P40o38K85j72o50m8M44p0k2K63O33l97L51o44
$$ 330 145 -411 -639 -160 -72 -35 285 -35 705 67 352 180 -470 -518 -74 -144 -166 97 730 333 684 40
6182D0j76K08n29Q85q44O29j64O75r49P0J19J63j88N0M30j96j64M31l40J31j75
$$ 40 -136 72 -457 428 -416 213 49 724 -225 -155 -36 127 -61 -11 419 223 59 490 150 281 106
6203A06l98L72j49O81p59N62q7k0n12L11m57M87L24n11m30Q88l44o30J67M50K85
$$ 106 -292 80 -69 612 -147 415 328 308 -204 107 -350 137 461 -50 -480 408 64 -566 -399 51 336
6224C36m36J81J24j14j72L52o95O05l99J21j88L92K64q06O56q70L79Q61m04J90
$$ 336 -100 81 205 91 -81 271 -424 181 -218 -97 -285 107 371 -435 221 -649 -270 591 187 377
6244C77k94n41M06p3O71r17q4R94j88n84l24N00K32Pm50L54m1Ml36Q3K90l17L08
$$ 377 83 -458 -52 -125 546 -371 -455 539 351 -233 -557 -57 175 182 -268 86 45 49 -287 -204 86 -231 77
6267G7K76m49K42j68N61l7n32J99K22l61L71m62j12M47l36M18n74L57J38j19L22
$$ 77 353 -96 146 -22 539 502 -30 169 391 30 401 -61 -173 274 -62 356 -218 139 277 158 480
6288D80r17L64o57L87P51j61l09L62k15m15l85N45j86O15l67J50k24n19O37N60
$$ 480 -437 -73 -730 -343 408 247 -62 300 85 -330 -715 -170 -356 259 -108 42 -182 -701 -64 496
6308D96J17n1j172K69K72P1m29m25N08M98j03j15n79O40%M36l01J82o87P04j46
$$ 496 613 562 -610 -341 -69 2 -427 -852 -344 154 51 -64 -643 -3 -3 433 132 314 -373 331 185
6329A85n19%p0L43p4l31M17k68M82K28n20O0M14O2Qj51J78p96J13k41N54j47Q0
$$ 185 -334 -334 -404 -61 -135 -466 -49 -317 165 393 -127 -67 347 409 417 266 444 -352 -239 -480 74 -73 7
6352GJ87l41Rl75O69m37O75j60k92K03J6j82k4M24m00p27J279k86l04m06L42K89
$$ 7 194 -147 -138 -513 156 -281 394 234 -58 145 161 -21 -45 379 -21 -748 531 245 -59 -465 -123 166
6374A66m12N91j59K84r00N44M20k06j67k57K37M85r38O0LM18l57N47o50NM38m22
$$ 166 -246 345 186 470 -430 114 534 328 161 -96 141 626 -312 -252 -249 169 -188 359 -291 -286 152 -270
6396b70N85m0L9p25J088m02q95M36L44q65O51L91k93n14M97O9q6L64j07n03j07
$$ -270 315 275 314 -411 677 275 -620 -184 160 -705 -54 337 44 -470 27 96 10 374 267 -236 -343
6417c43N73n80M97j91J81o04N06P3k09K49l29J5k37L84K66k29J79r1m77N05R3
$$ -343 230 -350 147 -44 137 -467 39 112 -97 152 -177 -162 -399 -15 251 22 201 110 -367 138 231
6438B31l84m32R01j23k34j99Q3N54n53K4k1J41L31o69K75L72L38n10k46l63M13
$$ 231 -153 -585 316 193 -41 -240 -157 397 -156 -132 -153 -12 319 -350 -75 297 635 125 -121 -484 -71
6459g1l28J81k23N49K03j46K08L44l58l9p66M76j34k42K56j4R0K46J87l06J16
$$ -71 -399 -218 -441 108 311 165 373 717 359 320 -446 30 -104 -346 -90 -104 -14 232 419 113 229
6480B29p31O68N97j130rJ40M59o16L81j61L36k24j46O09j18k41q5L91k26l70L83
$$ 229 -502 166 763 -367 -376 -236 223 -393 -12 -173 163 -61 -207 402 284 43 -42 349 123 -247 136
6501A36l66O46l81k00L85L80n52j78j04L41l75m9O01q4Q0o34K01J43m35O49j24
$$ 136 -230 416 35 -165 220 600 48 -130 -234 107 -268 -317 284 200 280 -354 -153 -10 -445 204 80
6522H0m35M36j07J88J81n15K65r5J92o47J81k38J75qp3N03n5J54j83n67J64O75
$$ 80 -355 81 -26 162 343 -172 93 -2 190 -457 -276 -514 -339 -347 -420 83 28 182 -1 -568 -404 271
6544B71J09p5m66L43k42K51p66M18M81J93q48K07p02P51j86Q74m84l21M61m4m36
$$ 271 380 305 -161 182 -60 191 -575 -157 324 517 -331 -124 -826 -75 -261 613 129 -192 269 225 -211
6565b11P19o51L5j53M87J98j41m56R6J68j01M59o06N07l94k67O52n76K85K16k94
$$ -211 508 -143 -108 -261 226 424 283 -173 -77 91 -10 449 -157 350 -44 -311 341 -235 50 266 -28
6586b8k74J57Q57o72M4q0N10l48K16p32J13K44K87n17j11J554j253j77N80n38
$$ -28 -302 -145 712 40 84 4 514 166 382 -350 -237 7 294 -223 -334 1220 -33 -210 370 -168
6606a68K04r09J003jo22Q80o10L57K36P9q95J76j95L01j2J86N8k29j98J58K67
$$ -168 36 -873 130 129 -493 387 -223 134 370 449 -446 -270 -465 -164 -176 10 68 -161 -359 -201 66
6627F6N6k7K8j30k20P37k15m99k64m34J290j27r19Q05m78K29K20M60j005L38%
$$ 66 122 95 123 -7 -227 510 295 -204 -468 -902 388 261 -658 147 -331 -102 118 578 -427 -89 -89
6648h9M03m99j72M77q35P36j05J61m69N99k74k38J89l52l98Q71N38n78j62O44
$$ -89 314 -185 -357 120 -715 21 -84 77 -392 207 -67 -305 -116 -468 -866 5 543 -35 -197 447
6668D47j032Q50J42o00l90O1O67K7L33k43j84k99O22j318J019k14k42j51O11N34
$$ 447 -585 265 407 -193 -583 -522 145 172 505 262 78 -221 401 -917 102 -112 -354 -505 106 640
6688F40j084O59l36j16N13l06n88J17L71r2M3m25N2M97M50o22L26m22J89J26r2
$$ 640 -444 215 -121 -237 276 -30 -618 -501 -130 -222 -179 -604 -552 -55 395 -227 99 -323 -134 -8 -100
6709a00M42n70k24L59l43Q41o67O31n68m42J127m24o6R7L04j35m29l78R66N3j26
$$ -100 342 -228 -452 -93 -436 405 -262 369 -199 -641 486 62 -4 93 397 262 -167 -545 421 474 348
6730C48p35J13L33q8n06M74M05o52L63L56r8j10k75L56P9O6n5n34L88j92j16K44
$$ 348 -387 -274 59 -29 -535 -61 344 -308 55 411 313 203 -72 284 363 429 374 -160 228 36 -80 164
6752A64K87o39Q53p54K70o06J87N79j31j4p6N5P5QK9j62n17K05j41M33q02L65
$$ 164 451 -188 665 -89 181 -425 -238 341 210 196 120 175 250 258 287 125 -392 -187 -328 105 -697 -332
6774c32L91O77o27L91L98j110K57k83l81O75l56N0K59k58K69J73l73K97L45o69
$$ -332 59 736 109 500 898 -212 45 -238 -619 56 -300 -250 9 -249 20 193 -180 117 462 -207
6794b07J32n11J184r04l98L92N9K94M9q76J189m40j8L94p20J77k27J37L60l2n41
$$ -207 -75 -586 598 -306 -704 -312 -253 41 90 -786 403 -37 -55 339 -381 -204 -431 -294 66 34 -507
6815e07M22j97R23r74j07Q11p8n34J07l21Q71p68K79M30l03n49P36l21M2m2k44
$$ -507 -85 -282 641 -333 -440 371 293 -241 -134 -455 416 -352 -73 357 54 -495 241 -80 -38 -80 -324
6836c24K35k5m42O2L78j4R5K17J64j24n98Q93o77N94o60P55n69l35j52K27N82
$$ -324 -89 -114 -556 -494 -116 -130 -35 182 346 222 -376 517 -160 434 -226 529 -40 -375 -527 -300 282
6857B82o50M32K12q0j16k13m69L68j14N57l31j06L42J83l01n17N45J08l78K46
$$ 282 -368 64 276 196 80 -133 -602 -234 -348 209 -122 -228 114 297 -4 -521 24 132 -246 0
6877@k74N78k83J60k32M71n98j80M13o20N95n46L96L33l90M72m63J63O66n34K20
$$ 0 -274 304 21 181 -51 420 -178 -358 55 -565 30 -516 -120 213 -177 295 -168 -5 661 127 347
6898C47m6q79J02L56p1J28j89k28M84o09J23P55o5rl69k88J20j07J23N93j46l11
$$ 347 301 -578 -476 -120 -191 -63 -252 -480 4 -605 -482 273 208 199 -170 -458 -338 -445 -322 271 125 -186
6920a86N63m79M87j006N11N38J95k84l71j75l25O57o76O19j92l09J070o05M58
$$ -186 377 -102 385 -621 -110 428 623 339 -32 -207 -532 125 -551 68 -124 -433 637 32 490
6939D90m6l69o30P72l44P50n30m73m9O56n2k07k0k60K5P23k57l63N9K60k6m02
$$ 490 444 75 -555 217 -127 623 93 -380 -429 227 175 -32 -52 -312 -287 436 179 -184 -125 135 109 -293
6961b93N38j92K19K72l37j99o01N31O63k95l72J03j40n00M68K17l56l76P7N24
$$ -293 245 53 272 544 207 8 -593 -62 601 306 -66 37 -103 -603 -135 82 -274 -650 -573 -49
6981d9K86n8K70m74K49j34q3k19K4N06j87j45L48k09L92j17l44J76K34o19n0K39
$$ -49 237 179 449 -25 224 90 7 -212 -188 318 131 -14 334 125 517 400 56 232 466 -153 -203 36
7003C6n74R07m72K66p01Q90p77O13l19L54m04J21l67Q58k72J18m78L93k41M21
$$ 36 -538 369 -103 163 -538 352 -425 188 -131 223 -181 -60 -427 431 159 277 -201 192 -49 372
7023C72q13k0J007p44l90O15l55L95n8k13J07m36N46m51P52q93K04K11k28M46
$$ 372 -441 -461 546 -198 -588 27 -328 67 9 -204 -97 -533 13 -438 314 -579 -375 -164 -392 54
7043E4m13Q83k25R2k54M53n27m76N35K28p10M47m14L12j5J74p34J355j049k65
$$ 54 -359 524 299 391 137 590 63 -413 122 350 -360 87 -327 -15 -30 144 -590 765 -284 -549
7063e49O27NL01p66K28M20l8J5r3K12N3j50k2J09k81j63L19j73Rm12L59L74k08
$$ -549 78 83 384 -382 -154 266 228 243 150 362 415 265 243 352 71 -92 227 54 63 -349 10 384 176
7086A76K07n93L68J13j14k80K11L27o31J34M35j82nj17n6o6k16N49j7J06m05l02
$$ 176 383 -210 158 271 157 -123 88 415 -216 -82 353 171 166 49 -7 -73 -289 260 243 349 -56 -358
7108c58M96j36j48k37O48J52M3l99P56q61P74n33k35M55j25l00k67J050j351P12
$$ -358 138 2 -146 -383 265 417 460 61 817 -44 730 197 -38 417 292 -8 -275 775 -576 136
7128A36l1K23n57O39j97k42l49O87P7j00nj72L83n66o53P30J81j41l7n74K21M56
$$ 136 105 328 -229 410 213 -29 -378 309 386 286 281 109 492 -74 -727 3 184 43 6 -568 -347 109
7150A09m08R59j172J111p53N37J46n19l23J21N02P4p32l14J070q41O00K63l30
$$ 109 -299 660 -512 599 -154 383 529 10 -313 -192 310 384 -348 -662 408 -433 167 430 100
7169A00L1p30Q41l67L04j60K57p65Q74j94j99M73L23o18j3k06L44o40o7LL92N80
$$ 100 131 -599 242 -125 179 19 276 -489 385 191 -8 465 788 170 157 -49 295 -345 -412 -409 -17 563
7191E63q57J112m31k97j83J13n76N30J07k05Q5J49m4j56l45L97J85j1l9k25k07
$$ 563 -294 818 387 90 -93 20 -556 -26 81 -124 -39 110 66 -90 -435 -38 147 136 97 -128 -335
7212c35L3O53l30kQ8n16j02N50j02L62K1J09k08k81N6R8k95J4M35j30L8k68M48
$$ -335 -302 351 21 19 107 -409 -511 39 -63 299 320 429 221 -60 -4 94 -201 -187 248 118 156 -112 336
7235C36m97K62J6m24o5J08N28r7m08k26P11K91n25m2l51N4k81N57P72j200M47
$$ 336 -161 101 117 -307 -372 -264 264 167 -241 -467 244 535 10 -32 -383 -329 -610 -53 719 -481 -34
7256c4J06n29Q54p6l97k40N09J03k12j61L49p79P07M01q02J12n80J122j072R17
$$ -34 72 -457 397 321 -76 -316 193 296 84 -77 272 -507 200 601 -201 -89 -669 453 -619 298
7276B98p79J85J98L96r4l8L59p7M8k51J73m49J59k3q44M40K01m5Q16J39k04p61
$$ 298 -481 -296 -98 298 204 166 525 448 496 245 418 -31 128 105 -739 -299 -98 -143 673 812 608 -153
7298a53K76K61k28q9m44Q47o25N62m36oQ9m97N83k83P0p1m7K76M03n36K96l06
$$ -153 123 384 156 67 -377 470 -155 407 -29 -35 54 -443 140 -143 -73 -144 -191 85 488 -48 248 -58
7320e8k39P49q29%N78m78J40J89J40j83o61M50J52l36P66l72j1J08n3J77k29L54
$$ -58 -297 452 -377 -377 201 -277 -137 52 192 9 -652 -202 -50 -386 380 8 -3 105 52 229 0 354
7342C54l07Q4K25k59m17k85J160o86L49p38QO0R41r38j41K81O74q68L23k26M66
$$ 354 47 131 356 97 -320 -605 555 -131 218 -520 -512 -452 489 -449 -590 -309 365 -503 -180 -406 60
7363F0N43Q3l26k68K25m81NL71r38O01l7K47K2k60r2L75j32P50p97m05K58k2M64
$$ 60 603 686 360 92 317 -164 -159 212 -726 -125 -162 85 107 -153 -245 130 -2 748 -49 -454 -196 -218 246
7386B46L69k21p54J99k06M79m68J24L43N54q78J95m98J18O87qk06l58Lj5L98l18
$$ 246 615 394 -360 -161 -367 112 -356 -232 111 665 -213 -18 -516 -398 289 281 75 -283 -280 -295 103 -215
7408b15Q2P10l6p30j93N05L8p12N09L6L60j95j61n5l80M12J46o88K79J25R4J08
$$ -215 -133 577 541 -189 -382 123 161 -551 -42 -6 354 159 -2 -57 -437 -25 121 -567 -288 -163 -69 39
7430C9o65J92j93K21R16Jn42OK67k35M24J58p21o93N18Q0P9n0j19P15j75k15L21
$$ 39 -626 -434 -627 -406 510 511 -31 -25 242 7 431 589 -132 -825 -307 -227 -148 -198 -317 398 223 8 329
7453C29p9K38o47j53J88l47Q40K49q86P68K41p80k9N96l41l00j42M5J13l15J10
$$ 329 250 488 -159 -312 -124 -471 369 618 -268 500 741 -39 -68 528 187 -113 -255 -210 -97 -412 -302
7474c02M23L36L04j252O32Q62j207N8O25j48j001J130m48j9m6n26P00j87k21P90
$$ -302 121 457 761 -491 141 1003 -204 -146 479 331 -670 460 12 -7 -53 -579 121 -66 -287 503
7494E03k38n78J34m06M02M25K77l49o64O05j85P37r79O09N3m96q27J171k8o96
$$ 503 265 -313 -179 -585 -183 242 519 170 -494 111 -74 663 -316 293 346 -150 -977 194 166 -530
7514e30R33k11l71N76m33l65L03N62k31j50M94r13M22m88J40Q15m91L24J33j46
$$ -530 403 192 -179 397 -36 -401 -98 464 233 83 577 -336 86 -402 -262 553 62 386 519 373
7534C73k45j86j90L34m8j38K2j6N99j020R33p90L06n7m65N20L93n68K47L64l63
$$ 373 128 -58 -248 86 38 -100 -78 -94 505 -515 418 -372 -66 -123 -588 -68 325 -243 4 368 5
7555EL89l88R8J05l11l34O29P8n12O28Q0n28m4K70p1K07m92O95l89J70l62o07
$$ 5 394 6 104 209 -102 -436 193 271 -241 387 467 -61 -105 165 94 301 -191 504 115 285 -77 -684
7577f84O99j74k02K91m29m4M32N42j66n40M57l1N0n24N44K61m11m61Q2O05M2p05
$$ -684 15 -159 -361 -70 -499 -543 -111 431 265 -275 182 151 201 -323 221 482 71 -390 -308 297 339 -366
7599c66K69j06K45J74n3j98J99J32R7k41q15N32J97j36j07L43J24K15n67o3L44
$$ -366 -97 -203 42 216 163 -35 164 296 393 152 -663 -131 66 -70 -177 166 290 505 -62 -125 219
7620B19n47J77K5j66J77M96p23N59j52n05J81K53k28p1K27l28L90j58l37K32K00
$$ 219 -328 -151 -126 -292 -115 381 -342 217 65 -440 -259 -6 -234 -305 -78 -406 -16 -174 -511 -279 -79
7641g9k13l96R06p70L20L73O0K96j77k8n83J72M90m81k06O35R2n12K55k26j6J15
$$ -79 -292 -688 218 -552 -232 141 201 497 320 292 -291 -119 371 -110 -316 319 411 -101 154 -72 -88 27
7663B7J33m19K02M51l88M84o46n4O24l09m35k68K87N56l88k74L62M12m07j8k16
$$ 27 160 -259 -57 394 6 490 -156 -210 414 105 -330 -598 -311 245 -143 -417 -55 357 -50 -68 -284
7684b84K56m3M10l75O4l38N07K99J48n20K09L68n35k62K27L38l20k89k6p9j12
$$ -284 -28 -71 339 -36 28 -310 197 496 644 124 333 701 166 -96 131 469 149 -140 -166 -245 -357
7705c57N51j62m37J63o7P23j09m92M02O65l80j012M43K20p40P18j0l43L12Q4k07
$$ -357 194 32 -405 -242 -309 414 305 -187 215 880 500 -512 -69 151 -589 129 119 -224 88 172 -35
7726c5L13P5K24n60l62N81J16q49K38j60o1J062lk03n55M73k19l51K02R2K69M1
$$ -35 278 353 577 17 -345 236 352 -497 -259 -419 -480 582 579 376 -179 294 75 -276 -74 18 287 328
7748C28m45k52N30J14r95J62R4R43l1K05p97N66n00L19J98q1r86P72L86q55K25
$$ 328 -117 -369 161 275 -720 -558 -464 479 448 653 -144 422 -78 241 439 358 -628 144 530 -325 -100
7769a00j12O65l79m35M32r40J686m99m26L26j80r53J334q20j2J56J65j09L13r4
$$ -100 -212 453 74 -361 71 -869 817 318 -108 218 38 -915 419 -401 -413 -257 -92 -201 112 18
7789A8L90n12O08k60n57Q50j4n41l3M69k46M12p86O5k32j53P63L51l10J40n03
$$ 18 408 -104 504 244 -313 537 523 -18 -51 418 172 584 -202 -137 -369 -522 241 592 282 422 -81
7810h1J24k84J36P31j348N89J39K46J1m17rk39N64k70J14j90O73k93n88L95K05
$$ -81 43 -241 -105 626 -722 -133 6 252 263 -154 -163 -402 162 -108 6 -184 489 196 -392 3 208
7831B08R9k68j94N43j052J574j446M04P19m78p86K52O81j071O95J43p9R0o9M03
$$ 208 307 39 -155 388 -664 910 -536 -132 587 109 -677 -425 256 -815 -120 23 -56 34 -35 368
7851C68j51o50R25m16L90j468O36r2N22L46l31o94P97j0l69j5L57K34o49M67k56
$$ 368 217 -433 492 76 466 -1002 -366 -458 64 410 79 -615 182 172 -197 -212 145 379 -270 197 -59
7872e9k8N42m42l05j57M48j85M42j08l70K04J45k49k63J71J4m5K18R4J49n38M02
$$ -59 -87 455 13 -292 -449 -1 -186 256 148 -222 -18 127 -122 -385 -214 -200 -245 -27 67 216 -322 80
7894H0M81p34J08j48J55j59N6q3J94K0j39L54j73j08L04J92q70J76J98K05l59
$$ 80 561 -173 -65 -213 -58 -217 -161 -244 -50 -30 -169 185 12 -96 208 400 -470 -294 -96 109 -250
7915b50L78L2j44N65m36J57l95l2L99j25k13j26N7N09K39J12l98j69k10P35r42
$$ -250 128 160 16 581 145 302 -93 -125 274 149 -64 -190 -133 376 615 727 329 160 -50 685 -257
7936b57J25j83K38L4M58l71p4K6N95n86m21O3M05M43p17Q6p1K94R0l03m4M60m19
$$ -257 -132 -315 -77 -43 415 44 -30 -4 591 5 -416 -353 52 495 -222 -136 -207 87 177 -126 -170 290 -129
7959a29J062r24N64k65k71k42J39j62J96J71J69n41L37j93P8l76K73l14N59l3
$$ -129 933 9 573 308 37 -205 -66 -228 -32 139 308 -233 104 -89 -11 -387 -114 -428 131 98
7979I8L42m24n75N47n04N19p20N11k20N60o25K59Q7K15m4m38O34k19O9m17j05
$$ 98 440 16 -559 -12 -516 3 -717 -206 -426 134 -491 -232 -145 70 26 -412 222 3 72 -345 -450
8000d50R1M59l4L27m70k36k78J61k88M67m58J005m68K1K94L99j024L8R4K96L31
$$ -450 -359 100 66 393 -77 -313 -591 -430 -718 -251 -709 296 -172 -151 143 542 -482 -444 -350 -54 277
8021B77o77N92k03M58q00O59k46m97J46K94J95k93o0N13Q3n65J68K26k9Q7j56
$$ 277 -400 192 -11 447 -353 306 60 -437 -291 3 198 -95 -155 358 441 -124 44 270 241 328 172
8042A72L14m05J26j58l51j14M38K22M4j105J012m27N52j55l11N5k69M72K68j716
$$ 172 486 81 207 49 -302 -416 22 244 288 -817 195 -232 320 165 -146 -91 -360 112 380 -1336
8062a336O97J461r96j11L19n8q5k56L86M58l95Kj67Ll5l49N25k71O71j126K78
$$ -1336 -639 822 -174 -285 34 -24 -109 -365 21 479 84 86 -81 -78 -113 -462 63 -208 463 -663 -385
8083c85P3K61N21m09j68K50L52j025o2K24J051p19K30j88K9p35R76m63K78l43
$$ -385 -312 -51 470 61 -107 143 495 -530 -592 -368 683 -36 194 6 35 -700 276 -187 91 -252
8103b52k46P82j76J56j8m03J0N53o55K86M33q15m4J163j203J54L77J9k72l6k21
$$ -252 -498 284 108 264 246 -157 -147 406 -249 37 470 -345 -389 774 -429 -275 102 121 -151 -187 -408
8124d08O7L03N41k23k15l54K3L80K98k86l36J18J63n5J35K9k99M33m86J99K30
$$ -408 -341 -38 503 280 65 -289 -266 114 412 126 -210 -92 71 16 151 180 -119 314 -172 27 257
8145B57O4O86r61l52J92M65n99N57n93j35K75r6k20l45O09O01k61K74l92J03p4
$$ 257 321 1007 46 -306 -114 351 -248 309 -284 -419 -144 -240 -460 -805 -196 405 144 418 26 129 55
8166E5j97o5j31L10K39p59L14n28P26O0N3l15O37R8k54l55O61r1q64N63J4q10
$$ 55 -142 -207 -338 -28 211 -548 -234 -762 -36 24 77 -238 399 497 243 -112 549 458 -406 157 171 -639
8188f39O91M57m73
$$ -639 52 509 36
8191C6
$$ Imaginary data points
##PAGE= N=2
##DATA TABLE= (X++(I..I)), XYDATA
0@%%%%%%%%%%%%%%Jm9R6r6R6r6J34j82J92k19K67l28L77m33N10n81O71p70Q79
$$ 0 0 0 0 0 0 0 0 0 0 0 0 0 0 0 1 -48 48 -48 48 -48 86 -96 96 -123 144 -184 193 -240 270 -311 360 -410 469
33D69j003J136j293J463j639J839k056K295k560K849l164L509l882M292m741N226
$$ 469 -534 602 -691 772 -867 972 -1084 1211 -1349 1500 -1664 1845 -2037 2255 -2486 2740
49B740n759O344o993P707q489R351j0313J1400j2626J4018j5616J7475j9667K2303
$$ 2740 -3019 3325 -3668 4039 -4450 4901 -5412 5988 -6638 7380 -8236 9239 -10428 11875
63A1875k5533K9577l4819M1866n1794O6526j18512Q23790j174163j07518J693021
$$ 11875 -13658 15919 -18900 22966 -28828 37698 -80814 742976 -431187 -538705 1154316
74A154316j443431m74267J810887q73671j171230J636622j84541j194354J115558
$$ 1154316 -289115 -763382 1047505 173834 -997396 639226 454685 -739669 375889
83C75889L2249j232551J064437L99065j351908O38195Q01808j233880J45624R03578
$$ 375889 408138 -824413 240024 639089 -712819 -74624 727184 -506696 -361072 542506
93E42506q41818j5390Q89818q06350k42395J039089n48524n85032R88801j83923
$$ 542506 -299312 -314702 575116 -231234 -473629 565460 16936 -568096 420705 236782
103B36782p58197P27775O6220p08361O39666K15841q46532M26914M90790q05536
$$ 236782 -521415 206360 272580 -435781 203885 419726 -426806 108 490898 -314638
113c14638J05957O39171n68903j11183N74737m38619j71793O38664l53691m01206
$$ -314638 -208681 430490 -138413 -249596 325141 -113478 -285271 353393 -298 -401504
123d01504O40639r8352n47005M77992J50439m79749L06149J77471m73909K56828
$$ -401504 239135 140783 -406222 71770 222209 -257540 48609 226080 -247829 8999
133H999L05755n15577O6821M49039l82068j37198M24100j94575j77658L44051
$$ 8999 314754 -200823 -134002 315037 -67031 -204229 219871 25296 -152362 191689
143A91689j73348k37252L76019o4247l52743L08411J17334l45979J49268J69117
$$ 191689 18341 -218911 157108 92861 -259882 48529 165863 -180116 -30848 138269
153A38269k61799J04968J70414k90857M6594K70861k39231q4476K90691j06864
$$ 138269 -123530 -18562 151852 -139005 -92411 178450 -60781 -145257 145434 38570
163C8570j46266K02783o5258j29960K09211m8995k06996J99087O9403k32165R2591
$$ 38570 -107696 95087 29829 -100131 109080 60085 -146911 52176 121579 -110586 -17995
174a7995J29201j64307K8235R5694j54536L9565J47267j64566l9595J95081q0588
$$ -17995 111206 -53101 -24866 70828 -83708 -44143 103124 -61442 -101037 94044 13456
185A3456j11022J40188j3299q8067J05533k9121j02185J33652K3039j51090Q0060
$$ 13456 -97566 42622 29323 -58744 46789 17668 -84517 49135 72174 -78916 1144
196A144R1398j25600P512Q0478q0643J2420P4570r9347r667J19750p0676p3047
$$ 1144 92542 -33058 -25546 54932 -25711 -13291 61279 -38068 -47735 72015 1339 -71708
208g1708J05776r185p6131O0450k551n5146P4449K518r0903O5307N4447r2668
$$ -71708 34068 24883 -51248 9202 6651 -48495 25954 28472 -62431 2876 57323 -35345
220c5345Q321O9435m8940o234M6094m8005K800O5305n4953m0070P7757j2378o2325
$$ -35345 -27024 42411 -6529 -12763 33331 -14674 -11874 53431 -1522 -41592 36165 23787 -38538
233c8538M3014J3638l8584L1582m50m7558M4282K2739o7420J2400N4967l8841
$$ -38538 4476 18114 -20470 11112 10662 -36896 7386 30125 -37295 -24895 30072 -8769
245h769j5718L8532j5614m508L0120l1736j4131N0186j6683m1954L8013J7307
$$ -8769 -24487 14045 -1569 -6077 24043 -7693 -21824 28362 11679 -30275 7738 25045
257B5045l3902J2042J0047k0988J8145N384l9906J3899L3039l1991j3217L3659
$$ 25045 -8857 3185 13232 -7756 10389 15773 -24133 -10234 22805 -9186 -22403 11256
269A1256o603j2495J1907j1477m303K4749j6204k3097L1159J2314k7824P470J6273
$$ 11256 4653 -7842 4065 -7412 -11715 13034 -3170 -26267 4892 17206 -10618 -3148 13125
282A3125j0435J829J356j6300J1735J4960k3607l468K5602n090j6646R609l18
$$ 13125 2690 4519 5875 -10425 1310 16270 -7337 -10805 14797 9707 -6939 2670 2352
295B352n141O336j0644p926J9379K062j9462P997J4745r757n160L940k033L237
$$ 2352 -2789 3547 -7097 -15023 4356 6418 -13044 -5047 9698 -59 -5219 -1279 -3312 -75
309g5L297j1352M062J7224p486j0833R832M147q386j206q51l1P064l483r883Q796
$$ -75 3222 -8130 -4068 13156 5670 -5163 4669 8816 430 -776 -1627 -1658 5406 1923 -7960 836
325H36Q361j0933n411P023M95l863N9k652M917N813o408m195R443K387q528j700
$$ 836 9197 -1736 -7147 -124 371 -3492 -3433 -6085 -1168 4645 -1763 -5958 3485 5872 -2656 -4356
341d356O130O21o37j874p23O161J441q336j141O693j79o189J49J062K660o30m173
$$ -4356 1774 2395 1758 -116 -839 5322 6763 -1573 -2714 3979 3800 -2389 -2240 -1178 1482 852 -3321
358c321l80O484j625o739Q80O206o76m132J103L415J771j918l524K149N359k481
$$ -3321 -3701 2783 1158 -5581 -4701 1505 829 -3303 -2200 1215 2986 1068 -2456 -307 5052 2571
374B571m704K462L776j878k186r30J979J283l110l673L907L435l349l112L148
$$ 2571 -2133 329 4105 2227 41 -889 1090 2373 -737 -4410 -503 2932 -417 -3529 -381
389c81K188k594k423M40K146J891l082r44L990K132l111k015K770R86k294o26
$$ -381 1807 -787 -3210 -2770 -624 1267 -1815 -2759 1231 3363 252 -1763 1007 1993 -301 -927
405i27L97K647Q74k215j747L225j09l568o20J879j11m77j612M09L168K04l573
$$ -927 -530 2117 2991 776 -971 2254 2145 -1423 -2043 -164 -275 -752 -2364 -1955 1213 1417 -2156
422b156q0L852j166k564j13K254K51P51j127J58L560j334m172J497K123j758j313
$$ -2156 -2236 1616 450 -2114 -2227 27 278 1029 -98 60 3620 2286 -1886 -389 1734 -24 -1337
439a337J554J070p76M87k578J760J411j794l382K353K340k079m82J887O77J72
$$ -1337 217 1287 511 998 -1580 180 1591 -203 -3585 -1232 1108 -971 -1453 434 1111 1283
455A283j038k079R28K718k877j209L562l77p48l32M17P29L56j163k044K446K29
$$ 1283 245 -1834 -906 1812 -1065 -2274 1288 911 163 -169 248 977 1333 170 -1874 572 801
472H01j878l3K477l70r55n16j29j11R81j271p02K310M58j496J4J672l39r70n91
$$ 801 -1077 -1110 1367 997 42 -474 -603 -714 267 -1004 -1706 604 1062 -434 -420 1252 913 -57 -648
491f48O79M92j67r21O15R29k82p65p20J629K09j956m58L66J473n25m9p89J189
$$ -648 31 523 356 -565 50 979 697 -68 -788 841 1050 -906 -1364 -998 475 -50 -99 -888 301
510C01N2j127K24L35R35k087P42P78N29n89O5J40j27P78j474N97J734j055j165
$$ 301 353 -774 -550 -215 720 -1367 -625 153 682 93 158 298 171 949 -525 72 1806 751 -414
529d14K48J200p99kJ97j398J264P9j571L61J433j64j769O83P74q31L08J056p48
$$ -414 -166 1034 235 233 430 -968 296 375 -1196 -835 598 434 -1335 -652 122 -709 -401 655 -93
548i3Q08N64j397K15L23J94j444J419q17J43M29j31p90J320p65r43Q98M38j116
$$ -93 715 1279 -118 97 420 614 -830 589 -228 -85 344 213 -577 743 -22 -965 -67 371 -745
567g45K08Q86q69J008j71n5j16L33j50r97P43O14j02r64J203j85oj53m19n45L82
$$ -745 -537 349 -520 488 317 262 146 479 329 -668 75 689 587 -377 826 641 635 482 63 -482 -100
588a00Kn33P30O06l88k60O24j098N6R9m37K95K19n06Q78J46M34p75N94R6j204
$$ -100 -98 -631 99 705 317 57 681 -417 -361 -262 -699 -404 -185 -691 187 333 767 -8 586 682 -522
609e22J370j027k46K35L80l02N74o85N98k74o25P97j60m09q2K73L27J91j45j52
$$ -522 848 -179 -425 -190 190 -112 462 -223 375 101 -524 273 113 -296 -378 -105 222 413 268 116
629A16Ll74m03Q97m26k0N27QK22m46r4l08n27O41M65p55j29R07K56j87m75K93
$$ 116 119 -255 -658 239 -187 -207 320 328 550 104 10 -298 -825 -184 281 -474 -603 304 560 373 -102 191
651A91k31j5n26M66L29L18j37o90Q83l69L33k80j01J56m18N4K81j72Rk96K43J56
$$ 191 -40 -55 -581 -115 214 532 395 -295 588 219 552 272 171 327 -91 -37 244 72 81 -215 28 184
673A84N30j6r98K05J87m51M65j2k58l7l45j5O91J71m88J68l9n55J352q48J05j04
$$ 184 714 698 -300 -95 92 -359 106 94 -164 -201 -546 -561 130 301 -187 -19 -58 -613 739 -109 -4 -108
695a08m15O52J08l65L23M09j69o83J69L74o73L64J10J86j88j08o48O56N00k04
$$ -108 -523 129 237 -128 195 604 435 -248 -79 295 -378 -14 96 282 94 -14 -662 -6 494 290
715B90K18n40K16L26r94O98m31N30q97O76r13N01K38K71k98M74m35M71m31M07
$$ 290 508 -32 184 510 -484 214 -217 313 -584 92 -821 -320 -82 189 -109 365 -70 401 -30 377
735C77m39l07K00M48l65j68N48n38N13K95j36p79M86k96K13M9L09m97j41k6k67
$$ 377 -62 -369 -169 279 -86 -254 294 -244 269 564 428 -351 135 -161 52 101 410 -87 -228 -254 -521
756e21O99J23j37j60l96N79k72M70j37m26K45R1o14L78k2m25P33k12K89m48K1
$$ -521 178 301 164 4 -392 187 -85 385 248 -178 67 158 -456 -78 -100 -525 208 -4 285 -163 -142
777a42J44L93j27j09P2k16m95O48n52J14M6n33K84O07p6P35j140P74k79Q2J43
$$ -142 2 395 268 159 231 15 -480 168 -384 -270 -224 -757 -473 134 58 793 -347 427 148 230 373
798C73q39O94J84l26K42l06M22n61nM49k00M00k71n74K74K04P9j82n90J022j194
$$ 373 -466 228 412 86 328 22 444 -117 -122 327 127 527 256 -318 -44 160 239 57 -533 489 -705
819g05N15l66N50K00N2n38N4P2O58P7r78j23R16m82MM85n36J15M42n60J67K30
$$ -705 -190 -556 -6 194 246 -292 -238 -166 492 569 -409 -532 384 -98 -94 391 -145 -30 412 -148 19 249
841B49O0K26o62m21O65N67j313P02j26l38L15M2l36K82j23K1K31j77J37l32N00
$$ 249 309 535 -127 -548 117 684 -629 73 -53 -391 -76 -34 -370 -88 -211 -190 41 -136 1 -331 169
862A69J73o83J064j154O00k06J4K93j05L4m95N19l53N86m99pK88j24l9p82Q83
$$ 169 342 -341 723 -431 169 -37 -23 270 165 199 -296 223 -130 456 -43 -50 238 114 75 -707 176
883A76k4N0n01M57j05p70M43L76l57k16M76l78L94J32o37P65k18m60L98m09K57
$$ 176 152 202 -299 158 53 -717 -274 102 -255 -471 5 -373 21 153 -484 281 63 -397 1 -408 -151
904a51k43M51L79l31J34n20J69M76m44o83J293r12N19M7q73J00L29K61n27K38
$$ -151 -394 57 436 105 239 -281 -112 364 -80 -763 530 -382 137 184 -689 -589 -260 1 -526 -288
924b88N45j83l82O63nj04k24l90N03L0k29l63M87l28J86J81n27L60j08LO39o62
$$ -288 257 74 -308 355 350 246 22 -368 135 165 -64 -427 60 -268 -82 99 -428 -68 -176 -173 466 -196
946a96J40L55l11q1K37k42k97lM17L16Q8r4l87m7k62M09M5N01j52M19r94K07k33
$$ -196 -56 299 -12 -93 144 -98 -395 -398 19 335 423 329 -58 -105 -367 42 87 588 436 855 -139 68 -165
969a65RK70J81k95K32p63R48o01o2Q13p37P07l11n1qP21j005o2L72J68n51K24
$$ -165 -156 114 295 0 232 -531 417 -184 -246 567 -170 537 226 175 167 888 -117 -179 193 361 -190 34
991C4M1l97J44O56l30J66p47N49M1N6K03r97P93M35j31n88L73j65j40K5L61m57
$$ 34 75 -322 -178 478 148 314 -433 116 157 213 416 -581 212 647 516 -72 301 136 -4 21 382 -75
1013g5L07J14l44L17j87R8j16N28p15m00M69M44N32r03r1P1r92J504l46q54O08
$$ -75 232 346 2 319 132 230 114 642 -73 -473 -4 440 972 69 -22 49 -943 561 215 -639 -31
1034c1j21L48R5k83L39n28M4N47k75P7o87L47O18o50j51P39r39N71M36j119O16
$$ -31 -152 196 291 8 347 -181 -137 410 135 212 -475 -128 490 -160 -311 428 -511 60 496 -623 -7
1055gK28l08K96j67J29j64o01J215o37J11L03j99l20j52M87l52m59K13K17P41
$$ -7 221 -87 209 42 171 7 -594 621 -16 95 398 199 -121 -273 214 -138 -597 -384 -167 574
1075E74o12l83Q98o43Pk6rj37O7O80j24L3o86N41q11O73j16J1q8l9N08m28n16
$$ 574 -38 -421 477 -166 -159 -185 -194 -331 -264 416 292 325 -361 180 -631 42 -74 -63 -151 -190 318 -110 -626
1098f26J053k59k73K88L94l83J28k2j20K30J49n51j0n5j79J86O37p74K00K43N2
$$ -626 427 168 -105 183 577 194 322 300 180 410 559 8 -2 -57 -236 -50 587 -187 13 256 308
1119C08m44K53r8Q5p8J09l68N6M12j00J59m67q0j18O76L00P7o87m48Q33k54l73
$$ 308 -136 117 19 104 26 135 -233 -177 235 135 294 -173 -253 -371 305 605 682 -5 -453 380 126 -247
1141b47M24k76n0j90R68j76p73K28K04n8P6o43O60k13o90N75P54o38L3J72j84
$$ -247 177 -99 -149 -339 629 453 -320 -92 112 54 130 -513 147 -66 -756 -181 573 -65 -32 140 -44
1162d4%m43R90K39j464O21j45L9L08m0M5m11N77j15L82k67n36j72P10k89K98o52
$$ -44 -44 -487 503 742 -722 -101 -246 -207 101 61 106 -305 272 157 539 272 -264 -436 274 -15 283 -369
1184c69J30j27L87o21P98m38p3L95P7j27j57J79k99N23l06K80m84O45m09M46M3
$$ -369 -239 -366 21 -600 198 -240 -313 82 159 32 -125 54 -245 278 -28 252 -232 413 4 450 493
1205D93q45L84J2k80J18L65m00P0l00O39p81P78l58L3q6P11k36p0M0m42Q65k92
$$ 493 -352 32 44 -236 -118 247 -153 -83 -383 256 -525 253 -105 -72 -158 553 317 247 287 -155 710 418
1227D18r99P84Q5o0J74n76O36n81n36N05N70m48j35P5m39M22k24O01n51o4N04
$$ 418 -581 203 288 228 402 -174 462 -119 -655 -150 420 -28 -163 -88 -527 -105 -329 272 -279 -343 161
1248A61k30m13N54q13J020q9m71K40n21L25l86L24n02J384m60n79j07N84k56Q41
$$ 161 -69 -482 72 -741 279 190 -281 -41 -562 -237 -623 -299 -801 583 123 -456 -563 21 -235 606
1268F06m58l86j57JL64j63k31N58J50k13L52k75M10p71J67R7m82K1O71j75k42
$$ 606 148 -238 -395 -394 -30 -193 -424 134 284 71 423 148 558 -213 -46 51 -431 -410 261 86 -156
1289a56o56R27k40M85L63j205N81l6k3K92r62N04K87k24m7j59P91p18O82k68K11
$$ -156 -812 115 -125 360 723 -482 99 63 40 332 -630 -126 161 -63 -110 -269 522 -196 486 218 429
1310D29m83j028J189j84j89L61M44j011N29j76M00k50O70j196K19R5N5j09o2J5
$$ 429 -54 -1082 107 -77 -266 95 539 -472 57 -119 281 31 701 -495 -276 -181 -126 -235 -297 -282
1330b82M1L96K4n14N91l01q9L11K70K76l03M4m66Q7k91Q56m42J35qp19M82M5K07
$$ -282 -241 155 179 -335 256 -45 -134 177 447 723 420 464 -2 85 -206 650 208 343 335 -384 98 143 350
1353C50m38K61l62J79n02P75M01l50m72J73n20m26N64M93j62J98P46j071K67m83
$$ 350 -88 173 -189 -10 -512 263 664 314 -158 15 -505 -931 -367 126 -36 162 908 -163 104 -379
1373c79O43L58k45m34M43l00n35O44Q4k29j94J5J55L18K47q43Q76n83O2L68o69
$$ -379 264 622 377 -57 386 86 -449 195 279 50 -144 -129 26 344 591 -252 624 41 103 471 -198
1394a98K89l87J80J82j95j85M98o72M67j55K39j1N1k61j31o9K13M62j31o5k29
$$ -198 91 -296 -116 66 -129 -314 184 -488 -21 -176 63 52 103 -158 -289 -358 -145 317 186 121 -108
1415a08O35j16q4m73M26n22O1N25n39K76m3N01p59k75O51M96j196R78l51j53m27
$$ -108 527 411 327 -146 280 -242 -181 344 -195 81 38 539 -220 -495 156 652 -544 434 83 -70 -497
1436d97O20J22n02M92n88P0j83R15N91r68N49m41L83n22K69j60n13N3M21l65L06
$$ -497 123 245 -257 235 -353 -283 -466 449 1040 72 621 180 563 41 310 150 -363 -310 111 -254 52
1457E2Q2o0K45o31K15n35R00n20P5M32J25q11N65L07n00l8M29l16M52o61k9O75
$$ 52 134 74 319 -312 -97 -632 268 -252 -177 255 380 -431 134 441 -59 -97 332 16 468 -193 -222 453
1479D53j303J105K68p42P2O09j01qj011O65pn2p1R45o53p36j0M78L59j63K16n91
$$ 453 -850 255 523 -219 -147 462 361 353 -658 7 0 -52 -123 822 169 -567 -577 -99 260 97 313 -278
1501b78M93k71p8M87o39K37K80p4r2L35l78K57m95M24K28m97L31N8q24L64P71
$$ -278 215 -56 -134 353 -286 -49 231 157 65 400 22 279 -216 208 436 -61 270 328 -496 -132 639
1522F39r69N31j79J02pl21L56j0J79n74l7J39N90p05J18L98R4l71j2K0n37M95
$$ 639 -330 201 22 124 117 -204 152 142 321 -253 -290 -151 439 -266 -148 250 344 -27 -39 -19 -556 -61
1544f1j10K80j84M51m09j6K09R9p22R16j035J40P77j55l68K39J51o88P42q3j069
$$ -61 -171 109 -75 376 -33 -49 160 259 -463 453 -582 -442 335 180 -188 51 202 -486 256 173 -896
1565h96P10P08p89P99K6m91j16J47K77J93p63J4K83k93J28O22n36J3m2J13o0n88
$$ -896 -186 522 -267 532 558 67 -49 98 375 568 -195 -181 102 -191 -63 559 23 36 -6 107 47 -541
1587e41N58o60M15m5N14j26m72L17L03J51l21l99M19L84o49k17L53n33L54m98
$$ -541 17 -643 -228 -273 241 115 -357 -40 263 414 93 -306 113 497 -152 -369 -16 -549 -195 -693
1607f93P91Q7j29k09K92q6k45K44n17N56k77m62O53O97m87o04M09M95k85K4l33
$$ -693 98 185 56 -153 139 53 -192 52 -465 91 -186 -648 5 702 215 -389 20 515 230 254 -79
1628g9R59q23M58j084N95j39k72m61R27L04j52j67rn21Q74n61j10O24j0q02L44
$$ -79 880 57 515 -569 26 -113 -385 -846 81 385 233 66 57 -464 410 -151 -261 363 353 -449 -105
1649a05N02m4l12k15O78k26o17M72N4l71N9k30m46L72P30P4M4j41k52%k03N56
$$ -105 397 353 41 -174 504 278 -339 133 187 -184 -125 -355 -801 -429 301 375 419 278 26 26 -177 379
1671C79r8l19O78j76p22K81J97R5L2k41l92L07j03L35o47K35j84M0Q53r60M97
$$ 379 281 -38 640 464 -258 23 220 315 347 106 -286 21 -82 253 -394 -159 -343 -303 550 -410 87
1692H7o48N53L28n31k17J67K24J86l89J80m01J048K67j455M53N0k50M46n72N19
$$ 87 -561 -8 320 -211 -428 -261 -37 149 -240 -60 -461 587 854 -601 -148 -98 -348 98 -474 45
1712D5n3J56k39n40M07m8L83n8l78O17j13k49J1M87Q9%k82k49l74L78l00o27P70
$$ 45 -8 148 -91 -631 -224 -272 111 53 -325 292 179 -70 -59 428 517 517 235 -14 -388 -10 -310 -937 -167
1735a67K93j058R01j20N84l77K85j33j54o7l1J00j7j19R6p0N61o79J91j14l7k79
$$ -167 126 -932 -31 -151 433 56 341 208 54 -13 -44 56 39 -80 16 -54 507 -172 19 -95 -132 -411
1757d11JM40k45K11J13j81J89M93j045M46M25l12N2K09j25K68j199j01P80K8n5
$$ -411 -410 30 -215 -4 109 -72 117 610 -435 11 436 124 176 385 260 528 -671 -772 8 36 -19
1778a9j24L92k65q8m17k56J063k2L94n72L18o32L87J32r46O25n49N01N95k23n34
$$ -19 -143 249 -16 -104 -521 -777 286 264 658 86 404 -228 159 291 -655 -30 -579 -78 517 294 -240
1799b40N28M50p46N25q20L67K11j25j98m77J338l01o12m47O67K83p26M18j53J16
$$ -240 288 738 -8 517 -303 64 275 150 -48 -525 813 512 -100 -547 120 403 -323 95 -58 58
1819E8jq65R8R89k9p28M53N93m30j90k80M33N16o99M69l22K5M18r09O6ok55j32
$$ 58 57 -808 -710 279 250 -478 -25 568 138 -52 -332 101 617 -82 387 65 90 508 -401 -335 -341 -596 -728
1842g28P08p6K6k13j88P86o93l6P24m51l9l0K92M1j53K99k96P44k39l8k82m3M90
$$ -728 -20 -96 -70 -283 -471 315 -378 -414 310 -141 -180 -210 82 123 -30 269 -27 717 478 440 158 115 605
1865F05n24L93k88j92L92l02m03j48K83M10n1K32n88L53j23J08K30n64N39l93
$$ 605 81 474 186 -6 386 84 -319 -467 -184 226 175 407 -181 172 49 157 387 -177 362 -31
1885c1L6l29O93N3r21P04m43J1K49K27r8l03P4j02J23j38P11k33Q1J14m98n07
$$ -31 5 -324 369 422 -499 205 -238 -227 22 249 151 -152 -78 -180 -57 -195 516 283 364 478 -20 -527
1907e27M62N13l65O40n38j36o16kM65k90J095q80l18M61K82l36k9P18q81m9L90
$$ -527 -65 448 83 723 185 49 -567 -569 -104 -394 701 -179 -497 -36 246 -90 -119 599 -282 -331 59
1928E9L81q19Q2j24N49o5l79N23n8n12K48J06K62p64O44k17o4M38q17N82m45O21
$$ 59 440 -379 -297 -421 128 63 -316 207 149 -363 -115 -9 253 -511 133 -84 -148 290 -527 55 -390 231
1950B31n98J098r88O20J82n07q1m71J40O97m22L82l15m60K3J98M75L34K02q81
$$ 231 -367 731 -257 363 545 38 -43 -514 -374 323 -99 283 -32 -492 -469 -271 204 538 740 -141
1970a41j4K52n28R20l83L31J75o52L18k14J53k58j41K08K22l97m2j63M94J76k58
$$ -141 -155 97 -431 489 106 437 612 -40 278 64 217 -41 -182 26 248 -149 -191 -354 140 316 58
1991E8k29O84k58l25j5P1r5K62m59J84L98l87P03p19j55K59J23L97l53n90L37
$$ 58 -171 513 255 -70 -85 -14 -109 153 -306 -122 276 -111 592 -127 -282 -23 100 497 144 -446 -109
2012a09j49N02l24O99j84r29J144q29M07j37l31M4j5N49p21J4K46j71K55j06J061
$$ -109 -258 244 -80 619 435 -494 650 -179 228 91 -240 -196 -211 338 -383 -369 -123 -294 -39 -145 916
2033I16q52q61J63J35O19j49K09K88r64L53L96r37R23o70P34j59k03N18N47j537
$$ 916 64 -797 -634 -499 120 -29 180 468 -496 -143 253 -684 239 -431 303 144 -59 459 1006 -531
2053e31N10n69M73k83L30N6j69K0k13P25m57p60J225q26J36N82k63L16j56N3k71
$$ -531 -21 -590 -117 -400 -70 -14 -183 -163 -376 349 -108 -868 357 -469 -333 249 -14 302 146 199 -72
2074g2K56l26Q28k23l51j55j61k96O94l11L67J3n83J56J80n95N18j43k26M72j46
$$ -72 184 -142 686 463 112 -43 -204 -500 194 -117 250 263 -320 -164 16 -579 -61 -204 -430 42 -104
2095a04O7k23M25p4J14Q3J92o75p3O4J75nM67j03o50K97J12k20N78o28k7K68m08
$$ -104 -37 -260 165 91 205 288 480 -195 -268 -204 -29 -34 433 330 -320 -23 89 -131 447 -181 -208 60 -348
2118c48P45m48k39N56k73m90J10M35l64L04l78P31n12M58j74m38q9k6K18j18O46
$$ -348 397 -51 -290 266 -7 -497 -387 48 -316 -12 -390 341 -171 287 113 -325 -414 -440 -222 -340 306
2139C06j80j031R58r3l19L40j3J39N4m4lk49m99R1r2J111k92q4m84L50K92j15
$$ 306 126 -905 53 -40 -359 -19 -32 107 161 117 114 -135 -634 -543 -635 476 184 100 -384 -34 258 143
2161A43j068J187n92M53P7o2k22J63m36L30N18r10P62j1k46m15K58r0N19j12K03
$$ 143 -925 262 -330 123 200 138 -84 79 -357 -27 491 -419 343 332 86 -329 -71 -161 358 246 449
2182D49p18Q75k03r53K68J05L65n49J3O2L41l47l07R89r19L48J77J29K45q03M26
$$ 449 -269 606 403 -550 -282 -177 188 -361 -348 -286 55 -292 -599 390 -529 -181 -4 125 370 -433 -7
2203gO28o46M48q07N82m98m1L70J16k38L57p41O47K1M4K75m42K73K41p88J27j92
$$ -7 621 -25 423 -384 198 -300 -341 29 145 -93 264 -477 170 191 235 510 68 341 582 -206 -79 -271
2225b71J35J93J28K57l65J36l50j27L68J46p49j12M92J03j91j27M40K18K32o42
$$ -271 -136 57 185 442 77 213 -137 -264 104 250 -499 -611 -119 -16 -207 -334 106 324 556 -86
2245h6j63O98q20R06o53j29l84R42j90l30N48n8k20j2m59K52o1j47L13P05j150
$$ -86 -249 449 -371 535 -118 -247 -631 311 121 -209 339 281 61 49 -410 -158 -219 -366 -53 652 -498
2266d98Q43n87N65l5L88j086N92l31L92J72m03p04J233o56j10M38j62O65n21r96
$$ -498 345 -242 323 288 676 -410 182 -149 243 415 12 -692 541 -115 -225 213 51 716 195 -801
2286h01O67O65k83J38k15m2m39L95o94N67L78r16P46k98K83M08o83m9K94Q15j363
$$ -801 -134 531 248 386 171 129 -310 85 -609 -42 336 -580 166 -132 151 559 -124 -173 121 936 -427
2307d27O40o19Q04m75k31L6K73l11m19J201n72L55l43L95o74P77q95P49n95m66
$$ -427 213 -406 398 -77 -308 -272 1 -310 -729 472 -100 255 -88 307 -367 410 -485 264 -331 -797
2327g97M33R00l76J00k59k41L78m2m06M57k54N67N6J30n14m48P07k31O3r03O67
$$ -797 -364 536 160 260 1 -240 138 96 -310 147 -107 460 516 646 132 -316 391 160 223 -680 -13
2348a3m45J9P71l5J22k59o43K74M53o68M91J65j02O6n55M01J02n1k62K95K0m86
$$ -13 -458 -439 332 297 419 160 -483 -209 244 -424 67 232 130 196 -359 42 144 93 -169 126 146 -340
2370c40M10K69l47P0K98n12J46Q26o19j71m63P89l75k5J1L43k92K60o05N62k79
$$ -340 70 339 -8 62 360 -152 -6 820 201 30 -433 356 -19 -44 -33 310 18 278 -327 235 -44
2391d4l25Q3O81L1n23k4K06q9J90l61j27k74J31K39k95L70J79k54O99n53j51k20
$$ -44 -369 -286 395 426 -97 -121 85 -4 186 -175 -302 -576 -445 -206 -501 -131 48 -206 493 -60 -211 -431
2413d31R82j032M51m80K12r3j6N49r5J65n77L31K9O09p18P3j29P39q13N65p83
$$ -431 551 -481 -30 -510 -298 -391 -407 142 47 212 -365 -34 -5 604 -114 -41 -170 569 -244 321 -462
2434d62J006j84l03m4qK53j182J115N5k95K07o67K23L92N20p33J74N44q69q4K39
$$ -462 544 360 57 13 5 258 -924 191 246 -49 158 -509 -286 106 626 -107 67 611 -258 -342 -103
2455a03K42l63M60p37L45J62m71N68j15J93k20k51L82L82o06j05J21k26L6L00
$$ -103 139 -224 236 -501 -156 6 -465 103 -12 181 -39 -290 92 474 -132 -237 -116 -342 -306 -6
2475fJ11j14J48P22j871J111J51m28K03q62R80k66R6n48P91o3nk98k24L82M85
$$ -6 105 -9 139 861 -1010 101 252 -176 27 -835 145 -121 -25 -573 218 155 150 -148 -372 10 495
2496D95m52J00P4k28j3K10M38r56J422r79N74o39o50O87j64J7j00k14J33l7L15
$$ 495 43 143 217 -11 -24 186 624 -332 1090 111 685 46 -604 83 -81 -64 -164 -378 -245 -282 33
2517C3m84L54J99l41O16k08k52m52R17n12j8m13M28m89M2M69O86q30K08r3P4L92
$$ 33 -451 -97 102 -239 377 169 -83 -535 382 -130 -148 -561 -133 -622 -580 -111 575 -255 -47 -140 -66 326
2539C26p88N55k9j14J69p84Q12M13r67l20J007m76j72M24m7j55J20M49n02k06
$$ 326 -462 93 64 -50 119 -665 147 560 -407 -727 280 -196 -368 56 9 -146 -26 423 -79 -285
2559b85N63j18k70R8q3L20P8p5p86O41J75K85l06q1j6q59J077k65L8J59j00o0
$$ -285 278 160 -110 -12 -95 225 303 228 -558 83 258 543 237 156 140 -719 358 93 131 290 190 130
2581A30n43M06r8K70L60p83k38N12m24K69M36m2l56P04r49N24q04P22J33Pk0q83
$$ 130 -413 -7 -105 165 525 -258 -496 16 -408 -139 297 255 -101 603 -346 178 -626 96 229 236 216 -667
2603f67P06k10J48L07j80j54l1r0j59j52M29P5P87q95o8k33L65K25k28J52n50
$$ -667 39 -171 -23 284 104 -50 -81 -171 -330 -482 -53 22 809 -86 -154 -387 -22 203 -25 127 -423
2624d23L51m8Mq8Q02n99%Q3N3j09p22P49m40M22m65O83N1m50J008j134P60n62
$$ -423 -72 -120 -116 -204 598 -1 -1 82 135 26 -696 53 -387 35 -430 253 304 -146 862 -272 488 -74
2646g4K87k13J53k16N23m02K13n79J64N24P2o85j8M53m2j95N04l05m38L47n87
$$ -74 213 0 153 -63 460 58 271 -308 -144 380 452 -233 -251 202 160 -35 469 164 -274 73 -514
2667e14k69O02M62m8m53l63J301j496O66N69k05m76j62Q91l57o65P06l92P34j01
$$ -514 -783 -181 281 233 -220 -583 718 -778 -112 457 252 -224 -386 505 148 -517 189 -203 531 430
2687D30m40R1K16o7k77j86j16L77J50j14o1j1J23k15M7J05m14J32O52o34ON79
$$ 430 -10 81 297 230 -47 -233 -349 28 178 64 3 -8 115 -100 -53 52 -362 -230 422 -212 -206 373
2709C73j32J73j23l95M18j32q2R6m21R71j65k38j21J10l52L77J80l76k30K53M4
$$ 373 241 414 291 -104 314 182 100 196 -225 746 581 343 222 332 -20 357 537 161 -69 184 228
2730B28j10o33P43K8n79J49k40N52r56M09L96m27j79O44o1R3k64K42m05j19M75
$$ 228 118 -515 228 256 -323 -174 -414 138 -818 -409 -13 -440 -619 25 -36 57 -207 35 -370 -489 -14
2751a4M91p13N15m14M06l20m35M22k0R5L66m35k99P54p41R54p58L71L17M63p80
$$ -14 477 -236 279 -135 271 -49 -484 -62 -82 13 379 -56 -355 399 -342 612 -146 225 542 1005 225
2772B25k4k52M1k11Q2N4J55m23L93j18J80m28Q12m29k2k93L54Q89j070j67p04
$$ 225 201 -51 -10 -221 -139 -85 70 -353 40 -78 102 -326 486 57 35 -258 96 985 -85 -252 -956
2793i56J065o74L29j48J53M71k53R8l75N99m12N8M84k44J6n3K51k78m47M47k76
$$ -956 109 -565 -236 -384 -231 240 -13 85 -290 309 -103 -45 439 195 211 158 409 131 -316 131 -145
2814a45N39m90r9M8l44M16N4Q1n62J65P16o11J21N20r87J089l29M68p63Q5m5k19
$$ -145 394 -96 -195 -147 -491 -75 -21 60 -502 -337 379 -232 -111 409 -578 511 182 650 -113 -28 -73 -292
2836b92K76j53L41m2l31K50J22m7k57M10J03n30L64m38N55o55L30NNk36j87N27
$$ -292 -16 -169 172 130 -201 49 171 124 -133 277 380 -150 214 -224 331 -324 6 11 16 -220 -407 120
2858A20L05k64j70N7L00l79j65O6m77K56J31K36K17L98l22j1j5M32j499N67n8
$$ 120 425 161 -9 48 348 -31 -196 -130 -607 -351 -220 16 233 631 309 298 283 715 -784 -217 -275
2879b75P7J56L37l25k60J83N28r4m08k03K17L0L02J41m21K78m07m37P27R9m41
$$ -275 -198 -42 295 -30 -290 -107 421 327 -81 -284 -67 -37 265 406 -15 263 -144 -581 146 245 -196
2900a96N09O2j42l19k64Q84r36R17n36J53j24j80j06N08o53K16k20N00J49k2l95
$$ -196 313 375 233 -86 -350 534 -402 515 -21 132 8 -172 -278 230 -423 -207 -427 73 222 200 -195
2921a95M52n97P40l74J72M53o90k72k74J72M01p7l96K60J41n5J07l19L28l66L39
$$ -195 257 -340 400 26 198 651 -39 -311 -585 -413 -12 -89 -485 -225 -84 -139 -32 -351 -23 -389 -50
2942e0L37J54k63M86l82j07M19m62j42L45o39N65j82J03p2l32J00l35Q22n47k07
$$ -50 287 441 178 664 282 175 594 132 -10 335 -304 261 79 182 110 -222 -122 -457 365 -182 -389
2963c89M38j32L20l45r5M60m51M10m43O87k01q06L22J92K64K79m55K17l41M37
$$ -389 49 -83 237 -108 -203 257 -194 216 -227 460 259 -547 -225 -33 231 510 55 272 -69 368
2983C68j3o32O51k88j29k30O7L72j86l06P77o5n66L01p5M60q0q79k74L04L61M7
$$ 368 355 -277 374 86 -43 -273 -206 166 -20 -326 451 386 -180 121 46 506 426 -453 -727 -423 -62 -15
3005a5l51k44O43k74L81o2l57J37O6N75j429O17J37L13K51j295J099M0K50o08
$$ -15 -366 -610 33 -241 140 78 -279 -142 -76 499 -930 -313 -176 137 388 -907 192 232 482 -126
3025a26N04K96J13j127N29p9q2O2M40m85l32N45j08j11k65j54Q44l30n85K84J40
$$ -126 378 674 787 -340 189 110 28 90 530 45 -287 258 150 39 -226 -380 464 134 -451 -167 -27
3046b7m28L5Q96j57M9n11N04k46J26k98O0l31Q71j200M01O24m6r81P96l99J23
$$ -27 -455 -420 476 319 368 -143 361 115 241 -57 3 -328 543 -657 -256 368 322 -659 137 -262 -139
3067a39k09Q53j53k32J99m53K08K42m44P67p0p1q41K45P4N3p1K52M5J05l99k84
$$ -139 -348 505 352 120 319 -134 74 316 -128 639 569 498 -343 -98 -24 29 -42 210 255 360 -39 -323
3089c23M1Q41r45j10O56N0k44p2L01J12L22n57K64k47M4k57K6k18M24p30L51j16
$$ -323 -282 559 -386 -496 160 210 -34 -106 195 307 629 72 336 89 133 -124 -98 -316 108 -622 -271 -387
3111c87K46N19m35L47m03L64r5Q4m81k8J036r43j76N14M86k31p16j4J50oJ61l79
$$ -387 -141 378 -57 290 -113 251 156 240 -241 -269 767 -176 -352 162 648 417 -299 -313 -163 -169 -8 -387
3133c87K07K90n04L12O5l05K22K54k06Q9L59K97n7p16O5j80J07p0M87m56O31m98
$$ -387 -180 110 -394 -82 -17 -322 -100 154 -52 37 396 693 636 -80 -15 -195 -88 -158 329 -127 504 6
3155Fl26N40p93N15j8K26p53N59l39P21j15j69j74L59l60l04M59P7M23j26n48
$$ 6 -320 220 -573 -58 -76 150 -603 -44 -383 338 223 54 -120 239 -121 -425 34 111 534 408 -140
3176a40K12q9k29N17j50o1j37O01m32L45o08N65l55K03k1k75L42J44J87o4r05
$$ -140 72 -17 -246 271 121 60 -77 524 92 437 -171 394 39 242 221 -54 288 432 619 555 -350
3197c50Q61q57P48k51K21j5m07j49O92j271J519n13m09M82p89Q29m21L25j01n81
$$ -350 511 -346 402 151 372 357 -50 -199 493 -778 741 228 -181 301 -488 341 -80 245 144 -437
3217d37K29j84o7M41K58m26L54J3l87M69k66M3K41l09j41N00r9p7O67j098Q0j75
$$ -437 -208 -392 -459 -18 240 -186 168 181 -206 263 -3 40 281 -28 -169 331 232 155 822 -276 -196 -371
3239c71L13K37k08O05n78o8J67p3m01n06N67M79o42M69j00o6J43l56L11N36p99
$$ -371 -58 179 -29 576 -2 -70 97 24 -377 -883 -316 163 -479 -10 -110 -176 -33 -389 -78 458 -341
3260c41K14nk13M11L73k3n88M00m00O68K18q02O13l25k13j94m35J138k15J53J2
$$ -341 -127 -132 -345 66 439 416 -172 228 -172 496 714 -88 525 200 -13 -207 -642 496 281 434 446
3281D46o76J87M37l64N88J60n54l94k5N18j61P3j54J39l47O7r9lJ29P22q73j33
$$ 446 -230 -43 394 30 618 778 224 -170 -195 323 162 235 81 220 -127 -60 -159 -162 -33 689 -184 -317
3303c17J09K47k20N04n05N1m27O22j17M84K08j006P17N53r90k40O54n70L36J64
$$ -317 -208 39 -181 323 -182 -131 -558 64 -53 431 639 -367 350 903 -87 -327 327 -243 93 257
3323B57k41j57Q20n43k60M71j0m57k62J07N71m24J55m82L7M98j2m52J099n31l58
$$ 257 16 -141 679 136 -124 347 337 -120 -382 -275 296 -128 27 -455 -418 80 68 -384 715 184 -174
3344a74o5N04m27m4M38J5N6m50k68l2P43r63J51J64K27j86O37l07l26j80P6O75
$$ -174 -239 265 -162 -206 232 247 303 -147 -415 -447 296 -667 -516 -352 -125 -311 326 19 -307 -487 -411 264
3366B64j66O13l40o00N44J85m38K71m60P7L43l39k30M14p39P9J45N07j09k14K01
$$ 264 98 711 371 -229 315 500 62 333 -127 -50 293 -46 -276 138 -601 -522 -377 130 21 -193 8
3387Hk37M00l84O76j45l02n62M43k39P97k0n7j86J42j13q30J113o11o45M27K56
$$ 8 -229 171 -213 463 318 16 -546 -103 -342 455 435 378 192 334 221 -609 504 -107 -752 -325 -69
3408f9k26K65J2O72r41n9l85O56r2K25n55J41m55K42O84p51R05m81J47k83P59
$$ -69 -295 -30 -18 654 -287 -346 -731 -75 -167 58 -497 -356 -811 -569 115 -636 269 -212 -65 -348 411
3429D11j55n40N29L50l80p50K18K48M02m70J107p90j85K91J55o04Q4M45k68n22
$$ 411 256 -284 245 595 215 -535 -317 -69 333 -137 970 180 -5 286 441 -163 -79 366 98 -424
3449d24K87J49J94j45P12r94N58p21O94m01N5K80L30o79m62K22K24L3j50L95j110
$$ -424 -137 12 206 61 773 -221 337 -384 310 -91 -36 244 574 -105 -567 -345 -121 -88 -238 157 -953
3470i53J017j87k06K06K27o9n1O8k13K08l94Q3M2K50K23m68q5J04M90l94k33N52
$$ -953 64 -123 -329 -123 104 35 -16 52 -161 47 -347 -264 -222 28 251 -217 -302 -198 292 -102 -335 217
3492B17k08Q7j85J80L03K70p00K09k38m95M54K38L69p35N40o77K0Q41m62L7n06
$$ 217 9 96 -89 91 394 664 -36 173 -65 -560 -106 132 501 -234 306 -371 -351 490 28 65 -441
3513d41O79j3p45R1K09L17M13o78J62m69M16m50M75j89O07L54o91m01M86K44o48
$$ -441 238 225 -520 -429 -220 97 510 -168 -6 -475 -59 -509 -34 -223 384 738 47 -354 132 376 -272
3534b72N64p47J160j39l36k79L60J74n98o79P77N20k77n60Q18k96r3m89J76M29
$$ -272 292 -455 705 566 230 -49 311 485 -113 -792 -15 505 228 -332 486 190 97 -392 -216 213
3554B13l70m79Q64l96qJ62N02j11o70N33q44Q73J6n39Q99j042Q7L88K34j73K69
$$ 213 -157 -636 228 -168 -176 -14 488 377 -293 240 -604 269 285 -254 645 -397 -310 78 312 139 408
3575D08j64o9M5m25J32j53Q3M47M5l38m04K03qL31n9J70m52jL9L23J96K04k47
$$ 408 244 175 220 -205 -73 -226 -143 304 349 11 -393 -190 -198 133 74 244 -208 -209 -170 153 349 553 306
3598C06j57K65k89N78k50k96k54L7j09K83N9r03KN97P90r2p07J51J5N79k20o58
$$ 306 149 414 125 703 453 157 -97 -60 -169 114 173 -730 -728 -131 659 567 -140 11 26 605 385 -273
3620b73j51M65l97Q30k48K72o37O69m86m69M58m59l11J23M39k73J083q93K76o
$$ -273 -424 41 -356 474 226 498 -139 530 44 -425 33 -426 -737 -614 -175 -448 635 -258 18 12
3640A2q4j68L32j38J41k3m60K59N2j8oK31N57j029P14n43J024n32m77K14J54m12
$$ 12 -72 -240 92 -46 95 72 -388 -129 -77 -95 -101 130 687 -342 372 -171 853 321 -156 58 212 -200
3662b00N06l51k93J26l49N48K89o31J53K42l40k04K97J1R6m8n26M54J2j93J050
$$ -200 306 -45 -338 -212 -561 -13 276 -355 -202 40 -300 -504 -207 -196 -100 -148 -674 -220 -208 -401 649
3683F49m40j22J18m75L86j2k28r0l11R84m44M25q07J029r86P35K51l68m15O8m10
$$ 649 209 87 205 -270 116 104 -124 -214 -525 459 15 440 -367 662 -324 411 662 294 -121 -53 -463
3704d63Q6M62p78J02Q11M0L20l83k78k50L82o34L38M71oj05l82K09L0N30j02o48
$$ -463 -377 85 -693 -591 220 260 580 197 -81 -331 51 -583 -245 226 220 115 -267 -58 -28 502 400 -248
3726b48M63k96M62r0j23k02m19P81L8n38O12r83K12M92l36L62m31n6o28L22L32
$$ -248 215 -81 381 291 168 -34 -453 328 366 -172 440 -543 -331 161 -175 187 -244 -300 -928 -606 -274
3747b74K71k78j52o7P46l05j56J90q8n16J325o53k57L63q9M23n13M12n4p15L09
$$ -274 -3 -281 -433 -500 246 -59 -215 -25 -113 -629 696 43 -214 149 60 483 -30 382 328 -387 -78
3768g8l65q9O73p29j30J264j390J95R24j77P10q52Nj51O41p60k4j44K40K60M10
$$ -78 -443 -532 141 -588 -718 546 -844 -649 275 98 808 -44 -39 -190 451 -309 -333 -477 -237 23 433
3789D33r1p25l69J169o66j5K57J020n05m05J87j24Q00q91K33k88q0l82N53m83
$$ 433 342 -383 -752 417 -249 -264 -7 1013 508 103 290 166 966 75 308 20 -60 -442 111 -372
3809c72L89k30r5O12l72M2M1P5l50M71l6M58p71L54k64j46l90O24j91R3M1k21
$$ -372 17 -213 -308 304 -68 -26 15 90 -260 211 175 633 -138 216 -48 -194 -584 40 -151 -58 -17 -238
3831b38L84N86m75N35r46k09n8K36N42o62o8J172m30k95N83n91k90M10m66Q68
$$ -238 146 732 257 792 -154 -363 -421 -185 357 -305 -373 799 369 74 657 66 -224 186 -280 588
3851E88q83M22O6j00J11n88N37q44P13J71j13k63O05q02O14l3l31L7J58K05L36
$$ 588 -295 127 193 93 204 -384 153 -691 22 193 80 -183 422 -380 234 201 -130 -93 65 270 606
3872F06j223J121j92r9M4k26J11k32K54M1N46l83n00O69j07q36L17J53l52J195
$$ 606 -617 504 312 213 257 31 142 -90 164 205 751 368 -132 537 430 -406 -89 64 -288 907
3892I07n48j043L81j85J066j67n09M42m10k40J71K52j29L35p0j91L12k6j70j54
$$ 907 359 -684 -303 -488 578 411 -98 344 -66 -306 -135 117 -12 323 253 62 374 348 178 24
3912B4q44Q19l20pl70Q97l32M24n36M20o82N72K09j40J21N21n56p12M22L90K07
$$ 24 -820 -1 -321 -328 -698 199 -133 291 -245 175 -507 65 274 134 255 776 220 -492 -70 320 527
3933E27r41L47k21O37m16j5N32o53j50R77m76l81J36N90p74N42n91Q79n91J22
$$ 527 -414 -67 -288 349 -67 -82 450 -203 -353 624 148 -233 -97 493 -281 261 -330 549 -42 80
3953H0L6l44n9K62m0K03J37L08m50n81J002k27r4k76k57N19m59k15N44O75m49
$$ 80 116 -228 -287 -25 -65 138 275 583 133 -448 554 327 233 -43 -300 219 -240 -455 89 764 315
3974C15q5K78j54l04k5K72r09P00L54o90k06R8L73J85o8j13m12J99N83J48k56
$$ 315 230 508 354 50 25 297 -612 88 442 -248 -454 -356 17 202 134 21 -391 -192 391 539 283
3995B83j24J7L23j42j007J88N68K04j85J40k91k42m52R26l06l3N17n07k32J18
$$ 283 159 176 499 357 -650 -462 106 310 125 265 -26 -268 -720 206 -100 -133 384 -123 -355 -237
4015b37K64m70L06j33K40l55M59l11k66O35m15J67K75L00j037J217o89J84O47
$$ -237 27 -443 -137 -270 -30 -385 74 -237 -503 132 -283 -116 159 459 -578 639 -50 134 781
4034G81m93l49k69O93M0n7m02O88j19l65p92J399r87k46J016j334J339p64L18
$$ 781 288 -61 -330 363 403 346 -56 632 513 148 -644 755 -232 -478 538 -796 543 -221 97
4053I7po01R22n05l09K46M8J10m72j00M41m79R96r36O41J18q23J38J068p67J17
$$ 97 90 -511 411 -94 -403 -157 -109 1 -471 -571 -130 -609 387 -549 92 210 -613 -475 593 -174 -57
4074e7j4k75J58o1M1M9M20k19NJ78j25l48j39L09J93k18L38k7m88K23O18p79J66
$$ -57 -71 -346 -188 -249 -208 -159 261 42 47 225 100 -248 -387 -78 115 -103 235 208 -280 -57 561 -218 -52
4097e2m4K69M10j053J011o37l10N22K87n89R27n30m41J48l67K46j27K67k44K81
$$ -52 -96 173 583 -470 541 -96 -406 116 403 -186 741 211 -230 -82 -449 -203 -330 -63 -307 -26
4117b6m86O65k51n41J246k90n71J04M13j89j61L55J01r45M88L55k22L09l36L60
$$ -26 -512 153 -98 -639 607 317 -254 -150 263 74 -87 268 369 -576 -88 267 45 354 18 378
4137C78r6M30l23q86P7K36m7O04Q4j48o35O22m59N56l55M53l25o50N78M56n82
$$ 378 282 712 389 -497 -420 -184 -231 373 457 309 -326 296 -163 393 38 491 166 -484 94 550 -32
4158c2k41R59n60n16J090p34k37J5N11k94l30K13O15k47k98m17P58l57l12Q78
$$ -32 -273 686 126 -390 700 -34 -271 -256 255 -39 -369 -156 459 212 -86 -503 255 -102 -414 464
4178D64l40P52r99k39Q13k86j15r1K67l19N14r45J049l73l30O37J93r96MM58p5
$$ 464 124 876 -123 -362 451 165 50 -41 226 -93 421 -524 525 152 -178 459 652 -344 -340 118 43
4199D3j65K62n09J49N0P04M96r69J10m90N17J30L2l44N08q96K58k17N20qr1P4
$$ 43 -122 140 -369 -220 -170 534 1030 61 171 -319 198 328 360 16 524 -372 -114 -331 189 181 90 164
4221A64o05M51l18R3M08o4J62l96j66K25m7K28K50n10R5L39k19M41j144Q12l32
$$ 164 -441 10 -308 -215 193 129 291 -105 -271 -46 -93 135 385 -125 -30 309 90 531 -613 199 -133
4242a33%L41j29J25m31N66l74m1M82j59k65k40J102m92j52j16m28Q63n5q10m5
$$ -133 -133 208 79 204 -227 339 -35 -76 406 247 -18 -258 844 352 200 84 -344 519 464 -346 -391
4263c91j4j20L49J51L24r3J8l87m70%Q45o84N52k50M26m94L22j68P65l62l15o5
$$ -391 -405 -525 -176 -25 299 206 224 -163 -633 -633 212 -472 80 -170 256 -238 84 -84 681 319 4 -61
4285f1j99J34N9o3l82R28n17M85p00K1M77J19o35j17M17K63M02o46jq0J1O37n19
$$ -61 -260 -126 -67 -130 -512 416 -101 384 -316 -295 182 301 -334 -451 -34 229 631 -15 -16 -96 -85 552 33
4308C3K70m16N06m05m49M54L87j96p57J143j033R34m31R5j91QK12L58m28M2J10
$$ 33 303 -113 393 -12 -461 -7 380 184 -573 570 -463 471 40 135 -56 -48 164 522 94 136 246
4329B46P7m18j0l35L7RN70l01j17L80q6j43j53l31P53o8%l8j15M17l79Q1K56k56
$$ 246 323 -95 -105 -440 -403 -394 176 -125 -242 138 52 -91 -244 -575 178 110 110 72 -43 374 -5 76 332 76
4353G6M33p06J87o35P31N30q89rL4M41K44j070L13M3M47q49J025o38K77L73L63
$$ 76 509 -197 -10 -645 86 616 -273 -282 -248 193 437 -633 -320 -277 170 -679 346 -292 -15 358 721
4374G21r61M9P1l80Q22l29J26k17l64K49K83j81l35M07JJ84m77m1j02P8K12J8
$$ 721 -240 -191 -120 -500 322 -7 119 -98 -462 -213 70 -111 -446 -39 -38 146 -331 -372 -474 -396 -184 -166
4396a66K96n89N42k01j36K31J67m74O9K68m22M61l17M47K7p48J068n82m07M97
$$ -166 130 -459 83 -118 -254 -23 144 -330 -261 7 -415 46 -271 176 203 -545 523 -59 -466 31
4416C1p19K90K17M83k65J34j16r6m7L36l64j93J39P8jK66o6l51k33J22N16n29
$$ 31 -688 -398 -181 302 37 171 55 -41 -88 248 -116 -309 -170 -92 -93 173 107 -244 -477 -355 161 -368
4438c68M19r5N47m11p54N32K3L25j80j35r3l32N77l65J96O37j028Q19p29K46O81
$$ -368 51 -44 503 92 -662 -130 -107 218 38 -97 -190 -522 55 -310 -114 523 -505 314 -415 -169 512
4459E12m62M52o96L64K6N7L20k19k98l13N07n52J28K88p28P48l47K56j09M66n9
$$ 512 50 502 -194 170 196 253 573 354 56 -257 250 -302 -174 114 -614 134 -213 43 -66 400 341
4480C41J7j14%K21j39k31l56M00j48q6L09j31o18Q67n59K05l8M80n40J17k58P57
$$ 341 358 244 244 465 326 95 -261 139 -9 -95 214 83 -535 332 -227 -22 -60 420 -120 -3 -261 496
4502D96m69k40j33P20q8m79L04o6r96M03Q08j87L28L47q58K84K66n08J91j48N00
$$ 496 27 -213 -346 374 286 -193 111 45 -951 -548 260 73 401 748 -110 174 440 -68 123 -25 475
4523D75o66p7o41J255K96q55j3M69p32M93J94Kq9j40k82M06K4M5j53j43L44l80
$$ 475 -191 -268 -909 346 642 -213 -226 243 -489 4 198 200 111 -29 -311 95 119 164 11 -132 212 -168
4545a68K24j50N77p84K77O79p64N04m19k03M11m31P23p18K55M20p44k62N01JJ0
$$ -168 56 -94 483 -301 -24 655 -109 395 -24 -227 184 -247 476 -242 13 433 -311 -573 -72 -71 -61
4566f1J31j66j36M39o32J38N72m20J46m2J53J93j20m72J39j51O41j99K41K6J82
$$ -61 70 -96 -232 207 -425 -287 285 -135 11 -31 122 315 195 -277 -138 -289 352 153 394 420 602
4587F02q12r5j12O95J31q64O85J01q36O14m71L01L7R3J05o26o0K77M75j75r0p27
$$ 602 -210 -305 -417 278 409 -455 230 331 -505 109 -362 -61 -24 69 174 -452 -512 -235 240 65 -25 -752
4609g52P28m05K06o7PP02n78J39L05k76k75L00N03r52K84l06N52k85j03Q89j087
$$ -752 -24 -429 -223 -290 -283 419 -159 -20 285 9 -266 34 537 -415 -131 -437 115 -170 -273 616 -471
4630d71Q80J35p00p9l18J244l50n92M18n17m43O58M37n25K42K17j94J04M21r66
$$ -471 409 544 -156 -235 -553 691 341 -251 167 -350 -793 -135 302 -223 19 236 42 146 567 -399
4650c99Q29m02K26k6n74l68Q82l6l95k45M14K28Mk98k64kK28N16l08k12N80K33
$$ -399 430 28 254 228 -346 -714 168 132 -263 -508 -94 134 138 -160 -424 -426 -198 318 10 -202 378 611
4672F11j102Q25p7p25R61m70M54n63j05M87L52j81k01l33K0L25j06j48m28L88
$$ 611 -491 334 257 -468 493 23 477 -86 -191 296 648 467 266 -67 -47 278 172 24 -404 -16
4692a6N37m17J70q45P47r8K30m16J67m28O89q53N81k11l45O47M63k54J13o11m80
$$ -16 521 104 274 -571 176 78 308 -108 59 -369 320 -533 48 -163 -508 139 602 348 461 -150 -630
4713f30K04N07j8N28k51k60L1J3l27K93J10J66j36l14K75l67k14N90l73P04q65
$$ -630 -426 81 63 591 340 80 111 124 -203 90 200 366 230 -84 191 -176 -390 200 -173 531 -334
4734c34J41K20R39p20p49L38N33m03K89k5n46K16J60n5K71n04l82O82o22J88P03
$$ -334 -193 27 966 246 -503 -165 368 -35 254 229 -317 -101 59 4 275 -229 -611 71 -551 -363 340
4755C40j13j51L21n34m32O70p67J601p42N9J5r98J067o28J75L9k1L08J39j27j0
$$ 340 227 76 397 -137 -569 101 -666 935 193 252 267 -731 336 -292 -117 -78 -99 209 348 221 211
4776B11L43q84J80R21o00k97L68j3j85J69q42K89j84P70K32l37p85L19R15q91
$$ 211 554 -330 -150 771 171 -126 242 229 44 213 -629 -340 -524 246 478 141 -644 -325 590 -301
4796c01m5L78J47j165J131J62J9p03N10o44N75k06j2J52q2L40m49j21N5K53J25
$$ -301 -346 32 179 -986 145 307 326 -377 133 -511 64 -142 -154 -2 -84 256 -193 -314 -259 -6 119
4817A19n23J80J14m2O66j51r17R22m46K36j02j9J35j59k76N78n31J58L39k5k35
$$ 119 -404 -224 -110 -152 514 363 -554 368 -78 158 56 37 172 13 -263 315 -216 -58 281 256 21
4838B1J05m0l99O37l44J03k49N33l36J83J40J54M7l86l50K89K80p11l7M66k0N71
$$ 21 126 86 -313 324 -20 83 -166 367 31 214 354 508 555 169 -181 108 388 -323 -360 106 86 657
4860F57n06m01P59p01M73j10l47O07K84j314J061o07P42n98M22o38L22m78L47
$$ 657 151 -250 509 -192 281 171 -176 431 715 -599 462 -145 597 -1 421 -217 105 -373 -26
4879b6L69n19J7j18N97m27M2R1j04k21O48m0p15J01L09M2j18j05k82O03K80o34
$$ -26 343 -176 -159 -277 320 -107 -65 26 -78 -299 349 309 -406 -305 4 46 -72 -177 -459 144 424 -210
4901b10L13j72k07k24M68m79J274q81J90l33Q12m58K48j62L49p95K13L47k43J68
$$ -210 103 -69 -276 -500 -32 -511 763 -118 72 -261 551 93 341 179 528 -267 -54 293 50 218
4921B18o72M16m8m0p2P82o27l2j35K60j15K85k24Q4j004Q03J09k81O64k34n41
$$ 218 -454 -38 -86 -126 -198 584 -43 -75 -210 50 -65 220 -4 80 -924 -121 -12 -293 371 137 -404
4942d04J165p63M29n10N80p14j11P91r28K6J94M25k55J65P7K20k4k14p79K21L08
$$ -404 761 -2 427 -83 497 -217 -328 463 -465 -439 -245 180 -75 90 167 387 363 149 -630 -409 -101
4963a01O01r83O24p39j58P83l60k59m05J654r18K09K1l8N81q47K9M71l15J21N35
$$ -101 500 -483 141 -598 -756 27 -333 -592 -997 657 -261 -52 -31 -69 512 -335 -306 165 -150 -29 506
4984E06k06J35l28r1j92n0P48o47J131j100L22m78Q3j18M67m78OM83l29j9K2M72
$$ 506 300 435 107 16 -176 -226 522 -125 1006 -94 228 -250 -167 -285 182 -296 -290 193 -136 -155 -133 339
5006C39o56M14K25p57M80k28J89N45l4o57j88pK28J02Q7q1K62l15J28o63M22k67
$$ 339 -317 97 322 -435 45 -183 6 551 517 -140 -328 -335 -107 -5 82 1 263 -52 76 -587 -165 -432
5028d32n67J321r3l93N14m51J02M07o52P58q99N42O3k88j91N30q1j45L93n63j79
$$ -432 -999 322 229 -164 350 -101 1 408 -244 514 -385 157 220 -68 -259 271 190 45 438 -125 -304
5049c04R03m99k93Q14o99K11k72K8M49m21K30P13j363O24j48n1q3q4J60l13j19
$$ -304 599 100 -193 621 -78 133 -139 -111 338 -83 147 860 -503 121 -27 -78 -161 -245 -85 -398 -517
5070e17N1N18l57O80k59M46m28k98R5o7K0l56Q68m81K57l25J46J01l72J77k15
$$ -517 -466 52 -305 375 116 562 134 -164 -69 -136 -116 -472 396 -85 172 -153 -7 94 -278 -101 -316
5091c16o0M24M01J01o49ON3P8k6j23K19Q8o31N29M62m26j13oJ6K47o42N60l07
$$ -316 -376 48 449 550 -99 -93 -40 38 12 -111 108 196 -435 94 556 130 17 11 27 274 -368 192 -115
5114a15J63m10R63l88p33R74o35l4R2O16o28N11n83K06K99j39k51j41L72L55p97
$$ -115 48 -362 601 213 -520 454 -181 -215 -123 493 -135 376 -207 -1 298 159 -92 -233 139 494 -303
5135c03R54q26J57J000j404L34K78n18K58K66n9m2L02K04j043R74n00L24r97O86
$$ -303 651 -175 -18 982 -422 -88 190 -328 -70 196 137 95 397 601 -442 532 32 356 -641 45
5155D5L56k39L3J30l76L54L57j56M12j244P19p44L38M3J34l2q66K14K17O19km10
$$ 45 401 162 195 325 -51 303 660 504 916 -328 391 -353 -15 28 162 130 -736 -522 -305 314 312 -98
5177i8l48J413j010L62k90o18M92N78q9k43N00o91L42m43q2O21l28N67n74l08
$$ -98 -446 967 -43 319 29 -589 -97 481 392 149 649 -42 300 -143 -225 396 68 635 61 -247
5197b47J73pj25l61R69m06K62k98k93J092l43k80j64M03p35J231p60k96L56k83
$$ -247 -74 -81 -206 -567 402 -4 258 -40 -333 759 416 136 -28 375 -360 871 111 -185 171 -112
5217a12R8N35j082L14m8M93k20l61M54L0j57L19n78kJ97L68q86J092p66K49m57
$$ -112 -14 521 -561 -247 -295 198 -22 -383 71 101 -56 263 -315 -317 -120 248 -638 454 -312 -63 -520
5238e20L57M0k21K04pN68p49M69k61J24j0r3m23M29n4l11j1O12m7l15q4M41m60
$$ -520 -163 -123 -344 -140 -147 421 -328 141 -120 4 -6 -99 -522 -93 -147 -458 -469 143 96 -219 -303 138 -322
5261c22O44j50k63J41J18L3r74O31J90k48L26m55o1M03l81M81m23l18N38rR5K72
$$ -322 322 172 -91 50 168 201 -773 -142 48 -200 126 -329 -390 13 -368 113 -310 -628 -90 -99 -4 268
5283B68p20o8P96J65r58L59q5J008j306Q93r85O45M66J10l91p71L02P7K35j16
$$ 268 -452 -520 276 441 -517 -158 -243 765 -541 352 -633 12 478 588 197 -574 -272 -195 40 -76
5303g6P67q54O7J55k78j1l2j67O63j5k47J85K07j10K10n99J92j8K90l65K08m17
$$ -76 691 -163 -96 59 -219 -230 -262 -429 234 219 -28 157 364 254 464 -135 57 39 329 -36 172 -245
5325b45K71m35L29N00n63K24m73K07n7K74l06L21j84L12J15o49R98p43J100j891
$$ -245 26 -409 -80 420 -143 81 -392 -185 -242 32 -274 47 -137 175 290 -359 639 -104 996 -895
5345h95O22K56l51O09k04m4o0J23k54l30P55m30k41P13qj01o43L62K12L14l91
$$ -895 -273 -17 -368 241 37 -7 -67 56 -198 -528 227 -203 -444 269 261 160 -483 -121 91 405 14
5366A4K00l09O2n34L46N5m30L06K10J35L34q5P6n95n71Q19J41n2m07K93j37K19
$$ 14 214 -95 -33 -567 -221 -166 -596 -290 -80 55 389 304 380 -215 -786 33 174 122 -285 8 -129 90
5388I0l25L94k75n84P26L29l73n44M13M38l55k92J99L26L32J93N4l69j83R4m90
$$ 90 -235 159 -116 -700 26 355 -18 -562 -149 289 -66 -358 -159 167 499 692 746 377 194 288 -202
5409b02L22J59J80k32K5N3k22j10o1M72k52R7m98P2k48R00o28M71j097P48k73
$$ -202 120 279 459 227 252 305 83 -27 -88 384 132 229 -269 -197 -445 455 -173 298 -799 -51 -324
5430c24N64o12P21n25N63o1m8q93L40k03k38N76q5M91K91o81L2p1O00n90R3P52
$$ -324 240 -372 349 -176 387 326 278 -615 -275 -478 -716 -140 -225 266 557 -124 -92 -163 437 -153 -60 692
5452F92q22M9j86j29J0N36q45N95J52J29m11K40l38L52j03k72P87J84o53K88N5
$$ 692 -130 -81 -267 -396 -386 150 -695 -100 52 181 -230 10 -328 24 -79 -351 436 620 -33 255 310
5473C10n62K69l43L02J5L89no39K13O1J64l52k8J10M40o2k89r7J78n5k73O25p73
$$ 310 -252 17 -326 -24 -9 380 375 -264 -51 10 174 -178 -206 -96 344 282 -7 -104 74 19 -254 371 -402
5496d02K93N47l69R4j97K19j49K8j37O05o15N84p85l6J27J42L96q05M37N35p14
$$ -402 -109 438 69 163 -34 185 36 64 -73 532 -83 501 -284 -320 -193 -51 345 -460 -23 512 -202
5517b02O03n64M22n19O39r94L10N74o54K05j08K98K91l12O43j111N37k86K93J92
$$ -202 401 -163 259 -260 379 -615 -305 269 -385 -180 -288 10 301 -11 632 -479 58 -228 65 257
5537B57j99p48M35k40q8N89L48m9q36O13K12p92J46J130o53L48o62k99K72P55
$$ 257 58 -690 -255 -495 -583 6 354 305 -531 82 294 -498 -352 778 125 473 -189 -488 -216 539
5557E39q20L71p17O08M14j45l61J18m7k66Q45r85M74R3j60k7J75L27r50K67K58
$$ 539 -281 90 -627 -19 395 250 -111 7 -40 -306 539 -446 28 121 -39 -66 109 436 -514 -247 11
5578A1J20m18J0O18n43L3m4J36L78n46N20K06k35j87k7p24Q36J31l76J75O9l03
$$ 11 131 -287 -277 341 -202 -169 -213 -77 301 -245 275 481 246 59 32 -692 144 275 -101 74 143 -160
5600a60m14Q06m8l17R2M3k85R57o88K54j046J007J37n66L10Q7j18J32j71K32k99
$$ -160 -574 232 184 -133 -41 2 -283 674 -14 240 -806 201 338 -228 82 169 51 183 12 244 -55
5621e5K82l69O97k38m37l59P56n33l59Q48n86j76K26P65q63O10l63l09N49Q7%
$$ -55 227 -142 555 317 -120 -479 277 -256 -615 233 -353 -529 -303 462 -401 209 -154 -463 86 173 173
5642A73j48k25K2k44M32K42m19o49J436o77m35L96K93M0P7r03K15N6N8M77l60
$$ 173 25 -200 -178 -422 10 252 -167 -816 620 -57 -492 -96 197 237 314 -589 -374 -318 -260 217 -143
5663a43J7r08J138K43P1j67l58m13J187p25M7P34n89k45K3J8j55J405j125L0q9
$$ -143 -126 -1034 104 347 418 251 -107 -520 667 -58 -11 723 134 -111 -88 -70 -225 1180 55 85 -4
5684dj62L00O4J51l20k86n6M30q3l08J38J46L39K35r20N50L5m22K3M73N8o88K52
$$ -4 -166 134 198 349 29 -257 -313 117 34 -274 -136 10 349 584 -336 214 249 -173 -150 323 381 -307 -55
5707e5J53m0n0l17P10p98J87M81l06N43k29j77K50Kj07j78K80n53l14L84j13n
$$ -55 98 58 8 -309 401 -397 -210 271 -35 508 279 102 352 354 247 69 349 -204 -518 -134 -247 -252
5729b52k42N34J02M54o90K00J55R4k36j19N95j98j1l00l72J97K51J60p1p29O73
$$ -252 -494 40 142 596 -94 106 261 355 119 0 595 397 386 86 -286 -89 162 322 251 -478 195
5750A95l36P5K20O0k15k23kL29M97r32J72M7Q30n70p15K76M16L69l89q7K69l43
$$ 195 -141 -66 154 214 -1 -224 -226 103 600 -332 -160 -113 717 147 -568 -292 124 493 104 17 286 -57
5772e7qm59L63L0K83p0M28p08L36n39M90K67k59k82r8m21n6J194m41J82K25m99
$$ -57 -65 -524 -161 -131 152 82 510 -198 138 -401 89 356 97 -185 -283 -704 -760 434 -7 175 400 -99
5794i9k0J74k94P31k80j86k50q4p2m54N48M29k61m5N6J12k9k02R99n06l92n62
$$ -99 -119 55 -239 492 212 26 -224 -308 -380 -834 -286 143 -118 -163 -107 5 -24 -226 773 267 -125 -687
5816f87J135p8o81M67o44N74q1N3o58O01o38M56n16N03R09n20l08q1J89k7P7l29
$$ -687 448 370 -311 156 -488 86 5 58 -600 1 -637 -181 -697 -194 715 195 -113 -194 -5 -32 45 -284
$$ [...]
8191h4
##END NTUPLES=NMR FID
##END=
