##TITLE=1H_SR151_k TFA
 DMSO-d6
 8 sc, 
 21.2.2023
##JCAMPDX= 6.0         $$ Bruker NMR JCAMP-DX V2.0
##DATA TYPE= NMR FID
##DATA CLASS= NTUPLES
##ORIGIN= UXNMR, Bruker Analytische Messtechnik GmbH
##OWNER= root
$$ XWIN-NMR		Version 3.5
$$ Tue Feb 21 16:59:07 2023 Russian Standard Time (UT+4h)  she@DPX200
##.OBSERVE FREQUENCY= 200.13135
##.OBSERVE NUCLEUS= ^1H
##.DELAY= (6, 6)
##.ACQUISITION MODE= SIMULTANEOUS
##.ACQUISITION SCHEME= undefined
##.AVERAGES= 8
##.DIGITISER RES= 18
##SPECTROMETER/DATA SYSTEM= spect
##.PULSE SEQUENCE= zg30
##.SOLVENT NAME= DMSO
##.SHIFT REFERENCE= (INTERNAL, DMSO, 0, 15.7039)
##AUDIT TRAIL= $$ (NUMBER, WHEN, WHO, WHERE, WHAT)
$$ ##TITLE= Audit trail, XWIN-NMR		Version 3.5
$$ ##JCAMPDX= 5.01
$$ ##ORIGIN= Bruker BioSpin GmbH
$$ ##OWNER= she
$$ F:/spectra/data/she/nmr/H-F/1/audita.txt
$$ ##AUDIT TRAIL=  $$ (NUMBER, WHEN, WHO, WHERE, WHAT)
(   1,<2023-02-21 16:57:50.60 +0400>,<she>,<DPX200>,
      <created by zg, POWCHK disabled, PULCHK disabled
       configuration hash MD5:
       00 E9 B6 7A A2 85 ED C7 34 08 36 98 17 FE 4E 26
       data hash MD5: 16K
       9F D3 3D EA DA A9 8F 7B CD DB 8E 9E 2C 22 0E 57>)
$$ ##END=
$$ 
$$ hash MD5
$$ 5C 0B 93 B6 67 14 05 D2 37 2A 93 1F A0 9D D3 AD
##$RELAX= 
##$RELAX= 
##$RELAX= 
##$RELAX= 
##$RELAX= 
##$RELAX= 
$$ Bruker specific parameters
$$ --------------------------
##$DU= <F:/spectra>
##$EXPNO= 1
##$NAME= <H-F>
##$PROCNO= 1
##$TYPE= <nmr>
##$USER= <she>
##$AMP= (0..31)
100 100 100 100 100 100 100 100 100 100 100 100 100 100 100 100 100 100 
100 100 100 100 100 100 100 100 100 100 100 100 100 100 
##$AQSEQ= 0
##$AQ_mod= 1
##$AUNM= <au_zg>
##$AUTOPOS= <>
##$BF1= 200.13
##$BF2= 200.13
##$BF3= 200.13
##$BF4= 200.13
##$BF5= 200.13
##$BF6= 200.13
##$BF7= 200.13
##$BF8= 200.13
##$BYTORDA= 1
##$CFDGTYP= 0
##$CFRGTYP= 5
##$CHEMSTR= <none>
##$CNST= (0..31)
1 1 145 1 1 1 1 1 1 1 1 1 1 1 1 1 1 1 1 1 1 1 1 1 1 1 1 1 1 1 1 1 
##$CPDPRG= <>
##$CPDPRG1= <>
##$CPDPRG2= <>
##$CPDPRG3= <>
##$CPDPRG4= <mlev>
##$CPDPRG5= <mlev>
##$CPDPRG6= <mlev>
##$CPDPRG7= <mlev>
##$CPDPRG8= <mlev>
##$CPDPRGB= <>
##$CPDPRGT= <>
##$D= (0..31)
0 1.2 0 0 0 0 0 0 0 0.06 0 0.03 0 0 0 0 0.0002 0 0 0 0 0 0 0 0 0 0 0 0 
0 0 0 
##$DATE= 1676984269
##$DBL= (0..7)
120 120 120 120 120 120 120 120 
##$DBP= (0..7)
150 150 150 150 150 150 150 150 
##$DBP07= 0
##$DBPNAM0= <>
##$DBPNAM1= <>
##$DBPNAM2= <>
##$DBPNAM3= <>
##$DBPNAM4= <>
##$DBPNAM5= <>
##$DBPNAM6= <>
##$DBPNAM7= <>
##$DBPOAL= (0..7)
0.5 0.5 0.5 0.5 0.5 0.5 0.5 0.5 
##$DBPOFFS= (0..7)
0 0 0 0 0 0 0 0 
##$DE= 6
##$DECBNUC= <off>
##$DECIM= 32
##$DECNUC= <off>
##$DECSTAT= 4
##$DIGMOD= 1
##$DIGTYP= 9
##$DL= (0..7)
0 120 120 120 120 120 120 120 
##$DP= (0..7)
150 150 150 150 150 150 150 150 
##$DP07= 0
##$DPNAME0= <>
##$DPNAME1= <>
##$DPNAME2= <>
##$DPNAME3= <>
##$DPNAME4= <>
##$DPNAME5= <>
##$DPNAME6= <>
##$DPNAME7= <>
##$DPOAL= (0..7)
0.5 0.5 0.5 0.5 0.5 0.5 0.5 0.5 
##$DPOFFS= (0..7)
0 0 0 0 0 0 0 0 
##$DQDMODE= 0
##$DR= 18
##$DS= 0
##$DSLIST= <SSSSSSSSSSSSSSS>
$$ [...]
##$SUBNAM2= <"">
##$SUBNAM3= <"">
##$SUBNAM4= <"">
##$SUBNAM5= <"">
##$SUBNAM6= <"">
##$SUBNAM7= <"">
##$SUBNAM8= <"">
##$SUBNAM9= <"">
##$SW= 18.05172834244
##$SWIBOX= (0..15)
0 0 2 0 0 0 0 0 0 0 0 0 0 0 0 0 
##$SW_h= 3612.71676300578
##$TD= 16384
##$TD0= 1
##$TE= 0
##$TE2= 300
##$TE3= 300
##$TEG= 300
##$TL= (0..7)
0 120 120 120 120 120 120 120 
##$TP= (0..7)
150 150 150 150 150 150 150 150 
##$TP07= 0
##$TPNAME0= <>
##$TPNAME1= <>
##$TPNAME2= <>
##$TPNAME3= <>
##$TPNAME4= <>
##$TPNAME5= <>
##$TPNAME6= <>
##$TPNAME7= <>
##$TPOAL= (0..7)
0.5 0.5 0.5 0.5 0.5 0.5 0.5 0.5 
##$TPOFFS= (0..7)
0 0 0 0 0 0 0 0 
##$TUNHIN= 0
##$TUNHOUT= 0
##$TUNXOUT= 0
##$USERA1= <user>
##$USERA2= <user>
##$USERA3= <user>
##$USERA4= <user>
##$USERA5= <user>
##$V9= 5
##$VALIST= <valist>
##$VCLIST= <CCCCCCCCCCCCCCC>
##$VD= 0
##$VDLIST= <DDDDDDDDDDDDDDD>
##$VPLIST= <PPPPPPPPPPPPPPP>
##$VTLIST= <TTTTTTTTTTTTTTT>
##$WBST= 1024
##$WBSW= 4
##$XGAIN= (0..3)
0 0 0 0 
##$XL= 0
##$YL= 0
##$YMAX_a= 248478
##$YMIN_a= -305712
##$ZGOPTNS= <>
##$ZL1= 120
##$ZL2= 120
##$ZL3= 120
##$ZL4= 120
##$ABSF1= 10
##$ABSF2= 0
##$ABSG= 5
##$ABSL= 3
##$ALPHA= 0
##$AQORDER= 0
##$ASSFAC= 0
##$ASSFACI= 0
##$ASSFACX= 0
##$ASSWID= 0
##$AUNMP= <proc_1d>
##$AZFE= 0.1
##$AZFW= 0.1
##$BCFW= 1
##$BC_mod= 2
##$BYTORDP= 1
##$COROFFS= 0
##$CY= 11.3945322036743
##$DATMOD= 1
##$DC= 2
##$DFILT= <>
##$DTYPP= 0
##$F1P= 2.36226072786647
##$F2P= -0.459571619588291
##$FCOR= 0.5
##$FTSIZE= 0
##$FT_mod= 4
##$GAMMA= 1
##$GB= 0.15
##$INTBC= 1
##$INTSCL= 1
##$ISEN= 128
##$LB= 0.24
##$LEV0= 0
##$LPBIN= 0
##$MAXI= 10000
##$MC2= 0
##$MEAN= 0
##$ME_mod= 0
##$MI= 1.114404
##$NCOEF= 0
##$NC_proc= 0
##$NLEV= 6
##$NOISF1= 3.799351
##$NOISF2= 2.8
##$NSP= 1
##$NTH_PI= 0
##$NZP= 0
##$OFFSET= 15.70392
##$PC= 1
##$PHC0= -19107.14
##$PHC1= 14.00078
##$PH_mod= 1
##$PKNL= yes
##$PPARMOD= 0
##$PSCAL= 0
##$PSIGN= 0
##$REVERSE= no
##$SF= 200.130013532006
##$SI= 16384
##$SIGF1= 3
##$SIGF2= 2
##$SINO= 400
##$SIOLD= 16384
##$SREGLST= <1H.CDCl3>
##$SSB= 0
##$STSI= 0
##$STSR= 0
##$SW_p= 3612.71676300578
##$SYMM= 0
##$S_DEV= 0
##$TDeff= 0
##$TDoff= 0
##$TI= <>
##$TILT= no
##$TM1= 0
##$TM2= 0
##$TOPLEV= 0
##$USERP1= <user>
##$USERP2= <user>
##$USERP3= <user>
##$USERP4= <user>
##$USERP5= <user>
##$WDW= 1
##$XDIM= 8192
##$YMAX_p= 0
##$YMIN_p= 0
$$ End of Bruker specific parameters
$$ ---------------------------------
##NTUPLES= NMR FID
##VAR_NAME=  TIME,          FID/REAL,        FID/IMAG
##SYMBOL=    X,             R,               I
##VAR_TYPE=  INDEPENDENT,   DEPENDENT,       DEPENDENT
##VAR_FORM=  AFFN,          ASDF,            ASDF
##VAR_DIM=   8192,          8192,            8192
##UNITS=     SECONDS,       ARBITRARY UNITS, ARBITRARY UNITS
##FACTOR=    0.0002768,     1,               1
##FIRST=     0,             0,               0
##LAST=      2.2672688,     0,               0
##MIN=       0,             -305712,         0
##MAX=       2.2672688,     248478,          0
$$ Real data points
##PAGE= N=1
##DATA TABLE= (X++(R..R)), XYDATA
$$ plain form
0 0 0 0 0 0 0 0 0 0 0 0 -8 8 -8 8 -16 16 -24 24 -32 40 -48 56 -64 80 -92 107 -126 144 -168 192 -217 248
32 248 -281 319 -361 406 -455 511 -571 638 -710 786 -874 968 -1068 1181 -1303 1438 -1584
49 -1584 1744 -1921 2117 -2334 2575 -2845 3152 -3498 3897 -4360 4909 -5567 6374 -7394 8722
64 8722 -10541 13183 -17390 25136 -44061 187520 104579 -305712 95308 226161 -108119
75 -108119 -132771 185522 68382 -153839 -22403 118363 -62998 -100192 83458 48216 -177913
86 -177913 -82045 124971 -3857 -149408 62324 135692 -113352 -117008 131872 54001 -129477
97 -129477 26505 133978 -68461 -74076 136560 66419 -98483 35127 110970 -74565 -81799
108 -81799 106008 50105 -103470 -7981 87167 -41505 -94364 32629 43570 -75403 -56240
$$ packed form
0@%%%%%%%%%%qJ6j6J6k4L2m0M8n6P2q8J04j20J44j72J99k33K70l12L60m09M65
32B48n29O00o80P67q61R66j082J209j348J496j660J842k036K249k484K741l022
49a584L328l665M038m451M909n420N997o650P395q257R269j0476J1941j3768J6116
64H722j9263K3724l0573M2526o9197K31581q2941m10291M01020J30853l34280
75a08119k4652L18293j17140k22221J31436J40766j81361l7194J83650l5242k26129
86a77913R5868K07016j28828j45551K11732P3368k49044l656K48880p7871j83478
97a29477J55982J07473k02439n615K10636p0141j64902J33610P5843j85535p234
108h1799J87807n5903j53575R5489R5148j28672n2859J26993J0941j18973J9163
$$ plain form
119 -56240 44737 724 -68500 18774 73386 -33297 -55166 57856 35169 -62329 14893
130 14893 87399 -22997 -50594 70556 46336 -62903 680 70844 -27754 -65919 33599
141 33599 34871 -47061 -14192 43148 -15914 -52922 12821 23018 -42294 -25071 36462 -870
153 -870 -47275 13396 50601 -15706 -32315 33620 23923 -36663 -2257 49948 3177 -26231 28588
166 28588 28809 -29235 -7382 36469 -10442 -39787 14153 18882 -35078 -14872 33603 -1956 -38844
179 -38844 1161 19832 -20809 -21174 19636 10760 -20103 2199 26229 -2160 -12807 19615 14498
192 14498 -21125 -3272 27256 -715 -19087 17395 21153 -18992 -12700 19598 -245 -24013
204 -24013 1223 12637 -14956 -13321 13656 2397 -18290 500 11529 -12291 -13380 13603
$$ packed form
119e6240J00977m4013o9224Q7274N4612j06683k1869J13022k2687r7498P7222
130A4893P2506j10396k7597J21150k4220j09239O3583P0164r8598l8165R9518
141C3599J272q1932L2869N7340n9062l7008O5743J0197o5312J7223O1533l7332
153h70m6405O0671L7205o6307j6609O5935r697o0586L4406N2205m6771k9408N4819
166B8588K21n8044K1853M3851m6911k9345N3940M729n3960K0206M8475l5559l6888
179c8844M0005J8671m0641l65M0810q876l0863K2302K4030k8389j0647L2422n117
192A4498l5623J7853L0528k7971j8372L6482L758m0145O292L2298j9843k3768
204b4013K5236J1414k7593J635K6977j1259k0687J8790J1029k3820j089K6983
$$ plain form
216 13603 8259 -13436 1787 19876 -273 -11307 10897 13446 -9101 -5214 13760 3067 -10549
229 -10549 5100 11187 -8497 -8661 8712 -1420 -15665 509 9079 -9621 -10144 9726 4213
242 4213 -12599 -2060 10072 -3302 -9440 5865 7704 -4226 93 10500 1767 -5542 5095
255 5095 6584 -6104 -3174 8994 1427 -8327 2777 8522 -5213 -8002 4236 1170 -9736 -3131
269 -3131 5078 -2684 -5568 3919 3074 -5778 -1286 5436 -2075 -5677 4283 5667 -3630 -515 8260
284 8260 2774 -4614 1612 5186 -2601 -3787 3350 1874 -3976 155 3896 -2386 -4212 1623 -3
299 -3 -6044 -2053 3446 -1750 -4261 3110 3737 -3053 -1499 4395 639 -3576 1391 3912 -850 -602
315 -602 4002 2044 -2232 909 2581 -2108 -2809 2192 867 -3585 -508 2842 -1095 -3577 652 921
$$ packed form
216A3603n344k1695J5223J8089k0149j1034K2204K549k2547L887J8974j0693j3616
229a0549J5649O087j9684j64J7373j0132j4245J6174Q570j8700n23J9870n513
242D213j6812J0539J2132j3374o138J5305J839j1930M319J0407q733p309J0637
255E095J489j2688K930J2168p567r754J1104N745j3735k789J2238l066j0906O605
269c131Q209p762k884R487q45q852M492O722p511l602R960J384r297L115Q775
284H260n486p388O226L574p787j186P137j476n850M131L741o282j826N835j626
299co041L991N499n196k511P371O27o790J554N894l756m215M967K521m762K48
315f02M604j958m276L141J672m689p01N001j325m452L077L350l937k482M229K69
$$ plain form
331 921 -3107 -2051 1933 -17 -2043 1168 2130 -1028 -714 2205 455 -1743 1190 2762 -505 -646
347 -646 2795 1801 -1871 -337 1833 -939 -2330 424 831 -1581 -808 1173 -725 -1802 153 338
363 338 -1807 -899 1585 127 -1358 855 1915 -465 -866 1059 869 -1160 99 1384 355 -313
379 -313 1092 664 -938 -283 960 -739 -1485 313 475 -1301 -692 993 1 -1528 -236 615 -1037
396 -1037 -989 757 562 -392 505 1289 193 -275 914 370 -574 150 902 -116 -411 624 715 -478 -514
415 -514 328 -380 -1007 -351 496 -407 -702 425 236 -719 -51 488 -733 -571 550 309 -443 331 851
434 851 137 -337 439 525 -528 -153 417 26 -317 204 202 -250 -237 -62 -398 -667 -247 121 -350 -578 156
455 156 282 -478 -116 554 -86 -424 341 356 41 221 657 57 -48 372 13 -446 233 230 -15 -99 151 96
$$ packed form
331I21m028J056L984j950k026L211R62l158L14K919j750k198K933J572l267j41
347f46L441r94l672J534K170k772j391K754M07k412P73J981j898j077J955J85
363C38k145R08K484j458j485K213J060k380m01J925j90k029J259J285j029o68
379c13J405m28j602O55J243j699p46J798J62j776O09J685r92j529J292Q51j652
396a037M8J746j95r54Q97P84j096m68J189n44r44P24P52j018k95J035R1j193l6
415e14Q42p08o27O56Q47r03k95J127j89r55O68N39j221J62J121k41p52P74N20
434H51p14m74P76Q6j053L75N70l91l43N21km52J3J75l36k69M20L68m71k28P34
455A56J26p60L62O70o40l38P65J5l15J80M36o00j05M20l59m59O79lk45q4K50n5
$$ plain form
477 96 -190 -334 153 108 -122 -349 127 -57 -283 135 338 -75 -98 342 -53 -341 291 429 -36 98 393
498 393 204 -205 130 210 -192 -180 -33 -75 14 -21 -183 -51 15 -185 -82 -142 -137 -44 31 -213 134 426 50 -14
522 -14 195 222 -266 -108 125 199 -11 196 -88 -1 238 50 -155 -20 98 -108 -222 -111 64 58 -60 -129 -85
545 -85 -234 -4 -60 152 -45 55 -45 138 -66 143 -1 -263 -69 149 3 -3 269 238 -134 -5 -37 -36 -74
568 -74 59 -113 -227 24 -240 -46 81 -140 -97 -147 -125 -14 34 -44 5 -88 152 -126 138 235 -150 -79 148 287
592 287 -48 84 92 -204 -15 51 -20 -49 267 110 -220 -116 96 15 -57 21 -147 130 39 115 -95 32 90 55
616 55 79 -109 51 137 140 -28 104 165 -82 -41 218 -64 -77 45 -83 -134 77 41 -138 38 200 -85 -154 100
640 100 23 26 74 16 -136 -53 192 33 20 84 103 240 3 -88 154 156 17 -21 131 22 -103 -77 -33 -72 -99 -131
$$ packed form
477I6k86j44M87m5k30k27M76j84k26M18K03m13k3M40l95k88O32J38m65J34K95
498C93j89m09L35Q0m02J2J47m2Q9l5j62J32O6k00J03o0NR3P5k44L47K92l76o4
522a4K09K7m88J58K33P4k10K07k84Q7K39j88k05J35J18k06j14J11J75oj18o9M4
545h5j49K30n6K12j97J00j00J83k04K09j44k62J94K18j46oK72l1l72J29l2Jl8
568g4J33j72j14K51k64J94J27k21M3n0K2J11M8p8M9r3K40k78K64R7l85P1K27J39
592B87l35J32Qk96J89O6p1k9L16j57l30J04K12q1p2P8j68K77r1P6k10J27N8l5
616E5K4j88J60Q6Lj68J32O1k47M1K59k82j3J22j28n1K11l6j79J76J62k85o9K54
640A00p7LM8n8j52Q3K45j59j3O4J9J37k37r1K42Kj39l8J52j09j25K6M4l9k7l2
$$ plain form
666 -131 -89 -157 -95 4 126 15 -26 37 130 -37 -32 -82 115 -3 -34 69 -25 -58 -141 -26 40 93 38 71 -15 82 117
693 117 27 22 29 161 -20 -29 -63 -100 166 -85 -114 -25 -82 -185 7 10 118 32 -58 45 16 61 -100 -45 9 -42 82
720 82 7 29 110 -10 63 47 -51 75 -164 -59 77 -77 2 20 -127 70 68 1 -74 99 108 -5 7 156 90 71
746 71 -39 -186 74 173 -75 -22 76 -30 0 126 -121 163 15 -181 145 -29 -180 -31 44 110 -78 -79 -146 46
770 46 -40 -91 -24 97 66 115 84 -34 -109 -42 62 -31 11 47 100 92 124 -26 -110 112 -43 144 28 0 148 25
796 25 -52 -37 103 -73 -26 60 14 64 -107 25 -61 -24 -119 -120 -50 -51 -152 -154 -92 -123 67 -130 -143 -132 -67 -90 108 -35
824 -35 -86 103 24 -137 -77 -36 130 -98 -115 88 -49 58 -12 -154 37 67 141 -54 -58 68 -6 162 36 -11 143
849 143 54 103 106 -21 -32 -89 19 7 57 155 12 26 -73 11 -137 107 40 107 -36 -4 -99 89 69 106 -1 126
$$ packed form
666a31M2o8O2R9J22j11m1O3R3j67Nn0J97j18l1J03r4l3q3J15O6N3n5L3q6R7L5
693A17r0nPJ32j81rl4l7K66k51k9Q9n7j03J92LJ08q6r0J03k9M5j61N5N4n1J24
720H2p5K2Q1j20P3j6r8J26k39J05J36j54P9J8j47J97ko7p5J73Rj13J2J49o6j9
746G1j10j47K60R9k48N3R8j06L0J26k47K84j48j96L26j74j51J49P5O6j88jo7J92
770D6q6n1O7J21l1M9l1j18p5O7J04r3M2L6N3qL2j50q4K22j55J87j16k8J48j23
796B5p7J5J40j76M7Q6m6N0j71J32q6L7r5jP0jj01kO2l1J90j97j3J1O5k3J98j43
824c5n1J89p9j61O0M1J66k28j7K03j37J07p0j42J91L0P4j95mJ26p4J68j26m7J54
849A43q9M9Lj27j1n7J08j2N0R8j43J4r9Q4j48K44o7O7j43L2r5J88k0L7j07J27
$$ plain form
875 126 -9 64 53 11 -21 -211 -6 18 -167 24 -8 20 94 -212 178 123 -7 -4 -148 -29 151 19 -173 -125
899 -125 99 -10 -107 -74 38 -53 -76 -15 -59 62 22 -37 -9 -49 65 33 85 51 108 -66 -74 -236 -138 -60 40 114 79
926 79 -18 -120 109 71 170 -196 238 139 122 -96 36 64 -70 -74 -1 -27 9 185 -28 -1 39 120 -15 1 24 1
952 1 -96 -74 -29 94 -99 37 4 -28 -119 137 62 87 -20 59 -109 114 27 116 -62 -231 75 -24 47 164 -109
977 -109 52 -133 14 67 60 6 -87 -18 55 72 -150 54 134 183 84 -24 38 39 78 30 -23 3 -16 108 -70 83 -5
1004 -5 -5 -23 -115 -55 195 -99 33 -159 -192 132 56 -102 -98 60 -154 -30 2 -9 180 184 53 175 -201 -158 27
1029 27 252 -33 -50 25 -286 44 -75 -9 -44 26 -21 133 92 -71 35 -16 30 6 -45 -133 32 -10 12 28 141
1054 141 10 108 -40 -78 151 -190 -17 116 -51 -73 99 10 -51 -114 -54 40 219 114 -79 65 31 -169 -74
$$ packed form
875A26j35P3j1m2l2j90K05K4j85J91l2K8P4l06L90n5j30Lj44J19J80j32j92M8
899a25K24j09r7L3J12r1k3O1m4J21m0n9K8m0J14l2N2l4N7j74qj62R8P8J00P4l5
926G9r7j02K29l8R9l66M34r9j7k18J32K8j34mP3k6L6J76k13K7M0Q1j35J6K3k3
952Ar7K2M5J23j93J36l3l2r1K56p5K5j07P9j68K23q7Q9j78j69L06r9P1J17k73
977a09J61j85J47N3pn4r3O9P3J7k22K04Q0M9r9j08O2JL9m8n3K6j9J24j78J53q8
1004e%j8r2O0K50k94J32j92l3L24p6j58MJ58k14J24L2j1J89Mj31J22l76M3J85
1029B7K25k85j7P5l11L30j19O6l5P0m7J54m1j63J06n1M6k4n1q8J65m2K2J6J13
1054A41j31R8j48l8K29l41J73J33j67k2J72q9o1o3O0R4J79j05j93J44l4k00R5
$$ plain form
1077 -74 67 24 115 16 55 42 91 58 -67 76 39 -46 -118 -84 -134 104 -79 40 48 -93 70 67 20 203 206 6 13
1104 13 -56 77 152 57 117 -7 -82 -159 102 36 90 -39 223 -248 -175 14 -3 -74 90 46 -130 44 72 90 5
1129 5 76 -117 37 -85 -52 132 15 20 -51 4 78 -58 -18 -148 32 -156 -35 -93 -60 -22 -106 197 9 -101 9
1154 9 -64 96 32 176 -304 -35 191 -18 -34 -65 -170 24 -57 -85 -114 88 -46 -136 -2 85 -4 -121 19 -106
1178 -106 -36 -56 50 -23 -2 300 -29 -34 -101 128 75 45 50 -8 -17 58 21 44 -34 68 -146 32 129 -23 97 -57
1204 -57 39 -20 -148 -28 -21 -72 -68 160 88 71 24 -50 2 34 -31 -48 4 105 -24 6 105 47 -54 -27 69 -70 37
1231 37 68 71 -130 140 -30 -162 143 95 62 -82 63 3 49 -89 24 88 55 0 -83 34 -99 56 0 68 -140
1256 -140 -10 28 -78 -100 9 -161 -78 100 -122 -84 -111 16 105 73 -69 -99 50 -40 -19 -39 -89 91 -183 -25
$$ packed form
1077g4J41m3R1r9L9j3M9l3j25J43l7q5p2L4n0K38j83J19Qj41J63lm7J83Lk00P
1104A3o9J33P5r5O0j24p5p7K61o6N4j29K62m71P3J89j7p1J64m4j76J74K8J8q5
1129EP1j93J54j22L3J84j17Np1N5P4j36M0j30J80j88J21n8L3L8q4L03j88j10J10
1154Ip3J60o4J44m80K69K26k09j6l1j05J94q1k8k9K02j34r0J34Q7q9j17J40j25
1178a06P0k0J06p3K1L02l29no7K29n3l0Nn8rP5l7K3p8J02k14J78R7j52J20j54
1204e7R6n9j28J20Pn1MK28p2j7m7p4N2L2o5j7N2J01j29L0R9n8j01K7R6j39J07
1231C7L1Lk01K70j70j32L05m8l3j44J45o0M6j38J13O4l3n5q3J17j33J55n6O8k08
1256a40J30L8j06k2J09j70Q3J78k22L8k7J27Q9l2j42l0J49r0K1k0n0J80k74J58
$$ plain form
1280 -25 80 171 38 120 118 -132 -20 -48 15 -24 27 -46 -81 -68 50 37 4 -105 81 -62 -234 -168 -24 151 0
1305 0 96 18 -173 -54 -98 -29 -24 45 -91 123 -200 120 -34 22 46 65 -49 2 103 -15 -8 -204 -36 -78 106
1330 106 -6 13 -34 -73 20 -132 21 88 -9 -179 71 39 53 160 78 -97 -60 31 -137 -158 -34 19 107 99 -121
1355 -121 100 -52 -4 -165 -96 142 27 54 68 102 -121 54 -100 -248 -15 -11 -33 -21 -142 -54 -170 -98 -151 191
1379 191 76 -46 -35 -154 -148 97 101 -64 -34 87 106 40 55 34 -105 57 80 65 174 63 82 23 157 117 -41
1404 -41 -46 -3 56 75 -75 67 57 -67 -6 -26 129 -154 -89 -61 27 -73 53 -78 -13 74 34 16 -139 -22 44 112
1430 112 -29 -36 -98 87 84 174 -31 -13 109 -84 -22 -46 54 -91 53 120 -141 73 41 9 69 -67 93 104 26
1455 26 7 62 138 30 134 87 -18 36 38 -2 -15 131 -123 -74 -290 58 -157 136 -83 64 -215 -78 -27 -53
$$ packed form
1280b5J05R1j33Q2kk50J12k8O3l9N1p3l5J3J18j3l3j09J86j43j72O6J44J75j51
1305@R6p8j91J19m4O9NO9j36K14l23L20j54N6K4J9j14N1J01j18Pj96J68m2J84
1330A06j12J9m7l9R3j52J53O7r7j70K50l2J4J07q2j75L7R1j68k1J24N3Q8qk20
1355a21K21j52M8j61O9K38j15K7J4L4k23J75j54j48K33Mk2J2j21Q8j16P2n3L42
1379A91j15j22J1j19OK45Mj65L0J21J9o6J5k1j39J62K3j5J09j11J9n9J34m0j58
1404d1nM3N9J9j50J42j0j24O1k0J55k83O5K8Q8j00J26j31O5Q7m0j8j55J17O6O8
1430A12j41po2J85lR0k05J8J22j93O2k4J00j45J44O7k61K14l2l2O0j36J60J1p8
1455B6j9N5P6j08J04m7j05N4Km0j3J46k54M9k16L48k15K93k19J47k79J37N1k6
$$ plain form
1479 -53 -43 -17 93 13 -56 -22 -22 -88 33 43 91 97 -58 -122 -60 -114 -22 44 -88 -104 35 -71 58 5 63 46 -27 -8
1507 -8 -20 17 108 -55 47 -15 -3 1 110 -46 -222 102 -56 -150 -145 15 166 -77 32 -69 -96 18 111 41 -178
1532 -178 -28 -62 -138 -101 62 100 40 -95 97 -64 67 -7 97 -50 -53 50 14 15 -39 -38 -157 81 -165 54 -30
1557 -30 -113 -107 19 4 -91 -85 14 -72 9 22 -30 -10 -8 -62 -48 141 -72 3 -70 -99 47 125 -96 -175 4 -27 160 -12
1585 -12 -110 -83 -82 45 140 -2 13 30 -105 92 36 83 -232 21 -74 35 52 -66 27 -106 39 82 82 61 102 144
1611 144 172 35 9 -105 -42 3 45 -106 -79 28 -18 25 18 -96 14 168 -32 -131 -106 60 -66 68 -6 -35 -37
1636 -37 -19 0 9 -219 -37 48 -160 -100 101 11 -158 48 -197 -20 50 67 1 -12 -19 131 51 72 39 101 70 72 57
1663 57 83 -10 -91 60 -222 -45 -21 -23 -52 25 17 -48 -65 62 43 -27 -93 153 -121 129 35 -142 93 38 96 0 152
$$ packed form
1479e3J0K6J10q0o9L4%o6J21J0M8Oj55o4O2n4R2O6j32j6J39j06J29n3N8j7p3J9
1507hj2L7R1j63J02o2J2MJ09j56j76L24j58r4NJ60J51k43J09j01k7J14R3p0k19
1532a78J50l4p6L7J63L8o0j35J92j61J31p4J04j47lJ03l6Jn4Jj19K38k46K19q4
1557c0q3OJ26j5r5OR9q6Q1J3n2K0Kn4J4J89k13P5p3k9J46P8k21p9J79l1J87j72
1585a2r8K7JJ27R5j42J5J7j35J97n6M7l15K53r5J09J7j18R3j33J45M3%k1M1M2
1611A44K8j37k6j14O3M5M2j51K7J07m6M3pj14J10J54k00r9K5J66j26J34p4k9k
1636c7J8J9Rk28J82Q5k08O0K01r0j69K06k45J77P0J7o6j3pJ50q0K1l3O2l1Kj5
1663E7K6r3q1J51k82J77K4kk9P7qo5j7J27j9p0o6K46k74K50r4j77K35n5N8r6J52
$$ plain form
1690 152 129 48 -25 -21 133 73 -158 37 -39 14 -94 -8 -230 93 65 -37 -58 -51 -61 -13 89 39 -36 -50 -80 -140 32
1717 32 -178 43 85 -131 22 128 -27 8 9 31 47 50 87 -116 91 2 54 -178 -34 96 -36 150 -97 -107
1741 -107 -23 70 109 152 -22 -26 -126 13 18 -21 -77 74 -96 -95 -54 -178 12 -38 99 -85 -82 150 -50 1 -80 -105
1767 -105 12 -15 148 33 -34 77 13 -46 103 79 -24 36 145 -131 24 119 -35 102 33 -95 95 97 32 61
1791 61 27 56 -98 9 123 161 49 45 98 69 -21 50 28 -33 -85 74 26 263 2 -109 77 74 -81 14 140 37
1817 37 50 9 -135 -71 -21 -121 40 -40 33 -19 37 176 14 -8 179 7 -34 -127 3 63 94 69 -183 164 -59
1842 -59 80 -117 54 4 67 -3 21 48 62 81 53 34 -12 -160 -12 123 102 -149 -141 -119 -104 190 -37 68 -13 -10
1868 -10 9 122 39 33 -67 11 69 94 84 -19 25 -68 -133 -75 -72 0 43 108 -57 25 218 -17 180 87 148 -153 51
$$ packed form
1690A52k3q1p3MJ54o0k31J95p6N3j08Q6k22L23k8j02k1Pj0M8J02n0p5j4l0o0J72
1717C2k10K21M2k16J53J06j55L5JK2J6LL7k03K07q9N2k32J44J30j32J86k47j0
1741a07Q4R3L9M3j74mj00J39Nl9n6J51j70JM1j24J90n0J37j84LK32k00N1q1k5
1767a05J17k7J63j15o7J11o4n9J49k4j03O0J09k76J55R5j54J37o9j28J90Ko5K9
1791F1l4K9j54J07J14L8j12mN3k9r0P1k2o1n2J59m8K37k61j11J86lj55R5J26j03
1817C7J3m1j44O4N0j00J61q0P3n2N6J39j62k2J87j72m1r3J30O0L1k5k52L47k23
1842e9J39j97J71n0O3p0K4K7J4J9k8j9m6j48J48J35k1k51QK2J5K94k27J05q1L
1868a0J9J13q3oj00P8N8K5j0j03M4r3o5N8LP2M3O5j65Q2J93k35J97r3O1l01K04
$$ plain form
1895 51 -24 -17 -89 95 -118 36 -147 43 -107 29 107 -106 200 -60 -29 -37 129 -58 49 20 145 117 -53 18
1919 18 19 -82 -37 -19 -118 -55 -70 27 -10 123 127 -44 -194 -128 -35 -88 -2 115 72 61 35 39 -34 16 -13 15 -21 26 -93
1948 -93 141 -107 -1 2 -30 170 33 -8 98 -84 -58 78 39 12 -35 6 11 214 -94 -74 178 56 78 -103 55
1973 55 41 -94 -19 -86 62 -124 -12 -4 76 120 -77 41 52 -30 -91 -6 -11 29 126 26 -44 40 27 17 -18 16 -130
2000 -130 109 -66 33 -31 61 -69 94 124 -93 100 80 62 -4 -123 -82 -264 -6 -4 -113 56 -113 16 -105
2023 -105 79 244 38 -205 -8 112 3 91 153 -124 -171 -30 -8 206 -110 67 -40 8 44 -18 42 -41 18
2046 18 -58 35 17 -82 22 50 147 -260 25 -43 22 -137 -70 -167 60 -12 -58 36 91 8 -38 103 10 -86 -18 -35 -55
2073 -55 68 156 26 -9 -23 -35 -15 -32 -95 70 98 33 -51 -13 -19 -3 -70 16 -144 -16 112 34 -86 -24 8 36 135
$$ packed form
1895E1p5Pp2J84k13J54j83J90j50J36P8k13L06k60L1qJ66j87J07k9J25k8j70P1
1919A8Jj01M5J8r9O3j5R7l7J33Mj71j50O6R3n3Q6J17m3j1k6Mp3N0k9K8l6M7j19
1948i3K34k48J06Ll2K00j37m1J06j82K6J36l9k7m7M1NK03l08K0K52j22K2j81J58
1973E5j4j35P5o7J48j86J12QQ0M4j97J18J1q2o1Q5nM0R7j00p0Q4j3j0l5L4j46
2000a30K39j75R9o4R2j30J63L0k17J93k0j8o6j19M1j82K58Kj09J69j69J29j21
2023a05J84J65k06k43J97J20j09Q8O2k77m7J41K2K14l16J77j07M8L6o2O0q3N9
2046A8p6R3j8r9J04K8R7m07K85o8O5j59O7r7K27p2m6R4N5q3m6J41r3r6O8j7k0
2073e5J23Q8j30l5j4j2K0j7o3J65K8o5q4L8oJ6o7Q6j60J28J28p8j20O2L2K8R9
$$ plain form
2100 135 -192 -88 -7 -45 148 -21 -30 20 -46 -76 169 -26 -168 -150 15 -43 -72 86 202 39 -24 -30 -103 -66 31
2125 31 256 -19 -52 58 -66 -16 -20 -105 -2 -59 117 -68 47 -4 37 -39 7 -89 -177 56 -98 8 -47 -59 -95
2150 -95 -33 -30 -68 56 67 -14 -65 156 68 175 -128 102 66 -73 141 66 -230 -130 20 35 -95 199 9 132
2174 132 -81 -128 -60 -47 40 -41 -41 -57 96 90 86 -64 -120 41 96 -93 66 51 56 9 18 -51 -112 -90 -2 -15 -70 -37 -34 -36
2204 -36 -12 107 155 224 -51 68 -102 75 -121 -173 23 -130 155 20 18 165 -32 8 3 -215 -95 122 -19
2227 -19 24 -25 49 45 -45 4 -95 73 184 168 -41 -80 105 72 119 -172 60 -84 24 104 -89 115 91 94 50 -22
2253 -22 18 -129 -103 -30 -193 65 -190 47 -30 36 24 0 -23 -12 -70 -184 -63 -84 -72 -95 -28 11 13 166 53 193
2279 193 36 -212 -111 -30 -2 90 0 123 -33 -11 121 36 -70 -221 -14 30 -37 11 7 -5 98 -46 -192 18
$$ packed form
2100A35l27J04Q1l8J93j69rN0o6l0K45j95j42J8J65n8k9J58J16j63o3op3L7R7
2125C1K25k75l3J10j24N0mq5J03n7J76j85J15n1M1p6M6r6q8K33j54J06n5j2l6
2150i5O2Ll8J24J1q1n1K21q8J07l03K30l6j39K14p5k96J00J50J5j30K94j90J23
2174A32k13m7O8J3Q7q1%j6J53omj50n6J61N5j89J59j5Nm7Ro9o1K2Q8j3n5L3Lk
2204c6K4J19M8O9k75J19j70J77j96n2J96j53K85j35kJ47j97M0nk18J20K17j41
2227a9M3m9P4mr0M9r9J68J11j6k09l9J85l3M7k91K32j44J08Q0j93K04k4Lm4p2
2253b2M0j47K6P3j63K58k55K37p7O6j2k4k3J1n8j14J21k1J2k3O7L9KJ53j13J40
2279A93j57k48J01Q1K8R2r0J23j56K2J32q5j06j51K07M4o7M8mj2J03j44j46K10
$$ plain form
2303 18 -9 -115 -71 244 38 34 204 136 -89 59 47 -96 -159 43 -4 -116 78 -50 48 -103 3 88 137 23
2327 23 -32 97 -27 -170 26 20 83 -30 -41 21 21 -134 66 69 72 116 -79 105 -109 36 -87 46 -94 11 16
2352 16 -17 51 -100 -75 -162 -90 107 10 -207 19 50 204 7 -24 95 -47 43 25 -61 -22 106 62 34 -136 38
2377 38 5 9 70 -260 -13 12 127 -63 11 -113 -8 -22 23 70 131 -31 -38 92 44 183 -1 -20 -12 47 69 169
2403 169 -82 -19 -52 105 33 90 -65 19 -29 69 -23 60 -23 -29 54 6 -111 1 7 35 74 58 -33 43 -241 -212 41
2430 41 93 107 -12 -38 -181 -18 26 -111 77 -45 92 59 62 -13 -159 -13 -74 -106 59 7 -184 98 -105 12
2454 12 -46 -173 -4 15 -32 113 -119 95 -61 51 -60 -32 37 -56 23 -76 124 -94 9 -100 -50 30 -21 -66
2478 -66 10 123 -99 -151 55 -50 -4 -134 -43 -47 -55 114 43 -24 70 58 -75 68 31 161 -72 36 -171 41 146
$$ packed form
2303A8k7j06M4L15k06mJ70o8k25J48j2j43o3K02m7j12J94j28R8j51J06Q5M9j14
2327B3n5J29j24j43J96oO3j13j1O2%j55K00LLM4j95J84k14J45j23J33j40J05N
2352A6l3O8j51K5q7P2J97r7k17K26L1J54j97l1J19j42R0j8q6L9J28m4k8j70J74
2377C8l3MO1l30K47K5J15j90P4j24J05j4M5M7O1j62pJ30m8J39j84j9QN9K2J00
2403A69k51O3l3J57p2N7j55Q4m8R8r2Q3q3oQ3m8j17J12OK8L9j6r1P6k84K9K53
2430D1N2J4j19k6j43J63M4j37J88j22J37l3Lp5j46J46o1l2J65n2j91K82k03J17
2454A2n8j27J69J9m7J45k32K14j56J12j11K8O9r3P9r9K00k18J03j09N0Q0n1m5
2478f6P6J13k22n2K06j05M6j30R1mqJ69p1o7R4j2j33J43l7J30k33J08k07K12J05
$$ plain form
2503 146 120 79 7 93 61 -55 -155 140 -154 -76 57 4 44 97 -181 -23 -41 112 -34 149 -91 -39 123 88
2527 88 -27 -30 68 -18 109 -49 11 -141 -52 116 -90 -14 -33 84 110 108 140 -37 -71 43 13 78 156 161 47 -39 54
2554 54 64 -111 10 -143 -85 -70 -116 -28 -107 -24 -27 -7 -36 -30 73 66 -165 45 -17 -132 18 -38 55 -13 169 45 -149
2581 -149 8 96 140 -55 -64 70 -192 -70 -1 -75 -103 58 75 83 97 16 45 2 -12 -58 122 -121 -22 -201 32 -150
2607 -150 -79 -21 -111 108 -56 5 24 -147 -71 136 -211 3 6 61 123 66 51 -62 -1 148 91 45 108 62 -66 -13
2633 -13 4 4 5 -42 -83 62 -57 -41 -14 30 -24 13 84 57 113 -32 -135 73 59 76 -47 -15 -106 28 -34 -191 -180
2660 -180 81 83 -66 53 -114 220 117 72 -127 -15 -17 7 93 -115 -137 67 -46 -6 -120 -106 -22 32 -63 -138 -57
2685 -57 -59 58 42 -15 138 94 -58 22 87 -5 -106 111 -98 -165 40 -84 46 -265 -89 161 6 15 37 -5 -11
$$ packed form
2503A46k6m1p2Q6l2j16j00K95k94P8J33n3M0N3k78J58j8J53j46J83k40N2J62l5
2527H8j15lR8q6J27j58O0j52Q9J68k06P6j9J17K6kL2j77l4J14l0O5P8Nj14q6R3
2554E4J0j75J21j53N8J5m6Q8p9Q3lK0k9OJ03pk31K10o2j15J50n6R3o8J82j24j94
2581a49J57Q8M4j95rJ34k62J22O9p4k8J61J7QJ4q1K9m3j4m6J80k43R9j79K33j82
2607a50P1N8r0K19j64O1J9j71P6K07l47K14LN5O2n7j5j13O1J49n7m6O3m6j28N3
2633a3J7%Jm7m1J45j19J6K7M4n4L7P1k7N6j45j03K08j4J7j23L2r1J34o2j57J1
2660a80K61Kj49J19j67L34j03m5j99J12kK4Q6k08k2K04j13M0j14J4Q4N4r5p5Q1
2685e7kJ17j6n7J53m4j52Q0O5r2j01K17k09o7K05j24J30l11J76K50j55RK2m2o
$$ plain form
2710 -11 -82 34 33 63 -60 -15 -60 -67 -66 46 -36 73 -125 10 -143 -31 73 8 -27 -77 98 -143 69 -41 144
2735 144 -165 33 -35 98 96 -115 -151 10 -17 161 -68 57 94 -107 -162 136 -33 117 63 -12 103 11 -69 -60
2759 -60 63 -6 -77 -107 -35 81 156 -22 -38 49 80 5 -124 48 16 -156 -74 -25 -96 -44 -26 -104 -62 -121 22 -159
2785 -159 142 170 54 22 -66 -93 -72 96 147 110 -102 165 -41 73 37 -96 158 24 -82 43 49 -62 -22 -15
2809 -15 -37 -110 -90 68 -147 98 175 -154 94 -18 32 -52 23 22 -53 -65 -78 -71 -109 176 -89 -7 108 138 81 -187
2835 -187 255 31 100 -53 -150 40 32 15 -85 101 -159 -124 -2 -16 74 -61 133 33 75 -96 48 -135 -25
2858 -25 91 -156 24 75 -149 -139 -42 7 -22 -69 62 13 124 -46 -118 -137 -31 -64 42 -25 96 188 31 -37 -96
2883 -96 23 -132 -152 9 -36 57 68 116 -130 103 -96 -4 -58 -22 53 72 -62 -72 34 148 -42 -42 176 -41 -109
$$ packed form
2710a1p1J16jL0j23M5m5pJJ12q2J09j98J35j53J12J04o5l5n0J75k41K12j10J85
2735A44l09J98o8J33kk11l6J61k7J78k29J25L7k01n5K98j69J50n4p5J15r2q0R
2759f0J23o9p1l0P2J16P5j78j6Q7L1p5j29J72l2j72Q2M9p1N2J8p8M2n9J43j81
2785a59L01K8j16l2q8k7K1J68N1l7k12K67k06J14l6j33K54j34j06J25Oj11M0P
2809a5k2p3K0J58k15K45P7l29K48j12N0q4P5jp5j2j3Pl8K85k65Q2J15L0n7k68
2835a87M42k24O9j53r7J90qj7j00J86k60L5J22j4R0j35J94j00M2j71J44j83J10
2858b5J16k47J80N1k24J0R7M9k9m7J31m9J11j70p2j9J06l3J06o7J21R2j57o8n9
2883i6J19j55k0J61m5R3J1M8k46K33j99R2n4L6P5J9j34j0J06J14j90%K18k17o8
$$ plain form
2908 -109 -4 -11 8 13 -104 159 28 -29 -19 -41 111 -96 -93 -20 -115 126 -103 32 13 17 50 -44 -147 109 51 23
2934 23 -16 43 -84 69 -8 113 104 45 -28 -12 20 -99 -38 -79 23 -88 -52 -54 26 -106 -32 -91 -201 42 -25 89
2960 89 144 -32 22 -179 -116 140 -84 61 44 99 114 113 -104 3 27 -116 -231 -51 59 -54 -32 82 -83 149
2984 149 119 -45 40 -52 -18 -51 -60 46 -65 -175 100 -315 5 -79 14 -98 -57 -105 -91 -56 35 -5 6 -21 -152 -34
3010 -34 93 116 87 67 -98 -46 24 -47 206 7 -136 31 71 206 -99 -19 -102 98 5 -192 -97 -26 113 48 81
3035 81 19 -99 -48 6 -101 -57 20 -84 57 5 20 84 -2 171 19 89 199 66 12 59 9 -64 -115 -28 12 -9
3061 -9 -21 111 -77 29 -45 76 42 94 -3 114 101 26 64 -95 -36 38 20 -145 49 -76 204 75 10 -42 -48 -85
3087 -85 42 -12 46 128 74 -73 -73 144 80 -93 -93 33 129 -36 -54 -110 0 19 149 -33 -35 31 55 66 -79 -116 -52
$$ packed form
2908a09J05pJ9Nj17K63j31n7J0k2J52k07LP3r5K41k29J35j9ML3r4j03K56n8k8
2934B3l9N9j27J53p7J21rn9p3J6L2j19O1m1J02j11L6kQ0j32P4n9j10K43o7J14
2960H9N5j76N4k01O3K56k24J45j7N5J5jk17J07K4j43j15J80J10j13K2J14j65K32
2984A49l0j64Q5r2L4l3rJ06j11j10K75m15L20q4R3j12M1m8J4L5R1m0J1k7j31J18
3010c4J27K3k9k0j65N2P0p1K53j99j43J67M0J35l05Q0q3K00r3j97R5P1J39o5L3
3035H1o2j18N1N4j07M4P7j04J41n2J5O4q6J73j52P0J10j33n4M7n0p3n1Q7M0k1
3061ij2J32j88J06p4J21l4N2r7J17j3p5L8j59N9P4j8j65J94j25K80j29o5n2ol7
3087h5J27n4N8Q2n4j47%K17o4j73%J26R6j65j8n6J10J9J30j82kO6K4J1j45l7O4
$$ plain form
3114 -52 -94 58 -99 -64 43 -83 26 -15 0 139 -204 17 -76 -6 48 -15 -7 156 42 150 12 85 -17 -30
3138 -30 16 29 59 -48 -43 25 -51 -70 -57 -170 -21 -28 56 -89 -135 -5 14 54 -184 89 -83 123 28 -127 -101 232
3164 232 80 37 14 -73 28 -96 -89 -115 -39 36 -79 -137 207 -32 -50 34 109 168 -55 -23 13 -15 7 29 -33 -32 114
3191 114 31 -53 130 -144 -192 79 5 98 -12 22 83 -62 25 -42 -69 63 40 77 1 65 -85 32 -74 -165 70
3216 70 55 -53 24 136 54 -94 165 -73 -85 139 30 -121 83 -85 -116 -25 54 -3 -29 -138 -31 20 23 90 11
3241 11 116 -148 37 42 -22 -85 21 -75 15 46 161 -28 -30 80 -169 4 -37 60 160 -79 -16 -33 53 58 47 178
3267 178 -155 -70 -66 -13 -14 64 -99 34 93 -81 -114 51 20 75 -54 -31 -62 31 152 76 207 70 22 3 32 -145
3293 -145 -47 59 -17 16 55 136 25 -19 -23 -62 110 -48 50 -51 -50 56 -84 78 -61 68 -78 -74 -119 -70 156
$$ packed form
3114e2m2J52j57L5J07j26J09m1J5J39l43K21r3P0N4o3QJ63j14J08j38P3j02j3
3138c0M6J3L0j07NO8p6j9J3j13J49pQ4j45m6J30J9M0k38K73j72K06r5j55K6L33
3164B32j52m3k3q7J01j24Pk6P6P5j15n8L44k39j8Q4P5N9k23L2L6k8K2K2o2JJ46
3191A14q3q4J83k74m8K71p4R3j10L4O1j45Q7o7k7J32k3L7p6O4j50J17j06r1K35
3216G0j5j08P7J12q2j48K59k38j2K24j09j51K04j68l1R1P9n7k6j09J07N1LO7p9
3241A1J05k64J85No4o3J06r6R0L1J15j89kJ10k49J73m1R7J00k39O3j7Q6Nj1J31
3267A78l33Q5MN3jP8j63J33N9j74l3J65l1N5j29K3l1R3J21p6J31j37m8j9K9j77
3293a45R8J06p6L3L9Q1j11m4ml9J72j58R8j01JJ06j40J62j39J29j46Mm5M9K26
$$ plain form
3318 156 -75 8 -132 -123 62 43 104 -59 130 134 133 -10 -77 -38 -90 108 -80 -120 83 154 48 -137 -17 -73 103
3343 103 85 70 -6 -58 30 -44 -4 -100 22 43 2 0 37 134 79 -61 94 100 24 111 -30 -22 54 11 -160 -85 70 156
3371 156 70 -47 -81 -15 16 79 127 19 150 -276 -26 87 -112 95 -90 58 -107 124 66 -40 77 13 -36
3394 -36 -96 -16 30 -44 2 117 39 -27 8 -64 23 1 15 -42 -13 -70 -128 76 -6 -121 -76 -70 22 -41 106 -99 51 -137
3422 -137 110 3 -1 3 -82 -103 82 28 -149 -130 -41 65 -44 -149 71 81 -213 -34 -9 -128 55 -17 34 -37 57
3447 57 212 11 119 -10 -26 -139 -12 -44 -20 -158 -73 -77 -148 -88 150 -5 39 -1 -68 -33 -137 -132 -117 -61 -31 49
3473 49 61 18 -8 81 21 -196 1 94 110 -185 -138 -83 -44 -138 40 -20 5 146 24 -35 6 74 -101 28 -46 -58
3499 -58 -34 152 21 15 -12 -72 -86 -4 18 9 52 -62 -69 -103 133 167 103 4 61 168 -47 -152 27 46 35 -104 99
$$ packed form
3318A56k31Q3j40RJ85j9O1j63J89Mjj43o7L9n2J98j88m0K03P1j06j85J20n6J76
3343A03j8j5p6n2Q8p4M0r6J22K1m1kL7R7n5j40J55Op6Q7j41QP6m3j71P5J55Q6
3371A56q6j17l4O6L1O3M8j08J31m26K50J13j99K07j85J48j65K31n8j06J17o4m9
3394c6o0Q0M6p4M6J15p8o6L5p2Q7k2J4n7K9n7n8K04q2j15M5OR2o3J47k05J50j88
3422a37K47j07mMq5k1J85n4j77J9Q9J06j09j05K20J0k94J79K5j19J83p2N1p1R4
3447E7J55k01J08j29j6j13J27l2K4j38Q5mp1O0K38j55M4m0o7L5j04NJ5N6L0Q0
3473D9J2m3k6Q9o0k17J97R3J6k95M7N5L9r4J78o0K5J41j22n9M1O8j75J29p4j2
3499e8K4J86j31ok7o0j4Q2K2rM3j14pl4K36L4o4r9N7J07k15j05J79J9j1j39K03
$$ plain form
3526 99 52 20 -157 14 -74 103 -110 -27 10 -27 117 -95 -64 85 112 89 -143 143 7 20 -17 -220 18 -20
3550 -20 99 -23 -31 26 -171 -36 42 11 -86 -16 -110 12 -80 61 71 -45 -166 -1 -22 -23 -42 8 120 74 -117 -7
3576 -7 -141 -102 -20 -36 -103 103 104 -90 153 -124 -42 -141 -259 152 96 -96 61 36 -86 83 89 -85 54 -224 175
3601 175 85 -27 -77 -17 72 27 86 26 3 -102 87 147 46 12 22 3 140 -177 113 26 -52 142 136 -27 -32 -17
3627 -17 -5 16 71 40 85 -127 -73 37 -108 60 -18 70 -44 -148 -109 -11 -31 25 -39 -102 96 90 14 42 -45 51 119
3654 119 -40 40 -5 -12 7 148 15 17 -16 -22 6 113 -15 28 -29 -75 33 49 16 -17 -15 47 28 155 110 -42 -92 21
3682 21 199 9 73 53 -90 -8 51 -123 5 -16 -133 -34 141 -68 77 -213 -55 23 117 -22 -118 -29 188 -51
3706 -51 -187 -108 -67 92 44 -141 -6 -15 6 -41 70 76 -78 19 -4 78 -28 -22 -7 -17 -87 -2 -62 74 15 -55 -28 -35
$$ packed form
3526I9m7l2j77J71q8J77k13Q3L7l7J44k12L1J49K7k3k32K86j36J3l7k03K38l8
3550b0J19j22qN7j97J35P8l1r7P0r4J22r2J41J0j16j21J65k1jj9N0J12m6j91J10
3576gj34L9Q2j6o7K06Jj94K43k77Q2r9j18M11n6j92J57k5j22J69Oj74J39k78L99
3601A75r0j12n0O0Q9m5N9o0k3j05J89O0j01l4J0j9J37l17K90q7p8J94oj63nJ5
3627a7J2K1N5l1M5k12N4J10j45J68p8Q8j14j04L9R8k0N6o4o3J98op6K8q7R6O8
3654A19j59Q0m5pJ9J41j33Kl3oK8J07j28M3n7m6J08J6l3l3KO2j9J27m5j52n0J13
3682B1J78j90O4k0j43Q2N9j74J28k1j17R9J75k09J45k90J58P8R4j39r6Q9K17k39
3706e1j36P9M1J59m8j85J35rK1m7J11Oj54R7k3Q2j06OJ5j0p0Q5o0J36n9p0K7p
$$ plain form
3734 -35 11 -51 -203 -97 -49 -62 -53 16 -171 -80 -50 78 -75 -69 29 63 41 33 19 -2 -55 -80 200 -186 -18 -96 8
3761 8 148 15 41 96 7 -80 53 54 -114 67 76 -129 -101 86 14 -22 -54 36 31 -32 25 -74 -42 -110 -15 31 56 -82
3789 -82 -190 -166 -12 -116 -30 76 55 -49 62 -57 124 -37 54 92 117 -45 -93 -36 3 -135 12 -53 -4 -77
3813 -77 -65 -4 58 -54 -107 112 -101 40 -59 -16 -54 -76 -68 -41 75 20 -115 -21 -67 -26 -109 27 -59 82 96 -146
3839 -146 -38 128 169 30 -26 -103 -119 28 70 -34 -127 -21 75 87 -105 -102 28 -217 -60 116 -40 -25 22 14 40
3864 40 32 -89 -155 -66 36 94 5 131 101 72 -49 -84 -142 -135 -30 -116 -1 128 -26 115 65 -57 -76 88 201
3889 201 145 -18 -8 36 9 129 64 31 -52 79 26 -79 191 -93 27 27 44 79 46 -130 -5 -113 -17 -75 80
3914 80 203 -59 -52 18 14 32 -31 -34 -86 -36 -94 -73 132 -68 -24 106 76 55 22 117 22 -6 17 -119 5 -49 -74 -92
$$ packed form
3734c5M6o2j52J06M8j3RO9j87R1L0J28j53OR8L4k2qj4k1n3k5K80l86J68p8J04
3761HJ40j33K6N5q9q7J33Jj68J81Rk05K8J87p2l6l2R0no3N7r9L2o8R5M6K5j38
3789h2j08K4J54j04Q6J06k1j04J11j19J81j61R1L8K5j62m8N7L9j38J47o5M9p3
3813g7J2O1O2j12n3K19k13J41r9M3l8k2QK7J16n5j35R4m6M1q3J36q6J41J4k42
3839a46J08J66M1j39n6p7j6J47M2j04r3J06R6J2j92LJ30k45J57J76j56J5M7qK6
3864D0qj21o6Q9J02N8q9J26l0k9j21l5n8PJ05q6J15J29j54J41n0j22j9J64J13
3889B01n6j63J0M4k7J20o5l3q3J31n3j05K70k84J20%J7L5l3j76J25j08R6n8J55
3914H0J23k62PP0mJ8o3ln2N0n8K1K05k00M4J30l0k1l3R5r5k8K3j36J24n4k5j8
$$ plain form
3942 -92 52 10 41 -144 -100 45 -4 47 96 1 81 1 23 173 -81 50 -37 -15 91 -62 48 -11 -68 -179 88
3967 88 18 29 -231 94 -34 -32 50 88 100 150 -238 60 -181 -45 -22 130 101 -31 90 -30 166 -42 -7 12
3991 12 35 -80 14 216 68 -41 -171 7 -85 78 29 -64 145 3 118 54 -107 -17 13 93 34 -28 0 -43 99
4016 99 113 109 -25 23 72 -9 -47 107 -44 34 54 28 89 -82 41 -48 -120 72 57 152 -157 32 -127 -8 56 -171
4042 -171 1 28 37 6 -60 -25 -50 138 -24 -102 63 -24 -99 -79 113 -87 33 58 112 -140 -23 -27 127 -9 40
4067 40 -34 94 -33 65 124 49 1 -17 59 81 -77 -16 46 -50 -122 -29 -68 7 200 -21 -73 1 -5 10 55 14 47 -85
4095 -85 -119 141 171 25 125 151 109 16 -83 -41 -80 116 21 -6 -163 -62 33 -78 -31 -30 -62 57 -52 -46 -68 -58 4
4122 4 62 -52 -82 108 -23 -12 12 -79 17 177 -84 12 -41 -101 -2 125 -53 -47 47 -75 5 46 34 49 -37 7 148
$$ packed form
3942i2J44m2L1j85M4J45m9N1M9r5Q0q0K2J50k54J31q7K2J06j53J10n9n7j11K67
3967H8p0J1k60L25j28KQ2L8J2N0l88K98k41J36K3J52k9j32J21j20J96k08L5J9
3991A2K3j15R4K02j48j09j30J78r2J63m9r3K09j42J15o4j61R0L0Q0n9o2K8m3J42
4016I9J4mj34M8M9q1l8J54j51P8K0k6O1j71J23q9p2J92j5R5l09J89j59J19O4k27
4042a71J72K7Rl1o6L5k5J88j62p8J65q7p5K0J92k00J20K5N4k52J17mJ54j36M9
4067D0p4J28j27R8N9p5m8j8P6K2j58O1O2r6p2R3l9P5J93k21n2P4oJ5M5m1L3j32
4095h5l4K60L0j46J00K6m2r3r9M2l9J96r5k7j57J01R5j11M7Jl2J19j09Ok2J0O2
4122DN8j14l0J90j31J1K4r1R6J60k61R6n3o0R9J27j78OR4j22Q0M1j2J5q6M4J41
$$ plain form
4149 148 81 194 -92 52 65 -5 25 61 -88 -42 -119 -38 -63 44 60 -173 140 126 16 68 -16 29 147 -27 -71
4174 -71 93 -30 56 -96 -19 -104 -104 -27 -12 136 -80 229 -21 11 -23 -10 133 -66 13 -34 -26 -98 162 159 82 -22
4200 -22 -95 -56 183 -45 3 20 -109 -3 58 -139 -48 44 151 3 -19 -92 -59 -25 29 102 -69 80 -43 29 10
4225 10 66 -42 -148 -54 45 189 -183 76 -10 14 57 -64 -100 95 -77 59 -185 -147 -100 44 44 83 -23 123
4249 123 47 82 68 41 -28 -134 -1 75 -111 -20 130 26 129 -135 -70 -21 37 -34 -66 -91 17 -20 -7 53 34 83
4275 83 -144 -71 57 127 218 14 -109 28 -58 31 19 5 120 -127 -177 130 -105 -38 87 127 238 84 -9 17
4299 17 54 2 -146 84 10 -134 4 -105 -127 -100 152 104 1 21 -9 -191 188 61 -46 -31 -60 -15 147 39
4323 39 -40 -96 129 -129 69 -86 -23 260 -36 110 -74 -41 54 -19 0 -33 117 -31 -20 -30 -85 18 -45 84
$$ packed form
4149A48o7J13k86J44J3p0L0L6j49M6p7Q1k5J07J6k33L13j4j10N2q4M5J18j74m4
4174g1J64j23Q6j52P7q5%P7J5J48k16L09k50L2l4J3J43j99P9m7Qp2K60lp7j04
4200b2p3L9K39k28M8J7j29J06O1j97R1R2J07j48k2p3L3L4N4P3j71J49j23P2j9
4225A0N6j08j06R4R9J44l72K59q6K4M3j21l6J95j72J36k44L8M7J44%L9j06J46
4249A23p6L5j4k7o9j06J33P6j86R1J50j04J03k64O5M9N8p1l2k5J08l7J3O0j9M9
4275H3k27P3J28P0R1k04j23J37q6Q9j2j4J15k47n0L07k35O7J25M0J11j54r3K6
4299A7L7n2j48K30p4j44J38j09k2K7K52m8j03K0l0j82L79j27j07J5k9M5J62j08
4323C9p9n6K25k58J98j55O3K83k96J46j84L3R5p3J9l3J50j48J1j0n5J03o3J29
$$ plain form
4347 84 -73 -42 -77 -60 -144 -3 171 61 -5 10 116 140 38 74 0 -192 33 69 129 10 -30 74 -90 -132 -80
4372 -80 -148 95 -63 -191 40 -61 -30 -143 88 -60 -111 52 -142 55 -22 68 96 65 0 2 -5 112 59 -43 75
4397 75 48 -30 -40 -133 120 -10 61 -26 151 143 74 -50 -172 56 -100 -92 -27 -56 2 -77 -8 -31 -159 -96 113 25 37
4424 37 -39 100 78 72 -8 40 -47 16 84 -78 45 90 179 -27 44 133 -41 -109 -15 -24 99 -44 57 -3 124 159 -17
4451 -17 -26 -12 -27 7 56 13 -1 -58 21 77 -39 -121 -16 -28 -62 144 -60 36 -32 -153 -43 -188 -109 -24 -108 -16 -129
4478 -129 228 109 15 31 69 -51 124 -40 128 -71 59 -83 11 11 57 -45 -26 -127 117 -101 -170 -115 139
4501 139 -64 21 28 -77 -6 -128 -68 -16 -144 -57 101 -103 33 100 -69 -25 108 51 -30 -91 -115 -60 -54 -164 108
4526 108 7 6 -22 83 111 -17 47 78 -83 -12 -88 -29 -52 -57 160 102 -77 17 29 -9 21 -183 -97 -88 5 28 55 -70
$$ packed form
4347H4j57L1l5J7q4J41J74j10o6J5J06K4j02L6p4j92K25L6O0j19m0J04j64m2N2
4372h0o8K43j58j28K31j01L1j13K31j48n1J63j94J97p7R0K8l1o5KpJ17n3j02J18
4397G5k7p8j0r3K53j30P1q7J77qo9j24j22K28j56QO5k9N8p9O9k3j28O3K09q8J2
4424C7p6J39k2oq0M8q7O3O8j62J23M5Q9k06P1Q9j74o8R4rJ23j43J01o0J27L5j76
4451a7rJ4j5L4M9m3j4n7P9N6j16q2J05j2l4K06k04R6o8j21J10j45P9Q5q4R2j13
4478a29L57j19r4J6L8j20J75j64J68j99J30j42R4%M6j02J9j01K44k18o9N5K54
4501A39k03Q5Pj05P1j22O0N2j28Q7J58k04J36O7j69M4J33n7q1o1k4N5Oj10K72
4526A08j01jk8J05K8j28O4L1j61P1p6N9k3nK17n8j79R4J2l8L0k04Q6RR3K3K7j25
$$ plain form
4554 -70 22 74 -144 162 -59 -84 -204 -88 54 -123 15 6 -11 -56 42 -39 110 -44 -56 -35 83 -71 -121 121
4578 121 -102 -38 33 -41 -66 -2 25 -108 24 -20 25 16 -242 74 -63 -34 -56 5 113 34 103 58 -90 -29 43 -71
4604 -71 46 169 -56 -58 -48 -44 135 98 126 -149 64 81 -24 -231 -31 81 58 68 35 -117 -15 -102 -92 44 -54
4629 -54 -171 43 -79 -41 -38 -132 -71 -58 -136 97 173 -100 -12 -89 -34 90 9 99 -114 13 37 105 27 -162 -55 41
4655 41 126 19 22 -186 102 -181 -135 16 97 -101 9 16 122 153 36 119 -150 135 -79 73 -175 20 75 -92
4679 -92 -7 -49 -32 -140 -86 191 13 -108 -105 72 1 58 -26 2 -150 -54 29 37 106 59 -14 3 -21 16 -40 94 3 1
4707 1 34 35 -14 -32 1 -151 -23 153 81 5 131 11 -40 112 94 72 89 2 -185 -96 22 -4 81 -55 0 -98 84
4734 84 37 12 -72 113 76 28 -184 -123 -144 -98 -113 -30 56 -138 74 3 10 -59 -25 -5 37 147 97 -24 79 49 175
$$ packed form
4554g0R2N2k18L06k21k5j20J16J42j77J38rj7m5R8q1J49j54j2K1J18j54n0K42
4578A21k23O4P1p4k5O4K7j33J32m4M5rk58L16j37K9k2O1J08p9O9m5j48O1P2j14
4604g1J17J23k25kJ0MJ79l7K8k75K13J7j05k07K00J12k3J0l3j52J02q7J0J36r8
4629e4j17K14j22L8Lr4O1J3p8K33P6k73Q8p7N5J24q1R0k13J27K4O8p8j89J07R6
4655D1Q5j07Lk08K88k83M6J51Q1j98J10PJ06L1j17Q3k69K85k14J52k48J95N5j67
4679i2Q5m2J7j08N4K77j78j21LJ77p1N7q4K8j52R6Q3QO9m7p3J7k4L7n6J34r1k
4707AL3Jm9j8L3j52J28J76p2p6J26j20n1J52j8k2J7q7j87Q9J18k6Q5j36N5r8J82
4734H4m7k5q4J85l7m8k12O1k1M6j5Q3Q6j94K12p1Po9L4K0M2J10n0j21J03l0J26
$$ plain form
4761 175 -78 25 55 77 -16 -9 72 141 2 -19 80 -66 -87 -51 -132 -24 -22 -88 6 30 80 -157 -34 9 87 63 -100
4788 -100 -160 -63 -80 101 65 163 217 20 100 -49 -129 51 81 20 73 -21 -97 -26 31 165 -61 80 -62 -94 22
4813 22 -10 122 -2 -176 100 -15 133 67 83 -28 20 -67 -263 20 39 34 21 137 109 -22 -166 114 36 42 118
4838 118 31 89 155 -13 -58 -41 30 -112 -23 -134 197 28 -238 2 -14 80 -78 11 -19 3 -49 -4 -194 -64 57
4863 57 -22 -104 44 -107 50 -116 0 -219 15 -96 -36 14 24 79 -71 41 -66 -8 -111 -162 -33 -9 -11 89
4887 89 85 -85 -13 16 4 19 141 -54 -113 69 -89 -4 27 201 137 23 -61 68 -109 -101 43 -70 24 -43 -36 2
4913 2 6 -105 -92 67 77 -29 92 -130 -75 40 49 -20 -104 28 -181 20 118 108 -244 195 9 27 58 31 12 54
4939 54 -82 -29 -6 104 17 -182 -55 -92 -126 -26 55 26 -16 -115 -24 -114 118 -65 -31 51 -38 40 -64 54 2 122
$$ packed form
4761A75k53J03L0K2r3PQ1O9j39k1R9j46k1L6q1J08Ko6R4K4N0k37J23M3P8k4j63
4788a00o0R7j7J81l6R8N4j97Q0j49q0J80L0o1N3r4p6P1N7J34k26J41j42l2J16
4813B2l2J32j24j74K76j15J48o6J6j11M8q7j96K83J9nj3J16k8j31j44K80p8OP6
4838A18q7N8O6j68m5J7P1j42Q9j11L31j69k66K40j6R4j58Q9l0K2n2M5j90J30J21
4863E7p9q2J48j51J57j66J16k19K34j11O0N0J0N5j50J12j07N8j03n1J29K4kJ00
4887H9mj70P2K9j2J5J22j95n9J82j58Q5L1J74o4j14q4J29j77QJ44j13R4o7PL8
4913BMj11J3J59J0j06J21k22N5J15Ro9q4J32k09K01R8j0l52M39j86J8L1k7j9M2
4939E4j36N3K3J10q7j99J27l7l4J00Q1k9m2r9R1r0K32j83L4Q2q9P8j04J18n2J20
$$ plain form
4965 122 71 64 -95 58 -41 31 -131 -81 207 -145 110 49 131 -43 -23 25 -75 90 -113 0 -35 -42 -1 -127 -141
4990 -141 132 -43 -140 108 127 230 -4 81 108 -61 155 63 62 49 148 -76 -261 33 -49 57 14 13 -157 -20
5014 -20 2 -39 85 -31 -164 -48 116 -41 117 -71 152 -126 -16 -2 10 -48 88 -132 141 62 -64 -82 44
5037 44 46 97 -50 -96 48 131 56 32 -68 -81 46 46 -121 -12 75 -97 -41 -83 -48 3 -98 45 63 77 168 -58
5063 -58 24 -12 -4 -77 19 37 93 -59 -57 22 -4 6 80 -3 2 34 49 -54 16 127 -10 -124 10 73 -86 10 55 43
5091 43 152 -29 167 64 130 35 175 3 -4 -61 232 32 56 -106 -98 167 110 46 -39 11 -123 52 -22 49 89
5116 89 187 46 -96 10 -66 -33 -76 -35 -156 86 111 142 155 17 -82 104 23 163 7 -41 115 -47 111 41
5140 41 39 107 70 88 85 -119 16 140 -71 -67 -90 48 -124 8 -77 70 131 50 -60 -29 45 -158 64 125 78 21
$$ packed form
4965A22n1pj59J53r9P2j62N0K88l52K55o1Q2j74K0M8j00J65k03J13l5pM1j26j4
4990a41K73j75r7K48J9J03k34Q5K7j69K16r2jj3R9k24j85K94q2J06m3jj70J37
5014b0K2m1J24j16j33J16J64j57J58j88K23k78J10J4J2n8J36k20K73p9j26j8J26
5037D4KN1j47m6J44Q3p5k4j00j3J27%j67J09Q7j72N6m2L5N1j01J43J8J4R1k26
5063e8Q2l6Qp3R6J8N6j52KP9k6J0P4q3NL2J5j03P0J11j37j14J34O3j59R6M5j2
5091D3J09j81J96j03O6r5J40j72pn7K93k00K4j62QK65n7o4q5N0j34J75p4P1M0
5116H9R8j41j42J06p6L3m3M1j21K42K5L1J3j38r9J86q1J40j56m8J56j62J58p0
5140D1kO8l7J8lk04J35J24k11Mk3J38j72J32q5J47O1q1j10L1P4k03K22O1m7n7
$$ plain form
5166 21 185 10 21 -49 101 9 -103 166 60 34 21 67 19 190 25 55 34 89 -11 76 5 8 -7 -35 -250 0
5192 0 19 -14 65 2 -85 -24 -18 -23 101 15 1 76 -36 -61 -66 -181 68 -57 184 92 104 -55 -5 -5 -1 48 106 -52 -99
5221 -99 -37 79 -48 50 -31 -178 -51 -66 -120 76 5 -45 -40 5 38 -12 -59 151 -90 -121 12 31 -1 -84 -107 -82 93
5248 93 -56 46 -101 79 14 12 118 73 61 25 32 62 8 35 52 88 -133 3 -194 195 -76 -35 259 -15 143
5273 143 80 -32 -111 -69 -120 181 103 21 -9 -79 -26 -3 -65 9 -42 49 -47 -21 150 66 41 47 -6 -71 -6 -27 75 30
5301 30 -126 65 -66 -36 -80 -51 184 114 -6 -152 -27 -44 -178 97 -85 32 -24 -71 56 109 -62 -19 -54 5
5325 5 80 40 95 -35 127 64 21 -83 -39 -107 -84 -44 -18 67 122 5 -24 -33 -77 60 -39 62 -102 -87 153 -41 165
5352 165 69 -115 73 53 128 3 -3 122 27 -119 112 46 -36 -89 -6 -133 33 42 -67 65 -100 60 -64 -65 -120
$$ packed form
5166B1J64j75J1p0J50r2j12K69j06k6j3M6m8J71j65L0k1N5j00Q7p1Lj5k8k15K50
5192@J9l3P9o3q7O1OnJ24q6j4P5j12k5nj15K49j25K41r2J2j59N0%MM9N8j58m7
5221i9O2J16j27R8q1j47J27j5n4J96p1n0NM5L3n0m7K10k41l1J33J9l2q3k3K5J75
5248I3j49J02j47J80o5kJ06m5j2l6PL0n4K7J7L6k21J36j97L89k71M1K94k74J58
5273A43o3j12p9M2n1L01p8q2l0p0N3K3o2P4n1R1r6K6J71q4k5On3o5O5k1J02m5
5301C0j56J91j31L0m4K9K35p0j20j46J25j7j34K75j82J17n6m7J27N3j71M3l5N9
5325EP5m0N5j30J62o3m3j04M4o8K3M0K6Q5N5j17k9rm4J37r9J01j64J5K40j94K06
5352A65r6j84J88k0P5j25oJ25r5j46K31o6q2n3Q3j27J66Rj09J32j65J60j24jn5
$$ plain form
5377 -120 -70 -10 -75 16 61 179 -25 -79 161 -121 143 53 -97 -11 32 -128 132 -175 -8 -8 -144 -119 22 -103
5401 -103 -59 -4 130 70 11 25 96 183 85 18 -52 119 -64 77 11 123 129 -262 -16 109 146 14 -24 45 -47 -22
5427 -22 -86 -110 2 129 -82 -40 -17 11 -160 -109 137 100 52 25 44 -17 -30 69 118 63 -7 -138 -98 33 64 -6 260
5454 260 135 -36 -2 -104 -29 111 8 13 159 122 -73 -52 154 113 28 13 144 35 -69 -72 164 -63 133 232
5478 232 -34 75 100 78 -158 -59 27 143 82 -112 80 106 0 32 61 -30 105 29 17 26 15 107 -108 111 51
5503 51 -97 43 117 23 133 42 -91 -100 -38 -84 -73 -26 146 74 25 -71 24 191 31 -106 -50 -64 -97 -14 -13 48 -200
5530 -200 0 -5 -104 40 -118 108 91 89 42 83 110 57 33 -37 157 -47 -42 39 86 -61 -67 -103 -103 32 -70 -75 166 -9
5558 -9 72 -61 77 40 -82 1 -49 90 -51 86 27 49 -96 49 42 42 -16 185 59 -61 -36 -35 98 25 77 43
$$ packed form
5377a20N0O0o5R1M5J18k04n4K40k82K64r0j50Q6M3j60K60l07J67%j36K5J41j25
5401a03M4N5J34o0n9J4P1Q7r8o7p0J71j83J41o6J12Ol91K46J25L7j32l8O9r2K5
5427b2o4k4J12J27k11M2K3K8j71N1K46l7m8k7J9o1j3R9M9n5p0j31M0J31L1p0K66
5454B60j25j71L4j02P5J40j03NJ46l7j95K1K06m1q5j5J31j09j04lK36k27J96R9
5478B32k66J09K5k2k36R9Q6J16o1j94J92K6j06L2K9r1J35p6j2Rj1R2k15K19o0
5503E1j48J40P4r4J10r1j33rO2m6J1M7J72p2m9r6R5J67j60j37N6j4l3Q3JO1k48
5530b00K00nr9J44j58K26j7km7M1K7n3k4p0J94k04NQ1M7j47ol6%J35j02nK41j75
5558iQ1j33J38l7j22Q3n0J39j41J37n9K2j45J45p%n8K01j26j20K5JJ33p3N2l4
$$ plain form
5584 43 95 95 7 -101 105 79 22 171 39 -6 20 -90 -42 61 34 95 -29 32 101 120 -137 96 83 9 -8 141
5610 141 -21 19 -34 -5 172 -81 65 39 24 13 -75 -61 23 -70 -86 63 153 14 -46 -135 -35 8 33 -77 120
5635 120 -41 -11 71 -130 -146 125 -117 -62 92 8 -107 7 151 64 9 -18 3 -1 133 112 25 61 157 -63 -79
5660 -79 30 31 -51 166 66 158 37 -26 48 -79 52 85 -110 -68 57 -53 26 -87 56 82 46 13 -136 101
5684 101 116 102 41 10 -90 8 99 99 -131 83 88 -9 -15 -67 -80 21 103 20 -61 60 14 -49 74 46 14 -15 88 -101
5712 -101 -38 -1 15 229 58 58 -98 154 -24 -133 -103 78 195 -34 -87 119 36 -208 -60 93 -62 46 -48
5735 -48 -12 197 71 2 -16 10 42 -84 -148 180 -119 -60 78 185 57 64 -109 -51 -121 136 -83 -11 215 41
5759 41 34 -28 25 -7 -153 -75 -4 14 78 37 104 76 60 -79 69 110 53 -64 -8 4 31 -33 -40 47 -168 96 42 62
$$ packed form
5584D3N2%q8j08K06k6n7J49j32m5K6j10M8J03k7O1j24O1O9J9k57K33j3p4j7J49
5610A41j62M0n3K9J77k53J46k6j5j1q8J4Q4r3j6J49R0j39o0q9J00M3K5j10J97
5635A20j61L0Q2k01j6K71k42N5J54q4j15J14J44q7n5k7K1mJ34k1q7L6R6k20j6
5660g9J09Jq2K17j00R2j21o3P4j27J31L3j95M2J25j10P9j13J43K6l6l3j49K37
5684A01J5j4o1l1j00R8R1%k30K14Nr7on2j3J01Q2q3q1J21m6o3J23k8l2k9J03j89
5712a01O3L7J6K14j71%j56K52j78j09L0J81J17k29n3K06q3k44J48J53j55J08r4
5735d8L6K09j26o9j8K6L2j26o4L28k99N9J38J07j28Pj73N8p0K57k19P2K26j74
5759D1po2N3l2j46P8P1J8O4m1O7k8j6j39J48M1n7j17N6J2K7o4pQ7k15K64n4K0
$$ plain form
5787 62 -85 5 113 -44 126 72 65 -130 -10 -60 14 -71 83 125 159 6 58 -111 -120 -25 15 11 116 30 -93 -20
5813 -20 37 27 -27 53 -35 -39 -4 13 81 -174 40 -38 -120 109 25 -48 28 112 -309 -86 -44 36 -89 142 78 54 82
5840 82 11 135 -4 -108 -5 -107 -13 -54 184 60 -95 1 141 -48 102 81 -31 41 46 -97 -62 40 101 150
5864 150 -95 134 193 -150 -141 12 -28 -77 69 92 23 38 -44 -24 -4 14 65 20 -32 -45 -88 -32 -162 86 -28 118
5890 118 -34 37 -77 -103 67 -143 -135 101 2 18 38 -76 -49 -134 45 117 -24 -40 38 -26 -76 -107 56 -8 -251
5915 -251 -87 29 79 -19 -113 -16 19 -165 -26 -38 36 84 -124 -113 -16 18 -8 -8 140 -174 42 51 82 115 132 -61
5941 -61 -26 101 -9 137 132 111 -50 -28 -105 2 -99 27 35 -6 -35 -69 54 -71 176 -22 5 22 -79 -59 -68 42
5967 42 31 135 156 -122 110 -176 -57 -132 -3 48 -43 6 -37 37 -77 -20 -64 9 123 -30 120 11 76 36 18
$$ packed form
5787F2j47R0J08j57J70n4pj95J20n0P4q5J54M2L4j53N2j69rR5M0mJ05q6j23P3
5813b0N7j0n4Q0q8mL5J7O8k55K14p8q2K29q4p3P6Q4m21K23M2Q0j25K31o4k4K8
5840H2p1J24j39j04J03j02R4m1K38j24j55R6J40j89J50k1j12P2Nj43L5J02O1M9
5864A50k45K29N9l43RJ53m0m9J46K3o9J5q2K0K0J8N1m5n2j3m3N6j30K48j14J46
5890A18j52P1j14k6J70k10QK36r9J6K0j14K7q5J79P2j41j6P8o4n0l1J63o4k43
5915b51J64J16N0r8r4R7L5j84J39j2P4M8k08J1R7L4k6%J48l14K16RL1L3J7j93
5941f1L5J27j10J46nk1j61K2p7J07j01J26Qm1k9l4J23j25K47j98K7J7j01K0rJ10
5967D2j1J04K1k78K32k86J19p5J29N1r1M9m3P4j14N7m4P3J14j53J50j09O5m0j8
$$ plain form
5992 18 -120 3 76 44 42 50 -9 -105 82 2 -73 141 57 -11 -84 65 -52 5 35 58 -20 -16 73 -30 -1 -9 -43 182
6020 182 -75 -75 38 -125 89 -16 -9 -19 1 46 -5 -48 -62 3 45 12 161 39 154 57 87 21 -203 -138 74 -156
6046 -156 32 121 82 -95 92 -70 -6 -12 -106 75 -27 -84 -134 -112 -52 141 -176 102 36 -51 63 13 -10 10 -51
6071 -51 -89 -216 106 38 54 -119 82 43 -35 -40 36 -79 -44 -21 -36 68 4 50 138 61 79 88 -8 -50 -109 101 59 77
6099 77 64 -92 -40 88 -121 165 -9 8 -43 57 166 70 98 58 -103 88 -28 46 -19 -85 -35 -90 61 42 -18
6124 -18 80 77 45 -98 -52 -31 1 -82 0 13 4 249 22 192 -71 -156 72 -14 60 59 -61 -90 67 20 -37 74 125
6151 125 -114 -53 74 151 -6 -107 -42 -103 -149 -83 -112 -63 23 -203 56 -113 -129 -67 -49 -12 -79 46 144 80 118 -76
6177 -76 36 168 -230 240 -38 121 14 7 139 67 73 112 -60 -96 -35 9 79 81 127 248 -63 110 -121 101 -19
$$ packed form
5992A8j38J23P3l2kQn9r6J87q0p5K14q4o8p3J49j17N7L0K3p8MQ9j03K9ql4K25
6020A82k57%J13j63K14j05Pj0K0M5n1m3j4O5M2l3J49j22J15r7L0o6k24O5K12k30
6046a56J88Q9l9j77J87j62O4or4J81j02n7n0K2O0J93l17K78o6q7J14n0k3K0o1
6071e1l8j27L22o8J6j73K01l9p8nP6j15L5K3j5J04o4M6Q8p7J8Rr6m2n9K10m2J8
6099G7j3j56N2J28k09K86j74J7n1J00J09r6K8m0j61J91j16P4o5o6N0n5J51j9o0
6124a8R8ll2j43M6K1L2q3Q2J3rK45k27J70k63q5K28q6P4jj20k9J57m7n7J11N1
6151A25k39O1J27P7j57j01O5o1m6O6k9M9Q6k26K59j69j6O2J8L7o7J25R8o4L8j94
6177g6J12J32l98M70k78J59j07pJ32p2OL9j72l6O1M4P0KM6J21l11J73k31K22j20
$$ plain form
6202 -19 -22 -107 10 23 77 -61 222 -56 -11 -49 -89 114 -107 18 -40 66 54 72 64 300 -28 16 72 113 -86 43
6228 43 -28 78 185 -1 60 82 -125 24 14 142 -29 -118 5 -145 -103 44 13 86 -35 18 -45 128 9 -75
6252 -75 55 -41 52 -76 130 37 105 -169 80 -14 53 -61 -49 -85 -57 -14 -124 -53 -66 92 48 -131 34 161 12
6277 12 91 87 33 -184 -24 97 -51 79 126 -137 79 1 122 60 -119 -12 -4 134 86 53 -70 -42 -99 -9 173
6302 173 135 -54 -105 31 132 -13 -50 16 -150 -15 -91 -19 -54 -29 143 57 -129 -69 11 37 56 -109 -45 -119 -187
6327 -187 81 -47 104 -16 33 -61 100 131 82 8 102 22 -85 -32 25 85 5 -183 106 -91 -120 69 -1 5 72
6352 72 -40 -57 -192 -91 31 -195 3 -6 -87 10 -240 -75 212 -4 -14 -69 88 90 -83 65 -118 -11 107
6375 107 -41 127 222 -36 48 115 -93 -77 -72 64 34 -75 53 -25 36 -13 28 3 91 42 37 193 27 -75 -64 229
$$ packed form
6202a9lq5J17J3N4j38K83k78M5l8m0K03k21J25n8J06j2J8qK36l28M4N6M1j99J29
6228D3p1J06J07j86O1K2k07J49j0J28j71q9J23j50M2J47l1P3j21N3o3J73j19q4
6252g5J30r6R3j28K06r3O8k74K49r4O7j14J2l6K8M3j10P1j3J58m4j79J65J27j49
6277A2P9mn4k17J60J21j48J30M7k63K16p8J21o2j79J07QJ38m8l3j23K8n7R0J82
6302A73l8j89n1J36J01j45l7O6j66J35p6P2l5K5J72q6j86O0Q0K6J9j65O4p4o8
6327a87K68j28J51j20M9r4J61L1m9p4R4q0j07N3N7O0q0j88K89j97k9J89p0OO7
6352G2j12j7j35J01J22k26J98rq1R7k50J65K87k16j0n5J57Kj73J48j83J07J18
6375A07j48J68R5k58Q4O7k08J6NJ36l0j09J28p8O1m9M1k5Q8m9nJ56j66j02J1K93
$$ plain form
6401 229 82 -12 18 -62 -21 17 145 56 -82 55 -44 57 -117 113 -21 -8 5 12 80 -128 34 169 -19 23
6425 23 -82 -37 156 -241 122 91 71 -81 89 45 157 -116 22 54 11 81 -82 -74 181 5 -48 62 -43 -141
6449 -141 45 -84 128 -156 -82 -39 -119 65 -80 -73 -134 47 -27 -25 242 -14 -21 140 -7 -74 -115 142 -17 82 44
6474 44 34 -188 50 -47 200 -178 125 56 -111 -24 121 -84 -96 74 41 32 34 27 -5 109 22 -37 -97 -8 -54 77
6500 77 3 -209 -16 66 96 61 49 119 -45 173 41 -22 -75 122 27 -117 -4 -10 29 14 18 -56 -42 -9 -48 119 -205
6527 -205 -83 58 -62 -2 -38 38 -37 120 -40 -135 81 108 -73 -36 15 58 -105 20 173 15 6 256 -20 -171
6551 -171 -213 -20 133 102 41 22 43 84 -112 -40 -40 97 76 -5 -52 1 139 -98 14 -20 166 -65 -133 -27 -2
6576 -2 -11 40 34 -28 -12 91 -55 -46 -60 87 49 98 -101 75 -17 40 -77 11 130 -40 4 -8 70 53 164 38 -95
$$ packed form
6401B29j47r4L0q0M1L8J28q9j38J37r9J01j74K30j34J3J3PO8k08J62J35j88M2
6425B3j05M5J93l97L63l1k0j52J70m4J12k73J38L2m3P0j63QK55j76n3J10j05r8
6449a41J86j29K12k84P4M3q0J84j45Po1J81p4KK67k56pJ61j47o7m1K57j59R9l8
6474D4j0k22K38r7K47l78L03o9j67Q7J45k05j2J70l3rKpl2J14q7n9o0Q9m6J31
6500G7p4k12J93Q2L0l5j2P0j64K18j32o3n3J97r5j44J13oL9j5Mp4J4L3l9J67l24
6527b05J22J41j20O0l6P6p5J57j60r5K16K7j81L7N1M3j63J25J53j58rK50k76j51
6551a71m2J93J53l1o1j9K1M1j96P2%J37k1q1m7N3J38k37J12l4J86k31o8J06K5
6576brN1oo2J6J03j46Rj4J47l8M9j99J76r2N7j17Q8J19j70M4j2P8j7J11j26j33
$$ plain form
6603 -95 11 -91 -96 122 116 129 -110 -13 -65 163 -67 -114 37 -70 -107 84 -132 40 26 75 4 -70 101 -135 -38
6628 -38 -68 -1 -98 24 10 14 -29 -56 5 12 119 -25 226 -55 42 -67 -51 -22 53 -3 -82 24 -51 67 36 79 21
6655 21 13 4 115 71 81 -70 -46 -181 -24 9 -5 39 -92 59 108 29 -25 107 -42 -35 50 -95 38 11 22 83 -50
6682 -50 -34 -123 -191 140 22 129 -167 89 78 -151 182 -67 -101 -88 35 -5 130 -48 -44 -245 -30 29 71 -56
6706 -56 -9 -78 -145 -57 114 13 13 -70 -164 -90 -84 -108 67 223 -43 -15 63 189 215 -23 68 -102 -3 -63 -96 -51 69
6733 69 -50 50 40 -78 10 134 -58 -154 71 50 19 -10 -92 79 180 26 60 -114 -69 65 58 76 -28 173
6757 173 38 15 60 121 -111 -61 -87 -61 104 183 23 -73 -45 96 -55 -37 -102 -192 75 -152 -66 -36 23 29 24 23 75
6784 75 84 -144 23 98 -165 -191 46 -112 -99 79 64 -100 -128 1 41 -17 -93 60 34 -62 -225 -40 151 0
$$ packed form
6603i5J06j02nK18oJ3k39R7n2K28k30m7J51j07l7J91k16J72j4M9p1p4J71k36R7
6628c8l0O7r7J22j4Mm3k7O1PJ07j44K51k81R7j09J6K9P5n6p9J06p5J18l1M3n8
6655B1qrJ11m4J0j51K4j35J57L3j4M4j31J51M9p9n4J32j49PQ5j45J33k7J1O1j33
6682e0J6q9o8L31j18J07k96K56j1k29L33k49l4J3J23m0J35j78Mk01K15N9M2j27
6706e6M7o9o7Q8J71j01%q3r4P4Ok4J75J56k66K8P8J26K6k38R1j70R9o0l3M5J20
6733F9j19J00j0j18Q8J24j92r6K25k1l1k9q2J71J01j54L4j74M5J34pJ8j04K01
6757A73j35k3M5O1k32N0k6K6J65P9j60r6K8J41j51J8o5r0K67k27Q6L0N9OnjN2
6784G5Rk28J67P5k63k6K37j58J3J78j5j64k8J29M0n8p6J53k6r6j63J85J91j51
$$ plain form
6808 0 -21 46 -90 35 6 33 53 -169 -53 -103 82 -56 196 7 -132 84 158 -59 -122 -191 -39 58 -37 43 -72
6833 -72 -87 11 69 -41 -61 -67 -119 89 28 111 -56 98 146 149 -123 -15 76 36 -39 -58 27 -84 87 -226 -132 80
6859 80 -6 -124 132 95 0 60 -25 -24 -28 -83 21 -123 -55 93 -133 36 -123 -101 82 -16 33 79 90 -72 100 136
6885 136 107 139 170 98 167 -151 67 53 -71 -39 -234 8 -75 -7 -56 -156 -110 19 126 98 -26 116 -40 77
6909 77 74 75 -63 -25 127 -91 4 -28 -52 -71 104 161 -1 37 -19 -17 -15 171 29 26 50 -98 141 -52 61 -61 11
6936 11 -27 -83 -7 -151 -112 31 -47 118 -22 157 -86 -18 -47 7 -40 104 -28 25 -82 3 9 87 1 99 58 171
6962 171 123 59 157 73 40 -142 150 -24 37 -49 -29 63 82 77 146 128 108 -133 37 -111 -60 27 -65 22 -31 1 63
6989 63 -60 -189 -48 101 60 37 134 -81 71 76 -7 122 -154 0 37 -7 -95 25 -11 -84 137 -30 -106 -172 -27
$$ packed form
6808@k1O7j36J25k9K7K0k22J16n0J85j38K52j89j39K16P4k17o3o9J52R7r5Q0j15
6833g2j5R8N8j10k0on2K08o1Q3j67J54M8Lk72J08R1m0p5j9Q5j11J71l13R4K12
6859H0q6j18K56l7r5O0q5Jmn5J04j44O8J48k26J69j59K2J83r8M9M6J1j62J72L6
6885A36k9L2L1p2O9l18K18j4j24L2j95K42q3O8m9j00M6J29J07k8j24J42j56J17
6909G7lJj38L8J52k18R5l2k4j9J75N7j62L8n6KKJ86j42lK4j48K39j93J13j22P2
6936A1l8n6P6j44L9J43p8J65j40J79k43O8k9N4m7J44j32N3j07Q5OP8q6R8m1J13
6962A71m8o4R8q4l3j82K92j74O1q6K0R2J9nO9j8k0k41J70j48N1Q7r2Q7n3L2O2
6989F3j23j29J41J49m1k3R7k15J52Nq3J29k76J54L7m4q8J20l6p3K21j67p6o6J45
$$ plain form
7014 -27 71 -26 4 25 25 33 -29 22 -55 -45 -157 75 56 125 -109 80 56 26 -13 -167 78 194 71 58 92 191 -63
7041 -63 -26 11 10 68 -46 19 91 -106 62 170 -125 122 9 -19 -155 11 61 -98 29 81 -8 131 -32 113
7065 113 -95 3 -82 -103 48 -32 160 1 10 70 -143 73 -46 84 87 33 22 -35 75 22 90 106 -126 -92 -73 3
7091 3 -22 71 203 -11 -3 -36 49 163 7 84 4 16 0 111 -46 100 -32 -109 -83 -49 24 1 -94 24 -107 -62
7117 -62 69 -101 -67 21 -45 87 -97 -128 152 -71 -46 198 -167 102 -36 -51 76 -6 -44 -102 1 -28 -37 40 77
7142 77 70 -59 9 -48 68 -65 -38 -31 -90 -67 -76 -96 -36 -136 -238 -31 -110 -4 24 -12 -27 -69 16 -86 134 183 -55
7169 -55 -1 -27 56 49 -19 77 -50 100 -8 64 15 60 106 197 47 -10 -26 61 75 -65 37 -1 -123 -7 36 62 -43
7196 -43 -116 20 29 124 -18 17 55 91 14 68 -31 88 -124 -65 -34 7 211 -174 -74 83 -9 -21 -6 185 44 111
$$ packed form
7014b7R8r7L0K1%Qo2N1p7J0j12K32j9O9k34J89k4l0l9j54K45J16j23j3L4R9k54
7041f3L7L7jN8j14O5P2j97J68J08k95K47j13k8j36J66N0j59J27N2q9J39j63J45
7065A13k08R8q5k1J51q0J92j59RO0k13K16j19J30Ln4j1n7J10n3O8J6k32L4J9P6
7091Ck5R3J32k14Ql3Q5J14j56P7q0J2j6J11j57J46j32p7K6L4P3k3r5J18j31M5
7117f2J31j70L4Q8o6J32j84l1K80k23K5K44l65K69j38j5J27q2l8n8J03k9rP7L7
7142G7pj29O8n7J16j33K7Pn9K3rk0O0j00j02K07p9J06K8l6j5m2Q5j02K20M9k38
7169e5N4k6Q3po8R6j27J50j08P2m9M5M6R1j50n7j6Q7J4j40J02l8j22J16M3K6j05
7196d3p3J36RR5j42L5L8L6p7N4r9J19k12N9L1M1K04l85J00J57r2j2J5J91j41O7
$$ plain form
7222 111 -6 -14 146 100 53 -5 0 80 37 35 -72 -81 88 23 4 10 137 -107 -5 -4 164 -183 -76 123 -12 16 19
7249 19 34 -104 43 9 78 -46 -140 -64 93 -11 -94 75 -46 7 146 -43 80 46 -51 54 30 -81 115 31
7273 31 -222 11 36 -51 -32 -86 50 218 67 95 96 70 -33 143 110 -62 42 -21 37 23 -126 122 86 77 79 190
7299 190 -113 -29 50 -87 -83 -65 93 44 -73 75 0 22 42 -5 -145 -13 81 70 -37 127 -120 43 19 -46 7
7324 7 -98 -94 -15 -113 -106 29 -35 -20 29 61 142 121 -42 -24 -74 -14 92 90 95 -49 20 -108 -84 -35 5 -22 135 60 -103
7353 -103 -130 124 62 6 -65 -76 71 49 -41 35 15 35 -203 44 84 80 54 -6 127 -33 168 80 1 -68 -29 -33 -45
7380 -45 10 90 68 19 109 51 -1 -10 -41 35 -16 -133 30 -178 10 45 37 -8 84 -64 -5 -34 64 -31 -38 184 108 0
7408 0 -44 -41 11 -45 35 -52 82 -89 31 -98 24 102 -53 3 58 84 34 -19 137 40 14 168 148 78 46 99 50
$$ packed form
7222A11j17qJ60m6m7n8NQ0m3kj07rJ69o5j9OJ27k44J02JJ68l47J07J99j35K8L
7249A9J5j38J47l4O9j24r4P6J57j04q3J69j21N3J39j89J23l4r7J05k4j11J96q4
7273C1k53K33K5q7J9n4J36J68j51K8Jk6j03J76l3j72J04o3N8j4j49K48l6rKJ11
7299A90l03Q4P9j37MJ8J58m9j17J48p5K2K0m7j40J32R4j1j07J64k47J63k4o5N3
7324Gj05MP9r8PJ35o4J5M9L2Q1k1j63J8n0O0J06kNj44O9j28K4M9M0k7J57p5j63
7353a03k7K54o2n6p1j1J47k2r0P6k0K0k38K47M0mk6o0J33j60K01q8p9o9L9mj2
7380d5N5Q0k2m9R0n8n2rl1P6n1j17J63k08J88L5qm5R2j48N9k9R8r5pK22p6j08
7408@m4LN2n6Q0q7J34j71J20j29J22P8j55N6N5K6n0n3J56r7k6J54k0p0l2N3m9
$$ plain form
7435 50 204 86 -26 -134 -39 6 47 -113 112 -71 101 -28 0 112 33 122 -102 -59 -77 10 -42 11 200 54
7459 54 44 10 -58 -76 -168 -72 -62 46 -56 -76 16 -55 -7 222 -110 -89 -109 -18 49 112 -19 9 13 77 97 140 11 89
7487 89 32 88 -104 -17 86 30 110 -153 105 -59 4 -42 80 -10 158 -140 -2 47 19 76 103 88 54 138 47 98
7513 98 25 14 -22 33 145 -112 160 96 -39 -74 7 147 77 21 -1 117 7 5 13 130 20 87 134 -125 -36 71
7539 71 -135 124 -115 -21 -178 -265 -86 -53 104 116 -73 33 128 62 60 21 7 164 18 36 -207 -83 -15 6 -55
7564 -55 80 118 66 111 -196 37 36 -2 15 -24 -27 9 -98 54 69 -190 -43 -93 -23 -15 -213 -77 -18 89 -4 -92 109
7591 109 37 108 43 -127 -97 24 32 59 211 -143 63 -21 10 -118 105 -73 39 -73 -67 -213 7 -189 -47 -15
7615 -15 -75 141 -66 35 66 68 -51 -209 5 -142 40 52 -103 79 -52 104 36 83 63 26 -20 -84 41 41 97
$$ packed form
7435E0J54j18j12j08R5M5M1j60K25j83J72j29K8J12p9Q9k24M3j8Q7n2N3J89j46
7459E4j0l4o8j8r2R6J0J08j02k0R2p1M8K29l32K1k0R1O7O3j31K8MO4K0M3j29P8
7487H9n7N6j92Q7J03n6Q0k63K58j64O3m6J22r0J68k98J38M9k8N7K7j5l4Q4r1N1
7513I8p3j1l6N5J12k57K72o4j35l5Q1J40p0n6k2J18j10kQJ17j10O7M7k59Q9J07
7539G1k06K59k39R4j57q7J79L3J57J2j89J06R5o6kl9j4J57j46J8k43J24O8K1o1
7564e5J35L8n2M5l07K33jl8J7l9lL6j07J52J5k59J47n0P0Qj98J36N9J07r3q8K01
7591A09p2P1o5j70L0J21QK7J52l54K06q4L1j28K23j78J12j12Oj46K20j96J42L2
7615a5o0K16k07J01L1Kj19j58K14j47J82J2j55J82j31J56o8M7k0l7m6o4J25%N6
$$ plain form
7640 97 6 -50 -93 -2 175 -73 -183 118 -22 173 22 -78 145 50 146 -79 68 13 -13 -72 -252 171 73 -78
7664 -78 -57 41 -28 -16 77 81 123 -136 -32 -2 -131 -49 82 -125 -94 -93 -88 93 109 -173 26 102 57 96 40 219 -38
7691 -38 33 -31 13 172 -93 139 -36 248 200 -76 -7 70 2 -34 40 -3 93 72 100 84 30 -144 -45 198 54 -9
7717 -9 116 218 -1 44 -93 50 -72 59 -9 58 229 73 -35 -31 76 -51 40 -70 65 37 -26 55 73 -81
7741 -81 57 45 150 -24 93 24 -51 5 -285 -12 -172 37 -22 147 -11 50 78 -129 -83 -112 89 -118 101
7764 101 -65 -96 -88 -19 -50 134 -2 22 16 114 116 137 -138 41 41 -14 -99 -46 -24 -37 31 -32 -35 116 -65 -19 124 -37
7792 -37 78 73 -7 70 -196 -67 301 -95 -117 -100 -45 113 108 -75 34 116 -5 118 -128 93 115 53 -201 54
7816 54 20 -87 -152 -103 109 -53 34 100 -87 43 -10 -2 -37 -61 -170 109 138 -237 94 -134 55 43 -35 -16 18
$$ packed form
7640I7r1n6m3R1J77k48j10L01j40J95j51j00K23r5R6k25J47n5k6n9j80M23r8j51
7664g8K1R8o9J2R3MM2k59J04L0j29Q2J31k07L1JNJ81J6k82J99P6m5L9n6J79k57
7691c8P1o4M4J59k65K32j75K84m8k76O9P7o8l6P4m3R6k1K8j6n4j74R9K43j44o3
7717iJ25J02k19M5j37J43j22J31o8O7J71j56j08MJ07j27R1j10J35k8o3Q1J8j54
7741h1J38j2J05j74J17o9p5N6k90K73j60K09n9J69j58O1K8k07M6k9K01k07K19
7764A01j66l1QO9l1J84j36K4oR8KK1k75J79%n5q5N3K2j3O8o3lJ51j81M6J43j61
7792c7J15nq0P7k66J29L68l96k2J7N5J58nj83J09Q2j21J23k46K21K2o2k54K55
7816E4l4j07o5M9K12j62Q7O6j87J30n3Ql5k4j09K79K9l75L31k28J89j2p8J9L4
$$ plain form
7841 18 -139 43 5 84 -81 -24 60 -67 31 15 15 15 -29 79 -14 99 20 46 58 65 -141 30 -120 -135 -111 179 -23
7868 -23 80 16 36 -60 82 -48 26 27 -36 -23 -47 61 -148 -99 163 171 -165 77 -16 67 -129 -152 7 -64 -147 -36
7894 -36 43 46 53 76 126 -138 -103 -10 -10 -43 -110 33 -168 -156 -55 145 -50 -41 -159 -61 -14 55 -13 59 57 128 73 117 5
7923 5 98 38 77 -4 -134 161 -111 -23 48 -104 47 -86 -76 -94 -21 18 -13 -65 166 64 -10 -78 -33 -25 -38 -19 -259
7950 -259 62 37 -4 -46 -26 -127 67 34 76 -42 27 56 -45 -4 -141 47 -214 -62 39 32 -64 -20 149 -121
7974 -121 -24 -27 -4 73 -74 166 -57 199 113 57 33 -60 -54 71 -1 77 -139 -75 40 -60 -9 63 -69 4 101 52
8000 52 -72 25 -64 102 34 108 -203 32 -162 41 24 92 -38 -29 173 -204 23 73 238 114 -3 -33 92 91
8024 91 -106 -17 113 -47 136 -23 19 -64 15 83 77 34 26 128 44 -47 -197 -129 -7 39 -94 133 66 -94 8
$$ packed form
7841A8j57J82l8P9j65N7Q4j27R8j6%%m4J08r3J13p9K6J2Pk06J71j50j5K4K90k02
7868b3J03o4K0r6J42j30P4Jo3J3k4J08k09M9K62Ql36K42r3Q3j96k3J59p1q3J11
7894c6P9LPK3N0k64L5R3%l3o7J43k01J2J01K00j95Rj18R8M7O9o8P2kP1n5M4j12
7923ER3o0L9q1j30K95k72Q8P1j52J51j33J0j8P3L9l1n2K31j02p4o8M5Qj3J9k40
7950b59L21k5m1m2K0j01J94l3M2j18O9K9j01M1j37J88k61J52J01pr6M4J69k70
7974a21R7lK3P7j47K40k23K56q6n6k4r3OJ25p2P8k16O4J15j00N1P2j32P3R7m9
8000E2j24R7q9J66o8P4l11K35j94K03j7O8j30RK02l77K27N0J65j24j17l0J25j
8024I1j97Q9J30j60J83j59M2q3P9O8om3qJ02q4r1j50O8J22M6j33K27o7j60J02
$$ plain form
8049 8 186 95 -146 62 10 -26 -15 49 -38 -23 91 -42 -61 94 31 -19 98 75 67 115 -39 46 21 116 -109 -38 37
8076 37 152 33 -76 -56 30 -38 -17 16 -18 89 -68 -27 -134 125 -8 -2 30 1 -58 88 -96 -14 81 115 20 -57
8102 -57 135 87 -27 -2 -99 162 131 -28 35 -77 103 36 -9 -25 9 43 -46 -30 -24 84 -17 8 59 6 -25 6 -70
8129 -70 -89 38 112 83 -195 -35 -68 -36 21 -159 -109 -13 -6 -15 -131 40 -54 -127 -18 72 65 36 -105 36 78 48 -136
8156 -136 -82 8 71 -10 79 -28 -80 -48 119 90 12 43 -68 -116 152 137 -66 -12 -85 53 -22 9 -78 -84 5 -56 11
8183 11 98 10 40 -106 -149 7 -73 -86
$$ packed form
8049HJ78r1k41K08n2l6J1O4q7J5J14j33j9J55o3n0J17k3qM8j54Q5k5R5k25P1P5
8076C7J15j19j09K0Q6o8K1L3l4J07j57M1j07K59j33OL2k9n9J46j84Q2R5L4r5p7
8102e7J92m8j14K5r7K61l1j59O3j12J80o7m5j6L4L4q9J6OJ08j01K5N1n3l1L1p6
8129g0j9J27P4k9k78J60l3L2N7j80N0R6Prj16J71r4p3J09R0pk9j41J41M2l0j84
8156a36N4R0O3q1Q9j07n2L2J67k9p8L1j11m8K68j5k03N4p3J38p5L1q7oQ9o1O7
8183A1Q7q8L0j46m3J56q0j3
8191h6
$$ Imaginary data points
##PAGE= N=2
##DATA TABLE= (X++(I..I)), XYDATA
$$ plain form
0 0 0 0 0 0 0 0 0 0 0 0 0 0 0 -4 4 -8 8 -8 8 -13 16 -16 24 -24 32 -36 40 -48 56 -64 74 -84 95 -108 124 -139
36 -139 156 -172 195 -217 242 -269 299 -331 367 -405 446 -494 544 -600 659 -726 801 -884 976
55 976 -1078 1194 -1330 1485 -1665 1881 -2141 2466 -2882 3434 -4210 5392 -7416 11826 -41791
70 -41791 66724 21128 -154735 85861 194704 -88318 -95479 218936 69366 -203353 60139
81 60139 248478 -95376 -172732 135771 77192 -161011 16679 159387 -75724 -137174 74449
92 74449 25450 -144151 -12037 119111 -51353 -127182 55215 84525 -82575 -50630 101065
103 101065 19845 -114390 6066 116911 -9288 -53756 90367 66760 -80686 -3255 106416
114 106416 -26264 -82408 69980 47271 -105614 -17868 101055 -29612 -96452 36855 30744
$$ packed form
0@%%%%%%%%%%%%%mQj2J6j6J6k1K9l2M0m8N6o8P6q8J04j20J38j58J79k03K32k63
36a39K95l28L67m12M59n11N68o30O98p72Q51r40J038j144J259j385J527j685J860
55I76k054K272k524K815l150L546m022M607n348O316p644R602j2808J9242n3617
70d1791J08515m5596j75863K40596J08843k83022p161L14415j49570k72719K63492
81F0139J88339l43854p7356L08503n8579k38203J77690J42708k35111o1450K11623
92G4449m8999j69601J32114J31148j70464p5829J82397K9310j67100L1945J51695
103A01065q1220j34235J20456J10845j26199m4468J44123k3607j47446P7431J09671
114A06416j32680n6144J52388k2709j52885Q7746J18923j30667o6840J33307o111
$$ plain form
125 30744 -94515 -34688 70771 -6244 -67586 23435 53324 -32054 -27335 54286 23964 -48245
137 -48245 2836 57065 -10081 -30651 55728 42487 -52209 -14502 59750 -9560 -58786 26368
149 26368 39890 -48997 -31055 43850 405 -47903 10178 23272 -44241 -28653 35553 2682
161 2682 -37771 15997 38023 -21984 -22913 36525 21974 -28031 564 37614 -859 -22822 22503
174 22503 28752 -18771 -12668 22579 -6060 -32566 9559 20277 -27193 -18615 25703 -1214 -35052
187 -35052 4941 23696 -20452 -22685 19742 10767 -19208 4056 25414 -3184 -13587 14517
199 14517 11754 -14568 149 22205 -960 -15353 13242 17433 -14589 -10332 16335 -592 -23842
212 -23842 -907 13865 -10700 -13747 11273 4029 -17266 -2358 11413 -8542 -12017 11427 7413
$$ packed form
125C0744j25259N9827J05459p7015o1342R1021K9889q5378M719Q1621l0322p2209
137d8245N1081N4229o7146k0570Q6379j3241r4696L7707P4252o9310m9226Q5154
149B6368J3522q8887J7942P4905m3445m8308N8081J3094o7513J5588O4206l2871
161B682m0453N3768K2026o0007r29N9438j4551n0005K8595L7050l8473k1963M5325
174B2503O249m7523O103L5247k8639k6506M2125J0718m7470Q578M4318k6917l3838
187c5052L9993J8755m4148k233M2427q975k9975K3264K1358k8598j0403K8104
199A4517k763k6322J4717K2056k3165j4393K8595M191l2022M257K6667j6927k3250
212b3842K2935J4772k4565l047K5020p244k1295J4908J3771j9955l475K3444m014
$$ plain form
225 7413 -11624 2866 18910 -322 -9635 10076 10306 -10182 -4770 12959 2911 -9560 3483
238 3483 9508 -6005 -7612 5769 -578 -12735 -1602 6658 -7296 -8253 8672 4508 -11055 -1782
252 -1782 9811 -3222 -9463 5525 7909 -4784 -874 10025 2805 -4403 4193 5675 -5195 -2776
266 -2776 6849 641 -6869 2440 6679 -4879 -6604 3997 1263 -8684 -3177 4573 -2126 -5738 2932
281 2932 3767 -4174 -1318 4831 -877 -4613 3552 5087 -3065 -406 7353 2112 -4303 2115 5101
296 5101 -2778 -3753 3515 1838 -4007 -464 3264 -1852 -4013 981 158 -4796 -1729 2589 -1164 -3103
312 -3103 2439 3050 -2615 -1543 3636 505 -3326 1267 3837 -442 -752 3434 1885 -2040 238 2294
328 2294 -1842 -2469 1826 800 -2677 -32 2769 -1174 -3410 668 902 -3174 -2076 1842 217 -1972
$$ packed form
225G413j9037J4490J6044j9232r313J9711K30k0488N412J7729j0048j2471J3043
238C483O025j5513j607J3381o347j2157J1133Q260j3954r57J6925m164j5563R273
252a782J1593j3033o241J4988K384j2693L910J0899p220p208Q596J482j0870K419
266b776R625o208p510R309M239j1558j725J0601k734r947N507P750o699l612Q670
281B932Q35p941K856O149n708l736Q165J535q152K659P759n241o415O418K986
296E101p879r75P268j677n845L543L728n116k161M994q23m954L067M318l753j939
312c103N542O11n665J072N179l131l831M593K570m279l10M186j549l925K278K056
328B294m136o27M295j026l477K645K801l943k236M078K34m076J098L918j625k189
$$ plain form
344 -1972 824 2558 -500 -738 1879 496 -1624 723 2138 -364 -556 2350 1407 -1696 -359 1516
360 1516 -964 -2381 406 703 -1727 -876 1104 -120 -1506 115 427 -1464 -871 1191 201 -1145
376 -1145 937 1697 -543 -523 1496 796 -969 100 1406 175 -393 1014 806 -827 -62 659 -467
393 -467 -1110 53 339 -1032 -607 782 10 -1367 -256 640 -533 -785 741 649 -505 395 1232 105
411 105 -154 735 502 -467 111 1042 85 -245 909 531 -695 -493 397 -260 -779 -86 249 -368 -411 373
431 373 34 -462 -332 265 -346 -478 236 473 -87 197 913 64 -194 530 731 -364 -176 805 64 -483
451 -483 250 346 -345 -222 -97 -427 -466 -80 -91 -108 -195 136 273 -347 -49 479 65 -266 35 531 65 -122
473 -122 675 223 -66 392 288 -73 -57 240 10 -364 240 207 -146 -351 258 -148 -424 -125 -6 48 -86
$$ packed form
344a972K796J734l058k38K617j383k120K347J415k502j92K906r43l103J337J875
360A516k480j417K787K97k430Q51J980j224j386J621L12j891N93K062r90j346
376a145K082P60k240K0K019p00j765J069J306j231n68J407k08j633P65P21j126
393d67o43J163K86j371M25J389p72j377J111Q96j173k52J526r2j154R00Q37j127
411A05k59Q89k33r69N78R31r57l30J154l78j226K02Q90o57n19O93L35o17m3P84
431C73l39m96J30N97o11j32P14K37n60K84P16q49k58P24K01j095J88R81p41n47
451d83P33R6o91J23J25l30l9L86j1j7q7L31J37o20K98N28m14l31L01M96m66j87
473a22P97m52k89M58j04l61J6K97k30l74O04l3l53k05O09m06k76K99J19N4j34
$$ plain form
494 -86 111 136 33 -123 95 93 -42 69 199 -43 33 332 187 -281 145 340 -171 -217 185 90 -141 49 106
517 106 -185 -98 84 -126 -342 28 108 -174 -77 250 -3 110 -90 158 108 71 -94 109 74 -243 191 277 -129
540 -129 -48 313 -134 -68 100 185 -150 -116 249 -65 -213 -47 213 -178 49 -51 -64 192 -39 -149 183 34
562 34 -8 85 -160 -110 143 186 33 -52 194 -32 -61 209 97 -190 -72 74 52 -178 27 -92 -38 58 41 -89
586 -89 3 143 -35 -58 119 -17 81 80 -29 219 112 -52 129 68 66 44 29 145 -118 88 9 -221 -209 29 -151
611 -151 -80 92 110 -108 -98 -22 41 94 8 44 135 -7 28 6 155 -25 81 -77 27 -65 151 -43 -32 -23 -128
636 -128 -177 -142 15 3 -129 -5 88 -23 11 119 7 -94 54 -114 -136 -2 -19 124 13 191 -42 -132 163
659 163 -50 42 86 -21 117 4 -85 -133 50 -138 -24 181 117 71 -78 -6 46 1 65 -108 -32 -90 134 89 187
$$ packed form
494h6J97K5j03j56K18kj35J11J30k42P6K99j45m68M26J95n11m6M02r5k31J90N7
517A06k91Q7J82k10k16L70Q0k82R7L27k53J13k00K48n0l7j65K03l5l17M34Q6m06
540a29Q1L61m47O6J68Q5l35L4L65l14j48J66K60l91K27j00j3K56k31j10L32j49
562C4m2R3k45N0K53M3j53q5K46k26k9K70j12k87J18J46k2k30K05j19N4R6j7j30
586h9R2J40j78k3J77j36R8jj09K48j07j64J81o1kk2j5J16k63K06p9k30J2K38j80
611a51P1J72J8k18J0P6O3N3q6L6R1j42L5k2J49j80J06j58J04r2K16j94J1Rj05
636a28m9L5J57j2j32J24R3j11L4J08j12j01J48j68k2J34j7J43j11J78k33r0K95
659A63k13R2M4j07J38j13q9m8J83j88J14K05o4m6j49P2N2m5O4j73P6n8K24m5R8
$$ plain form
684 187 -20 -5 119 82 -150 -227 -32 33 130 -98 -31 -10 -60 0 -36 -31 -57 -169 30 53 -42 22 36 97 101 71 121 -181
712 -181 128 -15 47 -60 -168 -60 -37 107 96 57 -30 -16 16 29 86 1 -20 147 71 -5 0 -100 -96 -84 -48 40 -36
739 -36 61 -155 65 -170 7 77 -70 34 21 -15 15 33 -40 106 78 -6 -176 -42 158 45 -62 207 -3 132
763 132 -94 136 1 -104 190 -21 86 67 -68 143 -45 -84 -102 96 -41 -108 -169 -100 6 -17 -20 -176 127
786 127 19 -121 -73 -244 -115 6 -29 -82 -9 -24 50 54 -166 -16 111 -97 -61 111 62 -85 96 -140 81 56
810 56 25 134 -171 85 -112 -77 -69 47 93 7 -59 -126 -13 -9 49 -107 -92 104 97 128 -126 -65 -113 -103 -2 -203 -27
837 -27 -95 5 -93 -12 70 -124 118 189 -33 -95 -65 73 -120 -163 151 -2 165 45 -28 19 21 2 6 -34 17 -63 -49
864 -49 -8 -151 3 -74 -55 90 -120 -84 -160 81 -107 46 79 15 -105 79 170 -69 -64 -206 83 166 85 -32 -182
$$ packed form
684A87k07J5J24l7k32p7J95O5R7k28O7K1n0O0l6Nk6j12J99K3r5O4J4O1Ml0N0l02
712a81L09j43O2j07j08J08K3J44j1l9q7J4L2J3N7q5k1J67p6p6Nj00MJ2L6Q8p6
739c6R7k16K20k35J77P0j47J04j3l6L0J8p3J46k8q4j70J34K00j13j07K69k10J35
763A32k26K30j35j05K94k11J07j9j35K11j88l9j8J98j37o7o1O9J06k3lj56L03
786A27j08j40M8j71J29J21l5n3P3j5P4Mk20J50J27k08L6J72m9j47J81k36K21k5
810E6l1J09l05K56j97L5QJ16M6q6o6o7J13MN8j56J5J96pL1k54O1m8J0J01k01J76
837b7o8J00r8Q1Q2j94K42P1k22o2L0J38j93m3L14j53J67j20p3M7Kj9Mm0N1q0J4
864d9M1j43J54p7J9J45k10L6p6K41j88J53L3o4j20J84R1k39Nj42K89Q3q1j17j50
$$ plain form
889 -182 -213 -91 103 -52 -53 40 -63 74 -46 220 81 69 -37 -40 28 -157 -37 -37 12 53 10 56 -48 -52 -36 77
915 77 -24 -125 -15 109 142 159 76 48 -53 42 -59 -46 82 107 -26 -142 92 208 -1 37 -15 62 -23 142
939 142 -103 -30 -49 -102 -78 -37 -25 -115 -122 10 22 -109 20 -33 -60 56 40 61 -282 -81 -37 194 -132 -79 162 -50
965 -50 -41 66 -81 16 85 -97 35 -11 -39 -5 47 16 -21 59 81 96 -116 124 -33 -91 -121 -158 -77 24 -202 87
991 87 63 -146 25 -30 24 -120 -31 164 -12 42 21 97 -20 91 84 -121 55 -17 140 83 -48 47 123 -61 -100
1016 -100 -8 4 69 49 25 219 -31 53 66 -25 9 72 -18 69 6 44 -178 45 -93 173 -79 -32 17 -92 153
1041 153 -42 89 26 -4 -145 -62 -48 54 -2 -38 88 84 79 8 -44 139 -140 -137 -184 -14 -50 111 92 -73 -47 32
1067 32 -34 47 59 61 -145 -47 -90 -42 71 -24 -10 23 -115 -66 61 77 124 20 85 -1 72 36 91 -18 7 3 -2 -36 -172
$$ packed form
889a82l1J22J94j55jR3j03J37j20K66j39j2j06lO8j85J20%M9M1m3M6j04mJ6J13
915G7j01j01J10J24L3J7q3k8j01R5j01J3J28K5j33j16K34J16k09L8n2P7q5J65
939A42k45P3j9n3K4M1J2r0pJ32J2j31J29n3k7J16j6K1l43K01M4K31l26N3K41k12
965e0RJ07j47R7O9j82J32m6k8L4N2l1l7Q0K2J5k12K40j57n8l0l7Q1J01k26K89
991H7k4k09J71n5N4j44Q9J95j76N4k1P6j17J11pk05J76p2J57n7j31R5P6j84l9
1016a00R2J2O5k0k4J94k50Q4J3r1L4O3r0Q7o3L8k22K23j38K66k52M7M9j09K45
1041A53j95J31o3l0j41Q3J4J02n6l6J26mnp1n2J83k79Lm7J70l6J61j9j65K6P9
1067C2o6Q1J2Kk06R8m3M8J13r5J4L3j38M9J27J6M7j04O5q6P3l6N5j09K5mnl4j36
$$ plain form
1096 -172 36 -35 -45 80 79 19 1 -93 93 -8 3 -93 -45 74 -11 -84 17 38 -27 18 50 79 5 125 -38 29
1122 29 -64 3 -95 -85 -39 26 -45 -48 33 -3 174 23 18 -127 18 30 209 27 27 -67 -38 -26 -6 -101 42 -68 33
1149 33 -176 -235 -79 -82 67 109 -89 77 92 4 32 -29 60 -68 10 42 26 -52 119 -43 -3 -73 -29 16 -15 -48 -29
1176 -29 -36 52 8 -23 -71 51 -62 31 82 -38 -55 -68 9 -70 2 16 -153 70 -78 3 29 -107 -161 77 -12 42 -1
1203 -1 151 12 13 -110 -88 18 -25 -55 -38 58 101 18 129 40 19 -58 -9 -86 5 35 -106 -126 -11 162 -13 19 -75
1230 -75 -31 -18 -109 -42 114 -44 -25 17 120 -48 -222 1 63 -2 66 -96 -266 -4 70 0 -19 -86 5 -108 -26
1255 -26 87 -101 -54 71 43 82 -14 1 62 -74 6 -13 36 132 25 141 138 -6 -66 136 -16 11 -29 -78 154 -50
1281 -50 57 -61 -130 -106 -128 -39 -27 -36 -11 -122 -171 63 25 -166 -46 26 75 99 -41 -58 -121 -68 26 -17 15 -33 101
$$ packed form
1096a72K08p1j0J25jo0j8r4J86j01J1r6M8J19q5p3J01K1o5M5L2K9p4J20j63O7
1122B9r3O7r8J0M6O5p1lQ1l6J77j51nj45J45J2J79j82%r4K9J2K0r5J43j10J01
1149C3k09n9J56lJ49M2j98J66J5q8K8o1Q9j28P8L2j6p8J71j62M0p0M4M5l1l3J9
1176b9pQ8m4l1m8J22j13R3N1j20j7j3P7p9P2J4j69K23j48Q1K6j36n4K38q9N4m3
1203aJ52j39Jj23K2J06m3l0J7R6M3q3J11q9k1p7M9p7R1L0j41k0J15J73j75L2r4
1230g5M4J3r1O7J56j58J9M2J03j68j74K23O2o5O8j62j70K62P4p0j9o7R1j13Q2
1255b6J13j88M7J25k8L9r6J5O1j36Q0j9M9R6j07J16lj44o0K02j52K7m0m9K32k04
1281e0J07j18o9K4k2Q9J2rK5j11m9K34l8j91J20P2M9K4j40j7o3N3R4m3L2m8J34
$$ plain form
1308 101 0 -59 -17 -57 50 -13 19 48 81 -43 64 13 -40 66 -111 -11 -1 -54 28 -137 20 -1 -8 54 -10 -61
1334 -61 -100 -92 -15 129 -75 -63 -81 -67 -37 -46 22 90 -6 -20 -145 94 -91 10 -57 -32 42 62 119 -33 -43 230 4
1361 4 -67 68 -180 89 52 56 -72 -82 -198 -71 -46 -166 7 -67 131 163 -27 -92 7 -218 35 -129 178 -4
1385 -4 42 100 121 -35 69 66 -144 -15 65 -84 -48 -55 -19 -57 -107 5 -48 18 97 -2 -3 -62 49 -14 -33 -28 -14 -176 -65
1414 -65 12 -41 -22 24 -60 -24 -147 -56 -68 -83 -15 -32 203 67 -257 6 -152 110 120 -23 -1 -80 160 -42 -81
1439 -81 -87 7 122 49 64 94 -6 -376 -4 -11 -14 53 62 154 -109 95 2 -86 -64 26 45 -52 -66 139 15 15 66 29 179
1468 179 -10 -13 -13 0 -55 -114 -81 -73 -110 -38 -15 -31 5 60 -47 109 104 -134 41 124 -64 49 -6 74 -49 49 -96
1495 -96 -87 -22 -32 47 -127 23 -59 -44 -150 -9 0 -80 133 -37 -96 214 79 -21 15 110 -153 58 58 -59 -1 -103
$$ packed form
1308A01j01n9M2m0J07o3L2K9L3j24J07n1n3J06j77J00J0n3Q2j65J57k1pO2o4n1
1334f1l9QP7J44k04J2j8J4L0rO8O8r6j4j25K39j85J01o7K5P4K0N7j52j0K73k26
1361Dp1J35k48K69l7Mj28j0j16J27K5j20J73p4J98L2j90o5R9k25K53j64L07j82
1385dM6N8K1j56J04lk10J29Q0j49L6pL6l8n0J12n3O6P9r9jn9J11o3j9NJ4j62J11
1414f5P7n3J9M6q4L6j23R1j2j5O8j7K35j36l24K63j58K62J0j43K2p9K40k02l9
1439h1oR4J15p3J5L0j00l70L72plO7RR2k63K04r3q8K2R0J9r7j4K05j24%N1l7J50
1468A79j89l%J3n5n9L3Ql7P2K3j6L6N5j07J56nk38J75Q3j88J13n5Q0j23R8j45
1495i6RO5j0P9j74J50q2J5j06J41Rq0K13j70n9L10j35j00L6R5k63K11%j17N8j02
$$ plain form
1521 -103 -74 156 6 2 -60 -137 -28 -16 3 -1 -64 -12 -74 -8 125 -46 7 20 -21 6 -54 -27 7 68 -34 -12 1 32
1549 32 -44 50 115 117 59 21 -70 91 -94 32 -93 48 11 72 -22 -106 -103 -124 -25 -33 -23 -31 -76 -79 21 11 84 218 -101
1578 -101 51 -1 -63 172 -4 13 31 85 39 -28 -47 -153 33 14 -50 -110 -2 24 78 26 176 -69 -44 -67 -14 71
1604 71 -76 33 -46 72 -16 54 65 10 -217 -62 36 -25 -185 82 -17 20 -110 -30 -77 -57 -62 -174 7 -51 -16 23
1630 23 -48 -191 107 -103 44 -73 107 -7 305 25 -84 122 216 13 69 -22 67 168 -7 74 -48 -10 23
1653 23 57 28 -83 -198 149 -40 44 18 6 -25 -47 -69 -45 57 124 63 -194 -215 -29 74 -101 -16 -22 97 198
1678 198 103 127 20 -10 29 106 -20 208 -39 -111 -67 18 55 -97 -24 -22 62 -116 -45 22 2 -1 77 119 -126 50 -132
1705 -132 -36 -52 -9 -60 24 15 37 94 2 31 -59 -114 -81 185 101 41 -39 -96 68 131 143 105 169 41 -25 -93 174 20
$$ packed form
1521a03K9K30j50mo2p7J09J2J9mo3N2o2O6J33j71N3J3m1K7o0K7L4O1j02K2J3L1
1549C2p6R4O5Kn8l8r1J61j85J26j25J41l7O1r4q4Lk1R9qJ0qm5lJ00j0P3J34l19
1578a01J52n2o2K35j76J7J8N4m6o7j9j06J86j9o4o0J08K6N4n2J50k45K5k3N3Q5
1604G1j47J09p9J18q8P0J1n5k27J55R8o1j60K67r9L7j30Q0m7K0nj12J81n8L5L9
1630B3p1j43K98k10J47j17J80j14L12k80j09K06R4k03N6r1Q9J01j75Q1j22L8L3
1653B3L4k9j11j15L47j89Q4k6j2l1k2k2K4J02O7o1k57k1J86J03j75Q5oJ19J01
1678A98r5K4j07l0L9P7j26K28k47p2M4Q5L7j52P3KQ4j78P1O7k0lP8M2k45J76j82
1705a32R6j6M3n1Q4rK2N7r2K9r0n5L3K66q4o0q0n7J64O3J2l8O4j28o6o8K67j54
$$ plain form
1733 20 28 -68 -70 95 -96 98 128 62 -101 108 -53 94 54 -23 -64 -51 66 113 130 43 163 48 68 -122 -64 -40
1759 -40 -61 -1 25 -12 134 210 60 -64 -1 103 -11 -148 -50 -79 75 5 -27 -2 -78 -42 -52 12 -27 101 52 -20
1785 -20 -4 2 -105 -125 19 54 22 67 -29 -65 39 -43 -50 26 -86 86 187 115 5 -249 109 -18 -13 27 0 1 28
1812 28 -7 -63 138 48 20 -1 91 -35 85 152 -37 27 -25 -18 -124 -95 -94 -38 -163 -135 -13 23 65 80 33 -81 -5
1839 -5 55 117 9 -19 60 65 45 -109 -110 1 135 -50 168 48 -109 5 -92 -4 -92 -62 68 21 10 38 -1 -140
1865 -140 24 -74 -69 -138 -149 104 78 -113 91 37 -87 25 -118 45 20 92 23 -34 -39 97 -26 -100 -80 55 25
1890 25 -136 95 67 -7 -54 108 131 139 -2 6 73 -112 81 -14 24 -33 21 -145 4 -25 -73 61 -184 -67 94
1915 94 -109 61 -49 38 -13 83 -16 -16 52 65 0 112 -20 109 -143 -81 124 -3 -34 -22 26 -40 -99 -72 89 27
$$ packed form
1733B0Qr6kJ65j91J94L0o6j63K09j61J47m0p7m1J3J17M7J7q7J20j15K0j90N8K4
1759d0k1O0K6l7J46P6j50j24O3J04j14j37R8k9J54p0l2K5p6L6j0O4l9J28m9p2
1785b0J6Oj07k0J44L5l2M5r6l6J04q2pP6j12J72J01p2j10k54L58j27NM0k7JK7
1812B8l5n6K01r0k8k1R2j26J20O7j89O4n2Pj06K9JN6j25K8J22L6M2J5m7j14P6
1839eO0O2j08k8P9Nk0j54jJ11J34j85K18j20j57J14r7Q8q8L0J30m7j1K8l9j39
1865a40J64r8No9j1K53k6j91K04n4j24J12j43J63k5P2o9n7nJ36j23p4K0J35l0
1890B5j61K31k8p4m7J62K3Qj41QO7j85J93r5L8n7N4j66J49k9m8J34k45J17J61
1915I4k03J70j10Q7n1R6r9%O8J3o5J12j32J29k52O2K05j27l1J2M8o6n9K7J61o2
$$ plain form
1941 27 -124 48 -52 -31 -2 -42 140 -108 180 -24 -12 116 30 104 62 -80 82 71 28 -183 -45 90 -156
1964 -156 -45 76 17 29 -92 -61 -136 48 -92 120 -41 -65 47 6 105 -14 7 197 122 -23 47 82 87 78 53
1989 53 46 -11 -20 162 -25 26 47 -71 -97 -84 26 -15 77 4 104 -26 -21 -72 -150 31 116 61 -72 32 71 68 26 -18
2017 -18 9 -140 -134 25 23 -39 -72 131 44 110 119 109 -19 37 36 38 92 100 91 100 -84 -69 48 -41 -8 29 -94 -101 -36 17 53
2048 53 -75 67 -136 -225 -80 59 -11 147 162 -83 -157 -86 1 -178 -77 99 -126 104 -71 26 -22 -28 -35 97
2072 97 164 -43 51 118 -27 64 -36 -38 -60 -77 -4 158 -172 104 1 28 -3 4 28 -93 -40 2 48 -19 70 -18 17
2099 17 26 59 48 -88 203 160 -50 131 69 -81 76 -77 49 114 151 68 106 -61 -57 97 106 -17 -79 -196 11
2124 11 166 44 -104 -9 106 -42 -17 46 -63 57 -119 -156 -209 57 -71 -52 -30 116 27 141 0 -111 113
$$ packed form
1941B7j51J72j00K1K9m0J82k48K88k04J2J28q6P4m2j42J62j1m3k11J38J35k46
1964a56J11J21n9J2j21L1p5J84j40K12j61k4J12m1R9j19K1J90p5j45P0L5Nrk5
1989E3pn7rJ82j87N1K1j18k6J3J10m1R2p3J00j30Nn1p8J81Q5n5j33J04L9lm2m4
2017a8K7j49OJ59ko2l3K03q7O6Rj0j28N6jKN4QrRj84J5J17q9L3L7j23pO5N3L6
2048E3j28J42k03q9J45J39p0J58J5k45p4P1Q7j79J01J76k25K30j75R7m8opJ32
2072I7O7k07R4O7j45R1j00kk2j7P3J62l30K76j03K7l1PK4j21N3M2M6o7Q9q8L5
2099A7RL3j1j36K91m3k10J81o2j50J57j53J26O5L7q3L8j67MJ54Rj23o2j17K07
2124A1J55j22j48R5J15j48K5O3j09J20j76l7n3K66j28J9K2J46q9J14j41j11K24
$$ plain form
2147 113 -30 -106 84 5 27 45 31 40 32 -2 161 11 186 46 42 81 294 -90 59 67 -132 155 -100 -88 27
2172 27 -5 -45 18 -76 -67 208 -11 55 -20 228 174 -64 -14 -108 -43 127 -76 301 -122 5 170 162 -91 -167 -37
2197 -37 -32 63 138 -48 -5 32 -119 102 -9 -20 -30 -228 102 141 -37 -54 2 83 -6 -31 -60 -76 15 46 -127 -152 55
2224 55 24 10 101 -51 42 12 -11 47 -72 79 2 20 17 -28 -128 29 173 -47 20 52 155 -85 -85 -120 -83 -28 10
2251 10 -87 102 161 -62 5 -25 -33 6 -7 27 -104 113 17 -78 -76 -21 -94 16 52 2 106 -2 10 176 -36 82
2277 82 -71 71 89 -7 112 -65 -88 -136 -67 -100 -88 -29 165 -240 9 30 -61 -98 -39 8 -119 13 -156 -59 -27
2302 -27 190 -44 -8 -62 -106 -121 -2 -77 -130 63 81 -84 -89 33 25 61 95 -118 59 97 -46 7 22 -63 88 -122
2328 -122 -59 -85 64 93 36 -81 -41 35 -22 23 58 99 30 42 -125 70 -46 -94 143 -57 -78 -95 -111 82 -30
$$ packed form
2147A13j43p6J90p9K2J8j4Rql4J63j50J75j40mL9K13l84J49Qj99K87k55J2J15
2172B7l2m0O3r4RK75k19O6p5K48n4k38N0r4O5J70k03L77m23J27J65qk53p6J30
2197c7NR5P5j86M3L7j51K21j11j1j0j98L30L9j78j7N6Q1q9k5k9j6R1L1j73k5K07
2224E5l1j4R1j52R3l0k3N8j19J51p7J8lm5j00J57J44k20O7L2J03k40%l5L7N5L8
2251A0r7J89N9k23O7l0qL9j3L4j31K17r6r5KN5p3J10L6n0J04j08J2J66k12J18
2277H2j53J42J8r6J19j77k3m8O9l3J2N9J94m05K49K1r1l7N9M7j27J32j69R7L2
2302b7K17k34L6n4m4j5J19p5n3J93J8j65nJ22qL6L4k13J77L8j43N3J5q5J51k10
2328a22O3k6J49K9n7j17M0P6n7M5L5M1o9J2j67J95j16m8K37k00k1j7j6J93j12
$$ plain form
2353 -30 231 -85 60 6 141 -102 24 49 -17 -5 70 20 10 177 -168 -148 -2 -100 37 21 -128 136 -51 109
2377 109 -52 -48 -21 -36 13 22 64 -182 -73 -136 15 159 -35 -62 12 -178 -32 -101 125 145 -88 43 101 29 -21
2402 -21 27 -11 55 66 -91 -94 24 -169 -197 2 198 -98 -11 117 -77 118 -55 -154 30 82 80 -63 55 19 82
2427 82 142 -21 -102 37 -16 -43 -43 72 33 168 -137 -33 -6 -126 67 10 26 -156 4 -169 200 -31 -16 174
2451 174 -55 -10 53 -32 -142 -86 -212 -39 28 81 -26 92 -104 41 -52 -74 -5 -138 -30 -27 -11 92 -97 47
2475 47 113 -85 -13 2 105 143 -63 62 -78 -10 -268 154 34 68 -110 107 308 45 22 -30 -51 -84 3 -9
2499 -9 -54 54 -44 25 50 72 3 -32 143 68 -89 -130 65 11 87 188 -49 222 2 -73 7 125 -98 -63 -89 85
2525 85 190 -69 142 -134 56 47 -102 -122 -51 -47 61 136 -30 -73 -137 -68 53 -10 -70 12 16 -47 -108 29 -72 22
$$ packed form
2353c0K61l16J45n4J35k43J26K5o6J2P5n0j0J67l45K0J46r8J37j6j49K64j87J60
2377A09j61MK7j5M9RM2k46J09o3J51J44j94k7P4j90J46o9K26K0k33J31N8p2n0
2402b1M8l8O6J1j57lJ18j93k8J99J96k96Q7J28j94J95j73r9J84N2kj43J18l6O3
2427H2O0j63q1J39n3k7%J15l9J35l05J04K7j20J93n7J6j82J60j73L69k31J5J90
2451A74k29M5O3q5j10N6j26J73O7N3j07J18j96J45r3k2O9j33J08LJ6J03j89J44
2475D7O6j98P2J5J03L8k06J25j40O8k58M22j20L4j78K17K01k63k3n2k1l3Q7j2
2499im5J08r8O9K5K2o9l5J75p5j57m1J95n4P6J01k37K71k20p5Q0J18k23L5k6J74
2525H5J05k59K11k76J90rj49k0P1MJ08P5j66m3o4O9J21o3o0Q2Mo3o1J37j01R4
$$ plain form
2551 22 56 139 22 -53 -57 37 -46 120 -13 9 143 23 -97 -55 94 30 -18 41 65 -10 -59 43 114 22 -21 21 3
2578 3 83 -66 20 200 82 14 -65 -17 -56 103 -112 -55 -19 47 11 -2 11 -40 139 233 -18 -108 -97 75 -85 18
2604 18 16 79 27 -129 -224 -67 74 2 66 -26 100 189 6 10 -97 -25 -27 116 -151 -185 -100 16 0 41 74 26 -77
2631 -77 -57 75 16 -51 160 -12 -81 -5 22 -52 -53 -87 -137 25 -48 -75 -180 -187 -109 -38 -7 36 43 -64 97 206 118 67
2659 67 54 -31 54 -103 73 -90 -22 88 -107 -81 -91 189 43 -193 24 -119 83 -4 48 151 13 17 24 -12 69
2684 69 84 4 86 71 -143 41 -70 -10 118 59 -12 72 64 26 -36 87 33 28 -128 -40 -96 -24 -46 11 -174 -34 -90
2711 -90 -146 131 15 -59 -259 -152 37 -10 -101 -60 -46 62 45 -118 93 116 -89 13 81 0 -51 70 22 -40 34
2736 34 -44 48 128 60 18 -15 -39 -16 -30 -37 16 -123 -67 -19 -116 71 -15 -49 -22 120 15 19 -17 -134 -103 -33 -28 74 -198
$$ packed form
2551B2L4Q3j17p5mR4q3J66j33K2J34j20j20M2J49o4m8N9K4p5m9J02P1r2m3M2j8
2578CQ0j49Q6J80j18o8p9M8l9J59k15N7L6O6l6j3J3n1J79R4k51r0J1J72j60J03
2604A8kO3n2j56r5J57J41p2O4r2J26Q9j83Mj07P2kJ43k67l4Q5J16j6M1L3m8j03
2631g7K0J32n9o7K11j72o9P6K7p4jl4n0J62p3k7j05pP8P1L1M3Pj07J61J09q8n1
2659F7j3q5Q5j57J76j63O8J10j95K6j0K80j46k36K17j43K02q7N2J03j38MPl6Q1
2684F9J5q0Q2j5k14J84j11O0J28n9p1Q4ql8o2J23n4nj56Q8n6P2k2N7j85J40n6
2711i0n6K77j16p4k00J07J89m7r1M1J4J08j7j63K11K3k05J02O8q1n1J21m8o2P4
2736C4p8R2Q0o8m2l3k4K3j4pN3j39N6M8r7J87q6l4K7J42j05Ml6j17L1P0NJ02k72
$$ plain form
2765 -198 -33 -172 -104 -7 77 37 -58 127 39 -85 -62 112 48 81 -80 -126 12 146 185 178 127 37 -65 115 -67
2790 -67 62 179 25 -59 -15 13 -69 -159 18 118 3 35 29 -188 -15 -75 -113 -92 8 59 67 -14 70 -13 -88 137
2816 137 -11 50 -125 -200 -101 -32 -14 25 16 -2 36 -13 -5 -72 -189 17 93 -86 -44 14 -26 35 66 108 25 97 34 -21
2844 -21 33 -58 -69 94 -65 88 3 71 202 -27 1 99 52 35 10 -33 72 -172 -92 152 -106 29 45 -11 -69
2869 -69 161 -3 37 90 137 -75 66 -59 -32 -9 -56 -93 -23 28 160 -42 -71 93 -128 147 -133 -12 53 74
2893 74 -35 62 -34 -23 -12 -54 27 98 -60 -20 85 -93 101 154 -40 11 35 -54 176 -149 56 -96 -3 90 11
2918 11 0 12 -71 -28 -241 -74 -85 -79 -49 -82 39 27 10 -26 -25 -129 69 -85 -35 148 114 -241 9 40 -34 -16 -116
2945 -116 -59 -69 -78 27 -56 -11 49 73 9 -23 86 -51 -15 -80 3 -101 -140 10 120 62 -26 -27 -90 -75 -22 73 29 -78
$$ packed form
2765a98J65j39O8R7Q4m0r5J85q8j24K3J74o4L3j61m6J38J34L9pn1r0j02J80j82
2790f7J29J17j54q4M4K8q2r0J77J00j15L2ok17J73o0l8K1J00N1Qq1Q4q3p5K25
2816A37j48O1j75p5R9O9J8L9rj8L8m9Qo7j17K06P6j79M2N8m0O1L1M2q3P2o3n5
2844b1N4r1j1J63j59J53q5O8J31k29K8R8m7j7k5m3J05k44Q0K44k58J35J6n6n8
2869f9K30j64M0N3M7k12J41j25K7K3m7l7P0N1J32k02k9J64k21K75k80J21O5K1
2893G4j09R7r6J1J1m2Q1P1j58M0J05j78J94N3j94N1K4q9K30l25K05j52R3R3p9
2918A1j1J2q3M3k13J67j1OL0l3J21j2j7l6Jj04J98j54N0J83l4l55K50L1p4J8j00
2945a16N7j0rJ05q3M5O0K4o4l2J09j37L6o5Q3j04l9J50J10n8q8jo3J5N3R5m4j07
$$ plain form
2973 -78 -11 -70 -71 -90 -124 58 -17 33 -48 -8 -36 -71 -40 -122 -61 78 -8 -135 60 -89 14 -12 -30 -28 32 14 -58 40
3001 40 58 44 92 118 -33 -105 98 -116 -110 -49 -55 -60 130 -12 -113 -20 -33 -41 127 -58 0 95 -107 -97 -9 93 -67
3028 -67 100 43 -83 71 -3 -228 66 62 79 34 157 48 139 -32 -51 -32 40 8 91 0 -93 16 -33 -20 -12 -62 250
3055 250 50 -116 -79 -9 114 13 -54 -9 5 -160 103 -113 10 -72 70 -94 -27 -98 41 194 68 135 192
3078 192 124 -61 13 -91 8 64 -31 -102 -117 50 -30 61 -87 13 0 -113 15 9 -20 90 110 -181 -65 75 89
3103 89 -24 19 1 -137 57 126 -153 -76 -86 9 -156 -91 115 84 42 -22 99 81 -22 6 -68 -141 -196 86 42 45
3129 45 30 66 9 -83 -212 27 32 27 -50 -18 -107 -206 170 -8 -44 38 47 -42 -18 -18 16 18 -50 25 -14 27 21 137 53 -85
3159 -85 113 -44 -61 -49 -66 18 -5 44 -21 -135 69 36 -62 26 117 185 -34 -129 -60 51 6 -41 46 -31 145 -92
$$ packed form
2973g8O7n9jj9l4J82p5N0q1M0k8l5L1q2O1J39q6j27J95j49J03k6j8KO0j8p2R8
3001D0J8j4M8K6j51p2K03k14OO1onJ90j42j01R3j3qJ68j85N8R5k02J0Q8J02j60
3028f7J67n7j26J54p4k25K94mJ7m5J23j09R1j71j9J9P2l2Q3r1r3J09m9J3Qn0L12
3055B50k00j66L7P0J23j01o7M5J4j65K63k16J23q2J42j64O7p1J39J53j26O7N7
3078A92o8j85P4j04R9N6r5p1j5J67q0R1j48J00j3j13J28ok9J10K0k91J16J40J4
3103H9j13M3j8j38J94O9k79P7j0R5j65O5K06l1m2o4J21j8j03K8p4p3n5K82m4L
3129D5j5L6n7r2j29K39Nnp7L2q9r9L76j78l6Q2Rq9K4%L4Ko8P5l9M1oJ16q4j38
3159h5J98j57j7J2j7Q4k3M9o5j14K04l3r8Q8R1O8k19r5O9J11m5m7Q7p7J76k37
$$ plain form
3185 -92 -54 -43 154 33 -3 -76 -84 -15 -163 95 75 -127 -55 -183 -81 -91 113 -23 -21 -150 10 116 -109 -31 5
3210 5 30 -90 -7 -55 75 176 -32 -87 -68 -59 132 68 3 -30 109 221 -164 -32 83 -92 116 -31 10 -129
3234 -129 -9 -84 -142 -111 -40 55 -161 29 205 44 -17 9 147 102 50 -110 -1 -60 64 143 -185 117 41 78
3258 78 -4 83 -20 182 -48 76 1 19 32 58 71 -70 -71 116 64 110 -33 -75 -24 23 23 110 16 -72 -36 44 7 -16
3286 -16 94 -151 0 -307 43 43 -42 -43 -81 -30 106 2 -21 -59 74 158 28 -55 -55 23 -61 40 62 95 -225 -56
3312 -56 124 -51 122 140 -58 74 44 37 -115 72 -5 -34 -69 -166 -56 10 118 19 -47 71 -21 49 81 -27 -30 -4
3338 -4 121 88 231 19 33 21 25 -97 3 25 47 95 85 -53 -18 36 -104 50 -23 -131 15 157 11 69 24
3363 24 72 39 -80 -122 -41 -125 -40 -178 78 -156 -65 26 59 62 19 63 -6 103 7 89 -75 -138 -125 24 62 -101 -33
$$ packed form
3185i2L8J1J97j21l6p3qO9j48K58k0k02P2j28J02j0K04j36Kj29J60J06k25P8L6
3210EK5j20Q3m8J30J01k08n5J9RJ91o4o5l3J39J12l85J32J15j75K08j47M1j39
3234a29J20p5n8L1P1R5k16J90J76j61o1K6J38m5n2j60J09n9J24P9l28L02p6L7
3258G8q2Q7j03K02k30J24p5J8J3K6J3j41jJ87n2M6j43m2N1M7%Q7r4q8L6Q0l7k3
3286a6J10k45J51l07L50%q5jl8N1J36j04k3l8J33Q4j30q3%P8q4J01K2L3l20J69
3312e6J80j75J73J8j98J32l0pj52J87p7k9l5r7J10O6J08r9o6J18r2P0L2j08lK6
3338dJ25l3J43k12J4j2Mj22J00K2K2M8j0j38L5N4j40J54p3j08J46J42j46N8m5
3363B4M8l3j19m2Q1q4Q5j38K56k34R1R1L3Lm3M4o9J09r6Q2j64o3J3J49L8j63O8
$$ plain form
3390 -33 13 85 93 -160 5 -50 46 62 -229 -113 -27 -106 152 -43 -4 -53 -9 -68 32 -60 -22 14 53 52 -41 120 -160
3417 -160 57 28 27 -38 -2 -134 51 184 -20 12 -4 -38 54 112 -11 3 40 -91 105 -127 -11 -5 -126 -34 -53
3442 -53 -106 -59 42 26 -198 -43 87 -101 -28 -58 -88 35 93 32 130 -95 37 -67 65 1 99 86 84 -105 25
3467 25 -35 109 92 -54 49 -31 -62 0 -129 -8 -144 -16 118 115 -86 22 -10 -52 -22 -44 -84 -1 148 -100 -166
3492 -166 -3 13 71 -74 136 101 48 -187 39 -74 -87 -5 -58 -44 -66 -189 -8 -19 -98 -84 -36 38 -117 -35 -170
3517 -170 49 68 -20 -173 37 -56 -61 23 55 145 16 14 94 -20 -115 36 -34 38 72 -81 -81 9 -19 24 -78 53 86
3544 86 -98 105 281 155 91 82 44 -35 -99 49 -110 -137 -2 124 -40 -91 27 2 10 -47 -17 258 -87 -68 -5
3569 -5 -123 -123 -78 114 -62 -83 -1 -132 -88 165 95 28 -90 101 42 -105 67 147 -74 -27 55 38 -43 20 80 -121
$$ packed form
3390c3M6P2Qk53J65n5R6J6k91J16Q6p9K58j95L9m9M4n9J00r2L8L6L9jr3J61k80
3417a60K17k9jo5L6j32J85J33k04L2j6l4R2N8j23J4L7j31J96k32J16Oj21R2j9
3442e3n3M7J01j6k24J55J30j88P3l0l0J23N8o1R8k25J32j04J32o4R8j3kj89J30
3467B5o0J44j7j46J03q0l1O2j29J21j36J28J34lk01J08l2m2L0k2m0Q3J49k48o6
3492a66J63J6N8j45K10l5n3k35K26j13j3Q2n3J4k2j23J81j1p9J4M8P4j55Q2j35
3517a70K19J9q8j53K10r3nQ4L2R0j29kQ0j14r5J51p0P2L4j53%R0k8M3j02J31L3
3544H6j84K03J76j26o4rl8p9o4J48j59k7J35J26j64n1J18k5Qn7L0K75l45J9O3
3569ej18%M5J92j76k1Q2j31M4K53p0o7j18J91n9j47J72Q0k21M7Q2j7q1O3O0k01
$$ plain form
3595 -121 -141 3 -30 92 132 -173 -117 -16 68 -206 -57 -26 -136 -170 80 -28 -44 -14 79 -152 -4 11 -45 -98
3619 -98 55 93 93 100 -110 120 105 106 -11 157 85 112 -106 95 -41 7 -82 -7 35 -21 40 -33 77 -75 42 76
3645 76 -16 -103 -13 -36 121 56 -63 123 163 97 72 -33 8 -64 13 -14 -35 -113 -89 -18 -6 14 -53 -119 85 42 -14 -73
3673 -73 37 41 20 186 77 122 -168 63 77 79 93 -140 82 117 -6 80 29 -16 104 149 71 -49 -44 -4 -65 141
3699 141 92 22 19 95 -4 -130 -88 146 91 60 -12 121 8 -23 -94 95 110 200 -57 -173 60 -154 114 -182 -52
3724 -52 41 -30 33 65 69 -30 -223 -170 18 -83 46 -20 -14 -109 -38 -151 -31 -98 -13 -94 -106 2 -42 -35 168 -88 -6
3751 -6 -66 27 -27 -103 -70 54 3 -12 65 -9 -8 173 -147 -23 9 -32 -141 -57 8 9 -25 79 31 -81 -18 -77 23 -105
3779 -105 -43 103 -74 103 -62 -78 -80 -13 -23 22 36 139 -48 -26 18 -106 -173 -149 -69 60 38 107 61 94 -26 25
$$ packed form
3595a21k0J44l3J22M0l05N6J01Q4k74J49L1j10l4K50j08j6L0R3k31J48J5n6n3
3619i8J53L8%Pk10K30j5Jj17J68p2K7k18K01j36M8q9P5M2n6O1p3J10j52J17L4
3645G6r2q7R0k3J57o5j19J86M0o6k5j05M1p2P7k7k1p8K4P1J2K0o7o6K04m3n6n9
3673g3J10Mk1J66j09M5k90K31J4KJ4k33K22L5j23Q6n1m5J20M5p8j20NM0o1K06
3699A41m9p0lP6r9j26M2K34n5l1p2J33j13l1p1J89J5R0k57j16K33k14K68k96J30
3724e2R3p1O3L2Mr9j93N3J88j01J29o6Or5P1j13J20o7Q5q1j2J08m4PK03k56Q2
3751fo0R3n4p6L3J24n1j5P7p4JJ81l20J24L2m1j09Q4O5Jl4J04m8j12O3n9J00j28
3779a05O2J46j77J77j65j6kO7j0M5J4J03j87K2M4j24o7K4Q0J29k2O9m6L3j20N1
$$ plain form
3805 25 -30 33 -53 27 32 98 -159 -144 32 58 42 117 -72 -150 112 -102 48 5 42 -57 -44 79 66 91 -25 -147
3831 -147 79 -6 28 -121 64 1 -160 1 -62 -73 182 80 11 25 -84 -40 -54 44 11 -10 -114 -35 -10 100 -92
3856 -92 -6 -48 -29 -53 32 -68 84 118 -54 37 30 35 -49 134 9 -71 -151 90 -45 50 86 -2 38 -71 -61 68 182
3883 182 46 35 6 -83 44 -46 41 -49 65 111 9 59 -127 -80 18 -50 -112 62 -148 36 -41 -2 -20 53 36 -31
3909 -31 48 -63 8 -36 2 45 -78 -141 159 -36 65 91 -20 -62 -70 -17 131 106 33 12 73 70 -29 -172 -115 88 -112
3936 -112 177 59 48 -50 74 77 -11 -59 -54 -58 107 19 134 51 -122 79 -168 116 42 -72 52 -30 -63 27 52 67
3962 67 4 -83 59 -42 -79 89 -10 -118 51 133 -14 -104 108 -23 -94 28 -70 -53 0 129 20 -6 45 66 74
3987 74 -121 -12 74 -14 17 52 -120 -182 64 171 -138 -126 -121 81 -83 79 -168 76 -9 68 49 -13 18 25 95 -75
$$ packed form
3805B5n5O3q6Q0NO6k57J5J76K6j6P5j89p8K62k14J50m3L7r9J3J23j3K5j16j22
3831a47K26q5L4j49J85o3j61J61o3j1K55j02o9J4j09M4j4R8l3k1j04P9K5J10j92
3856i2Q6m2J9k4Q5j00J52L4j72R1pNq4J83j25q0q0K41j35R5L6q8M0j09J0J29J14
3883A82j36j1k9q9J27r0Q7r0J14M6j02N0j86M7R8o8o2J74k10J84p7L9j8P3j7o7
3909c1P9j11P1m4L8M3j23o3L00j95J01K6j11m2qN3J48k5p3k1O1lr9j43N7K03k00
3936a12K89j18j1r8J24Lq8m8NmJ65q8J15q3j73K01k47K84p4j14J24q2l3R0K5J5
3962F7o3q7J42j01l7J68r9j08J69Q2j47r0K12j31p1J22r8J7N3J29j09k6N1K1Q
3987G4j95J09Q6q8L1L5j72o2K46J07l09J2NK02j64J62k47K44q5P7j9o2L1PP0j70
$$ plain form
4013 -75 -67 144 147 -19 87 -104 -160 4 33 -72 -121 68 80 -131 -35 -32 -168 11 4 34 67 -102 -52 190 62 -122
4039 -122 -97 40 -70 55 219 -35 -1 -28 81 -64 37 25 78 36 -43 -32 113 -67 264 88 96 64 -66 57
4063 57 70 15 77 5 -53 -1 11 -64 -45 192 -37 49 38 -8 -36 22 41 79 -69 -149 -68 65 -2 39 -59 76 3 5
4091 5 114 97 -234 11 129 97 -71 20 -94 61 21 -23 -79 -32 8 75 27 -58 -94 -51 -85 5 142 -13 -115 -53
4117 -53 122 -87 46 110 38 88 -129 -13 164 10 48 -125 -105 -11 -42 -56 87 17 77 -194 24 95 103 2 -100
4142 -100 44 64 -115 143 52 -12 30 -42 120 -186 6 -22 -29 -60 78 -84 42 69 127 -215 -65 36 102 69
4166 69 155 11 38 76 141 112 -79 139 79 20 -29 6 -73 -32 23 152 4 -59 -16 -60 -118 80 -7 178 176 -71 -156
4193 -156 6 15 17 -10 79 -19 57 -1 -69 19 8 -24 -27 89 29 -104 9 -64 68 15 -110 -20 20 -28 15 176 -38
$$ packed form
4013g5QK11Lj66J06j91n6J64K9j05m9J89J2k11R6Lj36J79pL0L3j69N0K42j28j84
4039a22K5J37j10J25J64k54L4k7J09j45J01j2N3m2p9J1J45j80L31j76Ql2j30J23
4063E7J3n5O2p2n8N2J2p5J9K37k29Q6j1m6k8N8J9L8j48q0Q1J33o7M1r8J35p3K
4091EJ09j7l31K45J18l2j68R1j14J55m0m4n6M7M0O7m8q5l6M3l4R0J37j55j02O2
4117e3J75k09J33O4p2N0k17J16J77j54L8j73K0R4l1j4J43p0O0k71K18P1Qj01j02
4142a00J44K0j79K58r1o4M2p2J62l06J92k8pl1J38j62J26K7N8l42J50J01O6l3
4166F9Q6j44K7L8O5k9j91K18o0n9m9L5p9M1N5J29j48o3M3m4n8J98q7J85kk47q5
4193a56J62RKk7Q9r8P6n8o8Q8j1l2lJ16o0j33J13p3J32n3j25R0M0m8M3J61k14
$$ plain form
4220 -38 -58 98 35 -2 71 62 33 -149 -22 -124 65 113 -61 -22 -93 152 73 -15 74 117 46 -100 -97 -78 49 28 66
4247 66 92 53 -60 42 -1 86 -25 75 -39 28 39 -58 12 30 51 -2 -1 12 -6 -21 -33 41 79 91 -34 65 -85
4274 -85 233 31 90 -45 18 309 53 178 -26 -18 -152 -262 69 -96 31 71 -27 -30 -59 17 -146 52 73 -44
4298 -44 -69 41 -58 -90 -9 -153 52 -5 85 -32 74 -30 34 80 55 -52 127 -122 -36 -16 2 -116 -109 36 -44
4323 -44 -19 9 -5 -111 -119 -84 -43 68 -102 -143 -71 51 33 -121 -82 93 18 -59 156 -49 64 -7 3 87 -27 -2
4349 -2 16 -26 15 -11 208 -44 130 -10 44 80 145 0 -19 -4 119 79 -139 59 157 138 -174 40 29 -52 -9 62
4375 62 -69 -10 -67 -96 -122 49 -31 -95 25 -137 8 -86 -11 50 -12 127 -193 47 -13 -115 -27 45 22 56 -20 119
4401 119 38 99 72 -23 50 36 -124 -17 118 -42 -48 35 151 -21 11 86 46 -42 57 105 119 -31 30 69 61 -112 74
$$ packed form
4220c8k0J56o3l7P3rk9j82J27j02J89M8j74L9p1K45p9q8Q9M3p1j46LJ9J27k1L8
4247F6K6l9j13J02m3Q7j11J00j14O7J1r7P0J8K1n3JJ3j8j5j2P4L8J2j25R9j50
4274h5L18k02N9j35O3K91k56J25k04Qj34j10L31j65J27M0r8lk9P6j63J98K1j17
4298d4k5J10r9l2Q1j44K05n7R0j17J06j04O4M6k5j07J79k49Q6K0J8j18PJ45q0
4323d4K5K8j4j06qL5M1J11j70m1P2J22j8j54L9J75p5p7K15k05J13p1J0Q4j14K5
4349bJ8m2M1k6K19k52J74j40N4L6O5j45j9J5J23m0k18J98R8j9l12K14j1q1M3P1
4375F2j31N9n7k9k6J71q0o4J20j62J45r4P5O1o2J39l20K40o0j02Q8P2k3L4p6J39
4401A19q1O1k7r5P3j4j60J07J35j60oQ3J16j72L2P5m0q8R9M8J4j50O1L9qj73J86
$$ plain form
4428 74 -26 -91 -65 -5 34 62 106 12 132 52 -88 31 -148 -230 91 72 -70 2 -25 -26 176 -20 56 138 -81 46
4454 46 10 -130 -102 21 19 74 98 -11 45 4 58 -155 -22 -50 -66 146 -34 45 12 -123 147 37 102 -1 -12
4479 -12 67 80 70 -43 -5 72 -13 22 7 70 28 -132 -122 -27 -49 -69 0 -8 83 23 62 -1 42 56 39 11 -45 -15 101
4508 101 -209 -42 58 81 -33 -7 -92 -16 12 60 -12 30 -176 23 38 25 127 -44 6 155 -5 22 9 -49 -5
4533 -5 -70 120 -65 127 48 30 17 -7 -61 14 -48 -79 56 -25 -96 -36 11 -143 -7 -137 -65 -12 -71 -23 -27 178 52
4560 52 -167 -215 -18 32 7 13 1 33 46 -122 90 -85 -91 49 -95 27 170 -103 -95 247 -36 -7 -26 -79 -77 99
4586 99 -30 5 82 -2 -50 82 -24 12 -152 18 -28 -25 -77 -72 117 85 -15 -7 85 26 -61 -112 112 24 72 39 10 -25
4614 -25 -51 -121 28 -21 -41 157 -40 -20 9 40 -95 -41 22 -125 38 170 10 -73 100 42 -27 -2 83 -95 -91 157
$$ packed form
4428G4j00o5K6O0L9K8M4r4J20q0j40J19j79q2L21j9j42P2k7jK02j96P6Q2k19J27
4454D6l6j40K8J23kN5K4j09N6m1N4k13J33k8j6K12j80P9l3j35K70j10O5j03j1
4479a2P9J3j0j13L8P7q5L5j5O3m2j60J0R5k2k0O9qR1o0L9o3M3J4j7k8n6L0J16
4508A01l10J67J00K3j14K6q5P6K8M8p2M2k06J99J5j3J02j71N0J49j60K7j3n8M4
4533eo5J90j85J92p9j8j3k4n4P5o2l1J35q1p1O0M7j54J36j30P2N3n9M8mK05j26
4560E2k19m8J97N0k5Oj2L2J3j68K12j75oJ40j44J22J43k73QL42k83K9j9n3KJ76
4586I9j29L5P7q4m8J32j06L6j64J70m6Ln2NJ89l2j00QR2n9q7n1K24q8M8l3k9l5
4614b5k6p0J49m9k0J98j97K0K9L1j35N4O3j47J63J32j60q3J73n8o9K5Q5j78MK48
$$ plain form
4640 157 -4 -79 165 147 -25 33 79 -25 -71 -22 52 -65 4 11 61 -16 84 2 -101 -94 -98 45 52 68 50 -79 -30
4667 -30 -94 -163 -46 99 -160 -31 -30 -28 36 102 7 -162 9 -197 -34 -64 -95 82 -9 -29 -216 40 94 14 163
4692 163 -24 -79 -25 -46 -12 47 -67 59 -90 56 -154 27 -1 -55 -22 7 -58 -63 -23 168 -46 -77 109 -113 126
4717 126 -16 4 -26 54 36 61 -16 -21 40 -12 8 113 146 34 5 81 29 83 -48 31 73 -87 93 -123 -95 -57 -23
4744 -23 -25 55 -119 4 -42 69 -39 112 74 -44 6 2 36 159 -30 4 27 -41 120 80 -57 -7 10 -18 7 118
4770 118 -173 24 35 48 -32 -40 -15 270 68 -139 -200 -132 36 -50 33 -93 -48 -125 99 23 -5 -158 52 -68 61
4795 61 -10 13 53 46 -109 74 -110 -51 109 -188 -49 44 64 -123 -29 64 -61 -26 149 -32 -51 136 54 -36 -21
4820 -21 31 -26 -174 16 -36 -86 -36 15 -15 -96 101 57 81 50 20 56 23 116 110 16 45 99 -72 -87 -71 77 128 46
$$ packed form
4640A57j61p5K44j8j72N8M6j04m6M9P4j17O9PN0p7J00q2j03PmJ43PJ6j8j29M9
4667c0o4o9J17J45k59J29JKO4O6r5j69J71k06J63l0l1J77r1k0j87K56N4q0J49
4692A63j87n5N4k1L4N9j14J26j49J46k10J81k8n4L3K9o5nM0J91k14l1J86k22K39
4717A26j42K0l0Q0j8K5p7nO1n2K0J05L3j12k9P6n2N4j31P9M2j60J80k16K8L8L4
4744b3kQ0j74J23m6J11j08J51l8j18N0mL4J23j89L4K3o8J61m0j37N0J7k8K5J11
4770A18k91J97J1J3q0qK5K85k02k07o1O8J68q6Q3j26M5p7K24p6k8j53K10j20J29
4795F1p1K3M0pj55J83j84N9J60k97J39R3K0j87R4R3j25L5J75j81j9J87q2r0J5
4820b1N2n7j48J90n2n0N0N1l0q1J97m4K4l1l0L6l3R3or4K9N4j71j5J6J48N1q2
$$ plain form
4848 46 45 2 215 63 -134 107 60 54 -10 -53 -72 -112 5 144 -24 -52 -29 -52 -69 52 22 54 -87 -76 204 45
4874 45 -97 22 -42 -116 -69 147 -49 -80 -18 -99 -146 -21 -45 -99 -189 -34 32 -74 12 -31 88 -27 102 86 32
4899 32 138 -212 -181 -67 -113 -123 -17 177 -110 92 -254 -109 28 -113 43 -138 -87 -40 3 -36 -34 -118 -83 -61
4923 -61 185 7 17 -4 -73 273 66 59 65 -169 -53 -108 -14 -44 72 41 -25 167 5 173 -20 -133 -12 -26 53
4948 53 -44 -33 9 19 -25 -105 -156 -107 -159 50 112 66 29 0 -35 -39 -5 117 28 -41 25 -79 221 30 38 -141 -58 29
4976 29 -36 -2 -19 159 28 -2 46 88 -13 -67 183 -110 -113 66 -151 79 27 50 7 -180 -177 17 -73 -54 173 -36
5002 -36 9 -94 104 1 -11 5 46 -77 -31 -202 87 -64 126 -103 20 79 12 -75 -78 -14 36 35 39 11 22 -9 71
5029 71 219 -43 -109 29 -33 17 -55 5 -21 141 47 84 7 -22 -84 -85 21 -62 -27 -19 66 53 -22 152 -114 169 141
$$ packed form
4848D6jm3K13j52j97K41m7oo4m3j9m0J17J39j68k8K3k3j7J21l0L2j41J1K80j59
4874D5j42J19o4p4M7K16j96l1O2q1m7J25k4n4r0J55O6j06Q6m3J19j15J29j6n4
4899C2J06l50L1J14m6j0J06J94k87K02l46J45J37j41J56j81N1M7M3l9Kq4L5K2
4923f1K46j78J0k1o9L46k07pOk34J16n5R4l0J16l1o6J92j62J68j93j13J21j4P9
4948E3r7J1M2J0m4q0n1M9n2K09O2m6l7k9l5mL4J22q9o9O6j04L00j91Qj79Q3Q7
4976B9o5L4j7J78j31l0M8M2j01n4K50k93lJ79k17K30n2K3m3j87LJ94r0J9K27k09
5002c6M5j03J98j03j2J6M1j23M6j71K89j51J90k29J23N9o7q7lO4N0jMk8J1l1Q0
5029G1J48k62o6J38o2N0p2O0k6J62r4L7p7k9o2jJ06q3L5QQ5j3p5J74k66K83k8
$$ plain form
5056 141 -37 108 20 79 -135 157 18 142 -53 136 -85 -103 -183 -35 54 26 207 -102 79 -70 -23 117
5078 117 -15 -80 161 -10 161 44 164 83 51 8 -17 -109 47 39 -272 62 69 46 -121 54 24 -75 -67 123 -95
5103 -95 -91 -26 -207 -121 -140 14 77 -65 -8 112 57 -35 -159 134 139 -23 111 153 96 -202 120 -57 -125 12 33
5128 33 108 35 -44 -69 -76 136 98 116 -83 -88 17 -161 -6 252 -16 32 141 47 -21 44 74 29 -114 55 70 -120
5154 -120 -68 -191 13 -43 -57 63 178 74 62 -220 39 -86 -116 -66 34 -165 -169 4 -65 112 -67 2 32 72
5178 72 -116 -1 -1 -12 -50 61 154 111 72 -11 96 57 47 -122 249 -125 -59 -47 -38 122 -34 -56 110 25 -59 51
5204 51 33 -151 65 36 -67 -8 100 -5 -32 -10 120 -20 16 25 -63 31 63 -56 -108 -60 -146 37 -113 -50 -17 43
5230 43 56 8 -17 -9 6 6 -50 -54 117 25 -53 60 -68 101 -87 19 4 -150 -109 84 6 -30 170 -90 -1 7 -10
$$ packed form
5056A41j78J45q8N9k14K92j39J24j95J89k21j8q0J48Q9k8J81l09J81j49M7J40
5078A17j32o5K41j71J71j17J20q1l2m3k5r2J56ql11L34Pk3j67J75l0r9QJ90k18
5103i5MO5j81Q6j9J54O3j42N7J20n5r2j24K93Nj62J34M2n7k98L22j77o8J37K1
5128C3P5p3p9k5pK12l8J8j99nJ05j78J55K58k68M8J09r4o8O5L0m5j43J69J5j90
5154a20N2j23K04n6j4J20J15j04j2k82K59j25l0N0J00j99mJ73o9J77j79O9L0M0
5178G2j88J15%j1l8J11R3m3l9q3J07l9j0j69L71l74O6J2RJ60j56k2J66q5q4J10
5204E1j8j84K16k9j03N9J08j05k7K2J30j40L6Rq8R4L2j19n2M8q6J83j50O3L3O0
5230D3J3m8k5QJ5%n6mJ71r2p8J13j28J69j88J06j5j54M1J93p8l6K00k60Q9Qj7
$$ plain form
5257 -10 2 130 67 -88 -111 15 -9 204 -32 105 -73 4 -38 10 19 177 131 53 7 135 -109 52 49 -53 -68
5282 -68 -4 -44 19 -5 86 12 80 -83 -67 0 -59 5 35 36 16 -42 85 -143 -57 33 -72 84 38 -30 -194 6 -24
5309 -24 79 -77 48 -14 126 24 96 70 8 120 0 -51 68 106 105 31 247 -8 38 -20 -43 107 -38 -149
5333 -149 33 -95 0 -21 89 46 -18 -201 -113 14 -94 -85 -19 -58 -5 48 -111 -9 -45 43 -59 207 -10 -51 109
5358 109 59 76 60 -29 3 -14 -69 20 48 -74 19 -30 -118 10 42 -156 43 -68 -62 -17 -15 45 12 29 125 131 -49 -153
5386 -153 -34 -1 -42 -97 3 31 -81 -54 54 -2 95 86 -269 128 131 -75 69 167 290 51 84 49 -53 -62 31 -106
$$ packed form
5257a0J2J28o3j55k3J26k4K13k36J37j78P7m2M8RJ58m6p8m6J28k44J61lj02j5
5282f8O4m0O3k4R1p4O8j63J6O7n9O4L0Jk0n8J27k28Q6R0j05J56m6o8j64K00l0
5309b4J03j56J25o2J40j02P2k6o2J12j20n1J19L8jp4K16k55M6n8k3J50j45j11
5333a49J82j28R5k1J10m3o4j83Q8J27j08RO6l9N3N3j59J02l6Q8j02K66k17m1J60
5358A09n0J7j6q9L2j7n5Q9K8j22R3m9q8J28L2j98J99j11OM5KO0l3J7R6Oj80j04
5386a53J19L3m1n5J00K8j12K7J08n6R7rl55L97Lk06J44R8J23k39L3l5j02rR3j37
$$ [...]
8191A5
##END NTUPLES=NMR FID
##END=
