##TITLE=1H_SR1516_rm
 CDCl3, 8 sc, 
 7.8.2020
##JCAMPDX= 6.0         $$ Bruker NMR JCAMP-DX V2.0
##DATA TYPE= NMR FID
##DATA CLASS= NTUPLES
##ORIGIN= UXNMR, Bruker Analytische Messtechnik GmbH
##OWNER= root
$$ XWIN-NMR		Version 3.5
$$ Fri Aug  7 10:36:39 2020 Russian Standard Time (UT+4h)  she@DPX200
##.OBSERVE FREQUENCY= 200.1314999998
##.OBSERVE NUCLEUS= ^1H
##.DELAY= (6, 6)
##.ACQUISITION MODE= SIMULTANEOUS
##.ACQUISITION SCHEME= undefined
##.AVERAGES= 8
##.DIGITISER RES= 18
##SPECTROMETER/DATA SYSTEM= spect
##.PULSE SEQUENCE= zg30
##.SOLVENT NAME= D2O
##.SHIFT REFERENCE= (INTERNAL, D2O, 0, 15.7039)
##AUDIT TRAIL= $$ (NUMBER, WHEN, WHO, WHERE, WHAT)
$$ ##TITLE= Audit trail, XWIN-NMR		Version 3.5
$$ ##JCAMPDX= 5.01
$$ ##ORIGIN= Bruker BioSpin GmbH
$$ ##OWNER= she
$$ F:/spectra/data/she/nmr/H-F/1/audita.txt
$$ ##AUDIT TRAIL=  $$ (NUMBER, WHEN, WHO, WHERE, WHAT)
(   1,<2020-08-07 10:35:15.67 +0400>,<she>,<DPX200>,
      <created by zg, POWCHK disabled, PULCHK disabled
       configuration hash MD5:
       00 E9 B6 7A A2 85 ED C7 34 08 36 98 17 FE 4E 26
       data hash MD5: 16K
       B9 A2 9E 65 2C 6B D2 33 F5 4A 7F 2A A0 53 E9 87>)
$$ ##END=
$$ 
$$ hash MD5
$$ 46 C1 B9 8E 76 DD A8 F3 93 F4 91 AE B2 FF 20 B0
##$RELAX= 
##$RELAX= 
##$RELAX= 
##$RELAX= 
##$RELAX= 
##$RELAX= 
$$ Bruker specific parameters
$$ --------------------------
##$DU= <F:/spectra>
##$EXPNO= 1
##$NAME= <H-F>
##$PROCNO= 1
##$TYPE= <nmr>
##$USER= <she>
##$AMP= (0..31)
100 100 100 100 100 100 100 100 100 100 100 100 100 100 100 100 100 100 
100 100 100 100 100 100 100 100 100 100 100 100 100 100 
##$AQSEQ= 0
##$AQ_mod= 1
##$AUNM= <au_zg>
##$AUTOPOS= <>
##$BF1= 200.13
##$BF2= 200.13
##$BF3= 200.13
##$BF4= 200.13
##$BF5= 200.13
##$BF6= 200.13
##$BF7= 200.13
##$BF8= 200.13
##$BYTORDA= 1
##$CFDGTYP= 0
##$CFRGTYP= 5
##$CHEMSTR= <none>
##$CNST= (0..31)
1 1 145 1 1 1 1 1 1 1 1 1 1 1 1 1 1 1 1 1 1 1 1 1 1 1 1 1 1 1 1 1 
##$CPDPRG= <>
##$CPDPRG1= <>
##$CPDPRG2= <>
##$CPDPRG3= <>
##$CPDPRG4= <mlev>
##$CPDPRG5= <mlev>
##$CPDPRG6= <mlev>
##$CPDPRG7= <mlev>
##$CPDPRG8= <mlev>
##$CPDPRGB= <>
##$CPDPRGT= <>
##$D= (0..31)
0 1.2 0 0 0 0 0 0 0 0.06 0 0.03 0 0 0 0 0.0002 0 0 0 0 0 0 0 0 0 0 0 0 
0 0 0 
##$DATE= 1596782115
##$DBL= (0..7)
120 120 120 120 120 120 120 120 
##$DBP= (0..7)
150 150 150 150 150 150 150 150 
##$DBP07= 0
##$DBPNAM0= <>
##$DBPNAM1= <>
##$DBPNAM2= <>
##$DBPNAM3= <>
##$DBPNAM4= <>
##$DBPNAM5= <>
##$DBPNAM6= <>
##$DBPNAM7= <>
##$DBPOAL= (0..7)
0.5 0.5 0.5 0.5 0.5 0.5 0.5 0.5 
##$DBPOFFS= (0..7)
0 0 0 0 0 0 0 0 
##$DE= 6
##$DECBNUC= <off>
##$DECIM= 24
##$DECNUC= <off>
##$DECSTAT= 4
##$DIGMOD= 1
##$DIGTYP= 9
##$DL= (0..7)
0 120 120 120 120 120 120 120 
##$DP= (0..7)
150 150 150 150 150 150 150 150 
##$DP07= 0
##$DPNAME0= <>
##$DPNAME1= <>
##$DPNAME2= <>
##$DPNAME3= <>
##$DPNAME4= <>
##$DPNAME5= <>
##$DPNAME6= <>
##$DPNAME7= <>
##$DPOAL= (0..7)
0.5 0.5 0.5 0.5 0.5 0.5 0.5 0.5 
##$DPOFFS= (0..7)
0 0 0 0 0 0 0 0 
##$DQDMODE= 0
##$DR= 18
##$DS= 0
##$DSLIST= <SSSSSSSSSSSSSSS>
$$ [...]
##$SUBNAM2= <"">
##$SUBNAM3= <"">
##$SUBNAM4= <"">
##$SUBNAM5= <"">
##$SUBNAM6= <"">
##$SUBNAM7= <"">
##$SUBNAM8= <"">
##$SUBNAM9= <"">
##$SW= 24.9337058888022
##$SWIBOX= (0..15)
0 0 2 0 0 0 0 0 0 0 0 0 0 0 0 0 
##$SW_h= 4990.01996007984
##$TD= 16384
##$TD0= 1
##$TE= 0
##$TE2= 300
##$TE3= 300
##$TEG= 300
##$TL= (0..7)
0 120 120 120 120 120 120 120 
##$TP= (0..7)
150 150 150 150 150 150 150 150 
##$TP07= 0
##$TPNAME0= <>
##$TPNAME1= <>
##$TPNAME2= <>
##$TPNAME3= <>
##$TPNAME4= <>
##$TPNAME5= <>
##$TPNAME6= <>
##$TPNAME7= <>
##$TPOAL= (0..7)
0.5 0.5 0.5 0.5 0.5 0.5 0.5 0.5 
##$TPOFFS= (0..7)
0 0 0 0 0 0 0 0 
##$TUNHIN= 0
##$TUNHOUT= 0
##$TUNXOUT= 0
##$USERA1= <user>
##$USERA2= <user>
##$USERA3= <user>
##$USERA4= <user>
##$USERA5= <user>
##$V9= 5
##$VALIST= <valist>
##$VCLIST= <CCCCCCCCCCCCCCC>
##$VD= 0
##$VDLIST= <DDDDDDDDDDDDDDD>
##$VPLIST= <PPPPPPPPPPPPPPP>
##$VTLIST= <TTTTTTTTTTTTTTT>
##$WBST= 1024
##$WBSW= 4
##$XGAIN= (0..3)
0 0 0 0 
##$XL= 0
##$YL= 0
##$YMAX_a= 510654
##$YMIN_a= -232554
##$ZGOPTNS= <>
##$ZL1= 120
##$ZL2= 120
##$ZL3= 120
##$ZL4= 120
##$ABSF1= 10
##$ABSF2= 0
##$ABSG= 5
##$ABSL= 3
##$ALPHA= 0
##$AQORDER= 0
##$ASSFAC= 0
##$ASSFACI= 0
##$ASSFACX= 0
##$ASSWID= 0
##$AUNMP= <proc_1d>
##$AZFE= 0.1
##$AZFW= 0.1
##$BCFW= 1
##$BC_mod= 2
##$BYTORDP= 1
##$COROFFS= 0
##$CY= 11.3945322036743
##$DATMOD= 1
##$DC= 2
##$DFILT= <>
##$DTYPP= 0
##$F1P= 16.9975609425685
##$F2P= -3.02152046262296
##$FCOR= 0.5
##$FTSIZE= 0
##$FT_mod= 4
##$GAMMA= 1
##$GB= 0.15
##$INTBC= 1
##$INTSCL= 1
##$ISEN= 128
##$LB= 0.24
##$LEV0= 0
##$LPBIN= 0
##$MAXI= 10000
##$MC2= 0
##$MEAN= 0
##$ME_mod= 0
##$MI= 1.114404
##$NCOEF= 0
##$NC_proc= 0
##$NLEV= 6
##$NOISF1= 3.799351
##$NOISF2= 2.8
##$NSP= 1
##$NTH_PI= 0
##$NZP= 0
##$OFFSET= 15.70392
##$PC= 1
##$PHC0= -9804.212
##$PHC1= 24.60092
##$PH_mod= 1
##$PKNL= yes
##$PPARMOD= 0
##$PSCAL= 0
##$PSIGN= 0
##$REVERSE= no
##$SF= 200.130013532006
##$SI= 16384
##$SIGF1= 3
##$SIGF2= 2
##$SINO= 400
##$SIOLD= 16384
##$SREGLST= <1H.CDCl3>
##$SSB= 0
##$STSI= 0
##$STSR= 0
##$SW_p= 3612.71676300578
##$SYMM= 0
##$S_DEV= 0
##$TDeff= 0
##$TDoff= 0
##$TI= <>
##$TILT= no
##$TM1= 0
##$TM2= 0
##$TOPLEV= 0
##$USERP1= <user>
##$USERP2= <user>
##$USERP3= <user>
##$USERP4= <user>
##$USERP5= <user>
##$WDW= 1
##$XDIM= 8192
##$YMAX_p= 0
##$YMIN_p= 0
$$ End of Bruker specific parameters
$$ ---------------------------------
##NTUPLES= NMR FID
##VAR_NAME=  TIME,          FID/REAL,        FID/IMAG
##SYMBOL=    X,             R,               I
##VAR_TYPE=  INDEPENDENT,   DEPENDENT,       DEPENDENT
##VAR_FORM=  AFFN,          ASDF,            ASDF
##VAR_DIM=   8192,          8192,            8192
##UNITS=     SECONDS,       ARBITRARY UNITS, ARBITRARY UNITS
##FACTOR=    0.0002004,     1,               1
##FIRST=     0,             0,               0
##LAST=      1.6414764,     0,               0
##MIN=       0,             -232554,         0
##MAX=       1.6414764,     510654,          0
$$ Real data points
##PAGE= N=1
##DATA TABLE= (X++(R..R)), XYDATA
$$ [...]
1952a28k40j30O60r9j15j82j35N35n04m85J87M26K08l58J42N03m54n93l8L07K89
$$ -128 -368 -498 162 63 -52 -234 -369 166 -338 -823 -636 -210 -2 -360 -218 285 -169 -762 -800 -493 -204
1973b04L6K71j63m83j58L3J94K86o9m4R2q6l47M3K95L55k15N9m5q2k1l77j66L97
$$ -204 -168 103 -60 -543 -701 -668 -474 -188 -257 -301 -209 -295 -642 -599 -304 51 -164 -105 -150 -232 -253 -630 -796 -399
1997c99rM24J39j1m64J68l64P5K05J39N64k35m68j54q6L06K13J99J56j51j8l79
$$ -399 -408 16 155 144 -320 -152 -516 -441 -236 -97 467 232 -236 -390 -476 -170 43 242 398 247 229 -150
2019a50R7J53m9l2M96j84PK4o1l65k08N15K03K66k96j37j89j1j35K99L48J44j03
$$ -150 -53 100 51 19 515 331 338 362 301 -64 -272 243 446 712 416 279 90 79 -56 243 591 735 632
2042F32k02j91j51o7J43M70K09l27J5m27p5N2K58j25J11l0J59N47p57j37J27j39
$$ 632 430 239 88 21 164 634 843 516 531 104 29 81 339 214 325 295 454 1001 244 107 234 95
2064I5K25L1J48m9kl50o5R7K13qJ04k63k21l04J18O78n64K20R5K0j58l63l0K70
$$ 95 320 351 499 450 448 98 33 130 343 335 439 176 -45 -349 -231 447 -117 103 198 218 60 -303 -333 -63
2088f3j65q8J27M94l13r7r3l56K29m94M74N47j19j00m14j40%K8J59J33M53n54
$$ -63 -228 -316 -189 305 -8 -105 -198 -554 -325 -819 -345 202 83 -17 -431 -571 -571 -543 -384 -251 202 -352
2110c52j12J92o9pP1j46M25k36k52M70k65k57j44K00L30R3l2K47k02k69n14N74
$$ -352 -464 -272 -341 -348 -277 -423 2 -234 -486 -16 -281 -538 -682 -482 -152 -59 -91 156 -46 -315 -829 -255
2132b55L6N2J80k25j16K58n33M89K18J87k49K05j44qr9k17L59J34j67K11k55J7
$$ -255 -219 -167 13 -212 -328 -70 -603 -114 104 291 42 247 103 95 -4 -221 138 272 105 316 61 78
2154G8j65K75o1o3O53m31J66k67J69m02pK61L50O2k94j08n88L63K04K45J15l63
$$ 78 -87 188 127 64 717 286 452 185 354 -48 -55 206 556 618 324 216 -372 -9 195 440 555 192
2176A92L8j31J39r2J45k29J90K65q8oj20r4o9J02j40K26p3Q6k39j52mKJ64K81
$$ 192 230 99 238 146 291 62 252 517 429 423 303 209 140 242 102 328 255 341 102 -50 -54 -52 112 393
2200C93k9k61j08k57n5K27RL75j89K4k16j23k3l9q6J89J73n3j27J81L6l61j05
$$ 393 364 103 -5 -262 -317 -90 -81 294 105 129 -87 -210 -233 -272 -358 -169 4 -49 -176 5 41 -320 -425
2223d25K48L11R6n5l72N4m93L5L24L32l12J18O3j59j06m13M14j1o4J95Q7M48m92
$$ -425 -177 134 230 175 -197 -143 -636 -601 -277 55 -257 -139 -76 -235 -341 -754 -340 -351 -415 -220 -133 315 -177
2246a77k69k3K88k57J58N31j7k0l81l21k37O69p6J67J23l15q2l6M6J1R5J6N34
$$ -177 -446 -469 -181 -438 -280 251 234 214 -167 -488 -725 -56 -132 35 158 -157 -239 -275 -229 -218 -123 -107 427
2269D27m03j26l59L08j01M9M3N06k3l59O7r4K25l54J23P15J31p67K2j53J68j21
$$ 427 24 -102 -461 -153 -254 -205 -162 344 321 -38 29 -65 160 -194 -71 644 775 8 30 -123 45 -76
2291g6NP00j62k54J21k45K2P3J5K73k91j7P7K9K8J02j68j6K63k38j08L81j87l25
$$ -76 -71 629 467 213 334 89 111 184 199 472 181 164 241 270 298 400 232 216 479 241 133 514 327 2
2315Bo8M9L13J87J1l37j51k70K04J39L24r9q3k92q6R6J6L08P1l31K78l0j85l94
$$ 2 -66 -17 296 483 494 157 6 -264 -60 79 403 304 221 -71 -157 -61 -45 263 334 3 281 251 66 -328
2339c28J77k64J92K13p4J82M2j78j18p5M1J37k6K41l45N6n1k89J32J57PQ7j08
$$ -328 -151 -415 -223 -10 -84 98 140 -38 -156 -231 -190 -53 -79 162 -183 -127 -178 -467 -335 -178 -171 -84 -192
2362a92j00J2K17n74M11K0Rm9K88k85J05j47Pj37L08J34K2j27m61N8j66L99K05
$$ -192 -292 -280 -63 -637 -226 -206 -197 -246 42 -243 -138 -285 -278 -415 -107 27 49 -78 -539 -481 -647 -248 -43
2385d3J77j96J72J4o51J44K54k5K43m3q7j10M09k58j68K13j63M67j42J62p5m03
$$ -43 134 -62 110 124 -527 -383 -129 -154 89 46 -41 -151 258 0 -168 45 -118 349 207 369 294 -109
2407a09k82M27r4K56J79m2k1k21r8R8J97J26k03K02l2m62P0j52M36K46k3l62j19
$$ -109 -391 36 -58 198 377 335 314 93 -5 93 290 416 213 415 383 -79 -9 -161 275 521 498 136 17
2430A7K76k17J36r3j52M38o2K32j13l79J8M9k91N61k12J44k39J66j59j09l32O29
$$ 17 293 76 212 119 -33 405 343 575 462 83 101 150 -141 420 208 352 113 279 120 11 -321 308
2452C08L1j53J05l72J17K79j38j31J52O8k34P7m1p9L2k47J08J85P5o7Q5k48m6
$$ 308 339 186 291 -81 36 315 177 46 198 266 32 109 68 -11 21 -226 -118 67 142 75 160 -88 -134
2475a34l46J22N26j29j15j7k0l4k01J29j8O33n08J6j40J80l17P3j9K53j38K83
$$ -134 -480 -358 168 39 -76 -93 -113 -147 -348 -219 -237 396 -112 -96 -236 -56 -373 -300 -319 -66 -204 79
2497G9k15k45O3J70j92K26j32M00o8j34k84j48K5J84K97r8Q3k90j23L8L58J28
$$ 79 -136 -381 -318 -148 -340 -114 -246 154 86 -48 -332 -480 -455 -271 26 -72 11 -279 -402 -364 -6 122
2519A22l75K07K23k60k08r8K44j4n7L5P0O0j42j36K45P7k70J50M92l25R3k60P1
$$ 122 -253 -46 177 -83 -291 -389 -145 -159 -216 -181 -111 -51 -193 -329 -84 -7 -277 -127 365 40 133 -127 -56
2542e6o9L68o8j93J26j42J18k13j05O55k04j1R0l41J86Q9K6l44K18L33k59J92
$$ -56 -125 243 175 -18 108 -34 84 -129 -234 421 217 206 296 -45 141 230 256 -88 130 463 204 396
2564C96n7j03m24K15k2o1J62q9J39M1r0l54J29P6M57K3l39o7K79n22P3K07J60
$$ 396 339 236 -188 27 5 -56 106 17 156 197 107 -247 -118 -42 415 438 99 32 311 -211 -138 69 229
2587B29k05J59j67L04m76J45j91N64q60N06J55J47k55l74K07K52m68N59j28j63
$$ 229 24 183 16 320 -156 -11 -202 362 -498 8 163 310 55 -319 -112 140 -328 231 103 -60
2607f0j20N0m11P22q6m2M05k83m26j42K74J01k53K23n8K99j53j17K39m40r1J59
$$ -60 -180 -130 -541 181 95 53 458 175 -251 -393 -119 -18 -271 -48 -106 193 40 -77 162 -278 -369 -210
2629b10L14Nk31L1l61Q3J61R3q0P6K01m28L52o0o1P4M4L41l96j54J49k10j34L36
$$ -210 104 109 -122 -91 -452 -369 -208 -115 -195 -119 82 -346 6 -54 -115 -41 3 344 -52 -206 -57 -267 -401 -65
2653f5J44R3k37J22K30k94j24J28l70N00j90K03j02K42p46M05K87j36J58j55J60
$$ -65 79 172 -65 57 287 -7 -131 -3 -373 127 -63 140 38 280 -466 -61 226 90 248 93 253
2674B53j60K9j59K83m8K05j71j23N2j2K55l06p7M69k69k28L61k55p3j9j38J83
$$ 253 93 122 -37 246 198 403 232 109 161 149 404 98 21 490 221 -7 354 99 26 7 -131 52
2696E2K77P9k02J9k20m07M00J00j37M76k21r5o7j51L02p8k02K36J07l85K19J92
$$ 52 329 408 206 225 5 -402 -2 98 -39 437 216 121 54 -97 205 127 -75 161 268 -117 102 294
2718B94m26J07O2K30L0j13K07l34k74K0K20j44L3J28L50n01k26J96N1QM31n89
$$ 294 -132 -25 37 267 297 184 391 57 -217 -197 23 -121 -88 40 390 -111 -337 -141 -90 -82 349 -240
2740b40j87K27j63R7K15k33J43K19j28K22l96J05J2J29k79j37K46K44Q3m30M1
$$ -240 -427 -200 -363 -266 -51 -284 -141 78 -50 172 -224 -119 -107 22 -257 -394 -148 96 179 -251 -210
2761b10k83M22J39J07k02k04j69J83Q5M7pJ51K26k87R1k90j41M57l80K5O1J81
$$ -210 -493 -71 68 175 -27 -231 -400 -217 -132 -85 -92 59 285 -2 89 -201 -342 115 -265 -240 -179 2
2783Bl8K3j50j7k84M00K31k2K9qk85k42L96L1J64o3Kr0j05r4j81J44J08J29Q7
$$ 2 -36 -13 -163 -180 -464 -64 167 145 174 166 -119 -361 35 66 230 167 169 79 -26 -120 -301 -157 -49 80 167
2808A67L98n99j33K18P9k0K03p3k81J77M5l22j81M28Q5k0qM4k72Q8M4O7j34M16
$$ 167 565 -34 -167 51 130 110 313 240 -41 136 181 -141 -322 106 191 171 163 207 -65 23 67 134 0 416
2832D16n72O9L06q8j53Q0j22r7M14k06j9l8k8j62L16j63J45J74O0l08k04j00J46
$$ 416 -156 -87 219 131 -22 58 -64 -161 253 47 28 -10 -38 -200 116 -47 98 272 332 24 -180 -280 -134
2855a34J49K18k1k53j74j16L21L7q6J78K54l19M8r1K02j63L0q9k00L41j48K55
$$ -134 15 233 212 -41 -215 -331 -10 27 -59 119 373 54 102 11 213 50 80 -9 -209 132 -16 239
2877B39l33j26J52m02N29Rj12J19j60p1P7P3K33j76Q2j02j00l26J41K45K1J06
$$ 239 -94 -220 -68 -470 59 68 -44 75 -85 -156 -79 -6 227 51 133 31 -69 -395 -254 -9 12 118
2899A18l53L93J6l58K17r2k30M37k25n9Q9K17k29m63O99k21N00k91j44J54k91
$$ 118 -235 158 174 -184 33 -59 -289 148 -77 -136 -47 170 -59 -522 177 -44 456 165 21 175 -116
2920a16l4K1r1L98J52p0m5n8k25m1N5J74O2q0R0qj28j22J9k38M51J55J12l93Q4
$$ -116 -150 -129 -220 178 330 260 215 157 -68 -109 -54 120 182 102 192 184 56 -66 -47 -285 166 321 433 40 124
2945A24l07N4K77J4j22J19k44J7L62m51M6M33l53L3L70k69k17J70N4P5j02o1J88
$$ 124 -183 -129 148 162 40 159 -85 -68 294 -157 -111 322 -31 2 372 103 -114 56 110 185 83 22 210
2968B10J25k47k27J58j11K16J12j43m6K5l09K05j54J42m4K75k08r0o8J16k8J03
$$ 210 335 88 -139 19 -92 124 236 93 47 72 -237 -32 -186 -44 -88 187 -21 -111 -179 -63 -91 12
2990A2j26K75j2j1l74J33J84r7R5O6l61J90L16k81l15N1L07l51K59j40L32l13
$$ 12 -114 161 149 138 -236 -103 81 -16 79 145 -216 -26 290 9 -306 -255 52 -299 -40 -180 152 -161
3012a61P0p1j67M64ql14P0j75M61j37n1k83R9J04M1L0j89J68j70j83M46l32L08
$$ -161 -91 -162 -329 135 127 -187 -117 -292 169 32 -19 -302 -203 -99 -58 -28 -217 -49 -219 -402 44 -288 20
3035B0J8J47k40j74J12J75J81j74J26l47N9N4j32J42J54k9n7J13j93n4pp1L15
$$ 20 38 185 -55 -229 -117 58 239 65 191 -156 -97 -43 -175 -33 121 92 35 148 -45 -99 -106 -177 138
3058A38K21m76L16l93J97K24j57l22K01P0R5o0k42N52j24q2p1M65l34K7j22q4
$$ 138 359 -117 199 -194 3 227 70 -252 -51 19 114 54 -188 364 240 158 87 552 218 245 123 39
3080C9j21m6J59L58l01k3K98m99K78r8r5L26K83n56j08k3J89o9L4j8K47P3O7q5
$$ 39 -82 -128 31 389 88 65 363 -136 142 44 -51 275 558 2 -106 -129 60 -9 25 7 254 327 394 309
3104C09l99J39J53k5j04k47K14J47k68j4K0L44j0j13p5J07k02M47n89K1J66j64
$$ 309 -90 49 202 177 73 -174 40 187 -81 -95 -75 269 259 146 71 178 -24 423 -166 -145 21 -143
3126a43J79k3j50q2J22r0M52l40j12M21k38m5p7j1J61J3j60K5J84l84Mp7L49J00
$$ -143 36 13 -137 -219 -97 -187 265 -75 -187 234 -4 -49 -126 -137 24 37 -123 -98 86 -298 -294 -371 -22 78
3150G8j21J1J03r8k2k9R4Rj4k09K65Rk64N1J3K18m00K76J81j10J18l56j84K82
$$ 78 -43 -32 71 -27 -49 -78 16 25 11 -198 67 76 -188 -137 -124 94 -306 -30 151 41 159 -197 -381 -99
3174i9M8J15M3l32Jj64L45kq3j91M74k11P1j21J96k4Q2k7m00L43K5K82m58J62
$$ -99 -51 64 107 -225 -224 -388 -43 -45 -128 -319 155 -56 15 -106 90 66 148 121 -279 64 89 371 -87 75
3198G5k81k4K83R3K28l95M8k35j01K26N6j6L1K98k93K7J3K9L8j26r2K19j29M7
$$ 75 -206 -230 53 146 374 -21 27 -208 -309 -83 -27 -43 -12 286 -7 20 33 62 100 -26 -118 101 -28 19
3222A9K04j13j15J37J39Q6j4j75j27j71J47J55m2K39l15N8J50l23k66K63R3J33
$$ 19 223 110 -5 132 271 357 343 168 41 -130 17 172 130 369 54 112 262 -61 -327 -64 29 162
3244A62l27J65J04K55m60J26Q1j46j40K59O3j38J3l59k51N23M03m80R2r0p1J41
$$ 162 -165 0 104 359 -101 25 106 -40 -180 79 142 4 17 -342 -593 -70 333 -147 -55 -145 -216 -75
3266g5J38o6j24k36M98j03j52j03Q1L05k46r7l4j18O65k16k16j1J86k5J27l47
$$ -75 63 -3 -127 -363 135 32 -120 -223 -142 163 -83 -180 -214 -332 333 117 -99 -110 76 51 178 -169
3288a69j52M66j44K34m09J3J94q9j45N4J65m2J63j81L2P1j7q4j01K85j92J56q0
$$ -169 -321 145 1 235 -174 -161 33 -56 -201 -147 18 -24 139 -42 -10 61 44 -40 -141 144 -48 108 28
3311B8j03Q6j46q9J21q5M88l48K82K40k88j70K00k43n1mK40k52K18j36L18n00
$$ 28 -75 11 -135 -224 -103 -188 300 -48 234 474 186 16 216 -27 -78 -82 158 -94 124 -12 306 -194
3333a94K28kK5K27ok39o3j39K26k84N76q0k98K92J37k71l22J38m6J34K7R4j30
$$ -194 34 32 57 284 278 39 -24 -163 63 -221 355 275 -23 269 406 135 -187 -49 -95 39 66 160 30
3356C0pj85J34j2r0K11L09k04k39j80J64J81J64k88m0j51K87j78L10o9m39J03
$$ 30 23 -162 -28 -40 -130 81 390 186 -53 -233 -69 112 276 -12 -52 -203 84 -94 216 147 -292 -189
3378a89J46L81J18l71k54NJ3m7P0K96k08K76j70j96P4j76K93J19ok60j38J21k44
$$ -189 -43 338 456 85 -169 -164 -151 -198 -128 168 -40 236 66 -130 -56 -232 61 180 174 -86 -224 -103 -347
3401c47P0L38j19J60Pl31K41k33J6LjJ97J9M9L3l53Q2Q0R3j19o4J94J32k9k00
$$ -347 -277 61 -58 102 109 -222 19 -214 -198 -195 -196 1 20 69 102 -251 -169 -89 4 -115 -179 15 147 118 -82
3426h2M5J00o2k31J55kJ27k89N8J29lJ05q7K1J55j95J6k48L58k3p7K72j17n2j56
$$ -82 -37 63 1 -230 -75 -77 50 -239 -181 -52 -55 50 -37 -16 139 -56 -40 -288 70 47 -30 242 125 73 -83
3451h3J07J43L2J33k28m8N8j72O6j0J08m3m6J92R7l90J19r9k55L47J27p9J31O6
$$ -83 24 167 199 332 104 56 114 -58 8 -2 106 63 17 209 306 -84 35 -64 -319 28 155 76 207 273
3475B73l9o45L71K05J58l40J62J07k73l88L93Q9j55R8J45k28k2k4K56j25r8J98
$$ 273 234 -411 -40 165 323 -17 145 252 -21 -409 -16 73 -82 16 161 -67 -89 -113 143 18 -80 118
3497A18J35j85q8K3n6k4j08K55j03J52j94j14q6K23K72j25j67j60J95m6K59k30
$$ 118 253 68 -20 3 -53 -77 -185 70 -33 119 -75 -189 -275 -52 220 95 -72 -232 -37 -83 176 -54
3519e4N6p9J67lR3p5k02J84p7J96k39j15J67O0j30j40P2J49J19m44L69r3K60l42
$$ -54 2 -77 90 87 180 105 -97 87 10 206 -33 -148 19 79 -51 -191 -119 30 149 -295 74 -19 241 -101
3543a01L7L47k67M2J46j88l23N27m36R4K08Q2n4j31J19r1NM3k52M99l56Q6m9J17
$$ -101 -64 283 16 58 204 16 -307 220 -216 -122 86 168 114 -17 102 11 16 59 -193 306 -50 36 -13 104
3567A04k49J24J55k23J29j61O13m82Qj33J32j23N1J45J78r8r3j78J36N3J00Q3
$$ 104 -145 -21 134 -89 40 -121 492 10 18 -115 17 -106 -55 90 268 170 77 -101 35 88 188 271
3589B71l55J51j25J13j41J4J51o3K17j42l4j56n5J44K9j8J75j9j15J20l68QL98
$$ 271 -84 67 -58 55 -86 -72 79 16 233 91 57 -99 -154 -10 19 1 176 157 42 162 -206 -198 200
3612B00j14P3k18K07k22J26J25n8k04J14j5P2J3J14l37j29J19K72j78o8K18p1
$$ 200 86 159 -59 148 -74 52 177 119 -85 29 14 86 99 213 -124 -253 -134 138 -40 -108 110 39
3634C9j07J9j47J05l5J62j00j26J57K02k58J81j02L8l0J40k55k7L63q1k58Lj09
$$ 39 -68 -49 -196 -91 -126 36 -64 -190 -33 169 -89 92 -10 28 -2 138 -117 -144 219 138 -120 -117 -226
3657b26K33J72k08j31J18J51k26KN0L90k05k14M64m06j53L16L8n5j0o9j55p7K39
$$ -226 7 179 -29 -160 -42 109 -117 -115 -65 325 120 -94 370 -36 -189 127 165 110 100 31 -124 -201 38
3680C8J57l22N7J95m2j6m7k5m47J77L05j40K94m91M47l01K96p4Qm3Q7j33p8L01
$$ 38 195 -127 -70 125 83 67 20 -5 -452 -275 30 -110 184 -307 140 -161 135 61 69 26 113 -20 -98 203
3704B03n11O44j93j81J30o6j37k4J64j63L4J31j10l0m2J56K05j36o4k7k20K99
$$ 203 -308 336 143 -38 92 26 -111 -135 29 -134 -100 31 -79 -109 -151 5 210 74 10 -17 -237 62
3726F2K02k42l1p5K02m1j35L10j96L0O5k05k82M95m8npj97P7O5OM5j38K05k45
$$ 62 264 22 -9 -84 118 77 -58 252 56 86 151 -54 -336 159 111 106 99 -98 -21 44 50 95 -43 162 -83
3751h3J18L37k00k45m8J95K6p9p8j0l9j61J52K22j9J91l75oJ71k19R7J91q9k35
$$ -83 35 372 172 -73 -121 74 100 21 -57 -67 -106 -267 -115 107 88 279 -96 -102 69 -150 -53 138 49 -186
3775a86M10j63q9q5k4k0J18L41k15L4p6m6l64M33j50L78k15K02j43m00J65j52
$$ -186 224 61 -28 -113 -137 -157 -39 302 87 121 45 -1 -365 68 -82 296 81 283 140 -260 -95 -247
3797b47K20L14j36p0l06K59J11j62J27k17R2j2k52JM27J5j33J01k40J76k53K06
$$ -247 -27 287 151 81 -225 34 145 -17 110 -107 -15 -27 -279 -278 149 164 31 132 -108 68 -185 21
3819B1L6j54j8OL04j10K64l52j21K85j70j27J78j22J42L49k68j31J8rJ12q6k5
$$ 21 57 -97 -115 -109 195 85 349 -3 -124 161 -9 -136 42 -80 62 411 143 12 30 21 133 47 22
3842B2K20l58n4J09j8P0j64J40O4o4K7J26j72K48l39M10m00m3J60k06L09R1j61
$$ 22 242 -116 -170 -61 -79 -9 -173 -33 31 -33 -6 120 -52 196 -143 267 -133 -176 -16 -222 87 178 17
3865A7J43M5j55Q3k82J41P2N2j16p8l0R8M0r4N8J13j23m5%M0K57l65K62R1k93
$$ 17 160 205 50 133 -149 -8 64 116 0 -78 -108 -10 30 -64 -6 107 -16 -61 -61 -21 236 -129 133 224 -69
3890f9l1L5P7K33j29k3R7j71L0j36P2J49p1o6k0J73j23L0N6j85j05K92m23K70
$$ -69 -100 -65 12 245 116 93 190 19 49 -87 -15 134 63 -3 -23 150 27 57 113 -72 -177 115 -308 -38
3914c8k4J08q2nJ49j92kJ42j40o0L57l20n2Nl3L43l39K67r7O5Q1l0k57K16l20
$$ -38 -62 46 -36 -41 108 -84 -86 56 -84 -144 213 -107 -159 -154 -187 156 -183 84 -13 52 133 103 -154 62 -258
3939b58K64J71q7J85l03m6k56M28J01j69l06K37R2L21j70k37NJ35Q8k34l6J24
$$ -258 6 177 90 275 -28 -74 -330 98 199 30 -276 -39 53 374 204 -33 -28 107 195 -39 -75 49
3961D9n31P29l69J28j90O67m22j17m8j62m3P18o99O37m65K74o0r2J46j55J25k04
$$ 49 -482 247 -122 6 -184 483 61 -56 -104 -266 -309 409 -290 347 -118 156 96 4 150 -5 120 -84
3983h4j08J23P2J16j15oo0J09lO7J84n18J52r2J45m2J75k4k27J23p6K33k43L95
$$ -84 -192 -69 3 119 4 -2 -62 47 44 111 295 -223 -71 -163 -18 -60 115 91 -136 -13 -89 144 -99 296
4007B96o77K47L26m49M0K11q0q5J61k21J96J10j1o8l02L23J15j14M01l13P1k46
$$ 296 -381 -134 192 -257 -217 -6 -86 -171 -10 -231 -35 75 64 -4 -306 17 132 18 419 106 177 -69
4029f9J31j4o9m03L69Mm2O8K52l49k94O27n17J89o1N07k79j63r9j09J74L24m42
$$ -69 62 48 -21 -424 -55 -51 -93 -25 227 -122 -416 211 -306 -117 -178 329 50 -113 -212 -321 -147 177 -265
4052b65M47k43Q7K20k62N9j76K8q5L89m37N9R5L31n10M59k39J30q0j64N0J38q2
$$ -265 182 -61 26 246 -16 43 -133 -105 -190 199 -238 -179 -84 247 -263 196 -43 87 7 -157 -107 31 -51
4075e1N6K21l52Q1mj84J96J81K7k51J21j45j02K65J41j24J73p6n43N02m8K56l10
$$ -51 5 226 -126 -45 -49 -233 -37 144 171 -80 41 -104 -206 59 200 76 249 173 -370 132 84 340 30
4098C0n7J97k54J62k36K11k2K9J1k97L70j1K0k9l34J28J81k77J99L2L14j84k91
$$ 30 -27 170 -84 78 -158 53 31 60 71 -226 144 133 153 124 -210 -82 99 -178 21 53 367 183 -108
4121a08j8L1R3j48p6M14k14j89K42j47j28J51K96qj11j31l8K17j56q8J01N6L08
$$ -108 -126 -95 -2 -150 -226 188 -26 -215 27 -120 -248 -97 199 191 80 -51 -89 128 -28 -116 -15 41 349
4144C49m48K69j31q1O0j44JP5K92l24M14l49j01R8L1j51k8K38j5j65Q8J50j22
$$ 349 -99 170 39 -42 18 -126 -125 -50 242 -82 332 -17 -118 -20 11 -140 -168 70 55 -110 -22 128 6
4167Fk41K10r3K50M6m46K97k18J14k01J59K38k31Q3K41k63k55j33L04M9L19j19
$$ 6 -235 -25 -118 132 178 -268 29 -189 -75 -276 -117 121 -110 -27 214 -49 -304 -437 -133 -84 235 116
4189A16O4K1k49n8J71J38j97k88N46n67J03L84k60L1N2R7J29m92k50M36j7K98
$$ 116 180 201 -48 -106 65 203 6 -282 264 -303 -200 184 -76 -45 7 104 233 -259 -509 -73 -90 208
4211B08j9l21J42J60k98J32J78n4k22R2N6l25L33L5j34L2l2K09k72K52q8R8k25
$$ 208 189 -132 10 170 -128 4 182 128 -94 -2 54 -271 62 97 -37 -5 -37 172 -100 152 64 162 -63
4234f3j39R1K07nko8l2o0k14L11Q6J5k27j1K75p1k13P6q2M0J69J87n34O44l66
$$ -63 -202 -111 96 91 89 21 -11 -71 -285 26 112 127 -100 -111 164 93 -120 -44 -126 -86 83 270 -264 380 14
4259A4m7J45k57O1K17L8k51K3N8k2Mj99j52K78L79l44J93k62P5L49m09J69j01
$$ 14 -33 112 -145 -84 133 171 -80 -57 1 -21 -17 -216 -368 -90 289 -55 138 -124 -49 300 -109 60 -41
4282d1J09RK44m5l67J68O2k12J2K48k2j17k11L12l30M3K44J94r2o5k46J71j68
$$ -41 68 77 321 276 -91 77 139 -73 -61 187 165 48 -163 149 -181 -138 106 300 208 143 -103 68 -100
4305a00K1l5j19J25K96l2j62Q3j80J38N9R1k30J20r6K6j3J0m6R7p9k2K2j6Q2o7
$$ -100 -79 -114 -233 -108 188 156 -6 77 -103 35 94 185 -45 75 -21 5 -8 2 -44 53 -26 -48 -26 -42 40 -27
4331b7j23Q1k4L22k66r3J28p7J28k8J28k92L97j34L0p2K29k98J60o7k16J89q8
$$ -27 -150 -69 -93 229 -37 -130 -2 -79 49 21 149 -143 254 120 150 78 307 9 169 102 -114 75 -13
4354a3k1o1q6L77j64l2P5l5K0k57P8n6k39M12o1J21j00J72l6l94K62P3N8n6J28
$$ -13 -34 -95 -181 196 32 0 75 40 60 -197 -119 -175 -414 -2 -63 58 -42 130 94 -300 -38 35 93 37 165
4379A65k27l2Q7j58J83l7L1j75K99l59L27jj30J39P7j16j71K34l03P7l4K12O4
$$ 165 -62 -94 -7 -165 18 -19 12 -163 136 -223 104 103 -27 112 189 73 -98 136 -167 -90 -124 88 152
4402A52J14m70kK53L0JQ0n14M37m48j4K56m7Q4J48q4l4QJ82k2K54k61p8m2R9k8
$$ 152 266 -204 -206 47 77 78 158 -356 81 -367 -381 -125 -172 -88 60 -24 -58 -50 132 110 364 103 25 -17 82 54
4428E4k74K42L13p4p6k59m6Q4K21k34J09J32q4j10J46K22mj11j62J70k34j82L15
$$ 54 -220 22 335 261 185 -74 -120 -36 185 -49 60 192 108 -2 144 366 362 251 89 259 25 -157 158
4451A58j31Q3q0k6K72j04N2j44k26J60J55j27r4K69j09p8j19L85m77K39Q4j35
$$ 158 27 110 30 4 276 172 224 80 -146 14 169 42 -52 217 108 30 -89 296 -181 58 142 7
4473Gj86K08k25K7J48l7J43j13p4J66L5k12k1J97l61L34n1J05j07m0MJ40J47n5
$$ 7 -179 29 -196 -169 -21 -58 85 -28 -102 64 99 -113 -134 63 -298 36 -15 90 -17 -57 -53 87 234 179
4497A79j38J8J08j16m5rL55k94K3k88J36J57K11k18k32K14K8k13K49j05J94k06
$$ 179 41 59 167 51 6 -3 352 58 81 -207 -71 86 297 79 -153 61 89 -124 125 20 214 8
4519HN7P5j44j62m4n7J52J62J3O8k40m1J79P4qK74l34k36K51j7P5k02M10l08R7
$$ 8 65 140 -4 -166 -210 -267 -115 47 60 128 -112 -153 26 100 92 366 32 -204 47 30 105 -97 313 5 102
4544A02n21N36k34j7L01m17K62j81L10j17o1J50J4j93j6k84O0J75n2r5L66J18
$$ 102 -419 117 -117 -134 167 -250 12 -169 141 24 -37 113 127 -66 -82 -366 -306 -131 -183 -278 88 206
4566B06j46k53N05j09o03L42q9J92n4M9k27J05R3j13K36J6Nj23l3L9j01N8J36
$$ 206 60 -193 312 203 -400 -58 -147 45 -9 40 -187 -82 11 -102 134 150 155 32 -1 38 -63 -5 131
4589A31k26P6l85O89k50o4M5J01l0k35M9r7J82J22k20K42k9k13J35k02K93o9l23
$$ 131 -95 -19 -404 285 35 -29 16 117 87 -148 -99 -196 -14 108 -112 130 101 -112 23 -179 114 45 -278
4612b78M29m95L49K65m23j31M41r2k11J45P2q2k3K86k69K60o63M95j38L57k70
$$ -278 151 -344 5 270 -153 -284 157 65 -146 -1 71 -11 -34 252 -17 243 -420 75 -63 294 24
4633B4jj20k9N4j24j32M11J84k11j80r1L36k56l77J58L16M0Qo2j72J30o6M84j04
$$ 24 23 -97 -126 -72 -196 -328 83 267 56 -124 -215 121 -135 -512 -354 -38 2 10 -52 -224 -94 -160 324 220
4657B20k03q9J5k4R3L9j02Mj57M07k38j88K2K41p8l3P3J4L8m18L34M03m72K48
$$ 220 17 -72 -57 -81 12 51 -51 -47 -204 203 -35 -223 -201 40 -38 -71 2 16 54 -364 -30 373 -99 149
4681A49r8p6J37j03J63k49K95j19j83J38o0j18J10j05Q7n5K34k61K86m94J73J13
$$ 149 51 -25 112 9 172 -77 218 99 -84 54 -6 -124 -14 -119 -32 -87 147 -114 172 -322 -149 -36
4703c6J12j42mj42O4J68j77M58j20j96j97L89j60j70J78j7J32n5J11k61N4J22
$$ -36 76 -66 -70 -212 -148 20 -157 301 181 -15 -212 177 17 -153 25 8 140 85 196 -65 -11 111
4725A11q2o8Rk1L28k8k75o0p3J90j96K02n4J22l43K57j69L09j98R4J28J23l17
$$ 111 29 -39 -30 -51 277 249 -26 -86 -159 31 -165 37 -17 105 -238 19 -150 159 -39 55 183 306 -11
4748a1J05J27l45O0j5M16k07P1k73K05j8j85J61j64Q0K39k85j88J10J63p0k52
$$ -11 94 221 -124 -64 -79 337 130 201 -72 133 115 -70 91 -73 7 246 -39 -227 -117 46 -24 -276
4770b76L84k22L5J09Q1j39j21L26k11q9L9J02j39J20j20n6K70l22K12k32L70l14
$$ -276 108 -114 -79 30 111 -28 -149 177 -34 -123 -84 18 -121 -1 -121 -177 93 -229 -17 -249 121 -193
4792a93J53P7P9q1j06o7J0R1J80k82J89L54m13M5Rj24L18l98J21k2K57N9j55r8
$$ -193 -40 37 116 35 -71 -138 -128 -37 143 -139 50 404 -9 36 45 -79 239 -159 -38 -60 197 256 101 3
4816CL2l1J81l79K38N8k90J08n5j02M23j16l08n1M55Rj23o7k54K17j9J00l02L03
$$ 3 35 4 185 -194 44 102 -188 -80 -135 -237 186 70 -238 -289 166 175 52 -15 -269 -52 -71 29 -273 30
4840C0k40J34K08j60j11L36k79k91L00j2kK98m2j80J37l82L11P8q1l1M9k49K73
$$ 30 -210 -76 132 -28 -139 197 -82 -373 -73 -85 -87 211 169 -11 126 -256 55 133 52 21 70 -179 94
4863I4j65K41k97O9K72j66p5j04M5j79L41l19K07l22M55J93l02R3k41K13K68l39
$$ 94 -71 170 -127 -58 214 48 -27 -131 -86 -265 76 -243 -36 -358 97 290 -12 81 -160 53 321 -18
4885a8J47Mj38j76R3J36j71O4N2nO9k57K40k48L34L13l68O8K22l15q6j4r0J93
$$ -18 129 133 -5 -181 -88 48 -123 -59 -7 -12 57 -200 40 -208 126 439 71 139 361 46 -40 -54 -144 49
4909D9j02j57L2Q3K7Q4J43l73K00m1K19j0k17J31J99k14Q2k13J2MQ9P3n9J13L1
$$ 49 -53 -210 -178 -95 -68 16 159 -214 -14 -55 164 154 -63 68 267 53 135 -78 -66 -62 27 100 41 154 185
4934A85j66j24J97M6j99K0J08L7j01k82L20R4L71p28K20J55l19L14N0k15l01K06
$$ 185 19 -105 92 138 -61 -41 67 104 3 -279 41 135 506 -222 -2 153 -166 148 198 -17 -318 -112
4956a12J56j50j48J95J1j1j61K92J33m92M67j24k1M58n50O5j13L79j34l33L02
$$ -112 44 -106 -254 -59 -48 -59 -220 72 205 -287 180 56 35 493 -57 8 -105 274 140 -193 109
4977A09l77O17n03J70J30l79K62rJ5r2J04l54K11J07j29L6j10L2j31J99N8l1M96
$$ 109 -268 349 -154 16 146 -233 29 20 35 -57 47 -307 -96 11 -118 -82 -192 -160 -291 -92 -34 -65 431
5000D31k64k31J3N1L4J00k60P0M7j08J22N2J4M4k3j73K52m40K15NM4K0J06mn8
$$ 431 167 -64 -51 0 34 134 -126 -56 -9 -117 5 57 71 115 92 -81 171 -269 -54 -49 -5 15 121 117 59
5025E9R9k35K87l36K43j17K99Mj24k09M7k79M51k40J57q4J31k11J44k2r9J60j02
$$ 59 158 -77 210 -126 117 0 299 303 179 -30 17 -262 189 -51 106 22 153 -58 86 64 -35 125 23
5048B3k9k5RJ07n6j5n8j53K54j56j06K57K29j76k18M60n39K28j34M33l69j07L28
$$ 23 -6 -31 -22 85 29 14 -44 -197 57 -99 -205 52 281 105 -113 347 -192 36 -98 335 -34 -141 187
5071A87j33j01k52L79N7m38L27k07J41L2K10k94J0RJ97k15N0J45L9j47k39K26
$$ 187 54 -47 -299 80 137 -301 26 -181 -40 -8 202 -92 -82 -73 124 -91 -41 104 143 -4 -243 -17
5093a7q1r0J8N0Rj88L35p6K16k13o4K56l22J52j04J31l68J83K56j4r5K7j64K06
$$ -17 -98 -188 -170 -120 -111 -299 36 -40 176 -37 -101 155 -167 -15 -119 12 -356 -173 83 69 -26 1 -163 43
5117D3nO2o0J66j78j86J71K20l74q0J05rJ26K4j93K68k9j7j33RL22L1J28n78J86
$$ 43 38 100 40 206 28 -158 13 233 -141 -221 -116 -125 1 25 -168 100 71 54 -79 -70 252 283 411 -167 19
5142A9K8J71r7l39P9j00J43P8N5k56J14R1J93M4j33j15J48j53j0k47J45J73j19
$$ 19 47 218 121 -218 -139 -239 -96 -18 37 -219 -105 -14 179 223 90 -25 123 -30 -40 -287 -142 31 -88
5165h8L92m91J96J69k67K16k47r9K47J41j01J73j86j80K8j50M52j99L9j99K73
$$ -88 304 -187 9 178 -89 127 -120 -219 28 169 68 241 55 -125 -97 -247 205 6 45 -154 119
5186A19n01O43n68K89p4j74K15m0J21r0j91M25k24k83L95k84O6J77k54J42J7R8
$$ 119 -382 261 -307 -18 -92 -266 -51 -91 30 -60 -251 174 -50 -333 62 -222 -156 21 -233 -91 -74 24
5208B4j22J90J24r2J40l92j98M18J04m15K47l7j99K94j65R7K24l42J54l03L51
$$ 24 -98 92 216 124 264 -128 -326 92 196 -219 28 -9 -208 86 -79 18 242 -100 54 -249 102
5229A02L1m1k78J46N6o2k7K44j03j74K51R1l03j86l3J51K1j88J4J23L20l59K28
$$ 102 133 92 -186 -40 16 -46 -73 171 68 -106 145 236 -67 -253 -286 -135 -114 -302 -288 -165 155 -204 24
5252B4J49l07J75Ol00K49J15k45M09k31R6J17k29K39j52j05L9K3k30JK12o6J08
$$ 24 173 -134 41 47 -253 -4 111 -134 275 44 140 257 28 267 115 10 49 72 -158 -157 55 -11 97
5275I7M9l43L37L1l25j80K62N4Q5p2j67Q7L11k83j68L23q6q3j80j6M0N24k37k36
$$ 97 146 -197 140 171 -154 -334 -72 -18 67 -5 -172 -85 226 -57 -225 98 12 -71 -251 -267 -227 297 60 -176
5299a76o8K05n9j83J56R3n7j52L74J54k28j39p8K09j72q4K13k43L04L9o4JL10
$$ -176 -244 -39 -98 -281 -125 -32 -89 -241 133 287 59 -80 -158 51 -121 -205 8 -235 69 108 44 45 355
5322C55l34K3p4J09j76M3k45M82j95J69Q9k61o5r5J46O4M73o87J28J86l5K66m32
$$ 355 21 44 -30 79 -97 -54 -299 183 -12 157 246 -15 -80 -175 -29 35 508 -179 -51 135 100 366 -66
5345f6j42K5J44K51J25n8k85J36j64k56M78m75M33k03l3K7n1N6J12j39J16j78
$$ -66 -208 -183 -39 212 337 279 -6 130 -34 -290 188 -287 146 -57 -90 -63 -114 -58 54 -85 31 -147
5367a47n9J42l7K35k67J64j63K31J09n2r9J54k77r1N09m91J44lP6j05K0J77p5
$$ -147 -206 -64 -101 134 -133 31 -132 99 208 156 57 211 -66 -157 352 -139 5 2 78 -27 -7 170 95
5390I5J08J6l89J72L9k24K45O6k91P6K1J59j10o2l2P9K2j30M2L45l14J98r7J42
$$ 95 203 219 -170 2 41 -183 62 128 -163 -87 -66 93 -17 -79 -111 -32 -10 -140 -98 247 -67 131 34 176
5414A76l13J68O7R4J59l31l12J9M57k88n1M38n44L7L37M8l95M90l49Q5k3J50j61
$$ 176 -137 31 98 192 351 20 -292 -273 184 -104 -155 283 -261 -224 113 161 -234 256 -93 -8 -31 119 -42
5437d2q9n7J97n0P4L37k16q3j79l4K72N9l10J82J02k44L17k45m5K25k19L89l19
$$ -42 -131 -188 9 -41 33 370 154 71 -108 -142 130 189 -121 61 163 -81 236 -9 -54 171 -48 341 22
5460B2j54J98m05J75n5M34J5k28J2j02L7K03k55L00l04j24K19j2j5J71j55p1J02
$$ 22 -132 66 -339 -164 -219 215 230 2 14 -88 -51 152 -103 197 -107 -231 -12 -24 -39 132 -23 -94 8
5483Hj86j70N13N4j21l2k39K42k93J44Q6n8K67l12J01L1k90K45K3M9m7J46j97
$$ 8 -178 -348 165 219 98 66 -173 69 -224 -80 6 -52 215 -97 4 35 -255 -10 13 62 15 161 -36
5506c6K91m60J07J81m7J95j9k36j33L77k53%L3R9l22J71k24K85K7j39R6r1l8j6
$$ -36 255 -205 -98 83 36 231 212 -24 -157 220 -33 -33 0 99 -223 -52 -276 9 36 -103 -7 -98 -136 -152
5530a52K36M6k25K28R5k59j57L58k05j3o1J17J34j18p5P2o2M2J8n0N4j71R5jN4
$$ -152 84 130 -95 133 228 -31 -188 170 -35 -48 -109 8 142 24 -51 21 -41 1 19 -31 23 -148 -53 -54 0
5555@J32j33L35k19l35O8K0J39j14j9Q1lj4J52j12J10j04j06K3J31J5k10L31k08
$$ 0 132 -1 334 115 -220 -152 -132 7 -107 -126 -45 -48 -62 90 -22 88 -16 -122 -99 32 47 -163 168 -40
5579d0k9J12J77j78m2p5L5R5j48K0j73N10l11J5n6M65m49J40j32J93j11j62O7
$$ -40 -69 43 220 42 0 -75 -40 55 -93 -73 -246 264 -47 -32 -88 377 -72 68 -64 129 18 -144 -77
5602g7K13m51L18J82n60J09J28L59k04J6k5K48m0k85l10L87k20Q3L60r5j41Q0
$$ -77 136 -315 3 185 -375 -266 -138 221 17 33 8 256 216 -69 -379 8 -212 -129 231 136 -5 75
5624G5j2j71K55k87j00M43o45N35j65p6J27J83k30K62l3J48l77j74J85j60K86
$$ 75 63 -108 147 -140 -240 203 -442 93 -72 -148 -21 162 -68 194 161 309 -68 -242 -57 -217 69
5645F9l6l67K91p6j69J9M79l29O5K94n14J84R0J63l40J2k4J45R6L8m7j83J16k00
$$ 69 33 -334 -43 -119 -288 -269 210 -119 -54 240 -274 -90 0 163 -177 -165 -189 -44 52 90 43 -140 -24 -224
5669b24K92j7M7l58K41J18j34k58K5N3K93Q9j35j73K24op3K21j28Q9k22J27j29
$$ -224 68 51 98 -260 -19 99 -35 -293 -268 -215 78 167 32 -141 83 77 4 225 97 186 -36 91 -38
5692c8K11K91m57J30n00K86P3j20R3j00k1J8J62r7M1r4J54p3PK8q0j93P2J51j61
$$ -38 173 464 7 137 -363 -77 -4 -124 -31 -131 -152 -134 28 -69 -28 -122 32 -41 -34 -6 -86 -279 -207 -56 -217
5717b17M48N9l30L54l19J29k29M68k93k75J19K66j52O1m8K13P5j26k81J72j70
$$ -217 231 290 -40 314 -5 124 -105 363 70 -205 -86 180 28 89 41 254 329 203 -78 94 -76
5738g6J09J4P9Q1j32o9qj91N29k36l84M41j6jj30J39m96J39J93n4J95n2j35J10
$$ -76 33 47 126 207 75 6 -2 -193 336 100 -284 157 141 140 10 149 -347 -208 -15 -69 126 74 -61 49
5762D9po9RK0K15k47J18j26M5j81K06Q3j70O7j99R9n6M11k12r4k25N03k99Oj60
$$ 49 42 -27 -18 2 217 -30 88 -38 7 -174 32 115 -55 12 -187 -88 -144 267 55 -39 -264 239 -60 -54 -214
5787b14K44j04j31L99j87J78j9n0p0J1o2o0l28L17N28m39J9L31o01K42k76K71
$$ -214 30 -74 -205 194 7 185 166 116 46 57 -5 -65 -393 -76 452 13 32 363 -238 4 -272 -1
5809aL69k48k31Q7J84o9k11k27M11J04j94n0J12l59L01j26K42K5j26J10J62m11
$$ -1 368 120 -111 -24 160 91 -120 -347 64 168 -26 -76 36 -323 -22 -148 94 119 -7 103 265 -146
5831a46O2K0J97k31j05M07p3j78L5k98N39n03N05l11M35l57j04K07M7l24R1Q7
$$ -146 -84 -64 133 -98 -203 204 131 -47 -12 -310 229 -274 231 -80 355 -2 -106 101 148 -176 -85 2
5853BQ2l18K08Q7K24M6k74J16q6qj16j32j02K54q3L42l97J64lJ41k63L64m1p6
$$ 2 84 -234 -26 61 285 331 57 173 87 79 -37 -169 -271 -17 -100 242 -155 9 6 147 -116 248 207 131
5877A31j33J0j49L22j22L1J77k21q6J80r1j36M13n1k67j08J93k03k02O5l1M74
$$ 131 -2 8 -141 181 59 90 267 46 -40 140 49 -87 326 275 8 -100 93 -110 -312 -247 -278 196
5899A96rj87J37L3k21R8M4R8j62j64P4L72O4l00j21J65j45j60L23l45J45J45j6
$$ 196 187 0 137 170 -51 47 91 189 27 -137 -63 309 373 73 -48 117 -28 -188 135 -210 -65 80 64
5922F4N7j42L47k77l5OJ4qK6j82J6J07k93L96m6m4k38N01j77j70J65k28J0J6K78
$$ 64 121 -21 326 49 14 20 34 26 52 -130 -114 -7 -300 96 50 6 -232 269 92 -78 87 -141 -131 -115 163
5947A63m18J38o1M42k08j87M01L2j8k34p1J50j85N2o6J35k53L34J84l04J93j73
$$ 163 -255 -117 -178 264 56 -131 270 302 284 50 -21 129 -56 -4 -70 65 -188 146 330 26 219 46
5969D6r1k4Q9N1r1J93k13p6K38k01k4m8J98j79qL43l80J24N7K8l96L78J20r5J5
$$ 46 -45 -69 20 71 -20 173 -40 -116 122 -79 -103 -151 47 -132 -140 203 -177 -53 4 32 -364 14 134 39 54
5994E4k69J72N6k0rL11k75N3k03J55k15K64K8k35L5r6J78J55k24J82mk82o5O6
$$ 54 -215 -43 13 -7 -16 295 20 73 -130 25 -190 74 102 -133 -98 -194 -16 139 -85 97 93 -189 -254 -188
6018a88L10j89K65j20j32j15K08k07L39j39J04L9j72L0O4n93M76l6J59r1j24L36
$$ -188 122 -67 198 78 -54 -169 39 -168 171 32 136 175 3 33 97 -496 -20 -56 103 12 -112 224
6040B24k2j20k39K50J80l55km1k2L35k24j18K71m5Q6N3m11J77j15K32Lo1J59r6
$$ 224 202 82 -157 93 273 -82 -84 -125 -147 188 -36 -154 117 72 158 211 -200 -23 -138 94 97 36 195 99
6064I9l31J16K69j89O6K34l05J07j17N15l93j36R1K29k46p1J09j23j14K46N0l65
$$ 99 -232 -116 153 -36 30 264 -41 66 -51 464 71 -65 26 255 9 -62 47 -76 -190 56 106 -259
6086b59L38n8J8K7j13r6K53j09J69M0k18k31L30l12P4oN8J31K90k08j5j14j2j26
$$ -259 79 21 39 66 -47 -143 110 1 170 210 -8 -239 91 -221 -147 -153 -95 36 326 118 103 -11 -23 -149
6110a49L8K05n0q8Q0O6M4p6j87j09L69O9j93pK20j94J18k23K05o1j19K34m63K32
$$ -149 -111 94 44 -44 36 102 146 70 -117 -226 143 212 19 12 232 38 156 -67 138 77 -42 192 -271 -39
6134c9j50J38P1j70J19k35L27j9k30M94Ol13k85K00K78j78j15mJ72l4O4J03j58
$$ -39 -189 -51 20 -150 -31 -266 61 42 -188 306 312 -1 -286 -86 192 14 -101 -105 67 33 97 200 42
6157D2J42k56J29M9R9j65l8l7K32k33K61P8l36j2K85j34k14J65j06j70N11m35
$$ 42 184 -72 57 106 205 40 2 -35 197 -36 225 303 -33 -45 240 106 -108 57 -49 -219 292 -143
6179a43J06j12M9pr8L14p1J03k94j12L75rn8k45K21j05k1M8k58J61K29R8j10j35
$$ -143 -37 -149 -100 -107 -205 109 38 141 -153 -265 110 101 43 -202 19 -86 -107 -59 -317 -156 73 171 61 -74
6203g4L9P7J79k16j45k0j55J32L8K29K3Mk93K62j70m4K71l22j03J79pO6K06kj61
$$ -74 -35 42 221 5 -140 -160 -315 -183 -145 84 107 111 -182 80 -90 -134 137 -185 -288 -109 -116 -50 156 154 -7
6228gK05k44J43j99K27J30l25J37k36K57K12l43mk38K85k53q2M63j46j10R5J48
$$ -7 198 -46 97 -102 125 255 -70 67 -169 88 300 -43 -47 -285 0 -253 -335 128 -18 -128 -33 115
6250A15N1l5j42j19o0L31k87M8Mj47L64q9o3j87M43m19j18K75L02m15J28j33K91
$$ 115 166 131 -11 -130 -190 141 -146 -98 -94 -241 123 34 -29 -216 227 -192 -310 -35 267 -148 -20 -153 138
6273A38R5p3m54K85J8J68j77O7j62J40j84J41J2l29K78Q4q0J20k94K31j7o3j31
$$ 138 233 160 -294 -9 9 177 0 67 -95 45 -139 2 14 -315 -37 47 -33 87 -207 24 7 -56 -187
6296a87J12K32j05o5k61J47J56J2k01K51kK1l68K35mk1k38M76k22K2j23K98l83
$$ -187 -75 157 52 -13 -274 -127 29 41 -160 91 89 110 -258 -23 -27 -48 -286 190 -32 -10 -133 165 -218
6319b18K00m8L70m67K78j37j80K12Ko4l42N64m3p5j40L30l24K37k16l2L79k25
$$ -218 -18 -66 304 -163 115 -22 -202 10 12 -52 -394 170 127 52 -88 242 -82 155 -61 -93 286 61
6341F1k70L66J58m91MM9j37JK0J93M3J45q3o6J26J06l26J44j97K18r2K53Rl76
$$ 61 -209 157 315 -176 -172 -123 -260 -259 -239 -46 -3 142 59 -7 119 225 -101 43 -154 64 -28 225 234 -142
6365a42L16k41K1n4M41o86M57j46L45n26J57O6J18j69k57J61k04L80n3q1J07R6
$$ -142 174 -67 -46 -100 341 -345 112 -34 311 -215 -58 8 126 -43 -300 -139 -343 37 -16 -97 10 106
6387A06L7N9k58Qk74M42j96J5N9j4rp8L29k58q9l46N83N3j95k25J03J54n9j53
$$ 106 143 202 -56 -48 -322 120 -76 -61 -2 -16 -25 -103 226 -32 -121 -467 116 169 -26 -251 -148 6 -53 -206
6411b06K84L09j35m14K31j77j06J71rJ86j3K8l02O5j79K43j69L74n6J04j09r0
$$ -206 78 387 252 -162 69 -108 -214 -43 -52 134 121 149 -153 -88 -267 -24 -193 181 125 229 120 30
6433C0j07L21m20K91k43J33K05J7k1q2l4l43K81J14k69P8J41n4o7q2j2Q3k92L17
$$ 30 -77 244 -176 115 -128 5 210 227 206 124 90 -253 28 142 -127 -49 92 38 -29 -111 -123 -40 -332 -15
6457a5j6L0K29j74O6p8r6J11K61m70Pj94J62K85J23n29K92l22M41N7j75N5n2P4
$$ -15 -31 -1 228 54 120 42 -54 57 318 -152 -145 -339 -177 108 231 -298 -6 -328 113 170 -5 50 -2 72
6481G2j43k29L84O2r2k68J98K17l6k59j6O5l68M97q8j38l2J20NK00J22n77M38
$$ 72 -71 -300 84 146 54 -214 -16 201 165 -94 -110 -45 -413 84 -4 -142 -174 -54 -49 151 273 -304 134
6504A34j20O2k26K06j25l9K96l57L94l45o7K17j17q4k8M91k99j02j18L08O8o2
$$ 134 14 76 -150 56 -69 -108 188 -169 225 -120 -187 30 -87 -171 -199 292 -7 -109 -227 81 149 87
6526H7q6J86O5n13K49K87k76pj07J70K02l94L60l71K7K2P8L23l12K72j41l77K14
$$ 87 1 187 252 -261 -12 275 -1 -8 -115 55 257 -137 223 -148 -121 -99 -21 302 -10 262 121 -256 -42
6549d2pj55m7L50L1k01J70l20j87J79K68j05O4k32L56l28K00k03J37j37J35J67
$$ -42 -49 -204 -251 99 130 -71 99 -221 -408 -229 39 -66 -2 -234 122 -206 -6 -209 -72 -209 -74 93
6571I3q5j25k3Jj09J51J22O8k41J05q9J4K35j08j10K80j22o2K95l06N5L71l19
$$ 93 8 -117 -140 -139 -248 -97 25 93 -148 -43 -132 -118 117 9 -101 179 57 -5 290 -16 39 410 91
6594I1J67j73l69L36m0J6p5lO8n3j62J35L13j84j70K53m04K96J60Mm23K36m4k38
$$ 91 258 85 -284 52 12 28 -47 -50 18 -35 -197 -62 251 67 -103 150 -254 42 202 206 -217 19 -25 -263
6618b63K69r3J39p4o7M4N8NJ2P5J11j9k25K01j79L07k30M5l23K03Q0q2o1k55R
$$ -263 6 -87 52 -22 -89 -45 13 18 30 105 216 197 -28 173 -6 301 71 116 -207 -4 76 -6 -67 -322 -313
6643c13N78j75k6j3l8m1j05K35j87k9j65L47K2J31r6K1k09P0P%j34K03RJ08j98
$$ -313 265 90 64 51 13 -28 -133 102 -85 -114 -279 68 90 221 125 146 -63 7 14 14 -120 83 92 200 2
6668Bj76J96L7j79L27k43K0N5j30J36k10M47m39L13k90J98J02m5l32Q7L24o0j86
$$ 2 -174 22 59 -120 207 -36 -16 39 -91 45 -165 282 -157 156 -134 64 166 121 -211 -124 200 140 -46
6691d6O0jj31N0K00J0j37K02n0J31n66J73J59k03J83p9Rq0J88j73J8P3O5m7J07
$$ -46 14 13 -118 -68 132 142 5 207 157 288 -278 -105 54 -149 34 -45 -36 -116 72 -101 -83 -10 55 8 115
6716A15j19q2p6J41P7rJ60j12oq1R5k2m76L19j32M09k67L07J76o09K43l9N2J10
$$ 115 -4 -86 -162 -21 56 47 207 95 89 8 103 81 -395 -76 -208 201 -66 241 417 -192 51 12 64 174
6740A74m94M24j54K7o8M8k34L19J4o9Q9j30P6k50J54K10n0L2p7k68J75R3k4M9
$$ 174 -320 104 -50 -23 -91 -43 -277 42 56 -13 76 -54 22 -228 -74 136 86 118 41 -227 -52 41 17 66
6764F6q8N2j15j94Q5J88j94N48n34Q6j9K3N3K47l85J47qp2j11M7J88j27J11J94
$$ 66 -22 30 -85 -279 -194 -6 -200 348 -186 -100 -119 -96 -43 204 -181 -34 -42 -114 -225 -178 10 -117 -6 188
6788A88j04L0j94M6m2J8M18k11k30J07j06K09K7j07P0ql02K09P2j66o8OL62j93
$$ 188 84 114 -80 -34 -76 -58 360 149 -81 26 -80 129 156 49 119 111 -191 18 90 -76 -144 -138 224 31
6812C1Q8j74K28l88M20k50J0q5J13K32j22j32J89l45J65r9J64j65K28j49J83j73
$$ 31 119 -55 173 -215 205 -45 -35 -120 -7 225 103 -29 160 -185 -20 -119 45 -120 108 -41 142 -31
6834c1rj55r9M76N4j66j35N7L15j37k45m1K73r4j56N36o52J27k3K6m3J65l24K59
$$ -31 -40 -195 -294 182 236 70 -65 -8 307 170 -75 -116 157 63 -93 443 -209 -82 -105 -79 -122 43 -281 -22
6858b2k01J82l6j54m5M92l00L00k08j8K14k78jL37j58Lm2j30j44O9K75j08p1N7
$$ -22 -223 -41 -77 -231 -276 216 -84 216 8 -10 204 -74 -75 262 104 107 65 -65 -209 -140 135 27 -44 13
6882A3J46N7j95j11m9K31l22K92K94k14J5j46J30L6j14j27k4J8L01m20l1J56K26
$$ 13 159 216 21 -90 -139 92 -230 62 356 142 157 11 141 177 63 -64 -88 -70 231 -189 -220 -64 162
6905A62M5o3k31K05o6Q6m62N42j44j39J59l21K53k68K02K30k63L99l13J50J7j69
$$ 162 207 144 -87 118 52 138 -324 218 74 -65 94 -227 26 -242 -40 190 -73 326 13 163 180 11
6927A1q3k18K85N5k03K64k20N57k36l17L1j31K14L41k57L9n2kj78K37l64L37j21
$$ 11 -72 -290 -5 50 -153 111 -109 448 212 -105 -74 -205 9 350 93 132 80 78 -100 137 -227 110 -11
6950a1K01k66J11k6j91J79J46M4m2l3l49L80q0l5k05J1R2J77k07Om3M75m11P5
$$ -11 190 -76 35 9 -182 -3 143 187 145 112 -237 143 63 28 -177 -166 -74 103 -104 -98 -141 334 -77 -2
6974bJ6m87M76Kk02k38O15j91J87j41j1k21k3M29j94k19J65J06k77K92q8j78K26
$$ -2 14 -473 3 5 -197 -435 180 -11 176 35 24 -197 -220 209 15 -204 -39 67 -210 82 -6 -184 42
6997D2Q3mr0j5J26K2m16J94j39K03K25k40j18J7K64j27J86n4J81o04L50l00K74
$$ 42 125 121 31 16 142 164 -252 -58 -197 6 231 -9 -127 -110 154 27 213 159 340 -264 86 -214 60
7020F0r7l19M17k26M21k59L21j83l20J16l1r2J62r7Q6JJ96j23l6k80K95J11K13
$$ 60 -37 -356 61 -165 256 -3 318 135 -185 -69 -100 -192 -30 -127 -41 -40 156 33 -3 -283 12 123 336
7043C36n40J74J4L14k98K80k10K2L4j72J74j24J16l1o0j02K88l88K56J3j85m2
$$ 336 -204 -30 -16 298 0 280 70 92 126 -46 128 4 120 89 29 -73 215 -173 83 96 -89 -131
7065a31M50k31j09k26J32k48N55k67J40j15qM31m00N1OJ69p3j56m2J75m9j03L06
$$ -131 319 88 -21 -247 -115 -363 192 -75 65 -50 -58 373 -27 24 30 199 126 -30 -72 103 54 -49 257
7088B57k76J42k17J90j33L40l00j26J22K28k07j19J10p4J02j11J9n2J74M9K0M6
$$ 257 -19 123 -94 96 -37 303 3 -123 -1 227 20 -99 11 -63 39 -72 -53 -105 69 118 138 184
7110A84j38K30m25K66O8k20L11k17J11o9k96K24J97j41r4J00J72l01L7P6j14j36
$$ 184 46 276 -149 117 185 -35 276 59 170 101 -195 29 226 85 -9 91 263 -38 -1 75 -39 -175
7132a75J85Q9n8n6m5M5n6J6K89k84M1K8l27N50l09K48k5p7k45J99J88j50k50K99
$$ -175 10 99 41 -15 -60 -15 -71 -55 234 -50 -9 19 -308 242 -67 181 156 79 -166 33 221 71 -179 120
7156A20m0m86K79L35j34J31l04j03K26%qJ74r2j38K32k25M6J75j00l07K49j74
$$ 120 80 -406 -127 208 74 205 -99 -202 24 24 16 190 98 -40 192 -33 13 188 88 -219 30 -144
7178a44K28K6k64J23O9J1Q1j16J90k63K80l25J54o3j8l%J37k71j37n7L79l9J05
$$ -144 84 110 -154 -31 38 49 130 14 204 -59 221 -104 50 -13 -31 -34 -34 103 -168 -305 -362 17 -22 83
7202H3J02l13K11n2N3k26pJ67O4j13n1K8J51j21j44K65k57N6K50m8M6m09L97o6
$$ 83 185 -128 83 31 84 -142 -149 18 82 -31 -82 -54 97 -24 -168 97 -160 -104 146 98 144 -265 132 66
7226F6k91K46K18l85k57L55L20l07j75K26n6r9K41r7r6K15l35M21l50N0J41j57
$$ 66 -225 21 239 -146 -403 -48 272 -35 -210 16 -40 -139 102 5 -91 124 -211 210 -140 -90 51 -106
7248a06J46l9J81m23M72k93L82m05r7K26j7k44J32J50p1K63k11k31Q8k0j41M1
$$ -106 40 1 182 -241 231 -62 320 -85 -182 44 27 -217 -85 65 -6 257 46 -185 -97 -117 -258 -217
7270b17J28Q9j74M0R9J27j9p8N0l12L02q3n7M7L2J92m4mN8J35n8k88l37L89Pk8
$$ -217 -89 0 -174 -134 -35 92 73 -5 45 -267 35 -48 -105 -58 -26 166 122 118 176 311 253 -35 -372 17 24 -4
7296dK54j63Q7k70R2j40K24j05K1mk50M60k27J72j45m0m3j2J53k28J01k07mo6
$$ -4 250 87 174 -96 -4 -144 80 -25 -4 -8 -258 202 -25 147 2 -38 -81 -93 60 -168 -67 -274 -278 -344
7320c44K07j32M82k05l58M78K02o7l66R2K8k91J29J72J26j91o4J08J79j72p5m8
$$ -344 -137 -269 213 8 -350 128 330 263 -103 -11 17 -274 -145 27 153 -38 -102 6 185 13 -62 -110
7342a10M6J96n9k7r0R2l11J72l1L3j01K01k80J54K13k39K75l06P9J35J68k61j86
$$ -110 -64 132 73 46 -44 48 -263 -91 -122 -89 -190 11 -269 -115 98 -141 134 -172 -93 42 210 -51 -237
7365b37K81%R7o0lj00jJ07j82k5M93m20K83k24J16k67j5L85p1pJ69l70l2j04K96
$$ -237 44 44 141 81 78 -22 -23 84 -98 -123 370 -50 233 9 125 -142 -157 228 157 150 319 -51 -83 -187 109
7390A09k33J41k68J44K26j01k5o2N5r8K59j5J35l79K28k30j48N31k81r2K50j69
$$ 109 -124 17 -251 -107 119 18 -7 -69 -14 -112 147 132 267 -112 116 -114 -262 269 -12 -104 146 -23
7412b3j87J88j02r8R7J84J58om07K31O6k75K37j59Q8n7J6Q8K01k77n9K17k0J12
$$ -23 -210 -22 -124 -222 -125 59 217 211 -196 35 101 -174 63 -96 -8 -65 -49 39 240 -37 -96 121 101 213
7436B13k15K82j97o3j44M19k69j08j19m0J42J75r8J56N8k35r5L33l64J20J67j32
$$ 213 -2 280 83 20 -124 295 26 -82 -201 -241 -99 76 -22 134 192 -43 -138 195 -169 -49 118 -14
7458a4q1j01K44k45K90k71j17L32P5m1K8j62j98J30K71j85J16k31K21j41J54P3
$$ -14 -95 -196 48 -197 93 -178 -295 37 112 71 99 -63 -261 -131 140 -45 71 -160 61 -80 74 147
7480A47j29J02k9j87J66q5j57M06j53l87M48k74k8K25k04Q0N2j65L03l69K79m5
$$ 147 18 120 91 -96 70 -15 -172 234 81 -306 142 -132 -160 65 -139 -59 -7 -172 131 -238 41 -4
7502dj12J64j13J43j23K37j48J16m13J63L26k96R7k03J73j30L33j54l36J05N7
$$ -4 -116 48 -65 78 -45 192 44 160 -253 -90 236 -60 37 -166 7 -123 210 56 -280 -175 -118
7523a18k07M90k32K3K00j80J1qj86J41P1j59J70j03N5l6R3M8J41j94rJR3O8n11
$$ -118 -325 165 -67 -44 156 -24 -13 -21 -207 -66 5 -154 16 -87 -32 -68 25 73 214 20 11 12 105 173 -338
7548c38L95j91K36j15N3J54r7j95J37J67k0m07p1J98Q6o1k18K2K9L97K57m09R8
$$ -338 57 -134 102 -13 40 194 97 -98 39 206 186 -221 -292 -94 -8 -69 -287 -265 -236 161 418 9 107
7571A07j88J47k61J94p0M55l75k39J70r4L73k36o2J5j35K26j54J42kk7n1K5j87
$$ 107 -81 66 -195 -1 -71 384 9 -230 -60 -154 219 -17 -79 -64 -199 27 -127 15 13 -14 -65 -40 -227
7594b27J25J19j6K2p1Jj65K73j78p8J8J16K98P6l48l7J51l7o2R6j29P7k67J25
$$ -227 -102 17 1 23 -48 -47 -212 61 -117 -195 -177 -61 237 313 -35 -72 79 42 -20 76 -53 24 -243 -118
7618a18L11k73N7k00K09m10M17M4J1N0j00O0j62J78K00k15l7K91m96J21j06L60
$$ -118 193 -80 -23 -223 -14 -424 -7 37 48 98 -2 58 -104 74 274 59 22 313 -183 -62 -168 192
7640A92k09M8J85m98K31j96K66k3j31N9J77K1l39Q3J21j96K19Q4j13J8M03k88
$$ 192 -17 31 216 -282 -51 -247 19 -4 -135 -76 101 122 -217 -134 -13 -209 10 94 -19 -1 402 114
7662A14l69J95K62l2mj39m0k1Qk16R1J29p4K59k31Q9M33l11K1l10J68k01K83K3
$$ 114 -255 -60 202 170 166 27 -13 -34 -26 -242 -151 -22 -96 163 -68 21 454 143 164 -146 22 -179 104 127
7686A27l26J0L10p8l65M61l54L14j20N1j8j51L54k62j02K04j49N2Q3Lj32o4J49
$$ 127 -199 -189 121 43 -322 139 -215 99 -21 30 12 -139 215 -47 -149 55 -94 -42 41 44 -88 -152 -3
7709cj22J47N1l41L46m08J76L45k19j1J07n1j83L12l27K52J64p6n53N31m5j73
$$ -3 -125 22 73 -268 78 -330 -154 191 -28 -39 68 17 -166 146 -181 71 235 159 -394 137 92 -81
7731h1N3j78J19M3O9m6o2J11k77K29O5K2q1rp1K23l40J64l9J41J75l1j3m07J85
$$ -81 -28 -206 -87 -44 25 -21 -83 28 -249 -20 45 67 -14 -23 -94 129 -211 -47 -86 55 230 199 186 -221 -36
7756c6J89k82K70J02m52K10j3K40n90J99K77J43j01j65K75j22j81M8q3Q4K22l57
$$ -36 153 -129 141 243 -209 1 -12 228 -362 -163 114 257 156 -9 266 144 -37 11 -72 12 234 -123
7778a23L35o7j59j1J02J36l21J39M6k06J72N8k29K5L07k24M5J6K2j89J28j52J46
$$ -123 212 145 -14 -25 77 213 -108 31 77 -129 43 101 -128 -103 204 -20 25 41 63 -126 2 -150 -4
7801dp7J08K60m38n7k30K91n6M15k55j21K88k55O86n77K03l83J16j74M35J99k05
$$ -4 -81 27 287 -151 -208 -438 -147 -203 212 -43 -164 124 -131 555 -22 181 -202 -86 -260 175 374 169
7823A69k38k2j45L35Oj31j70J20K02m3p8J61j61j25K83J0o0k06Q4j09K14k23k8
$$ 169 -69 -91 -236 99 105 -26 -196 -76 126 83 5 166 5 -120 163 173 113 -93 -9 -118 96 -127 -155
7846a55P0J70N7j83k11K38Qr5l9L48k43r0L29k26n0M19l88J1k39O10o92L77r5
$$ -155 -85 85 142 -41 -252 -14 -6 -101 -140 208 -35 -125 204 -22 -72 347 -41 -30 -269 341 -351 26 -69
7869f9K67l15j58P1L12k00K41j34K44O4l61J92j24J47%l00M40n68l1M80l8J53
$$ -69 198 -117 -275 -204 108 -92 149 15 259 323 -38 154 30 177 177 -123 317 -251 -282 198 160 313
7891C13l94M53m50K89j5k46L1OM1O2K3J32j63l08L76l68J73m3K67R0k42K61o10
$$ 313 -81 372 -78 211 196 -50 -19 -13 28 90 113 245 82 -226 150 -218 -45 -88 179 269 27 288 -322
7914c22L10n3j8J25l6k07J16J50k98K99J33M7j14m11L19R7o45L39Q5o7q5K40j19
$$ -322 -12 -65 -83 42 6 -201 -85 65 -233 66 199 246 132 -279 40 137 -508 -169 -84 -151 -236 4 -115
7937a15P4K01l63M83k04k44L85p1j45j89J84N9L16l85q5M2M9j52K20o6O3O1l26
$$ -115 -41 160 -203 280 76 -168 217 146 1 -188 -4 55 371 -14 -99 -57 -8 -160 60 -6 57 118 -208
7960b08J78L98n08j66K09Q6j01K67j82K94m40QJ1P3K06k17M26l88L02k26M6j30
$$ -208 -30 368 -140 -306 -97 -11 -112 155 -27 267 -173 -165 -154 -81 125 -92 334 -54 248 22 68 -62
7982f2K07k02M2Q4k86M11k87R0k94j7J21M2J88j41J33j63K67j62j8r0m4N9k74
$$ -62 145 -57 -15 69 -217 194 -93 -3 -297 -314 -193 -151 37 -104 29 -134 133 -29 -47 -137 -181 -122 -396
8005c96N38j91M48l69K9J45o3l23pJ63mK21l06L49l6K1k03j46K19rk02J56K5L5
$$ -396 142 -49 399 30 59 204 141 -182 -189 -26 -30 191 -115 234 198 219 16 -130 89 80 -122 34 59 94
8029I4j30J32j6m1j13m8K92j47o1M0J11l19K66n8K31j17j63J6k03K81m3r8L64
$$ 94 -36 96 80 39 -74 -122 170 23 -38 2 113 -206 60 2 233 116 -47 -31 -234 47 4 -94 270
8052B70m78M7K93k37j25J83k34L49k30K15J1J08j65j35L50k81Q1N1q3Q4j08r0
$$ 270 -208 -161 132 -105 -230 -47 -281 68 -162 53 64 172 7 -128 222 -59 22 73 -10 74 -34 -124
8074a24Q8m8J86n4m34j04P50n05K45K54k80K7K14k26J5k23n7L16J95l96K96m75
$$ -124 -36 -84 102 48 -386 -490 260 -245 0 254 -26 1 215 -11 4 -219 -276 40 235 -161 135 -340
8096c40L21r5j03K94Q3j93J35j00Q8k01j70J53R7J38l23L17o09M71L00m08P2J39
$$ -340 -19 -114 -217 77 160 -33 102 2 90 -111 -281 -128 -31 107 -216 101 -508 -37 263 -145 -73 66
8118F6j78J67j08J43p4Q5m06J62J25K0K1j6j75K91M7k80L32j02j87O0k53O09l71
$$ 66 -112 55 -53 90 16 101 -305 -143 -18 2 23 7 -168 123 170 -110 222 120 -67 -7 -260 349 -22
8141b2j55K05lo9J6L7k1K22m6J3n4l80K93k41J56j18K34k12K37j60j80K43p1K62
$$ -22 -177 28 25 -44 -28 9 -12 210 164 177 123 -257 36 -205 -49 -167 67 -145 92 -68 -248 -5 -76 186
8165A86m57N22m33J74K00l0j05K27Kl08K22k85J12QJ96m29K17J0N5P9k28j54N97
$$ 186 -271 251 -182 -8 192 162 57 284 286 -22 200 -85 27 35 231 -198 19 29 84 163 -65 -219 378
8188C78j70j18j15
$$ 378 208 90 -25
8191b5
$$ Imaginary data points
##PAGE= N=2
##DATA TABLE= (X++(I..I)), XYDATA
0@%%%qJ6j6J6k4L9m7N6p2Q8j04J28j60J92k31K75l24L82m45N14n94O84p83Q94
$$ 0 0 0 0 -8 8 -8 8 -16 23 -24 32 -40 48 -56 72 -88 104 -127 148 -176 206 -239 275 -319 365 -418 476
27D76j016J152j304J472j657J859k080K323k590K884l206L558l944M368m836N354
$$ 476 -540 612 -692 780 -877 982 -1098 1225 -1365 1519 -1687 1871 -2073 2295 -2541 2813
43B813n928O567p281Q085q997J0043j1254J2675j4371J6435j9013K2345k6838
$$ 2813 -3115 3452 -3829 4256 -4741 5302 -5952 6723 -7648 8787 -10226 12119 -14719
56a4719L3260m3264O1139j02742L67077K09903p10208J1169L47420K1301l11504
$$ -14719 18541 -24723 36416 -66326 300751 510654 -199554 -188385 159035 180336 -131168
67a31168J24563K74490j09289l33031P5046K52520k0949j89827N7740J27375o5831
$$ -131168 -6605 267885 158596 -174435 -99389 153131 132182 -57645 95 127470 61639
78F1639j23282P4721R2080o0297q4145N9296O9802k9983o0116O799K1755j329
$$ 61639 -61643 13078 105158 44861 -39284 20012 89814 59831 -285 6514 28269 26940
90B6940q844J5494J8318n690m7205l1840M2377O8452k0014p5118l029N1098j4239
$$ 26940 18096 33590 51908 46218 -987 -32827 9550 78002 57988 -17130 -20159 30939 16700
103A6700l9471M8756N3959p3713q5258O4608Q9506n9014p5553O9070O2613r4504
$$ 16700 -22771 25985 79944 6231 -79027 -14419 75087 16073 -59480 9590 72203 -22301
115b2301p0604J05603P6816j10551q0294J10430P9246j09184p8382R9242O5564
$$ -22301 -92905 12698 89514 -21037 -101331 9099 88345 -20839 -99221 21 65585
126F5585r7872n3379J04753N2569j06212o1658Q7572N8868o6294m0608N6938K2390
$$ 65585 -32287 -85666 19087 71656 -34556 -96214 -8642 50226 -16068 -56676 262 22652
138B2652o0474j7188O1847K2950n3164k9011L4635K4587j6759q098J6190k075
$$ 22652 -37822 -55010 6837 29787 -23377 -52388 -17753 6834 -9925 -18023 -1833 -3908
150c908k7905q768K8238K7873o998k5180p188J1035p08j0559J4009L0020n518
$$ -3908 -31813 -40581 -12343 15530 8532 -16648 -23836 -12801 -13509 -24068 -10059 19961 14443
163A4443l9487p829L4300P802k9227L480M1090l708m9893k293N0929N716m7772
$$ 14443 -25044 -32873 1427 9229 -19998 -16518 24572 20864 -29029 -31322 19607 25323 -22449
176b2449o57N1420K64n3497l1N6227J523n5693l575N4262O971m6714m637M3965
$$ -22449 -23106 28314 28578 -24919 -24950 31277 32800 -22893 -26468 27794 34765 -11949 -16586 27379
190B7379J638m4117k410M2621P065l6783p269L0506O555k5391n192K0022K328
$$ 27379 29017 -15100 -17510 25111 32176 -4607 -11876 18630 25185 -206 -5398 14624 16952
203A6952j8593J55K0754M083j9123j0512Q497P254k678J326Q525k512j6607p569
$$ 16952 -1641 -1486 19268 23351 4228 -6284 2213 9467 6789 8115 16640 14128 -2479 -10048
217a0048J1727J1933m548p407M468L189j1230p914J3072J0420j3005j2477J3182
$$ -10048 1679 13612 9064 1657 6125 9314 -1916 -9830 3242 13662 657 -11820 1362
230A362J3285j3891j6560J1063J4519j3121j4459J5096J7531j6158k1641J1744
$$ 1362 14647 756 -15804 -4741 9778 -3343 -17802 -2706 14825 -1333 -22974 -11230
242a1230J9604j1388j9678J0631K0457q221j9705N097J5504p926j7294Q154K0842
$$ -11230 8374 -3014 -22692 -12061 8396 175 -19530 -14433 1071 -6855 -24149 -15995 4847
255D847r56j8939m739R993J447q008L346J2821J25j3526n809Q532O040m926l581
$$ 4847 3891 -15048 -19787 -9794 -8347 -16355 -13009 -188 -63 -13589 -19398 -10866 -4826 -9752 -13333
270a3333N363M234l630l689L377J831n455k957O807P536j660n366j78J10l147
$$ -13333 -7970 -3736 -7366 -11055 -7678 -5847 -11302 -14259 -7452 84 -1576 -6942 -7120 -7010 -10157
285a0157N24Q676M852n912n962M213L569l517k239O658M006o198k790P812N114
$$ -10157 -9633 -957 3895 -2017 -7979 -3766 -197 -3714 -5953 705 4711 -1487 -4277 3535 8649
300H649p929p355N831Q932j916m843N332M907p714r387N186J2582P49p571j42
$$ 8649 720 -6635 -804 8128 6212 1369 6701 11608 3894 -5493 -307 12275 13024 5453 5311
315E311O022j653q722K50J0343K998o856k576O573K278q385m092O833N900m341
$$ 5311 11333 9680 958 1208 11551 14549 7693 5117 11690 13968 5583 1491 8324 14224 9883
330I883l637M420L157o096n711L747N694j449l694L123L146m292o392J008M680
$$ 9883 6246 10666 13823 7727 2016 5763 11457 10008 6314 9437 12583 8291 1899 2907 7587
345G587J33j593K523J742m779n729J115L588J24j317J890J155m115m256J639L320
$$ 7587 7720 6127 8650 10392 5613 -116 999 4587 4711 3394 5284 6439 2324 -1932 -293 3027
361C027k144l122K925L705k687n273Q41K312l335l632M216P549k164q174k625
$$ 3027 883 -2239 686 4391 1704 -3569 -2728 -416 -3751 -7383 -3167 4382 2218 -5956 -8581
376h581M067n20l304K785P129j599q685k952N813K622n170j270N789J830n234
$$ -8581 -4514 -5034 -8338 -5553 1576 -23 -8708 -11660 -5847 -3225 -8395 -9665 -3876 -2046 -7280
391g280k475M631J071o442k417P157N278l424l974J448P70m493j099O582N523
$$ -7280 -9755 -5124 -4053 -10495 -12912 -5755 -477 -3901 -7875 -6427 -5657 -10150 -11249 -4667 856
406H56l491m814J018K548k221j786M368L591k078l057K417K306l249k717L796
$$ 856 -2635 -7449 -6431 -3883 -6104 -7890 -3522 69 -2009 -5066 -2649 -343 -3592 -6309 -2513
421b513M415j502k018K611J920m692l651M500N548j663k465L133L226m927m854
$$ -2513 1902 400 -1618 993 2913 -1779 -5430 -930 4618 2955 490 3623 6849 1922 -2932
436b932L292O267q92l254L437L641m130o412J910O771L20l805J888L910l051n639
$$ -2932 360 6627 5735 2481 5918 9559 5429 -983 927 7698 8018 4213 6101 10011 6960 1321
452A321J362N814R6m763J335M958j013n792m04M015k22m164K397O232o66p148
$$ 1321 2683 8497 8593 3830 5165 10123 9110 3318 2914 6929 6707 2543 4940 11172 10506 3358
468C358k731L253J049k436K102N038j342o879k535M340J174l038K45L722o99m540
$$ 3358 627 3880 4929 2493 4595 9633 8291 1412 -1123 3217 4391 1353 1598 5320 4621 81
484H1j206L697n27m636l92N504J004l717j855J919j425m934M43O296K904m521
$$ 81 -1125 2572 2045 -2591 -2983 2521 3525 -192 -2047 -128 -1553 -6487 -6044 252 3156 -1365
500a365l409R24K87l802K60N524K068m205l313K136P58k705j565L510K281k893
$$ -1365 -4774 -3850 -3563 -7365 -7105 -1581 487 -3718 -7031 -4895 -4137 -6842 -8407 -4897 -2616 -5509
516e509j549K992P92m518k879L403L496j092j084K071N71n146k892M159M457j450
$$ -5509 -7058 -4066 -3274 -7792 -10671 -7268 -3772 -4864 -5948 -3877 -3306 -8452 -11344 -7185 -2728 -4178
532d178j238J542Q58m031k359L771L796j405j455K306J446l128k482K453L127
$$ -4178 -5416 -3874 -3016 -7047 -9406 -5635 -1839 -3244 -4699 -2393 -947 -4075 -6557 -4104 -977
547i77j284j101L149K229l285l033K137K114j237k53L787K432k680l878J059J843
$$ -977 -2261 -3362 -213 2016 -1269 -4302 -2165 -51 -1288 -1541 2246 4678 1998 -1880 -821 1022
563A022l68j41L462K570k737l675M80K408l52n28K864K278k788k691J303K255
$$ 1022 654 513 3975 6545 3808 133 613 3021 2669 2141 5005 7283 4495 1804 3107 5362
579E362j417j493K210K799j065k496P69J656k426k864L036M547q85k868o35K72
$$ 5362 3945 2452 4662 7461 6396 3900 4669 6325 3899 1035 4071 8618 7733 4865 4230 4502
595D502j857k073L096M406j132l697m16J243j601j835J979K650p84l029M20K055
$$ 4502 2645 572 3668 8074 6942 3245 2829 4072 2471 636 2615 5265 4481 1452 1872 3927
611C927j711l008N19K283k16j396J236J295k301m145M86K811O80o40N43L69k393
$$ 3927 2216 -792 -273 2010 1794 398 1634 2929 628 -3517 -3031 -220 460 -180 363 732 -1661
628a661l599R45K651J009j552O32K96k043j836N20K004m80j603Q30K167n31k698
$$ -1661 -5260 -4315 -1664 -655 -2207 -1575 -1279 -3322 -5158 -4638 -2634 -3114 -4717 -3887 -1720 -2251 -4949
645d949n23J234n41j273J709K867j56l346j163Q94L5n48K133K324n47k995r29
$$ -4949 -5472 -4238 -4779 -6052 -4343 -1476 -1632 -4978 -6141 -5247 -5212 -5760 -3627 -1303 -1850 -4845 -5774
662e774J484J63n90J318K750p15k367Q8J557p10j219J168K672J7j224M00J079
$$ -5774 -4290 -4127 -4717 -3399 -649 -1364 -3731 -3643 -2086 -2796 -4015 -2847 -175 -158 -1382 -982 97
679I7j525j845J605L370P5j329R20P55k128k237K234L114M20j720R02R60j883
$$ 97 -1428 -3273 -1668 1702 1777 448 1368 2123 -5 -2242 -8 3106 3526 1806 2708 3668 1785
696A785k191J755L402n67j722J064J747j261k354O02K526n52j074J169K774j041
$$ 1785 -406 1349 4751 4184 2462 3526 5273 4012 1658 2260 4786 4234 3160 4329 7103 6062
712F062l643m98K182M45o30J500K528j452m197p40K265J130j386J290K208j394
$$ 6062 2419 1921 4103 4548 3918 5418 7946 6494 2297 1557 3822 4952 3566 4856 7064 5670
728E670l701n25K848J86k447O47K436m00l079k35J800j038k471R30L669J81l036
$$ 5670 1969 1444 4292 4478 2031 2678 5114 4714 1635 1400 3200 2162 -309 621 4290 4471 1435
745A435j354J101q61k785J580L987N67l922j622J114j39k469Q01L678N97l597
$$ 1435 81 1182 321 -2464 -884 3103 3670 -252 -1874 -760 -899 -3368 -2567 1111 1708 -1889
761a889j348J590j9j911q06K842J002j612j450J410L6k781j655K844K084q21p45
$$ -1889 -3237 -1647 -1666 -3577 -4383 -1541 -539 -2151 -3601 -2191 -2155 -4936 -6591 -3747 -1663 -2484 -3229
778c229N64l65k977j256L259K357o07j699R77k78k680n44K552K186q62j303Q23
$$ -3229 -2665 -3030 -6007 -7263 -4004 -1647 -2254 -3953 -2976 -3254 -5934 -6478 -3926 -1740 -2602 -3905 -3082
795c082O72j905j198J743J840q04o7J516Q68k475j543J379J146j99P12K056J80
$$ -3082 -2410 -4315 -5513 -3770 -1930 -2734 -2801 -1285 -417 -2892 -4435 -3056 -1910 -2109 -1397 659 839
812H39k211k105Q07J956j30Q50J515J72j642j585K75J974J60j63R54Q83j200p99
$$ 839 -1372 -3477 -2670 -714 -844 6 1521 1693 51 -1534 -1259 715 875 712 1666 2549 1349 550
830E50J20Q35k37N5J050J362n87q36n10l7n37K26J531J870q34j754K2k53p05Q0
$$ 550 670 1505 1268 1323 2373 3735 3148 2312 1802 1765 1228 1454 2985 4855 4021 2267 2289 2036 1331 1411
850A411K076J197n51j970K08M88j296j83J382P98p82q15Q22K99j846q22J131J129
$$ 1411 3487 4684 4133 2163 2371 2859 1563 1380 2762 3560 2778 1963 2785 3084 1238 416 1547 2676
868B676p41j78R13%k436j501J293J813l38n75R69m72k133j589J562J846m11p28
$$ 2676 1935 1757 2670 2670 234 -1267 26 1839 1501 926 1895 1423 -710 -2299 -737 1109 698 -30
886c0P9J66j697p69Q73R13n01o49P79P01j098j164J9P35n79m15J306J490j136
$$ -30 49 215 -1482 -2251 -1378 -465 -966 -1615 -836 -135 -1233 -2397 -2378 -1643 -2222 -2637 -1331 159 -977
905i77k320l05J351p57K38J491J290j538k149J10J241n1p77J262J889j691j320
$$ -977 -3297 -3602 -2251 -3008 -2770 -1279 11 -1527 -3676 -3566 -2325 -2376 -3153 -1891 -2 -1693 -3013
922c013M26J097n53j213J034J931k36j167N65M39j359j452J797K489L9j119l23
$$ -3013 -2587 -1490 -2043 -3256 -2222 -291 -527 -1694 -1129 -690 -2049 -3501 -1704 785 824 -295 -618
939f18M31j236j010J761K095K9r19m78J79n93OR11Q38N25p80K66M25p04n22LQ58
$$ -618 -187 -1423 -2433 -672 1423 1452 533 55 234 -359 -353 558 1396 1921 1141 1407 1832 1128 606 609 1467
960A467J019m40P35N52j226j075n88J193J126J36K79k3p06j550m21J464J060Q9
$$ 1467 2486 2046 2781 3333 2107 1032 444 1637 2763 2899 3178 3155 2449 899 478 1942 3002 3091
978C091k39M24p78j140m60J184M61q25O23P90m53j057l88L18j93o75O83J649j70
$$ 3091 2852 3276 2498 1358 898 2082 2543 1718 2341 3131 2678 1621 1233 1551 1358 683 1366 3015 2845
997B845j709j036J53k22j07J420R24p37j468n40l74J49K37R24O31q49q42m00N25
$$ 2845 1136 100 253 31 -76 1344 2268 1531 63 -477 -851 -702 -465 459 1090 241 -601 -1001 -476
1016d76p47m43P30M67j39o33L83r3p33j080M34P29P89l53J20m13r28r30M0J630
$$ -476 -1223 -1666 -936 -469 -608 -1241 -858 -951 -1684 -2764 -2330 -1601 -812 -1165 -1045 -1458 -2386 -3316 -3276 -1646
1036a646R50n29o03j75n47j062P99J203K97p61j55O22m49q81m3J058K18k82L47
$$ -1646 -696 -1225 -1828 -2003 -2550 -3612 -2813 -1610 -1313 -2074 -2229 -1607 -2056 -2937 -2980 -1922 -1704 -1986 -1639
1055a639J092k82j719l78O70N82N99N73Q85o10j592q49J209Q11K7N74R59q54j213
$$ -1639 -547 -829 -2548 -2926 -2256 -1674 -1075 -502 383 -227 -1819 -2668 -1459 -648 -621 -47 912 58 -1155
1074a155p8J133M15l50K67Q64J91j206l23Q40P3o75M26J065R10r36o18J86o63
$$ -1155 -1233 -100 315 -35 232 1096 1287 81 -242 598 671 -4 422 1487 2397 1461 843 1029 366
1093C66J02L54J712M12j063o85l5M9m19P43J359J08j208p99K98N07n81j90J092
$$ 366 468 822 2534 2946 1883 1198 1163 1212 793 1536 2895 3003 1795 996 1294 1801 1220 1030 2122
1112B122L41p36r4M82l45j189l26J129O67o9j82J12q56j416j38J276O91L7k90
$$ 2122 2463 1727 1633 2115 1770 581 255 1384 2051 1982 1800 1912 1056 -360 -498 778 1469 1506 1216
1131A216K13r12j208k79J224Q89p86q3R0k15q99l00N23M31l87K0O13K72j172r18
$$ 1216 1429 517 -691 -970 254 1143 357 274 364 149 -750 -1050 -527 -96 -483 -463 150 422 -750 -1668
1151a668J83Q2J2L56J095K30j743j001R4O09J49N83P77j21j305j114P27O05oj44
$$ -1668 -1485 -1403 -1391 -1035 60 290 -1453 -2454 -2360 -1751 -1602 -1019 -242 -363 -1668 -2782 -2055 -1450 -1456 -1600
1171a600R78jr81n16N38p7k70J67N05R76l27o70J07k37m83m2J256J036l04r15
$$ -1600 -622 -623 -1604 -2120 -1582 -1659 -1929 -1762 -1257 -281 -608 -1278 -1171 -1408 -1891 -1933 -677 359 55 -860
1191h60k36N6p40L32J666L50m16n96j01K97k71k78J148N53k28n41M02K80j012
$$ -860 -1096 -1040 -1780 -1448 218 568 152 -444 -545 -248 -519 -797 351 904 676 135 537 817 -195
1210a95lM58P88l6L19M07j70j138r64O56J399R2J77K74k93p42j184Q51J129J26
$$ -195 -198 260 1048 1012 1331 1738 1568 430 -534 122 1521 1613 1790 2064 1771 1029 -155 696 1825 1951
1230A951k99K47q0n19p55M99N66l6l37N26R73r42j203L93j59K2J10Q38R74r53
$$ 1951 1652 1899 1819 1300 545 1044 1610 1574 1237 1763 2736 1794 591 984 825 847 957 1795 2769 1816
1250A816j102n55nL09J42Q78P59r92j248k49N60k25lQ03L55o34j070j61P02l46
$$ 1816 714 159 154 463 605 1483 2242 1250 2 -247 313 88 85 888 1243 609 -461 -622 80 -266
1270b66m22M09O81P9p07k03j29n89p44R92O33M08k40j153Mo23l38R79R14M7o72
$$ -266 -688 -279 402 481 -226 -429 -558 -1147 -1891 -899 -266 142 -98 -1251 -1247 -1870 -2208 -1229 -315 -268 -940
1291i40n58J65l95l68N02P34J89m06nK21l73p82K4Q08J49n0L01K82m38j057j07
$$ -940 -1498 -1333 -1728 -2096 -1594 -860 -671 -1077 -1082 -861 -1234 -2016 -1992 -1184 -1035 -1085 -784 -502 -940 -1997 -2104
1312b104M99J011R9NK40m19p86l70P26N96L31j88K71l15n68j39P59L23K73mjQ5
$$ -2104 -1605 -594 -495 -490 -250 -669 -1455 -1825 -1099 -503 -172 -360 -89 -404 -972 -1111 -352 -29 244 240 239 324
1334C24m78j87K89p8k80J042P36op27l68k03L3K34P93P91j99q18l61j8r4M24M81
$$ 324 -154 -341 -52 -130 -410 632 1368 1362 635 267 64 97 331 1124 1915 1716 898 537 519 425 849 1330
1356A330L70j72o83k1nm5J39M86L58j50k50J3J06n75p56M75N82N00k86j77J68
$$ 1330 1700 1528 845 824 819 774 913 1399 1757 1607 1357 1370 1476 901 145 620 1202 1702 1416 1239 1407
1377A407q76l62J94Q08K93m3m49N3o41n47K11Q19M82q10q2L66l90o96J26L38l05
$$ 1407 531 169 363 1171 1464 1421 972 1025 384 -163 48 867 1349 539 457 823 433 -263 -137 201 -104
1398a04l36M53O90j50j095p68Q92l36j18O30P35m56j079l30K06M50l50N25O70
$$ -104 -440 13 703 553 -542 -1310 -418 -754 -872 -242 493 37 -1042 -1372 -1166 -716 -1066 -541 129
1417A29o26q17k71K95M92j4n73N92M74r39k08K71J14m99k81R46M10k56j47m87
$$ 129 -497 -1314 -1585 -1290 -798 -812 -1385 -793 -319 -1258 -1466 -1195 -1081 -1580 -1861 -915 -505 -761 -908 -1395
1437a395j35l62J88J161O96m46j035j01M21n33K63O36R42m71o49j59P48l27j95
$$ -1395 -1530 -1892 -1704 -543 153 -293 -1328 -1429 -1008 -1541 -1278 -642 300 -171 -820 -979 -231 -558 -753
1456g53L68N71o2m27Q4K62k26p68N35R90K52m29L92j96q56n39O10J085K5k4Q3
$$ -753 -385 186 124 -303 -219 43 -183 -951 -416 574 826 397 789 593 -263 -802 -192 893 918 894 977
1477I77m40o77K0P20M35K23m30J09K42l57o33O11R0Q3J70K97n9k77o02k39K27
$$ 977 537 -140 -120 600 1035 1258 828 937 1179 822 189 800 890 973 1143 1440 1381 1104 502 263 490
1498D90K53P25L34K1o88o83k61j51R00L30j65K44n21p51n6N15J02J18K73l20j38
$$ 490 743 1468 1802 1823 1135 452 191 40 940 1270 1105 1349 828 77 21 536 638 756 1029 709 571
1519E71l85R0j29K23k21K84L92l51P7m66m95m97K50Q38L82m41J6l81m16j66k61
$$ 571 186 276 147 370 149 433 825 474 551 85 -410 -907 -657 181 563 122 138 -243 -659 -825 -1086
1540a086J016K11l4n87J64m70k98K57L36K73m91K67J3r1l44m98N14L02k4k52N93
$$ -1086 -70 141 107 -480 -316 -786 -1084 -827 -491 -218 -709 -442 -429 -520 -864 -1362 -848 -546 -570 -822 -229
1561b29p0j023m48P38M32J38J90j51J09r01l74N55Q84k02J91m13K62n17l68N18
$$ -229 -299 -1322 -1770 -1032 -600 -462 -272 -423 -314 -1215 -1589 -1034 -150 -352 -161 -574 -312 -829 -1197 -679
1581f79N11n24L39Q0L33m62n7j62J44P5J77N81N96k31q55l44J11M68j58O32N01
$$ -679 -168 -692 -353 -273 60 -402 -459 -621 -477 -402 -225 356 952 721 -134 -478 -367 101 -57 575 1076
1602A076m21m79n98Q50j99J24J41O52k50p85K21J08K3j7J74M04L35p46J81j53
$$ 1076 655 176 -422 428 229 353 494 1146 896 111 332 440 463 446 620 1024 1359 613 794 641
1622F41m93M1K60L98L43l07l77L66o16o2M03M17K59k46l09m34P2m23K69N39K52
$$ 641 148 189 449 847 1190 883 506 872 256 194 597 1014 1273 1027 718 284 356 -67 202 741 993
1643I93j23m75L64j86n90J94j9l9r1N39K1m32q15j7j36O71J93O2K00k92n91k20
$$ 993 870 395 759 573 -17 177 158 119 28 567 588 156 -659 -676 -812 -141 52 114 314 22 -569 -789
1665g89K15O54n27N18j5o00m04j8K67k2J41j32K69N9m53K63l00j76k24M30O70
$$ -789 -574 80 -447 71 56 -544 -948 -966 -699 -721 -580 -712 -443 -384 -837 -574 -874 -1050 -1274 -844 -174
1686a74K05p39o4k09j08J8K55O02R2m52l97J67l6j17N43K97j81j59k44J5K79k52
$$ -174 31 -708 -772 -981 -1089 -1071 -816 -214 -122 -574 -971 -804 -840 -957 -414 -117 -298 -457 -701 -686 -407 -659
1708f59j9J94M12k20K51p6k57j18j41M99L10M3j1j83n9k98J02M73K95k67j57K36
$$ -659 -678 -484 -72 -292 -41 -117 -374 -492 -633 -134 176 219 208 25 -34 -332 -230 243 538 271 114 350
1730C50k30m98N51M60p1n8j09J72l26j59J70L73L65m21K96J31n2n66l25Q1K79
$$ 350 120 -378 173 633 562 504 395 567 241 82 252 625 990 569 865 996 944 378 53 134 413
1751D13J37M19L08j19r01r6m6K54J33O70k73k77m7m61K11L34k86O0K35n2k05o8
$$ 413 550 969 1277 1158 257 161 115 369 502 1172 899 622 575 114 325 659 373 433 668 616 411 343
1773C43OP5j42j61M48K63j77o06q0j79j37L84N05M18q20m51l3j71J5M46O4L82
$$ 343 349 424 282 121 569 832 655 49 -31 -210 -347 37 542 960 140 -311 -344 -515 -500 -54 10 392
1795C92l40o64j22M97n37K15j3M93l18j62K87l3p45K24Q2M55OK67n64j16k41R9
$$ 392 52 -612 -734 -237 -774 -559 -572 -79 -397 -559 -272 -305 -1050 -826 -744 -289 -283 -16 -580 -696 -937 -838
1817h38J8L94K60k78j95k87P6J07k40M86K70n5j13k60R5m63N01n1N6Q1L89K7m90
$$ -838 -820 -426 -166 -444 -639 -926 -850 -743 -983 -497 -227 -282 -395 -655 -560 -1023 -522 -573 -517 -436 -47 -20 -510
1840e10k52K48k51M14j25O37K50o76p7j08NJ72K59L86r8l44k88P9M16k6j00K52
$$ -510 -762 -514 -765 -351 -476 161 411 -265 -342 -450 -445 -273 -14 372 274 -70 -358 -279 137 111 11 263
1862B63J36m4n92K04J98k02Q3L27K95o0k45k5r4K26m21K76L68J20j98l31q6j26
$$ 263 399 355 -237 -33 165 -37 46 373 668 608 363 338 244 470 49 325 693 813 615 284 198 72
1884G2K82K08M07j48m88J47J44o69M69j31J80K26m98N57r2k34m57L34kj72K08
$$ 72 354 562 969 821 333 480 624 -45 424 293 473 699 201 758 666 432 -25 309 307 135 343
1905C43J37k86j2m16M9L97L57r6K45m11m45n57K56K67N19m88K78K41p77o4rK22
$$ 343 480 194 182 -234 -185 212 569 473 718 307 -138 -695 -439 -172 347 -141 137 378 -399 -463 -472 -250
1927b50P5m2R8pj37k99J22J4o3Q7K55J24m3l58n57K30J46O9K94N02m87m59j31
$$ -250 -175 -217 -119 -126 -263 -562 -440 -426 -489 -402 -147 -23 -66 -424 -981 -751 -605 -536 -242 260 -227 -686 -817
1950h17K15J13K04J85n9J85m65k12J33J53nj45K56L57j61k90J62k86r5J96M55
$$ -817 -602 -489 -285 -100 -159 26 -439 -651 -518 -365 -370 -515 -259 98 -63 -353 -191 -477 -572 -376 79
1971G9J82j29m38J02j17r3J17M33M48k21j98r3k12L0J19K11L5K1n0K4p2l2QJ79
$$ 79 261 132 -306 -204 -321 -414 -297 136 584 363 165 72 -140 -110 9 220 255 276 226 250 178 146 154 333
1995C33n7M9K65L7j40k24k53J72L06J96J43l39K12p28J27K85L11r6O0R5n59J98
$$ 333 276 325 590 627 487 263 10 182 488 684 827 488 700 -28 99 384 695 599 659 754 195 393
2017C93j57Q4J11Q3J35K01n67J60k64K85m77K74K60K8K19m28j47j59J41k49N57
$$ 393 236 320 431 514 649 850 283 443 179 464 -13 261 521 549 768 340 193 34 175 -74 483
2038D83k9K29m54k03k37j4J31j43O49j42j80m72K26q9J11K11L5K2k15J15j7k69
$$ 483 454 683 229 26 -211 -225 -94 -237 412 270 90 -382 -156 -245 -134 77 112 134 -81 34 17 -252
2060b52l93N0M88r8K68j78Nj87m34l0P08r9J76j07P7n29j82J72M46J5o18M21l0
$$ -252 -645 -595 -107 -205 63 -115 -110 -297 -731 -761 -53 -152 24 -83 -6 -535 -717 -545 -99 -84 -702 -281 -311
2083c11K6l08NK08K61m02K62M89k09l03n18K92K32O1o7M24L3m68j89J25kM77k32
$$ -311 -285 -593 -588 -380 -119 -521 -259 230 21 -282 -800 -508 -276 -215 -282 142 175 -293 -482 -357 -359 118 -114
2106a14Q1O0j68r8O1R9Q7m07L16P61m48k75N4j01R9j09J81L73j37k61K23l16K21
$$ -114 -33 27 -141 -239 -178 -79 8 -399 -83 678 230 -45 9 -92 7 -102 79 452 315 54 277 -39 182
2129A82m61Q36L45n36k14k15K81l1j64M23K10j98R3k46L8J44m15P6J58K7l6j43
$$ 182 -279 557 902 366 152 -63 218 187 23 446 656 458 551 305 343 487 72 148 306 333 297 154
2151A54N81n82l0l38O10j5P6j78k46Q8l97R4M83j33K10N5q7o84J8K75mM58j97
$$ 154 735 153 123 -215 395 380 456 278 32 120 -277 -183 300 167 377 432 345 -339 -321 -46 -50 408 211
2174B11m57L62j96n59K84J97j92P69n53J34j6l90j7L5K29j04K94J76j66k53m70
$$ 211 -246 116 -80 -639 -355 -158 -350 419 -134 0 -16 -406 -423 -388 -159 -263 31 207 41 -212 -682
2195f82K13M25m8J42K12l89l04J80k21M1J62L88k39j45j2OJ71l66P4L15p1Q9j94
$$ -682 -469 -44 -92 50 262 -127 -431 -251 -472 -431 -269 119 -120 -265 -277 -271 -100 -466 -392 -77 -148 -59 -253
2218b53J9J90k62q3K97J25L1j09M0k64j17r5O19J45M8o03J91q0j98K2K81J39j2
$$ -253 -234 -44 -306 -389 -92 33 64 -45 -5 -269 -386 -481 138 283 331 -272 -81 -161 -359 -337 -56 83 71
2241G1n24N49K53m34J23k8M7K84J14m4n3m31r3J33L25K97l12L18m4n68N4K31K84
$$ 71 -453 96 349 -85 38 10 57 341 455 411 358 -73 -166 -33 292 589 277 595 551 -17 37 268 552
2264E52k17K94l17Q8j28k02J3L42l64M63l9j49j86p8j52K05K10j43p1P5M25n74
$$ 552 335 629 312 400 272 70 83 425 61 524 485 336 150 72 -80 125 335 192 121 196 621 47
2286D7J64O5k89j09O14k63M1j64r1R1m4o1J49N3J30l39q0J75l5M5k73M20j44M0
$$ 47 211 276 -13 -122 492 229 270 106 15 106 62 1 150 203 333 -6 -86 89 54 99 -174 246 102 142
2310A42k60J99n43L26k79K99L18k76J37l85M1l12K87J82K70m11N8j42r9K55q6
$$ 142 -118 81 -462 -136 -415 -116 202 -74 63 -322 -281 -593 -306 -124 146 -265 -207 -349 -448 -193 -279
2331b79j10M27j90Q9k33K98l30J64J2k36J53j8K50k02l27N6m5M90j07L68k88k7
$$ -279 -389 38 -152 -63 -296 2 -328 -164 -152 -388 -235 -253 -3 -205 -532 -476 -521 -31 -138 230 -58 -85
2353h5j00n04K35N04M1j06j60J6J01k61K76j55O5o2K10J39j96q8R2l1J05J29J6
$$ -85 -185 -689 -454 50 91 -15 -175 -159 -58 -319 -43 -198 -133 -195 15 154 -42 -130 -38 -69 36 165 181
2376A81j4j45J14j28k12L12l9K31J54K29p31K22j85J82K60q4J7m13L00N2j65j95
$$ 181 167 22 136 8 -204 108 69 300 454 683 -48 174 -11 171 431 347 364 -49 251 303 138 -57
2398e7R9J94P3r1o1J17k39J24j82n4M50N7QJ34k69n20K15K90j34J94q1M6j63k65
$$ -57 42 236 309 218 157 274 35 159 -23 -77 373 430 438 572 303 -217 -2 288 154 348 267 313 150 -115
2422a15kL57J18j03q5q3J24k62K35k73K29j95K28l31K83Rl19K6k27M51o9K02L23
$$ -115 -117 240 358 255 170 87 211 -51 184 -89 140 -55 173 -158 125 134 -185 -159 -386 65 -4 198 521
2445E21o00m0P7o0j13o2J16J35l63L48m44M22j83J59M3K39l49j58k02J27K4oK10
$$ 521 -79 -119 -42 -102 -215 -277 -161 -26 -389 -41 -485 -63 -246 -87 -44 195 -154 -312 -514 -387 -363 -369 -159
2468a59L28j09l23o8J02k04L24K77j98J09l43o2r4p3L96%J19Q2q1j47k58j37K16
$$ -159 169 60 -263 -331 -229 -433 -109 168 -30 79 -264 -326 -420 -493 -97 -97 22 104 23 -124 -382 -519 -303
2491c03J89L3K08l30J55K45o88K40O6L11l24N14j10l19K8k43K20J74J45nJ11k85
$$ -303 -114 -81 127 -203 -48 197 -491 -251 -185 126 -198 316 206 -113 -85 -328 -108 66 211 206 317 32
2513C2J25r9K68k17K32k51O6k7J27j10P4l38j11M05p6K44j61J14j03O9J44j53
$$ 32 157 58 326 109 341 90 156 129 256 146 220 -118 -229 176 100 344 183 297 194 263 407 254
2535B54k7R4q5m39R7K59QJ93q0p8L97m49k97K97j23M00j52o6j40J18j12L49m07
$$ 254 227 321 236 -203 -106 153 161 354 274 196 593 144 -153 144 21 421 269 203 63 181 69 418 11
2558A1k2R6N0J18j78K82n21j65K10J07K96j95p4k25K81l33J89J98r3P0l4j6Kj83
$$ 11 -11 85 135 253 75 357 -164 -329 -119 -12 284 89 15 -210 71 -262 -73 125 32 102 68 52 54 -129
2582a29m4jJ80K1l7P9R2k08l35K78L5j94J89j1J20j14j93K56j50n9L39k31L5J19
$$ -129 -173 -174 6 27 -10 69 161 -47 -382 -104 -69 -263 -74 -85 35 -79 -272 -16 -166 -225 114 -117 -82 37
2606C7o22J01M44j19K08j84N85m30j07m39M66J36o2J4P7K7l93K20j36J80k69N13
$$ 37 -585 -484 -40 -159 49 -135 450 20 -87 -526 -60 76 14 28 105 132 -261 -41 -177 3 -266 247
2628B47r2p2j15j03r9J65L9K14k1n1j30o2j33M86p5q8L47l54P0k84K23n2O1n8
$$ 247 155 83 -32 -135 -234 -69 -30 184 163 112 -18 -80 -213 273 198 110 457 103 173 -111 112 60 121 63
2652F3R3L0J52n2l14J93m42K59L15j83L06k6l24R4k65K25R4M1J42k24j93nJ71
$$ 63 156 186 338 286 -28 165 -277 -18 297 114 420 394 70 164 -101 124 218 259 401 177 -16 -21 150
2675A50j4n2J96j36m6J08k2q7LK9p9J11K7n4J60m27k21J29J04N7Q3R2l90j7K4
$$ 150 136 84 280 144 98 206 184 97 100 129 50 161 188 134 294 -133 -354 -225 -121 -64 19 111 -279 -296 -272
2700b72P3J84J67pl25O6j15J42j71J57J38J90j2k51r6k3k29M00k78Q1J9N0K2L05
$$ -272 -199 -15 152 145 -180 -114 -229 -87 -258 -101 37 227 215 -36 -132 -155 -384 16 -262 -181 -162 -112 -90 215
2724B15n87J99J4L7N9j01j72m6K16N8k30K14R0j6M3l82R6J39j09K46RL06l75j79
$$ 215 -372 -173 -159 -122 -63 -164 -336 -382 -166 -108 -338 -124 -34 -50 -7 -389 -293 -154 -263 -17 -8 298 -77 -256
2748b56K19K20k14rj64J06K36j48j26J44r9l2j64J14M18m04L03k1m07J18K86k0
$$ -256 -37 183 -31 -40 -204 -98 138 -10 -136 8 -91 -123 -287 -173 245 -159 144 123 -284 -166 120 100
2770A00Rj19o7J81k32J05k4J66PP5Q1lj49J5J31k79Q7K81m16L23k91M4j9j00l2
$$ 100 109 -10 -77 104 -128 -23 -47 119 126 201 282 279 130 145 276 -3 84 365 -51 272 -19 25 6 -94 -126
2795a26J51L22r2m41P7M81j85K39m80J27J30J45l07m1p5K19jm6J03M6L5l31j16
$$ -126 25 347 255 -186 -109 372 187 426 -54 73 203 348 41 0 -75 144 143 97 200 246 281 -50 -166
2818a66J04j02J79j5J1k64j67K17j19K33K88k21k1l29O6M46k36j69K55j04J46
$$ -166 -62 -164 15 0 11 -253 -420 -203 -322 -89 199 -22 -43 -372 -306 140 -96 -265 -10 -114 32
2839C2j84kj23J70J24j22l0N4J21j93J20J99l56r0KM66j95n3k00Q6m0K54j16J31
$$ 32 -152 -154 -277 -107 17 -105 -135 -81 40 -153 -33 166 -190 -280 -278 188 -7 -60 -260 -174 -214 40 -76 55
2863E5k2l19L73l33J08M4m7olL30J14l32n3K18k43k73L77l3J28k15L17n36L52
$$ 55 33 -286 87 -246 -138 -94 -141 -147 -150 180 294 -38 -91 127 -116 -389 -12 -45 83 -132 185 -351 1
2886Aj39K50L9j18K67j91K4q2j97J94q6K50o26L71J47K5j40J30J34Nj64L2j11
$$ 1 -138 112 151 33 300 109 133 51 -146 48 -38 212 -414 -43 104 129 -11 119 253 258 94 126 15
2909A5j93k0L15j25K2K97p4r0m4j32K74RL22m42j12M40m02Q4j57K21M7p4k52J10
$$ 15 -178 -198 117 -8 14 311 237 147 103 -29 245 254 576 134 22 462 60 144 -13 208 255 181 -71 39
2933C9kO9k39K61J75j24k98L00m4j85n7q4P5L58n3K54k94j53j48k01L98K72r0
$$ 39 37 106 -133 128 303 179 -119 181 137 -48 -105 -189 -114 244 191 445 151 -2 -150 -351 47 319 229
2956B29j51L21m06j61M4J02K99j41N7k63K12k94k78J05L61k65L00l5j01K8m4o4
$$ 229 78 399 -7 -168 -124 -22 277 136 193 -70 142 -152 -430 -325 36 -229 71 36 -65 -37 -81 -145
2978a45nn7r2J94J18k44J63n5P4J56k89J17j01J25J1L4j02P5j90K94m5j03L0j14
$$ -145 -150 -207 -299 -105 13 -231 -68 -123 -49 107 -182 -65 -166 -41 -30 4 -98 -23 -213 81 36 -67 -37 -151
3002a51R4j98M69k55K99l96J20k35J82l0J73j68R9m9K23j30j95J82q2M6L4J34
$$ -151 -57 -255 214 -41 258 -138 -18 -253 -71 -101 72 -96 3 -46 177 47 -148 34 -48 -2 32 166
3024A66k63K97l54K09j45jK5K34N5k21Oj44L12k01J56mL42k74l8k64K88j5j0n
$$ 166 -97 200 -154 55 -90 -91 -66 168 223 2 8 -136 176 -25 131 127 469 195 157 -107 181 166 156 151
3048A51q6K89j02j52k80L74l15j26K66K22j62j41K54j95m5m0K07J14q5j28O0j38
$$ 151 65 354 252 100 -180 194 -121 -247 19 241 79 -62 192 -3 -48 -88 119 233 148 20 80 -58
3070e8j26p4O57l61J74J36l27j21m1N8j7p8J22R8l88J99K44j68QK11j30r4n6J06
$$ -58 -184 -258 399 38 212 348 21 -100 -141 -83 -100 -178 -56 42 -346 -147 97 -71 -63 148 18 -76 -132 -26
3094b6K35O9m04J96k18J46k08J42k96J00K91k04k4J62j98K31j48O4l53K27L65
$$ -26 209 278 -126 70 -148 -2 -210 -68 -364 -264 27 -177 -201 -39 -237 -6 -154 -90 -443 -216 149
3115A49K0j55Q3k91L04j08j12P7j25O7l12O25ll55k52M61k58J25K33l14J35j32
$$ 149 169 14 97 -194 110 2 -110 -33 -158 -91 -403 222 219 -136 -388 73 -185 -60 173 -141 -6 -138
3137a38J04J42k17m8J05J30l21k27L74J23Q3J92j88m50O52l40p9J96n0K5J08j0
$$ -138 -34 108 -109 -157 -52 78 -243 -470 -96 27 110 302 114 -336 316 -24 -103 93 43 68 176 166
3159A66jl70R5L39m01K1K27o5Q0j73J36k14J49K04l66N0K94q8j66N8j77O64j08
$$ 166 165 -205 -110 229 -172 -151 76 11 91 -82 54 -160 -11 193 -173 -123 171 83 -83 -25 -202 462 354
3182C54n25K01Q2N2n9k87K16J27j33k45K17Q4O4k79k27N51j16K3J7l3R2n02J98
$$ 354 -171 30 112 164 105 -182 34 161 28 -217 0 84 148 -131 -358 193 77 100 117 84 176 -326 -128
3205a28N3J79R7j42k76L24j05L7j97M0M51k62j1p8o3J39j31J72LN2j94N3p7M1
$$ -128 -75 104 201 59 -217 107 2 39 -158 -118 333 71 60 -18 -81 58 -73 99 102 154 -40 13 -64 -23
3229b3m39N83j05j65L61k59R6p0k29L81k91j6J37k17J28J72n6j98J14J87p1QJ33
$$ -23 -462 121 16 -149 212 -47 49 -21 -250 131 -160 -176 -39 -256 -128 44 -12 -210 -96 91 20 28 161
3252A61o7l54K40l10K19j35K07L02m94J05J28j44J90p7k35K69O8p5Rl69N00Lk14
$$ 161 94 -260 -20 -330 -111 -246 -39 263 -231 -126 2 -142 48 -29 -264 5 73 -2 7 -362 138 141 -73
3275g3n3K42j23k11M10l30r4L48j24j00J43J46j23k91J87j73K52l0K59j32M9q0
$$ -73 -126 116 -7 -218 192 -138 -232 116 -8 -108 35 181 58 -233 -46 -219 33 3 262 130 179 99
3297I9j40J49k2M8K8o2j03q2P3J95j60J52J10k17J96j83N9r8r6O7m7L59l09j8
$$ 99 -41 108 86 134 162 100 -3 -85 -12 183 23 175 285 68 264 81 140 42 -54 13 -34 325 16 -2
3321bj33ML49j74R3J54m5j46M9l60J98O7K7n7N5Rj92o4L4RJ35m29L94J69MN2j08
$$ -2 -135 -131 218 44 137 291 246 100 149 -211 -13 54 81 24 79 88 -104 -168 -134 -125 10 -419 -25 144 148 200 92
3348I2r0J0k61L39J14j70L09n25R3q1K72K81k26J1r6k62L46j27j31l5m3J75m6
$$ 92 2 12 -249 90 204 34 343 -182 -89 -170 102 383 157 168 72 -190 156 29 -102 -137 -180 -5 -51
3371e1J48m5k42L11l51o5K50K88k76j05O8K32k11m0J82j43Q1K9Ok54p9J27K48
$$ -51 97 52 -190 121 -230 -295 -45 243 -33 -138 -70 162 -49 -89 93 -50 31 60 66 -188 -267 -140 108
3394A08j27J07p2p2j4J2P2M9R7r0o5k25K81J9j58J31N8j12k19N10l89J81k42p5
$$ 108 -19 88 16 -56 -70 -58 14 63 160 70 5 -220 61 80 -78 53 111 -1 -220 290 -99 82 -160 -235
3418b35M93m46K78m00M31m1j25J66m8j86J7L36k17j18OO2J31k9RL7m2L38o17K77
$$ -235 258 -188 90 -310 121 80 -45 121 73 -113 -96 240 23 -95 -89 -27 104 75 84 121 79 417 -200 77
3442G7L8K34l5l79K15m53J93m3J97q6O4K2J62j89K90o3k52K90l11N8K1J95o5j32
$$ 77 115 349 314 -65 150 -303 -110 -153 44 -42 22 44 206 17 307 244 -8 282 -29 29 50 245 180 48
3466D8k8j68L72j79ll28P3K91j92l6rJ87j14P9M5n5l0P0O9K04j97k47J53j79L7
$$ 48 20 -148 224 45 42 -286 -213 78 -114 -150 -159 28 -86 -7 38 -17 -47 23 92 296 99 -148 5 -174 -137
3491a37L35K3m14L18Pl28J06J54n5l53L66m1M6r4L5j64j31L57j52q9N8L97k0m11
$$ -137 198 221 -193 125 132 -196 -90 64 9 -344 22 -19 27 -67 -32 -196 -327 30 -122 -211 -153 244 224 -187
3515a87n2K11k38J85J69m34K75r2J79J32j04j49k33K11K07O9k97L35j52J07k47
$$ -187 -239 -28 -266 -81 88 -346 -71 -163 16 148 44 -105 -338 -127 80 149 -148 187 35 142 -105
3536a05k34L74J9j79p5L29r8j11J21p6J58nj14M4k44M24k65jll7K11j64q0l2L89
$$ -105 -339 35 54 -125 -200 129 31 -80 41 -35 123 118 4 48 -196 228 -37 -38 -41 -78 133 -31 -111 -143 246
3561B46l16K3K86Q2k49n8l15O1L19j71J47j77m3J73J12k92K46J7j45J26J88n02
$$ 246 -70 -47 239 321 72 14 -301 -240 79 -92 55 -122 -165 8 120 -172 74 91 -54 72 260 -242
3583b42J48L25k83J2N3P0k95J00K25j90q5K39J01N2m09M9j1O0j75K25M71n28J99
$$ -242 -94 231 -52 -40 13 83 -212 -112 113 -77 -162 77 178 230 -179 -130 -141 -81 -256 -31 440 -88 111
3606A11j43J70j82k55L39k6j94L45k99j21L49j25p8K73k46k62M83k09j77J53K53
$$ 111 -32 138 -44 -299 40 14 -180 165 -134 -255 94 -31 -109 164 -82 -344 139 -70 -247 -94 159
3627A59m53L48q1q8L81m41p3J27J56J70l38K12j58j57J46mJ37j30K73M6l07J03
$$ 159 -294 54 -27 -115 266 -175 -248 -121 35 205 -133 79 -79 -236 -90 -94 43 -87 186 232 -75 28
3649B8k16P1P1j58J48k7M4M4p1L71l62M46n85K05O2j59oj40J34l7J29N4Q9J51
$$ 28 -188 -117 -46 -204 -56 -83 -39 5 -66 305 -57 389 -196 9 71 -88 -94 -234 -100 -137 -8 46 135 286
3673B86j74k40j29M80j39j1Q1m57K07J09o6R7j05OJ71j41K29j57m0j47J40M5k55
$$ 286 112 -128 -257 223 84 73 154 -303 -96 13 -53 44 -61 -55 116 -25 204 47 7 -140 0 45 -210
3696b10K68L9j81K91n76M86j69J76P8k11QQ6j24m5K11j38q5K61o2q3r8r1K17m0
$$ -210 58 97 -84 207 -369 117 -52 124 202 -9 -1 85 -39 -84 127 -11 -96 165 103 20 -78 -169 48 8
3720HJ46m48J84J98L1k29r2N7k00L72P3j80mo6K79k50O4M4n8P2k5o4J11N9j67
$$ 8 154 -294 -110 88 119 -110 -202 -145 -345 27 100 -80 -84 -150 129 -121 -57 -13 -71 1 -24 -88 23 82 -85
3745h5l56N35J9p6l14K44K00j25k52J91L05m58O2r3J0J68j5K7m3J0j07l4K15q5
$$ -85 -441 94 113 37 -277 -33 167 42 -210 -19 286 -172 -110 -203 -193 -25 -40 -13 -56 -46 -153 -187 28 -57
3769e7j76J8K80j04Q4J06K6l31L6J96j1p2Po7L5p7K69p0K4N5m22r2M18K48m17
$$ -57 -233 -215 65 -39 45 151 177 -154 -118 78 67 -5 2 -65 -30 -107 162 92 116 171 -251 -343 75 323 -94
3794i4L02q4m22K57j77N96o44L45or5K99k38M3L40l99lj89L40K83n02L20k08J1
$$ -94 208 124 -298 -41 -218 378 -266 79 73 -22 277 39 82 422 23 20 -169 171 454 -48 272 64 75
3817G5L0n3p3J45l96K17K00J17j28j78K5K55k1l35K76j33p9j99j3J84k7NJ15k
$$ 75 105 52 -21 124 -272 -55 145 262 134 -44 -19 236 215 -120 156 23 -56 -255 -268 -84 -111 -106 9 7
3841GL9r1L7K12n1o9k81J10J24m9k7L9N8j15M8o1J24j06K04k77J2j26K06l8J87
$$ 7 46 -45 -8 204 153 84 -197 -87 37 -12 -39 0 58 -57 -9 -70 54 -52 152 -125 -113 -239 -33 -71 116
3866A16m46L71j07J08k05J5L08k76M0j14J64O6n7j5o1j2J33j50J69R8k93l7J0
$$ 116 -330 41 -66 42 -163 -148 160 -116 -76 -190 -26 40 -17 -32 -93 -105 28 -122 47 145 -148 -185 -175
3889a75R2Jk58O00l55K16j03q5K83o04M39k51K12P8k20K23k08J06q5L01o1m06
$$ -175 -83 -82 -340 260 -95 121 18 -67 216 -388 51 -200 12 90 -130 93 -115 -9 -94 207 146 -260
3911b60R9K41j54J70q7k21J36r2K50j09k5k6K11j1j6k40K25k54O3q6J83P9j30
$$ -260 -161 80 -74 96 9 -212 -76 -168 82 -27 -52 -78 133 122 106 -134 91 -163 -100 -186 -3 76 -54
3934e4N4j10Q9J3j45n9K42j85J53M5J68k33nK8J9m0M1k11K93k29O5K9j92M07j86
$$ -54 0 -110 -21 -8 -153 -212 30 -155 -2 43 211 -22 -27 1 20 -20 21 -190 103 -126 -61 -32 -224 183 -3
3959cK04k0j54j62L10m1l41J48J02L7k67K04p5OJ21J36m1k10l05J47P6K83m8j27
$$ -3 201 181 27 -135 175 134 -207 -59 43 80 -187 17 -58 -52 69 205 164 -46 -351 -204 -128 155 107 -20
3983b0K98k60l9K30l40K12j76J23m9k03K45r5j08L21j74O7k12J87j43RK00L7k62
$$ -20 278 18 -21 209 -131 81 -95 28 -21 -224 21 -74 -182 139 -35 32 -180 7 -136 -127 73 110 -152
4006a52P9j0k66N61qk80k20M7j12M06p4j39j62K33J00J36j64J3N5K9m11m7J23
$$ -152 -73 -83 -349 212 204 -76 -296 -249 -361 45 -29 -168 -330 -97 3 139 -25 -12 43 72 -339 -386 -263
4029b63J63n7J68K71l0j57r2P2m78L15J65L28n37M27o1j20m2k01n6L01k45L62
$$ -263 -100 -157 11 282 252 95 3 75 -403 -88 77 405 -132 295 234 114 72 -129 -185 116 -129 233
4051B33j71M5q4r3K86n3j13j15K04%j76j12K01R3j59J47J09j85k47j30L36Q0r0
$$ 233 62 107 23 -70 216 163 50 -65 139 139 -37 -149 52 145 -14 133 242 57 -190 -320 16 96 6
4074Fr5RJ90l75J91Q6l08K2K83M1k38K67n61P14Ql8j40k57J58J97k94J49L5k04
$$ 6 -89 -80 110 -265 -74 12 -296 -274 9 50 -188 79 -482 232 240 202 62 -195 -37 160 -134 15 50 -154
4098a54l1J96R1k76M44l27k76J90K87k06P9p5K11MJm19K66N9P6m0q6N3j87R4M3
$$ -154 -185 11 102 -174 270 -57 -333 -143 144 -62 17 -58 153 157 158 -261 5 64 140 100 14 67 -120 -26 17
4123A7K15n63N60j54r1j6j6l6M1J84l37L87k63r4J61j33J07n7KN2j33j50L60J70
$$ 17 232 -331 229 75 -16 -32 -48 -84 -43 141 -196 191 -72 -166 -5 -138 -31 -88 -86 -34 -167 -317 43 213
4147B13k33rK43l04L60j20j51k02QO0J6m6N32k33p7R1j9j00K1r4N4j61J20K36
$$ 213 -20 -29 214 -90 270 150 -1 -203 -195 -135 -119 -165 367 134 57 148 129 29 50 -44 10 -151 -31 205
4171B05j39j47Q6j58K05k26L23q2k39L27k88j26J0L45k38K59j54J98l5l59O36
$$ 205 66 -81 5 -153 52 -174 149 67 -172 155 -133 -259 -249 96 -142 117 -37 161 126 -233 403
4192D03m54n3p5L91r8q4J1q8K83j48P0k61K27k84J32J74m08M91j27j07q1k91N81
$$ 403 -51 -104 -179 212 114 30 41 -47 236 88 158 -103 124 -160 -28 146 -262 229 102 -5 -86 -377 204
4215B04j16K34k99J14J87n44M00l85L1J28j88J58j14J43K77k61on0r0J46k61L51
$$ 204 88 322 23 137 324 -220 180 -205 -174 -46 -234 -76 -190 -47 230 -31 -37 -87 -177 -31 -292 59
4237E9j31L1o3j2K10j20j67M00j43k18L82k77M42n06J4J31k6m9J50j62p0K56J30
$$ 59 -72 -41 -104 -116 94 -26 -193 207 64 -154 228 -49 393 -113 -99 32 6 -43 107 -55 -125 131 261
4260B61m71M17k78o2K62k78J27j70L82j41r8k1k97L38k63M67j86O8k7L5l27K71
$$ 261 -210 207 -71 -133 129 -149 -22 -192 190 49 -49 -70 -367 -29 -292 175 -11 57 30 65 -262 9
4282ILL3j86j07Q7K77q9k0K84l83j2k4j01J30N4j95L66j45J63j23N9q6L9PJ4j28
$$ 9 12 45 -141 -248 -161 116 27 7 291 -92 -104 -128 -229 -99 -45 -240 126 -19 144 21 80 -6 33 40 54 -74
4308g4K15R4p9m9r2n9m05K47K33l11L24k22Q2J99m9O7K7P3j20K26n03K72j24j55
$$ -74 141 235 156 107 15 -44 -449 -202 31 -280 44 -178 -96 103 54 121 148 221 101 327 -176 96 -28 -183
4332a83L25o6mk46L07k00K4J72l15L7J88J01k93j80M85j1jk36J09j68K25M7k06
$$ -183 142 76 72 -174 133 -67 -43 129 -186 -149 39 140 -153 -333 152 141 140 -96 13 -155 70 117 -89
4355h9K03q4M0r1j7o4m9M20l26J79j16l1M5M4j55L50k57n5J24k10M40m78K63J55
$$ -89 114 30 70 -21 -38 -102 -151 269 -57 122 6 -25 20 64 -91 259 2 -53 71 -139 301 -177 86 241
4379B41j27o7j96R4K35m38L57l3j47K46q0k56j4L66j17J57j68p2RO8l22K64J15
$$ 241 114 47 -149 -55 180 -258 99 66 -81 165 85 -171 -185 181 64 221 53 -19 -10 58 -264 0 115
4402A15J0j39O5J84m89L0M15j25j23k29L94l59M8K66j12J76O8j17o5k1q4J49q0
$$ 115 125 -14 51 235 -254 -224 191 66 -57 -286 108 -251 -203 63 -49 127 195 78 13 -8 -92 57 -23
4425b3K40l66M14j68k17L26r5j13J65r3%kj40k55K78R7J58m39K55J13M6l11K21
$$ -23 217 -149 265 97 -120 206 111 -2 163 70 70 68 -72 -327 -49 48 206 -233 22 135 181 -130 91
4448I1N0n5k09N3L40k44K79o7m73L71k29K84K7k05k3J2o9l75M30J54j06j23K59
$$ 91 141 86 -123 -70 270 26 305 238 -235 136 -93 191 218 13 -10 2 -67 -442 -12 142 36 -87 172
4471A72q9l73J83J00N9l56K79J49m5k76L08j97M3J21L8oj45J92j80M8j31K18j54
$$ 172 83 -290 -107 -7 52 -304 -25 124 79 -197 111 -86 -43 78 116 110 -35 157 -23 25 -106 112 -42
4494d2j09L56L6j43K76k52k57k5K08m0L0k13K90p4j80J33rM9K10j85J52j17M3
$$ -42 -151 205 241 98 374 122 -135 -160 48 8 38 -175 115 41 -139 -6 -15 34 244 59 211 94 137
4517A37j91K18j63p3J9k34K66R2l34L67k75L64k34j75K09q0j6J84JQ3j20M2k00
$$ 137 -54 164 1 -72 -53 -287 -21 71 -263 104 -171 193 -41 -216 -7 -87 -103 81 82 165 45 87 -113
4540a13L5M8j96RM03m04R2L2L8o7N1j76K97l1o1J16Q1k01K7rJ29k85J58k54K24
$$ -113 -78 -30 -226 -217 186 -218 -126 -94 -56 -123 -72 -248 49 18 -43 73 154 -47 -20 -29 100 -185 -27 -281 -57
4565e7J88j58P3k39O61k85k72O0j35K7QQ8J98n6K08l00L0j27J73j45K2N6J17j84
$$ -57 131 -27 46 -193 468 183 -89 -29 -164 -137 -129 -41 157 101 309 9 39 -88 85 -60 -38 18 135 -49
4589d9l7J16j7L66n78J87J47q2J36j14j55p6L54j21l03L92k33j0OM1j63J08L38
$$ -49 -86 30 13 379 -199 -12 135 53 189 75 -80 -156 198 77 -226 166 -67 -77 -71 -30 -193 -85 253
4612B53j27n3j06O7Q1j88r6K40j75j1J43J54k85j27M26j43q3J30q2J90p13O31
$$ 253 126 73 -33 34 115 -73 -169 71 -104 -115 28 182 -103 -230 196 53 -30 100 18 208 -505 126
4634A26j57J99k43q1J79kK09k63M4q8J48K8m8J50j96k05k0L12j06k65L04M1J82
$$ 126 -31 168 -75 -156 23 21 230 -33 11 -77 71 99 51 201 5 -200 -220 92 -14 -279 25 66 248
4657B48j02r8O6j14m9K51l41K24J90l15L48k87k9J90k58K09j60k29J99l9l2q1
$$ 248 146 48 114 0 -49 202 -139 85 275 -40 308 21 -8 182 -76 133 -27 -256 -57 -96 -128 -209
4679b09%M58k19J92m06J59K40J50j50j16j23mK64Nl52L46l04K14m1k18K86j79
$$ -209 -209 249 30 222 -184 -25 215 365 215 99 -24 -28 236 241 -111 235 -69 145 104 -114 172 -7
4701gj75N31l53K4j04L98l22Q1O2k57MK51K79o90K30J02L1J56k38l9lJ1K73k13
$$ -7 -182 349 -4 20 -84 314 -8 73 135 -122 -118 133 412 -278 -48 54 85 241 3 -36 -39 -28 245 32
4725C2L8j31M20k54j5j89J93J29j57k44%L00m2k89L17j52L76q4j56j42P9R6r2
$$ 32 70 -61 359 105 90 -99 94 223 66 -178 -178 122 80 -209 108 -44 332 248 92 -50 29 125 33
4748C3l5J57J1m8L0RL0m33M46k33K70k43k6k4K37j83Q4k45J43J04k68o5L67Q1
$$ 33 -2 155 166 118 148 157 187 -246 200 -33 237 -6 -32 -56 181 -2 82 -163 -20 84 -184 -249 118 199
4772A99k58J23M5l41K73J02j15O7K86l33j03j34n0K50k77M40q9o5j06k9K95jl22
$$ 199 -59 64 109 -232 41 143 28 95 381 48 -55 -189 -239 11 -266 174 85 20 -86 -115 180 179 -143
4795a43K21j70k1J26P6l89M17j31j01M09k89K10j86K8K9N2j57r0j17L15q2J8O6
$$ -143 78 -92 -113 13 89 -300 117 -14 -115 294 5 215 29 57 86 138 -19 -109 -226 89 7 25 91
4818I1o6N9n1O2k71L76r9l47L18r1j03K14k55J85R5k97J70K31p7r0J37j18q9K7
$$ 91 25 84 33 95 -176 200 101 -246 72 -19 -122 92 -163 22 117 -180 -10 221 144 54 191 73 -16 11
4842A1jp8J3P3k43K56RJ78l17n1o8M21k47J31m8k61Q7K66J42l92oP3P2k5J56j49
$$ 11 10 -68 -55 18 -225 31 40 218 -99 -150 -218 203 -44 87 39 -222 -135 131 273 -119 -125 -52 20 -5 151 2
4868Bn7M7k49J75Q7K07l82K4M55k30p9J15%k93L62j90J3r7J33K31j49j85j32K96
$$ 2 -55 -8 -257 -82 5 212 -170 -146 309 79 0 115 115 -178 184 -6 7 -90 43 274 125 -60 -192 104
4892A04k6l23J10R3j13L54p7Q9k47J47j64M9J57k19K97k36J10o0j11J04j95K02
$$ 104 78 -245 -135 -42 -155 199 122 211 -36 111 -53 -4 153 -66 231 -5 105 45 -66 38 -157 45
4914D5k48K36j5p5M5M6j78K42mO6k62J21R1k54K08p5o7J94l54M15l32K92m96J90
$$ 45 -203 33 18 -57 -12 34 -144 98 94 160 -102 19 110 -144 64 -11 -78 116 -238 177 -155 137 -359 -169
4938a69N22k38l23L69k67K46l3k5K3j74K32m9J08q8q6J10K71r9m08j34J26K41
$$ -169 353 115 -208 161 -106 140 107 82 105 -69 163 114 222 134 48 158 429 330 -78 -212 -86 155
4960A55j92O5j34L1J76r7J1m7J30q5J17mr9j85L51n7k76K61l16J25M18l04KK66
$$ 155 -37 28 -106 -75 101 4 15 -32 98 13 130 126 27 -158 193 136 -140 121 -195 -70 348 44 46 312
4984C12m01K54J34n75L12l63O16j74l90M10l76J79j44K6L00j88J51m2rJ53m3k85
$$ 312 -89 165 299 -276 36 -327 289 115 -275 135 -241 -62 -206 -180 120 -68 83 41 32 185 142 -143
5006a43J90p3LQk42L90k11J75J1K82n48R1L57p31M21l48O32k55K0J01l8N4m93
$$ -143 47 -26 -23 -15 -257 133 -78 97 108 390 -158 -67 290 -441 -20 -368 264 9 29 130 92 146 -347
5029c47L67k45L58Q7p5O0l91K66l77M34j78m2j3j7L27k58O9J4Rl98J24J86J40
$$ -347 20 -225 133 220 145 205 -186 80 -297 137 -41 -83 -96 -113 214 -44 25 39 48 -350 -226 -40 100
5052A00k21JQ6Q9o8J08j38K09k67k73M24J3L40m91J11J5J04j8j01mK5N3k8k58
$$ 100 -121 -120 -34 55 -13 95 -43 166 -101 -374 50 63 403 -88 23 38 142 124 23 19 44 97 69 -189
5076a89m5N10l98J03P2j49O9j33K58O2r7j65Q2J49l45J53o1Q5N8j8K24j09ol71
$$ -189 -234 276 -122 -19 53 -96 -27 -160 98 160 63 -102 -20 129 -216 -63 -124 -39 19 1 225 116 110 -261
5100b61K63P5N7j32J79k03j05J87j10j2K72k90l6K47j21m9J86O7k20k9j19K69
$$ -261 2 77 134 2 181 -22 -127 60 -50 -62 210 -80 -116 131 10 -39 147 214 -6 -35 -154 115
5122A15j23Oqm4m9K47k35L99l97j69J61K88j47j77K98j03J25j1j77k4J04j95K04
$$ 115 -8 -2 -10 -54 -103 144 -91 308 -89 -258 -97 191 44 -133 165 62 187 176 -1 -25 79 -116 88
5145H8l47K67J21j78k40K17j09L10K22m72K25J01k33j15p3K21p0J35k89M93p07
$$ 88 -259 8 129 -49 -289 -72 -181 129 351 -121 104 205 -28 -143 -216 5 -65 70 -219 274 -433
5166d33L37K62k86L13j20k12k3L62k85N8KL63l83N6o5p8L98j50l07L32J17k99
$$ -433 -96 166 -120 193 73 -139 -162 200 -85 -27 -25 338 -45 11 -54 -132 266 116 -191 141 258 -41
5188d1J07k43M8M94l43j15J57m9K00P8o3k88K17j91j53J97J4Nmk91N4L22k66K99
$$ -41 66 -177 -129 365 22 -93 64 15 215 293 230 -58 159 -32 -185 12 26 31 27 -264 -210 112 -154 145
5212A45k0%q3j00K11j94j0qj20J84kk02J80K82j46o3j24J05j89L26K5p0j87J58
$$ 145 125 125 42 -58 153 -41 -51 -59 -179 5 3 -199 -19 263 117 54 -70 35 -154 172 197 127 -60 98
5236I8J35l9j50m23M99m6K4j9j21P2k12j03N19r1l02K78j64J72k92J82j83L86
$$ 98 233 194 44 -379 120 74 98 79 -42 30 -182 -285 234 143 -159 119 -45 127 -165 17 -166 220
5258B20j21j80K30k8mm16J97L00l93K8K34L61l74j12J41j08r3J94j54L13k46K17
$$ 220 99 -81 149 121 117 -299 -102 198 -195 -167 67 428 54 -58 83 -25 -118 76 -78 235 -11 206
5280B06l18L53l77j5J45j04K59m36N16l13J68j70J7J33j81K5J56L6m5N4j89l4
$$ 206 -112 241 -136 -151 -6 -110 149 -287 229 -84 84 -86 -69 64 -117 -92 64 100 55 109 -80 -114
5302a14K29j06j80L35k13J55j05J36k09O7Q5J8K54l51j44j20L43j39j04j5J53
$$ -114 115 9 -171 164 -49 106 1 137 -72 -5 80 98 352 1 -143 -263 80 -59 -163 -178 -25
5323b5K85k92L15r2k71J25r7m0j92K60J16J7p7k18K7J17K31k03k73J72L61j4J46
$$ -25 260 -32 283 191 -80 45 -52 -92 -284 -24 92 109 32 -186 -159 -42 189 -14 -287 -115 246 232 378
5346C78m17j10K21l7k2o9L66m46j95L95j83jM83m45j07J92l1R8r5j22l1K84k82
$$ 378 -39 -149 72 35 13 -56 310 -136 -331 64 -119 -120 363 -82 -189 3 -28 70 -25 -147 -178 106 -176
5369a76K83k63m7J37K35p0j26J91k36R5J32N6l75L07j93m5J90j23L3j43K38J98
$$ -176 107 -156 -203 -66 169 99 -27 164 -72 23 155 211 -164 143 -50 -95 95 -28 5 -138 100 298
5391B98k84J11k55p4J81K49n15K47j98Q5L57J35l33R1j13j36K60m37M59j5M3J09
$$ 298 14 125 -130 -204 -23 226 -289 -42 -240 -155 202 337 4 95 -18 -154 106 -331 128 113 156 265
5413B65k41j24j2M2J5L8M2J3o8P8M6l1o1R3j2q1R9m48L09Q1kj23L20k63J12k30
$$ 265 24 -100 -112 -70 -55 -17 25 38 -30 48 94 63 2 95 83 2 101 -347 -38 43 41 -82 238 -25 87 -143
5439a43K22N3p6q1n6J17k22Q9K37P2j97j15R6K07k25K58j80L3k0j75%k19O35l07
$$ -143 79 132 56 -25 -81 36 -186 -97 140 212 15 -100 -4 203 -22 236 56 89 69 -106 -106 -325 310 3
5463CM4J86k20P7k75M31j51mj65j01J94k17J04j44K68K03l22K45o0j70q5J54j77
$$ 3 47 233 13 90 -185 246 95 91 -74 -175 19 -198 -94 -238 30 233 -89 156 96 -74 -159 -5 -182
5486a82J03j91L06M3j82N4K44r7k91L59j45J81j16J12m44L80j26j67M06j88j6
$$ -182 -79 -270 36 79 -103 -49 195 98 -193 166 21 202 86 198 -246 134 8 -159 247 59 43
5507D3l3O8j59n7Q3o7J7K5q4J16m1J65j0o7k76K90M37m67M16l46J38j45K80M2
$$ 43 10 78 -81 -138 -55 -122 -105 -80 -164 -48 -89 76 66 -1 -277 13 450 -17 399 53 191 46 326 368
5531C68n02K44R9r5r0j93K11j33J27J44K58l25j07k86N4K13k5m5L82m50j34L27
$$ 368 -134 110 209 114 24 -169 42 -91 36 180 438 113 6 -280 -226 -13 -38 -83 299 -151 -285 42
5553D2k49K84p0j6rj76K76l5j9j25l0K51k56J63k9j19J43J92l14K17J01M3l24
$$ 42 -207 77 7 -9 -18 -194 82 47 28 -97 -127 124 -132 31 2 -117 26 218 -96 121 222 265 -59
5576e9j5n7J65R3j60l93M48p1Q0J76k32J22J0l17J42j73J07K45l5qk09K39j30
$$ -59 -74 -131 34 127 -33 -426 22 -49 31 207 -25 97 107 -210 -68 -241 -134 111 76 68 -141 98 -32
5599c2L35k06j16r7O9j52P4J60j2p4l52L32O1j59j5O4J84j48Q5k11M94j79k91
$$ -32 303 97 -19 -116 -47 -199 -125 35 23 -51 -403 -71 -10 -169 -184 -120 64 -84 1 -210 284 105 -186
5622a86L72k30J73N1j02P2l63M80k54j18K03R8l50J97n9K5k3j80N41j66r7J24
$$ -186 186 -44 129 180 78 150 -213 267 13 -105 98 196 -154 43 -16 9 -14 -194 347 181 84 208
5644B08l56P9J59K46l71l9L28l11j96M29l70M84j07k11j06K73l9R1j66J72Mk52
$$ 208 -148 -69 90 336 -35 -74 254 -57 -253 176 -194 290 183 -28 -134 139 100 191 25 197 201 -51
5666e1j03K12J10k84N2j12R3J05J01k90K57J00j20J33k38K31j71j13J02j01J44
$$ -51 -154 58 168 -116 -64 -176 -83 22 123 -167 90 190 70 203 -35 196 25 -88 14 -87 57
5687E7j23J75j80J10r3K51k0k40J03K37n17M69l00R5j10Q5j87K48k02J16j37J60
$$ 57 -66 109 -71 39 -54 197 177 -63 40 277 -240 229 -71 24 -86 -1 -188 60 -142 -26 -163 -3
5709cj0O8J82k74L74l44oJ2r3J26K03k20j53K1J89N4K5k10J08q8M0J14N8p9L4
$$ -3 -13 55 237 -37 337 -7 -13 -1 -94 32 235 15 -138 -117 72 126 151 -59 49 -39 1 115 173 94 128
5734A28l18J61J50r2o4J15M5j5j08l08J42l7J43J4n9M56n39K81j10M6k34M01l76
$$ 128 -190 -29 121 29 -35 80 125 110 2 -306 -164 -201 -58 -44 -103 353 -186 95 -15 31 -203 198 -178
5757a78K3K85r2J05j35K87j92M0k72p3M0P5J47j34r2L42l66J67MJ18l13K28q4
$$ -178 -155 130 38 143 8 295 103 143 -129 -202 -162 -87 60 -74 -166 176 -190 -23 -19 99 -214 14 -70
5780g0K41j29m4J57k84j9j0r5J13L99k14j5j21J87q8p9j48J3J46k04K40j31K96
$$ -70 171 42 -2 155 -129 -148 -158 -253 -140 259 45 30 -91 96 8 -71 -219 -206 -60 -264 -24 -155 141
5803A41j81Or3J89K26k55p7J5Q9p3MM6K26l05J77j62j69Q3K00r9K12j43Q1k41
$$ 141 -40 -34 -127 62 288 33 -44 -29 60 -13 -9 37 263 -42 135 -27 -196 -113 87 -12 200 57 138 -103
5827a03J20j28K86k12j98J13J10o9m8L45j7j87q9K70j53j91o3Q8M9J65rj60J48
$$ -103 17 -111 175 -37 -235 -122 -12 -81 -129 216 199 12 -77 193 40 -151 -214 -126 -77 88 79 -81 67
5850F7K07n78L82l02K08K78j04q1j08K3J87l02K13j31mp2k17L83K8M0j57P4p7
$$ 67 274 -304 78 -224 -16 262 158 77 -31 -8 179 -123 90 -41 -45 -117 -334 49 77 117 -40 34 -43
5873d3j56K41L8r6J78l40L21k68K39O1n43L48q3K4O9M7o0j0J64j77J28j67j54
$$ -43 -199 42 80 -16 162 -178 143 -125 114 175 -368 -20 -103 -79 -10 37 -23 -33 131 -46 82 -85 -239
5896b39K36k5J10j97K6K68o1j14l29M34j96N4J21J10j09J16k45Rj47J27K14L0
$$ -239 -3 -28 82 -115 -89 179 118 4 -325 109 -87 -33 88 198 89 205 -40 -31 -178 -51 163 193
5918A93j1p0J9j93j01J35j59J65L00k20O8p1M1n8l60J84K75j62J70j61P6r4M4
$$ 193 182 112 131 -62 -163 -28 -187 -22 278 58 126 55 96 38 -322 -138 137 -25 145 -16 60 -34 10
5941A0k15L00J32n4L7k02k33K97M7m62N69j34l44L97j34N4K2O0l64L82n0m1n9
$$ 10 -205 95 227 173 210 8 -225 72 119 -343 226 92 -252 145 11 65 87 147 -217 165 115 74 15
5964A5M2k17K83l14M03k30L04J41n74n6L20r2k6kn0J8k8j65M0Q0K86k88M7J3k30
$$ 15 57 -160 123 -191 212 -18 286 427 -147 -203 117 25 -1 -3 -53 -35 -63 -228 -188 -108 178 -110 -63 -50 -280
$$ [...]
8191A25
##END NTUPLES=NMR FID
##END=
