##TITLE=1H_SR1516_k
 D2O, 8 sc, 
 31.7.2020
##JCAMPDX= 6.0         $$ Bruker NMR JCAMP-DX V2.0
##DATA TYPE= NMR FID
##DATA CLASS= NTUPLES
##ORIGIN= UXNMR, Bruker Analytische Messtechnik GmbH
##OWNER= root
$$ XWIN-NMR		Version 3.5
$$ Fri Jul 31 12:34:20 2020 Russian Standard Time (UT+4h)  she@DPX200
##.OBSERVE FREQUENCY= 200.1314999998
##.OBSERVE NUCLEUS= ^1H
##.DELAY= (6, 6)
##.ACQUISITION MODE= SIMULTANEOUS
##.ACQUISITION SCHEME= undefined
##.AVERAGES= 8
##.DIGITISER RES= 18
##SPECTROMETER/DATA SYSTEM= spect
##.PULSE SEQUENCE= zg30
##.SOLVENT NAME= D2O
##.SHIFT REFERENCE= (INTERNAL, D2O, 0, 15.7039)
##AUDIT TRAIL= $$ (NUMBER, WHEN, WHO, WHERE, WHAT)
$$ ##TITLE= Audit trail, XWIN-NMR		Version 3.5
$$ ##JCAMPDX= 5.01
$$ ##ORIGIN= Bruker BioSpin GmbH
$$ ##OWNER= she
$$ F:/spectra/data/she/nmr/H-F/1/audita.txt
$$ ##AUDIT TRAIL=  $$ (NUMBER, WHEN, WHO, WHERE, WHAT)
(   1,<2020-07-31 12:33:19.34 +0400>,<she>,<DPX200>,
      <created by zg, POWCHK disabled, PULCHK disabled
       configuration hash MD5:
       00 E9 B6 7A A2 85 ED C7 34 08 36 98 17 FE 4E 26
       data hash MD5: 16K
       F2 55 97 D8 CC 7C 7D 57 7A 02 AE 1F DA 76 14 51>)
$$ ##END=
$$ 
$$ hash MD5
$$ FA 00 1E C9 43 80 B5 57 95 1D 38 B6 A6 F1 38 D6
##$RELAX= 
##$RELAX= 
##$RELAX= 
##$RELAX= 
##$RELAX= 
##$RELAX= 
$$ Bruker specific parameters
$$ --------------------------
##$DU= <F:/spectra>
##$EXPNO= 1
##$NAME= <H-F>
##$PROCNO= 1
##$TYPE= <nmr>
##$USER= <she>
##$AMP= (0..31)
100 100 100 100 100 100 100 100 100 100 100 100 100 100 100 100 100 100 
100 100 100 100 100 100 100 100 100 100 100 100 100 100 
##$AQSEQ= 0
##$AQ_mod= 1
##$AUNM= <au_zg>
##$AUTOPOS= <>
##$BF1= 200.13
##$BF2= 200.13
##$BF3= 200.13
##$BF4= 200.13
##$BF5= 200.13
##$BF6= 200.13
##$BF7= 200.13
##$BF8= 200.13
##$BYTORDA= 1
##$CFDGTYP= 0
##$CFRGTYP= 5
##$CHEMSTR= <none>
##$CNST= (0..31)
1 1 145 1 1 1 1 1 1 1 1 1 1 1 1 1 1 1 1 1 1 1 1 1 1 1 1 1 1 1 1 1 
##$CPDPRG= <>
##$CPDPRG1= <>
##$CPDPRG2= <>
##$CPDPRG3= <>
##$CPDPRG4= <mlev>
##$CPDPRG5= <mlev>
##$CPDPRG6= <mlev>
##$CPDPRG7= <mlev>
##$CPDPRG8= <mlev>
##$CPDPRGB= <>
##$CPDPRGT= <>
##$D= (0..31)
0 1.2 0 0 0 0 0 0 0 0.06 0 0.03 0 0 0 0 0.0002 0 0 0 0 0 0 0 0 0 0 0 0 
0 0 0 
##$DATE= 1596184398
##$DBL= (0..7)
120 120 120 120 120 120 120 120 
##$DBP= (0..7)
150 150 150 150 150 150 150 150 
##$DBP07= 0
##$DBPNAM0= <>
##$DBPNAM1= <>
##$DBPNAM2= <>
##$DBPNAM3= <>
##$DBPNAM4= <>
##$DBPNAM5= <>
##$DBPNAM6= <>
##$DBPNAM7= <>
##$DBPOAL= (0..7)
0.5 0.5 0.5 0.5 0.5 0.5 0.5 0.5 
##$DBPOFFS= (0..7)
0 0 0 0 0 0 0 0 
##$DE= 6
##$DECBNUC= <off>
##$DECIM= 24
##$DECNUC= <off>
##$DECSTAT= 4
##$DIGMOD= 1
##$DIGTYP= 9
##$DL= (0..7)
0 120 120 120 120 120 120 120 
##$DP= (0..7)
150 150 150 150 150 150 150 150 
##$DP07= 0
##$DPNAME0= <>
##$DPNAME1= <>
##$DPNAME2= <>
##$DPNAME3= <>
##$DPNAME4= <>
##$DPNAME5= <>
##$DPNAME6= <>
##$DPNAME7= <>
##$DPOAL= (0..7)
0.5 0.5 0.5 0.5 0.5 0.5 0.5 0.5 
##$DPOFFS= (0..7)
0 0 0 0 0 0 0 0 
##$DQDMODE= 0
##$DR= 18
##$DS= 0
##$DSLIST= <SSSSSSSSSSSSSSS>
$$ [...]
##$SUBNAM2= <"">
##$SUBNAM3= <"">
##$SUBNAM4= <"">
##$SUBNAM5= <"">
##$SUBNAM6= <"">
##$SUBNAM7= <"">
##$SUBNAM8= <"">
##$SUBNAM9= <"">
##$SW= 24.9337058888022
##$SWIBOX= (0..15)
0 0 2 0 0 0 0 0 0 0 0 0 0 0 0 0 
##$SW_h= 4990.01996007984
##$TD= 16384
##$TD0= 1
##$TE= 0
##$TE2= 300
##$TE3= 300
##$TEG= 300
##$TL= (0..7)
0 120 120 120 120 120 120 120 
##$TP= (0..7)
150 150 150 150 150 150 150 150 
##$TP07= 0
##$TPNAME0= <>
##$TPNAME1= <>
##$TPNAME2= <>
##$TPNAME3= <>
##$TPNAME4= <>
##$TPNAME5= <>
##$TPNAME6= <>
##$TPNAME7= <>
##$TPOAL= (0..7)
0.5 0.5 0.5 0.5 0.5 0.5 0.5 0.5 
##$TPOFFS= (0..7)
0 0 0 0 0 0 0 0 
##$TUNHIN= 0
##$TUNHOUT= 0
##$TUNXOUT= 0
##$USERA1= <user>
##$USERA2= <user>
##$USERA3= <user>
##$USERA4= <user>
##$USERA5= <user>
##$V9= 5
##$VALIST= <valist>
##$VCLIST= <CCCCCCCCCCCCCCC>
##$VD= 0
##$VDLIST= <DDDDDDDDDDDDDDD>
##$VPLIST= <PPPPPPPPPPPPPPP>
##$VTLIST= <TTTTTTTTTTTTTTT>
##$WBST= 1024
##$WBSW= 4
##$XGAIN= (0..3)
0 0 0 0 
##$XL= 0
##$YL= 0
##$YMAX_a= 669505
##$YMIN_a= -589412
##$ZGOPTNS= <>
##$ZL1= 120
##$ZL2= 120
##$ZL3= 120
##$ZL4= 120
##$ABSF1= 10
##$ABSF2= 0
##$ABSG= 5
##$ABSL= 3
##$ALPHA= 0
##$AQORDER= 0
##$ASSFAC= 0
##$ASSFACI= 0
##$ASSFACX= 0
##$ASSWID= 0
##$AUNMP= <proc_1d>
##$AZFE= 0.1
##$AZFW= 0.1
##$BCFW= 1
##$BC_mod= 2
##$BYTORDP= 1
##$COROFFS= 0
##$CY= 11.3945322036743
##$DATMOD= 1
##$DC= 2
##$DFILT= <>
##$DTYPP= 0
##$F1P= 16.9975609425685
##$F2P= -3.02152046262296
##$FCOR= 0.5
##$FTSIZE= 0
##$FT_mod= 4
##$GAMMA= 1
##$GB= 0.15
##$INTBC= 1
##$INTSCL= 1
##$ISEN= 128
##$LB= 0.24
##$LEV0= 0
##$LPBIN= 0
##$MAXI= 10000
##$MC2= 0
##$MEAN= 0
##$ME_mod= 0
##$MI= 1.114404
##$NCOEF= 0
##$NC_proc= 0
##$NLEV= 6
##$NOISF1= 3.799351
##$NOISF2= 2.8
##$NSP= 1
##$NTH_PI= 0
##$NZP= 0
##$OFFSET= 15.70392
##$PC= 1
##$PHC0= -9799.648
##$PHC1= 13.20092
##$PH_mod= 1
##$PKNL= yes
##$PPARMOD= 0
##$PSCAL= 0
##$PSIGN= 0
##$REVERSE= no
##$SF= 200.130013532006
##$SI= 16384
##$SIGF1= 3
##$SIGF2= 2
##$SINO= 400
##$SIOLD= 16384
##$SREGLST= <1H.CDCl3>
##$SSB= 0
##$STSI= 0
##$STSR= 0
##$SW_p= 3612.71676300578
##$SYMM= 0
##$S_DEV= 0
##$TDeff= 0
##$TDoff= 0
##$TI= <>
##$TILT= no
##$TM1= 0
##$TM2= 0
##$TOPLEV= 0
##$USERP1= <user>
##$USERP2= <user>
##$USERP3= <user>
##$USERP4= <user>
##$USERP5= <user>
##$WDW= 1
##$XDIM= 8192
##$YMAX_p= 0
##$YMIN_p= 0
$$ End of Bruker specific parameters
$$ ---------------------------------
##NTUPLES= NMR FID
##VAR_NAME=  TIME,          FID/REAL,        FID/IMAG
##SYMBOL=    X,             R,               I
##VAR_TYPE=  INDEPENDENT,   DEPENDENT,       DEPENDENT
##VAR_FORM=  AFFN,          ASDF,            ASDF
##VAR_DIM=   8192,          8192,            8192
##UNITS=     SECONDS,       ARBITRARY UNITS, ARBITRARY UNITS
##FACTOR=    0.0002004,     1,               1
##FIRST=     0,             0,               0
##LAST=      1.6414764,     0,               0
##MIN=       0,             -589412,         0
##MAX=       1.6414764,     669505,          0
$$ Real data points
##PAGE= N=1
##DATA TABLE= (X++(R..R)), XYDATA
0@%%%%%%%QqQj6J6k4L2m0N6o4P8r5J10j32J50j78K09k37K75l12L57m07M58n22
31b78N85o56P38q22R18j023J139j266J401j556J724j907K114k337K591k878L196
48A683l562L980m469N047n736O593p675R090j1048J3945j8728K8381p8792K74787
62B13496L30778k6038j17454k97639m06656k85899O6311K64156L32399L29801
72D03255J96981j30847l59921l65912k37691n8352K12583L89970L32194J34169
82E16429n0970k50829l90028l08527m8661J71293L09296L66495K35523o5788k83177
93B01056l16048k75364j51959J27218L61110L32578J61739K5426j49532l57260
103d1036l61338j14882J29677K51913L17761K71590L9672k08380k93950k72271
$$ y = [0, 0, 0, 0, 0, 0, 0, 0, 8, 0, 8, -8, 8, -16, 16, -24, 32, -32, 46, -49, 61, -71, 79, -99, 110, -127, 148, -164, 193, -214, 244, -278, 307, -349, 389, -433, 485, -538, 601, -665, 736, -820, 904, -1003, 1111, -1226, 1365, -1513, 1683, -1879, 2101, -2368, 2679, -3057, 3536, -4139, 4951, -6097, 7848, -10880, 17501, -61291, 213496, 544274, 518236, 400782, 103143, -303513, -589412, -523101, -258945, 73454, 403255, 600236, 469389, 109468, -256444, -494135, -552487, -339904, 50066, 382260, 516429, 465459, 214630, -175398, -483925, -532586, -361293, -51997, 314498, 550021, 484233, 201056, -114992, -390356, -542315, -415097, -53987, 278591, 440330, 465756, 316224, -41036, -402374, -517256, -387579, -135666, 182095, 453685, 493357, 284977, -8973, -281244]
113b81244j91305J6219K65527L43759K40965Q4730j13929l18766l43457j52346
123d49847M8866J71798K83971L09096J20470j38576k56827k68105k35697o1110
133d75961K11916L32530K38667J05609k6737k17325l33648k27844k2340J24655
143b90478K39810L06562J94045n4044k26280k64058k37752j13690J17070K82194
153d6621K64055J55411K3914j54659k94660k57726r3891O6167K05159K96064K24502
164C87715R427j65921k29670k38211j62478L4384K19670K58901J95624Q7271q9003
175C07709k63105k78187j38314J9160J55840K60776K40926P5571r5589j90549
185I4238k40279k07440l1974J72469K46155K06843J24647k8892k11601k67967
$$ y = [-281244, -472549, -456330, -190803, 152956, 393921, 478651, 364722, 45956, -297501, -449847, -400981, -229183, 54788, 363884, 484354, 345778, 88951, -179154, -414851, -475961, -264045, 68485, 307152, 412761, 386024, 168699, -164949, -392793, -415133, -290478, -50668, 255894, 449939, 395895, 169615, -94443, -332195, -445885, -328815, -46621, 217434, 372845, 396759, 242100, -52560, -310286, -404177, -338010, -132851, 163213, 387715, 397142, 231221, 1551, -236660, -399138, -364754, -145084, 113817, 309441, 396712, 307709, 44604, -233583, -371897, -352737, -196897, 63879, 304805, 380376, 284787, 94238, -146041, -353481, -385455, -212986, 33169, 240012, 364659, 335767, 124166, -143801]
195a43801j65117l1708Q5875K12855K61296J42013m3327j60320k19118k21180
205b82532r6140J08870K26916K12913J43271K6506j40583k46603k03738q0951
215c32071M5532J72522K47352J81484J7379j23292k01881k17523j28113M3838
225b94773J74919K06528J72045P6765q5084k14684k16608j23154j883J32767K29991
236E6829J99585O2001p4300j64416k10565j63946j6859J31353J95474J86696J13280
247C15132l5114j78782k14337j46140m0817Q4221J94794K07358J05704k4136j26898
258A40985j97003j87451o6395Q7108J74211J87225J38051J4532j33184k00291
268d2212j63693p7183L5668J57065K08472J41522J7187r3289j74615j92483j05695
$$ y = [-143801, -308918, -340626, -254751, -41896, 219400, 361413, 318086, 157766, -61352, -282532, -378672, -269802, -42886, 170027, 313298, 339804, 199221, -47382, -251120, -332071, -286539, -114017, 133335, 314819, 332198, 208906, 7025, -210498, -338611, -294773, -119854, 86674, 258719, 335484, 250400, 35716, -180892, -304046, -305929, -173162, 56829, 256414, 318415, 244115, 79699, -130866, -294812, -311671, -180318, 15156, 201852, 315132, 280018, 101236, -113101, -259241, -300058, -215837, -21043, 186315, 292019, 267883, 140985, -56018, -243469, -309864, -222756, -48545, 138680, 276731, 291263, 158079, -42212, -205905, -283088, -247420, -90355, 118117, 259639, 276826, 183537, 8922, -183561, -289256]
279b89256M0005J46299J78121J51144N8528p9432j77074j78395j09310k418J18461
290a43327J92346J63503N8930n5962j48063j87247j32590q413J07001J65140J64531
301A75849R3468l5302j47075j78114j31896l8978P8927J68876J71131R3027j4965
312B34948j15396j75693j52252m9846O7012J44313J66781J20860O839j12650j66326
323c1410j45417p1703L6082J38541J73556J21148K0926q2668j55468j60644q4828
334b41885K6655J17838J61261J37894M4599p3138j47430j52290r9290k222J06241
345a21767J64615J38113N3256m7227j28796j59403j13484j3058Q8776J49668J46775
356A57468P4812l3849j21997j51607j18625l5070P1102J45337J46645Q2315j1425
$$ y = [-289256, -249251, -102952, 75169, 226313, 284841, 205409, 28335, -150060, -259370, -261788, -143327, 49019, 212522, 271452, 215490, 67427, -119820, -252410, -260823, -153822, 11318, 175849, 269317, 234015, 86940, -91174, -223070, -262048, -183121, -14245, 156886, 249913, 234948, 119552, -56141, -208393, -258239, -191227, -46914, 119867, 240727, 247566, 134916, -31410, -176827, -248530, -212448, -73907, 99649, 220797, 241723, 159055, 3587, -157057, -241885, -215230, -97392, 63869, 201763, 246362, 173224, 25794, -126496, -225786, -228008, -121767, 42848, 180961, 234217, 186990, 58194, -101209, -214693, -227751, -138975, 10693, 157468, 232280, 198431, 76434, -75173, -193798, -228868, -157766, -12429, 134216, 216531, 205106]
367B05106j01176j51602j32296m6655N7595J31720J46936R7112K545r0408j41296
378b2419j32119o5035L5908J21768J47235J05662K1000p3286j37803j39086p3039
389b11214K4215J05144J39833J15143L7555n7517j26609j38731q8964L204R5312
400a02629J40559J20096M7732m2948j15598j37632r5481j0723P6175J29369J27601
411A36521O6911k8080j08304j37170j03161k4337O3937J23353J27201P3333j1275
422A78929r1234j30590j12040m2791M6948J17455J32582Q5011j210q2538j23918
433b3396j12865n3270L1408J03517J28849R4082J8039o5422j21085j21509o6057
444a87709K2176R6336J24903R7830K8538n1534j08660j18914p7768P49Q2073J25611
$$ y = [205106, 103930, -47672, -179968, -226623, -169028, -37308, 109628, 206740, 209285, 118877, -22419, -154538, -219573, -183665, -61897, 85338, 191000, 212000, 138714, 911, -138175, -211214, -186999, -81855, 57978, 173121, 210676, 153159, 26550, -112181, -201145, -197941, -102629, 37930, 158026, 205758, 162810, 47212, -90420, -185901, -196624, -120449, 8920, 136521, 203432, 175352, 67048, -70122, -173283, -197620, -133683, -10330, 116871, 190204, 178929, 87695, -42895, -154935, -197726, -150778, -33323, 99259, 184270, 183060, 100522, -23396, -136261, -189531, -158123, -54606, 74243, 168325, 186364, 120942, -143, -121652, -187709, -165533, -69197, 55706, 153536, 182074, 130540, 21880, -97034, -174802, -174053, -91980, 33631]
456C3631J08756M0528m1855j02864j19104q2715r452O9644J14698J08375N5104
467A74746k2186r0649j21196r6037k2697O1287J12492J10501N9897j1834p8519
478G5805j13712r7946l7267M2197J01305J14915P6399K298p3502j13910j01047
489a24465m3462L2273R1773J09688P9524J6467n4500j05234j09046n9532J9064
500a47450Q6938J11716Q6202K3400m7508r7448j03934o4526L377O9763J06716
511B7246R5032M0219l4432r3914j09490p2582l429O3999J00136R2316M7323j9178
523A33246p9726j06257q2572k0083N1036R8116J00938N6694j3499p5919j00765
534c8791q1065k8813L5995Q6761R9946O6910L361o2648j01304r2926l8596L1960
$$ y = [33631, 142387, 182915, 141060, 38196, -80908, -163623, -173075, -103431, 11267, 119642, 174746, 152560, 61911, -59285, -155322, -178019, -116732, -4240, 106261, 166158, 154324, 75805, -37907, -135853, -173120, -130923, -29618, 85297, 161696, 163994, 90492, -23418, -124465, -167927, -135654, -43881, 65807, 145331, 161798, 107298, 2064, -106982, -166514, -147450, -60512, 51204, 137406, 160806, 113298, 15850, -88084, -152610, -149233, -79470, 27246, 122278, 162497, 128065, 34151, -75339, -147921, -151350, -87351, 12785, 105101, 152424, 133246, 53520, -52737, -135309, -155392, -104356, -6240, 94698, 151392, 137893, 61974, -38791, -119856, -148669, -112674, -25913, 74033, 140943, 144304, 81656, -19648, -112574, -151170, -119210]
546a19210Q3315R6507O8745J2485n0802r2222r1633n0444J3399P3294J00488Q0167
558A24089K1200m5637q9392r1507n3212O037O1533R1057Q1774L6123k9083q2179
570C0803r6239o5564m964N7551R1501Q4237L8649k1400p1463r0340o9383j8487
582a35099M2379Q5499R0531N2280j2097o8680r0990p3031k3391L6101P8114Q4021
594F5637N5463M850n3155q9675q1564l4011K5740P1891Q9473O5033P221n1675
606G5228q0012p5369m3922R158O4884Q9319O8559K0143l7204p9915q5735m8223
618a23089R939N7734P8978O9957L0028k6577p1002q1092n8224q111M9191Q3527
630A1259P6719L4121k0510o5633q0372n9653j2694L7365P2429P8641M7303r257
$$ y = [-119210, -35895, 60612, 129357, 141842, 91040, -1182, -92815, -143259, -129860, -56566, 43922, 124089, 145289, 99652, 10260, -81247, -134459, -128422, -66889, 24168, 105942, 142065, 112982, 30803, -65436, -131000, -135964, -78413, 13088, 97325, 135974, 114574, 43111, -47229, -116612, -135099, -92720, -7221, 83310, 135590, 123493, 54813, -36177, -109208, -132599, -96498, -18384, 65637, 121100, 125950, 72795, -16880, -98444, -132455, -106715, -34824, 54649, 119682, 126903, 75228, -4784, -80153, -124075, -114917, -50033, 39286, 107845, 127988, 90784, 10869, -74866, -123089, -113150, -55416, 23562, 93519, 123547, 96970, 25968, -55124, -113348, -121459, -72268, 11259, 87978, 122099, 101589, 35956, -44416, -104069, -116763, -79398, -6969, 71672, 118975, 109718]
642A09718n9867q1269o6573k1908L3989P2417P5146M5694O07m6713p5937o9567
654h4263l1574K0303O3603Q0658N7406O025m4667p1744o9629l7850J3424N8559
666c9749P3277N8300K1242l0246p3251p6584m1403P559M9188P4340O5816K1323
678A09812k9454o0215o6820n1756r321M4871P3872O4605L1279j4466n8460p6552
690d2605n2693o746L4979O2254O7720M1478q794n1822o9960n9282k2190K9500
702g8161O6868O8373M0062j343m3970o7547n9993k4804J8530N4327O9479N1035
714I2856P120l8595o4949o3944l3253J4935N2643O4119N0963J7108k8027o3051
726G925o5228l7708L254M4428O8796N8510J7620k5855n3424o3072m5773j914M1850
$$ y = [109718, 49851, -31418, -97991, -119899, -85910, -13493, 61653, 107347, 107954, 61241, -14696, -84263, -115837, -95534, -31931, 48727, 106133, 112158, 67491, -4253, -73882, -111732, -98308, -39749, 33528, 91828, 113070, 82824, 9573, -67011, -108414, -100855, -51667, 22673, 88489, 109812, 80358, 20143, -46677, -98433, -107754, -62883, 10989, 75594, 106873, 92407, 33947, -42605, -95298, -102044, -67065, -4811, 62909, 104387, 95593, 43771, -26189, -85471, -107661, -78161, -11293, 57080, 97142, 95799, 51829, -15718, -75711, -100515, -81985, -27658, 41821, 92856, 99976, 61381, -3568, -67512, -100765, -85830, -33187, 30932, 81895, 99003, 70976, 7925, -57303, -95011, -91757, -47329, 21467, 79977, 97597, 71742, 18318, -44754, -90527, -92441, -50591]
739e0591N9761N4216L1741j0999n5504o7812m4056p018K8862N7978O3008L3097
751I2683j1657m3649n8689n3885k0942K7997N8286N8302L8227J541m1671o4696
763a8153n1519j7896J6662M6977O1817M5082M058l4476n5048n6631l1082J2662
775g7547M8589N7632M4830J4071k6016n5868n6299l2031K384L8325O0386N1966
787G0422J6965k2499m8589n7786l9452m21L6526N3012M9849K6985j3297m8031
799B3684n6220l9335j0395K6309N5539N4973K5883r197l6715n3951m9314j5038
811h3777K5992M7772N0484L6793K569l9191n6914m3591j8593J2999M4746N7524
823C6813L6742P88k7898m7200n1819k8473J3418M3022M9569L9498J4325k4290
$$ y = [-50591, 9170, 63386, 95127, 84128, 28624, -39188, -83244, -90262, -61400, -3422, 59586, 92683, 81026, 37377, -21312, -75197, -96139, -68142, -9856, 48446, 86673, 88214, 46543, -18153, -69672, -87568, -70906, -23929, 37888, 82970, 87028, 52552, -2496, -59127, -90209, -77547, -28958, 28674, 73504, 87575, 61559, 5691, -50608, -82639, -80255, -41930, 18456, 70422, 87387, 64888, 16299, -41487, -80939, -81360, -44834, 8178, 58027, 85012, 71715, 23684, -32536, -71871, -82266, -55957, -418, 54555, 80438, 71241, 34526, -19425, -68739, -83777, -57785, -10013, 40471, 77264, 79833, 40642, -16272, -59863, -78456, -65457, -20711, 36813, 73555, 74343, 46445, -755, -52574, -81047, -67629, -24607, 24962, 64460, 78785, 54495]
835E4495n1122m9129k6655J981L3149N3980M5639J3889j8795m2010n1607l6594
847g2779LL3123M7810M3996K3423j2327m2995m9603l4995q365K4408M8350M7423
860D7472K2999o149l3960m9974m2226j0571K1975M0903M6319L3142r26l4957m7235
873a3188l8689j8929J1646M2563N0185L0290K200k3203m4942m7759k1393J4197
885e7022L5243M2601L7820J2499k4371m5255m0877k4854M31L1499M9542L7826
897E5082J1296j5557l7749m6355l1196J668K7916M0786M0758K2217j2839l9251
909A6776m3125l0426q290K1718M4700M1874J9128o170k9172m4468l7581q659J8867
922d4828L6323M1730K9457j344l2029m1635l4023j6005J0620L7393M3249K7477
$$ y = [54495, 3373, -45756, -72411, -70430, -37281, 16699, 62338, 76227, 57432, 15422, -36185, -72779, -72776, -39653, 8157, 52153, 75576, 63249, 20254, -29349, -64344, -72709, -48301, 49, 47472, 70471, 64322, 30362, -19612, -61838, -72409, -50434, -9531, 36788, 69930, 69004, 34047, -13188, -51877, -70806, -59160, -16597, 33588, 63878, 66078, 42875, -2067, -49826, -71219, -57022, -21779, 20822, 58642, 71141, 46770, 1515, -39362, -64216, -63785, -32286, 17256, 55082, 66378, 50821, 13072, -33283, -64479, -62811, -34895, 5891, 46649, 68866, 56027, 16776, -26349, -56775, -65065, -43347, 1353, 43227, 62355, 56185, 27013, -17455, -55036, -63695, -44828, -8505, 33225, 62682, 61338, 29309, -12326, -46349, -62354, -51734, -14341, 28908, 56385]
934E6385L426k1612m1113m0782j8427J0376L1297M0735L3886P452k2475l6653
946B495l5805k4334M23L0171M2750L2096J1272j2197l5764m3412k4513K929K3017
959c0872L5366L7916J8764j2645l3990l6361k8623q981K0954M1012L6573J6344
971E5457n387k6828m0323l1520p242J6028L1898L7941K6126k343k7775l6407l1508
984d1883j5039J1924L4387L6817K3250L349j8835l7234l5648j5632P994K7167
996a9383L8303L0908M962k0720l2610l2070k1636K526K6979L6389K7918J1281
1008E2847j0781l2883l8193k1686J864K1132L3943L3002J3649j2246k7340l2077
1020a8769k7189o892K0138L4998L1145J6602l672k6990l6838k6160m988J4081
$$ y = [56385, 59811, 38199, -2914, -43696, -62123, -51747, -20450, 20285, 54171, 61623, 39148, 2495, -33310, -57644, -57221, -27050, 15700, 47796, 59068, 46871, 11107, -32305, -56818, -53889, -30872, 4494, 42410, 61174, 48529, 14539, -21822, -50445, -59426, -38472, 2540, 39113, 55457, 50070, 23242, -17081, -48601, -55843, -39815, -7917, 30024, 56150, 53807, 26032, -10375, -41883, -56922, -44998, -10611, 26206, 49456, 52805, 33970, -3264, -38912, -54544, -46550, -19383, 18920, 49828, 54790, 34070, 1460, -30610, -52246, -49720, -22741, 13648, 41566, 52847, 42066, 9183, -29010, -50696, -48832, -27700, 6243, 39245, 52894, 40648, 13308, -18769, -45958, -52850, -32712, 2286, 33431, 50033, 46361, 19371, -17467, -43627, -48615, -34534]
1032c4534K7889L3837K2494k807k3543l2020k9885j3330J2638L0897L1790K0960
1044D4386L169j8808l3584k9436j2412N686K3321L4199K7669M512j7872k9249
1056A581l0528j8575M258K4641L0598K4535J0627j0359k9475l2463j8823l2J7946
1069b6069L2282L0284J1238j1807k5002k8648k2683n058J7064K9024K8429J6422
1081D5476m056k4669l2152k2963n815J2569K7554L0103J6683l389j8345k7520
1093f524k7449j2622J1640K6775K8671J9643K650j8226k9577k5482j1355N659
1105c6197K1276L0168K2737M014j3954k5752k8345j7484M758K2719K7728K1690
1117C3358Q601j0744k5521k6950j7348j029J6694K8737K5777J0452q891k2531
$$ y = [-34534, -6645, 27192, 49686, 46879, 23336, -8684, -38569, -51899, -39261, -8364, 23426, 44386, 47555, 28747, -4837, -34273, -46685, -40999, -17678, 16521, 44190, 48702, 30830, 1581, -28947, -47522, -43264, -18623, 11975, 36510, 47137, 36778, 7303, -25160, -43983, -44015, -26069, 6213, 36497, 47735, 35928, 10926, -17722, -40405, -45463, -28399, 625, 29054, 45476, 41420, 16751, -15401, -38364, -44179, -31610, -4056, 26047, 42730, 39341, 20996, -6524, -33973, -46595, -34955, -8180, 20491, 40134, 42784, 24558, -5019, -30501, -41856, -36197, -14921, 15247, 37984, 41998, 28044, 2292, -26053, -43537, -38779, -16060, 11668, 33358, 41959, 31215, 5694, -21256, -38604, -39633, -22939, 5798, 31575, 42027, 33136, 10605]
1129A0605k7975k0418j770J6212K4365K4363J4679l724k1485k7727k1196o257
1141d0328J2055K5616K6648J4112k645j7439k5484k3128q930R595K1809K5463
1153A7344J9152K540j7572k6629k2457j0050N525K0567K5915J8626L987j1707
1165B5241k3325k5323j4560M037J8705K5095K1033O763j0950k3044k3275j4404
1177c4007o68J5024K4907K2316R376p327k0221k5348j7855j318J3963K2689K2011
1190B3542J1848m162j8818k3410j8870o154J0303K3051K3987J3519l086j6023
1202A5727k3609j9607o916Q156J9095K3176J6419J155j4082k2957k0784j0809
1214c5036O108J9510K2970J6277K823j1018k0734k1728j1810K453J6104K2772
$$ y = [10605, -17370, -37788, -39558, -23346, 1019, 25382, 40061, 36337, 14852, -12875, -34071, -40328, -28273, -2657, 23991, 38103, 35458, 18019, -7465, -30593, -39523, -29928, -8119, 17344, 36496, 39036, 21464, -5165, -27622, -37672, -32147, -11580, 14335, 32961, 36948, 25241, 1916, -23407, -37967, -33930, -15225, 9870, 30903, 37666, 26716, 3672, -19603, -34007, -34675, -19651, 5256, 27572, 36948, 29621, 9400, -15948, -33803, -35121, -21158, 1531, 23542, 35390, 31228, 12410, -11000, -29870, -36024, -25721, -2670, 21317, 34836, 31750, 15727, -7882, -27489, -34405, -26249, -7154, 16022, 32441, 33596, 19514, -3443, -24227, -35036, -28928, -9418, 13552, 29829, 32652, 21634, 900, -20828, -32638, -30185, -14081, 8691]
1226H691J9365N820j0202k0100k1102j3523K64J4316K2100J8601P834n881j7567
1239H616k2810j5984j557J2760K1195J9983R687m744j6953k0386j6619m806R497
1252b2121K0180K0738J1830j737j4918k1376j7907n860Q221J8275K0174J2791
1264B8290R54j2226k0306j8903q427N245J7100K0437J4965K719j1257j9203j8534
1277a9146j0223K992J4612K0418J6402M638q284j7966j9812j2101J266J3616J9222
1290E634J6290O550n556j6693j9297j2993j912J1089J8764J8093Q845m682j5447
1303H685j8504j4531l802R088J8075J7482J0631j888j2743j9458j5764n105P440
1316b0394J6146J8202J1975N8j1939j7515j6022p434M493J5046J8733J2889J818
$$ y = [8691, 28056, 33876, 23674, 3574, -17528, -31051, -30787, -16471, 5629, 24230, 32064, 26183, 8616, -14194, -30178, -31735, -18975, 2220, 22203, 31890, 27146, 10193, -10193, -26812, -31618, -22121, -1941, 18797, 30627, 28890, 13972, -7404, -25311, -31171, -22950, -4675, 15499, 28290, 29244, 17018, -3288, -22191, -30618, -25373, -8273, 12164, 27129, 29848, 18591, -612, -19146, -29369, -26377, -11765, 8653, 25055, 29693, 21409, 3443, -16369, -28470, -27204, -13588, 5634, 21924, 28474, 22918, 6225, -13072, -26065, -27977, -16888, 1876, 19969, 28814, 24132, 8685, -9819, -24350, -28152, -19064, -989, 16493, 27124, 25236, 12493, -6965, -22729, -27834, -20394, -4248, 13954, 25929, 25987, 14048, -3467, -19489, -26923, -22430, -7384, 11349, 24238, 26056]
1329B6056r718j6759j6530r703L668J3398J7586J3870M534p244j6735j7449j0270
1342b5296J361J1257J7282J5847O059o643j5119j6527j1537j795R898J7140J5813
1355A7740P364l715j3302j7142j2888l018Q380J5817J5590R552j858j1946j7010
1368f436j3251m776N987J4522J6926J0221l03j0722j5237j4322p208M482J4018
1381f099J5963J1388K002q483j5226j5401p530K971J1358J6166J2793L763p602
1394A6063j4118j4965r547L39J1450J6128J3004M438n019j2919j5229j1158o75
1407b2208J0134J3802J3781O750l082j2367j5158j1236k282P282J3856J4150Q152
1420B1574j316j1330j4977j2008m220N970J3698J4613Q813q82q708j4077j3804
$$ y = [26056, 16338, -421, -16951, -26654, -22986, -9588, 7998, 21868, 26402, 19158, 2423, -15026, -25296, -23935, -12678, 4604, 20451, 26510, 19867, 4748, -11779, -23316, -25111, -15213, 1927, 17740, 25104, 21389, 8087, -9055, -21943, -24961, -16581, -764, 14826, 24378, 22520, 10574, -6436, -19687, -24463, -18476, -3954, 12972, 23193, 22890, 12168, -3069, -17391, -24599, -20117, -6099, 9864, 21252, 23254, 14771, -455, -15856, -23386, -20415, -9057, 7109, 19902, 23665, 16063, 1945, -13020, -22567, -22228, -10778, 5350, 18354, 22792, 17773, 4854, -10375, -21533, -22208, -12074, 1728, 15509, 22259, 19177, 6810, -8348, -19584, -21866, -14584, -728, 13422, 21574, 20258, 8928, -6049, -18057, -22277, -16307, -2609, 12004, 20817, 19935, 11227, -2850, -16654]
1433a6654n433N243J2061J3486J0648K003q205j4643j2687o220K556R450J4883
1446F488J1912K124o429j2248j3678r008J754J0211J3555J1277M850m776j2868
1459C164j3818q047m00P661J3359J2937N768m066j1135j3115r699k006O834J2633
1473G0J1948O825j297r311j3463j0784l651N153J2453J3115P581p68q527j2797
1487c453j1345m288M311J0316J2966R279J292q315j2450j1044n555J925J0045
1500f316J3513Q702J775n082j1012j2622p657K219R002J1360J0867M258n535j1355
1514B117j1234p086j284O881J3336J1125M129l600r116j2491r733n96P399J0559
1528D06J0649O338j311r689j1602q710l377M277J1092J2404O678j247p781j1307
$$ y = [-16654, -22087, -16844, -4783, 8703, 19351, 21354, 13149, -1494, -14181, -20401, -17845, -8395, 6488, 18400, 20524, 14095, 1847, -11831, -20839, -19085, -8874, 4681, 15958, 20808, 16032, 3164, -10654, -18701, -19101, -11440, 1919, 14856, 20624, 16558, 5423, -7692, -17391, -19397, -12563, 70, 12018, 18843, 17546, 8235, -5228, -16012, -19663, -14510, -2057, 11058, 18639, 17871, 9344, -3453, -14798, -19086, -14775, -4459, 8507, 17786, 19078, 10763, -1687, -12731, -18286, -16361, -6316, 7197, 15899, 17674, 12592, 1580, -11042, -18699, -16480, -7478, 3882, 14749, 19007, 13472, 2117, -9117, -16203, -17487, -10606, 2730, 13855, 17984, 14384, 5268, -7223, -16956, -17552, -10153, 406, 11055, 17393, 16082, 6393, -5209, -13919, -17296, -13019, -1927, 10477, 17155, 15908, 8127, -3180]
1542c180j0736l557M482R440J1120Q381P86o988j0945j0539n514K678R855J1357
1556F640P403J893m648j0384j1057n806J384P222J0831J0230L642n698r947r695
1570g990p296o65P269J1467Q630M021j745q663j1922q287k0N603R221J1168N667
1585A6458k924q716r406p344l887M354J0263J0235N556k85o162j1434r743k081
1599a5116M033P853R759P847K44o716r162q503n565K130Q635J0481P124J476m835
1614I685r564r448m438Q32O433R574R306K810m617q218r404p347m4P409R841P482
1630A0292L409j614q279j0002o479r41M323R139J0286M671l147p348q441p525
1644a1656k783N058R102Q158M645Q50o107j0547q211j857K980P871R638O566j385
$$ y = [-3180, -13916, -17473, -12991, -3551, 7569, 15950, 16736, 9748, -1197, -11736, -17250, -14572, -4717, 6640, 14043, 15936, 11288, 904, -10153, -15959, -14575, -7353, 3478, 13708, 17350, 11652, 1705, -7990, -15286, -15951, -8682, 2785, 11415, 15436, 13691, 5028, -6894, -15181, -15201, -9598, -377, 10791, 16458, 13534, 4818, -4588, -11932, -15819, -11465, -1202, 9033, 14589, 14304, 8142, -3292, -13035, -15116, -11083, -3230, 6529, 14376, 14620, 7904, -1258, -9761, -15326, -13196, -4561, 5920, 13044, 14520, 9685, 121, -9327, -13765, -12933, -6500, 3074, 12380, 15190, 10573, 2355, -7049, -14396, -14440, -7031, 2810, 10292, 13701, 12087, 3808, -6194, -12673, -13614, -9291, -152, 10134, 14805, 11658, 4310, -4131, -11656, -14439, -9381, -279, 7879, 12524, 13374, 7267, -3280, -11491, -13348, -10368, -2497, 7141, 13707, 12322]
1659A2322n741p373p930n244K041Q459Q639O334J863m377r181q934l787J785N654
1674e470Q703Q116J675l969p059q710o464N17O575Q929O869L001k170q094q653
1689f204n031q54M411Q199Q552L535j914o582q042p603j616N716P536O641M952
1704A1696K12o271q910o430k308K431P161R370N102j155m832o826p877l911K913
1719i635P018P068N769K215m082q981p481k999N75O120Q289O447O02k949o199
1734A777p991n565P43N785P650O198L680k635p761p623m344n07L701P388P535
1749H031L185j893n235p853o848r29M751O835O430M470n38o321p219n454k077
1764a0665J683P286P754M258k7m600p099p244k722L232O207N974N517J573m624
$$ y = [12322, 6581, -792, -8722, -13966, -11925, -3466, 5173, 11507, 13370, 8993, -188, -9122, -12909, -11124, -5470, 3233, 11349, 13024, 9055, 1996, -6714, -13178, -12661, -6086, 2843, 9712, 12713, 10543, 2449, -6204, -11235, -12089, -7678, 521, 9073, 12608, 10694, 4112, -3930, -11533, -13149, -7433, 103, 6744, 11696, 11908, 5637, -3273, -9703, -12011, -9580, -2419, 6951, 12053, 10898, 6066, -760, -8637, -12548, -9635, -2617, 4451, 10220, 12435, 8353, -628, -8109, -11108, -10533, -4413, 3876, 10323, 10925, 7976, 1777, -6214, -11779, -11036, -5251, 2399, 8597, 12277, 9642, 1881, -5742, -10086, -10593, -6892, 496, 8031, 11216, 9323, 4088, -3765, -10613, -11542, -6791, 44, 6474, 10944, 10406, 4085, -3134, -8588, -10665, -8982, -1696, 6058, 10316, 10289, 5689, -1410, -8654, -11376, -8144, -1937, 4037, 9554, 11127, 6503]
1779F503o980o429l644O50N654P980N732Q41l242o031p015m476R73M755O511O179
1795G961K972k646o572p011m080q37M557P153N777K892j929m912p184n707l61
1810i927L876N927O203M296j263n646o629m620j638K225O079O423L631K11m053
1825E095o735o183k098K561N214O266N084L17m118n992n684l205Q77N509O513
1840C421M734J200k672o190o482l162J029M067N700N712K460l021n367n643m528
1855h742k56L910O890M841K525j624m975o382m365o38L205N761N789L355j081
1870H213n334n654m412j850K789N583N514L504m7m041n729n491j966K289M558
1885b074O106L985O17l915n462n177k952J396M960N583M454J019k659n633n711
$$ y = [6503, -477, -6906, -10550, -9900, -4246, 3734, 9466, 10307, 7065, 1034, -5981, -10457, -9484, -4729, 1782, 7961, 10933, 8287, 1715, -5296, -9376, -10213, -5656, 1497, 7274, 10166, 8237, 3325, -3859, -9566, -9927, -6051, -124, 6079, 10375, 9112, 3466, -3163, -7783, -9421, -7196, -1117, 5306, 8937, 9148, 5095, -1640, -7823, -9921, -7360, -2146, 4120, 9204, 9521, 5403, -589, -6273, -9478, -8601, -3092, 3421, 8155, 9355, 6683, 493, -5989, -9151, -8122, -4055, 1645, 7357, 9817, 6796, 1429, -4214, -8742, -8998, -5088, 1802, 6643, 9168, 7544, 2569, -3813, -8178, -8816, -5611, 150, 5939, 9294, 8213, 2879, -2775, -7187, -9037, -6248, -665, 4849, 8353, 8306, 4265, -1464, -6955, -8921, -6632, -2074, 4032, 8017, 8634, 4719, -743, -5920, -8872, -7476, -2516, 3067, 7521, 8540, 5881, 248, -5463]
1900e463k833P32M158N446N140J404k512n066n357l728P1L636N677M788K250j627
1916F716m623o019l621P5K483N058M966L172j224m386n172m165j339K444N356
1931b79N017K963k69l812n785m441j381K165M190N466L445J92l090m821n008k506
1947g954J363M245N519L593Q62k476n306m831k450R32L459N156M168J353k122
1962E511m568n190l042P7L732M994M277J751j426m471n122l084p41K711N055M788
1978E252K116j215l770m953l766j075K595M472M433L180n74l399n161m237j126
1993g228J653M409N122K555o1k736m301m237k047J044L956M795L401L06k416m372
2009a57m798j900P12L494M584L724J410k293l866m616l118M02L169M676M085J127
$$ y = [-5463, -8296, -7564, -3406, 2040, 7180, 8584, 6072, 1006, -4351, -8079, -8008, -4372, 1305, 6093, 8343, 6716, 2093, -3926, -7547, -7472, -4989, 69, 5035, 8207, 6983, 2597, -2575, -6740, -8079, -5635, -279, 4738, 7701, 7432, 3620, -2165, -6606, -7987, -5822, -1632, 3834, 7279, 7471, 4381, -440, -5448, -7954, -6591, -2346, 3173, 6766, 7628, 5152, -154, -4985, -7435, -6503, -3044, 2112, 6280, 7633, 5511, 943, -4247, -7289, -7212, -3480, 1514, 5791, 7542, 6116, 1645, -3477, -6561, -7302, -4591, 464, 5252, 7368, 6153, 2383, -2570, -6336, -7411, -4816, -344, 4089, 7269, 6695, 3296, -1865, -6102, -7228, -5575, -1166, 3956, 6511, 6450, 3714, -587, -4824, -6871, -5827, -1871, 2924, 6325, 6631, 4215, -157, -4955, -6855, -6143, -2649, 1935, 5659, 7069, 4776, 910, -3706, -6824, -6422, -3253, 1423, 5508, 6635]
2025F635j387l561m575l507n41L062M437L955K143j042l422m713l491n48K265
2040d290M297M065K347o79k924m261l871j401J506M492M217K565L3k672m231m278
2056e085j149J268L258M111L090J010k477m250l958k063Q77L222M238L227N93
2071E912j700l380m222k711J05L163M287L313J376j474l459m487k196N0K191L657
2087D25L578J985j050l160m163k963p59K156M049L857J821r25k557l786l331j133
2103e956J878L192L735K401K09k453m209l483q42J165K935L782K733K31j911l466
2119e9l633k114O30L354M067K512M30j551l338l763j934N53K515L183L362J856
2135F070j670l618l758k085J2K274L341L483J180j006k617l683k781p86K218L764
$$ y = [6635, 5248, 1687, -2888, -6395, -6936, -3874, 563, 4518, 6661, 5619, 2197, -2516, -6007, -6555, -4290, 7, 4072, 6419, 5740, 2816, -1445, -5316, -6717, -5211, -719, 3498, 6063, 6096, 3424, -807, -5085, -6234, -4966, -1708, 2403, 5493, 6503, 4026, -224, -4182, -6245, -5368, -2146, 2092, 5319, 5912, 4212, 832, -3390, -6101, -5996, -2833, 1454, 4767, 6143, 4669, 1210, -3277, -5473, -5423, -3232, 425, 4003, 5988, 4938, 1778, -2385, -5348, -6107, -3951, 98, 3955, 5776, 4851, 2294, -1492, -4823, -5956, -4078, -886, 2849, 5250, 5459, 3006, -1203, -4686, -5528, -4363, -1428, 2354, 5087, 5318, 3407, -59, -3692, -5806, -5176, -1822, 2245, 4757, 5187, 3636, 298, -3465, -5399, -4846, -2331, 852, 4214, 6070, 4400, 782, -2976, -5061, -5049, -2775, 566, 4049, 5229, 4223, 1606, -2077, -4858, -5644, -3426, 338]
2151C38L142J869o52k840l688k508o48J555K424L505K611k59k509l607k969j604
2167e840J852L058L765J502J14j761k912k893k108P77K710L447K858P99k104l391
2183a27l165j361K59K382K989K933J036j319k845l197k450o7K682K905L079Q17
2199D551q29k282l692j868m26J555K709L552J910q00k951k854k778n06J703L118
2215A12K770J578k56j824l361k944j165J754K607K970K107N5k008l152k220j189
2231d166L85K093L346K265O68j580l165k827j318M07K015L431K234N67j046k790
2247E19k749j902k75K402K739K635J099r73k868k971j327l23R97K727L244J452
2263D426o69k057k819k914n62J703K972K565J095j18j766k482k801n87P15K179
$$ y = [338, 3480, 5349, 4697, 1857, -1831, -4339, -4987, -3432, -1008, 2497, 5108, 4849, 2340, -1267, -4236, -5840, -3988, -930, 2835, 4337, 4451, 2690, -222, -3115, -5223, -4446, -1736, 1711, 4569, 5368, 3264, -127, -3292, -4653, -4394, -2012, 977, 3910, 4946, 3627, 782, -2415, -4865, -4932, -2250, 655, 3734, 4551, 3722, 1440, -2252, -4120, -4546, -2991, -282, 3270, 5180, 4380, 1429, -1425, -4203, -4709, -3006, 112, 2882, 4460, 4204, 2380, -981, -3925, -5090, -3336, -729, 2241, 4348, 4403, 2395, -757, -2977, -4166, -3781, -1688, 1658, 3923, 4591, 3011, -154, -2981, -4299, -3892, -1877, 1554, 3788, 4355, 3309, 519, -2230, -4132, -4407, -2005, 734, 3369, 4468, 3495, 627, -2344, -3671, -3994, -2997, -270, 2974, 4426, 3757, 1700, -1119, -4033, -4595, -2892, 80, 2645, 3740, 3622, 1856, -626, -3427, -4014, -3299, -1120]
2279a120L339K385o81j820k444k367j295L18K394L082J649M04j043k815k543j458
2295d015M06K002L145K244J91j154k695k192j708J9J865K215K752J216r49k713
2311F29k546j998K82J422K545K445R25m80j899k513k389o86J736K517K230J498
2327C718k2k272k516j788m21L39K035K912J766P3j840k213k565j027O96K513K332
2344A720J369L74j049k667k312j036L36J600K816K315K02j217k381j782j869J79
2360c402J831K375J576J128n65k257k720j401J82J448K284K124P44n59j738j974
2376i24j882n36J130K146K118J783o65j830k707j268r25P98K159K441J188j42
2392B884j231k161k278r86J077J786K262J580N02j543k124j627j453K01J911K240
$$ y = [-1120, 2219, 4604, 3923, 2103, -341, -2708, -4003, -3685, -1291, 1791, 3440, 3844, 2801, -14, -2557, -4015, -3609, -1607, 1538, 3782, 3973, 2819, 124, -2068, -3776, -3757, -1892, 323, 3075, 4291, 3342, 629, -1917, -3915, -3633, -2211, 334, 2779, 3704, 3224, 1325, -1188, -3577, -4263, -2527, -10, 2220, 3718, 3696, 1424, -1092, -2880, -3301, -2962, -927, 1985, 3751, 3824, 1984, -229, -2794, -3821, -3125, -612, 1720, 3089, 3463, 2414, -253, -2565, -3601, -3265, -1665, 1151, 3466, 3668, 2451, 70, -1712, -3581, -3402, -1571, 804, 2380, 3508, 2943, 686, -2034, -3435, -3253, -1805, 479, 2603, 3347, 2788, 1050, -924, -2806, -3342, -2212, -66, 2052, 3835, 3170, 1340, -1367, -2635, -3560, -2762, -603, 1838, 3026, 2884, 1653, -508, -2786, -3772, -2695, -909, 1353, 2933, 3435, 1892, -232, -1859, -3312, -3111, -1200, 1040]
2408A040J755J98p42j859k191j533K34J786J916J785R92q56k010k162j441N0J130
2425a908K472J904O94p98j105k209k213L0J368J575J771J657l30j774j970j698
2441b534m85O26J921K375R30Pq67k263k337o19R28J841J598J844l1j081k163j771
2459b081n92J48J528K116J358K88o63j645k060j581O44J334J755J702P44r58j957
2476H0j607j358o9J380K273J502N99l96j646j853j621nJ346J300J751J280n25
2493B431j559k205r54n37O00K281J590P99J20r91j965j726n43Q00J538J412J534
2510B625J95j390j721j520j145K97J834K107J023J98p10j607k043p36K53J409
2526i31J501J727P82r22k059j382q37n83J105K226J138O38j33j637j944j080K17
$$ y = [1040, 2795, 2993, 2251, 392, -1799, -3332, -3098, -1312, 604, 2389, 3381, 2525, 515, -1647, -3088, -3038, -1908, 564, 2468, 3162, 2364, 1259, -950, -3163, -3133, -1765, -190, 1581, 3238, 2908, 1134, -836, -2534, -3019, -2393, -472, 1903, 2833, 2840, 1973, -290, -2627, -3246, -2318, -477, 1121, 2965, 2934, 1853, -310, -2081, -2673, -2525, -997, 1119, 2477, 2765, 2102, 457, -1603, -3184, -2540, -1206, 549, 2251, 2995, 2037, 80, -1527, -2885, -2954, -1574, 699, 2201, 2800, 2404, 758, -1095, -2716, -2721, -1375, -75, 1676, 2956, 2431, 872, -1333, -2287, -2824, -2224, 57, 1647, 2446, 2566, 1575, -390, -2116, -2659, -1859, -321, 1091, 2625, 2820, 1430, -291, -1811, -2956, -2659, -825, 1282, 2305, 2503, 1793, 186, -1857, -2593, -2340, -931, 570, 2297, 3079, 2157, 98, -1284, -2121, -2704, -1599, 627, 1765, 2403, 2270, 633, -1311, -2391, -2174]
2543b174M50J710J700J122m02j672j387j395n56O32K028J375R03k7q08k017j563
2560b081m66N97J326J887J144j24j092j324j366j308P80J365J692J110J48p19
2576A569j540j730n66K88Q96J372J596L81m83j524j120j481k78J555J434J409
2592A778O64l85j520j892p08j49P50J591J659O46l96j685j049r29q95Q55J722
2609E7J297P43j36p39j861j190l58L30J106J927J356m21j179j087j405p61M13
2626a908J096J770P89O62o94j691j637k25J13P78J897J006N4o24j173j153j005
2643a945j40R48J349J398N95l59j390j500j057L73P55J140J342P78o93n96j376
2660c78j393m69J085R55J423Q22j02j103j283r15m66K41J202J618P65M0p13j413
$$ y = [-2174, -1724, -14, 1686, 2808, 2406, 734, -653, -2048, -2604, -1972, 56, 1431, 2334, 2307, 1499, -518, -2081, -2547, -1950, -624, 1263, 2407, 2283, 1191, -133, -1499, -2807, -2027, -662, 1030, 2140, 2288, 1569, 29, -1701, -2267, -1979, -1083, 289, 1885, 2266, 1783, 259, -861, -2342, -2620, -1065, 369, 1778, 2442, 2057, 537, -1355, -2063, -2212, -1462, 129, 1788, 2434, 2038, 353, -696, -1625, -2520, -1665, 57, 1354, 2097, 1961, 1222, -639, -1829, -2187, -1857, -751, 1176, 2532, 2111, 932, -155, -1560, -2321, -1908, -812, 958, 1747, 2409, 1715, 24, -1613, -1838, -1725, -947, 950, 1956, 2010, 1386, 213, -940, -1945, -2085, -1137, 212, 1610, 2205, 1846, 456, -1044, -2101, -1728, -973, 167, 1509, 2287, 1594, 998, -378, -1771, -2240, -1155, -200, 1223, 2045, 1943, 840, -443, -1358, -1824, -1583, -381, 1237, 2002, 2042, 1329, -84]
2678h4j874j02P27Q65J285J208j73k66j801j148m90j65J220J649J005J78q40j036
2696A58j479o95L47P68J125J155O38k61j187j761o49J43O26J097J180Q70n42q49
2714F84j205j166n88J185R71J227O95j98j028j290p21l69O28R06J071R52Nm74
2732A285j339j677k18N41J229J032J006k86o97j061r50n25j37J006J152J292K31
2749A884o80j026j348o51M40R89P80J009L17k70r97j387q29j30P60J829O99P07
2767B096q04p42j100q55l20O64O26J328P01J51j141r56j128l06M12J237J156N54
2785A573k70n34j060j030k55J36J198J140N49J80p59j120p55m89L09P60N54R50
2803A077P42q13r40j420m19K99P74J013J265j21k66r63p83o90m51J064J000O41
$$ y = [-84, -1958, -2060, -1333, -468, 817, 2025, 1852, 1586, -215, -1363, -1853, -2018, -798, 851, 1856, 2034, 1194, 158, -1321, -2016, -1669, -901, 224, 1379, 2017, 1756, 569, -1192, -1841, -1698, -1072, 25, 1205, 2075, 1533, 684, -521, -1687, -2275, -1090, -119, 1108, 1803, 1605, 577, -713, -1434, -1803, -1175, -269, 802, 1754, 1759, 1285, -54, -1731, -1949, -1408, -179, 853, 1859, 1573, 876, -185, -1135, -1660, -1797, -791, 361, 1653, 1884, 1204, 178, -1170, -1821, -1381, -392, 388, 1397, 1714, 1444, 447, -940, -1769, -1899, -1139, 690, 1389, 2096, 1292, 550, -550, -1405, -1725, -1061, -435, 893, 1594, 1745, 604, -352, -1480, -1786, -1374, -137, 1019, 1573, 1303, 769, -291, -1321, -1576, -1440, -242, 898, 1447, 1627, 868, -252, -1007, -1496, -1187, -427, 127, 1077, 1819, 1006, 66, -1354, -1773, -1474, -700, 313, 1578, 1457, 1191, 228, -555, -1245, -1696, -632, 368, 1009]
2821A009P30m70p86r96p35m05N46J031R81Q14J30j288j090r25l31K52J447J147
2839A061J74M1n98p26j261k90N64R06O43J019j10n30j332p12l02K02J013P50O23
2858A135J31k43o80j131r68K94N61J309J083l42M7j065q24l93m97Q77R98P82N42
2877A616m76r83j006k28m14P63L28J492K77l19m76p90p16o70O85R12P56O99j79
2896A271o18j078p33j24M01O71R65N12Q9l84j530l85l67K4J082P66O39j49l40
2915G12p27n02r29K35P51Q94Q28ml79j043o04p41K42O94O75J130J1p5j001n43
2935c76p68p2K58J151Q06K68n15k48q18p56j82M55O02P29M81J50q31o44o77l27
2955a314K11Q56J059L70l4l37o33r13m92J64R61L89P32L21q01o27q61J28j77N97
$$ y = [1009, 1739, 1269, 483, -513, -1248, -1653, -1107, -76, 905, 1719, 1849, 561, -529, -1454, -1785, -1533, -86, 1061, 1235, 1276, 678, -48, -1309, -1599, -1035, -129, 514, 1533, 1423, 893, -439, -1151, -1453, -1251, -238, 512, 1135, 1266, 1023, 343, -788, -1756, -1462, -901, 408, 1491, 1149, 1196, 131, -693, -1086, -1583, -706, 292, 1074, 1616, 1140, 157, -849, -1077, -1491, -728, -400, 1092, 1369, 1050, 574, -216, -932, -1602, -917, -5, 751, 1450, 1271, 653, -425, -1158, -1282, -881, -210, 755, 1267, 1356, 972, -558, -943, -1310, -1286, -204, 562, 1201, 1052, 712, -15, -517, -1446, -1211, -460, 434, 1262, 1258, 879, -164, -768, -1509, -1267, -573, 102, 1232, 1243, 1168, 167, -376, -1144, -1216, -958, 193, 999, 1267, 752, 504, -314, -1070, -1252, -797, -195, 534, 1015, 1165, 334, -310, -987, -1314, -1103, -247, 812, 1182, 1148, 811, 178, -735, -1227, -1063, -102, 287, 1019, 1340, 539, -88, -949, -821, -998, -401]
2975d01O29Q31q6k6o44q00l21m26P19O78N38L42k75o19o31l18n79P14N76Q00K57
2996I58k3o30m51o98k55K18O83Q04O01k7q33n99m93l92L69O40Q83K27K23p31p36
3017b62p32k7N35J52N53O33K48j54r22o51m01k49O42J227L67K38n82n81o86m69
3037a121j27R24M02O86L03j35n75r91k50m21O87O23Q20K00m66k96n02l65o9K3
3057f50N13O46K39o3m20n17l45m14K23Q67L40P49k30m88o89o80n3M07L57P88K07
3078G87K78n15o95l63m16M0K89J204K44K27l92l87r25m87N08K44N53M18M26k86
3098G52l90r09j34j90N14Q45K69J83l48k68n74n83k18N97J55O22R22l05n20p01
3118b81l65k88J79N19P95J06m8l15k51o00m77K29M16O52O21j0k4j062m22j89J03
$$ y = [-401, 228, 1059, 973, 947, 303, -497, -818, -1244, -525, 153, 691, 1033, 758, 139, -492, -810, -1389, -675, -99, 701, 958, 935, 305, -146, -844, -1099, -881, -198, 606, 1207, 1180, 347, -252, -745, -1137, -768, -128, 755, 982, 1205, 474, -262, -994, -1021, -486, -334, 219, 852, 1100, 946, 24, -627, -1028, -1277, -635, 592, 959, 1197, 615, 34, -652, -1121, -1248, -324, 78, 764, 1067, 932, 357, -634, -884, -1305, -618, 5, 825, 1025, 559, 263, -239, -604, -673, -650, -137, 509, 748, 685, 265, -252, -597, -1011, -788, 79, 419, 1168, 938, 450, -239, -919, -972, -565, -208, 580, 787, 1065, 550, -145, -508, -924, -884, -595, 609, 853, 1080, 688, 301, -624, -1111, -603, -359, 194, 612, 1038, 752, 362, -547, -681, -871, -357, 488, 757, 940, 592, 324, -250, -833, -1051, -454, -299, 323, 1245, 940, 420, -281, -646, -934, -755, -236, 559, 665, 617, 302, 51, -549, -1026, -797, -381, 271, 892, 882, 858, -204, -626, -815, -712]
3139g12N30K94M51L72J26r36o48l92K28K78O00M94M65o24k12m26n29k37L90P83
3159B95J76M99k18p58o09k51r0L46L26O45M88j27l62n16m65j54K85M67M71M9L65
3180H62n06q32j70P0J01R4N81P16k57k89m46l24m40qN58L35O50p9o1l29n71m96
3202h41Q7M20N23K95L88k23m70n29m47j7M17P61J84J04J32n21q80j98J04K99N07
3223I5M45J79k20l08j98n34l79J3O59O08%K63j16q18p0j49j19L26Q63J88J49m19
3245D58q35j84j24L20L77K63M25J82m07m64o42J02l55O99L56L93K39n26j22o82
3265e27m12N70j02L62N86J58K5m97m71l57L5J73P07J82kq7n4j26o91l86N32M70
3287H8N05P8J38m62p04J68p77O64LO59J22J27j80m92n04l29L92N13J59O95l63
$$ y = [-712, -182, 112, 563, 935, 1061, 125, -523, -915, -687, -409, 191, 685, 1150, 526, 314, -112, -641, -878, -488, 295, 471, 970, 752, -6, -615, -866, -956, -610, -284, 361, 849, 722, 360, -156, -621, -775, -490, -23, 448, 497, 862, 356, -476, -646, -576, -475, -381, 200, 916, 659, 370, -76, -400, -840, -848, -290, 45, 695, 616, 555, 226, -345, -841, -754, -334, 189, 484, 872, 649, 179, -350, -797, -814, -397, 364, 548, 652, 784, 263, -617, -815, -711, -412, 95, 540, 719, 499, 191, -7, -541, -920, -907, -248, 360, 360, 623, 507, -311, -381, -530, -649, -323, 540, 728, 877, 458, -377, -561, -685, -365, 12, 275, 700, 882, 475, 11, -631, -529, -884, -185, 171, 564, 803, 277, 155, -527, -939, -369, -471, -109, 477, 635, 660, 163, -308, -665, -630, -457, 250, 432, 430, 343, 289, 163, -528, -914, -382, 88, 593, 671, 809, 347, -357, -189, -966, -302, -299, 360, 482, 609, 429, -63, -567, -896, -504, 9, 168, 863, 500]
3308E00L5o57m91j3j4L72N94J73K17k74l00l75p20K96K38M63M24rL06o80m47l18
3330f80j47K17O23K73L24j50j74l93o73J34L80K82K66L64O5l57m36n33Q7oN25
3351iO62o1m2R0r17k49k89L60K41N09K45L11m30m22k70k88K93J67M18j35N01j12
3373E73k81o69j07M8J57O10J89Q1p6o83j07j25j71QP32J78K12j20k43o00p0n29
3395i93R82J28J98J31R8j14o36k16j63J34K97P91k08K20j89o40l70O6K05J56L22
3416A99K73p7K76m73o57j7q7K77O5O32J48j89l92m04J03M3k77Q27L83j00n7n92
3438i6R2m14k53M38J16K26L90J10m45m81o6k4j35L60N93J50J13o92o0o6o33K85
3460d92K04O35J86q6k8n38n37J71J62R2L76J15M70m59m05J80o49J53K77M12K73
$$ y = [500, 535, -122, -613, -626, -640, -268, 326, 499, 716, 442, 142, -233, -953, -657, -419, 44, 468, 459, 765, 85, -362, -680, -827, -610, 13, 286, 610, 460, 286, -107, -780, -646, -266, 16, 282, 646, 711, 354, -82, -615, -528, -534, -9, 653, 592, 550, 640, -277, -526, -815, -455, -214, 295, 540, 851, 421, -1, -271, -559, -266, -99, 319, 184, 685, 573, 292, -377, -484, -436, -279, 331, 520, 601, 525, -158, -265, -390, -561, -553, 179, 357, 569, 449, 206, -394, -464, -993, -11, 117, 315, 446, 544, 430, -206, -422, -585, -451, -154, 637, 429, 649, 460, -180, -550, -484, -279, -123, 199, 472, 395, 671, 198, -459, -476, -563, -286, -221, 411, 559, 370, -22, -426, -323, -280, -557, 270, 653, 553, 496, -96, -4, -418, -671, -233, -117, 109, 499, 609, 164, -317, -383, -407, -542, -182, 411, 561, 674, -18, -78, -144, -777, -492, -288, 347, 533, 447, 419, -119, -656, -485, -323, -231, 145, 260, 730, 271, -134, 46, -603, -450, -173, 239, 512]
3481E12Jo6k41l60m41J16N24%J25N15n13k28Jn09J28N39J48k4K80J14o75j5m34
3504e03J60jM51K34L3l4m0l96l32m9J15J56M36k7K59o4n66k3m03K21L97L27m8
3527C03q1R0n43n7r5p7J74M12P3L17j13m68j89j31J04J37j37L67M32j70k93l46
3549b91j15L4J82L64J63J98j13j93p93J93p2L33l2M68K19k68J81m64k94N3r5K91
3571e1J50J06L2j2k83j91m7l63L98L17J4M23m44J31m92j1L0K55L9J25L41R2n47
3594A2k99k77O6P3N85K46k19J66l25j82j6k6n9M24L26j7M0k79l55k98j12N33r5
3617h8M49J6K65m82l64k08J19j41M13K93J67m4l90J10l46MR1K74K34J8L2J11j42
3640C91o17j74N17j64M32j09K52k10Q5o42k11J42Q8L01M77k77j80j67r3M2O4q
$$ y = [512, 513, 447, 206, -154, -595, -479, 45, 45, 170, 685, 172, -56, -55, -564, -436, 103, 251, 227, 507, 621, -54, -69, -503, -343, -344, 107, 341, 374, 340, 300, -96, -428, -477, -362, -206, 230, 203, 462, 398, -168, -191, -594, -373, 24, 351, 303, 222, 312, -231, -288, -383, -460, -286, 126, 199, 516, 403, -65, -254, -385, -281, -144, -281, 86, 518, 348, 55, -291, -406, -372, -190, 174, 337, 535, 422, 229, -564, -371, -443, -110, -142, 326, 545, 277, 458, -6, -300, -247, -342, -51, 99, 205, 237, 225, -58, -249, -296, -659, -261, 56, 70, 493, 49, 180, -312, -323, -293, -38, 1, 126, 467, 559, 12, -287, -564, -498, -425, 160, 406, 187, 353, 28, -154, -170, -196, -255, 169, 495, 478, 518, 239, -116, -414, -526, 7, -88, 361, 377, 642, 160, -204, -412, -293, -434, -21, 272, 439, 395, 5, 115, -231, -227, -136, 138, 372, 390, 422, 533, 391, -226, -400, 117, -47, 385, 276, 528, 318, 403, -239, -450, -308, -220, 81, 558, 281, 101, -66, -159, -117, -53, -61]
3662f1K50R1l5l7j18n25N3J35jL30J05L26k60n7n10P2Kj09L15L05j91R4j30m29
3686c85J31j35J23K17M8L54l3o8j46l80q7J95n9L30K90m9r2l36Q0j62r1J81PJ44
3710G7L52m16k8j3m47L15K83j11J97M73n09Q6m95k14K33J33qM21J91k41m04k07
3732c32J00L18l08J77J57L8J78k54k13J80j47m13K97L44K5J56o8k94q5M0j52K08
3754d8R2M69r5m64K15m10L46m62K43J64P5K47k01m02J48n97M60j61M78L27k40
3775A84k37l5j47k9r9J69K84J8J85O6k80m92L05l54K34L8M59j1Pk1k20j77l19
3798d72K95J26L47K25k03j76m1l35J29k16K23L6K92j38n5o0r0j74J06q9J74K81
3820A85J4Jj7m38k37L32M7J33o0J52J46k32j2j35j3Q3J21P3K80j15l21o7J95l29
$$ y = [-61, 189, 280, 245, 208, 90, -435, -382, -247, -248, 82, 187, 513, 253, 196, -314, -242, -240, -349, -34, 271, 80, 174, 44, -385, -254, -389, -266, -49, -1, 353, 320, 252, 106, -274, -361, -166, -225, 105, 395, 346, 254, -82, -2, -164, -255, -74, -67, 77, 429, 13, -15, -28, -475, -160, 123, 12, 209, 682, 173, 259, -236, -450, -217, -84, -92, 329, 520, 279, -125, -332, -232, 86, -222, -45, 112, 150, 328, 74, -139, 41, -106, -519, -222, 122, 147, 303, 235, -59, -144, -104, -256, -48, 44, 513, 418, -46, 169, -241, 105, -357, -114, 50, 125, 372, 171, -231, -83, -680, -220, -381, 97, 424, 184, -53, -88, -235, -264, -363, -194, 90, 108, 293, 359, 79, -413, -108, -462, -228, -190, 269, 258, 265, 244, 24, -153, -472, -177, -51, 296, 521, 318, 142, 101, -234, -105, -321, -98, -62, 230, 92, 37, -23, -113, -287, -181, -270, -96, 185, 199, 200, 183, -255, -492, -160, -113, 20, -40, 112, 258, 26, 14, -121, -134, -51, 70, 143, 423, 308, -13, -80, 115, -214]
3844b14j19qO06j98R5j21j89Q9j39R2J17J89P2j2l19L91n47L12j94j28L04J5J67
3867B61q2j17k52L3m7O5J73L56l98J02l75J05j15k9k2L37J13N32m56J79l09l69
3889c15O9K7J64J53K72j02l22k03J15m4k3J63j3K28M03n46j75m0J13j14k8L07
3911H9KL15j73j76o1q9q6P3L59J56l00q3Q0m2o12L36K3K71K81j02o2m07J97k43
3935b54N8l76O91M8n0Q3l10J55l41K45m23N32j06J46J97k82l7R1m94L31J94RQ4
3958A91m3k21J99k46M2k9J15m0M31k77K53m65J77k84p2J82K16J25j06r8k42k10
3980d02m1J33M07k5J64K5N8j71j81j71j08K90K29j05L34j8j3n66l02L67K52k47
4002i1L16J9j56j65L3J05k49L7J70K6L37k36j89m39M44p7pJ11L49P5j17k84k0
$$ y = [-214, -333, -341, 265, 67, 162, 41, -148, -59, -198, -106, 11, 200, 272, 260, -59, 332, -215, 97, -97, -225, 79, 94, 261, 179, 62, -190, -157, -204, -139, 34, 390, -8, 94, -281, -176, -291, -320, -342, -5, 108, 640, 184, 363, 54, -315, -246, -219, -55, 98, 370, 268, -54, -257, -142, -186, -209, -46, -59, 169, 572, 26, -149, -189, -76, -190, -218, 89, 91, 406, 233, 57, -4, -93, -179, -106, 253, 409, 109, 26, 106, 64, -548, -212, -189, 82, 363, 261, 199, -208, -11, -254, -196, -572, 119, 167, 117, 200, -110, 45, -296, -51, -474, 58, -48, 98, 295, 13, -24, 67, -427, -96, 98, 107, 191, 148, -73, 126, -120, -78, -107, 8, -32, 399, 122, 375, -90, 87, -197, -269, -87, 129, 254, 148, 50, -192, -402, -443, -310, 97, 72, 236, 261, 319, 148, -33, -204, -312, -22, 207, 102, 436, 418, 405, -161, -463, -96, 156, -91, 225, 244, 88, -77, -44, 61, -188, -151, 19, 45, 382, 146, -43, -482, -38, -115, -122, -11, 338, 413, 296, 12, -8]
4025hK11k96k12k3K93K42o7j03J8m28M46l20M41j58K01J04k77Q7k20j06J38l1
4047f8N0L08k00N7R0p9n59M81m54N53l66M16l62L11m31J11q2M6J28L54j65J59
4069B98K5m95J76o0pJ21p2J69p3n3L44m21Q0M9q0K94j07k79qoJ51m03M17o4K98
4094B94l14oO3k5j37k86l8N26j03k9M37j54j49k01QJ34l85L68O5K81k07j75j23
4117a56J12k02P0j4J55j67K98l1j93j03K28k31K8q8N70r5j56J6k71OL82j50K96
4140C04k60M29m17j37r3j20j26M48k08K93J06k61J94j02k81J12l62M61oJ07J39
4161B20k57l38j4K19K83OK03k25K2j71K07k57k1rJ48K57k23k5j79L72k08j42o8
4184b00nK48K25l29J55j27mj82N1K32n9L03J48l13j95J77k94J05k8O0K40k9j21
$$ y = [-8, 203, -93, -305, -328, -35, 207, 140, 37, 55, -373, 73, -247, 194, 36, 237, 341, 64, 151, -69, -175, -37, -68, -18, 290, 90, 147, 237, 158, -401, 80, -374, 179, -187, 229, -133, 178, -253, -142, -224, -178, -50, 304, 139, 298, 323, -172, 4, -56, -63, 58, -14, 155, 82, 29, 373, -48, 32, 81, 1, 295, 188, -91, -99, -105, 46, -357, 60, -4, 294, -20, -26, 37, 12, -125, -411, -449, 77, -26, -55, 382, 228, 79, -122, -114, 20, -365, 3, 68, 349, 142, -33, -156, -44, -246, -176, -190, -35, -202, 96, 65, -128, -231, -3, -234, -206, -294, 276, 181, 25, 41, -230, -224, 158, 8, 304, 44, 473, 56, -81, -174, -294, -420, 28, -180, 113, 219, -42, 152, 50, -231, -119, -481, -20, -26, 81, 220, -37, -375, -389, -170, 113, 119, 322, 97, 119, -52, 155, -102, -123, -132, 16, 273, 50, 25, -154, 218, 10, -132, -200, -205, 43, 268, -61, 94, -33, -37, -219, -168, 64, 5, 308, 456, 143, -52, 125, -169, -64, -92, -32, 208, 179, 58]
4207E8J07l98J06PP3R4l1N0M36n97j2m9j16J6J1L72O4l0J52l20l18PJ61M49j79
4232A13p8l8r0J52Rj09n2K4J6L12j11m3j65J57l36J10K10L5k8R9j41K33l32l14
4256c67L71j2K06K23l05j17K12l61j3M8J46j74K07K4j82L6j95k27L74L27k77J11
4278E5j2l1j03P5k32qK43q1L25n05N59k1m22R9L5K5J47R2k6l6k18j0l54J51l4
4303b87N73k71K5n4r3O3J93j07j53M85o40J22n7L89l96L6j07J52rM8L01j02k91
4326a80L01j43M7J20k48R8p5o8J58J08k12j2J30L9J1J07N4k65R5j84L16n03J37
4349a69K12m2P1L03l89r2K8k40J38mN9L21N7j8q5J32m31J57L33k66J63l93K81
4372A26j08K26m25J3J2J13P9m6K04m7k3o3j43j03J76k5k89M51n2J68m21MJ45m9
$$ y = [58, 165, -233, -127, -120, -47, 47, 16, 66, 502, -95, -107, -156, -272, -256, -245, 127, 191, 161, 313, -7, -325, -318, -157, 292, 113, 35, -3, -93, 59, 68, -41, -93, -69, -53, 259, 148, 105, -60, 97, -239, -129, 81, 116, 88, 187, 46, 279, -53, -367, 4, -8, 198, 421, 116, -1, 211, -150, -163, -115, 31, -143, 64, 88, -94, -58, -253, -480, -106, 221, -56, 55, 43, 12, -91, -16, -248, -256, -13, -94, 231, -274, 285, 264, -158, -59, -24, 1, 148, 240, 214, 178, -40, -50, -404, -253, -287, 286, 15, 40, -14, -107, -44, 149, 42, -111, 374, -266, -144, -201, 188, -208, -172, -279, -127, -136, -88, 213, 111, -180, 121, -22, 25, 145, -103, -5, -80, -148, 10, 118, -94, -106, 24, 63, 74, 181, 235, -30, 65, -119, 197, -306, -169, 43, 1, 72, 375, -14, -106, -78, -318, -180, -184, -125, 196, 253, 235, 150, 282, -149, 8, 341, 75, 238, -155, 126, 18, 244, -181, -168, -156, -43, 36, -10, 194, 147, 124, 61, -82, -185, -9, -34, -323, 128, 76, 244, -177, -173, -28, -77]
4396g7K55J56l47J03k51p1k5K84J43k3n8k96L08J37n21N07l32N3J35m9J52q2K2
4419A23j89j64o9L23R7o1k33L79l45J30j63J57j62J86k45J77J58l10K3L2M7R9
4441a0K06Kq1j09K08j96j09j1p8O2J97k34J45k15J23J11p9j79L07j3j77J66L2
4464F8k57k9J23J23j23OL72o7j52j76j5J66m1n1o3L55k08J41J69m62J26K46l86
4487a35K02Pk34K9L06l10J00l9J04K0j17k1J66l04NK93k35J36J10K5j16l41J32
4510b17K47j90J68N2j1O0r9M14m48N6o8K1j64J25P8j5J1k8l13J56L24k97J03J12
4534G7j42J56P7j02j46J27L9J31R2m07K85j28N0j90J11k81K0J95j11K42q1j25
4556a11R5j50J62J40j13k42J43J36K20l06J8kl7j99K98PL8r2k05K19k67P2P1J32
$$ y = [-77, 178, 334, -13, 90, -161, -232, -257, 27, 170, 147, 89, -207, 101, 238, -283, 224, -108, -55, 80, 31, 183, 101, 123, -66, -230, -299, 24, 121, 60, -173, 206, -139, -9, -172, -15, -177, 9, -236, -59, 99, -211, -188, -156, -109, -10, 196, 198, 117, 8, 216, 20, -89, -100, -178, -116, 81, -153, -8, -223, -100, 11, -68, -247, 60, 47, -130, 36, 68, -189, -218, -95, 28, -95, -89, 283, 216, 64, -112, -127, 39, -2, -53, -116, 239, 31, 172, 341, -121, 5, 251, -135, 67, 74, -160, -131, 175, -135, -35, -74, 30, 50, -67, -88, 78, -226, -221, 72, -163, -27, 83, 108, -8, -349, -217, 30, -160, 8, 60, 49, 109, 10, 424, -24, 32, -36, -15, -179, -54, 24, 9, 20, -8, -321, -165, 159, -138, -35, 77, -65, 91, 168, 66, -80, 47, 86, 217, 309, -98, 187, 59, 109, -81, 30, -251, -231, -36, -147, 95, 14, -111, -16, -166, -4, 136, 23, -219, -76, 60, 280, -26, -8, -10, -47, -246, 52, 59, 97, 5, -200, 19, -248, -176, -105, 27]
4580B7l05J28Kj18K24j41R7K99j96OL2j93%j41M90m14M86j98j50J22J44Kk81R9
4604B1o4P6l1L92n24J78p2N0L8K2Q2k4j87J93l34K27R1j84K3J5p6J40q1K72k95
4629e2J94r2l90L50j40jJ23J31k38K92k32k11L31j57N8N5J46L1j68p8J61k37O0
4652f4L74k91J65q6r8n9j28J1K8j26K61N1O0m8k85l5N0K71j48J45J9R6k20j87
4676b44k7L88j12J35l52J79J96k78j43J30J14P5k64J73K21l86K7K77k9Q3k97P5
4698e9J37j07J64m56K21J80j15j90K83j14L00m01O2K43L9l5n38L74J84j78J50
4719A44j49j23J37l06K39j85J77j29L19j05n0K01j09K9k35J70l4r3L35k71K3k5
4741d0J8J75j23k00K48j59K22j84l8K11jPn8k2n3n0J29m47L14m4m7j84L19J00
$$ y = [27, -278, -150, -148, -266, -42, -183, -86, 213, 17, 23, 55, -138, -138, -279, 211, -203, 283, 85, -65, 57, 201, 203, -78, 21, -43, 33, 2, 394, -130, 48, -24, 26, 64, 86, 168, 144, -43, 150, -184, 43, 134, -50, -27, -12, -88, 52, -29, 243, -52, 142, 50, -340, 10, -130, -131, -8, 123, -115, 177, -55, -266, 65, -92, -34, 21, 167, 198, 30, -48, 113, -124, -64, 310, 19, 184, 98, 0, -59, -187, -176, -148, -274, -13, 38, 98, 50, -235, -270, -220, 51, -97, 48, 67, 163, -57, -244, -271, 117, 5, 140, -212, -33, 163, -115, -258, -128, -14, 61, -203, -30, 191, -195, -168, 109, 80, 163, -134, -59, 78, -29, 135, -321, -100, 80, -35, -225, 58, -56, 244, -157, -95, 148, 187, 152, -386, -12, 172, -6, 144, -5, -128, 9, -297, -58, -243, -66, -195, 124, 19, -31, 170, 61, 90, -145, 25, -9, -102, 233, -38, -15, -40, -22, 153, 30, -170, 78, -81, 141, -43, -81, 130, 129, 136, 78, 56, 3, -47, 82, -365, -51, -95, -142, -326, -7, 93]
4765I3l5j33o2K26l22J99K49J65o47N53j29m40K4L04K06K7k42N9J64l61n8J96
4787C6j80O9k08K84P5M2p8o8k32o6L10q0K79pj35p4J97J9n43Q7L24k56K21j18
4811a02M8O4o6j99K76k02J76K30m34m6J15J15l26L58K03l17J17q0L03q3j88K1
4833a7J94k94L45n37M09o6r6k30M21k41K2k2O2J32j99K73l66LJ59K04k71Q4M42
4856D11l49J08l51M85m44P3J24P8J00k34K5jk97L04Q5j55j81K81k23J03p9M65
4878C28m96k09K31K45k2q0K94n50P40o30Q7j02%M93j66q1M3m41J49O3J03j53K91
4901A37m84M76m5k51l39N3K38J45j6p9K86j43J16l8m4k45K40j86M14l6l14J35
4923B0Qj32L14j65j34J24J80k74j52J45K5L05l70L26k18J46j67j71K7J17K15j40
$$ y = [93, 58, -75, -137, 89, -233, -34, 215, 380, -267, 286, 157, -283, -259, 45, 251, 278, 36, 95, 259, -102, -160, 36, -144, -75, -283, 1, 76, 118, 40, -28, -260, -326, -16, -96, 183, 176, 41, -33, 164, 183, -360, -273, 51, -205, 16, -102, -54, 10, -56, -255, 21, -181, -5, 225, -209, -255, -140, -25, -351, 7, 210, -107, 10, -70, 233, 150, -38, -17, 177, -117, 228, -309, 100, 34, -62, -292, 129, -112, -90, -112, -50, 82, -117, 156, -210, -207, -48, 156, -115, -31, 411, 62, 170, -181, 304, -140, -67, 57, 135, 235, 1, 26, 25, -272, 32, 117, -38, -219, 62, -161, -58, -137, 328, -168, -377, -146, 99, 77, -3, 291, -259, 481, -149, -62, -164, -164, 329, 163, 82, 125, -316, -167, -104, -1, -154, 137, -347, 129, 84, -167, -506, -453, -215, -70, -86, -165, 121, -22, 94, 56, 12, -233, 7, -179, 235, 199, -115, 20, 28, -104, 210, 45, -89, 35, 215, -59, -211, -66, -41, 264, -106, 220, 2, 148, -19, -190, -163, -46, 169, 29]
4945B9q8oj26M09k08P0n5J82j99J21k40J91j44o1j9o6K76J56p7q1k17K04L7J3
4969A01lj38J6k18J67K00j6j18J89k36J15l42J79M16j28K44l84j73M8J35Ql19
4991b57L39m6r7J85l2P5p8k37M71l23j73J75j43J58M0j83Q0o1J76L64k20j93p
5014A3k22J83J01l40J27k2L30r7k0J6m6K52k69J09Ok01r3K03k52L44j82j36J61
5037c5K29k09r0J39o7q3j77J76J10R7j39O7j17J18j14K30j16p7M8J20j22l6j78
5060b26L72l60K3K11J04n9Q9l07Q2r3J66J96m1Q8k26M3j61K89m51J31J07Q0J04
5083A61N2j65j1p6m9L6P2k81L56N1l6J84n17K36J50k96K77n7j89J16N5J80l55
5106a06m0K2L71m15R6MmR7K38k32p4N1P3j99K4j1Q1j04K26J81k40k68R4L17l18
$$ y = [29, -59, -65, -191, 218, 10, 80, 25, 207, 8, 129, -111, 80, -64, -125, -144, -210, 66, 222, 145, 64, -153, 51, 88, 101, 98, -40, -24, -242, -75, 125, 109, -9, 180, -56, 59, -283, -104, 312, 184, 428, 44, -129, -81, 54, 62, -257, 82, 36, -61, 124, 92, 167, 89, -148, 323, 0, -173, 2, -141, 17, 57, -126, -46, -107, 69, 433, 213, 20, 13, -209, -26, 75, -265, -138, -160, 170, 73, 53, 69, 23, 275, 6, 115, 121, -80, -173, 30, -222, 122, -60, -196, -35, 194, -15, -105, 34, -33, -116, -293, -117, -7, 90, -49, 18, -99, 19, -95, 135, 19, -58, -10, 110, -12, -48, -226, 146, -214, -191, 20, 124, 65, 154, -153, -71, -164, 2, 198, 157, 245, 19, 62, -99, 190, -261, -130, -23, 57, 161, 213, 48, 37, -39, -88, -52, 20, -261, 95, 146, 110, 294, -223, 13, 163, -133, 144, 87, -102, 14, 69, 249, -106, -146, -124, 247, -168, -72, -68, -72, 25, 263, 31, -43, 8, 81, -118, -94, -105, -24, -128, 98, 279, 39, -229, -135, 182, -136]
5131a36P6o9L43j13l39J20K79M3l27j55K11L00L4j19l40J55Q8m6K30l05O9p6R6
5154A9J62m45K14K05l68J60J10j19P0j1j10L65q2l24R7L6N5p4j40M6K25k33K57
5177A15j5N5k46J6k29L11Jj25K15j02m1J63R6r2K93o07J11R8r2K50j39r3J51k95
5201b01P5O8q3K77k72O7K11j66j4j37k42M55K30j03Mk14k3j48K88PJ18P8j02l1
5225A42n0J77k74k0J65j49R6p9J19L7l60K51p0km8J26K64m70J87j08K40l53L41
5248A62k22J54k9k0J43j35j35J74j54j10J33L27l81j03J34j50J51J85O3j62q0
5269e5n3J65j47N3K10n8l06K87k4J53l02l8Q8R4j66PL85q5j20q1Q1l45K54j01
5293a04p8M84k77j19L05q3j8J01j71j52M82j62l25Q8J12j74j61J17J59J08k27
$$ y = [-136, -60, -129, 214, 101, -238, -118, 161, 204, -123, -278, -67, 233, 267, 148, -192, -37, 51, 5, 235, -70, -1, -77, 19, 181, -264, -50, 155, -213, -53, 57, -62, 8, -3, -113, 252, 170, -154, -57, -21, 34, -40, -180, -134, 91, -142, 115, 100, 155, -91, -75, -304, 7, 8, -117, 98, -4, -45, 118, 214, 122, 415, -192, -81, 17, -75, 175, 36, -57, 94, -201, -126, -58, -141, 136, -136, -69, 142, -24, -38, -175, -417, 38, 268, 165, 169, -45, -68, -216, 72, 79, 197, 275, 173, 142, 92, 269, -5, -25, 140, -9, 87, 8, 127, 164, -196, 55, -15, -17, -65, 61, 325, -145, 42, -66, 174, -179, 162, -60, 94, 65, 45, 188, 53, -82, 92, -62, -172, -39, 288, -93, -196, -62, -212, -61, 124, 187, 25, -55, -108, 57, -90, -37, 173, 115, -191, 96, 72, 225, -77, -115, -27, 67, -99, -92, 293, 208, 88, 7, 88, -257, -3, -104, -182, 302, 25, -94, 211, 128, 110, 211, 40, -112, 370, 208, -117, -29, 83, -91, -252, -135, 24, 132, -95]
5314i5M53l05k56R1Q8j12o6K54o8l64J37L58k24M5K51j32j03J12pj55P3M1J20
5337A36r3r6k3O2K5M1j34Q4j65L12j67K0P3k17J37q1k78L95p7L0r4J12K00k87
5361h5K17l23L48l04K89j30j44J53j61L69m9j31J84l04K07O9j53k6q5k77M86l69
5383b19J31J99j56J56j58Q0k28K89j86L8J78j79r2J80J84k12k11j57M42q8K77
5404B68n06K00J09j02K40k90K49M1o49K98K19k57K64mj17K01k84j55J71K29K3
5425A48k03L01n25O82l94J40j23L59m47K81L6l03J78n07K80K99R2n14J44J55n2
5446B7r9q5P8l3K07m76K48J40L8k67K53J25l19J31K97k44LRL45n76l9J49K57k12
5470d3p2l7J42m6j02j69K57O1l3mJ51p8j50L5k17J40N9K80p4n2l9k05L34j54J54
$$ y = [-95, 358, 53, -203, -112, -24, -136, -202, 52, -16, -380, -243, 115, -109, -64, 187, 55, -48, 64, 57, -98, -25, 16, 136, 43, -53, -76, -14, 11, 52, -82, 2, -163, 149, -18, 2, 75, -142, -5, -86, -364, 31, -46, -16, -110, 2, 202, -85, 132, -191, 157, -147, 142, 12, -132, 21, -140, 229, 180, 49, 233, -71, 136, 205, 52, 26, -59, -336, 150, -219, -88, 111, -45, 111, -47, 33, -195, 94, -92, -54, 124, -55, -147, 33, 217, 5, -206, -363, 79, -9, 268, -238, -38, 71, -31, 209, -81, 168, 209, -440, -142, 77, -180, 84, 80, -37, 164, -120, -275, -104, 125, 148, -55, 246, -279, 403, 9, 149, 26, 385, -62, 219, 255, -48, 130, -377, -97, 202, 294, -220, -76, 79, 27, -72, -157, -79, -112, 95, -381, -133, 7, 45, -222, 31, 156, -163, -32, 265, 21, 24, 33, 378, -198, -237, -88, 169, -43, -115, -152, -10, -56, -158, -327, -70, -9, -42, -46, 105, 27, -123, -88, -305, -165, -106, 174, 100, 48, 9, -196, 138, -16, 138]
5495A38lj5k46R6q8K61k33mR5j47J44J8k92J69O6o5J81k54K90k02K23k13J97J3
5519A29K33k73k52J70J77k58kMK58j79k0M7Q0j01Jp1q7P5j59J68j85K96j97k09
5543c55L26J80J1k1k56J45n4N8N8J16o04M54j3J72j14J87k13j68M1O7k73K2L90
5566A56p5j63n1J90p0j68Q3n8K78J5j60J26j54J20n6m7l80K91K85K0L4j75J01
5589A42k68o9K94j16L7Q6j00j05J53O1l17L43k33%j3j04K43Rk26L95k80K78j80
5612C0q9J63M3j98J13MM1Q0l21L9L8J38k25J08j90J61L24l72J82Pj53j0J49q8
5636b6J11o5k67L09o0R8j73l21N53r1OR6l17J45q0L2k21L47O5l0j37n8R9J19J38
5661B72k33j94j0PK50L4p8l56J73J13L55l65p2K48r5Q9k37K17k40k57K04K67J47
$$ y = [138, 135, 120, -126, -30, -118, 143, -90, -94, 1, -146, -2, 16, -276, -107, -41, -106, 75, -179, 111, -91, 132, -81, 116, 129, 362, 89, -163, 7, 184, -74, -76, -72, 186, 7, -13, 34, 114, 13, 14, -57, -144, -69, -228, -60, -245, 51, -146, -355, -29, 151, 162, 141, -115, 30, -24, 34, 92, 208, -396, 58, 45, 217, 103, 290, 77, -91, -50, 17, -256, -234, 156, 81, -82, -133, 57, -13, -181, -98, -156, 122, 137, -23, 103, -51, 69, 13, -34, -414, -123, 162, 182, 216, 41, 142, -126, -195, 99, -17, 20, 106, 6, -99, 54, 115, -202, 141, -92, -92, -105, -209, 34, 43, -183, 212, -68, 210, 30, -59, 104, 147, -51, 62, 66, 107, 187, -134, -95, -57, 81, -144, -36, -226, -65, 259, -113, 69, 76, -77, -87, 62, -26, 85, 20, -247, 62, 2, 100, -73, -394, 159, 68, 74, 170, -147, -2, -82, -50, -271, 76, 141, 111, -26, -84, 15, 134, 272, 39, -155, -165, -158, 92, 126, 48, -308, -135, -22, 333, -32, -104, 144, 49, 138, -99, 118, -122, -379, -175, 92, 239]
5684B39OJ6l54m7J24K09l67J62J54O0l34K13j61J36r1Q8l53M27K95n18L1n3n9
5707a77L11n5j08J44j12k22K63l32N1L08J34k80J76o7K2j34k9K11k39P6J5m6M
5730h6R5l31J29M31j25j23J89j52k26L21j54R3j35K45J1k50j01J32L35l75K80
5751B03k85nJ09L1K7n3%n7j92L22N6l94M39m28K54j80J80j09o0j9K37l6l0P7j96
5776a09K51l12K35j66K36R6k96m7j7J74j0R8J67l79j22Q2K18o8k08L47m17K28
5798a9N7J38n8p2p0K11k31jr3J23P3k27J89j5K40k41j67J95j20L10k70P4n0k12
5822b36L4Q8m4K69J25l32l9j46L56J89J99j07l10J01k67J31r0K82k57L43k18k8
5844D3L3j04J81l26L16k63K03m54N69m1j00k29kQ0Kl7M62l04p5j3M3q5j06K33
$$ y = [239, 245, 261, -93, -140, -16, 193, -174, -12, 142, 202, -132, 81, -80, 56, -35, 53, -300, 127, 422, -96, -65, -118, -177, 134, 79, -29, 115, 3, -219, 44, -288, -237, 71, 205, -75, 101, 34, 56, -78, -107, 104, -135, -59, -44, -90, -86, 9, -322, -193, 238, 113, -10, 179, 27, -199, 122, -32, 61, -74, 171, 182, -68, -169, -37, 298, -77, 203, -82, -87, 22, 53, 80, 27, 27, -30, -222, 100, 156, -238, 201, -227, 27, -153, 27, -82, -142, -161, 76, 40, 10, 87, -109, 142, -170, 65, -101, 135, 231, -65, -112, -129, 45, 35, 133, 300, -79, -201, -119, 99, 31, -177, 170, -247, -19, 38, 176, 118, 46, -24, 187, -44, -45, -138, -15, 58, -169, 20, 5, 245, 4, -163, 32, -88, 222, -48, 26, -24, -236, -202, -114, -158, 111, 236, -96, -135, -281, 75, 264, 463, 356, 46, 147, -120, 11, -79, 203, -54, 289, 71, 43, 76, -28, 153, -173, 143, -120, 83, -371, 198, 157, 57, -172, -174, -94, -92, -129, 333, 29, -46, -59, -16, -101, -207, 26]
5868B6M1M04m06k63M47k46j5j75J78Qj00K95k33j69Q2L34J48k34r4q0j46J53M8
5891Cl4N0j8k32J42oJ09QJ84k71J01J4k1M5o5J39Nr6k65M34k07Q3q3l50J00k7
5917b58N25j40j09j17K65l0l59K89Qj55J71k49O0J83m87K92J40K7j52Q9L9M9m6
5940C5j02J19j74J20O8mj20PO3O3q3j60M9K12p4l71L52K88j55m80L26k8O4J81
5964A96k59j3%k21K73PP5m85O97k45j76m6q7O04k74Mj87J86j10J4K9N2j90k04
5988c60L97j20j02M74J02m36p4J12r5L02k24k14J48q2R0n0M76o12J79P2P7j76
6010a16K77j88K0K05l02J50LJ08j66L70l35n6j47J45L47j52p1j21o8P1J56k35
6032a05m9J08K02J19m44J12J29j8j76L78l13q5M63k64j42o2J13O1jj71J57k22
$$ y = [26, 67, 471, 65, -198, 249, 3, -12, -187, -9, -1, -101, 194, -39, -208, -126, 208, 356, 122, 28, -52, -198, -45, 3, -31, 19, 1, -231, -89, -95, 14, 22, 206, -65, 36, 50, 29, 74, 9, 148, 153, 57, -208, 226, 19, 102, 19, -331, -231, -258, 267, 127, 18, -99, 166, 136, -223, 66, 74, -81, 90, -159, -99, 84, -403, -111, 29, 56, -96, -7, 32, 81, 35, -67, 52, -122, -2, 66, 62, -58, -51, 12, 75, -8, -168, -119, 93, 19, -352, 0, 288, 133, -347, -21, -49, 15, 196, -63, -76, -76, -297, -24, -17, 58, -427, 270, 25, -151, -197, -284, 320, 46, 50, -137, 49, -61, -47, -18, 34, -156, -360, 37, -83, -185, 289, 391, -45, -119, -7, -102, 200, -24, -238, -90, -172, -82, -132, 344, -268, -89, -17, 60, -116, 161, -27, -7, 198, -104, 46, 49, 157, -9, 361, 26, -30, -177, -32, 315, 163, 92, -29, -97, -26, 130, -105, -154, -46, 156, 275, -169, -57, 72, 54, -122, 256, -57, -142, 321, 57, -85, -147, -34, 27, 26, -145, 12, -210]
6054b10o6J50N39l85j24L4J46P9l39L14k1Q4k92J11K8J70j65p3O1J76l22N25j87
6077B33m59J41j39K52J9K5m3K02k71Rk5m5N5L5o1K33k10K10k06K0J84pO7j75K05
6102B49k86o6M25n49L30j15J46j94q5K58Ll8p3K74l81J27J98k49J03l85N51l04
6124f1J53R1k43J50j64J34J8k05R2J53p8n5J48J17l84O3KJ87k61P5J6RM5J25k09
6149h2J4J98j36K32k68J16n3L3j85J85j17J20K9n16L11Q1r4p7M8L00l48K87j42
6172f4O1j24K84k43j14K03r1N2k08J02n4L59kk39n3J16j3L8nJ71l39J78j5j8P3
6197E5r4k81O32J06o57K09J44o4j49J85L3k2oj96K0K00m01K71k23M07l93J14q5
6220a95N93l70n47N51J27j36K01k77j35K7Qk48M79N4k08p8M48m20J80q1j7N8O9
$$ y = [-210, -276, -126, 413, 28, -96, -62, 84, 163, -176, 138, 117, 201, -91, 20, 48, 218, 53, -20, 41, 217, -105, 420, 233, -226, -85, -224, 28, 47, 72, 29, 231, -40, -31, -56, -101, -46, -11, -72, 161, -49, 161, -45, -25, 159, 152, 219, 44, 249, -37, -103, 322, -227, 103, -12, 134, -60, -145, 113, 116, 78, 5, 279, -102, 25, 223, -26, 77, -308, 243, -61, 92, 183, -60, 90, -74, 60, 78, -127, -35, 118, 40, -15, 133, 250, -134, -71, -69, 118, -143, -68, -52, -43, 2, 127, -82, -68, 130, -6, 226, -42, 74, 21, 54, -131, 54, -63, 57, 86, -430, -119, -38, -132, -209, -161, 139, -209, 78, -64, -3, -127, 157, -86, -200, 3, -88, -36, -244, -142, -196, 163, 161, -78, -131, -15, -28, 10, 5, 176, -163, 15, 0, -18, 55, -39, -320, 312, 418, -239, -30, 114, 50, -99, 86, 119, 97, 91, -105, -85, 115, -286, -15, -238, 169, -224, -110, -195, 398, 28, -519, 32, 159, 23, 224, -53, -188, -161, -153, -401, 78, 132, -76, -154, 294, -126, 54, -27, -44, 14, 83]
6243H3Kk18L32j35K12k72j22K04L9M4o9r8j42J32L4m0J78l89K25KK33n3k80j09
6267b07L2Q0J23K28k91K62k84J0Q1l1R8k53J60J29j58j96P9K85Pk06j06M70j36
6290A76j75P1k23N7l8L71k35K63n26K01J2q7Q2L17L4k92K44k22J08j8j04l05L35
6313D6j61J74M1j06j21K19j68J52M9p1j45K94j30L25l22l33K50lL30m77Q7M92
6335D22k05m01K25j97J14j33K40j31J61k3Pj73M8j27J64J82j69N8j15J98k0j32
6357gj83P6J6K85o5j40k53L3J02n4K22Q0k23K55l6o4k85J89m4L15k17k8N9k06
6381a73J71p9P2k66K31k7J49jm45L54p7M23k58n4j58K38j67K32k22K20l93k7J79
6404g8K54l48K37Q1r5j22K10l22mK29L9j06k0J36j03J86RR3j40l7j83J68k07L22
$$ y = [83, 85, -133, 199, 64, 276, 4, -118, 86, 125, 169, 100, 2, -140, -8, 26, -14, 164, -225, 0, 2, 235, 182, -98, -207, -175, -95, 28, 256, -35, 227, -57, -47, 34, 3, 101, -152, 8, 137, -21, -217, -138, 147, 154, -52, -158, 312, 176, 1, 72, -151, -94, -132, 239, 4, 267, -259, -58, -46, -133, -51, 266, 300, 8, 252, 30, 138, 120, 16, -289, 46, -115, 59, 100, -6, -127, 92, -76, 76, 125, 54, -91, 203, 73, 398, 76, -257, -7, -10, 320, -157, -70, 422, 217, -184, 41, -156, -42, -175, 65, -66, 95, 72, 79, -94, -46, -173, -9, 173, 4, 62, -53, 145, 125, -7, -190, -114, -98, 187, 122, -18, -271, -238, -136, -190, 32, 112, -111, 144, 108, 44, -241, -52, -96, 219, 2, -26, 33, -173, -2, -81, -9, -275, -44, -71, 78, 77, -368, -14, -91, 332, 74, 20, -138, 100, -67, 165, -57, 163, -230, -257, -78, 176, -172, 65, 146, 51, -71, 139, -183, -187, 42, 81, -25, -45, 91, -12, 174, 183, 276, 136, 99, -84, 84, -123, 199]
6428A99k03k73p6N99j75R4p8j70J40J46k84J1m4r4J58K33l11K34j20q0R2K41n9
6451A80L3m45J81J9J78J53r4j97q0K47k67K28l67j87O77j53K25m94Q2J70j50j
6473f2R5j45J65j69K84j48N5j99J00o6j86L19q2L4j93L14j21OJ09Q6j34j75K1
6496i2Q7M9q2k6K21l86M27k38R6R8j49Q1n1Jj63J53P0k76K91k29l8K45j47m8N7
6521d9J1j21o5J90K81l49n5J44J43j09k82R0J22J29j34M1k42J50J48L5l81K36
6543f7L8J87j35k2K54k95j57K9J55j9J01j2jj15J07l78O01n4k15J01r2p5J21j54
6567i7K41r9j23K55k08K24m20J44J55j9m7K19j28j51K12k51L29k10J3j24K88m0
6589A63k26J31k22L19m7m7J8j53L37j99k01j6L23m17J76J18j50K3K68k56k02J48
$$ y = [199, -4, -277, -353, 246, 71, 165, 87, -83, 57, 203, -81, -70, -114, -208, -50, 183, -128, 106, -14, -94, -2, 239, 180, 213, -232, -51, -32, 146, 299, 205, 8, -72, 175, -92, 136, -231, -418, 259, 106, 331, -163, -81, 89, -61, -62, 33, -112, 53, -116, 168, 20, 75, -124, -24, -90, -276, 43, -39, -5, -198, 116, -5, 1, 110, 196, 62, -113, -92, -5, 44, -38, -64, 157, -229, 198, -40, 56, 154, 5, 86, 35, 36, -127, 26, 96, -180, 111, -118, -156, 89, -58, -106, -49, -38, -159, -224, -34, 247, -102, -157, -13, 130, 21, -261, -171, -49, 80, -54, -13, -255, -105, 43, 78, -303, -67, -29, 158, 23, 1, 255, -40, -197, -168, -13, -32, 69, 57, 56, -59, 48, -330, 271, 217, 2, 103, 11, -64, 57, -97, 144, 45, -78, 177, -31, 193, -227, -83, 72, 53, 6, 225, 97, -54, 158, -93, 236, 26, 39, -85, 203, 163, -63, 68, -154, 165, 118, 71, 89, -64, 273, 74, -127, -143, 180, -237, -61, 57, -93, -70, 198, -58, -260, -112]
6611a12J08j79k63L90j8J82n9K06k69o9J88l25j03K34j6J49M1Jm4nk66J95J8J77
6635A61k86K30j37j17J28Q3J2Lk25J27k9j32K56P6k83k1j6J53O8j61n1M25j73
6658I1J65l56Q7j48j3l2j65L64k26J5J88K24J01l93J30m88K74P9P1K97m08M8J88
6681I3k52J03J6k14J17N4J35k31M02m37Q0L49N8O0l79l3J62K5j95L0q2K69j42
6704a2K71j66j40L0P4j34OQ8j08K07O4j67l8J47M4k28K89l41j16P8J33K07J28
6727C16o75L64q8K55k55J59Rr5L9l5J5k11L65J87m22M30p28N97k9j70O1j10R3
6750G2k53Q8K03j98L5M90l91j3j64j45L13J4l55M07j88q4L75l82K66k57M55j78
6772A10j6k31J35N7o2J34l98K09L5J08k58L74k87K11K6j67J81k98p5K03k77J38
$$ y = [-112, -4, -183, -446, -56, -74, 108, 49, 255, -14, -83, 105, -220, -323, -89, -105, 44, 85, 86, 42, 37, -229, -34, -16, 161, -125, 105, -32, -149, -21, 62, 74, 77, -148, -21, -50, -182, 74, 150, -133, -154, -170, -17, 51, -110, -161, 264, 91, 256, -100, -13, -161, -174, -206, -371, -7, -233, -218, -30, 194, 295, -98, 32, -456, -182, -103, -32, 265, -143, -95, 93, -159, -56, -40, -254, -137, -83, 52, -179, 223, -214, -134, 215, 273, 333, -46, -79, 83, 108, -87, -57, -139, 130, -12, 259, 93, -47, -17, 57, -77, -71, 17, -91, 116, 180, 13, -25, 122, 166, -62, 227, -114, -230, -152, -19, 188, 316, -359, 5, -83, 172, -83, 76, 85, -10, 29, -6, 9, -202, 163, 350, -72, 358, -370, 227, 198, 28, 89, -21, 72, -181, -93, 110, -88, -53, 437, 46, 33, -131, -276, 37, 51, -304, 103, -85, -169, 206, -176, 90, -167, 288, 110, 94, -137, -2, 55, -7, 127, -271, -62, -27, 81, -177, 197, -90, 121, 147, -20, 161, -137, -212, -9, -286, -148]
6794a48L92k16R2M1l14L01m00K88j86J58j55j40L65L8o1o3N4k60O0J22K19m89
6816c02K47N0o4j72K73K43k79k74K43j24M5N8J63j57J03R1k95K72k03k27M55O7
6838B13k79O4J46k34J67N5j9N7p2M5k65P4K45l43N8J06J2K15l70J50N5P7j18K52
6862B91k69M5p8J69j98o4K58p3k66K46l48L31J7P9k56K13j51J48L7j08n0K17l84
6885a94L61m3j02j99J81K0k75M04j01j89K04L6k35J62j97l3J42j45P7K54j97J01
6907C2j8J11l91q8N86j93r7P9j95J28j21J00J20j03m6P8l7O3K42j22l29J19J69
6930H7l1P3r9K49N3k96Q5k27j3P1K17j24L22n95J38R6l5J7K5k78M56m3j04Q2m24
6955b98L20m8K0O3L7k58K08k93L40l03Q6K6J65J2k62Q3r6L08q8J64m79L89j66
$$ y = [-148, 244, 28, 120, 161, -153, 148, -252, 36, -150, 8, -147, -287, 78, 116, 55, -8, 46, -214, -154, -32, 187, -302, -55, -5, -69, -241, 32, 275, -4, -278, -35, -159, -114, -56, 107, -50, 53, 144, -151, 121, -82, -309, 146, 213, -66, -2, 144, -90, 77, 132, 113, 170, 98, 143, -122, -48, 197, -146, -88, 18, 30, 245, -125, 25, 80, 157, 39, 291, 22, 67, -11, 158, -40, -104, 154, 81, -185, 61, -287, 44, 61, 140, -116, 97, -54, 94, 131, 23, -27, 190, -194, 167, 124, 22, -177, 4, 24, -251, 153, 52, -137, 67, 103, -132, 30, -167, -200, -58, -203, -126, 128, -69, 32, 14, 125, -266, -354, 232, 39, -58, 21, -174, -46, -167, -67, 53, -50, -96, -18, -55, 8, 250, 128, -201, -82, 87, 56, 129, 30, 279, 332, 36, 121, -106, -119, -48, 169, 45, 367, -228, -90, 6, -29, -12, 13, -265, 191, 148, 44, 126, -298, 22, -26, -6, 57, 94, -164, 44, -249, 91, -212, -126, -100, 65, 77, -185, -102, -198, 110, 22, 186, -293, 96, -70]
6978g0j86K86j49K9K85k2M1Pl53N2O6K2m5K2P3K8n4O9m04n9L37O0J70j30J9n9
7004C5k30M9K53R6k58j33N14Jl97L09j18k89K61J17j77j99J38K07j1l17K57o2
7026D6J85j37j63j20j6J7K77j45L7k53RK80R4R7l10K70j78J8K21j19k37K10j96
7049a13j21K31P0m7j70J36j05K81j8j41J62k96L63j40l02J66Q2J51m4L7j87J74
7071A69j91JL1J91n81N66k62J30j86k00M66k04n2j85J31J58k1j73L42j20O4l4
7093D0k9J50l98M35nl8Jk50P6J72J9j79J27j64J01P3L5r2M1m12K20P5r8RL81l05
7119a5r5Q0q7K46l25L00K7K21n35L05k98Q3K6J96k26J41K65l39J57k10K41Q6k91
7142d7j99M78k59k6j14j4O6K04l8j03O0M3j08Q5j3J73m76L60l11J63N2P6M5k9
$$ y = [-70, -256, 30, -119, -90, 195, 173, 214, 221, -132, -80, -14, 8, -37, -15, 58, 86, 32, 101, -303, -362, -25, 35, 205, 75, 94, 35, -195, -146, 107, 203, -55, -188, 326, 327, -70, 239, 121, -168, 93, 210, 33, -166, -28, 179, 168, -149, 108, 46, 231, 94, -69, -189, -205, -188, 89, -56, -19, -272, -263, 17, 111, 208, -102, 168, -10, 8, 229, 110, -127, 83, -113, -234, -3, 67, 20, -150, -14, -119, 162, 144, 3, 165, -131, 232, 92, -210, -44, 38, 189, 145, 182, -5, 169, -22, -21, 10, 201, -380, 186, -76, 54, -132, -332, 134, -70, -122, -307, -176, -18, -39, -212, 130, 10, 74, 40, 11, 161, -237, 198, 193, 155, 156, -94, -18, 154, 173, -6, 121, -43, 58, 131, 166, 74, 115, -297, -77, -2, -100, -91, 290, -15, -110, -30, -117, 129, -196, 104, 131, 352, -183, 122, -176, -93, -67, 129, -97, 44, 309, -30, 127, -83, 158, 244, -47, -246, 232, -27, -53, -167, -181, -115, 89, 51, -52, 8, 51, -57, 28, 15, 188, -288, 72, -239, -76, -24, 52, 97, 68]
7166F8J02j98j5r0L24m72L74n5q9K3K67m12J42K71m22K88j96J6M6j08O0m8R3J95
7190A64p9o9k49J18j0J10l58K56J92O4Om01K97p0L57k70Q0m90M70p9L4k59L90
7213B04j81k22K10J15R5k11J25J34k61l8n9n1Nm2J75N4k47P5J59j8K98m34p3j23
7237c11O3M45J29k11p8L0r4K4k60J51K94j83K73k64r5L01j37k6L0k06J69j25P3
7260hm2JJ36j91j62L67j39k09L00j76K6o0Q4M9l18J20M73l49L24j1j35J64j24
7283A20j83j9L65k99j11R7j43K09k31L51l82N14p6l58L49k87L95k40N2Rnj53j67
7306a93O0J9K8m4K38k76N5r8O9J9j22N1K3J15q3J96J76Pq1J09l10n4RJ13Q2M6
7332A54m36J81M0Q5Pn2O5j93J01j25R9J42j4P7pL37m97J6J82j70q3n0P6J45r4
$$ y = [68, 170, -28, -43, -133, 191, -281, 93, 38, -51, -28, 239, -173, -31, 240, -182, 106, -90, -74, -28, -136, -76, -124, -31, 164, 85, 16, -233, -115, -125, -15, -373, -117, 75, 139, 145, -256, 41, -29, 328, 58, 138, -352, 118, 39, 73, -186, 204, 23, -199, 11, 126, 221, 10, 135, 269, 8, -30, -89, -140, -135, -177, -2, 52, -195, -120, 39, 21, 319, -115, -188, -311, -248, 197, 326, 115, 37, 67, -27, -3, -263, -112, 182, -1, 272, 8, -87, 214, 77, 51, 81, -125, 44, -81, -8, -50, -49, 87, -104, -266, 101, -38, -247, 53, -123, -97, -157, -73, -24, -342, -222, 251, -98, 226, 215, 80, 244, 120, -63, -82, 283, -16, -127, -30, -173, 36, -195, 156, -226, 288, 212, -146, 203, -84, 311, 71, 123, 132, 127, -26, -193, -133, -114, -86, -130, 108, -168, -113, -211, -142, -123, -245, -194, -171, -56, -139, 57, 233, 240, 159, 268, -42, -96, -87, 26, 108, 154, -282, -101, -61, 24, 31, -21, 44, -149, -48, -173, -74, 68, 54, 131, 124, 461, -36, -20, 162, -8, -91, -141, -65, 80, -14]
7357a4J4p6M0N1l60K37J41K36l13r6J71j33J2kK30j39O5j09l4K44r6j05q1K92
7381A75l7k9k53R6j10M17k08k4j92L33j10p2M4j30J53Q9j97P6k04K41J1OK8R4
7405A97k59K02l97M28l31J38O4K5nj55J00j71K14j70K0K15n45N32R9j6j02N7J40
7428B80m59L34l51J74L8j69K9J23j87K92l10K81l2N6k20nJ6j77L88J56j44Q0m82
7451b89L64P6k66j3%K27k18j9J25k13M06m01K18j87J15o6j22N13m27Q4J57J03
7473A67J54j85J7j75N2J57N3k21q2J85j07q8n6L87j35j34J11K3J06k96J33r7Q3
7496E2J30l45P5J17M2OK26o14L59o1OQ9k49J79N7l21L47r6j8q6J0O3lOl19L66
7522A8j35K0l6J87m6j0J94j02k16K47p9k97o3L16J83l81K01p1K3J59K00l47j32
$$ y = [-14, 0, -76, -36, 15, -345, -108, 33, 269, -44, -140, 31, -102, -90, -92, 138, -1, 64, -45, -79, 165, 69, -36, -117, 175, 138, 109, -144, -48, -158, 259, 51, 27, -165, 168, 58, -14, 30, -100, 53, 142, -55, 21, -183, 58, 69, 75, 103, 197, -62, 140, -257, 171, -160, -22, 42, 67, 62, -93, 7, -164, 50, -120, -100, 115, -430, 102, 201, 185, 83, 140, 280, -179, 155, -196, -22, 16, -153, -124, -1, -188, 104, -206, 75, 43, 99, -121, -126, -110, -287, 101, 257, 113, 193, -289, 75, 151, -115, -128, -128, 99, -119, -138, -13, -226, 180, -221, -3, -190, -75, -141, -263, 250, -177, -93, 64, 167, 321, 136, 153, -22, 30, 187, 240, 19, -63, 122, 15, -73, -129, 258, 123, -11, 100, 123, 229, -67, 66, -31, 52, 182, -163, -88, 29, 71, 77, 303, -311, 48, -13, -7, 82, -167, 12, 69, -252, 95, -1, -19, -105, -95, -32, -35, -29, -348, 18, -117, -97, -133, 54, 8, -2, 192, 90, -126, 121, 42, -255, -318, -2, 181, -200, 1, -70, -47, 112, 312, -35, -167]
7545a67J46R6l78M20Q1l21o4N30l66K29j43m4n9K1j5K19k40K32k7m22L84l9P5
7568A48j99k35O54l83J01r8p1r3J20j32K30K96n9j30m12L00L4K07k85o6j13M0
7590a46M19l76M08j84l18J45J36J4k71J57j65L16k13j23K06Jn9l7K12j19j49o0
7612b06K49j6l3m3j34P8o3r3L51j08R5k72J70L7K18l48M1j2k07M61j44M8O6L1
7636A66k89k1P5J38k31M79m5n6l0n0Q5l34K40J9j75o8L40l51L30k76j3L24o8p2
7660A17pl7l2K2R5n2k15J02K74Q4l83J24j84K48k58k1M16k25M4k61m3M05k61J97
7684A49k88J32K09k73Q4k86M25l3J49k96J38j40O7J6j6Q6n7J54m89J67M1k07K34
7707c4L38m05K9K33p4j73M5m8R2o7K16l27j54M40k0j38J14j72N13n28n6N51n73
$$ y = [-167, -21, 75, -303, 117, 198, -123, -187, 343, -23, 206, 63, 19, -40, -19, -34, 185, -55, 177, 150, -272, 112, 73, 148, -51, -286, 368, -15, 86, -12, -83, -176, -56, -188, 42, 338, 279, 149, -263, 37, 71, 278, -7, -73, -186, -146, 273, -103, 305, 121, -197, -52, 84, 98, -173, -16, -181, 135, -78, -201, 5, 6, -53, -90, 122, 3, -146, -206, 43, 27, -6, -49, -183, -105, -168, -261, 90, -18, 77, -195, -25, 12, 230, -118, -77, -89, -296, 165, 21, 69, 135, 166, -123, -144, -69, 69, -162, 317, 272, 216, 186, 136, 221, -113, 127, 146, -29, -97, 243, -108, 222, -54, -67, 257, 189, 117, 110, 73, 41, 63, 158, 106, -109, -7, 267, 351, -32, 92, -92, 156, -102, -123, 293, 68, 112, -149, -192, 213, -48, 149, -139, -7, 202, -71, 13, -273, 152, 119, 268, -28, 110, -30, 37, 53, 37, 123, 66, 220, -269, -102, -61, -268, -34, 304, -101, -72, 161, 87, -86, -41, -89, 3, -64, 152, -175, -329, 111, 91, -47, 67, -105, 408, -120, -176, 375, -198]
7730a98J32L04j81J5N1k09K11j37k37M14l04K14k18k0L10l20K20Jq9J78p5k57
7752a95J41j04K24l1m25N54J13m77Q8J02K67j65j30J11j19p6K65j13l18J00L93
7773B05k40J15K9l90L4K31p8m6J95q9K6P4k87K42Q0j36J80K4l14Q7K47k53j58
7796b22L09m1k58J74J37L1k72Q6K3O7j32Q4Q7K6k1p9q2K00j53q3K04k4O4l72N35
7821B88k90P8R2j10K06j84k01K61j11R9j51k13L40k45K01q8%j55qK24MQ7k4k68
7845a68q1J18j26K64jR6l09Q5K06l0l70L10J81l00m3K07o4P2L3p0j61L22l08J86
7869D9K57n25L61j54P2r8j16K79R7l49M11j55K40l56n9j00K23j04j11P6J99J35
7891B72l57J20j34L74n07L32k92L19J0O2m21L71l10n4j41K64J29l9j32L31j45
$$ y = [-198, -66, 238, 57, 72, 123, -86, 125, -12, -249, 165, -139, 75, -143, -163, 147, -173, 47, 48, -41, 137, 62, -195, -54, -158, 66, 35, -390, 164, 277, -200, -112, -10, 257, 92, -38, 73, -46, -122, 143, 30, -288, -188, 205, -35, 80, 109, -281, -247, -16, -94, -140, 55, -34, -8, 66, -221, 21, 101, -35, 145, 169, -145, -58, 189, -64, -222, 87, 46, -212, -38, 99, 130, -142, -56, -33, 34, -98, -14, 73, 99, 78, -1, -83, 117, -36, -119, 85, 61, 125, -247, 288, -2, 76, 168, 58, 264, 80, -121, 140, 29, 128, -23, -236, 104, -141, 60, -28, -28, -183, -191, 33, 37, 124, 100, -168, -249, -131, -257, 7, 6, 102, -207, -122, 84, 54, -316, -6, 175, -125, -168, 39, -25, 47, 80, 10, -151, 171, -137, 49, 306, -219, 142, -12, 60, -38, -154, 125, 222, -127, 284, 129, 369, 13, -46, -146, 77, -27, -138, -62, 137, 272, -85, 35, -99, 275, -232, 100, -192, 127, 137, 199, -222, 149, -161, -215, -356, -92, 37, -2, -134, 197, 52]
7912E2l24L51j54j61M68N4j35j68o5N0n1QK11j38mJ21j59m5p9K28J03J2k05m7
7936g7l1kO7K17k80J59J29l81K13K8r7J11K2k24m3M26p9r7k20M9L6K45L8l76L08
7961A41j02k4k14L86j43q5Q9M8m24L05Lq7K69k78K35j33L3m9n0l6J9M2j57Q5k3
7986a50k1K43J20l05K9L71l36J21j53J47j79L6j21K77q0k45L81%j37N6N2o0m6
8009@J67n5l74J05J88j24K22Q5k76K82l78J83J05p7M06p12M5M93l10J67l90L33
8031H5j3L6j21q5l2J31J20j30K7J4q2J17j63J27K1k46M07j56o8O6n0o8Q9k86N02
8056B42j85J49j34j9K07j60j52rp1J30j07LL48l71K27q0J4J29J2j58J7p3L38l51
8080e4J89m9k59L90r5m61K71p7K21q5M76l73j85n3o8K40q3J33k62m5K96r0n5j8
$$ y = [52, -272, 79, -75, -236, 232, 286, 151, -17, -82, -32, -83, -75, 136, -2, -6, 115, -44, -89, -168, 60, 163, 175, -30, -77, -108, -110, -43, 174, -106, 53, 182, -199, 14, 42, -55, 56, 78, -146, -189, 237, 158, 61, -159, -110, -74, 171, 209, -167, 141, 39, 15, -199, 187, 44, -41, 48, 96, -328, -23, -20, -107, 162, -116, 119, -14, 19, -30, -80, -116, -97, -55, -212, -127, -150, -171, 72, 192, -113, -84, 287, -49, 72, -81, 66, -113, -77, -198, 79, -1, -246, 135, 135, -2, 54, 106, 46, 0, 167, 112, -262, -157, 31, -93, 129, 214, -62, 220, -158, 25, 130, 53, 459, -253, -208, 285, -25, 142, -248, 85, 72, 108, -13, -98, -130, 1, 121, -9, 18, 32, -50, 67, -96, 31, 52, -194, 213, 57, -11, 55, 5, -63, 26, -260, 242, 57, 206, 72, 53, 260, 100, -52, -61, -132, -2, -109, -106, 242, -129, 98, 18, 32, 161, 173, 15, 32, -41, 297, -54, 135, 86, -173, 217, 122, -339, -68, -145, 76, -9, 467, 94, -91, -144, -212, 28, -55, 78, -184, -229, 67, -23, -78, -96]
8104i6P9K79k71j77L5J56J13R3k94L1N1j91K8M20r5j31N0J40k54J0l20K37K21
8127A14j91J28l76N48l95O5J4M8K63k53p9Qj19Q4J09J3k1m1l6J46L0m2Q1j84K81
8152A95j04k30K60k59M0K27k8l51L02j66L57o23M09j10J61j14q7l2K09j24j82
8173b50J39k6J30M00m47m7L4K7k24K75O6j59k11L65M2q0k24L89
$$ y = [-96, -17, 262, -9, -186, -151, 5, 118, 211, -83, -52, -1, -192, -164, 256, 161, 30, 80, 220, -34, -24, -344, -107, 114, -77, 51, -325, 223, -172, -107, -93, -45, 218, -35, -114, -106, -225, -141, -32, -19, -40, -81, -117, 29, 59, 17, 98, -86, 195, 91, -139, 121, -138, -98, 129, 101, -250, 52, -114, 243, -380, 29, -81, 80, -34, -121, -153, 56, -68, -250, -111, -137, -7, 393, -54, -101, -67, -40, -264, 11, 77, -82, -293, 72, 114, 34, -190, 199]
8191A99
$$ Imaginary data points
##PAGE= N=2
##DATA TABLE= (X++(I..I)), XYDATA
0@%%%qJ6j6J6j7K5m0M8o4Q1r7J25j49J76k08K47k95L44m00M67n38O22p11Q08r25
28d93J048j185J337j502J687j886K108k355K618k911L231l582L971m394M866n388
44b830N967o618P348q180R131j0228J1520j3056J4931j7276K0299k4384L0227
57A6851l9355N5774r4582L51721L79096m33728k99662l10720j74802J1968L70943
68a66496L98910K55926M5045j23943l72497m04081k02467Q3999K46124L69784
78A30304L33184J03861j85698l06873l28336k53767l4047K57633L69728L00155
88C86144J48937p1792l27909l90402k19556r383J51752L25125L75786J65489j22551
99D11640k48866k82069k90604j35737J76536L60511L03915J65954K115k23062
$$ y = [0, 0, 0, 0, -8, 8, -8, 8, -9, 16, -24, 24, -40, 41, -56, 69, -80, 96, -112, 135, -160, 184, -216, 251, -287, 335, -376, 432, -493, 555, -630, 707, -795, 892, -994, 1114, -1241, 1377, -1534, 1697, -1885, 2086, -2308, 2558, -2830, 3137, -3481, 3867, -4313, 4818, -5410, 6110, -6946, 7985, -9291, 11008, -13376, 16851, -22504, 33270, -61312, 290409, 669505, 235777, -63885, -374605, -549407, -537439, -166496, 232414, 488340, 533385, 409442, 36945, -367136, -569603, -485604, -239480, 130304, 463488, 567349, 381651, 74778, -253558, -507325, -541372, -283739, 85989, 386144, 535081, 463289, 135380, -255022, -474578, -483961, -332209, -7084, 368702, 534191, 411640, 162774, -119295, -409899, -545636, -369100, -8589, 295326, 461280, 463395, 240333]
109B40333l61078k69950p1712R0531K46947L47939K46522n457k00650k93531l10037
120c40143j66106J11717K91151K77846K03046Q7875j38876l31272k97075j25378
130d27215K3827J85276L36974K89009M3823j58529k30952k69072k22303n221K25034
141b09349K83199K26861J33337n2101k70329l18862j81088j7475J33323K79269
151F785K96359J24408q2766j99073k58368k41214p5031J45760K55965K48603J74929
162C96357L766k13181k95291k04867o9246O7021K21057K89206J79045n828j42420
173B25619k37137k65248j37990Q3930K25779K44155J92964N8692j39355k56234
183d825k22985j23522J065J70889K83448K16601M4145r7077j99091k58331j77820
$$ y = [240333, -120745, -390695, -462407, -371876, -124929, 223010, 469532, 464075, 263425, -30106, -340143, -506249, -394532, -103381, 174465, 377511, 465386, 326510, -4762, -301837, -427215, -403388, -218112, 118862, 407871, 451694, 293165, 62213, -206859, -429162, -434383, -209349, 73850, 300711, 434048, 381947, 111618, -207244, -388332, -405807, -272484, 6785, 303144, 427552, 344786, 145713, -112655, -353869, -428900, -283140, -27175, 221428, 396357, 400123, 186942, -108349, -313216, -382462, -315441, -94384, 194822, 373867, 368039, 225619, -11518, -276766, -414756, -330826, -105047, 139108, 332072, 390764, 251409, -4825, -227810, -351332, -350267, -179378, 104070, 320671, 364816, 267739, 68648, -189683, -367503]
194c67503K3014J75477K13425K02034J23519n8914k25573k40694j52309m1976
204c49500J08598K49506K44284R5331n6551j58115k28789k05644n1926J20641
214b32165K02046K08995J52215O21j72036k36457j81812p5069O4041K01606K33858
225A65843J37058L855j11996k07078k20236j03624O3458J71257K09279J77243
235B85059M7782j23185k11355j88228j11670Q294J52891K25959J70794N0531p0706
246B36166j79055k22365j39340J6244J35299J89607J85099R1853o5654j77240
256G0614j91268j40555m0119J05105K08237J90242Q6568l0013j41860k08999j65768
267b57816l1756R3097J65493J87006J29080j1213j43905j88269j56929p3892N7484
$$ y = [-367503, -344489, -169012, 44413, 246447, 369966, 311052, 85479, -155215, -307524, -349500, -240902, 8604, 252888, 348219, 291668, 133553, -95236, -300880, -352806, -232165, -30119, 178876, 331091, 331712, 159676, -76781, -258593, -333662, -269621, -68015, 165843, 302901, 306756, 194760, -12318, -232554, -336178, -272720, -101463, 107816, 285059, 332841, 209656, -1699, -189927, -301597, -293303, -140412, 85547, 256341, 306872, 236166, 57111, -165254, -304594, -288350, -153051, 36556, 221655, 313508, 247854, 70614, -120654, -261209, -301328, -196223, 12014, 202256, 288824, 258811, 116951, -92048, -257816, -289572, -196475, -30982, 156024, 285104, 273891, 129986, -58283, -215212, -289104, -231620]
278b31620J77085J96232J16223O719j00679j82262j81124q0150M9078J41841J82434
289I3777J49771L4704r9994j73029j68124j02494J5252J37367J86512J41909M7978
300B63629o1130j58132j85360j13798P402J10741J69692J61789P1903n5954j46521
311F4261j68346j26715k6432R7131J70493J56538Q1481k1990j27654j79185j37072
322b17490l1012P4457J46909J66071J05145j1855j17721j62459j40787o0631N5905
333a93468J45084J61861J08705J3657r3014j63584j50743o6496L7185J21760J62104
344H3051J28655K6390q4634j47099j46626q7889J3824J14406J58849J29268M5805
355B34000n9567j40685j54604r5325J473R3300J50365J40357O0316m7212j25091
$$ y = [-231620, -54535, 141697, 257920, 264639, 163960, -18302, -199426, -279576, -230498, -88657, 93777, 243548, 278252, 178258, 5229, -162895, -265389, -250137, -112770, 73742, 215651, 263629, 202499, 44367, -140993, -254791, -247389, -136648, 33044, 194833, 266736, 210782, 64261, -104085, -230800, -257232, -160101, 10392, 166930, 248411, 226421, 98767, -80418, -217490, -248502, -174045, -27136, 138935, 244080, 232225, 114504, -47955, -188742, -249373, -193468, -48384, 113477, 222182, 235839, 142825, -20759, -171502, -237998, -200813, -79053, 83051, 211706, 238096, 153462, 6363, -140263, -228152, -214328, -99922, 58927, 188195, 234000, 174433, 33748, -120856, -216181, -214708, -121408, 28957, 169314, 229630, 182418, 57327]
366E7327j46978j10761k2420Q2070J47629J41273P1820k6587j13496j48178j15064
377a83365l3678O1697J33176J45677Q7686j0988r8949j42293j25617n1261N0459
388a67456J27186J41130R3538Q195q1734j36877j29680o3975L0018J12076J44221
399G6642J07810K1358p1682j28740j30504p5071J5908R9493J35912J12052M0186
410B03364n0953j21825j36666q6966L180Q7898J31926J17701N0429l8941j09298
421D9849j30875r4724j5996P0008J25644J25422O6279k4439j03142j31945r9235
432a63154k5296N6208J15071J23816P6879p605q6951j26187j09973m3964M3950
443a47206J11469J27136Q2727L182p5770j19248j09605n3620K5856R5178J25538
$$ y = [57327, -89651, -200412, -222832, -140762, 6867, 148140, 219960, 193373, 79877, -68301, -183365, -217043, -155346, -22170, 123507, 211193, 200205, 101256, -41037, -166654, -217915, -167456, -40270, 100860, 194398, 202593, 120859, -16018, -145698, -209673, -179655, -67579, 76642, 184452, 205810, 134128, 5388, -125116, -200187, -184279, -84786, 51126, 163178, 203364, 152411, 30586, -106080, -193046, -189866, -101968, 29958, 147659, 198088, 159147, 49849, -81026, -175750, -191746, -121738, 3906, 129328, 195607, 171168, 68026, -63919, -163154, -188450, -132242, -17171, 106645, 183524, 175919, 88968, -37219, -147192, -191156, -147206, -35737, 91399, 174126, 177308, 101538, -17710, -127315, -180935, -155079, -59901, 65637]
454F5637R6991K0793o5072j17540j14402o2030J5549Q6960J20118R8036L1940
465A76980m6969j04321j15683p7662k275P7043J21595J06437M0472l8877r6470
476D0270j12148q1205j4520O1567J10420J08480N7484j9661q8889j17286r0948
487a46436k2956N4192J04679J07674O2890r299p4176j07669r5988m1058L6879
498a31268R9396J13605P3641J239o8428j05846r6859m5161K5627Q5306J06830
509E8082Q1618J9572n3118j02069j04280n8806J5629Q1977J07145Q3298K4798
520A53846m1761r0441j01046o7784q98O7311J05027R2809L9367l2462q9002j03917
532f8951o9673o390N6535R4018R2580N0386j7223p6246j02371q1557k2988M8587
$$ y = [65637, 162628, 183421, 118349, 809, -113593, -175623, -160074, -73114, 47004, 145040, 176980, 130011, 25690, -89993, -167655, -169930, -92887, 28708, 135145, 175617, 136740, 40270, -71878, -153083, -167603, -106036, 4384, 112864, 170348, 150687, 61798, -55488, -146436, -169392, -115200, -10521, 97153, 160043, 150744, 76568, -31101, -127089, -168147, -131268, -31872, 81733, 155374, 156613, 88185, -17661, -114520, -159681, -134054, -48748, 58082, 139700, 159272, 106154, 4085, -100195, -159001, -143372, -61395, 45750, 129048, 153846, 112085, 21644, -79402, -147186, -148084, -80773, 24254, 117063, 156430, 123968, 34966, -68951, -138624, -145014, -88479, 5539, 98119, 148505, 131282, 55036, -47335, -128892, -151880, -103293]
544a03293R6084R6567N2823j0462o6813r5361q2763l2080L2892Q3848R7351O7657
556A36450M941o1297r7921q7343l7827K7057P7190R2011O8390J5780m4594q8554
568D283r1863n2317J2784P1079R6175P6454K2400m0768q3686q7769n5388J501
580a27115N7705Q9133Q1627L6869k6655p9871r3552o2851n298N2973Q5755Q0845
592H9565L9809j7600o4626q6876p2648k1355M2580Q3665Q4612N0007o041o3674
604E7418q9908p0557k2096K9700O9384Q5534O1275L735n4472q3995p7724l7619
616a29325K3563P3279Q4208N6984J0665m0154p6861p9328m3822J0513N9262Q3818
628C2802P0839K1578l6815p6391p9316m7999L792N3468P7459O8844L1495k1799
$$ y = [-103293, -7209, 89358, 142181, 131719, 64906, -30455, -113218, -145298, -112406, -28558, 68793, 136450, 141391, 80094, -17827, -105170, -142997, -115940, -38750, 53261, 121651, 137431, 92837, 4283, -87580, -139897, -127113, -56034, 40141, 116595, 138995, 98227, 14541, -73228, -128616, -127115, -69410, 19723, 101350, 138219, 111564, 31693, -61859, -124710, -130008, -77035, 8720, 89565, 129374, 111774, 47148, -39728, -112376, -133731, -91151, -7486, 77126, 127133, 121092, 57418, -32490, -103047, -125143, -95443, -26059, 59475, 120750, 124485, 70013, -13982, -91706, -129325, -105762, -32483, 51725, 108709, 119374, 79220, 2359, -76969, -120791, -110278, -51016, 32802, 103641, 125219, 88404, 12013, -67303, -115302, -111510, -58042, 19417, 88261, 119756, 97957]
640I7957o8732q2848n7053n583M6172P8563P3828L3997j8846n9541p5072o0797
652i7955j7200L5570P1205P4725M6963n368n7409p9419o2644k1166K7256O6031
664a9411P5825M8139P67m2780p1558p2158l5013K2931O5198P2571N3575J1911
676A09997m0986p3675o5500l2336P489M8827P5196O3199J7240l3308o2989p0567
688e7413m7715L674N2635O9785N7117K6101j8839o0139p2338m8713o193L8241
700f3797O9690O8764L0646j8385n5079o7541n2576j2709L3496O2122O3963L9724
712I8318m024m8622p0033n6461k0719K4824O1409O7188M1146j168l8177o3013
724i332o2348k8607J8941N4087O5161N0935J0199l8697o4563n8129l1003P863
$$ y = [97957, 29225, -53623, -110676, -116259, -70087, 8476, 82304, 116301, 97455, 37914, -37158, -97955, -115155, -79585, -8380, 66345, 113308, 107940, 50531, -28888, -91532, -112698, -85442, -19411, 56414, 104553, 105320, 62540, -9018, -81176, -116189, -93258, -28060, 44511, 98086, 109997, 69011, -4664, -70164, -102500, -95011, -46184, 29012, 92211, 109451, 76143, 13154, -57413, -105128, -101454, -48819, 20966, 78083, 104184, 85345, 25206, -47132, -95845, -102038, -63797, 5893, 74657, 105303, 86918, 31839, -35702, -88278, -100987, -67491, -5369, 58594, 98318, 94294, 45672, -24361, -80822, -101541, -76717, -15308, 51880, 93026, 91858, 53681, -9332, -71680, -100287, -81346, -27259, 37902, 88837, 99036, 60339, -4224, -62353, -93356, -85493]
736h5493M8026O7193N0014J2487k4187n4038o6421m3020O832M6314N9446N2525
748F9678K5272j9818n6943o1254l9336p047L2073O3087O0636K5898j5479m6025
760C0742o2145n1158q462L4142N4819N3569L5197l356m4587o1407m8357j7727
772h8730K0555N3697O1416L6675j500l5562n6558n4105k3889J7434M6950N6346
784C2729M5004R876l3296n7304n2996k8371Q081M4544N8916M3862J1786k2369
796F0462n0603n7556l3861N184L6193N3385N1186K1638k1749m9458n1358l6511
808g3048p833L1295N7130M9769K1649r765l9549n8617m4664o340K9334M6642N0445
821D6448L3482o262m2526n1439m0515j7786J6831M9843N4743L0106j019k9726
$$ y = [-85493, -37467, 29726, 79740, 92227, 68040, 14002, -52419, -95439, -88607, -42293, 17153, 69678, 94950, 75132, 18189, -43065, -82401, -89448, -57375, 5712, 66348, 92246, 76767, 30742, -31403, -82561, -91023, -56881, -2062, 51507, 86704, 83348, 38761, -22646, -71003, -88730, -68175, -14478, 46938, 83613, 82113, 46551, -10007, -64112, -88001, -70567, -23617, 32729, 77733, 87609, 54313, -2991, -55987, -84358, -76277, -31733, 27183, 71045, 82831, 60462, 9859, -47697, -81558, -76374, -40181, 13204, 64390, 86028, 64279, 14821, -36537, -73048, -80881, -49586, 7544, 57313, 78962, 69197, 29648, -28969, -73633, -79973, -50639, -3997, 46448, 79930, 73668, 31142, -20297, -60812, -78598, -61767, -11924, 42819, 72925, 71906, 42180]
833D2180n0751n0170j9992J7509M1050M9154L9823Q441l0093n0130m5370k6126
845g4475N520M0129N3891L8560J0064k0601m4822n0756l0060M974L3045M7805
857A3274M3810J7945j8631m2323m6691l3819n625L0219M9433M2155K0278p700
869F2325l7460n2083l6912m831K2787M1640M7376K9201q240l6753m3747l8326
881e5023j6994J8455M6202M5202K5141R42k5540m7716m3787j5064J5188L4053
893a8941M5267L6461N468k8624m2823l9343k3889N899L6738M6209L2399J0529
905F5350j6874m1612m6736k4553N214K8684M2293M0292J5237j8166l7911l9893
917b8675l0291m646K6780M3869L7409J8216o952l4325m6504l1961m003K0842L6922
$$ y = [42180, -8571, -58741, -78733, -61224, -20174, 28980, 68803, 77244, 47151, -2979, -48349, -74475, -68955, -28826, 25065, 63625, 73689, 53088, 8266, -42490, -72550, -67576, -34531, 13274, 57084, 75029, 56398, 14075, -32616, -66435, -72060, -41841, 7592, 49747, 70025, 62325, 24865, -27218, -64130, -68961, -46174, -4534, 42842, 72043, 63803, 27050, -16697, -55023, -72017, -53562, -7360, 37842, 62983, 63925, 38385, -9331, -53118, -68182, -52994, -18941, 26326, 62787, 68255, 39631, -3192, -42535, -66424, -60525, -23787, 22422, 54821, 65350, 48476, 6864, -39872, -64425, -59211, -30527, 11766, 52058, 67295, 49129, 11218, -28675, -58966, -63612, -36832, 7037, 44446, 62662, 55710, 21385, -25119, -57080, -61083, -40241, -3319]
930c319M1544K4648o981l0786l9761l5353j3881J7272L9441L9820K5087J135k6457
943C2409m3254l5242j2579J0547L0508M2041L1959K872k3815l6694l7349k2441
955f1038P904L4259L8403K8027J0613j4599l8788m0153k0433L387K3325L9039
967I946L7858J2258j7032l3171l5819k7257k638K4765L7298L2363J7321o090l1592
980A8210m0910k7617m343J8138L4644L7830J9870p616k6736l4507l1314j2033
992e6384J5936L3599L5212K3630J679k5421l9155l0767j0594R351K8378L7926
1004B3390K6466J093j9421l1959l4608j9824Q056K9841L4671K6433Q522j6242
1016C6418l4509l2952j7141J131K1392L6188L2027R778j3805k8805l4382k4622
$$ y = [-3319, 38225, 62873, 55892, 25106, -14655, -50008, -63889, -46617, -7176, 32644, 57731, 58866, 32409, -10845, -46087, -58666, -48119, -17611, 24430, 56389, 59261, 35446, -1248, -38597, -61038, -53134, -18875, 19528, 47555, 58168, 43569, 4781, -35372, -55805, -52418, -29093, 9946, 47804, 60062, 43030, 9859, -25960, -53217, -55855, -31090, 6208, 38571, 55892, 49802, 18210, -22700, -50317, -54660, -36522, -1878, 35952, 55822, 48206, 21470, -13037, -44351, -56384, -40448, -6849, 28363, 51993, 53672, 28251, -10904, -41671, -52265, -42914, -14536, 23390, 49856, 50949, 31528, -431, -35039, -54863, -46807, -16966, 17705, 44138, 52660, 36418, 1909, -31043, -48184, -47053, -25661, 10527, 42554, 52332, 38527, 9722, -24660, -49282]
1028d9282m58K3874L2321K7868J5297o103k8081l5280k4333n081J5720L2691L4116
1041C3269J6168o592k3561l1890k8210q507J5097K8317L0086K1729J792k2406
1053B5292l4748k7725j0504R245K7259L3185K1455J329j6712k8591l1110j6448
1065d8073P271K5209L0090K5073Q648j5940l1519k9205j4726J897J9755L1111
1077I591K6748R465j0404k6059l2092k1239M92K0013K8746K6618J3530q533k5467
1090A1409k8448k0551o019J3315K9575K9926J4473m830k1498k9566k4932o391
1102d3537J3896K4698K6964J9020K89k0067k8794k4170j1543P818K5717K9974
1114B0265J8981M29j5522k6122k6312j3044N876K0936K7494K2772O727j3985k6888
$$ y = [-49282, -49740, -25866, 6455, 34323, 49620, 43517, 15436, -19844, -44177, -49258, -33538, -847, 33269, 49437, 42845, 19284, -12606, -40816, -49323, -34226, -5909, 24177, 45906, 47698, 25292, -9456, -37181, -47685, -38440, -11181, 22004, 43459, 44788, 28076, -515, -31625, -48073, -40802, -15593, 14497, 39570, 48218, 32278, 759, -28446, -43172, -41275, -21520, 9591, 36339, 45804, 35400, 9341, -22751, -43990, -43498, -23485, 5261, 31879, 45409, 36876, 11409, -17039, -37590, -43609, -30294, -719, 29207, 43680, 38850, 17352, -12214, -37146, -43537, -29641, -4943, 22021, 41041, 41330, 21263, -7531, -31701, -43244, -35426, -9709, 20265, 39246, 39675, 24153, -1969, -28281, -41325, -35449, -14513, 12981, 35753, 42480, 28495, 1607]
1127A607k6112j5466K207J9993K8545K1249P025q494k2039k8336j8887m68J7730
1140b1446K5808K5230J1041q328k2626k5379j8695m100J3081K5719K4427J3008
1152C7740k444j8763k8086k2318m778J2028K2479K4656J6115q81j7624k4826k1462
1165b8164j0041P229K2389K6238J7265J587j4407k4905k3833j0113N911J8646
1177a2198K3805J9928N371j1771k2744k3945j4698K346J8390K4911J9634O403
1189C5432q483k0987k4006j5398l54J4396K3171K2594J0436p135k0800k3450j6760
1202c1344l064J3027K2274K1291J1489k601j7328k3844j8947n775J0047K1216
1214c559K3227J3543j984j5940k1633j9309q220P395J9185K2235J5958K320j3812
$$ y = [1607, -24505, -39971, -37764, -17771, 10774, 32023, 39048, 30554, 8515, -19821, -38708, -39176, -21446, 4362, 29592, 40633, 32305, 9679, -15700, -34395, -38495, -25414, 305, 24732, 37740, 35296, 16533, -11553, -33871, -38649, -26621, -4142, 20514, 36629, 35748, 18124, -6702, -28164, -38205, -30976, -8587, 17651, 34916, 36503, 22096, -2809, -26642, -36755, -30844, -12198, 11607, 31535, 36906, 25135, 2391, -21554, -36252, -33906, -15516, 9395, 29029, 35432, 26949, 5962, -18044, -33442, -33796, -19400, 3771, 26365, 36801, 29666, 8866, -14584, -31344, -34408, -21381, 893, 22184, 33673, 31072, 13744, -10100, -29047, -34822, -24775, -3559, 19668, 33211, 31227, 15287, -6346, -25655, -33875, -26480, -7295, 14940, 30898, 33218, 19406]
1227A9406k2884k0371q733M958J6949K2316J7088L638j1027j9693k0628j2763
1239c1744J683J6130K2311J8191N903q978j9173k1154j2797J8J2760K0630J9670
1252B3450Q527o102j7913k1008j5282k626J1661K0796J9068R803l979j5189k0250
1265i044j6651m704Q481J9363K0057J2345j873j4164k0255j7326o057P102J6733
1278e993J9882J3774J340j2208j9545j7990q981M951J6249K0190J3937K699r738
1291A8567j7797j8607j0591K548J4393J8849J5992N779q050j7747j9018j1341
1303b7023M36J2170J8717J6845O813n532j5660j8380j3702k317J1027J8404J6813
1316A8611Q525l653j4053j8494j4359l317Q298J6196J7771J0797j292j2840j8057
$$ y = [19406, -3478, -23849, -32582, -27624, -10675, 11641, 28729, 32367, 21340, 1647, -18981, -31744, -30061, -13931, 8380, 26571, 32474, 23496, 4323, -16831, -29628, -29610, -16850, 3780, 23450, 31977, 25875, 7962, -13046, -28328, -30954, -19293, 1503, 20571, 30374, 26395, 11206, -9044, -25695, -30399, -21918, -2555, 17502, 29847, 27974, 13810, -6445, -23771, -29828, -22726, -5993, 13889, 27663, 29003, 16795, -2750, -20740, -29721, -24770, -8521, 11669, 25606, 28305, 18567, 770, -17837, -28428, -25880, -11487, 7362, 23354, 29133, 21083, 3336, -15682, -27023, -26587, -14417, 4300, 21145, 27958, 22426, 6766, -11614, -25316, -27633, -16606, 1798, 18611, 27136, 23483, 9430, -9064, -23423, -26740, -18442, -2246, 15525, 26322, 25030, 12190, -5867]
1329e867j5266n922O689J5609J7956J1373K71j0076j7252j6154q099M822J4653
1342g263J7106J2606L378q714j7368j6210q446K584J2043J6707J4516M969p369
1355A8539j5705j6079j0717K85J0870J7338J4491N913n180j3678j7103j2012j040
1368b4078R654J5454J5191Q529l110j3320j7091j1845l002P014J4868J5935R441
1381B3640k007j1197j5464j3606n657O059J4442J5073J0811P98r833j6074j4111
1394a7126n959L739J2391J6063J2341J237q529j4497j4069q325K354J1543J5448
1407F611J2574L407o665j3363j5031r288P23J0016J4765J2917N489m359j2845
1420D951j4798j0641q97Q558J3985J4348O474l886j1468j3984j1163l242P224
$$ y = [-5867, -21133, -27055, -20366, -4757, 13199, 24572, 24843, 14767, -2485, -18639, -26738, -21916, -7263, 9843, 22449, 25827, 17113, -255, -16465, -24911, -22327, -10284, 6423, 20939, 25908, 18539, 2834, -13245, -23962, -23677, -12807, 4531, 19022, 24935, 19755, 6077, -11026, -23038, -24078, -14424, 1030, 16221, 24750, 21640, 8320, -8771, -20616, -23618, -16604, -1736, 14199, 23640, 21633, 10436, -5028, -18634, -24291, -18232, -3790, 11283, 22094, 22892, 13059, -3015, -17126, -23085, -19346, -6955, 9108, 21449, 22686, 14157, -340, -14409, -22734, -20380, -8837, 6611, 19185, 22592, 15927, 2564, -12467, -21755, -21032, -11016, 3749, 16666, 22155, 17796, 4951, -9847, -20488, -21385, -12827, 1158, 15506, 21980, 18094, 6626, -7358, -18521, -21763, -14539]
1433a4539J4016J3810P084j141r757j4550j2803l465O046J2104J3443R565P87
1446B0600r652j3928j1763o089L429J1516J4871R870J003o846j2734j3701p533
1459b0957L338J0553J2587J1181M009o282j3284j2714p315M49Q804J3610J1586
1472A5565M125m447j0782j3392r155j044P383J3217J2445N924l661j0324j3084
1485g230r467k456O725J2029J2053P012r49r308j4037j0516k390M847J1074J2272
1499I659Q531o08q595j1572j0209o011K988J1526J2758Q162J161n891j2881j1808
1513a2790n050K785Q570J1532J0696K865o639j1135j0966p071R5Q831J3094R458
1527A4275K738l412r763j2427p731l98P139J0617J1158N843l058j0210j1852p953
$$ y = [-14539, -523, 13287, 20371, 19230, 9473, -5077, -17880, -21345, -15299, -3195, 10248, 19813, 20600, 10948, -2980, -14743, -20832, -17403, -5887, 8984, 18854, 19857, 13011, 277, -13424, -20957, -17619, -7066, 5521, 16702, 20711, 14429, 1145, -11569, -18884, -18435, -9631, 3979, 15565, 19690, 15243, 4461, -8931, -18086, -19130, -11747, 1470, 13915, 19839, 16178, 5854, -7230, -16697, -19153, -12428, -399, 11654, 18666, 17717, 8409, -5628, -16144, -18534, -13687, -2613, 9659, 18190, 17582, 8987, -2585, -12794, -18805, -15817, -4291, 8467, 16629, 17790, 11899, -982, -12790, -17840, -15055, -6485, 5047, 15743, 18608, 11969, 834, -10132, -17203, -17108, -8277, 4817, 14275, 17013, 13601, 3838, -8589, -16320, -16718, -9579, 1038, 12196, 18039, 14981, 4771, -7081, -15034]
1541a5034k268N916J1558J0539N598q09q117j2204r501k704M737J0038J1968O804
$$ y = [-15034, -17302, -11386, 172, 10711, 16309, 15500, 7383, -4821, -14322, -17026, -12289, -2251, 9717, 16521]
$$ [...]
8191a7
##END NTUPLES=NMR FID
##END=
