##TITLE=1H_SR1516_TFA
 CDCl3, 8 sc, 
 28.7.2020
##JCAMPDX= 6.0         $$ Bruker NMR JCAMP-DX V2.0
##DATA TYPE= NMR FID
##DATA CLASS= NTUPLES
##ORIGIN= UXNMR, Bruker Analytische Messtechnik GmbH
##OWNER= root
$$ XWIN-NMR		Version 3.5
$$ Tue Jul 28 10:02:09 2020 Russian Standard Time (UT+4h)  she@DPX200
##.OBSERVE FREQUENCY= 200.1315
##.OBSERVE NUCLEUS= ^1H
##.DELAY= (6, 6)
##.ACQUISITION MODE= SIMULTANEOUS
##.ACQUISITION SCHEME= undefined
##.AVERAGES= 8
##.DIGITISER RES= 18
##SPECTROMETER/DATA SYSTEM= spect
##.PULSE SEQUENCE= zg30
##.SOLVENT NAME= DMSO
##.SHIFT REFERENCE= (INTERNAL, DMSO, 0, 15.7039)
##AUDIT TRAIL= $$ (NUMBER, WHEN, WHO, WHERE, WHAT)
$$ ##TITLE= Audit trail, XWIN-NMR		Version 3.5
$$ ##JCAMPDX= 5.01
$$ ##ORIGIN= Bruker BioSpin GmbH
$$ ##OWNER= she
$$ F:/spectra/data/she/nmr/H-F/1/audita.txt
$$ ##AUDIT TRAIL=  $$ (NUMBER, WHEN, WHO, WHERE, WHAT)
(   1,<2020-07-28 10:00:52.20 +0400>,<she>,<DPX200>,
      <created by zg, POWCHK disabled, PULCHK disabled
       configuration hash MD5:
       00 E9 B6 7A A2 85 ED C7 34 08 36 98 17 FE 4E 26
       data hash MD5: 16K
       D5 8A 24 B6 F1 BF F1 8F 97 34 14 52 0E A7 F2 F2>)
$$ ##END=
$$ 
$$ hash MD5
$$ A3 3B E4 74 2E E6 EE 01 61 2A 7E CC 31 5C 90 ED
##$RELAX= 
##$RELAX= 
##$RELAX= 
##$RELAX= 
##$RELAX= 
##$RELAX= 
$$ Bruker specific parameters
$$ --------------------------
##$DU= <F:/spectra>
##$EXPNO= 1
##$NAME= <H-F>
##$PROCNO= 1
##$TYPE= <nmr>
##$USER= <she>
##$AMP= (0..31)
100 100 100 100 100 100 100 100 100 100 100 100 100 100 100 100 100 100 
100 100 100 100 100 100 100 100 100 100 100 100 100 100 
##$AQSEQ= 0
##$AQ_mod= 1
##$AUNM= <au_zg>
##$AUTOPOS= <>
##$BF1= 200.13
##$BF2= 200.13
##$BF3= 200.13
##$BF4= 200.13
##$BF5= 200.13
##$BF6= 200.13
##$BF7= 200.13
##$BF8= 200.13
##$BYTORDA= 1
##$CFDGTYP= 0
##$CFRGTYP= 5
##$CHEMSTR= <none>
##$CNST= (0..31)
1 1 145 1 1 1 1 1 1 1 1 1 1 1 1 1 1 1 1 1 1 1 1 1 1 1 1 1 1 1 1 1 
##$CPDPRG= <>
##$CPDPRG1= <>
##$CPDPRG2= <>
##$CPDPRG3= <>
##$CPDPRG4= <mlev>
##$CPDPRG5= <mlev>
##$CPDPRG6= <mlev>
##$CPDPRG7= <mlev>
##$CPDPRG8= <mlev>
##$CPDPRGB= <>
##$CPDPRGT= <>
##$D= (0..31)
0 1.2 0 0 0 0 0 0 0 0.06 0 0.03 0 0 0 0 0.0002 0 0 0 0 0 0 0 0 0 0 0 0 
0 0 0 
##$DATE= 1595916051
##$DBL= (0..7)
120 120 120 120 120 120 120 120 
##$DBP= (0..7)
150 150 150 150 150 150 150 150 
##$DBP07= 0
##$DBPNAM0= <>
##$DBPNAM1= <>
##$DBPNAM2= <>
##$DBPNAM3= <>
##$DBPNAM4= <>
##$DBPNAM5= <>
##$DBPNAM6= <>
##$DBPNAM7= <>
##$DBPOAL= (0..7)
0.5 0.5 0.5 0.5 0.5 0.5 0.5 0.5 
##$DBPOFFS= (0..7)
0 0 0 0 0 0 0 0 
##$DE= 6
##$DECBNUC= <off>
##$DECIM= 24
##$DECNUC= <off>
##$DECSTAT= 4
##$DIGMOD= 1
##$DIGTYP= 9
##$DL= (0..7)
0 120 120 120 120 120 120 120 
##$DP= (0..7)
150 150 150 150 150 150 150 150 
##$DP07= 0
##$DPNAME0= <>
##$DPNAME1= <>
##$DPNAME2= <>
##$DPNAME3= <>
##$DPNAME4= <>
##$DPNAME5= <>
##$DPNAME6= <>
##$DPNAME7= <>
##$DPOAL= (0..7)
0.5 0.5 0.5 0.5 0.5 0.5 0.5 0.5 
##$DPOFFS= (0..7)
0 0 0 0 0 0 0 0 
##$DQDMODE= 0
##$DR= 18
##$DS= 0
##$DSLIST= <SSSSSSSSSSSSSSS>
$$ [...]
##$SUBNAM2= <"">
##$SUBNAM3= <"">
##$SUBNAM4= <"">
##$SUBNAM5= <"">
##$SUBNAM6= <"">
##$SUBNAM7= <"">
##$SUBNAM8= <"">
##$SUBNAM9= <"">
##$SW= 24.9337058887773
##$SWIBOX= (0..15)
0 0 2 0 0 0 0 0 0 0 0 0 0 0 0 0 
##$SW_h= 4990.01996007984
##$TD= 16384
##$TD0= 1
##$TE= 0
##$TE2= 300
##$TE3= 300
##$TEG= 300
##$TL= (0..7)
0 120 120 120 120 120 120 120 
##$TP= (0..7)
150 150 150 150 150 150 150 150 
##$TP07= 0
##$TPNAME0= <>
##$TPNAME1= <>
##$TPNAME2= <>
##$TPNAME3= <>
##$TPNAME4= <>
##$TPNAME5= <>
##$TPNAME6= <>
##$TPNAME7= <>
##$TPOAL= (0..7)
0.5 0.5 0.5 0.5 0.5 0.5 0.5 0.5 
##$TPOFFS= (0..7)
0 0 0 0 0 0 0 0 
##$TUNHIN= 0
##$TUNHOUT= 0
##$TUNXOUT= 0
##$USERA1= <user>
##$USERA2= <user>
##$USERA3= <user>
##$USERA4= <user>
##$USERA5= <user>
##$V9= 5
##$VALIST= <valist>
##$VCLIST= <CCCCCCCCCCCCCCC>
##$VD= 0
##$VDLIST= <DDDDDDDDDDDDDDD>
##$VPLIST= <PPPPPPPPPPPPPPP>
##$VTLIST= <TTTTTTTTTTTTTTT>
##$WBST= 1024
##$WBSW= 4
##$XGAIN= (0..3)
0 0 0 0 
##$XL= 0
##$YL= 0
##$YMAX_a= 632122
##$YMIN_a= -337755
##$ZGOPTNS= <>
##$ZL1= 120
##$ZL2= 120
##$ZL3= 120
##$ZL4= 120
##$ABSF1= 10
##$ABSF2= 0
##$ABSG= 5
##$ABSL= 3
##$ALPHA= 0
##$AQORDER= 0
##$ASSFAC= 0
##$ASSFACI= 0
##$ASSFACX= 0
##$ASSWID= 0
##$AUNMP= <proc_1d>
##$AZFE= 0.1
##$AZFW= 0.1
##$BCFW= 1
##$BC_mod= 2
##$BYTORDP= 1
##$COROFFS= 0
##$CY= 11.3945322036743
##$DATMOD= 1
##$DC= 2
##$DFILT= <>
##$DTYPP= 0
##$F1P= 16.9975609425685
##$F2P= -3.02152046262296
##$FCOR= 0.5
##$FTSIZE= 0
##$FT_mod= 4
##$GAMMA= 1
##$GB= 0.15
##$INTBC= 1
##$INTSCL= 1
##$ISEN= 128
##$LB= 0.24
##$LEV0= 0
##$LPBIN= 0
##$MAXI= 10000
##$MC2= 0
##$MEAN= 0
##$ME_mod= 0
##$MI= 1.114404
##$NCOEF= 0
##$NC_proc= 0
##$NLEV= 6
##$NOISF1= 3.799351
##$NOISF2= 2.8
##$NSP= 1
##$NTH_PI= 0
##$NZP= 0
##$OFFSET= 15.70392
##$PC= 1
##$PHC0= -9792.441
##$PHC1= 8.200916
##$PH_mod= 1
##$PKNL= yes
##$PPARMOD= 0
##$PSCAL= 0
##$PSIGN= 0
##$REVERSE= no
##$SF= 200.130013532006
##$SI= 16384
##$SIGF1= 3
##$SIGF2= 2
##$SINO= 400
##$SIOLD= 16384
##$SREGLST= <1H.CDCl3>
##$SSB= 0
##$STSI= 0
##$STSR= 0
##$SW_p= 3612.71676300578
##$SYMM= 0
##$S_DEV= 0
##$TDeff= 0
##$TDoff= 0
##$TI= <>
##$TILT= no
##$TM1= 0
##$TM2= 0
##$TOPLEV= 0
##$USERP1= <user>
##$USERP2= <user>
##$USERP3= <user>
##$USERP4= <user>
##$USERP5= <user>
##$WDW= 1
##$XDIM= 8192
##$YMAX_p= 0
##$YMIN_p= 0
$$ End of Bruker specific parameters
$$ ---------------------------------
##NTUPLES= NMR FID
##VAR_NAME=  TIME,          FID/REAL,        FID/IMAG
##SYMBOL=    X,             R,               I
##VAR_TYPE=  INDEPENDENT,   DEPENDENT,       DEPENDENT
##VAR_FORM=  AFFN,          ASDF,            ASDF
##VAR_DIM=   8192,          8192,            8192
##UNITS=     SECONDS,       ARBITRARY UNITS, ARBITRARY UNITS
##FACTOR=    0.0002004,     1,               1
##FIRST=     0,             0,               0
##LAST=      1.6414764,     0,               0
##MIN=       0,             -337755,         0
##MAX=       1.6414764,     632122,          0
$$ Real data points
##PAGE= N=1
##DATA TABLE= (X++(R..R)), XYDATA
0 0 0 0 0 0 0 8 0 8 -8 16 -16 16 -24 32 -36 44 -55 64 -76 88 -107 124 -140 164 -189 219 -249 281 -323 364
30 364 -411 461 -519 583 -649 723 -808 895 -994 1104 -1224 1354 -1498 1659 -1837 2037
46 2037 -2261 2515 -2804 3139 -3530 3994 -4556 5252 -6143 7326 -8986 11488 -15731 24744
60 24744 -83209 279092 359859 -161034 -150261 158683 55990 -337755 -195779 240734 236624
71 236624 -129190 -138960 108729 66466 -186832 -109967 169896 160065 -85439 -94381 88210
82 88210 70925 -131595 -130739 77185 146426 9549 -28656 96409 106211 -90596 -188232 -19506
94 -19506 152510 87465 -26289 37114 117561 -7767 -152360 -44308 152083 116968 -45021
105 -45021 -32147 80346 22461 -106415 -31217 140847 113536 -30303 -11525 91644 28108
116 28108 -104364 -49460 93469 71477 -23841 38244 146400 64469 -94851 -75683 52712
127 52712 59993 -9000 30618 115604 64750 -63625 -74215 27238 82256 55914 37057 40747
139 40747 11261 -44788 -59308 -9156 58188 89218 67434 21653 -8383 -17993 -27557 -26930 7851
152 7851 48871 48259 18337 7967 12241 -3719 -18654 6951 39717 25652 -5373 660 16447
165 16447 -10598 -38884 1386 67111 60756 682 -16737 9515 -4360 -55063 -44645 38764
177 38764 78694 22924 -28686 -1560 29623 -10633 -51995 -10064 49057 20732 -42889 -28570
189 -28570 29983 23149 -25971 -11405 41672 24984 -38363 -35513 15351 3355 -47816 -20728
201 -20728 54515 45808 -24709 -21266 36712 11198 -72507 -56746 43997 56341 -29096 -43355
213 -43355 37068 47806 -39324 -59972 29232 63232 -21200 -72181 -9475 36550 -12201 -42007
225 -42007 21745 65402 7006 -50290 -20632 14304 -21303 -47396 4943 48679 7876 -34792
237 -34792 100 35092 -8152 -49942 -5330 44297 1875 -56960 -24020 39116 17126 -37528
249 -37528 -9418 55543 32941 -46718 -53051 7304 15957 -30167 -24929 35709 45216 -10791 -34682
262 -34682 -490 12054 -20400 -26773 8773 16349 -16954 -24385 8463 17100 -10612 -11566 20471
275 20471 18282 -27070 -41662 -4571 12422 -15689 -22040 20737 43118 4550 -32586 -15820
287 -15820 8238 -10621 -34431 -12237 24392 18904 -10762 -13982 5483 6771 -8868 -10986 1121
300 1121 929 -11848 -16046 -9471 -4335 751 12809 18181 5105 -11154 -12718 -10193 -18913 -23136
314 -23136 -3635 20661 19625 458 -6003 2859 725 -15957 -20927 -3739 10398 3271 -10168
327 -10168 -7954 5482 9984 2050 -2409 3073 6485 -3681 -19610 -21199 -6011 8828 10376 7253
341 7253 10743 13892 3487 -15264 -22405 -12233 475 2923 2031 6163 12068 10162 -120 -7896
355 -7896 -6261 894 2558 -4549 -10163 -4706 5217 6047 -4 1809 14145 15959 -1274 -17883 -15330
370 -15330 -2541 -1731 -6980 1214 19484 23290 5776 -9915 -8760 -2223 -6346 -11884 -5512 7784
384 7784 12482 5974 -1600 -477 4240 5147 -730 -6469 -6040 -1627 -1973 -7717 -6550 6912 18937
399 18937 14138 157 -4671 -1519 -5406 -17083 -17449 206 16237 14148 4320 2906 6334 1322
413 1322 -11083 -14619 -5327 4738 3524 -2249 -2163 4248 8588 4936 -982 -652 3377 1822 -8949
428 -8949 -16401 -8499 6155 10677 5679 6001 13284 11097 -6542 -20448 -13884 228 3757 -517
442 -517 3970 14960 15020 1473 -8686 -4917 1864 620 -4422 -4320 488 4839 3751 1890 3734
457 3734 9450 12177 5038 -7463 -12724 -6491 -610 -2333 -1214 11644 23336 16277 -2415 -9987
471 -9987 -2960 -1208 -9317 -10148 5514 18848 12439 -1114 -1543 6960 6802 -3190 -6326 1013 5424
486 5424 -1302 -8233 -3219 7094 12097 10802 8225 4094 -1075 -7290 -11682 -12487 -5064 7829 17530
501 17530 14379 4252 859 2109 -3577 -14755 -12764 3869 13448 2782 -7602 249 11960
514 11960 5988 -7361 -3303 10659 8141 -12502 -20326 -5822 6030 2520 -196 11153 18702
527 18702 5899 -12951 -16027 -9534 -7773 -6632 3450 12775 9236 1049 463 -542 -9318 -12128
541 -12128 593 9046 -2693 -14777 -4574 9829 1274 -11364 2649 23621 12236 -19688
553 -19688 -24870 -2253 2440 -15194 -11319 20992 31328 2478 -19266 -7193 3745 -11639 -20693
566 -20693 1213 19623 5343 -12264 -3049 10207 -416 -9966 5641 16300 -4769 -24996
578 -24996 -10537 8356 -2634 -12967 12264 36049 11002 -26367 -17802 10508 56 -27777
590 -27777 -10694 31474 26835 -15583 -20738 15081 20460 -15307 -23040 12041 22414 -13264 -28852
603 -28852 3627 23548 974 -10900 15054 25191 -8918 -31147 -7219 11805 -8711 -17882
615 -17882 16005 36469 2948 -25891 -2287 21156 -6339 -33628 -3366 33467 8824 -31855
627 -31855 -13416 29197 17498 -22342 -11759 28704 17960 -31792 -36032 7220 19072 -9351
639 -9351 -9420 27597 30181 -14705 -34187 -5872 8689 -13624 -15978 18653 27897 -10128 -29305
652 -29305 -244 18964 -5939 -18795 11638 26142 -14583 -46438 -14632 24791 11164 -13591
664 -13591 9149 36476 3322 -48140 -38111 9323 15506 -11973 -4354 29942 21348 -26136 -36398
677 -36398 1348 18784 -4879 -13257 11344 13063 -21422 -34117 256 24556 7519 -5081
689 -5081 12893 15447 -23022 -46182 -14553 20736 9956 -7418 14826 33827 -337 -42971
701 -42971 -27661 15419 14327 -15160 -5885 29187 18759 -28207 -33353 11266 30195 1177 -11383
714 -11383 14734 18489 -22895 -43092 -5883 29689 17860 2404 20488 26660 -14425 -47207
726 -47207 -21501 17802 13066 -1335 20469 39065 1906 -42879 -23982 23000 20590 -9135
738 -9135 3654 35458 10936 -44733 -37483 23791 43106 6555 -1908 30005 21339 -38863 -56315
751 -56315 669 42330 18977 450 27224 33423 -18512 -51411 -11544 31903 15775 -7136
763 -7136 16300 33202 -8657 -45081 -9709 38528 23460 -10328 7314 32475 -5887 -55149
775 -55149 -27215 35565 35890 -4918 2802 39743 15991 -48083 -47345 14287 34126 -3500 -8926
788 -8926 32152 32508 -24196 -44420 2678 31106 1363 -14828 16754 26017 -18927 -44183 -3474
801 -3474 31893 11258 -7912 18409 29531 -17446 -54435 -20978 24268 12540 -9945 16333
813 16333 42379 3213 -49417 -33270 16701 16114 -15724 -3718 32742 15946 -35846 -36839 11929
826 11929 27941 -2177 -8967 16967 12383 -31454 -42705 -1222 25641 8768 -423 19799 17756
839 17756 -23114 -42717 -11493 15513 1977 -8204 15313 25826 -8393 -35333 -11081 20360
851 20360 7379 -16354 -2821 19036 -522 -32892 -20402 18891 22888 -3578 -6984 13093
863 13093 6667 -25914 -31394 -447 17195 3108 -3882 12702 15890 -9243 -23973 -6862 8479
876 8479 -2291 -10135 5173 14406 -4120 -17991 -1970 16066 4741 -11094 -647 12880 -3981
889 -3981 -26345 -13916 15036 15592 -3878 -1407 17428 9982 -20413 -25585 879 13327 -2672
902 -2672 -8863 9355 16939 -3335 -16758 -1434 13292 1323 -12089 -3253 6722 -4304 -14465
915 -14465 635 17475 8941 -5979 -408 7702 -6328 -22008 -8495 13374 9028 -7990 -1239
928 -1239 16317 8051 -14986 -12641 10247 10714 -11981 -15576 5602 12654 -4678 -9882 9891 18357
942 18357 -738 -15011 -5022 4490 -5717 -12017 2665 15287 6095 -4785 1713 7864 -2611
955 -2611 -11930 -1885 8330 -713 -10450 39 12609 4728 -6538 1603 14040 4606 -14575
968 -14575 -11492 4963 4368 -8409 -3703 15151 16850 -1358 -8818 1305 4478 -7008 -10252 2611
982 2611 10341 3096 -2835 3548 7311 1242 -2509 2746 4661 -3109 -7012 -929 3187 -312 184
997 184 10214 13958 3508 -6211 -3422 950 -4979 -8791 1074 13211 10487 245 -929 5453
1011 5453 2881 -5184 -6135 2359 5912 -82 -4363 613 5150 4058 2789 4255 4569 417 -4186
1026 -4186 -5442 -4750 -2631 2230 7527 8195 4565 2009 963 -2794 -7338 -6509 -160 4391 2767 195
1042 195 2371 4924 1839 -2866 -2373 1860 2057 -3466 -6245 -2698 1359 1628 776 3561 6827 4288
1058 4288 -2734 -7688 -6853 -4010 -2488 -821 3134 6434 6232 2056 -2688 -4785 -4158 -2899 -2610 -2190
1074 -2190 -766 2243 2151 -225 -1073 1313 3139 438 -4144 -5146 -3221 -2659 -3805 -2366 3415 7855
1090 7855 5677 231 -2964 -3270 -4612 -7269 -5802 200 4975 5125 2041 611 600 -1117 -3168 -4248
1106 -4248 -3063 -423 334 -1325 -1976 478 3509 3869 1513 -204 243 -1052 -5433 -7415 -3904 2141
1122 2141 5292 4502 3385 4392 2211 -3764 -7781 -5781 -1123 1324 920 2038 3500 3640 566 -1691
1138 -1691 -1747 -456 -523 -1681 -2735 -2450 -445 1493 1991 1845 3548 4469 1218 -4789 -7548 -4100 -995
1155 -995 -823 81 4931 8514 4641 -2503 -4738 -2582 -2144 -4187 -3467 1852 4521 1858 -1118 112
1171 112 1984 699 -1342 -1174 -1585 -2675 -3963 -2667 -656 981 3752 6342 4427 -1324 -4796 -4298
1187 -4298 -3934 -6195 -3984 3736 8403 4520 -902 -678 1435 -2621 -7625 -4515 2878 3225 -2199 -3475
1203 -3475 2177 3878 -10 -1631 2667 3888 -1926 -6870 -4993 -1708 -1557 285 5652 8036 3984
1218 3984 -709 -2109 -3443 -7484 -6388 1128 6740 3579 -108 3261 4923 -1282 -7240 -1956 5915
1233 5915 2673 -5578 -4239 3545 3038 -3187 -1179 8732 10142 79 -7036 -3403 -1142 -5716 -5519
1248 -5519 4808 12144 7392 -93 261 645 -5127 -7913 -594 6538 2983 -2223 1262 5524 -188
1263 -188 -5204 1517 9766 3390 -7775 -6248 1969 25 -7821 -1338 13549 13206 -1636 -7310 337
1278 337 1370 -9857 -10577 4744 12865 2944 -5043 1973 6649 -2926 -9910 -154 8097 149 -9013
1293 -9013 -2807 5638 -442 -6537 3361 13573 4100 -10048 -6164 3378 -3650 -13690 -3312 15336
1307 15336 11411 -6022 -5878 7339 2887 -14368 -12787 7677 11510 -6092 -10881 4916 10019
1320 10019 -5400 -10718 6177 13520 -3854 -15429 -4059 5491 -4617 -10164 6078 18119 3972
1333 3972 -11756 -4089 5154 -6237 -15803 -294 17121 6300 -11389 -3991 11385 3033 -13475
1346 -13475 -4621 15433 8321 -14756 -13940 7170 8876 -7691 -4834 16591 16375 -8685 -17549 -628
1360 -628 6735 -7282 -9321 11380 19343 -124 -12787 831 9767 -3798 -11536 4833 15124
1373 15124 -1548 -15722 -1641 13946 3011 -8384 5540 19229 3076 -19177 -11389 8931
1385 8931 5256 -9490 884 21314 14861 -11370 -13895 4864 6805 -9622 -8088 13245 16144
1398 16144 -4904 -13033 3196 11246 -1968 -6978 8864 14090 -4699 -17431 -4224 8627 1084
1411 1084 -4767 10962 20398 1858 -18165 -10958 4151 -694 -9608 4056 21376 10413 -13428
1424 -13428 -12893 5081 5696 -8159 -4083 13955 11442 -12053 -18788 -7 10416 547 -2523 11894
1438 11894 14203 -8405 -23496 -9873 5661 700 -3046 10691 18710 75 -19424 -11495 4489
1451 4489 -70 -8836 2482 16574 3738 -17690 -12982 7976 7815 -6559 -2053 14535 7385
1464 7385 -18565 -21938 1131 11174 -1813 -2901 14655 15939 -9747 -23802 -7369 6760 -1897
1477 -1897 -7403 9374 18684 -702 -18579 -7433 7873 299 -9646 3253 15958 599 -19823
1490 -19823 -11132 9273 6355 -6407 2989 19290 6907 -20498 -20076 2633 7206 -6163 -905
1503 -905 20282 17124 -11063 -20855 -1389 7707 -5372 -7994 11884 17434 -5314 -18840 -2754
1516 -2754 11570 1361 -6141 8400 15248 -4547 -21463 -8599 9286 3800 -4182 8797 19739
1529 19739 2480 -19438 -12841 5682 3005 -8951 1383 19157 10318 -13263 -12033 6780 7693
1542 7693 -7436 -5798 11559 10306 -10493 -15349 3055 11093 -511 -3997 10050 12343 -6877
1555 -6877 -17151 -4621 5760 -1369 -4968 8820 15698 878 -12508 -4754 5373 -2236 -9701
1568 -9701 1479 13164 3293 -10921 -5020 8306 4315 -6663 -1941 10109 4731 -11864 -11780 2535
1582 2535 6488 -2692 -1510 10227 10310 -4966 -11987 -2886 2972 -3300 -4762 5408 10284 334 -6940
1597 -6940 -550 5067 -1129 -6255 1075 6536 -1225 -8921 -2229 7299 3717 -2947 1032 8240 1934
1612 1934 -9735 -8109 2715 3794 -3261 -1822 8266 8494 -2776 -6393 1400 4259 -3386 -6225
1626 -6225 1310 6221 99 -3803 2492 7522 1803 -4366 -422 3079 -1745 -6309 -1382 5458 2740
1641 2740 -1875 1919 7088 2301 -5338 -3320 3153 827 -5159 -2831 5421 5805 -1610 -1871 5216
1656 5216 5344 -2800 -6759 -286 2887 -1932 -3719 3150 7586 2522 -2361 -83 2770 -1929 -5722
1671 -5722 -1832 2874 756 -2137 999 4387 1623 -2576 114 3086 -517 -5740 -3381 1667 461
1686 461 -2967 281 6210 4804 -2614 -4400 -481 -763 -5026 -4654 2295 5080 911 -1655 726 2307
1702 2307 -1827 -4231 -1330 1084 -1054 -3547 -1600 975 179 -221 2097 3260 -183 -3085 -3154 -2344
1718 -2344 -3523 -3327 1040 4729 3196 74 -456 122 -1785 -5057 -3659 617 1930 -600 -984 1413
1734 1413 2037 -7 -1419 -424 1018 -956 -3236 -2540 -663 -134 674 2158 3350 2701 452 -1084
1750 -1084 -2897 -3638 -2637 -257 1941 2491 2737 2860 1563 -852 -2015 -1409 146 233 -640 -220 1629
1767 1629 1792 759 781 2292 3079 948 -1518 -1812 -1393 -965 -983 1155 3911 4678 2894 987 -497
1784 -497 -1572 -2059 -1716 -533 1286 2751 3198 2465 1121 690 371 38 -692 -586 -157 508 -90 -191
1802 -191 950 2792 3224 1621 317 -114 -1032 -2774 -2854 -528 2166 3204 2866 2382 1869 320 -2175
1819 -2175 -2816 -1790 -256 796 1038 1224 1605 1083 655 236 -338 -125 -39 -550 -1913 -2107 -296 1432
1837 1432 1384 1633 2022 1958 -351 -3521 -3840 -2202 -524 -285 800 3059 3425 742 -1286 -2028 -1544 -1884
1855 -1884 -1825 -748 638 638 176 317 770 413 416 130 -560 -1569 -2699 -2092 -653 -336 823 2917 3655
1874 3655 1561 -1897 -2373 -1451 -2223 -3255 -974 2821 3559 903 -387 1032 590 -1897 -2964 -382
1890 -382 1313 -568 -1930 -171 1622 765 8 1568 2359 110 -2579 -2394 -1336 -2008 -1467 1997 4782
1907 4782 2704 57 -241 102 -2747 -5154 -2262 2932 2390 -622 251 2949 1615 -2923 -2600 1696
1923 1696 2241 -1800 -3602 -344 1094 -1835 -1772 2886 5046 1181 -2533 -1712 -1150 -4448 -4808 114
1939 114 4884 2732 -68 1537 1728 -2846 -6024 -2525 2431 498 -2741 -16 3106 353 -4125
1954 -4125 -1772 4181 2969 -3011 -3970 -259 -323 -4800 -3912 3549 6261 1609 -1870 287 305 -5227
1970 -5227 -6834 -1115 3838 1747 -1151 1759 3119 -1484 -5237 -1333 3196 118 -3834 -1180 2490
1985 2490 -955 -5141 -390 5934 3965 -2855 -2521 1682 -653 -7333 -5448 4020 6475 143 -1268
2000 -1268 3324 3390 -4979 -7214 494 4670 73 -3651 1690 4828 -997 -4948 986 6028 1457
2015 1457 -4410 -1683 2867 -2047 -6206 -159 8249 5595 -2344 -798 4357 38 -8491 -4836 5779
2030 5779 6245 -2099 -2240 5664 4661 -4651 -5728 3939 6722 -2096 -6316 1257 4946 -2098 -5059
2045 -5059 3982 9771 1419 -5732 -1019 3649 -3114 -7665 713 9041 3992 -4065 55 6194 308
2060 308 -7909 -2402 7475 3309 -6315 -3285 6572 4185 -5486 -2994 8329 6760 -5929 -7732 2654
2075 2654 3989 -5768 -5597 7005 10595 -781 -6555 1563 4828 -5033 -8772 1855 9092 416
2089 416 -6209 874 6732 -900 -7113 914 8797 797 -8834 -3898 5034 499 -6900 471 11309
2104 11309 6419 -6706 -6445 3315 792 -8553 -4470 8956 9195 -3412 -6458 2972 4506 -5365
2118 -5365 -6221 4685 8311 -2872 -8426 -415 4997 -1341 -4370 5012 10059 -238 -9012 -4163
2132 -4163 2919 -1942 -6054 3058 11591 4652 -6626 -4061 3306 61 -7595 -1972 8891 5742
2146 5742 -5769 -5333 4178 4669 -4052 -2745 7089 7208 -4700 -9045 -737 4053 -1922 -2917 6595
2161 6595 10244 519 -8129 -3045 2255 -2867 -6031 2829 9935 3212 -5380 -2348 3813 -159 -6163
2176 -6163 -177 8462 3709 -7015 -6347 3049 2775 -3899 -888 9177 7833 -4859 -9569 -1430 2165
2191 2165 -3555 -3452 7067 10774 508 -7633 -2660 2040 -3003 -5621 2467 8729 1350 -6685 -2835
2206 -2835 3696 760 -4502 1180 8194 1938 -8588 -6847 2008 1486 -4165 524 10059 6832 -5923
2221 -5923 -8020 65 1031 -5734 -4028 6822 8553 -1990 -7095 356 3828 -2775 -5875 2747 7153
2236 7153 -1334 -8006 -2080 4117 -19 -3935 2787 8346 901 -7739 -4550 1934 -1138 -5566 1098
2251 1098 9540 4892 -4831 -4070 2705 298 -6662 -3165 6517 5704 -3837 -4834 3044 4000 -2851 -3586
2267 -3586 4718 6517 -2804 -7461 -1131 3185 -1615 -3122 4404 8281 964 -5443 -1931 1613 -2525
2282 -2525 -5207 1523 6920 2430 -3374 -279 3913 159 -4904 -1153 5018 2047 -4908 -3300 3490
2297 3490 2963 -2155 -636 5388 4404 -3200 -4981 148 1640 -2395 -2405 3606 5699 658 -2652 152
2313 152 2231 -1881 -4171 170 3059 420 -2303 960 3687 497 -2482 -23 2953 -342 -4073
2328 -4073 -2032 2075 694 -2578 -166 4561 2759 -2158 -2799 534 435 -3627 -3323 1363 3327 -100
2344 -100 -1535 1231 2634 -1146 -3392 -1131 754 -1014 -2511 -1 2208 845 -1047 417 1703
2359 1703 -531 -2855 -1691 501 -468 -2357 -488 2717 1584 -1134 -385 1529 417 -2761 -2950 -30
2375 -30 601 -1469 -911 2169 3184 340 -1730 -566 316 -1734 -2640 -350 1670 1240 -499 603 1884
2392 1884 311 -1029 -442 746 -391 -1755 -783 1045 478 99 1185 2908 1581 -1240 -1516 -387
2408 -387 -700 -1996 -748 2296 3280 1024 16 970 1095 -1257 -1915 -305 1067 520 -147 447 1556
2425 1556 1166 358 864 1112 494 -914 -677 -352 -446 207 1508 2529 2085 911 514 -290 -1265 -1729 -1067
2444 -1067 989 1512 988 1125 1660 1003 -648 -994 151 565 -367 -712 53 930 771 226 836 1760 1101
2463 1101 -316 -1133 -1188 -1119 -981 -271 1114 1649 1897 1254 48 -1056 -1647 -1153 -716 -735 -170 856 1064
2482 1064 759 -278 2 133 -134 -984 -1263 -604 -521 -931 -558 395 1529 1343 328 -681 -792 -1207 -1969
2501 -1969 -1477 -552 644 1224 914 405 -58 -714 -1106 -1316 -1423 -657 -45 447 264 -184 481 596 298
2520 298 -475 -285 -29 -658 -1652 -1396 235 979 841 602 793 726 -1117 -1915 -1952 -855 -158 228 800 1248
2540 1248 1340 259 -696 -877 -660 -337 -79 -413 -423 65 294 578 432 264 491 436 -431 -1426 -1426 -505 26
2561 26 -152 546 2414 2005 78 -810 -947 -761 -1450 -1217 312 1586 1324 351 352 568 21 -688 -753 155
2581 155 -186 -991 -495 301 271 276 1131 1534 129 -1069 -1107 -613 -1259 -1751 -138 2131 1864 193 -337 515
2601 515 -66 -2389 -2319 219 1551 -147 -670 905 1390 206 -1300 54 1066 -217 -1896 -1081 75
2618 75 -329 -994 577 2370 1447 -493 -274 51 -1624 -2947 -1033 1765 1680 -230 609 2266 410
2635 410 -2667 -1946 1041 930 -1360 -1206 1572 1854 -1146 -1518 1438 2498 -250 -1818 -320 489 -1682
2652 -1682 -2350 455 3134 1550 -41 919 1089 -1346 -3008 -1107 1514 661 -806 1169 2874 443
2668 443 -2614 -642 2497 863 -2301 -1189 2040 693 -2410 -1882 2653 3189 -276 -1004 1620 1170
2684 1170 -3077 -3652 -29 2509 1100 46 1789 2669 -937 -3218 -787 1482 -90 -1205 1216
2699 1216 2598 -225 -2460 170 2892 1129 -1666 -300 2120 -660 -3950 -1741 2907 3257 -439
2714 -439 -227 2561 1311 -3717 -4189 628 2293 -363 -1393 1985 2857 -1206 -3144 -29 2547 -173
2730 -173 -2534 -268 1708 -790 -2920 -137 3459 1670 -1407 -139 1616 -1061 -4416 -1901 2940
2745 2940 2133 -1329 -515 3334 1852 -3678 -3287 1503 2311 -2148 -2845 1557 3185 -1378 -3049 1532
2761 1532 3748 -548 -3401 -227 2396 -1726 -4014 227 4132 1409 -1919 836 3330 -740 -4595
2776 -4595 -1627 2844 1126 -2647 -421 4226 1391 -3656 -1734 3672 2484 -2952 -2869 2402 1990 -3549
2792 -3549 -2797 3606 5003 -694 -2795 1326 2121 -3065 -4746 1061 4808 848 -2367 1216 3378
2807 3378 -1184 -4417 -35 4031 461 -3925 -533 3201 -69 -3422 484 5502 2287 -3714 -2091
2822 -2091 2232 329 -4529 -1706 5054 4481 -1915 -2340 2510 2093 -3550 -3862 2157 4243 -1301 -3268
2838 -3268 1263 3241 -1464 -3173 1930 4163 -609 -3994 -915 2003 -1343 -3416 1359 5199 1349
2853 1349 -3109 -1051 2016 -1291 -5017 -1146 4080 2101 -2394 -1428 2976 1106 -3889 -2637 3106
2868 3106 3008 -2736 -3648 953 1779 -2471 -2702 2564 4206 -584 -3322 -911 446 -2317 -3462 1237
2884 1237 4696 1603 -1846 -483 1367 -2128 -3751 -470 3691 1465 -2694 -1220 1957 352 -3037
2899 -3037 -726 3898 2553 -2948 -3375 623 745 -2452 -1787 3536 4762 -70 -2941 -648 463 -2197
2915 -2197 -3185 1107 3871 952 -1742 -416 2067 -685 -2837 -156 2865 873 -2575 -1271 1418
2930 1418 286 -2598 466 4276 2343 -2261 -2406 867 -45 -3333 -1747 3484 3950 -328 -1891 1274
2946 1274 1637 -2169 -3171 1058 3539 417 -2209 410 2351 -401 -2132 682 3220 894 -2463
2961 -2463 -1300 1243 -476 -2228 505 4089 2427 -1538 -876 927 -812 -3465 -1271 2962 2769
2976 2769 -1427 -1178 2155 1469 -2221 -2264 1808 2639 -1397 -2952 373 1563 -689 -1840 1461 3164
2992 3164 -163 -2600 -842 594 -1225 -2599 256 2631 1314 -1198 124 1441 -655 -2541 -994
3007 -994 1572 240 -1823 -306 2067 940 -1963 -801 1850 1401 -1938 -2136 744 782 -1566 -1261
3023 -1261 1564 2525 238 -1186 128 575 -1405 -2127 -35 1556 213 -276 656 1343 -303 -1451
3039 -1451 -183 839 -497 -1208 98 1471 -46 -1113 551 1761 804 -1417 -843 820 58 -1386
3055 -1386 -1117 1248 1600 -125 -359 849 855 -670 -1650 -26 838 144 -467 696 1088 1014 -145 211
3073 211 304 -266 -1026 -317 338 174 -44 716 1146 314 -375 135 655 -62 -1233 -854 555 496 -275 -49
3093 -49 1335 1263 -32 -810 -533 -44 -903 -1064 -243 983 1019 234 305 542 -155 -947 -433 -93 -74 -224 -86
3114 -86 300 70 352 413 635 83 -585 -715 -390 -554 -1032 211 1155 1338 84 -331 79 -216 -900 -1227
3134 -1227 -287 371 128 36 397 710 529 -700 -538 97 69 -466 -641 -532 -109 224 -6 331 288 215 -454
3155 -454 -729 -916 -844 -250 301 350 658 714 400 -187 -1004 -846 -138 242 -443 -185 142 689 360 -393 399
3176 399 589 295 -422 -482 -203 34 -207 -168 445 951 883 323 -284 -602 -720 -751 -405 -188 211 750 383
3197 383 406 -89 15 -102 -331 -607 -348 545 331 -139 -2 510 890 264 -199 -46 170 -601 -1204 -404
3217 -404 377 1104 621 719 596 285 -276 -695 -1028 -424 -17 154 420 211 202 359 270 -95 -483 -270 213
3238 213 -341 -548 -353 505 383 216 -193 792 687 -608 -916 -559 -269 -175 13 387 1233 593 -140 -393
3258 -393 -676 -642 -724 -182 100 172 321 309 248 129 -240 -19 -107 -479 -854 -247 -165 310 -344 196 767 510
3280 510 -253 -553 -179 -185 -754 -669 493 1050 641 -24 183 318 -132 -882 -382 170 36 -160 72 373 277
3301 277 186 292 330 -14 -483 -250 160 -227 -505 -54 901 666 -85 -102 325 -278 -1357 -981 422 1157
3321 1157 215 -340 1230 1108 -141 -1193 83 562 -121 -901 -175 809 53 -609 -11 1199 609 -353
3339 -353 -521 334 -795 -1380 -572 823 450 -62 500 1205 -95 -1624 -1137 686 371 -604 85 1209
3357 1209 1290 -753 -1086 707 1286 -704 -1311 27 941 -937 -1406 203 1514 714 -381 651 1074
3374 1074 -397 -1647 -703 613 220 -37 830 1552 158 -1296 -550 631 -524 -1468 234 1524 678
3391 678 -1419 -822 1214 935 -1113 -720 978 620 -1682 -1811 254 1680 -249 -740 1349 1716 -586
3408 -586 -2129 -780 615 -254 -591 729 1363 -177 -1209 163 1287 -343 -1054 92 1230 -146
3424 -146 -1522 -95 1747 978 -980 295 1459 419 -2008 -1702 883 953 -501 -385 1350 1514 -521
3441 -521 -1822 76 1155 -701 -1154 377 1375 -37 -1116 101 1530 439 -1096 -65 953 -128
3457 -128 -1825 -398 1245 494 -680 533 2031 395 -1613 -1182 690 689 -1205 -197 1936 1863 -619
3474 -619 -1774 681 1667 -315 -1617 298 1339 -876 -2023 -27 1946 752 -823 214 1175 -468
3490 -468 -1930 -526 1013 659 -661 0 1829 503 -1861 -598 1123 459 -1639 -1011 1509 737
3506 737 -1490 -1155 1567 1789 -1165 -1728 377 797 -1589 -2382 651 1959 -32 -1409 827 1619 -504
3523 -504 -2176 -592 1373 -22 -1502 32 1763 182 -1622 -12 1585 531 -2279 -534 1153
3538 1153 267 -2100 -747 1929 1353 -1149 -839 1494 660 -2071 -1752 832 1665 -793 -1225 1052 1892
3555 1892 -901 -1695 237 1558 -453 -1741 -2 1218 -393 -1528 495 1868 691 -1036 167
3570 167 862 -827 -2416 -92 2115 1102 -680 177 1435 -11 -2326 -870 1658 1100 -1159 -822
3586 -822 1187 1184 -1167 -1415 1445 1873 -304 -1566 166 531 -955 -1268 799 2203 304 -812 109
3603 109 744 -733 -1444 -151 1230 299 -825 309 1245 188 -1794 -221 1354 566 -1179 -818 705
3620 705 648 -1421 -825 1821 1422 -581 -626 430 67 -1299 -1520 327 1439 507 -678 432 1044 -686
3638 -686 -1700 -197 1098 302 -705 116 1018 -84 -947 59 1296 615 -747 -648 613 -208 -1570
3655 -1570 -724 1437 1314 -368 -542 556 382 -1373 -1530 515 1455 -363 -569 254 739 -474 -1342
3672 -1342 -268 1147 464 -1019 -334 402 52 -871 237 1193 312 -563 -271 358 -460 -1318 -259 1144
3690 1144 694 -280 -253 980 545 -1159 -1011 722 997 -621 -939 843 1176 -296 -841 321 977 -141
3708 -141 -977 36 703 -420 -834 41 1141 572 -335 339 499 -259 -895 -494 319 373 -216 -29 1145
3727 1145 228 -684 -570 398 265 -803 -477 617 694 -641 -696 610 1160 78 -694 -358 279 -439 -1208
3746 -1208 -215 730 555 -297 189 744 -216 -809 -267 115 35 -594 179 426 213 -146 335 537 -235 -538
3766 -538 -382 280 -108 -486 -230 544 502 -128 -200 687 285 -585 -858 -168 196 -146 -472 356 582 365 -247
3787 -247 -272 -165 -254 -548 -344 -55 104 377 103 224 -139 -223 -196 -62 -261 -450 -81 256 167 -23 -96 826
3809 826 152 -331 -606 -24 -104 -423 -429 136 662 364 -106 29 322 -66 -553 -461 -60 105 -104 -32 326 399
3831 399 349 85 86 -256 -315 -287 58 -137 -94 34 356 480 183 427 -11 39 -620 -447 80 502 82 165 356
3854 356 205 11 -557 -313 59 -180 -293 -182 302 467 132 -95 253 37 -123 -234 -208 -294 -77 84 307
3875 307 249 437 74 259 -321 -293 -335 -175 148 -228 36 607 244 20 -18 -109 104 56 -297 -12 37 218
3897 218 -326 -111 201 418 -136 -81 33 45 -252 -446 -38 70 79 65 158 -116 269 15 -193 -528 -552 44
3919 44 172 334 -79 -21 246 317 -124 -249 106 103 -302 -326 297 405 331 249 156 286 351 -448 -499 -225 -185 -13
3943 -13 190 389 255 106 177 -152 -106 -405 -2 127 -67 -211 242 491 144 -40 215 431 125 -273 -307
3964 -307 -81 132 16 97 601 516 163 -175 51 -207 -246 -564 -256 196 279 105 65 18 -91 -24 -149 -300
3986 -300 38 -143 210 378 23 -154 226 225 215 -437 -331 135 -132 -549 -20 327 451 202 -115 54 320
4007 320 -350 -554 -169 44 35 66 364 565 225 -111 -7 -138 304 -126 -473 -8 -112 -220 134 274 345
4028 345 -256 -40 252 -315 -751 -309 284 170 -144 3 610 291 -369 -690 -255 -21 -150 -486 35 267
4048 267 203 -207 33 600 -109 -383 10 284 77 -447 -78 278 -31 2 89 681 116 -640 -567 100 -231
4069 -231 -313 33 701 545 -735 -384 449 389 -658 -673 682 734 -395 -360 94 861 -23 -433 282 483
4089 483 -43 -958 -350 10 221 -257 445 837 212 -669 -333 257 -240 -285 94 755 356 -417 -56 690
4109 690 28 -505 -334 834 239 -899 -482 286 589 30 -369 634 557 -666 -959 -74 603 -228 -722
4128 -722 240 833 53 -634 188 94 -439 -637 -198 487 -9 -535 11 455 90 -568 -123 637 327 -662
4148 -662 -741 322 438 -598 -487 794 558 -617 -934 -75 507 -374 -360 304 867 -8 -824 133 444
4167 444 358 -802 397 349 -157 -409 -107 135 193 -235 356 881 178 -668 -822 94 180 -525 -118 860 458
4188 458 -611 -826 314 618 -464 -543 304 659 -498 -577 228 671 -301 -414 71 406 -408 -743 -295
4207 -295 583 157 -137 -110 764 13 -616 -296 196 254 -732 -22 643 409 -514 -256 990 693 -391 -500
4227 -500 378 342 -469 -803 585 787 -157 -718 287 752 -274 -1008 -356 760 -83 -854 160 762 241
4246 241 -719 -445 608 50 -645 40 468 54 -688 -231 888 739 -302 -186 667 426 -1084 -880 740
4265 740 439 -494 -598 657 719 -397 -1284 -2 595 -147 -716 241 596 -213 -623 313 692 56 -800
4284 -800 34 451 -351 -877 -118 630 384 -475 -57 446 -32 -932 -539 691 220 -388 -183 633 269 -267
4304 -267 -340 442 501 -772 -470 451 393 -707 -529 574 763 2 -115 93 206 -396 -721 -59 296 135
4324 135 -314 -50 446 -235 -631 -17 127 -195 -267 -19 223 173 -311 -36 117 406 -592 -8 370 380 -613
4345 -613 -518 343 594 115 41 92 418 -200 -730 -241 256 139 -563 40 426 167 -285 -160 390 -41 -67
4366 -67 -20 110 23 -309 316 588 553 156 8 426 -89 -331 -281 321 422 -330 -159 172 448 -171 -487 -93
4388 -93 252 -227 -219 -216 323 264 -246 -135 414 247 -211 -158 299 12 -373 -349 341 3 -167 237 218 -145 -233
4411 -233 -419 298 358 -338 -179 482 481 -42 -473 194 365 -74 -598 -112 236 24 -198 -75 456 308 -386
4432 -386 -49 302 -172 -199 -441 380 171 -60 302 89 212 -532 -368 -24 96 -369 59 215 190 -162 -243
4453 -243 452 315 -274 -216 176 75 -229 -625 144 442 -202 -68 -10 604 -33 -313 31 208 -144 -85 -37
4474 -37 420 255 252 -31 1 -275 -361 -185 164 -207 -102 47 96 41 -316 73 -66 142 -356 -207 39 280
4496 280 12 -295 481 280 -23 -139 -209 112 -66 -286 -106 164 -368 127 28 207 -179 -149 -152 -178 -280 -25
4518 -25 -253 86 220 0 492 168 107 -272 -143 245 -257 -243 -267 39 77 -230 -167 62 214 105 -193 -506
4540 -506 121 257 -126 -34 72 234 -112 -174 -116 96 -146 -275 -23 -116 -140 165 301 7 87 -48 60 -333
4562 -333 7 -212 73 391 -76 310 368 288 -53 -138 -285 60 -122 -383 -155 -39 334 -91 -287 -156 318
4583 318 178 -276 -225 -202 -28 -9 68 -162 -78 166 230 -14 -177 -56 -171 -239 -100 231 145 105 115 -40 -8 99
4607 99 -381 -201 84 198 101 171 -99 537 447 -143 -287 299 -104 -291 -316 19 234 278 93 -112 274 -46
4629 -46 -229 143 -209 -141 41 319 73 209 7 -96 -188 -141 131 12 168 80 -316 50 -68 66 -44 -73
4651 -73 161 123 -48 154 -123 -18 20 12 181 267 205 117 -47 -273 -171 -84 77 -1 -81 122 156 -77 194 83
4675 83 121 -371 -145 -47 79 -254 -413 -77 324 153 74 -305 196 203 -219 -338 46 240 -105 -172 99 182 50
4698 50 23 -168 384 -58 -74 -65 194 85 328 -42 219 -21 -8 -25 111 47 -54 118 200 -72 -4 -3 -117 109
4722 109 -283 -121 -108 217 -148 -100 57 324 4 -85 117 117 -54 -109 -40 16 458 -113 68 -36 -43 34 -63 -265
4746 -265 182 -415 -122 -80 295 313 -77 348 -95 84 -85 107 308 -399 -86 293 95 -185 -257 163 201
4767 201 40 -446 -43 72 318 -166 -225 150 311 -34 -51 114 140 -183 -64 -190 3 -80 15 94 466 -260
4789 -260 -373 117 -53 -252 -324 -268 247 30 -281 239 121 105 -85 -264 273 8 -541 -137 98 191 -182
4810 -182 194 332 128 -269 -227 352 159 -506 1 367 215 -237 66 334 8 -618 -419 397 -35 -44 -259
4831 -259 366 261 -388 -305 161 481 -90 -324 112 172 185 -205 59 499 7 -314 26 236 -314 -233 61
4852 61 324 147 -367 115 416 -118 -334 -254 140 114 -410 -47 95 -92 -96 42 339 387 -466 -466 -70 496 -257
4875 -257 -206 423 380 165 -655 -27 60 288 -72 -50 211 123 -136 233 545 201 -98 73 169 247 -20 -226
4897 -226 213 215 -39 -151 175 472 -208 -273 8 240 -120 -238 368 206 -70 -48 231 52 258 -268 -342 138
4919 138 221 -168 -40 39 140 -237 -308 97 173 -110 -450 254 196 -99 -141 230 362 160 -119 154 219 -387
4941 -387 -306 159 431 -83 -255 365 376 169 -174 200 455 46 -378 -275 151 390 -522 -342 447 247 -267
4962 -267 -251 476 171 -681 -183 -127 215 -215 -283 305 41 -137 50 503 255 -423 -156 197 199 -50 -236 -108
4984 -108 376 -244 -566 -230 334 126 -206 -59 558 122 33 -41 351 293 -325 -304 347 157 -459 63 129 240
5006 240 -224 77 337 -106 -72 -61 -254 37 -91 -7 31 296 -103 -264 -106 187 157 -106 114 40 187 -176
5028 -176 -152 118 61 -34 27 398 -21 -239 32 67 344 50 230 102 149 -238 -291 112 160 -170 233 157 171
5051 171 10 -15 240 137 -132 -67 269 327 -201 -119 249 370 -16 -195 85 108 58 -315 -63 11 247 286 126
5074 126 263 349 -262 -80 -9 -48 25 94 -88 -170 -87 114 87 -44 120 -73 -15 -21 -36 178 -179 44 -26 -24 227
5099 227 381 -109 -294 -129 53 54 -501 -143 93 234 -114 9 165 446 -49 -7 53 96 -4 -15 42 2 119
5122 119 127 -1 368 -215 -209 -297 21 225 12 -29 261 285 -148 219 128 241 -256 -126 44 -76 -89 -92 393 -24
5146 -24 -163 40 -172 138 -144 -140 118 250 -31 68 -77 100 37 -270 -250 188 72 -456 157 -76 9 -145
5168 -145 -19 51 47 33 127 398 -119 -79 223 385 -232 -321 -46 263 118 -54 75 -82 143 37 -153 145
5190 145 134 31 -175 -135 4 282 -95 -140 94 -48 119 -87 -73 90 -298 286 337 177 -450 45 -25 -130
5212 -130 163 82 25 -170 -21 24 3 -7 55 -79 -137 230 204 -18 170 191 -213 108 -339 193 152 254 -100
5235 -100 127 110 -128 -30 114 -179 -1 112 -19 -150 102 169 47 -149 -10 -18 229 402 -318 -219 20 -239
5257 -239 -89 20 110 -28 123 -191 -420 -63 16 -220 -272 239 110 185 -32 58 30 31 -129 -233 -19 226 114
5280 114 211 -89 134 -44 -45 -41 -284 52 19 -140 -264 172 -13 82 145 -275 106 209 -55 97 -323 123 -35
5303 -35 -197 52 91 294 -146 -57 -11 -16 161 -76 62 124 -314 143 105 347 -24 -6 135 -46 13 -294 -82
5326 -82 43 19 -382 -28 -10 -332 -169 314 -210 15 -286 255 58 -142 -56 22 76 40 99 -124 98 123 260
5349 260 -196 143 -38 137 0 -48 -170 -138 -165 -185 -38 -127 227 161 -37 -23 61 137 -155 -16 -430 -28 42
5372 42 114 -98 33 -26 65 -50 -50 92 -245 130 -221 183 113 -30 -259 256 153 -255 82 -48 -123 -29 198
5395 198 61 -90 -452 127 143 112 -135 186 132 15 -64 -427 58 18 36 202 213 153 55 -178 40 142 197
5418 197 -201 151 -57 253 -195 378 40 -66 86 -4 135 75 -56 -85 26 -63 16 273 71 199 89 -34
5440 -34 82 164 -25 26 208 164 -80 -100 -81 147 40 -302 3 184 89 -228 -78 117 -24 68 -53 147 21
5463 21 -297 -57 -55 118 132 -79 329 -10 83 110 293 259 -146 -10 228 279 292 110 266 82 -575 -90 -123
5486 -123 107 118 -456 334 88 -36 -407 38 320 -8 -427 -23 -10 -181 -301 286 244 165 103 141 353 48
5508 48 -194 -110 192 -36 -176 -8 87 189 84 189 105 100 -171 -265 198 -21 -37 53 222 88 -235 45 126
5531 126 30 -121 -52 -40 105 116 108 347 256 -329 -29 -155 133 320 -58 223 481 204 -129 64 33 104 -436
5554 -436 -212 190 -68 -186 -114 62 208 -203 -185 122 177 -414 -117 178 174 211 95 175 -18 -29 -112 42 79
5577 79 -24 52 116 81 217 -107 154 252 335 -254 193 478 -18 -154 -23 -65 -172 19 296 -85 -163 -636 -468
5600 -468 57 94 73 -218 191 -36 241 -116 -69 -14 -409 -225 160 -53 57 -128 217 214 -152 -263 -76 324
5622 324 28 -351 -374 9 -96 -122 186 548 187 -274 -38 72 10 -234 -28 295 355 -239 -164 64 465 117
5644 117 91 46 332 -184 -63 215 112 108 -159 -132 181 -34 -158 -291 179 184 -22 -82 261 41 -127 -112 11
5667 11 -50 -203 -27 163 5 -165 -244 273 85 -268 -54 114 224 -380 -133 -141 156 -91 22 431 189 -40
5689 -40 25 39 108 -143 -255 87 137 271 63 259 108 -63 -349 -172 23 -75 -189 49 243 211 138 -77 213
5712 213 15 -209 -14 86 -78 33 -345 228 286 -136 -16 304 71 -129 -116 172 -129 66 -362 -73 236
5733 236 11 -267 173 56 -194 -206 -415 -6 100 92 -266 210 223 12 -68 259 194 -256 -247 -220 398 -14 58
5756 58 174 -24 -28 -328 -159 26 39 -262 76 84 -166 -338 -122 124 117 16 -88 64 -4 81 -80 191 245 -126
5780 -126 154 82 -191 110 -284 127 -83 36 -57 136 221 -227 -262 -39 140 25 22 -286 403 -245 -37 -247
5802 -247 321 158 356 205 71 179 -137 -80 30 190 -168 208 123 97 13 -245 62 19 48 -319 -33 47
5824 47 -53 -137 -29 145 104 -226 -292 342 72 18 142 8 190 -7 -169 -63 158 -236 -3 -9 73 -162 -118
5847 -118 -57 -25 -24 -39 86 -32 -126 -128 242 67 43 139 137 11 171 -152 119 321 -186 92 76 -83 -71 167 -157
5872 -157 -187 -149 -38 -383 54 -68 4 -146 -129 -62 -118 156 30 -9 -21 -7 -55 89 -21 84 -127 8 -193
5895 -193 -5 226 108 271 -89 23 121 -300 227 127 -7 314 -12 -4 37 -35 -295 -96 162 123 -153 -48
5917 -48 -122 101 -126 98 -155 178 211 -460 104 202 71 -79 131 -30 19 -284 102 22 -335 -189 -127 20
5939 20 152 -67 171 57 178 -60 -91 70 145 135 182 34 70 -243 -70 103 -162 -132 47 -111 93 127 312
5962 312 -8 130 -192 105 -187 -117 -68 -60 -69 166 74 75 -74 380 210 -68 -49 83 78 -147 -13 -57 136 65 111
5987 111 -81 -65 406 72 -245 18 -132 -223 -91 -53 179 76 82 368 -92 -251 -184 -139 -5 -31 68 243 123
6010 123 128 169 85 141 17 90 118 185 154 98 -21 293 32 -42 -267 114 157 78 54 2 8 88 -92 217 225 295 -130
6037 -130 -16 -249 -123 13 -115 -13 42 89 -27 -102 -320 302 -85 178 -329 -27 -19 280 -157 -52 -60 99
6059 99 -45 -35 -92 59 -188 186 230 135 266 75 220 -63 -186 8 -44 169 -182 -2 222 161 -38 -269
6081 -269 146 151 -21 115 28 15 -75 221 -38 -6 146 31 54 38 -65 -130 -163 93 -213 -104 139 79 280 97
6105 97 81 -274 -92 53 -150 26 -115 -169 -258 -223 165 -245 88 97 -179 -92 -130 191 198 319 74 210 175 14
6129 14 -159 223 192 64 -208 137 242 190 150 -165 -115 75 -219 -15 106 -74 101 -173 150 252 -116 -47
6151 -47 78 192 -219 249 -224 112 -43 -3 25 47 81 38 258 -33 -16 -214 103 -15 -36 -114 182 364 223
6174 223 -97 -5 120 -58 -488 -55 150 190 3 -181 208 394 -113 -282 -114 151 -26 -590 270 184 116
6195 116 88 -42 362 -360 -505 31 150 -158 -332 94 396 -115 -48 -59 -48 -123 -95 53 318 219 -121 -102 112
6218 112 -3 121 105 -117 -164 -172 44 218 -83 -4 -192 131 31 -249 13 161 42 -92 -437 227 -27 -64
6240 -64 -330 0 259 -181 -125 47 169 420 -43 -137 317 71 -56 140 150 92 -445 -192 479 145 1 24
6262 24 -58 -309 -349 -298 443 179 -346 -108 190 -68 -104 -229 -69 -68 -304 8 232 333 -181 -37 133 328
6284 328 46 -26 79 113 -145 -71 -38 -72 172 -300 -34 437 63 -24 94 85 454 -5 -27 114 -28 -107 -140 517
6308 517 -83 -21 -93 99 280 -226 -581 -97 173 75 -402 65 256 -18 -220 38 -14 70 -614 -189 111 132
6330 132 -163 69 308 221 -470 80 420 -185 -190 -151 300 56 -277 -403 139 -3 -208 -261 -136 247 -287 -357
6352 -357 53 132 -69 -106 153 464 39 -337 360 -4 72 -572 30 190 -103 131 -135 246 25 -343 -149
6373 -149 216 182 -232 -4 270 125 -142 -15 121 19 -129 -399 231 197 -218 -35 177 268 -159 -124 175
6394 175 247 -168 -263 -109 210 144 -74 293 220 -88 -298 -336 -64 -26 -60 2 -37 181 9 129 79 198 -382
6417 -382 -232 396 255 -203 -110 117 259 -106 27 3 203 -220 -252 -50 228 160 -132 276 386 287 -13 -47
6439 -47 80 -232 45 21 33 215 -270 179 14 40 127 -190 177 177 1 -232 -132 186 -122 -193 69 17 -2
6462 -2 88 -23 131 -34 -68 50 233 -173 -82 437 125 173 -276 37 146 -87 -36 137 207 131 171 101 -52 -37
6486 -37 -207 -170 221 -256 -220 20 131 63 -398 36 109 41 -357 -110 135 44 -121 -48 58 172 127 -6 -173
6509 -173 -313 -35 -73 -140 -124 100 21 -49 234 146 167 -254 20 31 -140 55 -55 102 -141 156 25 172 139
6532 139 -182 -267 -39 148 -169 142 -72 197 -97 176 -50 33 -165 83 223 143 -176 -26 252 -101 44
6553 44 -183 319 249 -178 265 319 55 14 -120 233 207 245 -43 -65 6 -145 -136 -128 397 66 -140 238 97 312
6577 312 46 45 -158 -21 -297 -54 408 -196 -133 16 -230 22 -77 7 -105 -24 -5 -65 97 44 119 -116 -28 110
6601 110 75 -126 62 -150 -81 89 455 119 54 218 -236 -211 -242 -58 270 20 -17 -67 212 188 30 -204 206
6624 206 67 253 -184 -198 138 -221 119 -300 68 -21 -214 -3 138 -122 17 142 232 203 -41 193 -10
6645 -10 -148 -15 89 272 -68 255 -31 -133 115 156 176 27 128 179 -8 60 83 -45 26 96 157 -134 286
6668 286 54 85 26 -131 -38 -41 48 31 150 289 98 -192 200 103 28 -40 -114 -72 122 186 -140 -208 -82 55 -492
6693 -492 189 -71 29 265 -20 -125 273 115 4 207 67 -363 99 -212 15 7 -37 28 131 25 -106
6714 -106 -36 150 -244 -331 79 61 -188 -127 316 -43 -140 234 238 179 -159 -6 282 123 -207 1 -179 208 81
6737 81 -69 -47 -106 139 -120 -38 67 -21 -115 -41 240 100 -149 -50 -100 167 43 25 -66 209 -12 -241 92 329
6761 329 167 -281 -14 -154 -313 -400 -253 100 406 74 -43 -51 141 101 57 -134 -31 37 66 18 106 -132 14
6784 14 201 -10 -224 -131 46 -50 -70 87 33 91 126 -123 -150 -71 112 44 77 236 -267 -66 -77 193 -392 -314
6808 -314 304 63 39 -421 -89 124 17 -338 36 27 -134 -223 15 215 258 56 -252 187 258 -100 166 -185
6830 -185 254 -167 -217 211 -58 28 117 64 79 214 -2 97 -3 -48 -298 129 134 -470 -51 106 142 -15 73 -2
6854 -2 87 181 28 -42 52 155 -72 -387 98 -222 -168 -276 316 47 -251 -35 78 47 -264 41 -5 415 -509
6877 -509 -97 -51 451 -303 -268 99 136 -7 -52 64 472 -26 -178 176 -66 217 -175 -120 20 255 -180 364
6899 364 -89 -77 -33 -116 300 197 -145 -146 147 130 7 -23 -111 -147 -179 -202 124 57 23 -247 117 81 127 -210 -11
6924 -11 -8 -291 -335 -137 184 -20 -201 24 190 -221 -391 76 107 93 -216 55 -235 88 208 -102 46 286
6946 286 -268 -35 110 -131 2 127 355 158 178 -158 378 167 -285 -75 225 306 -224 -113 67 430 120
6967 120 -137 60 -113 145 -212 -160 -81 5 -172 -45 209 343 -248 31 137 17 -310 -150 -42 -106 53
6988 53 -380 38 234 -87 -219 -80 482 -25 -186 -173 330 219 77 206 164 120 -220 211 31 -419 -134
7009 -134 -57 260 72 -47 -103 -19 10 -230 -206 -59 -80 -302 85 410 604 -352 -75 253 -30 1 -356 203
7031 203 153 -80 -105 314 328 -270 -561 182 377 104 -365 -44 46 249 -281 -116 305 -105 -173 -155 114 -64
7053 -64 -125 -341 296 130 106 38 31 107 99 -314 158 83 -178 -93 213 226 40 -37 9 -33 -17 48 -76 349 111 -103
7079 -103 -232 178 -64 -145 -30 289 -83 -195 -229 392 443 -42 25 456 -62 -18 -6 -103 447 -102 -245 -11
7101 -11 34 -66 60 27 223 -161 -402 48 -102 -310 -161 -209 202 -20 -175 100 453 -171 -124 -214 82 290
7123 290 -460 -204 400 221 12 -94 266 44 -361 -52 308 -71 27 -115 46 238 -6 52 153 348 -170
7144 -170 -48 67 100 121 133 380 499 174 -367 -100 121 65 -77 152 -29 -46 -167 -2 402 220 -274 159
7166 159 53 30 -219 -230 174 -66 -89 -390 35 -74 -57 -296 47 -82 -171 6 7 139 -62 176 125 244 46
7189 46 -18 137 29 18 41 53 147 291 -85 -515 -382 -102 -215 -256 33 -55 -212 -330 175 318 -138 2 95
7212 95 -98 -226 -107 -333 11 54 105 -78 18 202 112 -361 -161 199 -24 -91 8 266 185 65 452 86 -354
7235 -354 73 31 134 -20 127 87 -154 217 107 44 69 -257 45 150 133 69 24 95 169 229 130 93 -260 45
7259 45 -224 -138 134 1 -53 350 -143 304 -119 -153 -355 71 -4 -62 -60 204 -87 98 -57 -141 -37 95 -169
7282 -169 120 0 -364 -157 -11 -117 84 3 -144 146 -65 -107 -32 5 -38 69 31 26 250 228 116 81 61 43
7306 43 -34 131 99 -51 260 101 47 -84 29 -9 -226 50 48 238 64 166 -28 60 -59 -126 -103 -91 -164 108
7330 108 -106 12 -139 -207 130 -110 129 -255 69 -88 290 -217 -165 11 173 -152 -85 128 -101 -216 -74
7351 -74 153 155 -190 -139 172 141 41 93 74 -156 2 -35 -11 198 -155 224 -69 71 264 -44 252 30 -45
7374 -45 -387 -146 222 -78 -351 86 16 221 -97 -163 -40 -67 -24 -108 217 91 27 -95 -142 -160 -389 -6 13
7397 13 -194 84 15 -160 116 332 -128 -146 -13 219 -18 -72 188 -130 -301 -81 55 -276 -14 -105 60 -42
7419 -42 44 -151 73 -21 15 -38 218 267 -431 4 -45 93 -123 -121 -214 -208 -30 124 396 -105 104 -112 -208 101
7443 101 -88 -196 -112 1 -421 229 70 53 -288 -503 149 -77 -90 56 108 -69 119 -261 -180 -129 188 207
7465 207 -88 -116 -13 147 -57 -39 -160 4 8 -43 30 -254 -115 -107 486 -287 -26 21 -61 79 -135 -7 40 66
7489 66 -73 -25 -204 -82 -272 -37 381 25 -46 71 -18 100 -140 -191 15 -38 -136 22 314 -3 -378 -50
7511 -50 18 59 -46 -112 -142 30 194 74 -273 299 -224 -329 90 -106 111 -299 -264 -23 -121 -159 -22 47 -189
7534 -189 -236 84 103 44 -158 -108 324 163 -233 209 -230 48 -79 -86 16 -149 -229 -24 157 255 154 -12 231
7557 231 410 117 -69 31 188 123 47 392 185 -6 159 -126 176 -56 -154 -246 -103 -52 -14 -81 -52 -74 -165
7580 -165 244 -116 84 171 -111 341 -97 -236 -358 101 255 32 -211 -188 234 25 -184 96 250 -135 -184
7601 -184 184 305 -60 -173 -241 -5 65 27 180 159 -127 -297 42 145 -52 -3 -138 -179 -96 251 144 90 -211
7624 -211 66 -407 110 127 -211 -227 -243 169 -267 -396 232 240 -107 -38 222 282 24 -235 141 185 -247 -90 -99
7647 -99 464 81 -18 -98 -92 -38 -88 -23 324 78 66 94 235 98 -74 -119 217 150 -83 -13 117 84 -101 -72 66
7672 66 53 -31 -203 -39 206 -92 -365 -31 310 218 -64 -21 88 -425 -118 -137 197 67 -79 137 279 170
7694 170 -379 -265 -108 22 -168 -82 368 75 -66 -346 243 116 -94 -170 -61 318 211 -120 246 140 -183
7715 -183 -42 302 160 -64 -406 -56 179 165 -324 180 138 -84 -16 -96 435 78 -92 201 116 3 -104 -302
7737 -302 129 54 -288 107 205 165 -137 71 171 246 286 -322 8 324 -224 118 96 190 -14 -304 -52 226
7759 226 168 63 199 559 -21 190 -79 283 -105 -666 89 17 187 -116 -34 213 264 -44 101 364 -103
7780 -103 115 -169 285 -142 16 -48 -292 202 -47 -17 21 59 32 -327 109 153 -58 -94 -127 212 47 -198 -49
7803 -49 153 31 -227 154 21 -128 -147 94 17 -136 -372 -272 35 109 -42 -35 486 -20 -134 -207 -62 2 42
7826 42 83 46 166 -120 190 79 68 166 -297 -76 182 73 -32 -56 241 119 -87 -97 278 252 -172 -232 167
7849 167 67 34 -268 91 164 -448 -154 210 12 -355 -122 21 -112 -148 106 149 135 4 -108 181 22 -153
7871 -153 -71 -11 315 138 -355 -269 176 -143 -47 -187 -3 -74 -267 155 203 -58 79 -88 99 123 -243 -286 110
7894 110 -42 76 -62 20 290 -146 -56 147 65 -92 -193 -256 352 -33 -12 -17 253 48 -268 -251 20 -30 -151
7917 -151 -308 -173 128 -3 131 203 240 -122 -365 130 -104 -172 -128 -54 -36 -35 68 -67 120 38 15 131 -62
7940 -62 -281 -331 -244 236 -195 -132 -10 213 -126 34 -62 340 -113 82 -25 7 89 -73 26 9 76 -157 23
7963 23 -142 24 0 -217 -105 7 -262 -26 -70 35 -162 -283 -35 162 -108 100 313 86 -49 -168 -100
7984 -100 73 65 -13 -242 125 -72 -3 -40 104 197 -85 -143 34 -70 96 -121 115 121 85 77 16 -28 -126 -94 3 -148
8010 -148 20 70 130 -39 -57 218 244 -14 112 -287 -251 166 148 228 228 -9 378 -223 220 35 57 -38 -88 -9
8034 -9 -82 -125 104 -150 -89 30 -305 -35 -3 174 -210 82 -134 -356 -109 165 39 64 -228 126 -3 -43 -197
8057 -197 20 -120 106 -85 -182 194 128 24 -100 84 -154 226 -104 145 -175 185 -61 -135 231 123 -88
8078 -88 66 28 -58 110 -145 -56 52 -4 179 -251 54 97 -418 -123 265 29 -164 218 -162 -508 21 60
8100 60 -385 46 184 -192 -187 13 3 278 116 -100 -150 -34 180 -229 -208 -17 84 276 -69 22 75 -161 1
8123 1 -20 -233 94 -235 102 90 78 -138 -18 -151 -236 -51 -307 301 154 241 93 -117 338 87 181 35 -14
8146 -14 119 -166 -179 175 271 -23 40 105 82 -67 186 432 -40 -66 -135 -16 116 -103 84 18 9 -214 127 -85
8170 -85 -288 -114 -127 95 102 -365 224 88 -95 -184 -216 10 -28 182 40 75 -19 -158 -236 -136 162
8191A62
$$ Imaginary data points
##PAGE= N=2
##DATA TABLE= (X++(I..I)), XYDATA
0 0 0 0 0 -8 8 -8 8 -16 24 -27 32 -48 56 -67 80 -104 120 -144 168 -200 236 -274 316 -366 420 -482 547
27 547 -625 706 -798 899 -1011 1132 -1264 1411 -1573 1750 -1943 2155 -2389 2647 -2929 3243
43 3243 -3592 3980 -4414 4907 -5466 6111 -6860 7749 -8816 10126 -11785 13964 -16959
56 -16959 21359 -28483 41970 -76567 349952 632122 -120054 -129890 184609 155261 -220275
67 -220275 -53254 348119 288589 -148913 -157374 124000 121947 -127491 -46750 215628 175310
78 175310 -104051 -107612 95017 97592 -90518 -64005 148435 191197 12218 -50520 61190
89 61190 75168 -89181 -129305 71035 222981 108431 -44459 956 84700 -14798 -119903
100 -119903 8341 187740 115337 -73864 -62110 69623 36997 -75464 -313 153542 97684
111 97684 -70643 -59490 55606 13085 -98980 -30122 116719 83447 -36684 -2124 86502
122 86502 2574 -136517 -81162 74280 79312 -13711 -1235 65348 9245 -101994 -77053 48050
134 48050 89087 24654 -22207 -20066 -33082 -61069 -42429 24095 73443 62742 5958 -47826
146 -47826 -62333 -45616 -28504 -12544 18204 41662 20990 -22553 -34489 -21097 -22988 -29346
158 -29346 -4879 20356 -668 -35890 -28600 -5133 -18944 -35616 4158 51996 23441 -46851
170 -46851 -59573 -19192 -14433 -44948 -23105 50325 64759 -10438 -64286 -28371 12036 -19460
182 -19460 -51597 -6982 44544 9146 -53354 -32510 29745 20822 -33140 -23843 24728 6194
194 6194 -53945 -44317 14962 11501 -34509 -11520 52029 31728 -46434 -45481 15591 1217 -65720
207 -65720 -39272 58448 58930 -35413 -51759 28158 39741 -43902 -58987 29858 57045 -31464
219 -31464 -74243 1379 53626 1915 -34218 20963 53332 -13199 -68037 -25251 23553 -4333
231 -4333 -29621 17375 51997 3113 -43160 -8929 28559 -10422 -47988 -2501 43493 283
243 283 -53605 -14370 48739 23150 -35374 -12266 44369 14864 -60466 -51580 21940 34457 -14219
256 -14219 -13819 38323 37005 -25369 -45694 -1670 18258 -12250 -19867 14769 21997 -12173 -19499
269 -19499 13462 22074 -8144 -14319 12588 9597 -30625 -35306 8673 28268 -1020 -11533 23511
282 23511 34821 -11035 -44249 -17562 14552 201 -19881 3215 34500 19870 -15537 -16539
294 -16539 6807 9019 -7889 -9923 3999 4678 -6718 -7656 3794 11091 11473 14495 11479 -5083
308 -5083 -19168 -14484 -3555 -3566 -2590 15039 30333 18571 -7296 -13647 -2060 -230 -11943 -10889
322 -10889 8376 19768 8065 -6755 -2489 11349 12269 1143 -4929 355 2675 -5817 -14422 -7072
336 -7072 11855 22692 16569 5873 3132 2850 -7319 -19289 -15972 1613 15363 14123 7901 7054
350 7054 8718 3036 -6992 -10981 -4435 4110 4767 -1846 -4826 2438 11264 9383 1357 950 8405
365 8405 5596 -11287 -21554 -9851 7651 9994 3685 7883 18894 13687 -8112 -20485 -12151
378 -12151 -128 -144 -3019 4100 14334 13443 1670 -6037 -3343 2062 1388 -3971 -7764 -4209 1921
393 1921 2827 -568 1618 12091 16429 5193 -10705 -13523 -6028 -4336 -9304 -4240 13578 23254
407 23254 12452 -3281 -5970 -1380 -4549 -11892 -9742 3315 11744 7706 -120 -214 5292 7171 1279
422 1279 -4657 -3862 489 -789 -8116 -9278 2811 16011 15509 5180 387 4090 -364 -14544 -19752
437 -19752 -5199 12128 13711 5525 5453 11525 6746 -7629 -14059 -5424 3807 2812 -2093 -844 4956
452 4956 7420 4721 1768 2173 4868 3350 -4947 -13415 -12012 -1050 7280 5871 5181 12158 15159
467 15159 2053 -16274 -18394 -5321 1477 -3450 -2434 11150 18291 6118 -9885 -8448 1702
480 1702 1531 -7703 -8845 432 4652 -1857 -6375 675 9557 9496 2474 -3981 -7900 -10476 -11862 -9538
496 -9538 -3706 5079 14035 15079 4532 -8502 -11621 -7347 -8539 -12804 -6534 9242 13975 27
510 27 -10815 -2432 8404 942 -11787 -7455 5378 1633 -15883 -17952 2026 14662 7212 -461
524 -461 5015 7421 -7916 -23097 -17754 -2579 3047 3495 8913 12682 4011 -7530 -8207 -5399 -8900
539 -8900 -8368 3741 9892 -2067 -12162 -852 12907 4246 -9079 1341 16794 1650 -26672
552 -26672 -23052 6142 14072 -2684 -1370 23247 23864 -10142 -29379 -9959 7392 -3949 -10817
565 -10817 9368 23604 4668 -14588 -3806 11248 1699 -9305 2712 11938 -7519 -22637
577 -22637 -3565 18109 8257 -5137 11973 26216 -2092 -35284 -19608 15204 8743 -16534
589 -16534 -1007 34477 21994 -22888 -24873 13875 18983 -16247 -22350 13233 22236 -13125 -24712
602 -24712 10025 28922 2220 -15441 6597 15108 -16470 -32925 -2366 21150 1947 -10571
614 -10571 16380 28946 -7649 -34592 -7116 19560 -4762 -28554 2223 34584 6358 -32818
626 -32818 -11394 30718 15023 -25787 -16038 22413 10232 -34991 -30091 19371 30360 -3916
638 -3916 -10748 19357 16885 -26750 -38843 -877 19587 -2363 -8789 18704 23062 -15311 -30970
651 -30970 3004 23511 -2733 -18622 7529 19633 -17478 -39147 478 39831 18932 -14068
663 -14068 616 22107 -9685 -49394 -25074 30020 32353 -3267 -4116 23188 11405 -31295 -31605
676 -31605 13503 29849 391 -13084 9019 12492 -16386 -21864 15593 36079 10133 -11335
688 -11335 1992 6547 -22559 -32350 7742 41026 21980 -4763 7688 21097 -10348 -41920
700 -41920 -14814 32203 27019 -7805 -3854 25914 13633 -28283 -24014 24005 37818 544 -17353
713 -17353 7114 13260 -20189 -29242 14610 46746 22700 -5775 3467 8709 -22791 -41032 -2519
726 -2519 39000 27948 996 10389 21621 -12417 -44887 -13969 36163 28146 -10073 -5149 21843
739 21843 844 -41892 -22466 40235 48905 -1496 -20498 7866 3847 -41996 -41514 24085 58703
752 58703 19804 -14459 3777 10834 -31550 -49116 2156 45239 19537 -15200 1182 16899
764 16899 -17976 -42665 -559 44756 20186 -23700 -10996 14429 -14786 -49045 -10717 50014
776 50014 38135 -16012 -17170 16033 -4126 -53954 -37918 30822 44844 -3539 -18872 15889
788 15889 14673 -36012 -44998 10192 37396 471 -23274 4076 14664 -24081 -39062 7137
800 7137 40185 10617 -19053 -753 10204 -28304 -50121 -4759 41496 22422 -12035 2930
812 2930 21824 -15262 -55691 -25136 30912 26647 -13141 -8665 22286 5556 -39771 -29989 23688
825 23688 34556 -5326 -19622 5017 3841 -30635 -30191 16785 39640 11116 -10006 3272 2057
838 2057 -29693 -36802 3422 31661 12104 -7092 8654 15547 -15352 -34427 -3533 28124 10750
851 10750 -17628 -5576 15751 -1126 -26771 -8463 29640 25790 -8443 -15338 5201 1725 -23607
864 -23607 -20632 15129 29407 7593 -6534 5754 8032 -14306 -23051 -582 16599 4154 -6467
877 -6467 5854 13191 -4144 -15850 2385 18528 4217 -12935 -3446 10136 -3854 -20075 -3078
890 -3078 24805 19594 -5823 -7160 9370 2727 -22277 -19669 10879 22262 2362 -7549 8112
903 8112 13813 -6698 -17956 475 14807 1678 -12706 -2477 9704 461 -8451 5855 18901
916 18901 6301 -11460 -6179 4307 -5428 -15604 565 20769 12415 -7633 -3225 12833 4261
929 4261 -16641 -11043 12623 12012 -10192 -11949 10821 16600 -2299 -8434 9142 14528 -5954 -18461
943 -18461 -3863 9321 804 -5256 7735 17364 4553 -8777 -2494 5149 -2877 -10401 680
956 680 11393 2098 -7201 3065 14014 4772 -8168 -916 10598 181 -15677 -8605 10419
969 10419 10105 -3200 -228 14843 11861 -8244 -13917 -479 5082 -4174 -6552 6953 12970 2860
983 2860 -4968 1093 5153 -1685 -5483 286 2782 -3853 -6147 1941 6729 2542 682 7203 7457
998 7457 -4761 -13262 -6168 1473 -1386 -3811 5320 13798 6338 -6248 -6772 268 -255 -7079 -5902
1013 -5902 3270 5315 -982 -4445 322 5092 2258 -1227 -1086 -1358 -4845 -7548 -5112 -1253 2007
1028 2007 5075 6737 4012 -2340 -5679 -5608 -5922 -7337 -3368 3589 6200 2522 -1756 -311 1159 -2140
1044 -2140 -6003 -4422 294 -47 -4667 -5411 -309 4132 2904 402 966 1686 -2009 -8188 -9554 -4885
1060 -4885 648 2693 3106 4525 4644 1153 -4134 -7134 -6443 -3100 -379 224 691 1831 3036 1812
1076 1812 -1360 -2030 169 1116 -1784 -5186 -4695 -782 1450 711 1877 5545 6256 1217 -5329 -6929
1092 -6929 -4355 -3095 -2528 472 5705 7778 4265 -366 -2816 -2313 -2344 -3027 -2674 278 2823 2425 405
1109 405 208 2074 3919 2648 -1197 -2983 -2094 -2186 -3528 -3058 2014 7352 7229 2907 4 -764 -2644
1126 -2644 -6420 -6718 -1945 3776 5203 3374 2358 2455 1149 -2306 -3717 -2500 67 325 -643 -1127
1142 -1127 -274 2225 3298 2463 1510 536 419 -3022 -7120 -6284 -426 4077 3605 2872 4726 5089 -863
1159 -863 -7205 -6972 -2077 334 -782 245 4417 5410 1272 -2608 -1318 1143 -409 -2256 -2032 -1221
1175 -1221 -1285 -1481 784 2784 3729 3935 3163 -86 -5492 -6822 -3419 -422 -396 2102 7656 8501 1630
1192 1630 -5014 -3587 -322 -2391 -5386 -760 5986 5136 -1301 -2488 3131 4613 -125 -2588 1128
1207 1128 1962 -3634 -6373 -1956 3367 3843 3795 6114 5833 -954 -5953 -5170 -3224 -3613 -607 6486 9433
1224 9433 3571 -1827 -142 1969 -2977 -6838 -446 6428 2860 -5001 -3003 5463 4824 -1635 -410
1239 -410 6919 5727 -5715 -10709 -3573 2103 -377 139 8098 11105 2400 -6659 -5630 -2221 -4626
1254 -4626 -5105 2926 8578 3426 -3246 -511 3069 -1105 -5692 772 6999 -323 -10224 -6658 4130
1269 4130 3166 -3625 1512 12362 7928 -9039 -13177 -2044 1599 -6423 -5511 8909 13502 35
1283 35 -9095 -1606 3956 -4145 -9489 340 8449 -432 -9037 -1353 7136 1660 -5368 2286 9880
1298 9880 -855 -13910 -7747 4667 429 -7500 2282 16739 8528 -10391 -9851 4381 2198 -12350
1312 -12350 -8176 12078 13467 -5953 -10620 5782 10920 -4875 -10040 6039 11395 -5868 -15678
1325 -15678 -855 11112 1310 -5076 8257 16114 -1346 -16157 -6167 6629 -1371 -9525 5135
1338 5135 19162 5401 -13061 -4882 11182 3382 -12235 -3206 14788 6449 -15203 -11132 12360
1351 12360 13994 -4427 -4390 13172 10619 -13996 -19317 2772 12450 -1129 -5006 12375 16305 -5249
1365 -5249 -16608 -807 10545 -1783 -9654 5639 14374 -3030 -15287 958 16048 4405
1377 4405 -9440 1572 13142 -3050 -21772 -8625 14298 9995 -6098 449 17019 6614
1389 6614 -18616 -17039 5843 9562 -6443 -6170 12456 12541 -9444 -15808 2998 11635 -2630 -9016
1403 -9016 4626 8901 -9392 -18177 -753 14115 4744 -4222 6100 11137 -7638 -23757 -10264
1416 -10264 9478 5680 -5056 4659 16258 2391 -20030 -14913 6791 8305 -6707 -4411 10696
1429 10696 6114 -15322 -17144 5464 15568 2076 -5476 4889 5089 -14999 -22635 -2743 14975
1442 14975 8152 -1234 6675 9647 -8901 -23179 -8913 10288 6311 -4982 2876 12752 -934
1455 -934 -19345 -10002 12541 11440 -5883 -4647 9497 2152 -19296 -16115 10681 19421 2141
1468 2141 -4494 8627 7599 -15925 -23449 -549 16056 5373 -3971 8661 14086 -6002 -20351
1481 -20351 -4798 12761 5316 -7079 2764 12902 -2400 -18847 -5644 16062 11691 -4444
1493 -4444 419 12622 -382 -22868 -15415 11775 16372 146 -86 15199 8705 -17838 -21639
1506 -21639 3212 15033 324 -5052 10736 13358 -9145 -18730 1241 16277 4113 -7105
1518 -7105 3866 9457 -8263 -20286 -2277 17442 9728 -3405 4296 11758 -5694 -23005 -10171
1531 -10171 12273 9276 -3963 2336 15534 4289 -17522 -12720 8979 10327 -5945 -6147 9903
1544 9903 7684 -12168 -13451 7294 15173 112 -6134 5000 6484 -10789 -16891 -193 12227
1557 12227 3968 -2885 6862 10632 -5120 -16471 -4923 7756 1210 -6544 3257 12510 1190
1570 1190 -12228 -4269 9667 5195 -7116 -3116 7816 2272 -12469 -8866 7540 10951 -16
1583 -16 -2092 7173 5026 -9687 -13204 -513 7490 922 -1705 6616 8840 -2259 -9304 -1752 5290
1598 5290 -185 -5325 1099 6777 -910 -7315 289 9118 4621 -3850 -972 4986 -859 -10254 -5726
1613 -5726 6646 7076 -1246 -476 7280 5396 -6069 -8300 1056 5021 -2330 -5156 3182 7448 529
1628 529 -3930 1825 5951 -510 -6012 -2318 2594 -1270 -4810 1058 7073 3287 -2733 -203 3832
1643 3832 -683 -7278 -3757 3197 1970 -4089 -1523 6327 5156 -3168 -3985 2617 2288 -5580 -7569
1658 -7569 111 4294 -634 -2765 3167 6107 -420 -5941 -2648 771 -2345 -5461 -340 4140 1525
1673 1525 -1935 371 3172 -33 -4545 -2201 1315 -1568 -5486 -2032 3580 2313 -1380 650 4844
1688 4844 1458 -5952 -6268 -877 446 -2689 -1813 4394 5530 -252 -3273 -733 722 -2189 -4072
1703 -4072 -455 2073 28 -2026 224 2906 1535 2 1467 1098 -2061 -4368 -2570 125 94 758
1719 758 4207 5696 2110 -2092 -1990 -583 -1880 -3000 -409 3935 3836 815 -280 1885 2097 -589
1735 -589 -1454 317 1007 -337 -2305 -353 2300 2869 2536 2830 2539 299 -1835 -2782 -2733 -826 907
1752 907 3408 3961 3361 1775 716 -404 -2085 -2362 -239 1370 1265 644 1091 2074 2051 453 257 1485
1770 1485 1043 -1291 -2478 -1769 304 1060 1529 2372 3643 2540 -26 -2487 -3256 -2679 -1514 -99 1709
1787 1709 2656 2918 1623 31 -1591 -1473 -704 -1096 -1247 -734 222 633 344 13 925 1995 1024 -1333
1805 -1333 -2609 -2363 -2500 -2134 -1301 1344 3391 2896 795 -814 -1532 -2764 -3480 -2978 -988 1169 1571
1822 1571 1195 543 41 -780 -912 -1386 -1452 -990 -1102 -972 -1643 -826 1073 2208 1468 147 -268 -1048 -2921
1841 -2921 -4253 -3149 123 1810 1403 1529 2080 1198 -1728 -3670 -3011 -935 -423 -417 601 1458 1051 76
1859 76 -33 -24 34 -580 -782 -1296 -1754 -2122 93 1624 1694 1503 1916 1757 -1358 -4222 -3668 -742 -31 -546
1879 -546 1573 4268 3568 -380 -2070 -913 -74 -1918 -2593 631 1979 165 -1432 396 2240 754
1895 754 -613 335 468 -1637 -3802 -1910 456 549 763 3129 4112 680 -3209 -2908 -1509 -2501 -3278
1912 -3278 249 4428 2897 -1078 -926 1588 112 -4029 -3193 1513 2201 -2058 -3278 763 2660 -342
1928 -342 -893 2719 3693 -1375 -4964 -2980 -1147 -2265 -1856 3065 5915 2165 -1954 -1327 -644 -3469
1944 -3469 -4921 -5 4038 1739 -1932 -222 3117 57 -3565 -1128 3948 2023 -4101 -4175 643
1959 643 1616 -2221 -868 5615 6100 -559 -4876 -1354 -342 -3670 -3540 2681 6928 2558 -1347 368
1975 368 1825 -2178 -4572 336 4330 808 -3263 -354 3735 784 -2688 1202 6718 3005 -4368
1990 -4368 -3791 1419 347 -4360 -1109 7484 7921 -435 -3308 1398 1599 -4589 -5344 3063 7114 1202
2006 1202 -2795 1746 4599 -1009 -4419 1474 6095 307 -5397 -1616 3669 366 -3569 2919 8863
2021 8863 3911 -4920 -3444 2234 -1000 -6656 -1776 8406 6946 -2651 -3248 4083 3384 -5591 -5661 4274
2037 4274 6295 -3376 -6529 1864 6189 -799 -4063 3907 7648 -1579 -8736 -2557 3794 -1036 -5372
2052 -5372 2537 9493 2533 -6535 -2770 4387 -868 -8039 -1447 7868 2818 -6867 -3356 6551 4160
2067 4160 -5674 -3704 6366 4213 -8288 -8366 3504 5842 -3978 -4054 7224 8851 -3919 -9725 -290
2082 -290 4031 -4174 -7271 3954 9355 -180 -7382 -152 6267 -1251 -7256 709 7782 -626 -9586
2097 -9586 -2559 6642 2662 -5142 1007 9911 2809 -10416 -7668 3676 3045 -5234 -1440 10083
2111 10083 7643 -5813 -8269 2291 4729 -4263 -5194 5342 7186 -4354 -8651 995 7137 12
2125 12 -3764 3824 6801 -3375 -10976 -2999 5518 1913 -2842 4638 9792 516 -10276 -5427 4049
2140 4049 1253 -5210 -140 9066 4367 -7231 -5934 4588 5029 -3558 -3286 5189 4412 -6528 -9196
2155 -9196 1602 6934 576 -1696 5501 6608 -4063 -10802 -3520 3693 412 -2827 4359 8772
2169 8772 472 -8533 -3757 3938 707 -4776 434 7429 1565 -8415 -5877 4822 4976 -2751 -1201
2184 -1201 6628 3456 -8557 -10203 374 5617 -287 -1113 6794 7578 -4274 -10766 -3381 3746 -312
2199 -312 -3436 3503 7534 -385 -8475 -3010 4904 1560 -3457 766 6419 -666 -9568 -5424 5197
2214 5197 4500 -1927 1457 7642 2517 -9358 -9182 1743 4342 -1939 -1490 7698 7051 -4469 -8455
2229 -8455 588 5228 -1493 -4551 3177 6562 -2332 -8146 -486 6458 1805 -3001 2085 6290 -1920
2244 -1920 -9682 -3842 4435 2431 -2359 2783 8464 2179 -7421 -5489 3280 1852 -4780 -1096 7538
2259 7538 5125 -4591 -5499 3618 4879 -2452 -3499 4069 4890 -4701 -7391 682 5597 982 -1313
2274 -1313 4135 5993 -1826 -7934 -2573 2864 30 -2431 2893 7118 1108 -5333 -1988 3188 83
2289 83 -4467 -399 5195 1525 -5212 -2481 4569 3234 -2275 -1406 4295 2339 -5309 -5738 1093 3253
2305 3253 -949 -1427 3660 4501 -1514 -5141 -893 1499 -1944 -3361 1050 3926 390 -2498 529
2320 529 2922 -221 -3773 -816 2059 -752 -3801 -1284 3112 1851 -1985 -73 3690 1259 -3597
2335 -3597 -3649 607 617 -2338 -1674 2953 3645 -556 -1995 327 1514 -1824 -3456 -465 1869 12
2351 12 -1426 1111 3041 811 -1574 -91 975 -1081 -2595 -657 1700 765 -937 845 2855 1415
2367 1415 -1672 -1042 1247 208 -2751 -1691 1558 2369 197 2 2668 2208 -1080 -2842 -735 761
2383 761 -400 -1292 1080 3005 1761 -455 308 1424 -140 -1394 -292 737 -43 -794 343 2057
2399 2057 1014 547 1043 1585 -96 -2261 -1997 153 196 -56 773 2883 2550 -160 -1242 -393 -53 -1603
2417 -1603 -1776 590 2023 895 -822 486 1398 364 -467 -402 185 -619 -1590 -1001 -321 678 1067 1094
2435 1094 1606 394 -1298 -1553 -1300 -1774 -1507 366 1730 1582 305 333 518 -487 -1556 -1795 -344
2452 -344 296 -471 -1230 193 673 420 -190 -390 -9 -413 -2049 -2257 -1465 -602 24 643 1224 1179 389 -933
2472 -933 -1671 -2189 -1589 -854 83 444 618 512 181 -390 -1004 -762 -332 -466 -1079 -998 -96 161 49 -73
2492 -73 979 1298 393 -1050 -1781 -1625 -1249 -848 -58 1316 1809 1239 460 -531 -738 -1218 -1188 -853 -156 586
2512 586 715 491 76 185 316 318 -168 -839 -541 -81 -324 -625 381 1579 1753 800 25 117 -287 -1205
2532 -1205 -1978 -690 682 1428 1081 920 1102 343 -706 -1233 -790 -327 -84 321 334 239 626 908 555
2551 555 304 -77 145 -284 -1308 -1586 -469 991 1386 908 1033 1521 626 -1456 -2092 -695 -3 -565
2569 -565 10 1222 2146 905 -717 -289 -12 -656 -1307 -310 267 -202 -320 115 691 789 335 234 540
2588 540 -1158 -1389 -1186 -57 -129 -159 957 2475 1298 -858 -1289 -486 -538 -2142 -1259 1263 2229 132
2606 132 -556 604 1167 -544 -1711 82 1133 -95 -1671 -272 1162 409 49 1223 1785 810 -1446
2623 -1446 -1478 -296 -975 -1600 1113 3111 1833 -465 -156 899 -643 -2921 -1568 1786 1368 -496
2639 -496 -839 1993 1745 -1539 -1701 1659 2044 -596 -2402 -529 913 -657 -1029 1774 3644 1225
2655 1225 -1221 -511 -99 -1654 -2588 11 2570 1686 -335 876 2023 -613 -2948 -788 2148 683
2671 683 -2234 -934 1968 1004 -2041 -987 3205 2797 -1177 -2435 303 247 -2544 -2538 1611 3936 779
2688 779 -1109 811 934 -2424 -3559 -369 2426 493 -1131 884 2199 -465 -2762 25 2402
2703 2402 353 -2486 -1039 1365 -455 -2966 -564 4002 2990 -1305 -1820 1173 16 -4043 -3438
2718 -3438 1754 3791 53 -1663 1396 2231 -1872 -3771 244 2705 -170 -2450 -221 1889 -251
2733 -251 -2032 600 3849 929 -2727 -1203 1071 -757 -3288 -4 4166 2570 -1403 -1004 2202
2748 2202 653 -4032 -2705 2409 2673 -1757 -1956 2318 2934 -1767 -2866 1571 3437 -1052 -4051 -209
2764 -209 2523 -729 -2693 1158 4831 1333 -2795 -646 1838 -1091 -4268 -326 4007 1712 -2420
2779 -2420 -246 3273 932 -3928 -1627 3521 2123 -3977 -2457 2866 2280 -2893 -2044 4182 4493 -1968
2795 -1968 -4314 500 2062 -2414 -3506 2603 5663 196 -3358 -117 2657 -1176 -4171 451 3991
2810 3991 61 -3585 -342 3545 569 -3139 173 4328 688 -5035 -3022 2183 1036 -3412 -460
2825 -460 5113 3184 -3337 -4103 1446 1808 -3428 -3144 3068 4364 -1819 -3708 1138 3253 -1663 -3229
2841 -3229 1363 3089 -1630 -5010 -480 2562 -151 -2146 1738 4369 -127 -4931 -1822 1945 -769
2856 -769 -3554 285 5238 1988 -3314 -2113 1994 723 -3644 -1665 3640 2666 -2839 -3230 1607 2650
2872 2650 -1375 -1316 2881 3670 -1894 -4725 -1011 1655 -306 -1521 2806 4914 407 -3404 -1275 1279
2888 1279 -1134 -2633 1151 4155 931 -2638 -908 2242 761 -2251 -168 3906 1593 -3340 -3377
2903 -3377 1537 2281 -919 -218 4040 3196 -1991 -4253 -674 1535 -977 -1692 2433 4345 226 -2754
2919 -2754 -643 1730 -510 -2118 499 3254 342 -2747 -1029 2445 981 -1482 730 3686 863
2934 863 -3611 -2993 1440 1259 -1612 -124 3834 3670 -1969 -3185 175 1379 -2088 -2374 1844 3622
2950 3622 -22 -3110 -199 2259 -411 -2296 703 2519 -323 -3431 -1460 1583 315 -1054 1102
2965 1102 3391 772 -3027 -2211 472 -685 -2438 -59 3767 2441 -1808 -2253 1529 1235 -2517 -2070
2981 -2070 1994 2293 -1774 -2566 660 2476 -316 -1745 1208 2410 -1019 -3256 -905 1203 -299
2996 -299 -1587 1189 2945 665 -1993 -592 916 -764 -2629 -132 2600 812 -1706 -35 2301
3011 2301 600 -2171 -1081 1598 901 -2238 -1912 1458 1460 -955 -871 1886 2087 -631 -1961 -117 612
3028 612 -1115 -1304 1102 2436 737 -530 654 895 -719 -1602 97 994 -229 -1069 442 1869
3044 1869 485 -642 360 1500 51 -1717 -1087 990 434 -928 -200 1436 1656 -126 -920 409
3060 409 661 -1361 -1475 148 1058 218 -241 369 1073 361 -866 -480 48 -692 -741 122 721 515 218
3079 218 601 890 -202 -690 -389 227 -468 -1119 -477 859 1093 -110 -166 1234 579 -977 -1704 -475
3097 -475 6 -372 -505 702 1269 492 -522 -544 -192 -372 -1071 -683 159 116 11 -4 563 189 66 9 84
3118 84 -672 -951 -554 -1 -159 -236 518 991 776 -431 -802 -358 -372 -1034 -733 314 1259 473 -62 63
3138 63 372 183 -686 -839 105 254 -311 -302 227 580 621 174 274 53 -199 -534 -569 -407 -42 696 791 784 387
3161 387 339 175 -653 -1163 -1021 78 628 135 283 647 757 -77 -831 -42 379 -24 -622 -867 228 383
3181 383 422 76 476 648 304 -194 -731 -502 -259 45 304 420 702 949 79 -230 -477 -461 -111 10 -422
3202 -422 230 436 247 181 -178 405 572 -385 -718 -601 -88 -104 -266 245 930 1049 332 -259 -210 -443 -991
3223 -991 -540 -261 29 632 633 342 343 -376 35 -263 -618 -321 341 206 -331 -290 -38 803 296 -244 -186 -63
3245 -63 -209 -989 -975 -267 698 598 29 477 668 102 -623 -1221 -349 -145 110 -37 423 446 453 343 -216 -191
3267 -191 -465 -111 -180 -110 -358 401 585 409 198 540 914 48 -698 -1052 -17 349 -266 -203 1033 1219
3287 1219 601 -381 -267 163 -436 -826 -139 460 653 -32 177 384 154 -369 -320 11 -359 -596 -286 210
3307 210 -178 85 590 949 592 -231 -192 -109 -172 -1289 -336 1344 1386 424 -104 673 463 -1017 -1221 -30
3327 -30 928 108 -579 54 963 245 -417 -301 899 254 -858 -725 -238 -397 -436 281 1631 891 -318
3346 -318 103 391 -593 -1494 -979 593 588 -652 -142 1211 747 -1124 -1043 514 735 -983 -1173 429 1092
3365 1092 -484 -706 376 1476 228 -960 -502 107 -615 -1587 -163 1550 1037 -273 661 862 -512
3382 -512 -1719 -809 609 384 -887 85 1413 361 -1504 -794 1531 836 -1309 -955 708 185 -1850
3399 -1850 -1268 1310 1950 200 -699 833 837 -1304 -1935 -222 1611 198 -337 976 1273 -394 -1380
3416 -1380 -6 979 -238 -932 68 1128 -394 -1475 546 1880 807 -875 -390 906 -164 -2142
3432 -2142 -1151 1666 1547 -605 -506 1080 1137 -1384 -1971 -62 1267 -372 -944 435 1577 197 -1261
3449 -1261 28 1223 7 -1332 -180 832 -400 -1161 -196 1531 849 -759 -67 1246 -383 -1886
3465 -1886 -1183 1037 752 -768 -195 1746 1193 -1429 -1622 519 1435 -736 -1546 640 1373 -609 -1601
3482 -1601 590 1938 246 -1232 -560 695 -566 -2199 -266 1740 953 -1090 165 1163 27 -2114
3498 -2114 -787 1228 367 -1487 -938 1531 883 -1592 -904 1787 1326 -1378 -1983 663 1247 -1171 -1522
3515 -1522 1191 2434 -330 -1864 -23 1354 -748 -2015 172 1925 361 -1352 50 1950 0
3530 0 -1541 101 1434 -13 -2149 -624 1673 499 -1598 -101 2380 1313 -1724 -1169 1138 470
3546 470 -2072 -1326 1620 2088 -718 -1253 1134 1889 -950 -2046 465 1935 -285 -1422 419 1597
3562 1597 91 -1261 490 2093 503 -1572 -284 1327 -482 -1602 469 2669 745 -977 -429
3577 -429 1271 -154 -2049 -649 2183 1357 -1032 -929 1726 850 -1261 -896 1500 1410 -1432 -2029 36
3594 36 1186 -390 -978 1105 1885 20 -1606 -526 408 -888 -1164 285 1660 174 -1038 -114 861
3611 861 -260 -1523 170 1587 305 -1487 -664 1040 519 -1257 -499 1604 1263 -1024 -1601 196
3627 196 503 -1219 -1047 1165 1707 64 -1006 -165 471 -658 -1352 91 1296 459 -779 -154 700
3644 700 -153 -1096 147 1063 1 -1096 -699 401 2 -1079 -204 1763 1160 -830 -1303 369 25
3661 25 -1441 -894 1164 1646 -28 -884 -123 838 -679 -1087 -95 837 -117 -999 -413 923 601 -514
3679 -514 229 887 450 -843 -751 177 -18 -763 179 1800 849 -288 -610 832 -41 -1288 -825 876
3697 876 1145 -737 -831 880 1254 -239 -960 131 1073 -165 -1390 -161 739 -149 -346 371 979 332
3715 332 -423 -108 87 -358 -932 -54 1033 225 -649 62 842 147 -926 -199 535 331 -628 -149 775
3734 775 644 -367 -534 716 694 -469 -885 28 430 -565 -681 385 933 363 -356 225 136 -329 -1014
3753 -1014 -281 549 75 -282 236 623 -36 -333 124 557 -354 -815 -174 445 149 -384 180 678 310 -292
3773 -292 -301 342 432 -610 -569 -79 552 403 -304 295 364 -367 -645 -695 244 168 -218 164 465 267 165 54
3795 54 -79 -146 -498 53 -272 -106 240 112 248 244 -169 250 618 144 -546 -656 141 3 -194 60 489
3816 489 843 101 -387 -65 -76 -40 -301 -236 76 272 314 -32 60 181 85 143 278 -198 -110 93 -157 -118 56
3839 56 182 164 348 -285 -224 -329 -379 -255 0 476 341 14 10 225 98 -398 -462 -164 161 42 -308 -26
3861 -26 211 190 12 -72 44 39 -111 -657 -200 -88 4 362 331 139 47 279 -282 -581 -488 -272 95 126 89 121
3885 121 506 -117 -332 -440 -272 -57 70 -476 -193 313 77 17 267 267 -135 -414 -424 -457 -130 -73 6 283
3907 283 353 444 31 355 -227 -87 -409 -71 -46 -21 105 584 90 -170 -120 429 190 -302 -181 32 96 178
3929 178 10 65 593 139 41 205 222 389 -374 -491 36 242 339 593 105 365 267 -150 -162 -363 6 366
3951 366 366 -193 -23 283 409 -82 -277 -49 129 89 -282 -516 84 392 -50 -209 325 -9 -512 -660 -493
3972 -493 -353 -204 -126 -117 369 210 -42 300 -157 -284 -321 28 17 -16 -72 -40 304 -42 -358 17 508 -196 -418
3995 -418 -142 103 221 -22 -132 187 595 95 -281 48 172 -339 -581 1 265 213 -99 106 -50 224
4015 224 -498 -600 -93 149 -63 62 38 202 21 -18 82 -83 -317 -215 30 -205 -550 -28 726 424 -442
4036 -442 -90 670 362 -495 -482 -15 230 28 -312 149 788 182 -475 -272 250 86 -120 -119 368 46 -161
4057 -161 118 449 413 -246 301 364 14 -682 -334 532 -48 -155 312 613 355 -766 -457 694 86 -245
4077 -245 -225 697 529 -414 -921 113 639 -224 -235 -47 694 -116 -527 222 683 684 -69 41 210 -203 -814
4098 -814 -217 566 159 -303 258 789 29 -1135 -247 500 384 -790 -343 807 352 -687 -873 608
4116 608 547 -350 -324 482 615 -768 -1053 29 548 -104 -253 518 792 -251 -491 -389 245 -231 -661 327
4136 327 787 75 -312 387 566 -142 -709 105 766 -177 -992 92 722 383 -448 37 673 432 -546 -681
4156 -681 92 511 -400 -214 652 861 -99 -650 17 602 -154 -617 -7 189 216 -631 17 462 164 -262
4176 -262 16 615 -199 -796 -171 569 655 -522 139 905 144 -373 -611 375 440 -510 -689 530 583 95
4196 95 -407 319 753 86 -584 98 576 0 -669 3 726 387 -273 203 576 -37 -654 -77 340 143
4216 143 -299 -244 568 802 -362 -191 478 601 -487 -543 710 533 -389 -613 401 911 -54 -492 166
4235 166 441 -391 -591 -91 879 365 -251 386 945 -22 -809 -427 501 -34 -489 -411 343 292 -457 -279 688
4256 688 322 -669 -559 300 67 -765 -693 614 805 -250 -965 697 640 -637 -757 384 996 -372 -745
4275 -745 728 1031 -276 -711 267 449 0 -777 -232 159 -257 -413 -150 614 266 -438 -121 344 -456
4294 -456 -972 104 693 329 -626 -259 714 417 -763 -342 344 363 -665 -528 -86 499 -217 -358 464
4313 464 567 21 -525 167 428 -237 -595 209 729 465 -81 89 423 -334 -586 -205 505 156 -561 56
4333 56 623 -300 -433 18 581 700 -419 -413 244 129 -527 -252 608 794 223 -163 50 352 -435 -591 162
4354 162 592 139 -135 -16 65 -192 -252 -220 79 -105 -157 -91 -6 167 -450 142 625 161 -115 -415 67 19
4376 19 -479 -204 488 341 -225 -151 356 141 -370 -671 -13 297 171 -155 -56 238 165 -290 -261 420 142 -388
4398 -388 -130 94 433 -386 -197 479 320 -69 -105 340 -181 -431 -314 203 140 -130 -233 316 280 -595 -420
4419 -420 401 297 -179 -210 48 602 58 -431 231 649 210 -391 -372 -138 -28 -169 -235 315 134 346 69
4440 69 178 -148 -422 -316 25 -51 -156 121 303 26 41 152 129 406 -210 -379 31 189 -33 -11 31 230
4462 230 173 19 -35 328 123 -328 -56 396 136 -273 117 608 -10 -265 70 -87 -116 -207 -376 207 141 -89
4484 -89 -13 399 184 -409 -133 133 144 -428 -138 169 262 -275 56 68 166 -140 -233 -134 208 1 -303 176 543
4507 543 204 -43 255 -255 -77 -198 -48 114 -202 -149 64 182 39 -24 -5 -14 -394 -317 -69 276 188 -92
4529 -92 8 381 95 17 13 154 162 -14 -316 -93 -17 204 -59 114 -71 23 -85 -419 -320 -99 195 -72 -130
4552 -130 131 313 31 11 91 -286 -308 188 61 -189 -63 416 183 -135 19 235 -202 -203 -154 98 -114 119
4574 119 -91 119 281 -24 -85 -167 174 88 -146 -30 285 -18 152 -280 132 217 -368 -94 -54 -81 54 -375
4596 -375 121 -14 103 242 260 158 -54 -346 4 39 -99 42 281 110 74 -16 153 -55 -70 31 -323 98
4618 98 -23 -148 5 141 52 121 31 -158 -137 12 -54 82 46 291 -58 9 145 82 -163 138 36 -176 -223
4641 -223 -88 -47 -185 -323 121 294 175 -315 -217 -20 116 -344 -241 257 300 43 237 78 -67 -107 -18 -12
4663 -12 119 -145 -288 24 97 147 -56 -215 -231 -79 143 -176 -152 30 -177 236 175 -3 103 134 191 -62 -361
4686 -361 -149 168 26 -155 308 304 137 20 -77 1 52 -219 -178 -118 -167 -119 63 108 -213 16 120 -183 92
4709 92 -32 -99 202 23 -496 -114 136 34 -269 20 -108 230 92 -344 224 487 -71 -61 186 45 3
4730 3 -265 -150 111 -171 -128 -50 200 -52 -80 -55 58 134 -114 -55 -92 -155 -155 67 133 116 135 -142 182 -315 -201
4755 -201 -189 200 303 314 31 236 123 -34 -345 -182 13 -1 -269 -299 395 101 -415 68 207 357 -25
4776 -25 257 112 -281 -230 -313 -197 83 -34 -185 287 219 -105 -227 39 95 -176 -56 179 449 218 -399 -183
4798 -183 -39 -216 -432 146 320 -327 -692 79 298 231 -207 15 40 -100 -153 -408 183 -138 -345 65 300
4819 300 141 -136 -308 -68 -4 -213 -97 471 77 -58 90 471 131 -67 -264 258 89 -86 -418 281
4839 281 482 -36 117 177 752 122 -201 -240 51 -362 -138 403 361 531 15 -125 141 -88 -108 -125 43 213
4861 213 -240 151 327 -164 -136 -70 459 162 -90 -300 107 169 -68 -472 248 256 4 -12 -119 183 -206 -197 125
4884 125 -71 125 -349 -114 268 -75 -172 -84 80 33 -573 -79 128 50 -255 314 138 78 -145 -78 -157 56
4906 56 -209 -221 19 209 -91 -162 361 265 -299 -238 89 -140 -313 -243 -18 196 406 -148 -63 30 32 -371 -165
4929 -165 122 -52 -21 21 74 196 -80 -375 -78 241 27 -99 -44 326 83 -383 84 479 -2 -214 -34
4950 -34 139 -176 -538 -87 218 35 -196 175 297 5 -318 -212 231 266 -223 -121 160 295 -339 -36 175
4971 175 49 26 -377 -16 182 -262 -284 34 147 -120 -145 287 418 -85 -414 -435 355 202 -207 388 148
4992 148 265 -396 -140 375 225 -120 -294 285 344 -288 -156 180 243 -92 -300 211 113 -101 -152 207 217 -411
5014 -411 4 106 187 -512 -203 85 278 -89 -143 187 141 -142 -235 -218 454 160 -406 194 279 -99 -416 -109
5036 -109 200 131 -50 299 235 46 -206 -145 -124 433 -434 130 381 265 -45 110 133 -19 -294 -52 282 -161
5058 -161 -68 -83 131 -16 -37 -297 343 42 186 -258 -198 154 252 75 -100 -154 -58 -172 -59 34 2 -199 -183
5081 -183 121 184 32 -98 82 -167 -71 -283 34 15 -235 -141 247 53 -102 60 94 93 -253 -421 -66 -43 -37
5104 -37 -68 -85 219 185 -100 68 -159 42 -76 59 -132 208 45 -416 102 202 -63 -69 37 -117 -110 -1 57
5127 57 155 -81 70 155 380 -13 13 -22 -85 -251 -35 258 366 -90 -256 -109 263 13 -89 -412 -136 226
5149 226 -207 -265 159 -132 97 98 28 0 81 -278 -146 -131 -314 -231 243 188 -14 28 -70 -6 143 -121 -234 158
5173 158 -228 12 282 73 145 -285 -5 407 -115 260 -118 90 2 -30 142 456 155 52 -89 -159 127
5194 127 -21 -276 171 37 -225 84 -146 180 -177 -92 -61 -25 -104 -133 5 81 6 -196 13 323 -9 -318
5216 -318 -149 52 234 92 -25 -83 383 465 -83 -35 108 -49 -210 -235 58 141 -64 -15 -52 -41 155 -138 23
5239 23 59 254 74 50 15 -316 160 158 -122 96 116 -98 55 -307 -104 -60 -52 -111 -14 20 -38 -97 148 -273 -15
5264 -15 -155 67 -46 123 9 -50 183 170 -122 -12 -54 270 279 32 -158 -75 225 241 156 201 202 113 -145 42
5288 42 88 29 -81 -65 209 133 -89 31 -220 48 40 339 -30 121 -163 -196 115 81 239 -173 -52 -110 -182 263
5312 263 -57 195 101 122 149 206 -264 -5 32 -52 -247 270 -171 -42 -80 -370 321 -4 -134 -329 118 104 -178
5335 -178 -271 62 36 -31 -150 53 1 -138 -517 27 -187 79 -2 -64 464 89 -184 -153 -127 -152 -77 -235 210
5358 210 43 -119 -106 161 108 152 21 -15 86 -21 -181 -88 314 -159 221 -18 -31 12 -297 -87 -112 207 164
5381 164 -180 -107 -208 -169 272 53 324 -187 -230 22 165 374 -54 159 57 -96 279 169 -139 14 9 245
5403 245 -104 -261 -207 61 200 79 -76 56 155 -80 -109 -13 267 137 41 267 69 256 39 0 281 -209
5425 -209 96 170 139 -67 -113 257 169 -64 269 -272 -154 -192 -464 36 143 -139 95 237 136 43 -165 -85
5447 -85 -77 266 115 -170 157 196 54 -180 -175 42 -86 161 9 -124 47 -65 82 88 -177 -211 -268 386 11
5470 11 -133 -113 76 118 -201 118 157 29 14 29 136 25 229 -38 -251 324 -358 -30 225 194 -43 -83 -267
5493 -267 -162 -107 -136 305 91 240 -208 43 211 -74 -294 -165 -173 36 -26 -4 406 178 -299 -23 250 23
5515 23 -106 -332 237 193 -115 -24 151 6 -168 -220 -137 -230 -73 87 -149 219 17 -558 160 251 -86 -299
5537 -299 98 32 -20 -225 -6 90 4 -109 -9 68 103 79 -33 235 85 -382 -38 171 91 -164 82 263 288
5560 288 -213 -375 159 -125 -43 -279 59 299 -126 48 -24 330 -111 -141 16 153 50 104 278 66 39 -24
5582 -24 86 -69 -171 -184 -99 85 -59 -79 74 248 94 -186 -147 53 13 -161 -196 -148 152 98 -214 -231 122
5605 122 -60 -94 -5 165 -51 -224 221 354 195 -332 -7 96 -99 -193 -285 193 111 -53 58 150 444 5
5627 5 -8 217 81 -338 51 421 72 -116 -77 144 349 46 24 134 184 -65 -357 -34 132 54 -335 210
5649 210 293 31 -334 72 161 -2 -106 -25 103 -28 228 262 119 245 -54 36 135 24 -44 -100 -65 167 -123
5672 -123 -40 336 67 -184 -217 181 -20 -242 75 -160 267 327 -150 -15 155 -116 -145 -293 274 -309 -146
5693 -146 25 139 92 -266 -137 186 95 -434 127 105 44 -44 105 415 147 52 -27 100 254 -449 110 -219
5715 -219 -56 -12 -164 222 357 -33 -337 188 3 -294 -229 -42 192 35 5 270 56 62 -143 -181 13 37
5737 37 -389 131 9 142 -85 6 239 104 -64 -62 319 68 -340 -282 186 -54 -28 -241 154 -48 -71 -77 -134
5760 -134 102 166 54 -199 407 370 -56 -10 -25 -18 -145 49 131 45 -242 -51 256 214 -122 -198 225 -102 -21 -249
5784 -249 -179 164 -84 270 -77 -92 -198 -225 -125 153 5 -272 118 380 -231 22 -6 -64 -38 -212 -106 -10
5806 -10 -113 -250 148 -73 126 254 22 334 59 -15 -111 22 129 -194 183 72 161 26 0 73 -92 234
5828 234 -87 329 -27 -13 187 -139 153 61 -184 70 87 64 -212 123 80 17 -146 160 260 170 95 -119 23
5851 23 114 -91 -55 41 145 -32 -32 210 158 -176 43 41 -56 116 28 -117 215 10 142 38 76 73 -194 -285 -168
5876 -168 254 -21 -59 57 98 41 -51 250 -37 -26 -129 68 -149 65 51 -118 167 -52 -171 303 -50 -89
5898 -89 -278 -21 69 -86 -66 146 222 126 -34 -145 -59 -352 -89 -188 299 39 100 38 110 71 -382 79 -183 -212
5922 -212 -3 -12 -38 -140 92 -188 385 -23 -99 163 378 102 -286 174 -202 -70 62 -276 101 -207 -42
5943 -42 206 -302 38 223 -50 105 -67 -194 -158 7 -110 170 268 -196 0 -12 141 170 102 110 -339 -108 59
5966 59 -9 -14 54 188 308 90 21 -78 149 305 149 -91 325 227 23 318 62 227 95 -14 -49 354 100
5989 100 -96 -20 -222 72 153 114 156 -214 -26 238 -176 133 -79 7 132 199 -140 97 96 307 -149 111 -62
6012 -62 112 -12 -17 8 211 148 -172 151 44 -5 124 -252 -102 -255 -77 122 -117 149 202 -108 158 -212
6034 -212 -9 215 -96 -41 -241 131 74 63 -295 109 264 97 -97 260 199 -8 -112 -24 4 -19 101 136 165
6057 165 269 -89 -47 235 -11 -85 -110 -200 36 6 -96 54 32 -132 209 -103 104 -9 135 -95 101 -202
6079 -202 -32 -30 -251 66 -73 -123 121 -208 130 239 59 -87 0 -122 -196 31 137 -120 361 29 -140 -262
6101 -262 -18 142 -98 -15 -95 -1 -268 272 32 -113 -223 -44 73 -113 -57 -121 211 48 77 -116 -68 104
6123 104 -17 -356 -16 -43 -160 -104 -22 51 -331 129 31 194 122 -82 73 -165 120 10 -164 234 288 143
6145 143 -189 12 15 -77 210 189 -2 -101 -93 320 148 56 -33 188 5 38 16 141 171 136 -365 -138 224 -9
6169 -9 -293 -46 205 117 134 -50 160 47 232 69 -77 111 -56 321 171 -116 -41 19 331 185 -102 302
6191 302 57 -114 -105 -58 343 120 -99 -205 265 48 -190 78 162 116 -236 -253 33 227 -76 88 -423 199
6213 199 113 163 0 134 43 -198 249 164 -24 -221 206 88 178 35 35 37 54 -370 -189 358 19 -304 22
6236 22 215 111 -84 -225 160 -95 -30 -226 -171 63 -227 -222 200 345 -4 -54 21 251 -214 -463 125 457
6258 457 -73 -128 65 190 78 -225 -242 155 45 -77 -203 253 192 -76 -281 279 263 93 -331 223 403
6279 403 -90 -257 200 326 60 -234 21 110 71 -288 -133 -74 -32 86 -75 217 94 -70 17 313 -179 -385
6301 -385 -191 273 -70 -86 -117 -47 264 -208 -127 344 76 -3 -150 -10 189 10 -295 40 365 -97 -369 19
6323 19 253 -210 -126 109 443 130 -13 -158 55 89 -175 -224 270 234 -209 45 438 35 -2 119 115 148 -112
6346 -112 -49 40 269 -91 -101 258 46 50 0 245 229 143 -161 93 289 236 -193 -55 307 37 -54 -40 294 111
6370 111 2 -113 273 -24 -148 265 309 212 -89 -106 160 240 -208 -132 210 297 -175 -56 25 118 -51 -227 112
6393 112 -160 -123 -297 106 389 -21 -35 221 397 163 -43 12 384 148 -73 302 255 343 -57 -204 -145 376
6415 376 -434 -284 276 -252 -167 -219 158 185 -268 -74 255 121 -169 -431 33 212 -182 -170 41 142 -253
6436 -253 -102 183 59 150 -43 -92 83 93 -170 -107 65 157 -314 75 280 56 -65 -95 279 -43 -48 -219 196
6459 196 104 -225 -35 83 32 -77 -111 41 136 47 -208 131 26 187 -209 -149 35 -124 -42 -19 9 150 34
6482 34 27 269 50 -379 -158 -65 -57 -63 84 -220 75 -397 -312 43 79 -134 -348 250 -98 31 -180 230 112
6505 112 0 -185 122 58 136 -323 81 193 98 40 109 55 127 -126 -78 31 -159 -101 7 262 34 -130 26
6528 26 187 172 -6 -112 -31 -61 145 -157 43 158 80 64 -138 226 -70 -116 -95 22 65 265 -416 12 16 -177
6552 -177 -76 -262 43 -192 -94 90 -202 -85 -344 20 -261 -183 189 -32 4 -67 -197 135 145 -178 -30 -197
6574 -197 -11 -99 -213 207 61 104 143 -17 60 266 -17 -262 87 -127 -121 -27 134 202 121 -12 -20 208 -153 112
6598 112 -102 187 -149 -92 303 54 -319 -158 -287 134 48 132 -30 -77 -90 -88 51 43 275 40 268 166 -356
6621 -356 -25 -258 -49 -149 -196 -124 115 -9 21 196 -5 -15 -42 -311 35 208 -419 -264 101 -72 222 -6
6643 -6 8 -60 -160 -4 -309 318 -172 -17 -186 -124 -111 354 -85 -133 -9 -7 158 219 -35 -30 6 205 158 -88 -42
6668 -42 -143 -124 -148 -224 -102 38 246 96 -97 -71 -108 11 -49 44 -81 -469 24 -53 206 25 134 61 22 22
6692 22 98 -107 48 -96 161 224 80 -252 125 72 156 14 106 263 -133 75 87 258 122 -111 142 -334
6714 -334 -41 76 -19 92 -10 252 -207 241 276 -55 30 51 78 92 -46 82 227 -124 -186 16 112 104 138 -225
6738 -225 -56 -106 -178 -143 49 -398 -238 119 -73 -11 19 -60 -149 39 -28 -434 272 -102 175 -22 -56 294 260
6761 260 -37 -105 115 -5 46 158 341 76 -199 8 -28 -129 -244 -195 141 -73 172 -92 218 64 -352
6782 -352 -137 -36 93 -242 -162 77 260 -155 -78 484 86 -75 -242 160 72 -43 -78 209 161 -66 10 -121
6804 -121 326 -178 -26 80 -466 154 -45 154 300 3 -40 78 131 34 4 -292 131 -21 -113 99 271 -68
6826 -68 -43 -17 -211 44 -334 110 55 406 47 -117 97 142 18 49 5 90 -203 -288 111 -25 -253 -20 -27 82
6850 82 -68 -147 -270 79 49 -335 -221 145 -103 -34 -78 180 -222 -27 -75 -88 35 -189 -211 299 56 -216 -43
6873 -43 -82 -5 -63 -422 34 78 -122 163 323 261 -16 190 127 -33 31 131 -55 293 -18 -15 -303 204 159 -316
6897 -316 34 237 103 -224 -21 82 93 6 -161 168 97 -228 -244 -46 -124 -268 -98 39 94 186 -253 -55
6919 -55 112 -33 -180 -147 238 -256 -36 54 268 332 42 -95 12 -61 -248 -126 244 -39 -99 -78 231 194 -37
6942 -37 -42 420 185 -109 -15 -46 76 -232 -236 216 139 -292 -8 274 165 64 -141 -26 137 -59 21 4 341
6965 341 163 -208 5 16 -307 -196 -193 186 24 116 116 25 116 80 -85 196 -252 26 -223 97 310 -147 -101
6988 -101 116 11 -223 -466 298 -74 -225 -35 231 381 -59 -113 27 19 -166 -67 -101 143 185 -149 -311 200
7010 200 -45 66 133 195 -14 -369 186 13 42 -169 -140 286 210 30 5 87 137 -189 -504 75 296 -57 -178
7033 -178 -190 48 -160 10 -71 171 284 -412 -149 115 24 -226 -97 -8 -28 -385 -62 168 186 -225 -54 31
7055 31 220 -128 323 340 33 -246 74 70 80 -315 -9 -1 173 -142 -53 -228 96 73 -365 469 324 -51 -379
7078 -379 167 12 86 14 -151 268 -39 -59 -2 346 80 29 -18 236 -73 -85 -252 106 308 -73 59 138 189
7101 189 122 41 1 220 -181 -297 -64 192 -99 -53 262 290 67 -150 -40 105 -201 -452 -91 -27 36 -2 -1
7124 -1 425 536 -102 -352 510 53 -163 -101 381 74 -293 -170 351 515 201 -180 -88 86 -37 -81 114 236
7146 236 -162 63 86 259 98 -316 197 310 95 -298 -243 -110 28 198 -59 311 -186 -37 -52 109 144
7167 144 -128 -419 131 70 -91 -4 287 50 -132 -384 -66 12 -241 -81 144 165 -94 -120 -217 77 -163 -6
7189 -6 445 113 455 32 169 390 233 -515 -97 104 -147 -111 196 -300 193 166 214 -83 -66 33 -147 -181 239
7212 239 -90 -190 346 73 185 -64 32 -186 -96 -299 241 -122 -7 -226 83 -158 24 242 29 254 -161
7233 -161 70 -3 319 100 -32 -241 158 20 230 48 -7 32 155 -174 -9 117 -44 -23 -4 303 61 69
7255 69 90 30 -300 -216 68 133 29 -117 166 146 -195 -239 -98 -177 38 -255 -136 244 323 8 -22 166 -204
7278 -204 43 -153 6 11 -84 -2 -240 -1 19 -297 100 131 -153 -160 62 173 142 26 110 135 -173 -127 34 76
7302 76 -76 -107 -241 -63 -89 38 -110 13 244 -32 -282 138 288 -168 -24 -238 53 -71 -124 -159 71 -111
7324 -111 -50 -307 -84 -46 73 -41 -90 121 107 125 39 -85 -265 -31 85 259 -62 134 -135 -118 72 59 233
7347 233 -63 4 156 183 199 134 296 94 92 -262 -116 238 294 -308 -163 444 104 -180 -134 138 -141 244 -62
7370 -62 -184 97 -90 -172 -256 136 -35 -92 -13 137 -41 -137 -385 7 -286 -140 -279 16 140 -85 105 -8
7392 -8 -13 -13 -95 243 54 -198 53 215 115 28 49 208 -144 55 -151 136 -111 72 13 36 309 30 19 133
7416 133 -45 205 -126 43 25 31 -6 185 -157 126 70 -137 148 61 -115 -368 8 31 154 -176 90 92 -92
7439 -92 122 56 107 -101 -43 406 223 -14 -213 98 137 -100 -242 -297 -97 -214 134 21 195 -5 -152 55
7461 55 -22 35 -179 -12 -69 387 74 301 163 -308 75 129 87 -56 39 -307 116 48 -314 154 -47 -83 221
7484 221 -117 -29 87 -224 37 8 258 214 38 73 -9 -141 -251 43 125 -206 -88 249 199 -142 114 -119
7506 -119 37 198 24 -123 59 -64 63 36 -85 43 89 -157 -5 118 -72 -74 5 105 -29 -219 133 196
7528 196 -148 172 240 -106 -63 -171 283 31 -435 -8 77 -46 145 -83 -133 174 104 -389 -10 142 100 99 -65
7551 -65 64 166 -14 -313 38 109 -181 -144 -5 -35 -223 -110 -238 54 -215 -350 -32 -56 -87 -20 193 204 123
7574 123 161 -225 -224 -26 -115 308 21 127 -216 -53 340 276 -9 32 329 -66 -10 -309 -22 55 -242 -69 -81
7597 -81 259 -104 -222 -298 48 11 -109 -77 5 256 -45 74 103 -78 -247 107 360 -109 -460 -66 131 99
7619 99 -90 -94 -112 -77 -234 -339 55 -232 14 -47 -5 1 -4 -189 181 65 -134 -163 -275 203 53 -232 36 316
7643 316 193 182 -177 117 -276 -293 -169 84 -83 -440 23 310 257 -461 -248 221 144 -17 -1 19 -175 -129
7665 -129 77 320 -108 -55 -36 138 237 -91 -251 43 200 -9 -264 176 176 -208 -276 -351 -19 -161 -183 55 231
7688 231 -39 -165 -2 100 267 -378 -376 56 -62 -223 -26 282 314 -85 -44 87 37 -249 121 -64 -66 -142 187
7711 187 44 135 -124 -114 33 76 -360 -183 -176 184 96 -85 63 -148 114 -167 -58 104 43 -138 -189 75 -74
7734 -74 -149 -159 135 171 -120 41 29 69 -451 -319 29 259 10 -17 116 266 -178 -151 -133 -137 -159 -183 53 167
7758 167 78 -139 75 63 -229 -429 100 408 188 -242 -186 223 133 -9 -145 -63 340 26 179 202 55 -62
7780 -62 -173 143 257 -9 -284 57 109 10 -353 113 121 -123 -5 -82 32 19 -205 -4 489 29 -273 -225 181
7803 181 253 26 -22 138 -159 -331 -75 2 -261 -22 -134 97 152 -70 -16 9 -252 -253 96 142 -108 -256 -31
7826 -31 133 106 -93 -274 40 209 -151 -131 175 30 36 -246 -107 137 185 103 362 389 -34 -140 -216 121 56
7849 56 -24 129 170 78 -76 -166 -299 197 143 -6 219 129 -97 -58 103 147 -44 -269 -113 155 187 -337 -171
7872 -171 307 453 -104 -266 119 424 -451 97 -6 412 -121 2 279 138 205 -40 -272 56 -477 79
7892 79 217 -140 -18 -14 118 163 115 -250 1 -307 -288 8 -93 283 162 -286 82 151 -256 139 -391 9
7914 9 127 -171 -66 18 1 -144 -136 42 -60 -15 121 -121 268 -219 -251 121 34 58 -128 101 234 46 134 164
7938 164 17 123 -145 191 -180 78 -126 14 -201 -87 -337 150 214 -61 -101 -35 180 -93 -62 -75 386 304
7960 304 -125 -55 317 -15 -18 -173 116 71 68 -411 -169 43 -140 105 91 7 157 132 52 11 -84 -58 -194 44
7984 44 -48 -154 121 51 7 131 96 -11 214 108 134 79 125 -13 136 -91 -449 291 -100 -184 12 -19 -153
8007 -153 -64 14 -133 -44 -14 74 -205 -196 158 -343 35 123 -156 241 -5 249 -17 223 -147 -109 -94 -174 -70 -218
8031 -218 -60 51 96 114 -103 262 -87 -91 -128 -145 87 -265 150 -127 286 58 204 11 -299 -58 -61 136 43
8054 43 -121 -43 -88 79 -215 -288 32 85 110 -55 60 -61 345 139 191 -45 69 330 12 36 45 182 -111
8077 -111 -335 258 -44 -291 215 339 -246 8 -27 263 87 -9 258 -82 47 -145 85 86 -230 122 306
8098 306 25 52 -66 224 -116 12 -205 -157 -81 -74 48 -95 74 153 -75 30 -61 79 94 -7 171 357 235
8121 235 -385 -243 -55 78 -139 295 -62 17 -61 -85 171 13 -45 194 -201 -30 -97 -91 201 -313 -157 -377
8143 -377 95 185 -129 129 314 24 -177 -62 242 -80 -124 53 38 203 -129 -62 269 211 -9 -71 1 318
8165 318 -51 -114 -392 -191 -165 -89 -221 36 95 74 -232 251 410 2 158 152 192 245 -171 -144 225 20 -94
8188 -94 153 -160 -93
8191i3
##END NTUPLES=NMR FID
##END=
