##TITLE=1H_SR1516_3
 D2O, 8 sc, 
 30.7.2020
##JCAMPDX= 6.0         $$ Bruker NMR JCAMP-DX V2.0
##DATA TYPE= NMR FID
##DATA CLASS= NTUPLES
##ORIGIN= UXNMR, Bruker Analytische Messtechnik GmbH
##OWNER= root
$$ XWIN-NMR		Version 3.5
$$ Thu Jul 30 09:57:23 2020 Russian Standard Time (UT+4h)  she@DPX200
##.OBSERVE FREQUENCY= 200.1315
##.OBSERVE NUCLEUS= ^1H
##.DELAY= (6, 6)
##.ACQUISITION MODE= SIMULTANEOUS
##.ACQUISITION SCHEME= undefined
##.AVERAGES= 8
##.DIGITISER RES= 18
##SPECTROMETER/DATA SYSTEM= spect
##.PULSE SEQUENCE= zg30
##.SOLVENT NAME= D2O
##.SHIFT REFERENCE= (INTERNAL, D2O, 0, 15.7039)
##AUDIT TRAIL= $$ (NUMBER, WHEN, WHO, WHERE, WHAT)
$$ ##TITLE= Audit trail, XWIN-NMR		Version 3.5
$$ ##JCAMPDX= 5.01
$$ ##ORIGIN= Bruker BioSpin GmbH
$$ ##OWNER= she
$$ F:/spectra/data/she/nmr/H-F/1/audita.txt
$$ ##AUDIT TRAIL=  $$ (NUMBER, WHEN, WHO, WHERE, WHAT)
(   1,<2020-07-30 09:56:12.48 +0400>,<she>,<DPX200>,
      <created by zg, POWCHK disabled, PULCHK disabled
       configuration hash MD5:
       00 E9 B6 7A A2 85 ED C7 34 08 36 98 17 FE 4E 26
       data hash MD5: 16K
       FE 12 E3 17 17 C7 C4 03 BA DA 3B EA 87 D5 55 96>)
$$ ##END=
$$ 
$$ hash MD5
$$ 57 1B B1 2E 15 6F EA B1 19 55 0A 36 06 F2 32 84
##$RELAX= 
##$RELAX= 
##$RELAX= 
##$RELAX= 
##$RELAX= 
##$RELAX= 
$$ Bruker specific parameters
$$ --------------------------
##$DU= <F:/spectra>
##$EXPNO= 1
##$NAME= <H-F>
##$PROCNO= 1
##$TYPE= <nmr>
##$USER= <she>
##$AMP= (0..31)
100 100 100 100 100 100 100 100 100 100 100 100 100 100 100 100 100 100 
100 100 100 100 100 100 100 100 100 100 100 100 100 100 
##$AQSEQ= 0
##$AQ_mod= 1
##$AUNM= <au_zg>
##$AUTOPOS= <>
##$BF1= 200.13
##$BF2= 200.13
##$BF3= 200.13
##$BF4= 200.13
##$BF5= 200.13
##$BF6= 200.13
##$BF7= 200.13
##$BF8= 200.13
##$BYTORDA= 1
##$CFDGTYP= 0
##$CFRGTYP= 5
##$CHEMSTR= <none>
##$CNST= (0..31)
1 1 145 1 1 1 1 1 1 1 1 1 1 1 1 1 1 1 1 1 1 1 1 1 1 1 1 1 1 1 1 1 
##$CPDPRG= <>
##$CPDPRG1= <>
##$CPDPRG2= <>
##$CPDPRG3= <>
##$CPDPRG4= <mlev>
##$CPDPRG5= <mlev>
##$CPDPRG6= <mlev>
##$CPDPRG7= <mlev>
##$CPDPRG8= <mlev>
##$CPDPRGB= <>
##$CPDPRGT= <>
##$D= (0..31)
0 1.2 0 0 0 0 0 0 0 0.06 0 0.03 0 0 0 0 0.0002 0 0 0 0 0 0 0 0 0 0 0 0 
0 0 0 
##$DATE= 1596088571
##$DBL= (0..7)
120 120 120 120 120 120 120 120 
##$DBP= (0..7)
150 150 150 150 150 150 150 150 
##$DBP07= 0
##$DBPNAM0= <>
##$DBPNAM1= <>
##$DBPNAM2= <>
##$DBPNAM3= <>
##$DBPNAM4= <>
##$DBPNAM5= <>
##$DBPNAM6= <>
##$DBPNAM7= <>
##$DBPOAL= (0..7)
0.5 0.5 0.5 0.5 0.5 0.5 0.5 0.5 
##$DBPOFFS= (0..7)
0 0 0 0 0 0 0 0 
##$DE= 6
##$DECBNUC= <off>
##$DECIM= 24
##$DECNUC= <off>
##$DECSTAT= 4
##$DIGMOD= 1
##$DIGTYP= 9
##$DL= (0..7)
0 120 120 120 120 120 120 120 
##$DP= (0..7)
150 150 150 150 150 150 150 150 
##$DP07= 0
##$DPNAME0= <>
##$DPNAME1= <>
##$DPNAME2= <>
##$DPNAME3= <>
##$DPNAME4= <>
##$DPNAME5= <>
##$DPNAME6= <>
##$DPNAME7= <>
##$DPOAL= (0..7)
0.5 0.5 0.5 0.5 0.5 0.5 0.5 0.5 
##$DPOFFS= (0..7)
0 0 0 0 0 0 0 0 
##$DQDMODE= 0
##$DR= 18
##$DS= 0
##$DSLIST= <SSSSSSSSSSSSSSS>
##$DSPFIRM= 0
$$ [...]
##$SUBNAM2= <"">
##$SUBNAM3= <"">
##$SUBNAM4= <"">
##$SUBNAM5= <"">
##$SUBNAM6= <"">
##$SUBNAM7= <"">
##$SUBNAM8= <"">
##$SUBNAM9= <"">
##$SW= 24.9337058887773
##$SWIBOX= (0..15)
0 0 2 0 0 0 0 0 0 0 0 0 0 0 0 0 
##$SW_h= 4990.01996007984
##$TD= 16384
##$TD0= 1
##$TE= 0
##$TE2= 300
##$TE3= 300
##$TEG= 300
##$TL= (0..7)
0 120 120 120 120 120 120 120 
##$TP= (0..7)
150 150 150 150 150 150 150 150 
##$TP07= 0
##$TPNAME0= <>
##$TPNAME1= <>
##$TPNAME2= <>
##$TPNAME3= <>
##$TPNAME4= <>
##$TPNAME5= <>
##$TPNAME6= <>
##$TPNAME7= <>
##$TPOAL= (0..7)
0.5 0.5 0.5 0.5 0.5 0.5 0.5 0.5 
##$TPOFFS= (0..7)
0 0 0 0 0 0 0 0 
##$TUNHIN= 0
##$TUNHOUT= 0
##$TUNXOUT= 0
##$USERA1= <user>
##$USERA2= <user>
##$USERA3= <user>
##$USERA4= <user>
##$USERA5= <user>
##$V9= 5
##$VALIST= <valist>
##$VCLIST= <CCCCCCCCCCCCCCC>
##$VD= 0
##$VDLIST= <DDDDDDDDDDDDDDD>
##$VPLIST= <PPPPPPPPPPPPPPP>
##$VTLIST= <TTTTTTTTTTTTTTT>
##$WBST= 1024
##$WBSW= 4
##$XGAIN= (0..3)
0 0 0 0 
##$XL= 0
##$YL= 0
##$YMAX_a= 250686
##$YMIN_a= -190116
##$ZGOPTNS= <>
##$ZL1= 120
##$ZL2= 120
##$ZL3= 120
##$ZL4= 120
##$ABSF1= 10
##$ABSF2= 0
##$ABSG= 5
##$ABSL= 3
##$ALPHA= 0
##$AQORDER= 0
##$ASSFAC= 0
##$ASSFACI= 0
##$ASSFACX= 0
##$ASSWID= 0
##$AUNMP= <proc_1d>
##$AZFE= 0.1
##$AZFW= 0.1
##$BCFW= 1
##$BC_mod= 2
##$BYTORDP= 1
##$COROFFS= 0
##$CY= 11.3945322036743
##$DATMOD= 1
##$DC= 2
##$DFILT= <>
##$DTYPP= 0
##$F1P= 16.9975609425685
##$F2P= -3.02152046262296
##$FCOR= 0.5
##$FTSIZE= 0
##$FT_mod= 4
##$GAMMA= 1
##$GB= 0.15
##$INTBC= 1
##$INTSCL= 1
##$ISEN= 128
##$LB= 0.24
##$LEV0= 0
##$LPBIN= 0
##$MAXI= 10000
##$MC2= 0
##$MEAN= 0
##$ME_mod= 0
##$MI= 1.114404
##$NCOEF= 0
##$NC_proc= 0
##$NLEV= 6
##$NOISF1= 3.799351
##$NOISF2= 2.8
##$NSP= 1
##$NTH_PI= 0
##$NZP= 0
##$OFFSET= 15.70392
##$PC= 1
##$PHC0= -9798.864
##$PHC1= 17.60092
##$PH_mod= 1
##$PKNL= yes
##$PPARMOD= 0
##$PSCAL= 0
##$PSIGN= 0
##$REVERSE= no
##$SF= 200.130013532006
##$SI= 16384
##$SIGF1= 3
##$SIGF2= 2
##$SINO= 400
##$SIOLD= 16384
##$SREGLST= <1H.CDCl3>
##$SSB= 0
##$STSI= 0
##$STSR= 0
##$SW_p= 3612.71676300578
##$SYMM= 0
##$S_DEV= 0
##$TDeff= 0
##$TDoff= 0
##$TI= <>
##$TILT= no
##$TM1= 0
##$TM2= 0
##$TOPLEV= 0
##$USERP1= <user>
##$USERP2= <user>
##$USERP3= <user>
##$USERP4= <user>
##$USERP5= <user>
##$WDW= 1
##$XDIM= 8192
##$YMAX_p= 0
##$YMIN_p= 0
$$ End of Bruker specific parameters
$$ ---------------------------------
##NTUPLES= NMR FID
##VAR_NAME=  TIME,          FID/REAL,        FID/IMAG
##SYMBOL=    X,             R,               I
##VAR_TYPE=  INDEPENDENT,   DEPENDENT,       DEPENDENT
##VAR_FORM=  AFFN,          ASDF,            ASDF
##VAR_DIM=   8192,          8192,            8192
##UNITS=     SECONDS,       ARBITRARY UNITS, ARBITRARY UNITS
##FACTOR=    0.0002004,     1,               1
##FIRST=     0,             0,               0
##LAST=      1.6414764,     0,               0
##MIN=       0,             -190116,         0
##MAX=       1.6414764,     250686,          0
$$ Real data points
##PAGE= N=1
##DATA TABLE= (X++(R..R)), XYDATA
0@%%%%%%%%%Qj6J6j6J6k4L2l3M1m9N7p2Q4r6J10j28J50j70J93k21K49k82L19l57
33a89M00m47N01n58O20o87P61q46R36j037J149j271J409j564J737j934K161k424
51a283K736l110L569m149M906n946P473r957J4847m0485J52166Q9637j32761l3084
65D4559k768j08971j22936P5023J36678K5207j1783P5682K6785j16912j28931
76a08367j0343K7340K2109P8320J17335K3559p8478q0330m9581n5336j7582P4753
88e6601J13696N6390p558l1509n0494p9289p1029p626P3481J10362P8770O067
100A34660n3483q7146r0766m0526M3507Q4625O1517L5688K1571l1422q7924p0072
112g9771j3726K095K4779R8099J08017r195r6897n3633j8829o3324l5460R6148
$$ plain form
0 0 0 0 0 0 0 0 0 0 0 8 -8 8 -8 8 -16 16 -17 24 -25 32 -40 44 -52 58 -70 80 -90 103 -118 131 -151 168 -189
33 -189 211 -236 265 -293 327 -360 401 -445 491 -546 603 -668 741 -823 914 -1020 1141 -1283
51 -1283 1453 -1657 1912 -2237 2669 -3277 4196 -5761 9086 -31399 120767 210404 77643 44559
65 44559 41791 -67180 -190116 -115093 21585 46792 35009 110691 137476 20564 -108367
76 -108367 -118710 -91370 -69261 9059 126394 149953 71475 -8855 -58436 -113772 -131354 -56601
88 -56601 57095 113485 105927 74418 23924 -55365 -126394 -134020 -60539 49823 128593 134660
100 134660 81177 -5969 -96735 -137261 -93754 -9129 52388 88076 109647 78225 -9699 -79771
112 -79771 -93497 -91402 -66623 31476 139493 130298 33401 -20232 -39061 -102385 -137845 -41697
124d1697J30064J9153l9030j84l2354j20599p3343O9550R6795L1628L4041N0233
136A24257l9481j22307o2956J9726R695J3744R2402R8163j8256q9222m8150k6180
148d8565n3006j1907Q5736J00151K9223j7511k6712n8822q2685l5091L8975P1031
160i183O3803M0413q92m6934o4994n4021k7739J5559O2532P5687M5950l444m9657
173D7080p3783n2668q395J8071L9084P1256O7772m537o9147o1543l5534l6584
185i8928m7Q4122R9841J6628m1949k5979l2499p4373m5447M9227P9777L9756K3556
198G3685K1814l8963r5054n5138J7723K7036K3582O2996O8321r884p3539n4528
210c1949k5409k7918K369O9014Q4040K6382k5025l7206n0244n8897k4233L4925
$$ plain form
124 -41697 88367 107520 68490 68306 35952 -84647 -157990 -88440 8355 39983 74024 124257
136 124257 84776 -37531 -100487 -80761 -71066 -57322 35080 133243 114987 25765 -22385 -48565
148 -48565 -101571 -113478 -27742 72409 101632 84121 57409 -1413 -84098 -119189 -80214 -9183
160 -9183 54620 95033 94141 47207 -17787 -71808 -99547 -83988 -21456 54231 100181 96737 47080
173 47080 -26703 -79371 -87766 -69695 -30611 40645 108417 103880 34733 -26810 -62344 -98928
185 -98928 -98975 -14853 84988 101616 59667 33688 1189 -73184 -118631 -69404 10373 50129 73685
198 73685 95499 56536 -38518 -93656 -75933 -48897 -25315 37681 106002 96118 22579 -31949
210 -31949 -57358 -85276 -82907 -13893 70147 96529 71504 34298 -15946 -74843 -99076 -64151
222f4151O5660N8068L0957r485n1427o3701m0703m719K5274M8602N6003L6792
234H7170n994m9580o3891m1898n245K3231M7147O4088M0939k0285o0244m6260
246c0822k5509k3127O039O6046P9128K0268l0761l6543m4383n7326k0134M9584
258d7540O6951L2841J6323O000l9487p6005m1074J5287K7299K8153N6016N0988
270I5752j7490o9087m9347j7899j4438R196O2271P1763J6424l2174l9411m1258
282b5698m3438j2513L6348N5043M2282K3234m406m5215o5297l8164N397L0946
294d1481M5098N2770L0507k2218n8318m8882j9750j453J7263M6520N8443K5611
306H4110k5653m9578m2468l0130j1866K6276O1303N3556J1887k4413m0550m7133
$$ plain form
222 -64151 1509 59577 90534 81049 29622 -34079 -74782 -79501 -54227 -5625 50378 87170
234 87170 81176 31596 -32295 -74193 -79438 -56207 -9060 55028 95967 75682 15438 -30822
246 -30822 -56331 -79458 -73419 -7373 71755 92023 61262 24719 -19664 -76990 -97124 -47540
258 -47540 19411 52252 68575 74575 35088 -40917 -81991 -66704 -39405 -11252 44764 95752
270 95752 78262 9175 -40172 -58071 -72509 -63313 -1042 70721 87145 54971 15560 -25698
282 -25698 -69136 -81649 -45301 9742 52024 75258 70852 25637 -39660 -77824 -72427 -41481
294 -41481 3617 56387 86894 64676 6358 -42524 -62274 -63727 -46464 56 58499 84110
306 84110 58457 8879 -33589 -63719 -75585 -49309 11994 65550 77437 53024 12474 -34659
318c4659l7605m06L9223M8964L6119J9927q755m8129n9105k7260J0120K6405L9891
331D730N2497K8189k7930n9109m1600j5979l236K1448N3005N2065J0890k7575
343D7395l9527m2108l3827k371L7872N2324L8420J3637j7575m8085n2605k3018
355f9468J2804L0537L8668M1551K0736k2260n1294m3346k0295J657K5780N0103
367A5173M9092J2056l1255m7825m0331k0823N148L3538M6063L4769R601j8441
379D6765m1316m7212k6375Q968L4406M3221L8283J5597k3445n3319m6036j4041
391f4504J4392K7717L9093M0137J3258k7409m8906l7756j4646N279K6072M5035
403A7762M2179J0855k8646m7842m0891j7914J0738L5123M3989L2510M733k5088
$$ plain form
318 -34659 -72264 -72670 -33447 15517 51636 71563 62808 14679 -44426 -71686 -61566 -35161 4730
331 4730 57227 85416 57486 -1623 -43223 -59202 -62438 -40990 12015 64080 74970 47395
343 47395 7868 -34240 -68067 -70438 -32566 19758 58178 71815 54240 6155 -46450 -69468
355 -69468 -56664 -26127 12541 54092 74828 52568 1274 -42072 -62367 -60710 -34930 15173
367 15173 64265 76321 45066 -2759 -43090 -63913 -58765 -25227 20836 55605 65206 46765
379 46765 5449 -41763 -68138 -59170 -24764 18457 56740 72337 48892 -4427 -50463 -64504
391 -64504 -50112 -22395 16698 56835 70093 42684 -6222 -43978 -58624 -53345 -27273 17762
403 17762 59941 70796 42150 -5692 -46583 -64497 -53759 -18636 25353 57863 62596 37508
415C7508m2856l8295j6503Q892K9388M1180L8685J1713k8909n1903l9711j0097
427f0908J3844K9646M1158L4241M826k8829m3189l4016j5756Q069L2211M4553
439B5850L3117L592k7781m4855l7491j3595J3870L3333M0991L1319K951k9881
451C1420m4402l4334r954J3400L0597L8384K9554N069k4867m3907m0006j4460
463f3506J7634L7552L8931K6648J132k9984m4636l2125n683J4762K7570L6156
475B4451L1494M057k9813m4896l3845r475J5964L4594L8817K5187r95k8176m3017
488a5653l3788p276J9725L2633L3187K4153J974k8121m3243l0853n774J4290K8861
501i885L8709L0714j316l5738m4697k6988l236J7091L3132L5215J9322m993k4434
$$ plain form
415 37508 -5348 -43643 -60146 -51254 -21866 19314 57999 69712 40803 -11100 -50811 -60908
427 -60908 -47064 -17418 23740 57981 62807 33978 -9211 -43227 -58983 -50914 -18703 25850
439 25850 58967 62559 34778 -10077 -47568 -61163 -47293 -13960 27031 58350 61301 31420
451 31420 -12982 -47316 -57270 -43870 -13273 25111 54665 59734 34867 -9040 -49046 -63506
463 -63506 -45872 -8320 30611 57259 58391 28407 -16229 -48354 -54037 -39275 -11705 24451
475 24451 55945 60002 30189 -14707 -48552 -58027 -42063 -7469 31348 56535 55540 27364 -15653
488 -15653 -49441 -56717 -36992 -4359 28828 52981 54955 26834 -16409 -47262 -53036 -38746 -9885
501 -9885 28824 59538 58222 22484 -22213 -49201 -52437 -35346 -2214 33001 52323 47330 22896
514B2896l5210l3469j2523J8904L8708L4763J8802k497k6887m3791l2314K81K3675
527b8662K7857K8175K4134J740l1722m3969k5760j031J5634K9451L7280K2890
539E6017p671l1141l6129k8208p812K0956L9109L2245J1662o464k3198l7144l2184
552d9962k333K4988K9932K5609K1754K659l2585m8515k5579Q563K1751K5212K9335
565C0829K1638p992l3105l2704j9883p391J2661L7568L9405J2313j4930k5818
577A2591l1742l0062m904K8931L7489K1240Q728Q73k3438m5116k9540Q846K7625
590a8479K4354K3329K1196m497l5738l8280j7577J644J7460L2613L3703J1113
602E0841j5740k7413k8463k4338l314K5276L4789K2987Q953l070k4277m2154k8508
$$ plain form
514 22896 -12314 -45783 -58306 -39402 -694 34069 52871 50374 23487 -20304 -52618 -52337 -28662
527 -28662 -805 27370 51504 53244 21522 -22447 -48207 -49238 -33604 -4153 33127 56017
539 56017 48346 17205 -18924 -47132 -54944 -33988 5121 37366 49028 42564 19366 -17778 -49962
552 -49962 -52295 -27307 2625 28234 49988 52647 20062 -28453 -54032 -45469 -23718 1494 30829
565 30829 52467 44475 11370 -21334 -41217 -48608 -35947 1621 41026 53339 38409 12591
577 12591 -19151 -49213 -54117 -25186 12303 33543 42271 43144 19706 -25410 -54950 -46104 -18479
590 -18479 5875 29204 50400 45903 10165 -28115 -45692 -44048 -26588 6025 39728 50841
602 50841 35101 7688 -20775 -45113 -48427 -23151 11638 34625 43578 40508 16231 -25923 -54431
615e4431Q461L0401K7184J9520J4852m012l2439m0385j7016Q161J9710K6331L0342
628C6679J5431j6992l5157k7404j1878j402J6474L4143K9760N081j4398k1351
640H986k9800k8927p24L4681L7251J3568J530l163k2483l9509k2025J2955K5625
653a2035J9515K1996J8914r276l7050l3499j2012M104J8442L4025K9725L329k0318
666B5860k5836k5880j9972M201L0973L0695J2019J542k779k0480l6618k2886R801
679c9360K7149K5323K0680J2421j2009l6575l3386q237J3260J9571K2120K3484
691C4441R447j6111k9984k4510j2538j95J9711L7097K6756k710k0947k0964k3284
704b3791k3524L633L6865L4743P235n661m143j9415l7356j7832J9236K7687J4551
$$ plain form
615 -54431 -45970 -15569 11615 31135 45987 41975 9536 -30849 -47865 -39704 -19994 6337 36679
628 36679 52110 35118 -39 -27443 -39321 -40723 -24249 9894 39654 44735 30337 8986
640 8986 -20814 -49741 -50465 -15784 21467 35035 36565 33402 10919 -28590 -50615 -37660 -12035
653 -12035 7480 29476 48390 39114 2064 -31435 -43447 -39343 -20901 13124 42849 46178 25860
666 25860 24 -25856 -45828 -41627 -10654 20041 32060 33602 30823 10343 -26275 -49161 -39360
679 -39360 -12211 13112 33792 46213 34204 -2371 -35757 -43994 -30734 -11163 10957 34441
691 34441 43888 27777 -2207 -26717 -39255 -39450 -19739 17358 44114 41404 20457 -507 -23791
704 -23791 -47315 -43682 -6817 27926 35161 29500 25357 5942 -31414 -49246 -30010 -2323 12228
717A2228J4497J6342r310l8219l1736l752J0024J6725K8763K6856m92k4302k3998
730f374j7827j5677J331K9178L4344J2034m795r518k0995l2585j6612J6144L0319
743a033K0170J1472P924j1252l3542l0559l935J5427J9166K2358K1784K140k3208
756A6912k9033j4690n341k77J9335L5402K0612j0633k0796j3311j9212k3315M041
769d0306L9428L2607M73p580j203k0197l9621j4218K7798L0760Q832Q872J3013
782C8658j3492l8901k3384N202R828J1108K8147K7177o681l0089j9666j0614j3640
795c6347J875L3394L2276J777j1768m165j4876l3335j5849K2196L0987J2909R063
808B8137Q907j3887l8138k5156O388J6261J3575K1978K2264n038k9615k1986o118
$$ plain form
717 12228 26725 43067 33757 -4462 -36198 -39950 -29926 -13201 15562 42418 41926 17624 -6374
730 -6374 -24201 -39878 -38547 -9369 24975 37009 32214 22696 1701 -30884 -47496 -31352 -1033
743 -1033 19137 30609 38533 27281 -6261 -36820 -40755 -25328 -6162 16196 37980 40120 16912
756 16912 -12121 -26811 -32152 -32429 -13094 22308 42920 32287 11491 -1820 -21032 -44347 -40306
769 -40306 -878 31729 32202 24622 23419 3222 -36399 -50617 -22819 7941 16773 25645 38658
782 38658 25166 -13735 -37119 -31917 -22089 -10981 17166 44343 37662 7573 -12093 -22707 -36347
795 -36347 -34472 -1078 31198 32975 21207 17042 2166 -31169 -47018 -24822 6165 19074 28137
808 28137 37044 23157 -14981 -40137 -33749 -17488 -3913 18065 40329 35291 5676 -16310 -22428
821b2428o933k303K4553L7423R856j7372j5105j0219k3178k0737J7118M1144J9035
834C0854o792k688j090k4832l3684j630K5810J8668Q873J7664R784k5053l8295
847b2411j3528Q636P466J5225L0988J7596j8772k7313r316p757j5629N841L4466
860E492K6845l958r935l103j8935l2049o836K7363K6052Q877P757N454j9634l3795
874b0405j4146Q676R691J2661K6215J9100j3308k9449j5611o124r020N258L2125
887E663K9287k705j7880q246j0250k4262j2547K2188L2353J2416q67n51j0810
900A3789k9639k2208P174K1868J5708J2283J2524l174k3799k3706o931m7N295
913b0863K0946K9393R272j7686k2109j3188j2567o993J6300L0872J6293n719q629
$$ plain form
821 -22428 -29361 -31664 -7111 30312 40168 22796 7691 -2528 -25706 -46443 -29325 11819 30854
834 30854 24062 21374 20284 -4548 -38232 -39862 -14052 4616 13489 31153 40937 15884 -22411
847 -22411 -35939 -27303 -19837 -4612 26376 43972 25200 -2113 -11429 -19186 -34815 -28974 5492
860 5492 32337 28379 18444 15341 -3594 -35643 -42479 -15116 10936 19813 27570 33024 13390 -20405
874 -20405 -34551 -25875 -16184 -3523 22692 41792 28484 -965 -16576 -22700 -31720 -26462 5663
887 5663 34950 32245 14365 6119 -4131 -28393 -40940 -18752 13601 26017 25150 24599 13789
900 13789 -15850 -38058 -30884 -9016 6692 18975 31499 28325 4526 -19180 -26111 -26158 -20863
913 -20863 83 29476 38748 21062 -1047 -14235 -26802 -33795 -17495 13377 29670 23951 15322
926A5322o968j7246k1883k533J9687K1323J3950R594k087k3830k9325r612Q490
939b5118J4135J7334K0529O725j6607k1392j0138n145q184O324K8576K4574r18
952C0695j5037j1941j5299k0304l302K4343K8595Q560m207m493j1808k1599j5287
965c1084N237J6131J5496J5967J1169p849k5571k2907o982N643J3862K1789J9114
978C0015l06j7805j6270r666q435l963J1904K4868J7293j54j0646j4846j8623
991a6634j4948K910K1423K1821J1072r0q529j7993j8897p440O045J2090J6331
1004G161J8486O332j4757k2869j3810m930p15J2509K7212J8216o926j8181j0967
1017c239r647j3313j215K0301K3548P178j978m485j4707k3725j1144J0515J8530
$$ plain form
926 15322 8354 -8892 -30775 -33308 -13621 7702 21652 31246 29159 5329 -23996 -33608 -25118
939 -25118 -10983 6351 26880 33605 16998 -4394 -14532 -19677 -27861 -21537 7039 31613 30695
952 30695 15658 3717 -11582 -31886 -35188 -10845 17750 26310 22103 17610 5802 -15797 -31084
965 -31084 -25847 -9716 5780 21747 32916 25067 -504 -23411 -30393 -24750 -10888 10901 30015
978 30015 29709 11904 -4366 -14032 -22467 -26430 -14526 10342 27635 27481 16835 1989 -16634
991 -16634 -31582 -28672 -7249 14572 25644 25554 17025 -968 -19865 -27305 -21260 -9170 7161
1004 7161 25647 31979 17222 -5647 -19457 -24387 -25102 -12593 14619 32835 25909 7728 -3239
1017 -3239 -12886 -26199 -27414 -7113 16435 23613 21635 17150 2443 -21282 -32426 -21911 -3381
1030c381J4744J2924M768j3736k3125j3385j087K696R071K1095J9286j846j8717
1043I307j5638j0364q141R1J8000K3410J0528n341j0881j2901j5942j0576O137
1056b2311J8911J7854R900p6j0769j8526j6534l791O876J3247J6957J4963O26
1069B7327j6714j9847j0363k525J660J3347K2439J3749o406j5675j2333j1082
1081a6423j0053M287K0677J9607N099l131p664j6132j8574m848J0739J4818J3597
1094A1999J3135K366j7585k2437r547K042M285R807J9360J4468m990j6865j3317
1107g279r866p908M290J9147K0703P147o360j2563j5453j2387l031Q731J4091
1120g38J5012R834j444j4148j8010j1014j906O080J3859J7903J2126m651j7790
$$ plain form
1030 -3381 11363 24287 29055 15319 -7806 -21191 -22278 -19582 -10511 10584 29870 28024 9307
1043 9307 -6331 -16695 -24836 -24745 -6745 16665 27193 21852 10971 -1930 -17872 -28448 -22311
1056 -22311 -3400 14454 24354 24278 13509 -5017 -21551 -25342 -18466 -5219 11738 26701 27327
1069 27327 10613 -9234 -19597 -22122 -20462 -7115 15324 29073 22667 6992 -5341 -16423
1081 -16423 -26476 -22189 -1512 18095 23194 20063 12399 -3733 -22307 -27155 -16416 -1598 11999
1094 11999 25134 27500 9915 -12522 -22069 -20027 -15742 -5935 13425 27893 22903 6038 -7279
1107 -7279 -17145 -25053 -20763 -1616 19087 26234 19874 7311 -8142 -20529 -23560 -14829 -738
1120 -738 14274 24108 22664 8516 -9494 -20508 -22414 -16334 -2475 15428 27554 22903 5113
1133E113j7062q153r00N809J4184J8115Q489o770j4625j1972r410n845N071J7732
1147b24J8347P057n594j2617j7018j2778j42J1759J4130J1508P750k051j4533
1160E594j6863q098j54M830J3011J8864R987p811j6975j3101q019l005P631J6886
1174B777J5111M765n525j1901j5229j1226J55R750J3184J3595P736l698j5798
1187C696j6235q130J006Q037J3719J5036P101p075j5173j3588p239k89O661J3986
1201A513J5483P639o483j6032j5242p297P64R185J4782J3285L961o344j3060j3092
1215a0938q896k43R114J3927J3915O467n890j6069j5754o069K920Q121J3323J3476
1229A7404N610q189j4401j3116o284P02Q827J3818J2514M938n694j4057j5471
$$ plain form
1133 5113 -11949 -20102 -21002 -15193 -1009 17106 25595 18825 4200 -7772 -17182 -23027 -17956 -224
1147 -224 18123 25180 19586 6969 -10049 -22827 -22969 -11210 2920 14428 22178 20127 5594
1160 5594 -11269 -19367 -19521 -14691 -1680 17184 27171 19360 2385 -10716 -18735 -21740 -14109 2777
1174 2777 17888 22653 17128 5227 -10002 -21228 -21073 -11323 1861 15456 23192 19494 3696
1187 3696 -12539 -20669 -19663 -11626 2093 17129 24230 17155 1982 -11606 -18845 -19134 -12473 1513
1201 1513 16996 24635 18152 2120 -13122 -20419 -19655 -10470 4312 17597 21558 15214 2154 -10938
1215 -10938 -19834 -20077 -10963 2964 16879 23346 17456 1387 -14367 -20436 -17516 -9395 3928 17404
1229 17404 23014 14825 424 -12692 -18976 -18274 -9447 4371 16885 21823 16129 2072 -13399
1242a3399q002K963J0163J3939J2375M292p715j5726j2716m537K304P548J2428
1255C917J2547N031n800j4705j4964p170L934J0403J2653J1439M210p533j5873
1268a911j2876l275K998O861J2507J3814L966r151j4458j1571n389R40R584J5540
1282G579J1019P53p342j2817j2941o569M758J1545J1024Q153L886m478j4761j4647
1296a4838n006M755R021J1774J2559L899r954j6622j0611k467L566Q516J2524
1309G116R736J298o861j1904j2290p188L757J2422J2103Q009K873n928j5620j5108
1323a7585k418Q046R322Q230J0418M626r812j6366r303k09K188N583J3958J2557
1337A9235O31j0963j2512r494o151K848J3360J4464N428j926n412j1135j3548
$$ plain form
1242 -13399 -21401 -18438 -8275 5664 18039 22331 14616 -1110 -13826 -18363 -16059 -8511 3917
1255 3917 16464 21495 15695 990 -13974 -21144 -17210 -6807 5846 17285 21495 13962 -1911
1268 -1911 -14787 -18062 -15064 -8203 4304 18118 22084 12933 -1525 -13096 -18485 -17545 -7961 7579
1282 7579 18598 19351 12009 -808 -13749 -20318 -15560 -4015 7009 15162 19048 14570 -191 -14838
1296 -14838 -19844 -15089 -6068 5706 18265 22164 12210 -4412 -15023 -17490 -13924 -5408 7116
1309 7116 16852 18150 11289 -615 -12905 -20093 -16336 -3914 8189 16198 19071 13143 -2477 -17585
1323 -17585 -20003 -11957 -2635 5595 16013 20639 10827 -5539 -14842 -15051 -12863 -7280 6678 19235
1337 19235 19866 8903 -3609 -13103 -19254 -16406 -3046 11418 16846 14920 9508 -1627 -15175
1350a5175m972P240J1602Q567P172M624o183j7615j3075k81P486P713J0102J0704
1364A7909J371j1243j3945p940k573K772J0081J3508P697j467p597j1238j2770
1377a5435m725Q195J2887Q233N084K673o708j5753j1637Q73P348O419Q525J1551
1391A7530K732j2110j6036p945j81M252R574J4016O983m596j0569q697o991m549
1405a6587M310J1354J0918N006K5n560j2716j4104l117J0205J2907Q587M293n04
1419A5017q647j3542r098K020O654P174P468Q316J414q931j4133r934j689P001
1433a0910J1240J2225M937l922r828j0698p989n45P508R619O898M065K194o162
1447H632j3972j1806m05Q275J0356R302P553j741j2672j4416n153L158O092P116
$$ plain form
1350 -15175 -20147 -12907 -1305 7262 14434 19058 12875 -4740 -17815 -18096 -10610 -2897 7205 17909
1364 17909 19280 8037 -5908 -13848 -16421 -13649 -3568 9940 17637 16170 8573 -2665 -15435
1377 -15435 -20160 -11965 922 9155 14239 16912 10204 -5549 -17186 -16313 -8965 -2546 5979 17530
1391 17530 20262 8152 -7884 -15829 -16010 -11758 -2184 11832 18815 14219 3650 -5047 -12038 -16587
1405 -16587 -12277 -923 9995 15001 15026 9466 -3250 -17354 -20471 -10266 2641 11228 15521 15017
1419 15017 6370 -7172 -16270 -14250 -7596 -422 7046 15362 16776 7845 -6288 -16222 -17911 -10910
1433 -10910 330 12555 17492 13570 3742 -6956 -14945 -15490 -7982 1637 8535 12600 14794 8632
1447 8632 -5340 -17146 -17551 -9276 1080 10382 17935 16194 3522 -10894 -16047 -12889 -6797 319
1461C19R648N482k731q884r304p179m018M659J3404J2104L058n064p205j0593
1475f304j0485j071J1592J2197M665P34J166n044j4097j1401K694J0068P441O245
1489H400P547P8j2602j4321m757L266N417Q321J0897M378o081r358p433o973k670
1504a5891P235J3153P287J298r27n490j4389j1173K713J2608Q836N058M628j015
1518A3931j3051j3609k262N311M851N797J0073N100o057j0280o125m631m367M744
1532a0575J5024J0834j176n471m555r929j2447J89J5310J2457R26j142K235o106
1546E574j5715q048O703R337M070O989Q537l126j6543j1352J11L477M692R412
1560D118J0050m10q653n947l473p515m135R286J2963N300o57J38n247j5311j0580
$$ plain form
1461 319 9967 15449 12718 3834 -5470 -12649 -16667 -12008 1396 13500 16558 11494 4289 -6304
1475 -6304 -16789 -17860 -6268 5929 10594 11328 12494 7450 -6647 -18048 -15354 -5286 2155 8400
1489 8400 15947 16025 3423 -10898 -15655 -12389 -6972 1349 12246 16624 10543 1185 -6248 -13221 -15891
1504 -15891 -8656 4497 11784 13082 12155 6665 -7724 -18897 -16184 -3576 5260 10318 14946 13931
1518 13931 880 -12729 -14991 -9680 -4829 968 11041 16141 10084 -196 -6321 -10952 -15319 -10575
1532 -10575 4449 15283 14107 8636 4081 -5848 -18295 -18106 -2796 9661 10587 9445 11680 5574
1546 5574 -10141 -18189 -11486 -2149 1921 8910 17447 14321 -2222 -13574 -13463 -9986 -5294 4118
1560 4118 14168 13758 5105 -842 -4315 -11830 -15965 -6679 6284 11584 10927 11065 5818 -9493 -20073
1575b0073O228J2707P330M229M137l329j3553j1418J047M971K919P434J0599K129
1589A5357q765q768m715n270k858Q764J5653N425n672m320j763q987j0970K096
1603a4793J4210Q657N25K246J830j0427j6423l896R428Q699M300O123M813o608
1617H684j3333n968L68L29M108J1648R584l136q340m984n144p856j97J2453J1858
1632A0074J265k367q51o031j2942n924P411R761M857M939M032m652j3195r225
1646a2848j97M147N808J0462Q196l559j0229n920j842m939q30Q415J2473L237
1660A2374l839k293m096j1415q592N420J4820P496l80M38j091j0372j1972j051
1674a4553Q140O954M581O037K571q292j1317m503J94O88N813J2389O209n051q013
$$ plain form
1575 -20073 -13845 -1138 6192 10421 14558 11229 -2324 -13742 -12695 -7724 -4805 2629 13228 15357
1589 15357 6592 -2176 -6891 -12161 -15019 -6255 9398 14823 9151 4831 3068 -5919 -16889 -14793
1603 -14793 -583 8074 8599 10845 12675 2248 -14175 -18071 -8643 56 4356 10479 15292 8684
1617 8684 -4649 -10617 -10249 -9920 -5812 5836 15420 12284 3944 -1040 -6184 -14040 -14237 -1784 10074
1632 10074 11339 8972 8121 2090 -10852 -16776 -9365 396 5253 10192 14224 9572 -3623 -12848
1646 -12848 -13045 -8898 -3090 7372 15568 12009 1780 -4140 -5982 -10921 -11751 -3336 9137 12374
1660 12374 8535 6242 2146 -9269 -17861 -12441 2379 9875 9495 9933 8842 -1530 -13502 -14553
1674 -14553 -6413 541 5122 11159 13730 5438 -5879 -10382 -10188 -9500 -3687 8702 14911 9860 1847
1689A847m150n033o234K160J2373R138n95j801l84o903j2015m235P632R650O084
1704G534M319R17p884j1196n020J361K722N784R381N630l877p727n132m280n281
1719a2749J844J1415J0540P93n188l132m496q807n327O818J1187N712M76L63l072
1734F377r944r395M8O988O992N780N647o76r190r982l090J100K127P113R842L112
1750A2849n909n993k806n187o387L204J2379R144k60l098l757p751q717m50Q121
1765d618P679M181K922J73p050r270m080n00L259P282R793M264n968q524m664
1780e121l150l021L566J0603Q037n16m546l450n012p426k941O409R919N575J345
1795A0271j362n423r449o736K229O885O413N354L030k063q440p460k109l30K017
$$ plain form
1689 1847 -2303 -7336 -13570 -11410 963 10101 9506 7705 7321 418 -11597 -15832 -8200 1450 7534
1704 7534 11853 12770 4886 -6310 -11330 -9969 -7247 -1463 7918 13548 9671 1944 -3188 -7468 -12749
1719 -12749 -10905 510 11050 11843 6655 3523 -973 -9780 -15107 -8289 2898 8610 9086 9449 6377
1734 6377 -3567 -12962 -12914 -5926 1066 6846 12493 11817 2627 -7355 -10445 -9345 -7218 -105 9737 12849
1750 12849 6940 947 -1859 -7046 -13433 -10229 2150 11294 11034 7936 4179 -3572 -12289 -12739 -4618
1765 -4618 3061 7242 10164 10337 3287 -5983 -10063 -10563 -7304 -22 9771 14035 8067 -457 -5121
1780 -5121 -8271 -11292 -7726 2877 10914 10398 5852 2402 -2610 -10036 -12977 -6568 3351 8926 10271
1795 10271 8909 3486 -5963 -12699 -10470 -3585 2828 8182 11212 9149 709 -6751 -8860 -9190 -7173
1810g173Q022R845K748o880p369l772m114k582M919J0465O130j500k676l225o943
1825d105p502o0P708P366M899K270k054q071q032k325J935K865O473Q381K532
1840A2280o246o847m376l377k135M110J0937P037j106n458m414n031n844k47O898
1855c819Q666L708O55k013n692p993m780K130N970O441O141K399m969q837n602
1870g595p58L59L362P276P891L85o047n931l864m119k018O383J0889M717k293
1885H637m051m303o864m385K529O509N529M275K118l013p869p199j389K004L290
1900d182P361P901j8p243o901k677k192p95M915R105N153j563m362m612n591n248
1916a0949J688P397P365L994k74m190o994o022j500L249M145N851N084J234m858
$$ plain form
1810 -7173 849 10694 13442 6562 -807 -4579 -8693 -11275 -6356 4109 10239 8739 6063 2838 -4105
1825 -4105 -11607 -11667 -3959 3407 8306 10576 8522 451 -7581 -9906 -7971 -5106 1367 9748 12280
1840 12280 6034 -813 -5189 -8566 -10701 -6591 4346 11383 10277 4819 405 -4626 -10470 -10717 -3819
1855 -3819 4847 8555 9210 7197 1505 -6488 -11268 -9138 -3168 3273 9414 11813 6844 -1993 -7595
1870 -7595 -8353 -7994 -4632 2644 10535 10920 4873 -1058 -4922 -9041 -11059 -4676 6213 10930 8637
1885 8637 4586 283 -6581 -10966 -8437 -1928 3601 7876 9994 6981 -888 -8087 -9476 -7472 -4182
1900 -4182 3179 11080 11062 3819 -3082 -5759 -7951 -8746 -3831 5274 10427 8864 4502 -110 -5701 -10949
1916 -10949 -9261 -1864 5501 9495 9221 5031 -1963 -7985 -9485 -6236 -2091 3760 8844 10078 5220
1931E220p611m100k009P3M600Q816O567j720p095n449l269l027J057O231P489
1946E773L394j452k793o000o301l140L302O081N933M324P53n402q338m241N92
1961g515J579L495O708O041o06o949n861l300j859K21O108Q084M308k329n065
1976C060n743m305j699K178N599N892M197on108o984m490j239J723N638O915M733
1992A0361j732o491o222l091n43J619N339O519L312j374m814n617m327j553J937
2007f677O066O407L774j002n907o407m346l40L182M982N290M185j162n453o305
2022c713l599p20K253N046O408M259j688o286o529l445J48K774N223N760L771
2037I662k081o454n607k617J39J706M566O677L699k263n887n079l223j902K949
$$ plain form
1931 5220 -2391 -6491 -8500 -8427 -3827 4989 11556 9836 2741 -2708 -5977 -9004 -7947 -1716 5773
1946 5773 9167 7715 4922 -1078 -7379 -10519 -7217 -1136 4797 9121 9874 4472 -3866 -8107 -7515
1961 -7515 -5936 -2441 4267 10308 9702 2753 -3108 -6408 -8267 -8046 -1938 6146 10454 8125 3060
1976 3060 -2683 -6988 -8687 -6509 -910 4982 9179 9173 4065 -2919 -7409 -8648 -6925 -1287 5628 10361
1992 10361 8629 2138 -4084 -7175 -7718 -6099 -760 5759 9071 7697 2883 -2734 -7061 -8614 -6677
2007 -6677 -611 5796 9570 8568 2661 -3746 -8092 -8432 -5250 -268 5022 9207 8045 2592 -3713
2022 -3713 -7312 -8032 -5779 -733 5675 9934 8246 1960 -4569 -8014 -7866 -5092 131 5891 9662
2037 9662 7581 1127 -4480 -7097 -6958 -5252 -686 5991 9690 7427 1540 -3539 -6762 -8664 -5715
2052e715O290O328K204k047n164n705m848M10M170N015M660L412j125o070o749
2067d934k834O13K804M308O434L356k674o692n200k398j0K776N960N210J740k402
2083F057m756n391l849O45L806M501L973L746o32o433p479k690K058K853L474
2098a17O499L768l390p577m529j196m68J788O248P018R66m249m906l793l702l69
2114h009M919O254L379N11j410m352o828l254K793M091K855L969L555j292o738
2129D43o269j391P96K016N362O777J771l979o150m911k332P05M453O214K977P31
2145G213k179m297n934l148K188M331L534L778L335k145p511o441R6K325K147
2160b708M176N639J669m663n794k946j139n62K326O177M961N73k501m701n409
$$ plain form
2052 -5715 575 6903 9107 7060 1896 -3809 -8657 -8247 -4077 938 5598 9010 7885 1815 -4934
2067 -4934 -7768 -7155 -4351 -43 6391 9747 7073 381 -4819 -7217 -7227 -4451 1509 6719 8459 6057
2083 6057 1301 -4090 -7939 -7294 -3488 1013 4986 8732 8100 1667 -5812 -8502 -6444 -3591 -117
2098 -117 6382 10150 6760 -817 -5346 -6542 -7010 -5222 1026 8044 9010 4761 -145 -3938 -7640 -8009
2114 -8009 -3090 3164 6543 7054 5644 1292 -5536 -8790 -5997 -1906 949 4918 8473 7181 443
2129 443 -5826 -7217 -6421 -4405 957 7734 9505 5526 -624 -5535 -7867 -7162 -2709 3505 6482 7213
2145 7213 5034 737 -5197 -8345 -6157 -1826 1708 5486 8821 6676 -835 -7276 -7180 -4855 -2708
2160 -2708 1468 7107 8776 4113 -1681 -4627 -5766 -6328 -4002 2175 7136 7709 5208 507 -4902
2175d902m201J386O005N996K863K52k496n542o263j250L700L761L066L358J900
2190G633k395o048n204j331J565L598M572M365J440l562o102m693j252K265M209
2205i40M359K656O74k239m808n238j758J793L402M570M098J889l123p054n462
2220g181p10L036L775M515L518K54l948n531m125N2J709L052N044L325J30l831
2236C084m939l455j877J442M669N566K042p78k236m209m990k798L618N320K972
2251C431J853J308j305o624o614N62L991K970K670M151J790m574o654l249J77
2266f117J332L371N582M050j506n181m100l254j202K292N473L573M85L62r07m934
2282f81o008j077M038L599K823L807J699m484p680l321J690K369K331M909L298
$$ plain form
2175 -4902 -9103 -7717 -1712 4284 7147 7399 4903 -639 -6902 -8152 -4452 -691 2375 5733 7633
2190 7633 5238 -810 -6014 -7345 -5780 -2182 2390 6755 8195 4633 -1469 -6162 -7414 -5149 -940
2205 -940 3419 6075 6749 4510 -298 -5536 -7294 -5501 -2099 2471 6569 8458 5335 -1719 -7181
2220 -7181 -7891 -4855 -1080 3435 6953 7207 3259 -2272 -6397 -6345 -4636 -1584 3460 6785 6915 3084
2236 3084 -1855 -5310 -7187 -5745 -1076 4490 6532 5754 3518 -691 -5681 -8479 -4861 459 3431
2251 3431 5284 6592 5287 -1337 -7951 -7389 -3398 -428 2242 6393 8183 3609 -3045 -6294 -6117
2266 -6117 -4785 -1414 4168 8218 6712 1531 -2569 -5823 -7025 -4733 740 4313 4798 5160 4253 -681
2282 -681 -6689 -7766 -3728 -129 2694 6501 8200 3716 -3964 -7285 -5595 -3226 -895 4014 7312
2297G312j365m988k924k489k670J072O339N802Q7j659j265m089o742j495O496
2312b578N913M46L6K049j309p456m944J899L484J124L336N490P60o285o515j557
2328f107L82J416M666N509J405l452k978k194l885k249L240O252K564L52Q49j805
2344C965o985n234J969M924K724J613L334J94n061n467j272L18P40L186O465K585
2360G998k754m824k857l211k067L813P290L300k035j728q83l711n338l34N696
2375a645L919M01K113J996l377q057l273K387L641K418L227L439j485n540m437
2390d273j046J19J263M883N393L43l508k303l124m115p52M885N391J429l85M76
2406D676k058n895m347K225M252K428K653K524j077n185m658p13O22J531L766
$$ plain form
2297 7312 5947 959 -1965 -4454 -7124 -6052 287 6089 6176 4517 3252 -837 -7579 -9074 -2578
2312 -2578 3335 3781 3817 5866 4557 -2899 -7843 -5944 -2460 -1336 2000 7490 8250 1965 -4550 -6107
2328 -6107 -5725 -4309 357 5866 7271 3819 841 -1353 -5238 -7487 -4247 2005 4569 4921 5770 3965
2344 3965 -3020 -8254 -6285 -1361 1363 2976 6310 6504 1443 -4024 -5296 -4978 -4238 -1052 5413 7998
2360 7998 5244 420 -2437 -5648 -7715 -3902 3388 6688 4653 2925 2042 -1669 -7007 -7341 -1645
2375 -1645 2274 2675 4788 6784 3407 -4650 -7923 -5536 -1895 523 3750 7189 5704 164 -4273
2390 -4273 -5319 -5200 -3937 946 6339 6682 3174 871 -2253 -6368 -7120 -2235 3156 4585 4200 4676
2406 4676 2618 -3277 -7624 -5399 -1147 1281 3934 6458 5381 196 -4462 -5175 -4553 -3022 744
2421G44M924R39k967l191k824l504j591M569O750K702j801k026j586m209m182
2436g253J644N731K701j71J343J484l333o438k564J934L170K362M053K962k523
2451E102o138l953l12M83K186M769M073j110l000j770k484m156p14N332N778J417
2467E503j233q63k443n539k213K651M185J610J586K179m72m778m084j232J77J637
2483c329N780M420j41m530m039j766k032j79N267M978O85j978o04r05m662m105
2499g140J828N449L179M94J275l82n417m922m90L252K170K157L461J129k966m510
2515a433k312j070n72K842O164L552j864l774k310k688l217J509N718M353o31
2530D267j648L47k714m299k303K638L525K048K877J506k744n449k868j33R77K493
$$ plain form
2421 744 5668 6607 3640 449 -2375 -5879 -7470 -2901 3849 6551 4750 2724 1138 -3071 -7253
2436 -7253 -5609 122 2823 2652 3995 5479 2146 -4292 -6856 -4922 -1752 610 4663 7625 5102
2451 5102 -1036 -4989 -5301 -4818 -2632 2137 6210 5100 2100 330 -2154 -6310 -7024 -1692 4086 5503
2467 5503 4270 3407 964 -4575 -6788 -4137 48 1658 3244 5423 4951 173 -3911 -5143 -4966 -3329
2483 -3329 2451 6871 6730 2200 -1839 -3605 -5637 -5816 -549 4429 5114 3136 2532 1627 -3035 -7140
2499 -7140 -5312 137 3316 3810 5085 4703 -714 -5636 -6126 -2874 -704 1453 4914 6043 3077 -1433
2515 -1433 -3745 -4815 -5387 -2545 3619 7171 5307 1533 -777 -3465 -6682 -5173 545 4898 4267
2530 4267 2619 2966 252 -4047 -6350 -3712 -187 1861 4738 6244 3500 -1949 -4817 -4950 -3973 -1480
2546a480N082K820j577l825j682k217k949j7N051N751O69j905j325k602m707j721
2562f634L160M653K547M1M54j126m349l468m45J931K280L367L275r0l552m398
2578b354j949q61P52L550N657J392k742k651j584k668k416J381M937M109p2r10
2594C571j046l327m417j020L567L483K181J605j15k812m056k011L8Q22K373M631
2610C467K718j719l857k242k052k023J125N657M198k47k517j370j770m119j075
2625e826L019M149K384M27K33k276m345k914L98K219L068K747K201j153m106k784
2641b559r86n87M74L808M532Q65k460k200j985l024k104K664N839K588n61j508
2657B796j238l420l268N70K663K401K328K061k19l913l768j249M09O64L314M724
$$ plain form
2546 -1480 3602 6422 4845 1020 -662 -2879 -5828 -5845 -794 4957 5626 3721 2396 -206 -4913 -6634
2562 -6634 -3474 1179 3726 3767 4221 3095 -1254 -4722 -5167 -3236 -956 2411 5686 5596 2044 -2354
2578 -2354 -4303 -5164 -4412 -862 4795 6187 3445 794 -790 -3458 -5874 -4493 444 4553 4481 3571
2594 3571 2525 -802 -5219 -6239 -2672 811 2992 4597 4482 1670 -2386 -4397 -4359 -3537 -1164 3467
2610 3467 6185 4466 609 -1633 -3685 -5708 -4583 1074 5272 5025 2508 1138 -632 -4751 -5826
2625 -5826 -2807 1342 3726 4153 4386 2110 -2235 -5149 -4751 -2532 536 3283 5484 4331 225 -2559
2641 -2559 -3545 -4132 -3658 150 4682 5547 3087 887 -1098 -4122 -6226 -3562 2277 4865 4304 2796
2657 2796 1558 -1862 -5130 -4560 -1897 504 2832 4893 4674 761 -3007 -4256 -3847 -3183 131 4855
2673D855J433l403l578j259j325j928J808N047L389r69j485j165k701l527p79
2688e587L605L574K323Q15q01l234m159j332J157J689K484L617J682k789l733
2703f89j616r26j349J105M618M153l15k890j798j983k774m57L500L664J920k77
2719C886j044j950l570k389J508K054K333K527J806j497m248k726n23j20J217
2734b736L673M464j4l617k822j456j293r89K901M260K298p86j838k064k615k080
2750d714M83K895K893K427R01j877l636k620o43K46J695L798K970o6k811k519
2766e78j687j458p05K326M088K561J25k351k767k766j844J005L193L265J809L9
2782D255j935l313k328o77Q35J684K767K959L47k141l400k055q69K65K357L388
$$ plain form
2673 4855 6288 2885 -693 -1952 -3277 -5205 -3397 1650 5039 4070 2585 1420 -1281 -4808 -5587
2688 -5587 -1982 1592 3915 4730 3929 695 -3464 -4796 -3639 -1950 534 4151 5833 3044 -689
2703 -689 -2305 -3231 -4580 -3475 1143 5296 4981 2091 293 -1690 -4464 -4921 -1421 2243 4163 3886
2719 3886 2842 892 -2678 -5067 -3559 -1505 828 3355 5161 3664 -584 -3310 -3833 -3953 -2736
2734 -2736 937 5401 5387 1770 -1052 -2508 -3801 -4790 -1889 2371 4669 3883 2045 -19 -2634 -4714
2750 -4714 -4231 -1336 1557 3984 4885 3008 -628 -3248 -3891 -3645 -1950 1848 4818 4752 1941 -578
2766 -578 -2265 -3723 -4428 -2102 1986 4547 4672 2321 -446 -3212 -5056 -4051 -858 2407 4216 4255
2782 4255 2320 -993 -3321 -3998 -3163 -1479 1288 4247 4594 2453 -947 -3002 -3871 -3606 -1249 2139
2798B139K420l65k389k979j595o65J08J734L578K447R9k615k980j989j060M55
2814c657K580L433K575o32k869k538j713j508O89L040L317J674l02k461k969k191
2830c532p73J669K397K569J452J62k004l156j973k53Q8J785L759K768n46k674
2846A738l202k033r06J537K753K735J482m60k162k749k178k46J153J787K637K404
2862D290N31l039l956j633L76P71J757L528K419j583l366j994q2p75k71J906L771
2879B650J319q51j415k398k925j239J829L536K613J301p06k559l543j636J058
2894b966J796J144J830K194Q3k937l296j061k51N21K607L607J485j259k928k931
2910b362j381j17K012K457J766J073j75j792l411j896P19J130J308K706L215o89
$$ plain form
2798 2139 4559 4194 1805 -1174 -2769 -3434 -3326 -1592 1986 4433 4532 1917 -1063 -3052 -4112 -3657
2814 -3657 -1077 2356 4931 4299 1430 -1108 -2821 -4329 -3640 -600 2717 4391 4089 1628 -1341 -3532
2830 -3532 -4305 -2636 -239 2330 3782 3944 1940 -1216 -3189 -3442 -3354 -1569 2190 4958 4412 1738
2846 1738 -1464 -3497 -4403 -2866 -113 2622 4104 3644 1482 -1267 -3445 -3691 -2538 -751 1886 4290
2862 4290 4821 1782 -2174 -3807 -3431 -2660 -903 2625 5044 3461 95 -1899 -1981 -2756 -3027 -1121 2650
2879 2650 3969 3118 1703 -695 -3620 -4859 -3030 506 3119 4420 3714 1155 -2388 -4024 -2966
2894 -2966 -1170 -26 1804 3998 4081 1144 -2152 -3213 -3464 -2943 -336 3271 4756 3497 569 -2362
2910 -2362 -3743 -3860 -1848 609 2375 3448 3273 1481 -1930 -3826 -3107 -1977 -669 2037 5252 4563
2926D563l944l848k58Q88M70K112L013J553j668l008j639r55r81P35L259K975
2942C267R04j047k021l190k196N88K263K788J375P64l33k354l204j021M68J243
2958a706J605K300J974k97k990l400j339N81J439K391K653J006j269l125k508
2973b685j081J067J226J635K445J249m81l167k625j076M17J444K370K361R62j217
2989B844k880k665m83M08J142K172K319P95m63l203k470p65J80J462K436K556
3005C385Q19j700k656j954j347j45K354K776J451L47r02j756l089j874J028K588
3021f75J818J156J293m16l021l121q35J373J604J677J929J705j684l341k610P2
3037c076N72Q60K672K519O2j588k450j697j264K03K318K494J045M50n44k711l402
$$ plain form
2926 4563 619 -3229 -3487 -2599 -2129 -17 2996 4549 2881 -127 -1766 -2721 -3702 -2967 292 3267
2942 3267 4171 3124 1103 -2087 -4283 -3695 -1432 1356 2731 3495 3162 808 -2396 -3417 -2949 -1706
2958 -1706 -101 2199 4173 3876 886 -2514 -3853 -3272 -1833 558 3211 4217 2948 -177 -2685
2973 -2685 -3766 -2699 -1473 162 2607 3856 3375 208 -2417 -3493 -3076 -1632 738 3099 4061 2844
2989 2844 -36 -2701 -3184 -2776 -1634 538 2857 3652 3189 -14 -2484 -3249 -3069 -1607 829 3385
3005 3385 4204 2504 -152 -2106 -3453 -3598 -1244 1532 2983 3330 2428 672 -2417 -4291 -3263 -675
3021 -675 1143 2299 3592 3176 155 -2966 -3801 -2428 -824 853 2782 4487 2803 -538 -3148 -3076
3037 -3076 -2504 -1644 1028 3547 3609 2021 -429 -2126 -3390 -3187 -869 1625 2670 3120 2576 -135 -3537
3054c537p53K252J653J353J625J528j837l642j852M68M39N81K445K633K05j990
3070A571k153j480j495jK699L103O43n31l2k113l217j612K394K649N93P45J898
3087C661k58m032l175K77J927J050J153K846J089k750l634q66j52L39J568K816
3103A859J900j190j520j395j933j394J083K602J870M95N10j87l176l210j84K393
3119a477J280J046J860J354k237l446j297O04j57J571L189J794j411k008j417
3134g52j270j728J017L267K051l65l18K97k303l623m32K692K238K64J017J378
3150C430j349l579k306J128J851K04K011K135n8k463k468j136l73P20K259K497
3166B503O61r75j114j618k081j132K106K314J117M87M16p51k980k778N39J935
$$ plain form
3054 -3537 -4290 -2038 -385 968 2593 4121 2284 -1358 -3210 -2742 -2303 -1722 723 3356 3561 1571
3070 1571 -582 -2062 -3557 -3558 -859 2244 2887 2356 2324 211 -3006 -4618 -2224 425 1018 1763 3661
3087 3661 3403 -629 -3804 -3527 -1600 -550 603 3449 4538 1788 -1846 -2712 -2864 -2525 -957 1859
3103 1859 3759 2569 1049 -346 -2279 -3673 -2590 12 1882 2377 2887 2700 -476 -3686 -3870 -1477
3119 -1477 -197 849 2709 4063 1826 -1620 -2917 -2313 -2470 -899 2290 4084 2673 665 -752
3134 -752 -2022 -3750 -2733 534 2585 2220 1902 2199 -104 -3727 -4159 -1467 771 1035 2052 3430
3150 3430 2081 -1498 -3804 -2676 -825 -621 1390 3525 3467 1004 -1464 -2600 -2973 -2253 6 2503
3166 2503 3164 2189 1075 -543 -2624 -3756 -1650 664 1781 2268 2684 1933 -1047 -3825 -3286 -1351
3182a351J641Q79K139k8k412k907p15L70N10J632K442J395j411j904r26j864j435
3199c945J838L307J552o75l31l83k159k927O02K449J655R8J342J019j772l631
3215a961k131J212J645J391K025J386j012k517j973n52JO29K480K013N0r15r45
3232H26j498k662m99K472K735J148l88j46o26k834k049Q22J806J288J063J468
3248B926J45k298k843j220P30Q57K075K774K52j828j938p28j264j047K112K606
3264A311J207p70j23L31k660l195J67L105K376M34M56l9k159k816n84J103R92
3281h64J010J807J305q28k010j705j508l87J506K961J814o13j678n09j181k209
3297c089L29K412K043Oj06Q29j406k653k035R34K025J637J287J323j342k614k089
$$ plain form
3182 -1351 290 1169 3308 3280 868 -2039 -2754 -2384 -1874 -242 2200 3595 2184 280 -646 -2510 -3945
3199 -3945 -2107 1200 2752 2077 1746 1363 -796 -3723 -3121 -672 983 1081 2423 3442 1670 -1961
3215 -1961 -4092 -2880 -1235 156 2181 3567 2555 38 -1935 -2487 -2486 -1857 623 2636 2686 1771 826
3232 826 -672 -3334 -3833 -1361 1374 2522 2134 1988 1362 -1472 -3521 -2699 -893 395 1458 2926
3248 2926 3071 773 -2070 -3290 -2560 -1703 372 3146 3398 1570 -368 -1096 -2360 -3407 -1295 1311
3264 1311 2518 1748 1625 1956 -704 -3899 -3732 -627 1749 2183 2639 2600 441 -2375 -2959 -1856 -864
3281 -864 146 1953 3258 2430 420 -1285 -2793 -3180 -1674 1287 3101 2488 810 301 -880 -3089
3297 -3089 -2760 -348 1695 1701 1595 2424 1018 -1635 -3670 -2736 -711 926 2213 3536 2194 -420 -2509
3314b509L44P9R24K204J764r8j386j131j223k067m40K369L342P08j163m70l49
3331H98k283k144J162K458J184L89Q25P7k204k612o61P35J901J424J891L2k118
3348I54j882n86o16n70J708K287J480r98j52j077k097k311N75L132K364L29n99
3365A941l71j546k563n11J624J016J158J080J207j212k245j921k58K81J616K330
3381A626J854r45k337p27o90j445O4K150K622l9m71j09r40k453j807J281K565
3398A99J546L66n6m16k249j873J78P42Q58J489K157j34k042j731l48j200m11K181
3416g44L197O78j379j551j26j624j581Q64K836J209m22N24l42j878k471J27J213
3433a470J724P30J801j37k092k116j42K7l82J235K735Q90j051j344l53j086j871
$$ plain form
3314 -2509 -2165 -2086 -1162 1042 2806 2708 1322 191 -1032 -3099 -3539 -1170 2172 2880 1717 1247 898
3331 898 -1385 -3529 -2367 91 1275 1664 2489 2566 362 -2250 -2911 -2176 -275 1149 3040 3072 954
3348 954 -928 -1514 -2130 -2700 -992 1295 2775 1777 1625 548 -1549 -3860 -3285 -153 2211 2540 1941
3365 1941 1570 24 -2539 -3050 -1426 -410 748 1828 3035 1823 -422 -2343 -2601 -2320 -704 1626
3381 1626 3480 2535 198 -529 -1219 -2664 -2600 -450 2172 2133 1662 1553 613 -1840 -3647 -2366 199
3398 199 1745 2111 2055 1639 -610 -2483 -2305 -1563 -705 784 2941 2807 765 -966 -1314 -2514 -2925 -744
3416 -744 2453 3131 1752 201 75 -1549 -3130 -2266 570 1779 1357 1881 1539 -339 -2810 -2683 -1470
3433 -1470 254 984 2785 2648 556 -1560 -1702 -1675 -2057 -822 1913 2803 1752 408 55 -1031 -2902
3450b902L50L017J845J8p07p23j177j768q73J575J754Q81J079K76j526k409j010
3467b300N14K1J330K344J199j440j990k87m85j028k58K662K166j68r54m14j154
3484b42k152p26J633K479J006m5m3j293j963j171Q25K95R43J956J415n78k206
3501A33j313n06o07L8K521K457K21j824j572k59j033p90J216J849J689l58n59
3518A303l94j525j790j13J146J556J577J383j140k066j487n26M2O32J964J666
3534B228J97j705j019k65j025r85R82K057J702P6p27n76k169j317n1J833J579
3551H15J062M67r45j379j512j88q7M34J210K099P12j105j796j111m29k89O82K027
3569F67J572N8j222j630n91q44O4Q88J520J266L90q51j214j077p60o89P82K420
$$ plain form
3450 -2902 -2552 465 2310 2328 1621 898 -279 -2047 -2920 -1345 409 1290 2369 2645 1119 -1290 -2300
3467 -2300 -1786 -1765 -435 1909 3108 1668 -322 -609 -1094 -2122 -2380 282 2448 2280 1326 912 -242
3484 -242 -2394 -3120 -1487 992 1998 1953 1910 617 -1346 -2517 -1692 -1397 -454 1502 2917 2339 133
3501 133 -1180 -1686 -2293 -2255 266 2723 2944 1120 -452 -711 -1744 -2534 -1318 531 2220 1862 1303
3518 1303 909 -616 -2406 -2519 -1373 183 1760 3143 2003 -63 -1550 -2076 -2034 -1402 562 2228
3534 2228 2425 720 -299 -564 -1589 -2574 -1592 465 2167 2243 1516 940 -1229 -2546 -2597 -764 815
3551 815 1877 2344 1399 20 -1492 -1680 -1767 -1333 -123 1976 2688 1583 -213 -1324 -1753 -2042 -1360 667
3569 667 2239 2297 1075 -555 -1146 -1990 -1926 -1038 482 1748 2138 1287 73 -1004 -1764 -2453 -1671 749
3587G49J609J03j367j121j037j177JJ414J734J149k88m19j558j040n29k05P61
3604a221J785J411J59p86j448j654m89J58J347J345J629k2j522j168q29o15L70
3621a550R68J290J488j15r79j540j037n07O9J388J265J408M36j628k001j75m34
3638a654Q5L09J845J755n6j688j079m74j012k52J319J938J209m54m21j617j016
3655a263r40N72J292J212R07L27r24j407j338l08N04N35J598J789k33j655j423
3672g55r47O0O6J221J415J028k19j163j468n08m37J98J071J292J256J69j443j474
3690f38j222N3M73P17J697J493n03j299j967n43m7K37Q06K310O46m02j250r89
3708d28r26m33J23J339J661Q04q7j356j284j052j70M63J492J275O43n24o86j701
$$ plain form
3587 749 2358 2461 1094 -27 -1064 -2241 -2240 -826 908 2057 1769 1350 -208 -1248 -1777 -1982 -1221
3604 -1221 564 1975 2134 1348 -100 -1754 -2243 -2085 -738 607 2236 2214 692 -476 -1305 -1920 -1550
3621 -1550 -582 708 2196 2081 1102 -438 -1475 -1982 -1913 -525 740 2148 2584 956 -1045 -1220 -1654
3638 -1654 -1569 -1260 585 2340 2284 596 -483 -957 -1969 -2221 -902 1036 2245 1791 1370 -247 -1263
3655 -1263 -2203 -1631 -339 873 1780 2107 1183 -224 -1562 -1870 -1366 -831 767 2556 2323 668 -755
3672 -755 -1702 -1642 -1576 -355 1060 2088 1869 706 -762 -1270 -1707 -1509 -438 854 2110 2279 836 -638
3690 -638 -1860 -1807 -1334 -617 1080 2573 2070 771 -1196 -1739 -1786 -1549 -743 1567 2213 1811 561 -428
3708 -428 -1354 -1787 -1664 -325 1336 2140 2053 697 -587 -1639 -1809 -1346 146 1421 2064 1540 854 -847
3726h47o73k85P97Q88R33J158K67j264j822j069R3O05Q26J514J272n51j579j193
3744i30q11K71K19J015J350R66k66j522j202j008M56J89J280J141R37l59j163
3761E63j653r02J65Q84R75J315Q30m56j435j321k22p1O5Q34K007O23p48r32j411
3780h90j004RN48J655J218J80j49j173j497j188Q45Q29J007M44J033L01j422k062
3798a316p69O64N50P98J422P81k91j723j700PJ47L90J075J392M23n95j015r23
3816f83r74J42P96J084J162O94n87j321k007m61J233J15P24J243J009m35j496
3833B38j560k9j91J10J491J788K81r63j012j285p16j42J490J284N90J26k55n31
3851G14j949j056O36J597Q89K86Q96m33j683j867M52N22M38M96J156R14o99j702
$$ plain form
3726 -847 -1520 -1805 -1008 -120 813 1971 2238 974 -848 -1917 -1824 -1219 -393 1121 2393 1842 263 -930
3744 -930 -1741 -1470 -1251 -236 1114 2080 1814 292 -910 -1918 -1462 -1273 7 1148 2085 1726 563
3761 563 -1090 -1992 -1827 -943 32 1347 2177 1721 286 -1035 -1257 -1328 -1263 -429 1578 2201 1453 521 -890
3780 -890 -1894 -1885 -1337 318 1536 1716 1567 394 -1103 -2291 -1446 -617 390 834 1867 2168 746 -1316
3798 -1316 -2085 -1421 -871 -73 1349 2130 1839 116 -1584 -1577 -1430 -1040 35 1427 1850 1255 240 -683
3816 -683 -1657 -1515 -719 365 1527 2221 1634 313 -1694 -2155 -922 -807 -83 1160 2169 1734 238
3833 238 -1322 -1351 -1542 -1432 59 1847 2128 1165 153 -1132 -1848 -1990 -500 784 1374 1500 1245 714
3851 714 -1235 -2291 -1655 -58 831 1117 2013 1580 -103 -1970 -1518 -996 -558 -62 1094 2008 1309 -393
3869c93p03j17m52M07J365J737Q4j017j037j148n71J14K008P13JK02M44j462j338
3888a163m33M58N71N46J487N50k69k200q55j73K62K59J770R06j35o00o94j101
3906h14q25m28J746J357L40j17K59j172k253m63J237J281N86K39P71j24k098j300
3924a778O65J53L63Q46J462N05j442j381m29m33j19J241J277Q05k04o11p37j661
3942a478o98Q42J936R9O03K27k04j466j721J23J213N45K96R69N86p98j257r66
3960a149o2k22J079J125Q01J86p57j079j414o26O47J836R43l26MK24j547j083
3978a420o64J550O90M67M78O32o23j943q35P00K00P02L67J158L92j244j187m32
3996a012o70n8J651J293M49j38n95j015j402m61J337J101O10J91K35j14k103j044
$$ plain form
3869 -393 -1096 -1213 -1665 -1258 107 1844 1928 911 -126 -1274 -1845 -1731 277 990 991 1193 1637 175 -1163
3888 -1163 -1596 -1138 -567 -21 1466 2016 1747 -453 -1308 -1481 -1219 -960 810 1716 1581 981 287 -814
3906 -814 -1639 -2067 -321 1036 1376 1259 1518 346 -1907 -2370 -1133 148 734 973 1744 1620 -478 -1778
3924 -1778 -1113 -960 -597 249 1711 2216 774 -607 -1036 -1469 -1588 -347 930 1735 1531 920 183 -1478
3942 -1478 -2176 -1334 602 701 1304 1531 1327 -139 -1860 -1737 -524 21 317 1286 1872 1074 -183 -1149
3960 -1149 -1211 -1433 -354 771 1572 1758 1001 -78 -1492 -2118 -1471 365 1308 982 986 1210 -337 -1420
3978 -1420 -2084 -534 156 623 1101 1733 1110 -833 -1668 -968 -768 -66 301 1459 1851 607 -580 -1012
3996 -1012 -1682 -1740 -89 1204 1653 1515 920 -95 -1497 -1958 -621 480 1090 1281 1516 1402 -701 -1745
4014a745L27P96Q33L27P06L80r79j219m92k54K19J011J064O22l83k35j042j152
4032a216p56P88J409R59L79m22l24j378j408k16J764P17M21M57M20q14j942k46
4050a408L00L88N25J022O21j90r05r33n80p46P27J342J208j89k17k47j273r60
4068a515m68J175J612L60k42M57p75j459r12L96J209M60O75N36l76j035r26l49
4086a177J45pJ032J211N27q20o38p00j226l05J056J938M28k49l23l23j308r59
4104a698j09J434Q91M40L00Jj139j226o05N70R59N00N74P40q69m94l64p69p15
4123a579L90J639J348j74r75j99j266j091l6J558J428j13m71L10j18j404o14M06
4141i61L59Q88O62N84j41j696p57j66j08R38R11J118n36r29J0l16j016m96Q60
$$ plain form
4014 -1745 -1418 -622 211 538 1244 1624 645 -574 -1066 -1320 -1101 -90 974 1596 1213 978 -64 -1216
4032 -1216 -1972 -1184 225 1184 1563 1141 817 -561 -1969 -2185 -421 296 717 1174 1594 780 -1162 -1408
4050 -1408 -1108 -720 -195 827 1448 1258 353 -580 -1160 -1906 -1179 163 1371 1182 965 718 -555 -1515
4068 -1515 -1983 -808 804 1164 922 1379 604 -855 -1767 -1371 -162 298 973 1509 1133 98 -828 -1177
4086 -1177 -1032 -1039 -7 1204 1731 911 273 -427 -1653 -1958 -902 1036 1464 1215 892 569 -739 -1698
4104 -1698 -1807 -373 518 958 1258 1259 120 -1106 -1711 -1141 -182 318 892 1632 763 269 -95 -864 -1579
4123 -1579 -1189 450 1798 1624 649 450 -816 -1907 -1943 -385 1043 930 459 769 651 -753 -1367 -961
4141 -961 -602 286 948 1532 1391 -305 -1062 -1228 -1336 -398 513 1631 1095 166 176 -140 -1156 -1652 -792
4160g92J300O88M8Jo75j432j129O39J502N78L21O2j68j143q52P5J58j02J022J379
4180A480r9m41q53p85o63k26J331J574J94q86j97j01j291j064P53J501N38m0O87
4199A412J07j246j836l1O42Q62L69R62M8n78j057j69j34p74N85J481R68m00o66
4218E45k75r11j221M60J327J339n37j23K11m47j342n66O86N69N35R91M66j134
4236E73j124n02K19j49Q80R63N80n73r17K00l64j037n96J333J538K4j7k0o36j585
4256a210n44R65J396J56JN38m27j502l19M49l26Q1J250R36j66q80o21q05o7j29
4276a224J031J469k74k81n06P1q80q77K10J183P97M29J2n27r81o42l72L92P67
4295b03R71R26o72j042l61m84J37k65Q03J464K31p60k68o35n86o54M46J439L72
$$ plain form
4160 -792 508 1196 1244 1245 570 -862 -1991 -1352 150 728 1049 1111 943 -200 -1052 -977 -819 -921 101 1480
4180 1480 1381 940 87 -698 -1361 -1587 -256 1318 1512 626 429 328 -963 -2027 -1274 227 765 725 1412
4199 1412 1519 273 -1563 -1594 -952 -90 279 1241 1289 711 -346 -515 -649 -1423 -838 643 1611 1211 545
4218 545 270 -641 -1862 -1402 -75 1264 727 604 815 368 -974 -1540 -854 -285 250 1241 1707 573
4236 573 -551 -1053 -834 -983 -103 860 1440 867 -50 150 -214 -1251 -1847 -514 1024 1048 1031 1011 375 -1210
4256 -1210 -1754 -789 607 763 764 1302 875 -627 -946 -497 -823 -742 508 1444 1278 398 -223 -1028 -1095 -1224
4276 -1224 -193 1276 1002 721 215 286 -594 -1471 -1261 -78 719 1148 1160 633 -348 -990 -1362 -970 -203
4295 -203 768 1694 1022 -20 -381 -865 -728 -993 -190 1274 1505 745 477 -158 -744 -1398 -952 487 859
4314H59J1L21p42n37r48j80O13N76Q14L97l24r04o41j75K94l09P88J049N01n62
4334I01q04m21m78k68MJ249R57M04p56o65p41k52k77K68J144M49M49m55o05m39
4354c36l20n99J60J107J282J12p84n47o77o48j0N93R70M88Q1m70L6o11n64o47
4374a384N34J031P56P19n01j207p19l55l7Q56O51Q38o0n29o92l88l97k2M22P96
4394C12N03N36n14p07p91m67j3M99P49P56N92n07j058p01J80m59L01J129Q02J74
4414A316o81o22k76o47l08L06J233Q74O5o95l38q50k74L1J52R10R71K07m22j065
4434a13n42k67j40L80Q47Q99K98n40p96m78m87L9M15P30P88M1m38p52m43k28O0
4455g27L6Q88P39M98o76r85m88j08k52N00O40J083k08k93j042j98p45L50Q06O44
$$ plain form
4314 859 870 1191 449 -88 -1036 -1216 -603 -27 787 1184 860 -44 -685 -860 -566 -875 -87 962 1463 901
4334 901 97 -324 -802 -1070 -1066 183 1140 1544 788 123 -618 -870 -1147 -879 265 714 1163 708 103 -336
4354 -336 -656 -1255 -1095 12 1294 1406 622 75 -602 -1250 -1260 -667 303 791 872 402 438 -173 -737 -1384
4374 -1384 -850 181 937 1656 1155 -52 -771 -1126 -1163 -307 344 1182 1122 593 -99 -487 -884 -906 -484 312
4394 312 815 1351 837 130 -661 -1128 -1141 -642 107 863 1455 948 -110 -811 -631 -1090 -789 340 1142 1316
4414 1316 635 13 -263 -910 -1218 -912 321 1195 1260 565 227 -623 -897 -866 -714 196 1167 1374 952 -113
4434 -113 -655 -922 -1062 -682 165 1064 1362 822 26 -452 -939 -900 -485 245 1033 1074 636 -116 -559 -787 -727
4455 -727 -691 197 936 1434 758 -227 -715 -823 -1075 -575 65 1148 940 647 -395 -593 -1338 -988 -182 462
4475D62O62Q0o41n48l90l85k69P43P93O16j14l25p21m52n14P8P16N31N94p9r2
4496G45r56r92K7M29K24Q48N11J67o05q18k04j86r1N39J60J331R1q86n19n65o5
4517h15%J05R98Q15j61m27o31n50k76L9O83O65M74k13k47p61l59k07L1M68O76
4538C07O99j23n95o96j16j50k71N62J008M31j98n63o42l88j19K1O82O88L41Pn5
4559H30r08r40j02P17L51L24O49K43o07j491J72J55O3K00J042N63j88r44o81k49
4579h01J13j42M18R25N55k86l85p44l18k55M93N66M34K31M1m75q48l98M46K20
4599b10l2P48O85m00o13o46l27n1j73Q93Q11K22j18n16q36j98k92P25O13L26O8
4620F79N02p00j081k81J42M24J54M09Q44j60p43r18j55N01l3Q1J159N74m62j144
$$ plain form
4475 462 1124 1204 563 15 -375 -760 -1029 -286 507 1123 1009 684 -37 -489 -1003 -925 -209 322 916 837 745
4496 745 -211 -1203 -1176 -747 -523 325 836 1003 398 -420 -624 -810 -901 -362 -202 1129 1220 334 -185 -750 -815
4517 -815 -815 -710 288 1103 942 515 -116 -666 -942 -903 -220 445 919 706 459 -302 -661 -868 -837 -369 307
4538 307 1006 883 288 -408 -524 -674 -945 -383 625 1056 858 295 -347 -735 -854 -833 -151 537 878 885 830
4559 830 -78 -1018 -1120 -403 -52 272 921 1164 557 -934 -762 -607 -544 -344 698 1261 1073 129 -552 -801
4579 -801 -688 -830 -412 513 1068 782 397 -347 -665 -920 -427 139 573 804 845 370 -478 -876 -430 -210
4599 -210 -242 506 1191 791 178 -468 -795 -846 -1019 -126 685 907 789 273 -563 -761 -1053 -328 285 611 679
4620 679 1181 481 -600 -881 -739 -315 -161 248 1092 932 189 -729 -884 -383 -416 -335 824 1398 936 -208
4640b08l91l71K57k48J059O65P8j50n19l88o25Q7L20N51L95K17K03l39j159p07
4660a273M48M76K41N46P09M6j107p58J39j64J84N65N54J54k52l42k57p63j58P63
4680b49N71L12J04L3n49q38l46M88O07j95J95P84J44j025o29l44L81K13K62Q48
4700G67R9l31r48j10J00n55O08L99N82%K9n26o55o13J45R78L42j24M46L18p10
4721B41j266J64L85J22L31M58O53k76p88n30J8k93M27P35P30l91o20J29p29k24
4741g24l45Q55P11j03M10j41m06j299JN54O80Q6M51K97j42j228l75J57L14j52
4761c99N81O79p7l18p57l23o79O09P63K79M49l61L50q09k59k46J92O14N3P3J72
4782E86M31q18j121k57N74L36N17L67J13l94m45m10j70N9N80K25J87K92q6q18
$$ plain form
4640 -208 -599 -970 -713 -961 98 763 841 691 172 -216 -841 -754 -434 117 512 729 932 593 -566 -1273
4660 -1273 -825 -349 -108 438 1147 1193 86 -672 -533 -697 -513 52 606 760 508 166 -91 -854 -1012 -249
4680 -249 322 634 738 771 222 -616 -962 -474 133 -62 133 917 1061 36 -593 -937 -556 -343 -81 767
4700 767 866 535 -413 -523 -423 -978 -370 29 611 611 640 114 -541 -1154 -1009 -31 311 187 633 951 241
4721 241 -1025 -861 -476 -354 -23 435 1088 812 24 -506 -488 -781 -354 381 1111 720 100 229 -500 -724
4741 -724 -1069 -214 497 394 804 663 257 -1042 -1041 -487 193 279 730 1027 885 -343 -718 -561 -247 -399
4761 -399 182 861 784 466 -291 -614 -1293 -684 79 358 807 446 796 -13 -272 -518 -326 288 341 414 586
4782 586 1017 199 -922 -1179 -605 -269 248 615 728 334 -111 -521 -691 -632 -52 173 360 652 566 -252
4802b52n62k29N72O41M18N7J22j06q98l92l05M39P30k6L45M00l33q79n71q2O58
4823b53K29M59N48k50m30j67n35m50L73P61R9j29L10l08m33m30n1K30L89N38Q4
4844E84J35r9p54q15N5L06J95Q78J90J01l48l97r07j48R10N18m0L10n2o21j29
4865a28k51l20p8O66L95J74k77J59o20n56j59P01R10l24K57J66R0j296m01K86
4885f06N66J68J8N31j70m27j87l50k89J25O76P39m70m9r3k62j022Q8Q48O88j3
4906E09kK00m05m75k93j84L82L42L91J67J64n91p53R0k03M57K11N00K42m94n6
4927A99J72r57n60N97P47M75k64L66m19m45q40R3Q96J53K10L21k61n08n35j62
4947g22J38J20M04N95Q6k73k56r1o06o2L35Q80L33o51K03m1l48j008M11P3M84
$$ plain form
4802 -252 -814 -1043 -471 170 588 645 767 661 -237 -629 -934 -495 235 209 554 954 621 -258 -829 -911 -253
4823 -253 -24 435 983 733 303 136 -399 -849 -476 285 384 255 565 257 -176 -606 -657 -427 -38 500 584
4844 584 719 620 -134 -949 -894 -588 -393 485 675 776 428 31 -876 -1024 -114 404 364 674 622 1 -128
4865 -128 -379 -699 -777 -111 284 458 181 340 -280 -836 -995 -294 616 292 549 715 805 -491 -892 -606
4885 -606 -40 128 146 677 507 80 -107 -457 -746 -621 55 794 324 275 182 -80 -1102 -1014 -166 522 509
4906 509 507 707 302 -173 -466 -650 -268 74 465 632 796 205 -548 -458 -661 -204 7 507 749 255 199
4927 199 371 -586 -1146 -549 198 673 409 775 356 -89 -929 -836 60 213 423 744 483 -25 -560 -722
4947 -722 -584 -464 -60 535 621 348 92 1 -605 -667 -332 548 881 230 433 392 44 -964 -553 -480 4
4968DM38pJ39n16m89k25J90M24j38O02M98n53n83j59L1o40N27J050L0k66m91L09
4990A75l21o76J29L55Q65l81L89K08j62j029o61O11K74K40L94K69k28n58m01K25
5010b83j37rP08M71l56n16K86k51l81n52Q64Q23P0m70M00l92p85q9m6P88o6K7
5032A04L30J84o36k97J63k61j39L02R93J79m87o60l73J27p3N13L83K28k26l4p1
5053B49k90n02r2N02M03K54J26l28k13p31K5j0M29N14L82k54r1j07n62l39k24
5074h59O36Q91l2J9l6o31n60l5j46P71O07k39k13J22m30j81m67M20K86N27J55
5095F05l71K86o49j87k16J76M57K26J21j10k11l3M2m70k20K67J076M2m90k38m10
5116c07o2l82L80M95J49J15J57k20k62l51k05l25N87Q53k58k46M8k93m74j06J88
$$ plain form
4968 4 442 435 574 58 -431 -656 -466 -42 -180 422 920 367 -216 -375 -344 -984 -457 593 623 357 -134 175
4990 175 -146 -822 -693 -338 527 146 535 743 581 -448 -1109 -498 -224 16 410 679 451 -107 -508 -283
5010 -283 -420 -429 279 750 394 -122 164 -87 -468 -1020 -156 667 737 267 667 275 -510 -599 -645 143 77 104
5032 104 434 618 -18 -315 -152 -413 -552 -250 743 922 435 -225 -598 -471 -544 -31 352 580 354 320 249
5053 249 -41 -543 -635 -133 270 524 650 322 109 -622 -597 -607 -178 336 718 464 373 266 -296 -635 -859
5074 -859 -223 668 636 655 619 -12 -572 -607 -753 18 625 386 173 295 -135 -316 -783 -363 -77 450 605
5095 605 234 520 -129 -316 -532 -356 101 327 448 338 127 94 136 -334 -554 -287 789 831 341 103 -307
5116 -307 -369 -751 -371 124 273 388 545 325 63 -288 -493 -818 -231 622 364 118 166 -127 -601 -707 -519
5137e19M42L98j27K10q4l10m76m8j10P24J14J60R6j77m27l37q8J57K09M78L47
5158F32k23k08k02r5n76p5M64P09J70j76l47l68j98k7L98L5O69l17K25o38j75
5179c23K43n74M9N02O68P9l17m68j7N9m85K26L54N49nj54j00o71j05j05M50m5
5201a90O81p9L7m18l01m46J60J94K57N84K75l88m55j2j56k49J24L67L28J7p8L
5223B55l92k41j18j1L90M67K61k57l33p2j49l12P4N74L73L2k39l40j9k39l04n7
5245f57Q14J68L53k94k23j72l75k54J01Q06J60J87J19p84K0k95m24N00N85Ro3
5266B81K19l61k05j54l79M58K8L21N21l32n18m70K19j46L43m1P36K48l15m31o17
5287e95M22j81j95O22K86L30m02m11o6M2k54L60K87J47M97k78n11n68O8k74N27
$$ plain form
5137 -519 -77 321 194 404 320 10 -466 -514 -624 100 214 374 470 293 -134 -471 -559 -402 -193 285 632
5158 632 409 201 -1 -96 -672 -747 -283 426 596 420 73 -295 -493 -520 -122 -87 582 265 490 -148 -323
5179 -323 -80 -654 -605 -103 565 644 327 -141 -158 -99 -584 -358 -4 545 540 386 286 -385 -490 -595 -145 -190
5201 -190 491 412 449 31 -270 -716 -556 -362 -105 479 754 366 -89 -101 -257 -506 -382 -15 313 330 252 255
5223 255 -137 -378 -496 -507 -117 350 611 354 21 -51 -200 -512 -438 136 509 541 302 -38 -57 -296 -600 -657
5245 -657 157 325 678 384 161 -11 -386 -640 -539 267 427 614 733 -51 -31 -326 -750 -250 335 344 281
5266 281 500 139 -66 -220 -599 -141 -113 208 729 397 -121 -591 -372 -518 -175 -216 520 768 453 22 -595
5287 -595 -173 -354 -549 73 359 689 287 -124 -190 -148 -402 -42 245 392 889 611 100 -468 -400 -674 -147
5308a47K41N04L64o21k02l20j27k43K78L40K57K21l67K4n85o1o4M61L79N6K09
5329E97j49o24k18k08L32K3M89K42L43n39l38m27L09j22J68J64K63M81n60j20
5349A06k90O7k42J08N35N36j41m16l77j88k87K62L90Q3K57K17k74p36m4k1J37
5370c18NN10M50o0n78l68J24j36J75qM43M96j16k26k33m96r0P6K92M34K16r6j23
5393C73m19n24O6J59L71p2K85K70k14o02K07M0l57J10N34N06l85r5n11J00k44
5414d02J08K34J47L04k38P5k60l21k1J33P3J29N20N5j95o18l95J28J34J06L02
5435bL51K09k99k77q0l49j75M49J60J71K95m21n6k21l43L31L65K09K07j94j27
5456B03n71k87L95J64J11P5K43K71o26l54o2j29L12K41M63O4R8m97m53L08m32
$$ plain form
5308 -147 94 598 962 341 139 -181 -308 -551 -273 67 324 545 178 202 -383 -444 -508 -47 332 388 597
5329 597 448 -176 -394 -602 -270 -247 242 484 827 288 -50 -477 -168 -290 -122 42 305 786 226 106
5349 106 -184 -117 -359 -251 284 820 679 263 -114 -302 -589 -327 63 146 403 620 346 -390 -434 -455 -318
5370 -318 -313 197 647 587 9 -359 -235 -371 -196 -204 239 735 619 393 160 -336 -426 -350 -58 376 592 496 373
5393 373 -46 -570 -504 -345 26 -46 239 509 295 -307 -100 -60 -417 -307 227 733 348 253 -258 -158 -402
5414 -402 -294 -60 87 391 153 228 -32 -353 -374 -241 -168 -39 481 536 341 -277 -672 -544 -410 -304 -2
5435 -2 349 558 259 -18 -98 -447 -622 -173 -13 158 453 32 -24 -245 -588 -257 108 317 524 330 203
5456 203 -368 -655 -260 -96 15 90 333 604 -22 -376 -438 -567 -255 -14 449 513 611 114 -339 -31 -463
5477d63m7M50Q7N74k42k39m65j14nL10K22J39J14K17j42p11Q4K80m07M02K91J48
5499D83J54n79l50j13j75J89L55L62J1k10K05l48p04L91R4L10QL96J18m48l98
5520b49m1J15K1L35j08K16J1l30m0k03lK23l47L29M20J3l8l83o00K38K04M82q6
5543A79K27jk05l11j95K37r8J38K51J25r1k76l21k49L43L8J39L57K31l52j83K6
5565Il49K09N9N7L54J69Ll40l42m25L54N8R2M56rj47L0m59q2K3L94k02o2O02R2
5590E44o18j28k00J99O4L49j28J30O5r9j39j49j40K37j2K03K67M2k56k75o17M23
5612b38P1L64M0L73j70m05m26J06k20K03K73J13M03l1o76q3J32p2L14j00K34J01
5634C06K35l37n41k20J1L56j0N40kK60o34n38K5K12N10p9L0Pj0q1k89k49K82P9
$$ plain form
5477 -463 -510 -60 27 601 359 120 -345 -459 -464 -154 68 207 321 538 396 -315 -231 49 -358 44 335 483
5499 483 637 58 -292 -405 -580 -391 -36 326 337 127 332 -16 -720 -329 -235 75 83 479 597 149 -249
5520 -249 -290 -175 -154 181 73 289 300 -30 -70 -273 -276 -53 -400 -71 349 362 324 -59 -659 -421 -217 265 179
5543 179 406 405 200 -111 -306 -69 -167 -29 222 347 256 -20 -341 -590 -247 -209 -70 287 518 166 -17 9
5565 9 -340 -131 -72 -15 339 508 511 171 -171 -596 -242 -184 -92 364 355 208 238 -221 -303 -280 114 -88 -150 452 544
5590 544 -74 -202 -402 -203 -139 210 82 212 277 178 39 -110 -250 -13 -25 178 445 487 231 -44 -661 -238
5612 -238 -167 197 237 610 440 35 -391 -285 -505 -302 -29 84 487 456 -220 -303 -171 -243 71 -29 205 306
5634 306 541 204 -337 -557 -546 -190 -200 340 338 598 -36 -574 -549 -337 173 94 124 131 121 40 -249 -498 -216 -137
5658a37rK70K47L11o91k04j62P5N84j01R2j40K26l88m07J38J5K96k83M22K08K44
5680F06o57o38K49K96J57K77k77O30n10m32N9M8o7J53M22q5j2j14l9j66l60K0
5702d40K70N65j73j65L46n72m97J82N28K63l16L36J51l16m73J93j33L5N8M05j10
5723A37k04K60j37j88m44J26J93M88N3l2J56n34l15j10O38R1k01J89P8J17n59
5744a98j07OJ48j73M15L56k7n55m9j08j0P8N74K3l25q3L85j19o98j33K20M39M0
5767I9J20J90O8o69k45K14JL68j8O37o96K1j85L11o57J1M43K77R5l21j1j08l38
5790c93J96K51J66J62l3j97J15l45k83j62M25k10M74l2N55n62k36n5j73K31L59
5811B53Kk09L59m12k14n0j83r3N88K27l10J50J66l67j73j44L79O5P0L23j25k23
$$ plain form
5658 -137 -146 124 371 682 -9 -213 -375 -300 284 183 275 135 361 -27 -434 -296 -281 15 -268 154 362 606
5680 606 -51 -689 -440 -144 13 290 13 643 133 -299 -240 -192 -259 -106 316 231 219 105 66 -100 -460 -440
5702 -440 -170 395 222 57 403 -169 -666 -484 44 307 -9 327 478 162 -311 -118 -251 -216 -158 247 137
5723 137 -67 193 56 -132 -576 -450 -257 231 284 252 408 -126 -441 -551 87 178 -23 166 244 361 -198
5744 -198 -305 -299 -151 -324 91 447 420 -135 -184 -292 -302 -224 350 373 48 -35 350 231 -467 -600 -380 59 99
5767 99 219 409 477 -192 -437 -223 -222 146 128 765 69 90 -95 216 -441 -430 13 290 385 64 53 -55 -393
5790 -393 -197 54 220 382 349 152 267 -78 -361 -523 -98 -308 166 134 689 127 -109 -164 -337 -106 253
5811 253 255 46 405 -7 -221 -271 -454 -547 41 268 -42 108 274 -93 -266 -410 -31 34 104 427 302 79
5833G9k80k4j64L15J21L00MJ38p73K68q0j55J67K42j13n2J35K06l53j59q8L85
5855A19J18q8J94k99J54m55j76L10j6J98r4K74N2l99q0L7j01r3N00K83j29k43
5877F6J72k85j13j62K22O5J22j17J76r7j19j36N7k95N77O3O6k38J01l31l05L31
5899a80J4K86K44RN7l93l3k57pK18K33Q5n6j88nk77m18L61L90J1K38n1J41o67
5923b45j38lJ71M3L42K49k88qJ10l11o5j94M74k53M57k7m91K87l64j03j64L49
5945a72L06J25k63J32j04O9n79J01M42K38j17P3m3k30j52l42K52P9J00K44K94
5966D53k64j56m4k40j06J20M55J1q0n2j1k49j12L06k23M71j97K5L26l86k36j39
5988c28K27O5J1L14j7j40k00K55m86j03L74J44K85m65K69m82K41k49q4j4M01L70
$$ plain form
5833 79 -201 -225 -389 -74 47 347 351 489 -284 -16 -96 -251 -84 158 45 -7 128 334 -19 -178 -266 119
5855 119 237 149 343 44 198 -257 -433 -123 -139 59 -35 239 291 -108 -188 -151 -252 -345 155 438 309 66
5877 66 238 -47 -160 -322 -100 -35 87 -30 146 49 -70 -206 -149 -444 133 196 262 24 125 -206 -511 -180
5899 -180 -166 120 364 373 430 37 4 -253 -260 -42 191 276 220 32 27 -250 -668 -307 83 94 332 281 422 -245
5923 -245 -383 -386 -215 -172 170 419 131 123 233 -78 -143 -337 137 -116 341 314 -177 110 -254 -357 -521 -172
5945 -172 134 259 -4 128 24 93 -486 -385 57 295 178 251 208 -22 -174 -516 -264 -185 -85 159 453
5966 453 189 33 -11 -251 -357 -237 218 229 149 97 86 -163 -275 31 -192 279 82 107 433 47 -189 -328
5988 -328 -101 -36 -25 289 272 132 -68 187 -299 -402 -28 116 401 -64 205 -277 -36 -285 -369 -383 18 388
6010C88m65oR1j35o6r5J57L11K19j50m45K33n00J01P9j51K74L84J56k74k1m21
6032c36j5j3L33L29P6j5l92K63m96j83K79N50j91m3J34k78p5j52L97l43j22N34
6054B41n3K8P6l84j48q8K5M40k31O07k13n3j14m38K29m52R43k11J53o0j95N1l04
6077a51k44J98j03M97J56m21n1K6k56K33L4J43L88J42m07k73K73l75j52K38L1
6098g4j3J97o7O9j97m30J11M12j56M23J98lm26m33L38l24K10K82Q6J68k34l53
6120b16J73J0j15m75N10K97J16Jk16k26r1o7K41J65J63N7N3k28k22k43NJ72J2
6143a24J73j46M91k58q3j70k55M64J89j5J05l82j66L06j69l34K54O0J83J82R6
6164D01K2o89L91l71m8L5M50K58M9k95m98K19m7K5J49J78P6k37j07K03n33J24
$$ plain form
6010 388 -77 -83 8 -127 -193 -288 -131 180 399 249 -196 37 -463 -362 -283 -434 -160 224 380 106 85 -336
6032 -336 -351 -364 -31 298 374 359 -33 230 -266 -449 -170 380 189 146 280 2 -73 -225 172 -171 -293 241
6054 241 188 216 292 -92 -240 -328 -303 137 -94 513 300 247 133 -305 -76 -528 415 204 357 297 102 153 -151
6077 -151 -395 -197 -300 197 353 -68 -119 -93 -349 -116 -82 61 449 591 184 -89 184 -191 -343 -105 -74
6098 -74 -87 110 43 112 -85 -515 -404 8 -148 275 473 470 44 -389 -51 -375 -165 117 203 371 137 -216
6120 -216 -43 -33 -148 -623 -113 184 300 301 85 -141 -232 -299 -58 107 270 327 380 152 -70 -313 -308 -136 -124
6143 -124 49 -97 394 136 53 -117 -372 92 281 266 371 -11 -177 129 -40 -374 -120 -60 123 305 401
6164 401 423 -266 125 -246 -294 -259 191 449 498 203 -295 -76 -123 -98 51 229 305 68 -39 164 -369 -245
6186b45N8J39L26m8l02o9M09n16J66j86L17K0M68m55q8k79L5L11j19K59j27L33
6208D07j02m62j57n7J38n9K74L44q0L3m58K5L9l1j0J81J09K5J71m37l14JJ97L82
6232A59j21K48J77r0k59j50j83m0P0L66K68J31k38k33l28p1O6K05l4K85j23Q3
6254A88l13N9J42j53Pj62L99M01m63k33m7N4J90K2j14K47K12l75L6n10K51M52
6276B90o10L69K69j51m3l03k00K98J4j32J57L21k03J93o50K15J6j64J16L43K46
6297C91j1l22k69j18K12J10N6J39j35J18J71l61j7o9N6j8J7K70j54j48k3q5o9
6320b59N00j96l82M70o3J93n29mK34q5OJ68J84J88l35q4k08J44K30m06N55n01
6342a80L83j20j18l99M70j5k05R5K75J30j73k96rP6k14L54rJ26j80K7n4k26p6
$$ plain form
6186 -245 -187 -48 278 230 -72 -141 268 -248 -82 -268 49 69 537 82 -6 -285 -250 61 -58 201 74 407
6208 407 305 -157 -314 -371 -233 -292 -18 326 246 279 -179 -154 -115 -146 -156 25 134 159 330 -107 -421 -420 -223 159
6232 159 38 286 463 373 114 -36 -219 -259 -189 177 445 576 338 105 -223 -294 -228 -23 -57 228 105 188
6254 188 -125 -66 76 -77 -70 -232 167 568 105 -128 -175 -121 69 91 -23 224 436 61 97 -413 -162 290
6276 290 -320 49 318 167 124 -179 -379 -81 -67 -199 -42 279 76 269 -381 -166 -150 -314 -198 145 391
6297 391 380 58 -211 -329 -117 -7 49 188 53 171 342 -19 -36 -105 -49 -67 -50 220 66 -82 -105 -190 -259
6320 -259 241 45 -337 133 70 263 -266 -270 -36 -121 -115 53 237 425 90 6 -202 -58 172 -234 321 -180
6342 -180 203 83 -35 -434 36 21 -184 -89 186 316 143 -153 -162 -86 -300 54 45 171 -9 18 -36 -262 -338
6365c38K73J60j98N35l61q9r2N8k6J19k46M39J27o6j76l24J38L8N4R9k5J31J26
6388C56j98k51k94K97m2J39J65L61k82j62k13j2L48l95K51j06J44K35j37Oj92
6409A8j7k75N22k6r6O9l12Om8m3J75j13j01M54K2j42j46m19L10j03K68J97J09
6432C09j81k27k7J89r4l38J27K74q3K13K97l47n90m7K56K38R4K13Q7k57j72k74
6454c40L33r0R2j98M66k63N3J53o42Q9K54J34n0N7l0K38o19j17O1L83N9J47l8
6477A32L11m16J4l55K00J81j30M88l81N6m1k26j18K16J36k07L29r5Q8J7l75j82
6499c58J00M72J15l68n4%K44l63j53J66J35N3P1O0K3J87n42J55m09K11O72k94
6521A23L28o79R5m4j29L43k23M09m2k28K46k24k05o0m0K92O6J27J2J26m56j90
$$ plain form
6365 -338 -65 95 -103 432 71 -18 -110 -52 -78 41 -205 234 361 295 119 -205 -67 -29 25 124 99 230 356
6388 356 158 -93 -387 -90 -132 7 172 533 251 89 -124 -136 212 -183 68 -38 106 341 204 210 18
6409 18 1 -274 248 222 126 195 -117 -111 -159 -202 -27 -140 -241 213 235 93 -53 -472 -162 -265 3 200 309
6432 309 128 -99 -126 63 -31 -369 -242 32 -51 162 459 112 -478 -525 -269 -31 63 276 363 106 -66 -340
6454 -340 -7 -97 -5 -203 263 0 53 206 -436 -347 -93 41 -9 48 18 256 -363 -480 -419 -36 23 170 132
6477 132 443 27 41 -314 -114 67 -63 425 44 100 59 -167 -285 -69 67 -140 189 94 182 199 -176 -358
6499 -358 -258 214 329 -39 -93 -93 151 -212 -365 -199 -64 -11 60 120 143 330 -212 -57 -466 -255 417 123
6521 123 451 -228 -133 -177 -306 37 -186 223 181 -47 199 -25 -230 -290 -330 -38 28 155 167 293 -163 -353
6543c53J08l0L96J32j16j55N6q9k15K23j32j51L54J29l2j00J18n73K59l2M00j5
6565A82p5j71K53j43j04l03%L81k26N2M01k85r7N6o8l6j41M55k27K50j76N5j42
6588a09j29k41N10J6J97j8m22P1J00R0j22J33J69k70j00J35K72l45k56K90k01
6609b30K82j07o3K01j13n4p6L27m1j03p3J76P1j95k89k5K5L28J47l3j99M48l54
6632E0o1m11j63O18j1Pq4K62j94j9m69L11M7L53k02m7o1j62J22R8n1j89O60j7
6656C87k42Q0l70N4k01LL88K03p6k25R3r2j84J37K27j68J59L6j82J10J01l9k07
6679hj99J88J02J89j15k07j2k30L18j87N45l94q2p4K88j29k31J77k05J59J09M06
6701D08m70J64m6N1j50k97O28j6j50l1J11k78J17j42j94L03J56k4L2L0k79J19
$$ plain form
6543 -353 -245 -275 121 253 137 -18 38 -51 -266 -43 -175 -326 28 157 125 25 143 -430 -171 -203 197 182
6565 182 107 -64 189 46 -58 -361 -361 20 -206 -154 247 -38 -135 -79 -147 -183 -324 131 -96 154 -22 33 -109
6588 -109 -238 -479 31 47 244 226 -196 -125 -25 65 -57 76 245 -25 -125 10 282 -63 -319 -29 -230
6609 -230 52 -55 -118 83 -30 -84 -160 167 126 23 -50 126 197 2 -287 -312 -287 41 188 155 -44 404 50
6632 50 -11 -422 -585 33 22 29 -55 207 13 -6 -475 -164 -117 236 34 -13 -74 -236 -114 -16 -67 -256 404 387
6656 387 145 225 -145 -91 -292 -289 99 302 226 1 94 2 -182 -45 182 14 173 209 27 137 238 199 -8
6679 -8 -207 -19 83 272 157 -50 -62 -292 26 -161 384 -10 -92 -166 122 -7 -238 -61 -266 -107 2 408
6701 408 -62 102 56 107 -43 -340 288 272 122 91 202 -76 41 -101 -295 8 164 140 172 202 -77 42
6723D2l46J01M05j72j34M60m05Jj82l3L01J01K1j6j07jp8L1l10M53J20o7J17K7
6747C29l49K32l11n2M02l87L16J5KK58l98k21K51j72q4M43k9K6l93L34k50k61
6769b99n4L79K87%k04l46M90p9l35L15l45nM87o9k38p0o7o1K51Nj09J81j33J56
6793A37n00K95j12J48M3K85J25n30J26l13J55M8M8K31ro0K23k59j77J34o8p3L31
6816B28n1J65l40J51p4j43k21L72k54L73R9l12N4K60k95j59k90N55q6J66k59k63
6838c24O94p06J03J99J71J47J08m04J42q2j89j46M74j36m4K23k32K70j42q6j00
6859f0j65L77j25J46j94M69j18j46k06l8K55q1L03k87o7j26k34K58k15L74j7p4
6881B9J15J5j70K84k83j66M96p6j71k0K7N8j1j60j07K78q3K35l48J64l44j6R1
$$ plain form
6723 42 -304 -203 202 30 -104 356 -49 -48 -230 -263 38 139 160 144 37 36 -42 -11 -321 132 252 185 302 329
6747 329 -20 212 -99 -151 251 -136 180 195 197 455 57 -164 87 -85 -169 274 245 271 -122 212 -38 -299
6769 -299 -353 26 313 313 109 -237 253 174 -161 154 -191 -196 291 222 -16 -86 -153 -214 37 42 -67 114 -19 137
6793 137 -363 -68 -180 -32 11 296 421 -109 17 -296 -141 -93 -45 186 177 117 340 81 -96 38 -30 -103 228
6816 228 177 342 2 153 79 -64 -285 87 -167 206 305 -7 47 307 12 -147 -437 118 32 198 -61 -324
6838 -324 370 -336 -233 -34 137 284 392 -12 130 48 -141 -287 187 51 7 230 -2 268 126 40 -60
6859 -60 -225 152 27 173 -21 448 330 184 -22 -60 195 114 417 130 63 -63 -297 -39 -254 120 103 29
6881 29 144 159 -11 273 -10 -176 320 244 73 53 80 138 127 -33 -140 138 55 290 -58 106 -238 -254 -163
6904a63j8K17j2K2k8K1j23j9J28j16M6J78k32j65K70n7l1j43K76k2K27k64k5M26
6928C93o16l9J2J04l7K76o0K51k27l64J66R2J12m8j01J54J28o5k51ko5Q8K70J65
6952C36j3k67Oj04r3Q3K56j28L7n8j2m78M20j09k67M50o0K22j71J9q4O7l92m4
6976c84L29K79r2j04J42O8j66K2j06O3J11J30J63k50j92J32l16j09K05J82k6J75
6998B56l66n1L21j48m69Q9O99j54K1l63K41j93l06M98l89L65J48%k16j47m7M01
7020A90m02K69N6R5j95j16J06k18K26J44k88R9K11j79k54K56j10L6j30K03J40
7041A39j6J54n42K92j13J0lJ70j58L17j78j92j7k04K27Q8k30N68l39n6J03j70
7063a50kJ0j93L53J38j42Q5oJ40k87j96J17K56j71KN4J51l00j17o1N2J52J48L5
$$ plain form
6904 -163 -181 36 24 46 18 39 -84 -103 25 -91 -45 133 -99 -264 6 -51 -82 -225 51 29 256 -8 -33 393
6928 393 -223 -262 -250 -146 -183 93 33 284 57 -307 -141 -49 63 15 -86 68 196 131 -120 -122 -187 -99 171 336
6952 336 323 56 62 -42 -135 -52 204 76 113 55 43 -435 -15 -124 -391 59 -1 221 50 69 -15 52 -340 -384
6976 -384 -55 224 132 28 170 238 72 94 -12 51 162 292 455 205 13 145 -171 -280 -75 107 81 256
6998 256 -110 -161 160 12 -457 -368 331 177 198 -165 76 -117 -423 75 -314 51 199 199 -17 -164 -211 190
7020 190 -212 57 113 208 13 -103 3 -215 11 155 -133 -34 177 -2 -256 0 -110 -74 -204 -1 139
7041 139 123 277 -265 27 -86 -76 -79 91 -67 250 72 -120 -137 -341 -114 -26 -256 312 -27 -83 20 -150
7063 -150 -152 -142 -335 18 156 14 99 93 233 -54 -250 -133 123 -48 -46 8 159 -141 -258 -319 -267 -115 33 68
7087F8J84l43RL15l24J30k29M51J00k45L4j74k14J29K8J05j15K30k67n5j70K54
7109i9L95m18OK07m8kk00Q8j07l5n3L15O7j1J09l37j94J08K06Q6q6o2j9M65k05
7134A76m35L82m46J03K38J71K47o74J24n4j6r3M48k91J33K0Q8p3kk34j08L82j17
7157c1L78k33l18k15J84J13m5j4K23r2K73k72J55N6j59p8Q5j0J08J2k72K00L12
7180C60l23j87L05j55Q3K16j98Pj99r2Q1R7L8k73N27m78K05k1p5J45l08K3K30
7203HL25j60j05k49l6J26o1l5L07o1j45N9j58M9j05M49k52J67R9q5j45k19Q3N9
7227h5J22J68k8L1k99K3p7q4k5Q9M64m13P5J54k9l8k56k55P94k04J14K10l01N9
7251B09j77j3l06L90k21R3J16q6R6q3K2k86J27L97l25J30Q0K5j64p5l1m1K10l9
$$ plain form
7087 68 252 -91 -82 233 -91 39 -190 261 361 116 150 -24 -238 -109 -81 24 -91 139 -128 -183 -353 -99
7109 -99 296 -122 -116 91 43 41 -159 -71 -178 -213 -266 49 116 105 214 -123 -317 -209 -3 83 -3 -65 -84 381 176
7134 176 -259 123 -323 -220 18 189 436 -238 -114 -168 -184 -277 171 -120 13 33 121 48 46 -188 -296 86 -31
7157 -31 347 114 -204 -419 -235 -122 -167 -181 42 -50 223 -49 106 162 3 -75 10 0 108 120 -152 48 360
7180 360 37 -150 155 0 83 299 101 108 -91 -183 -102 -5 33 -240 287 -191 14 -7 -82 63 -245 -222 8
7203 8 333 173 68 -181 -217 -91 -152 -187 120 59 -86 -27 -185 -136 -241 208 -44 123 222 137 -8 -227 -144 -85
7227 -85 37 205 177 208 -91 -68 -145 -229 -254 -165 299 -114 -39 115 86 48 -208 -463 331 127 241 451 150 209
7251 209 32 19 -287 103 -118 -25 91 5 101 18 40 -246 -119 278 -47 83 163 188 24 -51 -82 -123 87 48
7275D8j84J98j07k16J36k7j5O6M06l7k42j68k09K23K08m02L20J74o1J5l08L64
7297A82k54J5j25K71m1l8J66k11k05N0M4O1J78j00J53m2n8p9k57L98l37K57j01
7320g3M54k51j19l28K74J22j28K19k10J19j69K78p4k54K01O3m81L42L00m41L01
7341A45q1l8j10J15p6Q6P2k43L0l9q4k96M28KK54J73j26j88j86J36P7j6n0k29
7365b44M78l3j72l3j1J80k38K03R4K41o11m9O4k72O06j39j14J20k40R3o4q5N6
7388a70K12J64l06L2K48J31l99j98J66m0L98k88J98j84k1J56n36L53j28J62L8
7409a2M42k32n7j65k74K50J84n3j01J23L8j18P5j03k09J70o5o7N15j74J34j63
7431A38k91j17J72J70j20j6J2K67j85j85L43l70p1L63k47L20l51J24n4R9K21j82
$$ plain form
7275 48 -136 62 -45 -261 -125 -152 -167 -101 305 268 26 -142 -351 -128 80 -322 -2 172 111 126 -182 182
7297 182 -72 -57 -182 89 48 10 176 -35 -240 -190 -146 -85 93 -7 146 104 46 -33 -290 108 -229 28 -73
7320 -73 381 130 11 -317 -43 79 -49 170 -40 79 -90 188 114 -140 61 124 -357 -15 285 -156 145
7341 145 64 26 -84 31 -45 41 113 -130 -100 -139 -223 -519 -91 -89 165 338 212 24 -162 -26 51 35 -15 -244
7365 -244 234 201 29 -4 -15 165 -73 130 224 465 -146 -195 -131 -403 203 64 -50 70 -170 -77 -141 -226 -170
7388 -170 42 206 -100 -68 180 311 -88 -286 -120 -160 238 -50 148 -36 -57 99 -437 -84 -212 -50 -12
7409 -12 430 198 141 -24 -298 -48 136 83 -18 105 143 25 100 -3 -212 -42 -107 -174 341 167 301 138
7431 138 -153 -270 -98 72 -48 -64 -52 215 30 -155 188 -182 -253 110 -137 183 -168 -44 -98 1 222 40
7453D0O1J41j58q6k74L92k85P0j9K17K4K73k18N2j75k91L53J69n31M30m3o1m0
7476D1j91J36j07L18j12K06m27L13k67r9M7J64O8J79l67M5Mj74J23J6RK17L0j16
7500E6R9j13j40n9J36p2J18P8l8n7m8j08J55o6J96N3O0j14M6l08K19j55J14l37
7524b85J71Q8R5k2J99k32j48K21k05R6K81J62m95L7p9K40L6k74J72RJ64Q8j23
7547A96m37J94l33N76j86j81J77R2m5r7l64L70P0K3j00l80O31l74J61j91L5M9
7569a14Q4j49M30K64l66k25k45M39j9j37J32R1J6k60k70Q2J35Q8KJ48J13l63L56
7592B32k42k17m1J80J38Q5l11K72j28K28k12m8J69J06k79J23L12k2k96j56J92
7613H5k38J87J59l17J3r9q9J41J32o0K50k87J74k01K40j15k82N22j4m7l1l44L16
$$ plain form
7453 40 101 242 84 -2 -276 116 -169 -99 -118 99 123 396 178 230 55 -236 117 286 -245 185 142 81 41
7476 41 -150 -14 -121 197 85 291 -136 177 -90 -189 -142 22 90 269 -98 -53 -49 -223 -100 -84 -75 142 172 56
7500 56 155 42 -98 -157 -21 -93 25 103 65 8 -40 -148 7 -59 137 190 250 136 182 -126 93 -62 52 -285
7524 -285 -114 -26 69 47 246 14 -134 87 -118 -22 259 421 -74 -37 -116 124 160 -114 58 67 231 319 196
7547 196 -241 -47 -380 196 10 -171 6 98 53 -44 -408 -38 32 55 -45 -425 206 -168 -7 -198 -163 -114
7569 -114 -30 -179 251 515 149 -76 -321 118 99 -38 94 185 201 -59 -329 -247 -112 -24 -22 126 239 -124 232
7592 232 -10 -227 -268 -88 50 135 -176 96 -32 196 -16 -64 105 211 -68 55 367 345 49 -107 85
7613 85 -153 34 193 -124 -111 -210 -299 -158 -26 -86 164 -123 51 -150 90 -25 -307 215 201 154 123 -221 95
7636I5o1k21N4L37j54k21K32k46L69k31J27j65K40k39K92k49N6P5l54J41n0K76
7658A03oj52K93j07k02k3K69j75o2K21o1k3J3Q2k6l99N2K12J02l14J83J87L7j69
7682C5l56P1L22n3j6q2NK43m08L26k55j20Q4L83k90M60k30j44J28j56m6j3K12
7705A00p1J9l0J79P6l29k64J55K70K91l87k04K10j73m9K37J02J30l13l9J89k12
7727a13M0J27j77j25L01q1J8K8L8j58p9K27l1kP1O6j48n0J7J35n6l61N68k86j8
7752d9J63l8R5l03J16l3J56k98J26K42j46j20R1l29M61k70M22n12K4K64J10l31
7774a59J34K06J3K21m12l48K76M8JJ2P4P3l7o8K0J25k39OM5j12M39k20k59K71
7798A10k37j76J91J15K6L1N4j76J05j43K1j89J26K64q3Q3r4J4l00K90j99J43p3
$$ plain form
7636 95 34 -187 -133 204 50 -171 61 -185 184 -47 80 -85 155 -84 208 -41 15 90 -264 -123 -173 103
7658 103 97 -55 238 131 -71 -94 175 0 -62 159 98 75 88 170 144 -255 -203 9 111 -203 -20 167 204 35
7682 35 -321 -250 72 19 3 -79 -74 169 -239 87 -168 -288 -204 179 -111 349 119 -25 103 -53 -99 -112 100
7705 100 29 48 18 197 273 -56 -320 -165 105 396 9 -195 15 -158 -207 30 132 262 -51 -90 99 -113
7727 -113 -73 54 -123 -248 53 -28 -10 18 56 -102 -181 46 15 13 84 150 2 -48 -31 104 48 -313 255 -31 -49
7752 -49 114 76 171 -132 -16 -49 107 -191 -65 177 31 -89 2 -327 134 -136 286 -226 -202 62 172 -159
7774 -159 -25 181 194 415 3 -345 -69 -21 -20 -8 66 139 102 34 54 179 -60 -54 -9 -121 318 98 -161 110
7798 110 -127 -303 -112 3 29 60 114 -62 43 -100 -79 -268 -142 122 39 122 28 42 -258 32 -167 -24 -97
7821i7J45R4kk44R5n4K9n5K19l68p0M83n9J0j60O8j67L23k7L7l43J04o7j81L26
7846C9j14J53k11R4k86K09j70L12n5m1k1K69m43j11L40L38o14K83pP6N2l63J79
7869i2L1o9j91O54k18j01m4J81j2ol45K9K09m4K00J44k07l94R1J09J09k1j78Q7
7893g8J93J24l74J28j9P9l22N07K29n31J20J15n7j70j64K59k03P5L8q6j5J28j02
7916a26J55J23j75J02K02k18J90k94k75j7R0L81j84j68K56M2j28j29J01j67K66
7937B7L9J70r0j17r4j73K37kJ68k64K85k54k51K78l18M1K4K63j17K17jK30k71
7960B7M8J22j37Q1k31N96k67j94j1k54J97K0K7r3M32o4k93k6K35l49L26N7k99
7983e0P6J93k15k13K62r2J73l92K07L39k98L45k35J8k37k4J83O9J13l45M82m38
$$ plain form
7821 -97 48 142 140 -104 -9 -63 -34 -89 130 -238 -308 175 116 126 -34 34 -133 190 163 200 -143 -39 -106 -287 39
7846 39 -75 78 -133 -39 -325 -116 -286 26 -29 -70 -91 178 -265 -376 -36 302 -312 -29 -36 40 92 -271 -92
7869 -92 -61 -130 -321 333 115 14 -30 151 139 133 -212 -183 26 -18 182 326 119 -275 -184 -75 34 13 -165 -78
7893 -78 115 239 -135 -7 -26 53 -269 238 467 -64 56 171 114 -56 -220 39 -164 -89 -51 -137 -152 -24 -126
7916 -126 29 152 -23 79 281 63 253 -41 -316 -333 -243 138 -46 -214 42 84 -44 -173 -72 -239 27
7937 27 66 236 146 29 -65 -238 -1 -3 165 -99 186 -68 -319 -41 -359 -318 -294 -31 -148 69 68 298 27
7960 27 75 197 60 141 -90 506 239 45 34 -220 -23 -3 24 -69 363 299 6 -20 215 -134 192 249 -50
7983 -50 26 219 4 -209 53 -39 134 -258 -51 288 -10 335 100 118 -119 -143 40 109 222 -123 359 -79
8005g9k8J25k68J26N1j87J06O9J28m31L8L12M52k51kk90m8O3K5o5K23K1o7L7M8
8030A08j27l2K73J9k2j16o6J73k6k04k06J40OJ3J21j98J40J3r6k9j04n1J84O1
8054b6k63Q7J29K8p2N8J29j67M0K05j17m5j42L09k74O0J83k04O4K88j34k07L20
8077B49j33j07p3M3L54l93J61j58j06L7J1l8p3R7K04K17k78j76P7O4J8K12n26
8100c17M51K0M0k27q9r6N58l14l19J90N2r1j08J04J28m9m9J12J16j07k00J18p4
8123a51L31j38p3M6j78K34j47J29j66J56R1m6O1k15J73k69P4L67j71j35j99K17
8145iJ56J36m64M39l99K28l5l9k30N6J28J33l41M40n10r2N37l67K48l7k41k08
8167d71K89o4K25r7L36k86J61N2k55OP3n1K23J98k89jl8J76l82K92m4o7J89J81
$$ plain form
8005 -79 -107 18 -250 -124 -73 -260 -154 -85 43 -388 -350 -38 414 163 161 -129 -177 -114 -89 -154 69 90 23 60 108
8030 108 -19 -51 222 241 219 103 37 210 184 -20 -226 -86 -80 -67 54 -144 -4 9 -87 -116 -220 -271 -87 -26
8054 -26 -289 -202 -73 -45 -117 -59 70 -97 -57 148 31 -14 -156 153 -121 -61 122 -82 -18 270 136 -71 249
8077 249 116 9 -64 -21 333 -60 101 -57 -163 -126 -115 -153 -226 -129 75 292 14 -162 -85 -21 -3 209 -317
8100 -317 134 154 194 -33 -122 -218 340 26 -293 -103 -51 -142 -250 -146 -18 -67 -116 -4 112 5 -195 -77 -151
8123 -151 180 42 -31 15 -163 71 -76 53 -113 43 134 88 149 -66 107 -162 -88 279 108 -27 -226 -9
8145 -9 147 283 -181 258 -141 87 52 13 -217 -161 -33 100 -241 199 -311 -403 134 -233 15 -22 -263 -471
8167 -471 -182 -246 -21 -118 218 -68 93 145 -110 -104 -31 -82 141 339 50 49 11 187 -195 97 53 -14 175 356
8191C56
$$ Imaginary data points
##PAGE= N=2
##DATA TABLE= (X++(I..I)), XYDATA
0@%%%%%%Qj6J6j6J9k7L7m5N6o7P9r5J11j33J57j83K14k46K81l23L70m21M76n38
30b86O09o84P67q58R57j069J190j321J465j626J805j997K209k446K709l002L334
47A756l712M144m641N226n928O778p842R216j1070J3724j7864K5290m2720J57371
61A29728J20958k59393o8728J3125l3251n8545J30923J51486J251q0515J3309
72F0348j3958j19284r5114O3694R9748N0480M6195N2634m8250j26980q1944L102
84a09329J9919M3419R5321Q8048r505p8327p3542m8486l7331j502O1148J04274
96E4107Q1892M423p3414r9133p5028k7245L6558R5387R2291K5206k8183l9627
108D7234o0761p7506k8342M6943O0578M7254O6062M1118p2777j31008m6940L0927
$$ plain form
0 0 0 0 0 0 0 0 8 -8 8 -8 11 -16 21 -24 32 -35 44 -51 60 -73 84 -99 115 -131 150 -173 197 -224 252 -286
30 -286 323 -361 406 -452 505 -564 626 -695 770 -856 949 -1048 1161 -1285 1424 -1578 1756
47 1756 -1956 2188 -2453 2773 -3155 3623 -4219 4997 -6073 7651 -10213 15077 -27643 129728
61 129728 250686 -8707 -77435 -64310 -97561 -156106 -25183 126303 127554 47039 60348
72 60348 46390 -72894 -168008 -104314 -4566 45914 92109 144743 96493 -30487 -112431 -109329
84 -109329 -89410 -45991 49330 137378 127873 49546 -23996 -72482 -109813 -111315 -50167 54107
96 54107 135999 140422 67008 -32125 -107153 -134398 -97840 -2453 89838 115044 86861 47234
108 47234 -13527 -91033 -119375 -72432 -11854 35400 101462 142580 69803 -61205 -108145 -77218
120g7218O323J6348J07155J00062l9927j04197l7543k0330o7817r558J20760J12476
132A06534k896l4782j0758o4222j08287j7686Q2654O1050K2680N6152L9421p5156
144E4704j20388l6103K6062R347L1662R4300O9900l1550p8208n3838m1875l3035
156a09022K5082Q5312P7726K4847j9919n1848o8563n0783p854L0947N7675O9069
168F2669M2551j2837n8639p2739n3533n275M4976N8621M6501L8235J0154n6478
180D4206r2937m7873J3167K5348M1800Q3309O1135m0185r1010m5111j1778k6628
192h6557O591Q4210Q4064N643l4381k7730n4522p4628j0120P0052O2495K2704
204D7821K7466J7559n4839r3229l8936K1948K6323L5691O9135N0774k7592p3571
$$ plain form
120 -77218 -70895 -54547 52608 152670 112743 8546 -28997 -49327 -117144 -126702 -5942 106534
132 106534 103638 68856 58098 -6124 -114411 -132097 -49443 11607 34287 90439 129860 54704
144 54704 -65684 -101787 -75725 -66378 -34716 59584 129484 97934 19726 -34112 -75987 -109022
156 -109022 -83940 1372 79098 103945 84026 32178 -36385 -87168 -95022 -64075 -6400 62669
168 62669 105220 92383 33744 -38995 -92528 -97803 -52827 5794 52295 90530 100684 44206
180 44206 -48731 -96604 -83437 -58089 -16289 67020 128155 87970 -3040 -48151 -59929 -86557
192 -86557 -79966 4244 88308 93951 59570 31840 -22682 -97310 -107430 -37378 25117 47821
204 47821 75287 92846 38007 -55222 -94158 -72210 -45887 -10196 58939 109713 82121 8550
216H550n4299k8336j2418K6997O8748O5010K0366k4644n2808o3227m1198N366
228h1893M3219N3438M5411K3158j2569m9077o4201m2878K984M2917N3239M4881
240E8629K8040j0380o0386p1115k6325J6325K4981L5626O3535M4225l0132p3249
252b26m9572k0107r882K6273P4561O0597k278l3677l1337m7234n3284K41N9290
265b6635N3196K3776K0413L868n4600p9670k7871K6768L1234L2788N5341L6662
277I5270l0929o9771m7165j5852M24K7591N8976N0083P708k3888m0602n2747m1912
290h2814N275M9408N4160L5720J5439j6589n5558o2592k3031K2096L7498L7181
302A6193L8895K4593j8950n9137n5647j8702J1958K9918M6634N1104J7893l4081
$$ plain form
216 8550 -45749 -74085 -86503 -59506 9242 74252 94618 69974 17166 -46061 -87259 -81893
228 -81893 -38674 14764 60175 83333 70764 21687 -42514 -85392 -82408 -39491 13748 58629
240 58629 86669 76289 15903 -55212 -81537 -65212 -40231 -4605 58930 103155 73023 -226
252 -226 -49798 -69905 -79787 -53514 21047 81644 79366 45689 14352 -32882 -86166 -85925 -26635
265 -26635 26561 50337 70750 74618 20018 -59652 -87523 -60755 -29521 3267 58608 95270
277 95270 64341 -5430 -52595 -68447 -68023 -40432 18544 68627 76335 52447 11845 -40902 -82814
290 -82814 -77539 -28131 26029 61749 77188 60599 5041 -57551 -80582 -58486 -20988 16193
302 16193 55088 79681 60731 1594 -54053 -72755 -60797 -30879 15755 66859 84752 50671
314E0671n6731m3492k0327M194L7787N6429L8569J520k3399l9765n0897l3914
326g9355J3083M9209M4547K9008J5848j4839n8190o0588j4856K5546L3644L6033
338A9090M1379J7401l1131n6148m1359j5417O766L3805N3548M0327K437k9325
350D1373m5230m6734k5192J7421M7106M3717K4907P025j8900m8544n1027j8273
362g2351K0450L6495L9269L6945J3151k9473n7009m5556j1160J9137L7169M3676
374C0743L1465R65k7869m2911m0121k0678J2473M1650M6819K8688K472k4220m7455
387g979m9291j6831K5614M4218L7355K2403N826k2936m9790m5144j0210K2850
399d3915L4872L6064L0622Q031k7662n1807m3060j1228K0853M0700M2170K5875
$$ plain form
314 50671 -6060 -49552 -69879 -65685 -27898 28531 67100 68620 45221 5456 -45441 -79355
326 -79355 -66272 -17063 27484 56492 72340 57501 -689 -61277 -76133 -50587 -16943 19090
338 19090 60469 77870 46739 -9409 -50768 -66185 -59419 -25614 27934 68261 70698 41373
350 41373 -3857 -50591 -75783 -58362 -11256 32461 57368 64393 45493 -3051 -54078 -72351
362 -72351 -51901 -15406 23863 60808 73959 44486 -12523 -58079 -69239 -50102 -12933 30743
374 30743 62208 63173 35304 -7607 -47728 -68406 -55933 -14283 32536 61224 63696 39476 -7979
387 -7979 -57270 -74101 -48487 -4269 33086 55489 61315 38379 -11411 -56555 -66765 -43915
399 -43915 -9043 27021 57643 65674 38012 -13795 -56855 -68083 -47230 -6530 35640 61515
411F1515k106l0684m4277l6823j1158J9146L7944L7830K5416M275k5274n0098
423a4294m4956r582K7741M1063L4852K2386P00k8585m7286l6588o230K0465L5054
436e260L8657K6381o15l1591m6110l6128q578K2491M0023L7879K1574l044l0109
449B5570m5854l5681m917K4854L7703L3659K0497k706k7573m1918l6204j0744
461f3314K1834M3394L9603J8079p925l0816m3299l3236l197K7229L6712K9420
473C4484J7720l84k7271m4911l5554m498K5709L8792L5506J7872p845l1566m0867
486b2813l1191m904K6026M0714L2723J2775p978k6819l9487l2889l045K6467L6125
499E704K9925J8677k615l1645m7658l1647L432K9254L6314L0098J3953j0665l1125
$$ plain form
411 61515 59409 28725 -15552 -52375 -63533 -44387 -6443 31387 56803 61078 35804 -14294
423 -14294 -59250 -68832 -41091 -28 34824 57210 57910 29325 -17961 -54549 -60779 -40314 -5260
436 -5260 33397 59778 59163 27572 -18538 -54666 -63244 -40753 -730 37149 58723 55679 25570
449 25570 -20284 -55965 -60882 -36028 1675 35334 55831 53125 25552 -16366 -52570 -63314
461 -63314 -41480 1914 41517 59596 51671 20855 -22444 -55680 -58877 -31648 5064 34484
473 34484 52204 51820 24549 -20362 -55916 -60414 -34705 4087 39593 57465 49620 18054 -22813
486 -22813 -54004 -58908 -32882 7832 40555 53330 45352 18533 -20954 -53843 -56888 -30421 5704
499 5704 35629 54306 51691 20046 -27612 -59259 -55827 -26573 9741 39839 53792 43127 12002
512A2002l5519k4236n317J9075L9091L8153J3301j3939l0407l6646k9709k832
524e6983L0468M1210K5592O811o627k4009m1236l1069K652K9545L3979K6580J5326
537E2239p663l3733l9986k3149J640K3043L7828L4603R727j8698l0724k9809k3447
550d8129m028K6254M0976K6562M800q780k2905l9560l3996M574L7361L6635J8795
563C8559O960o906k9669l9560j9797P788K0524K9109L3082J7020j7778l8872l1447
576c0987j5649q98K2658M2208L1151j343j9691k1550k7697k9725k122L5952M1286
589B3593J7307N38p015k5603l9720k3563J0885K9342K9197K4785J0454j6525l6360
602b685k9747j2423L119K1781L6441K7971J418j8873k3908k7791k5726k78L4606
$$ plain form
512 12002 -23517 -47753 -53070 -33995 5096 43249 56550 42611 12204 -24442 -54151 -56983
524 -56983 -26515 14695 40287 47098 40471 16462 -24774 -55843 -53191 -23646 10333 36913 52239
537 52239 44576 10843 -29143 -52292 -50652 -27609 10219 44822 54549 35851 5127 -24682 -48129
550 -48129 -52157 -25903 15073 41635 46435 37655 14750 -24810 -58806 -54232 -16871 19764 38559
563 38559 45519 38613 8944 -30616 -50413 -42625 -22101 7008 40090 57110 39332 460 -30987
576 -30987 -46636 -47534 -24876 17332 48483 47140 27449 5899 -21798 -51523 -53645 -17693 23593
589 23593 40900 41438 34423 8820 -30900 -54463 -43578 -14236 14961 39746 50200 33675 -2685
602 -2685 -32432 -44855 -41736 -19955 16486 44457 45875 27002 3094 -24697 -50423 -50701 -16095
615a6095M1920J8028l833j2419k2764l4665k3394J0255L3411L0303J7392O643
627D4782j2224l4631l5555j0140J4317K2341K5433K5420Q515k1214l2619k3776
639b9351j2747j641K4392M3499K6932j0199k4519j8922k1686k3316L272L5550
651h736L4813J0903j164o371k5957l8338j7093J5753K8329K6188K2884O269k2374
664B5106l6181k4033o747O246K4790L6266K0066r952k1120j7054k0169k1208J857
677d2133L2016L6185J5069k833j3605k7129l4098j4096J8390L2985K3446J1115
689C5312J945j3506k9663k8307q141J2488K0915K6677K5248L727k6664l4705j8530
702c3204m507L446K2924M0176K1598j5822k7687j5061j5387j8880N038L6326L2864
$$ plain form
615 -16095 25825 43853 40020 27601 4837 -29828 -53222 -42967 -9556 20747 38139 44782
627 44782 32558 -2073 -37628 -47768 -33451 -11110 14323 39743 48258 27044 -5575 -29351
639 -29351 -42098 -43739 -19347 24152 51084 40885 16366 -2556 -24242 -47558 -44286 -8736
651 -8736 26077 36980 35816 29445 3488 -34850 -51943 -36190 -7861 18327 41211 47480 25106
664 25106 -11075 -35108 -41855 -35609 -10819 25447 45513 35561 14441 -2613 -22782 -43990 -42133
677 -42133 -10117 26068 41137 38304 24699 -2430 -36528 -50624 -32234 751 24197 35312
689 35312 37257 23751 -5912 -34219 -42360 -29872 -8957 17720 42968 46695 20031 -14674 -33204
702 -33204 -37711 -34265 -11341 28835 50433 34611 6924 -8137 -23524 -42404 -37366 -1040 31824
715C1824L353p663n424k1797l5768j4394K1217L0568K0121J5070M061k1973l5812
728a6617j9414Q01Q678J8586L2087K1787r606k6803k0464j5860j4148O664L4030
741b79L2677P034j0678j3781k1258k8030j1327J9074L2399K1092P916o02j7537
754A6700l1731k2731K449J6399J6455K1112K2270p42l0345l0320q462j110q0K0846
768i290M0118J8978k1375k7747j0317j3541k0361Q391M2671L0809n537j2560n644
781A4595k0310l2542n977K7274K5612J1254J3142N821k5129l7672j3171R191Q432
794a9480J5231L1435J8941j8274k9290j1739p936j5491M405L6148L2005l67j3657
807B1931r719k0347l0171o040K7909L0066J1604N713J714k1499l4371j4270J1799
$$ plain form
715 31824 35177 27514 22090 293 -35475 -49869 -28652 1916 22037 37107 41168 19195 -16617
728 -16617 -36031 -35230 -26552 -7966 24121 45908 36302 9499 -10965 -26825 -40973 -34309 -279
741 -279 32398 39432 28754 14973 -6285 -34315 -45642 -26568 5831 26923 34839 34237 16700
754 16700 -15031 -37762 -35313 -18914 -2459 18653 40923 40181 9836 -20484 -28946 -30056 -30136 -9290
768 -9290 30828 49806 28431 684 -9633 -23174 -43535 -35144 7527 38336 32799 20239 14595
781 14595 -5715 -38257 -44234 -16960 8652 19906 33048 38869 13740 -23932 -37103 -27912 -19480
794 -19480 -4249 27186 46127 27853 -1437 -13176 -21112 -36603 -32198 3950 35955 35588 21931
807 21931 12212 -8135 -38306 -44346 -16437 13629 25233 30946 32660 11161 -23210 -37480 -25681
820b5681J2570J0518K3454K3011j0617l4762k0856j874m533N02K9097L8165L802
833D2796k7157j8678n363j6059j6160J6577L8241J7685n298l733p161k9217l0312
846d3839O023K9536J9133J0987J4162l184l2129l0531m5J0772K784J3988L1981
859B9638J3268k2634k5570p892r592j3530J1971L7775K2979o954j2670r023k1764
872a3998k4014L008K7405K0311Q467J0544q04k7348l2291n036J2500R154J3826
885A724K6773J3846k1098l1036j0368m85p119N141L0961K8670l303k0478j3620
898c92j2604j8767m231K4610K9923J0065l545n867j4911k4984j3835Q855J7905
911g778J4365J6154J3722r929l0997k3051j818O468J0167K1718K4486P99k2905
$$ plain form
820 -25681 -13111 -2593 20861 43872 33255 -1507 -22363 -24237 -28770 -28268 829 38994 42796
833 42796 15639 -3039 -8402 -24461 -40621 -24044 14197 31882 26584 22851 15690 -13527 -43839
846 -43839 -37816 -8280 10853 21840 36002 32818 689 -29842 -29887 -19115 -16331 -2343 29638
859 29638 42906 20272 -5298 -13190 -22782 -36312 -24341 13434 36413 29459 16789 7766 -13998
872 -13998 -38012 -35004 -7599 12712 21179 31723 30919 3571 -28720 -33756 -21256 -12102 1724
885 1724 28497 42343 21245 -9791 -20159 -20644 -27763 -22622 8339 37009 33706 13228 -392
898 -392 -12996 -31763 -35994 -11384 18539 28604 25059 19192 4281 -20703 -34538 -25683 -7778
911 -7778 6587 22741 36463 26534 -4463 -27514 -29332 -22864 -12697 9021 33507 34306 11401
924A1401j9427p140p558o222J2776K8412J7776j206r897j5650k4454j6603Q681
937b9111K6183J9724R062L333r991k5186k1033P57R963O544J3260K3543R747j8646
951A8149k6794j2413l358k282J2661K9342K0935p688k0709j3418j0091j1664O68
964b6662J9629K1990J0430J056o957j9152k5040j0571J1774K1151J7700J2734
976B8082K372j6205k5222j3887J612P003Q754J6220J9076K745j6659k0914j3532
989b0555o632K370J7077K5475J3934n714j6010j6280j5069o986P821J8499J6163
1002A4093R925L082r937k3450k0622j958J2074J2764J5810J7657K326k2152k4799
1015a5187p563L101J465R899K3284J6016o977j7127j2551j2323j0933M310K3602
$$ plain form
924 11401 -8026 -15166 -22724 -28946 -16170 12242 30018 28812 18915 3265 -21189 -37792 -29111
937 -29111 -2928 16796 25858 29191 19200 -5986 -27019 -26262 -16299 -9755 3505 27048 36795 18149
951 18149 -8645 -21058 -24416 -26698 -14037 15305 36240 28552 7843 -5575 -15666 -27330 -26662
964 -26662 -7033 14957 25387 26443 19486 334 -24706 -35277 -23503 -2352 15348 28082
976 28082 30454 14249 -10973 -24860 -23248 -16245 -7491 8729 27805 30550 13891 -7023 -20555
989 -20555 -27187 -24817 -7740 17735 31669 25955 9945 -6335 -21404 -28390 -20569 -2070 14093
1002 14093 24018 27100 17163 -6287 -26909 -28867 -16793 -4029 11781 29438 31764 9612 -15187
1015 -15187 -22750 -19649 -18184 -8285 14999 31015 24038 6911 -5640 -17963 -28896 -24586 -984
1028i84K1325N855l516j0420j9460j9604j213J4513J4222J1066J2972L979j6682
1041A2053k5545j1970K913P117J1325J8817J5323n179j8997j7220q956l390M317
1054a9392J7045K0489R628n828j4352j6348j4182l778J0451J8052J4357Q325n83
1067B3884j3174k2439j4655K061J2167J2435J3495J3204j142j9380k1105p664
1079b2313J104N142J3995K0949J0573r724j6562j1973j0911o161Q616K0713J5466
1092A8914M712k873j1279k0990j6728L484J6351J2500R289J0107M44j7397k1413
1105a4879q146K568O607J2827J9050J1123q493j8132j6314q651O2J0405J6553
1118D580J3106N223l760j3085j7851j1932J153J1549J4764J3017Q248l355j6779
$$ plain form
1028 -984 20341 26196 22680 12260 -7200 -26804 -28017 -13504 718 11784 24756 28735 12053
1041 12053 -13492 -25462 -22549 -15432 -4107 14710 30033 24854 5857 -11363 -20319 -23709 -19392
1054 -19392 -2347 18142 27770 21942 7590 -8758 -22940 -26718 -16267 1785 16142 24467 23884
1067 23884 10710 -11729 -26384 -24323 -12156 279 13774 26978 25836 6456 -14649 -22313
1079 -22313 -21209 -16067 -2072 18877 29450 19726 3164 -8809 -19720 -25881 -17265 3448 18914
1092 18914 23626 20753 9474 -11516 -28244 -24760 -8409 4091 13380 23487 23931 6534 -14879
1105 -14879 -23025 -20457 -13850 -1023 18027 29150 20657 2525 -13789 -22440 -22378 -11973 4580
1118 4580 17686 22909 19149 6064 -11787 -23719 -22566 -11017 3747 16764 25012 21657 4878
1131D878k0409j0130M935J2360J2689J2429P772m967j7698j7105n805K603O796
1144a1652J2894J6967Q497p972j6817j5673r598O94J2541J7937J2001J288n673
1157A5434j2059j6411j0549L460J2230J2118J1131Q583l500j8659j9153n681M976
1170a8080R550J3296J4044N083q737j4958j4072p883J275J1787J5771J1447K746
1183B1269n185j3738j6889r527M683J2943J3533J0322M681n664j6399j5913o590
1196b2474N253J1047J2020J1094N406n793j5910j7243o636N415J2090J3720J0803
1209A8792K595q162j4621j3163o174L074J0495J4528J0972L161o565j5029j6046
1222a6143p763O389J3701J2232R562K998p204j5707j4260n084N397J0758J3035
$$ plain form
1131 4878 -15531 -25661 -20726 -8366 4323 16752 24524 19557 1859 -15246 -21051 -18448 -11652
1144 -11652 1242 18209 26706 18734 1917 -13756 -23354 -22660 -10119 7818 19819 21107 15434
1157 15434 3375 -13036 -23585 -20125 -7895 4223 15354 23937 20437 1778 -17375 -23056 -18080
1170 -18080 -8530 4766 18810 23893 15156 198 -13874 -21757 -20482 -8695 7076 18523 21269
1183 21269 16084 2346 -14543 -24070 -19387 -6444 7089 17411 22092 16428 29 -15884 -22474
1196 -22474 -17221 -6174 5846 16940 22346 16553 643 -16600 -23236 -17821 -5731 7989 18792
1209 18792 21387 13225 -1396 -14559 -20733 -17659 -7164 7364 18336 21497 14932 -97 -16143
1222 -16143 -23906 -17517 -3816 8416 17978 20976 13772 -1935 -16195 -21279 -15882 -5124 7911
1235G911J0071K828p845j3966j4168p143M508J3360J4412R116J046p923j5225
1248c018j4002m137P012J1221J1247Q347K764o499j4190j4589o312N386J3497
1261c273J4266P569L55p317j4304j4743m064Q061J2229R449P823L680o887j6396
1275c552j3956k577O125J0509J2705J0413K38j0811j4045j0940m038M939J3172
1288a818J3637N789j765o248j1618j3167o422O757J3732J1787O743J104p101j6360
1302d950j4219j820R402J1605R534P748J20q895j3357j0183l801M277J2247J4024
1316A1732O898k414p753j1777j3167n664Q772J5741J0692K146J4n302j4608j4159
1330a8849n82J0255R899P007Q130L450r659j6991j0283L7N080J0843J4005Q362
$$ plain form
1235 7911 17982 20810 12965 -1001 -15169 -22312 -17804 -4444 9968 19084 20130 12207 -3018
1248 -3018 -17020 -21157 -14145 -2924 8323 16670 19434 12935 -1255 -15844 -22156 -16770 -3273
1261 -3273 10993 18562 18917 11600 -2704 -17447 -21511 -13450 -1221 8228 16051 19731 12844 -3552
1275 -3552 -17508 -20085 -13960 -3451 9254 19667 19905 9094 -4951 -15891 -19929 -14990 -1818
1288 -1818 11819 17608 15843 9595 -2023 -15190 -21612 -14855 -1123 10664 17407 18511 11410 -4950
1302 -4950 -19169 -20989 -11587 18 9552 17300 17420 8525 -4832 -15015 -18816 -14539 -2292 11732
1316 11732 18630 16216 8463 -3314 -16481 -22145 -13373 2368 13060 15206 15220 9918 -4690 -18849
1330 -18849 -19431 -9176 723 7730 15860 19310 9651 -7340 -17623 -17586 -12506 -1663 12342 20704
1344B0704n080j1691r875p774m756N028J4401J2692K955l176n510j1228j4387
1357a7697l833J0821J4643P844L527M56q007j5053j0837Q94Q252R563J0056P731
$$ plain form
1344 20704 15624 3933 -5942 -13716 -18472 -13444 957 13649 16604 13428 7918 -3310 -17697
1357 -17697 -21530 -10709 3934 11778 15305 15761 7754 -7299 -18136 -17242 -8990 573 10629 18360
$$ [...]
8191A26
##END NTUPLES=NMR FID
##END=
