##TITLE=1H_SR1516_2
 D2O, 8 sc, 
 28.7.2020
##JCAMPDX= 6.0         $$ Bruker NMR JCAMP-DX V2.0
##DATA TYPE= NMR FID
##DATA CLASS= NTUPLES
##ORIGIN= UXNMR, Bruker Analytische Messtechnik GmbH
##OWNER= root
$$ XWIN-NMR		Version 3.5
$$ Tue Jul 28 09:52:48 2020 Russian Standard Time (UT+4h)  she@DPX200
##.OBSERVE FREQUENCY= 200.1315
##.OBSERVE NUCLEUS= ^1H
##.DELAY= (6, 6)
##.ACQUISITION MODE= SIMULTANEOUS
##.ACQUISITION SCHEME= undefined
##.AVERAGES= 8
##.DIGITISER RES= 18
##SPECTROMETER/DATA SYSTEM= spect
##.PULSE SEQUENCE= zg30
##.SOLVENT NAME= DMSO
##.SHIFT REFERENCE= (INTERNAL, DMSO, 0, 15.7039)
##AUDIT TRAIL= $$ (NUMBER, WHEN, WHO, WHERE, WHAT)
$$ ##TITLE= Audit trail, XWIN-NMR		Version 3.5
$$ ##JCAMPDX= 5.01
$$ ##ORIGIN= Bruker BioSpin GmbH
$$ ##OWNER= she
$$ F:/spectra/data/she/nmr/H-F/1/audita.txt
$$ ##AUDIT TRAIL=  $$ (NUMBER, WHEN, WHO, WHERE, WHAT)
(   1,<2020-07-28 09:51:17.45 +0400>,<she>,<DPX200>,
      <created by zg, POWCHK disabled, PULCHK disabled
       configuration hash MD5:
       00 E9 B6 7A A2 85 ED C7 34 08 36 98 17 FE 4E 26
       data hash MD5: 16K
       77 7F DC CB F0 B3 5D EE AF C6 90 73 B3 E0 97 F6>)
$$ ##END=
$$ 
$$ hash MD5
$$ BE 05 85 7B 6E 20 F8 F9 A8 73 6A 93 54 E3 8A C5
##$RELAX= 
##$RELAX= 
##$RELAX= 
##$RELAX= 
##$RELAX= 
##$RELAX= 
$$ Bruker specific parameters
$$ --------------------------
##$DU= <F:/spectra>
##$EXPNO= 1
##$NAME= <H-F>
##$PROCNO= 1
##$TYPE= <nmr>
##$USER= <she>
##$AMP= (0..31)
100 100 100 100 100 100 100 100 100 100 100 100 100 100 100 100 100 100 
100 100 100 100 100 100 100 100 100 100 100 100 100 100 
##$AQSEQ= 0
##$AQ_mod= 1
##$AUNM= <au_zg>
##$AUTOPOS= <>
##$BF1= 200.13
##$BF2= 200.13
##$BF3= 200.13
##$BF4= 200.13
##$BF5= 200.13
##$BF6= 200.13
##$BF7= 200.13
##$BF8= 200.13
##$BYTORDA= 1
##$CFDGTYP= 0
##$CFRGTYP= 5
##$CHEMSTR= <none>
##$CNST= (0..31)
1 1 145 1 1 1 1 1 1 1 1 1 1 1 1 1 1 1 1 1 1 1 1 1 1 1 1 1 1 1 1 1 
##$CPDPRG= <>
##$CPDPRG1= <>
##$CPDPRG2= <>
##$CPDPRG3= <>
##$CPDPRG4= <mlev>
##$CPDPRG5= <mlev>
##$CPDPRG6= <mlev>
##$CPDPRG7= <mlev>
##$CPDPRG8= <mlev>
##$CPDPRGB= <>
##$CPDPRGT= <>
##$D= (0..31)
0 1.2 0 0 0 0 0 0 0 0.06 0 0.03 0 0 0 0 0.0002 0 0 0 0 0 0 0 0 0 0 0 0 
0 0 0 
##$DATE= 1595915476
##$DBL= (0..7)
120 120 120 120 120 120 120 120 
##$DBP= (0..7)
150 150 150 150 150 150 150 150 
##$DBP07= 0
##$DBPNAM0= <>
##$DBPNAM1= <>
##$DBPNAM2= <>
##$DBPNAM3= <>
##$DBPNAM4= <>
##$DBPNAM5= <>
##$DBPNAM6= <>
##$DBPNAM7= <>
##$DBPOAL= (0..7)
0.5 0.5 0.5 0.5 0.5 0.5 0.5 0.5 
##$DBPOFFS= (0..7)
0 0 0 0 0 0 0 0 
##$DE= 6
##$DECBNUC= <off>
##$DECIM= 24
##$DECNUC= <off>
##$DECSTAT= 4
##$DIGMOD= 1
##$DIGTYP= 9
##$DL= (0..7)
0 120 120 120 120 120 120 120 
##$DP= (0..7)
150 150 150 150 150 150 150 150 
##$DP07= 0
##$DPNAME0= <>
##$DPNAME1= <>
##$DPNAME2= <>
##$DPNAME3= <>
##$DPNAME4= <>
##$DPNAME5= <>
##$DPNAME6= <>
##$DPNAME7= <>
##$DPOAL= (0..7)
0.5 0.5 0.5 0.5 0.5 0.5 0.5 0.5 
##$DPOFFS= (0..7)
0 0 0 0 0 0 0 0 
##$DQDMODE= 0
##$DR= 18
##$DS= 0
##$DSLIST= <SSSSSSSSSSSSSSS>
##$DSPFIRM= 0
$$ [...]
##$SUBNAM2= <"">
##$SUBNAM3= <"">
##$SUBNAM4= <"">
##$SUBNAM5= <"">
##$SUBNAM6= <"">
##$SUBNAM7= <"">
##$SUBNAM8= <"">
##$SUBNAM9= <"">
##$SW= 24.9337058887773
##$SWIBOX= (0..15)
0 0 2 0 0 0 0 0 0 0 0 0 0 0 0 0 
##$SW_h= 4990.01996007984
##$TD= 16384
##$TD0= 1
##$TE= 0
##$TE2= 300
##$TE3= 300
##$TEG= 300
##$TL= (0..7)
0 120 120 120 120 120 120 120 
##$TP= (0..7)
150 150 150 150 150 150 150 150 
##$TP07= 0
##$TPNAME0= <>
##$TPNAME1= <>
##$TPNAME2= <>
##$TPNAME3= <>
##$TPNAME4= <>
##$TPNAME5= <>
##$TPNAME6= <>
##$TPNAME7= <>
##$TPOAL= (0..7)
0.5 0.5 0.5 0.5 0.5 0.5 0.5 0.5 
##$TPOFFS= (0..7)
0 0 0 0 0 0 0 0 
##$TUNHIN= 0
##$TUNHOUT= 0
##$TUNXOUT= 0
##$USERA1= <user>
##$USERA2= <user>
##$USERA3= <user>
##$USERA4= <user>
##$USERA5= <user>
##$V9= 5
##$VALIST= <valist>
##$VCLIST= <CCCCCCCCCCCCCCC>
##$VD= 0
##$VDLIST= <DDDDDDDDDDDDDDD>
##$VPLIST= <PPPPPPPPPPPPPPP>
##$VTLIST= <TTTTTTTTTTTTTTT>
##$WBST= 1024
##$WBSW= 4
##$XGAIN= (0..3)
0 0 0 0 
##$XL= 0
##$YL= 0
##$YMAX_a= 210461
##$YMIN_a= -166486
##$ZGOPTNS= <>
##$ZL1= 120
##$ZL2= 120
##$ZL3= 120
##$ZL4= 120
##$ABSF1= 10
##$ABSF2= 0
##$ABSG= 5
##$ABSL= 3
##$ALPHA= 0
##$AQORDER= 0
##$ASSFAC= 0
##$ASSFACI= 0
##$ASSFACX= 0
##$ASSWID= 0
##$AUNMP= <proc_1d>
##$AZFE= 0.1
##$AZFW= 0.1
##$BCFW= 1
##$BC_mod= 2
##$BYTORDP= 1
##$COROFFS= 0
##$CY= 11.3945322036743
##$DATMOD= 1
##$DC= 2
##$DFILT= <>
##$DTYPP= 0
##$F1P= 16.9975609425685
##$F2P= -3.02152046262296
##$FCOR= 0.5
##$FTSIZE= 0
##$FT_mod= 4
##$GAMMA= 1
##$GB= 0.15
##$INTBC= 1
##$INTSCL= 1
##$ISEN= 128
##$LB= 0.24
##$LEV0= 0
##$LPBIN= 0
##$MAXI= 10000
##$MC2= 0
##$MEAN= 0
##$ME_mod= 0
##$MI= 1.114404
##$NCOEF= 0
##$NC_proc= 0
##$NLEV= 6
##$NOISF1= 3.799351
##$NOISF2= 2.8
##$NSP= 1
##$NTH_PI= 0
##$NZP= 0
##$OFFSET= 15.70392
##$PC= 1
##$PHC0= -9794.809
##$PHC1= 5.200916
##$PH_mod= 1
##$PKNL= yes
##$PPARMOD= 0
##$PSCAL= 0
##$PSIGN= 0
##$REVERSE= no
##$SF= 200.130013532006
##$SI= 16384
##$SIGF1= 3
##$SIGF2= 2
##$SINO= 400
##$SIOLD= 16384
##$SREGLST= <1H.CDCl3>
##$SSB= 0
##$STSI= 0
##$STSR= 0
##$SW_p= 3612.71676300578
##$SYMM= 0
##$S_DEV= 0
##$TDeff= 0
##$TDoff= 0
##$TI= <>
##$TILT= no
##$TM1= 0
##$TM2= 0
##$TOPLEV= 0
##$USERP1= <user>
##$USERP2= <user>
##$USERP3= <user>
##$USERP4= <user>
##$USERP5= <user>
##$WDW= 1
##$XDIM= 8192
##$YMAX_p= 0
##$YMIN_p= 0
$$ End of Bruker specific parameters
$$ ---------------------------------
##NTUPLES= NMR FID
##VAR_NAME=  TIME,          FID/REAL,        FID/IMAG
##SYMBOL=    X,             R,               I
##VAR_TYPE=  INDEPENDENT,   DEPENDENT,       DEPENDENT
##VAR_FORM=  AFFN,          ASDF,            ASDF
##VAR_DIM=   8192,          8192,            8192
##UNITS=     SECONDS,       ARBITRARY UNITS, ARBITRARY UNITS
##FACTOR=    0.0002004,     1,               1
##FIRST=     0,             0,               0
##LAST=      1.6414764,     0,               0
##MIN=       0,             -166486,         0
##MAX=       1.6414764,     210461,          0
$$ Real data points
##PAGE= N=1
##DATA TABLE= (X++(R..R)), XYDATA
$$ [...]
$$ plain form
2198 -1190 -851 -1746 -267 2360 3290 1277 -850 -1016 -1092 -1592 -1859 -647 1978 3019 1826 -788 -1732
2215 -1732 -1778 -1085 -1502 -444 2123 3158 1870 -1343 -1832 -1364 -1344 -1602 -369 2054 3523 1324 -1073
2232 -1073 -1520 -1157 -1474 -1459 -146 2351 3363 1473 -803 -1675 -1464 -929 -1165 -412 1721 3163 1630
2249 1630 -793 -1859 -1401 -1087 -1674 -459 2217 3182 1461 -1493 -1847 -1073 -901 -1171 -81 2328 3061
2266 3061 1388 -1153 -2004 -1241 -1024 -1251 -490 1951 2849 1304 -1261 -1794 -1254 -1043 -1392 -119 2244
2283 2244 3044 1426 -967 -1661 -1113 -943 -1250 -221 1822 2960 1154 -1099 -1869 -1005 -998 -1181 -223 2271
2301 2271 2874 1058 -1138 -1703 -649 -674 -1015 -182 2135 2935 1109 -1140 -1691 -1145 -928 -1089 -85 1852
2319 1852 2605 1220 -1145 -1382 -1025 -1244 -1149 144 1894 2738 898 -1055 -1811 -1104 -1269 -1335 29 1943
$$ packed form
2198a190L39q95J479K627R30k013k127j66p6n00k67J212K625J041j193k614r44
2215a732m6O93m17J058K567J035j288l213m89M68K0k58J233K423J469k199k397
2232a073m47L63l17J5J313K497J012j890k276q72K11N35k36P53K133J442j533
2249A630k423j066M58L14n87J215K676R65j721k954l54P74J72k70J090K409P33
2266C061j673k541q51P63K17k27P61K441Q98j545k565n33N40K11l49J273K363
2283B244Q00j618k393o94N48J70l07J029K043J138j806k253p70Q64Pj83R58K494
2301B271O03j816k196n65J054k5l41Q33K317Q00j826k249n51N46K17j61J004J937
2319A852P53j385k365k37L57k19R5J293J750Q44j840j953p56P07j65o6J364J914
$$ plain form
2337 1943 2684 968 -805 -1595 -1362 -804 -824 129 2006 2494 1073 -921 -1662 -798 -800 -1108 84 2221
2355 2221 2746 927 -1240 -1364 -768 -1201 -1070 308 2179 2457 870 -1007 -1551 -1105 -808 -915 157
2372 157 2209 2493 684 -1380 -1485 -1035 -629 -890 46 2088 2406 477 -1286 -1520 -1046 -726 -780 26
2390 26 1893 2281 865 -1191 -1382 -635 -937 -951 173 1952 2335 594 -1039 -1720 -675 -1019 -756 183
2408 183 1820 2345 704 -1344 -1502 -786 -507 -844 91 2000 2381 725 -1208 -1181 -720 -940 -714 303
2426 303 1989 2271 832 -1540 -1607 -773 -607 -731 224 1732 2135 555 -1121 -1517 -640 -875 -787 344
2444 344 1975 2091 775 -1197 -1459 -964 -535 -1133 2 1719 2198 829 -1438 -1212 -680 -768 -944 337
2462 337 1997 2091 452 -938 -1222 -753 -785 -790 140 1847 2164 691 -1153 -1441 -884 -772 -955 405 1991
$$ packed form
2337A943P41j716j773p90K33N58k0R53J877M88j421j994p41Q64kl08J192K137
2355B221N25j819k167j24N96m33J31J378J871K78j587j877n44M46K97j07J072
2372A57K052K84j809k064j05M50M06k61R36K042L18j929j763k34M74L20n4Q06
2390B6J867L88j416k056j91P47l02j4J124J779L83j741j633o81J045l44K63R39
2408A83J637N25j641k048j58P16K79l37R35J909L81j656j933K7M61k20K26J017
2426C03J686K82j439k372o7Q34J66j24R55J508M03j580j676l96Q77k35Q8J131
2444C44J631J16j316j972k62M95M29n98J135J717M79j369k267K26N32q8j76J281
2462C37J660R4j639j390k84M69l2nR30J707L17j473j844k88N57J12j83J360J586
$$ plain form
2481 1991 2264 266 -1220 -1229 -867 -631 -851 374 1791 1697 605 -1087 -1136 -555 -511 -1010 202 1832 2244
2500 2244 327 -1548 -1360 -464 -733 -758 442 1998 2050 504 -888 -1457 -277 -540 -908 161 1722
2517 1722 1982 250 -1316 -1372 -383 -461 -567 369 2067 2006 348 -1023 -1198 -525 -612 -453 362 1710 1852
2536 1852 549 -1280 -1170 -352 -536 -793 131 1933 2123 382 -1163 -954 -758 -612 -410 292 1625 1970
2554 1970 455 -1026 -1221 -388 -593 -766 -255 1503 1835 324 -1145 -1385 -620 -927 -581 226 1697 1910
2572 1910 112 -1178 -1090 -278 -744 -637 310 1874 1657 8 -1191 -1218 -185 -524 -959 100 1873 1687
2590 1687 -97 -1011 -1352 -697 -506 -131 438 1491 1937 12 -1068 -1290 -371 -463 -659 128 1610 1546 146
2609 146 -1088 -858 -688 -712 -636 613 1653 1365 441 -1114 -1130 -240 -530 -438 -38 1652 1422 70 -1121
$$ packed form
2481A991K73j998j486rL62K36k20J225J417r4j092j692m9N81M4m99J212J630M12
2500B244j917j875J88Q96k69k5J200J556N2j546j392n69J180k63l68J069J561
2517A722K60j732j566n6R89p8j06R36J698o1j658j371j75O73q7J59Q15J348J42
2536A852j303j829J10Q18j84k57R24J802J90j741j545K09J96J46K02P02J333L45
2554A970j515j481j95Q33k05j73N11J758L32j511j469k40P65l07L46Q07J471K13
2572A910j798j290Q8Q12m66J07R47J564k17j649j199k7J033l39m35J059J773j86
2590A687j784r14l41O55J91L75N69J053M46j925j080k22R19r2j96P87J482o4j400
2609A46j234K30J70k4P6J249J040k88r24j555j6Q90k90R2M00J690k30j352j191
$$ plain form
2628 -1121 -860 -628 -544 -569 264 1791 1625 -34 -896 -924 -604 -670 -410 547 1484 1462 43 -1362 -1177 -518
2648 -518 -377 -573 712 1675 1541 7 -1312 -1300 -567 -192 -469 524 1700 1712 -146 -1423 -1033 -475 -590
2667 -590 -480 482 1772 1369 59 -1172 -824 -815 -969 -500 349 1437 1390 132 -1094 -1364 -571 -312 -373
2686 -373 304 1767 1382 -224 -1133 -954 -49 -850 -499 508 1559 1188 -139 -1139 -876 -284 -387 -333
2704 -333 728 1500 1556 43 -1157 -1146 -281 -235 -415 38 1649 1548 -18 -1115 -1061 -372 -517 -457 409 1623
2724 1623 995 -202 -1144 -672 -596 -244 -114 336 1322 860 -258 -1098 -632 -571 -292 -134 238 1464 1216
2743 1216 -211 -1241 -992 -294 -171 -232 295 1396 1019 -99 -1013 -825 -607 -629 -262 589 1657 1045 -479
2762 -479 -1047 -859 -206 -112 -327 619 1671 1153 -45 -990 -697 -257 -518 -489 240 1230 1118 6 -619 -804
$$ packed form
2628a121K61K32Q4k5Q33J527j66j659q62k8L20o6K60R57R37k2j419j405J85O59
2648e18J41j96J285R63j34j534j319J2P33L75k77R93J176J2j858j277L90N58j15
2667e90J10R62J290m03j310j231L48Rj54M69Q49J088m7j258j226k70P93K59o1
2686c73O77J463l85j606r09J79R05q01L51J007J051l71j327j000K63N92j03N4
2704c33J061P72N6j513j200J1Q65M6j80M53J611j01j566j097N4O89j45O0Q66J214
2724A623o28j197r42M72P6L52J30M50R86m62j118q40M66O1K79J58L72J226k48
2743A216j427j030K49O98J23o1N27J101l77j118r14J88K18k2L67Q51J068o12j524
2762d79n68J88O53R4k15R46J052n18j198r45K93M40k61K9P29R90j12j112o25j85
$$ plain form
2782 -804 -357 -411 -301 430 1331 1072 -280 -1152 -1015 -410 -550 -529 586 1667 1059 -201 -1097 -764 -231
2801 -231 -185 -199 382 1404 1024 -391 -1139 -815 -88 -37 184 349 1378 883 -350 -1081 -1028 -199 -565 -667
2821 -667 422 1555 933 -372 -1094 -872 -150 -298 -356 655 1446 1191 -336 -1343 -1145 -277 -166 -301
2839 -301 518 1232 1248 -338 -1097 -736 -66 -73 -230 503 1378 937 -819 -920 -395 -31 -319 -268 479 807 799
2860 799 -362 -784 -787 -424 -71 -221 702 1503 1020 -185 -1244 -500 -130 -58 -255 395 1293 694 -343 -1183
2880 -1183 -482 -67 -529 -469 603 1406 764 -475 -848 -512 -153 -127 161 348 1298 785 -126 -1143 -650
2899 -650 148 -41 -572 357 1504 899 -653 -1182 -298 78 -96 -213 668 1118 649 -649 -619 -589 -205 -352
2919 -352 145 718 1168 621 -288 -782 -785 -83 31 -163 394 1345 946 -522 -1056 -550 -46 -250 -367 406
$$ packed form
2782h04M47n4J10P31R01k59j352q72J37O05j40K1J115J081o08j260q96L33N33
2801b31M6j4N81J022l80j415p48L24P27N1K21J65J029m95j233p31N3Q29l66j02
2821f67J089J133o22j305p22K22P22j48n8J011P91k55j527j007J98Q68J11j35
2839c01Q19P14J6j586p59L61O70pj57P33Q75m41j756j01N25L64k88N1P47L28q
2860G99j161m22lL63L53j50R23Q01m83j205j059P44L70P2j97O50Q98n99j037q40
2880a183P01M15m62O0J072Q03o42j239l73L36L59K6K88J87R50n13r11j017M93
2899f50P98j89n31R29J147o05j552n29Q84L76j74j17Q81M50m69j298L0L0L84j47
2919c52M97N73M50n47r09m94lP02J14j94N57R51l99j468n34N06N04k04j17P73
$$ plain form
2939 406 1303 602 -471 -891 -437 -253 -165 -30 654 933 672 -212 -1012 -612 -471 147 119 93 1215 882
2959 882 -314 -1081 -395 64 -294 -226 386 1402 525 -424 -1005 -452 -244 -265 -142 647 1070 927 -344 -1167
2979 -1167 -581 -433 -121 -135 461 1125 672 -202 -898 -920 -100 -130 -95 470 1683 539 -430 -849 -519 68
2999 68 52 21 607 1003 597 -444 -518 -397 -162 -28 -15 327 1317 905 -356 -993 -715 379 -162 7 369
3020 369 1445 649 -679 -1068 -258 -212 -124 -27 527 1068 418 -376 -695 -394 -30 29 -101 744 1232 878 -352
3041 -352 -513 -623 -105 -218 -56 659 1274 382 -402 -1252 -774 -11 -245 -217 789 981 590 -512 -912 -558
3061 -558 -139 -288 -180 430 899 468 -551 -1208 -473 53 -432 -19 474 1167 245 -551 -1041 -534 51 -346
3081 -346 -46 532 910 306 -474 -1219 -652 38 -56 -135 368 1201 530 -608 -674 -234 -12 -162 82 822 936
$$ packed form
2939D06Q97p01j073m20M54J84Q8J35O84K79k61q84q00M00J41O18k8k6J122l33
2959H82j196p67O86M59l58O8O12J016q77r49n81N53K08k1J23P89M23j43j271q23
2979a167N86J48L12j4N96O64m53q74o96k2Q20l0L5N65J213j144r69m19L30N87
2999F8j6l1N86L96m06j041p4J21K35J34J3L42R90m12j261o37K78J094n41J69L62
3020C69J076p96j328l89Q10M6Q8R7N54N41o50p94l19L01L64N9j30Q45M88l54j230
3041c52j61j10N18j13J62P15O15q92p84q50M78P63k34K8J006J92l91j102m00L54
3061e58M19j49J08O10M69m31j019o57P35N26m85M13M93O93r22p96m90N07N85l97
3081c46L00N78L78o04p80p45N67O90r4p9N03Q33o71j138o6M40K22j50K44P40J14
$$ plain form
3102 936 573 -479 -890 -530 133 -74 141 427 746 658 -810 -1068 -522 -124 -21 115 544 966 579 -642
3122 -642 -970 -336 30 -157 -155 573 1078 652 -696 -696 -157 84 -337 56 602 853 515 -837 -557 -467 -211
3143 -211 -150 -219 317 1049 563 -281 -858 -533 38 -251 50 574 1085 466 -498 -924 -248 -84 14 -25 408
3164 408 1053 374 -302 -764 -474 237 15 -35 439 1291 648 -631 -699 -228 -111 -318 21 554 1107 194
3184 194 -398 -730 -474 -237 -90 -322 391 1017 290 -618 -853 -249 135 -250 90 783 705 195 -464 -684
3204 -684 -155 58 -272 63 201 888 362 -759 -676 -521 91 196 70 624 743 389 -480 -756 -266 223
3224 223 -248 -137 420 995 307 -307 -791 -341 -66 -71 -202 333 726 -66 -501 -729 -388 116 -393 -118 421
3245 421 961 387 -540 -937 -301 -128 -67 58 424 1023 227 -602 -916 -37 -55 -212 -98 442 917 466 -604
$$ packed form
3102I36l63j052m11L60O63k07K15K86L19q8j468k58N46L98J03J36M29M22l87j221
3122f42l28O34L66j87KP28N05m26j348%N39K41m21L93N46K51l38j352K80R0K56
3143b11O1o9N36P32m86q44n77L25N71k89L01N24N11o19r64m26O76J64R8l9M33
3164D08O45o79o76m62K90P11k22n0M74Q52o43j279o8M71J17k07L39N33N53r13
3184A94n92l32K56K37J47k32P13O26p27r08k35O04L84l85L40O93p8n10o59k20
3204f84N29K13l30L35J38O87n26j121Q3J55O12J05j26N54J19l54q69k76M90M89
3224B23m71J11N57N75o88o14m84M50K75nj31N35L93p92m35k28L41N04n09K75N39
3245D21N40n74r27l97O36J73O1J25L66N99p96q29l14Q79j8j57J14N40M75m51j070
$$ plain form
3266 -604 -1118 -715 99 -288 170 633 917 136 -635 -634 -235 -185 -185 -191 364 752 396 -847 -729 -208 -175 -234 -212
3289 -212 632 695 410 -599 -740 -260 99 -102 91 467 932 644 -492 -833 -41 -391 -162 73 86 977
3309 977 457 -622 -528 -183 224 -117 -48 435 917 447 -672 -800 -11 -9 -201 257 533 930 419 -576 -672
3330 -672 -235 262 -105 -153 625 778 320 -656 -744 -152 185 71 178 180 684 271 -559 -771 92 71 -289 134
3352 134 592 916 288 -763 -724 -342 248 -84 -296 392 815 317 -806 -619 -520 107 -269 -60 658 451
3372 451 229 -774 -417 -3 -1 -200 -205 538 459 301 -681 -747 -244 74 -120 140 539 732 124 -940 -751
3393 -751 -457 300 -35 -138 407 596 47 -635 -562 -296 -22 109 -119 550 767 105 -421 -489 -28 152 153
3414 153 115 470 530 116 -463 -768 -156 437 -167 -52 589 789 192 -609 -720 -128 336 38 195 588 610
$$ packed form
3266f04n14M03Q14l87M58M63K84p81p71JL99N0%oN55L88l56j243J18N21L3n9K2
3289b12Q44O3k85j009j41M80L59k01J93L76M65k88j136l41P92l50K29K35J3Q91
3309I77n20j079R4L45M07l41O9M83M82m70j119j28P89Kj92M58K76L97n11r95r6
3330f72M37M97l67m8P78J53m58r76q8N92L37j14J07KN04m13q30k12Q63k1l60M23
3352A34M58L24o28j051L9L82N90l32k12O88M23m98j123J87R9O27l76K09P18k07
3372D51k22j003L57M14Kj99nP43p9j58r82o6N03L18j94K60L99J93o08j064J89
3393g51K94P57l35j03N45J89n49o82P3K66K74J31k28O69K17o62n26o8M61J80J
3414A53l8L55O0m14n79l05O12N93o04J15O41K00n97q01j11N92M64k98J57L93K2
$$ plain form
3435 610 -135 -531 -460 -193 -108 5 231 238 571 258 -655 -341 -92 128 -6 -234 199 394 420 -719 -730 -36
3457 -36 -33 -90 152 419 698 78 -510 -259 -53 34 -306 430 379 409 -13 -502 -604 -20 266 -40 -52 573 640
3480 640 305 -527 -737 -77 77 -307 140 537 746 234 -822 -510 109 321 -29 196 399 483 136 -412
3500 -412 -458 -362 7 -33 52 422 892 210 -487 -729 126 -82 -58 -134 676 573 -184 -413 -555 -245 -4 -180
3522 -180 -182 388 306 154 -366 -436 184 -143 211 15 541 800 279 -633 -340 -25 163 -128 -211 683 564 -54
3544 -54 -382 -324 269 67 -43 -155 333 662 20 -753 -558 -212 36 -31 119 367 526 127 -293 -468 279
3565 279 159 -18 -222 405 550 60 -546 -408 -238 264 -50 -24 465 324 -55 -360 -532 197 264 -174 -221
3586 -221 217 686 -121 -730 -363 -182 -140 174 64 481 481 49 -498 -488 77 136 -104 145 487 616 -64 -656
$$ packed form
3435F10p45l96P1K67Q5J13K26PL33l13r13L14K49K20j34k28M33J95K6j139j1O94
3457c6Ln7K42K67K79o20n88K51K06Q7l40P36n1L0m22m89j02N84K86l06j2O25O7
3480F40l35q32k10O60J54l84M47L97K09n12j056L12O19K12l50K25K03Q4l47n48
3500d12m6R6L69m0Q5L70M70o82o97k42Q55k08K4p6Q10j03p57k29j42L10K41j76
3522a80kN70q2j52n20p0O20l27L54j96N26K59n21r12K93L15J88k91q3Q94j19o18
3544e4l28N8N93k02j10j12M88L29o42p73J95L46K48o7J50K48J59l99m20j75P47
3565B79j20j77k04O27J45m90o06J38J70N02l14K6M89j41l79l05j72P29O7m38m7
3586b21M38M69q07o09L67J81M2L14j10M17%m32n47J0N65N9k40K49L42J29o80n92
$$ plain form
3608 -656 -462 -316 102 -63 -18 322 706 -292 -519 -405 119 244 -213 369 533 175 -83 -219 -467 18
3628 18 -91 43 171 351 223 41 -642 -239 157 302 122 124 433 654 154 -804 -589 159 79 -138 116
3649 116 632 610 32 -196 -345 -168 -141 74 137 272 488 -47 -331 -516 -204 121 49 -172 287 309 41 -559
3671 -559 -598 -117 316 28 61 735 785 -107 -479 -467 -137 275 28 167 189 344 58 -357 -555 -24 241 135
3693 135 64 279 576 158 -458 -308 -100 181 -107 82 513 342 317 -571 -291 121 102 132 158 282 338 -229
3715 -229 -406 -288 72 80 -7 105 279 306 -70 -284 -190 74 11 -108 158 521 343 133 -332 -245 94 -65
3737 -65 -288 196 573 454 320 -482 31 -109 -34 212 40 162 607 16 -510 -686 -29 101 -83 2 420
3758 420 501 155 -355 -273 97 -170 81 143 617 269 -102 -223 -317 -263 138 -273 182 345 500 243 -535 -264
$$ packed form
3608f56J94J46M18j65M5L40L84r98k27J14N24J25m57N82J64l58k58j36k48M85
3628A8j09J34J28J80j28j82o83M03L96J45j80KL09K21n00r58K15P48q0k17K54
3649A16N16k2n78k28j49J77K7K15O3J35K16n35k84j85L12L25p2k21M59K2k68o00
3671e59l9M81M33k88L3O74N0q92l72J2L30M12k47J39K2J55k86m15j98N31K65j06
3693A35p1K15K97m18o16J50K08K81k88J89M31j71k5q88K80M12j9L0K6J24N6n67
3715b29j77J18L60Qq7J12J74K7l76k14R4K64o3j19K66L63j78k10m65Q7L39j59
3737f5k23M84L77j19j34q02N13j40P5K46j72J22M45n91n26j76O57J30j84Q5M18
3758D20Q1l46n10Q2L70k67K51O2M74l48l71j21r4N4M01m11M55J63J55k57p78K71
$$ plain form
3780 -264 100 286 -52 -6 287 174 -256 -154 -385 103 358 46 -141 103 367 -299 -346 -65 25 101 19 206
3802 206 478 315 190 -374 -429 221 91 173 -132 417 208 -16 -735 -444 -123 484 33 14 447 502 -191
3823 -191 38 -244 -110 0 179 -129 238 389 -269 -472 -531 68 -85 -19 -159 159 412 -326 -635 -239 162
3844 162 168 -261 94 198 384 -163 -545 -90 -8 263 227 11 222 501 46 -174 -253 -65 234 -76 -23 729
3866 729 302 134 -329 -370 -25 167 -105 -96 68 -87 -174 -194 -217 63 72 96 143 337 424 1 -347 -491 152 237
3890 237 -191 -171 192 370 -60 -216 -376 -17 3 -224 170 180 -25 -304 -383 -11 -36 137 296 91 284 604
3912 604 -171 -384 -180 3 -5 -169 -71 471 316 -101 -480 -65 -45 107 -68 180 401 526 -58 -228 -333
3933 -333 -34 79 -255 59 117 239 -219 -429 -239 218 -147 -161 -124 224 649 -151 -552 -182 228 365 -211
$$ packed form
3780b64L64J86l38M6K93j13m30J02k31M88K55l12j87K44K64o66m7K81R0P6q2J87
3802B06K72j63j25n64n5O50j30Q2l05N49k09k24p19K91L21O07m51j9M33N5o93
3823a91K29k82J34J10J79l08L67J51o58k03n9N99j53O6j40L18K53p38l09L96M01
3844A62Om29L55J04J86n47l82M55Q2K71l6k16K11K79m55k20p9J88K99l10N3P52
3866G29m27j68m63m1L45J92k72RJ64j55q7k0k3K80RK4M7J94Q7m23l48j44O43Q5
3890B37m28K0L63J78m30j56j60L59K0k27L94J0k05k79p9L72k5J73J59k05J93L20
3912F04p75k13K04J83qj64R8N42j55m17l79M15K0J52j75K48K21J25n84j70j05
3933c33K99J13l34L14N8J22m58k10J90M57l65j4L7L48M25q00m01L70M10J37n76
$$ plain form
3954 -211 -79 544 396 161 -181 -5 -24 -60 164 -90 603 -30 -189 -723 -357 251 39 89 -163 104 434
3975 434 -151 -460 -153 19 65 -123 75 288 525 -118 -324 -84 129 -68 -77 -207 393 417 -239 -342 -50
3996 -50 -113 56 27 -90 226 141 -114 -636 -248 139 511 -228 -67 363 283 -395 -252 -16 104 158 -344 76
4018 76 186 448 -82 -167 -273 81 220 -533 15 345 186 -6 -288 -417 254 -48 -168 -206 142 78 -145
4039 -145 -391 -118 105 9 143 -204 230 6 -451 -334 -375 -96 -140 -20 -73 256 295 9 -658 -239 205 -180
4061 -180 -47 -88 314 104 -256 -289 -252 103 -4 -36 288 56 365 127 -133 90 -81 308 -351 6 150
4082 150 178 -307 -189 -47 32 159 -480 260 485 -9 -162 -518 -231 -119 216 19 32 282 354 -205 -665
4103 -665 -336 -39 -44 -84 173 276 125 -130 -107 -53 313 318 94 -75 -73 323 -415 -413 -209 186 302 -307 9 158
$$ packed form
3954b11J32O23j48k35l42J76j9l6K24k54O93o33j59n34L66O08k12N0k52K67L30
3975D34n85l09L07J72M6j88J98K13K37o43k06K40K13j97rj30O00K4o56j03K92
3996e0o3J69k9j17L16q5k55n22L88L87L72p39J61M30q0o78J43K36J20N4n02M20
4018G6J10K62n30q5j06L54J39p53N48L30j59j92k82j29O71l02j20l8L48o4k23
4039a45k46K73K23r6J34l47M34k24m57J17m1K79m4J20n3L29L9k86o67M19M44l85
4061a80J33m1M02k10l60l3L7L55j07l2L24k32L09k38k60K23j71L89o59L57J44
4082A50K8m85J18J42P9J27o39P40K25m94j53l56K87J12L35j97J3K50P2n59m60
4103f65L29K97nm0K57J03j51k55K3N4L66Nk24j69KL96p38KK04L95J16o09L16J49
$$ plain form
4127 158 321 -249 -445 -179 257 51 -57 -36 375 179 -136 -319 -219 173 286 68 66 316 -36 15 -438
4148 -438 -43 -22 -59 20 411 210 212 -249 -485 -441 -85 0 -100 292 533 112 -106 -333 -172 240 127 -51
4170 -51 -10 114 459 -205 -274 -362 -65 150 -87 -187 306 229 97 -443 -195 259 168 -76 79 178 142 -76 -416
4193 -416 -5 297 58 -306 -6 216 347 -246 -362 -55 -46 -16 -185 16 13 -19 250 -323 22 -100 115 -84
4215 -84 172 194 220 -170 -243 -267 285 115 -310 101 197 389 -217 -204 -60 138 13 -112 374 125 131 18 -304
4238 -304 -123 -146 -43 -230 121 112 464 114 -273 335 178 205 -164 -130 99 6 -305 -347 139 118 -54 -183 175
4261 175 62 151 -258 -266 -303 66 422 148 26 252 73 -256 -437 -429 172 145 -265 -175 585 131 -449 -42 57
4284 57 -109 240 74 -40 97 163 -54 -163 -117 -51 -37 -1 260 33 104 -239 -593 -179 -130 64 187 71 418
$$ packed form
4127A58J63n70j96K66M36k06j08K1M11j96l15j83J00L92J13k18kK50l52N1m53
4148d38L95K1l7P9L91k01Km61k36M4L56Q5j00L92K41m21k18k27J61M12j13j78
4170e1M1J24L45o64o9q8K97K15k37j00M93p7j32n40K48M54r1k44J55R9l6k18l40
4193d16M11L02k39l64L00K22J31n93j16L07RL0j69K01ll2K69n73L45j22K15j99
4215h4K56K2K6l90p3k4N52j70m25M11R6J92o06J3J44J98j25j25M86k49Oj13l22
4238c04J81k3J03j87L51rL52l50l87O08j57K7l69L4K29r3l11m2M86k1j72j29L58
4261A75j13Q9m09ql7L69L56k74j22K26j79l29j81QO01k7m10R0P60m54n80M07R9
4284E7j66L49j66j14J37O6k17j09M6O6J4L6K61k27P1l43l54M14M9J94J23j16L47
$$ plain form
4307 418 252 -24 -242 -125 201 34 -286 84 54 317 -224 -189 -141 189 258 -77 -223 237 483 165 -126
4328 -126 -101 14 30 -136 183 122 85 56 -224 -28 -182 -167 -288 -51 -133 79 -198 -126 -54 -153 292 119 -190
4351 -190 111 421 -95 -126 -262 237 -19 56 154 217 188 -223 -232 -210 182 28 -47 238 504 113 -89 -506 -215
4374 -215 415 190 -241 94 0 43 -175 -155 -295 -56 -50 -48 304 200 -243 -284 -269 -228 126 197 -150 -1 154 308
4398 308 -57 -450 190 96 -26 70 -59 209 316 -326 -264 -16 32 27 110 114 140 260 -254 -437 -125 98 60 -303
4422 -303 -92 345 235 75 -393 -168 167 62 89 26 -104 68 -36 -103 221 285 -164 -491 -125 151 -34
4443 -34 -296 -255 2 117 211 -125 0 167 -193 -247 -164 -254 304 -63 -57 104 -105 -70 -393 -199 25 -70 179
4466 179 28 -81 355 268 -146 -168 -314 204 -81 14 105 213 76 106 -141 -156 334 -148 -256 -52 -10 111
$$ packed form
4307D18j66k76k18J17L26j67l20L70l0K63n41L5M8L30O9l35j46M60K46l18k91
4328a26K5J15J6j66L19o1l7k9k80J96j54J5j21K37q2K12k77P2P2r9M45j73l09
4351a90L01L10n16l1j36M99k56P5R8O3k9m11rK2L92j54p5K85K66l91k02m17K91
4374b15O30k25m31L35r4M3k18K0j40K39OKL52j04m43m1J5M1L54P1l47J49J55J54
4398C08l65l93O40r4j22R6j29K68J07o42O2K48M8nQ3MK6J20n14j83L12K23l8l63
4422c03K11M37j10j60m68K25L35j05K7o3j30J72j04o7L24O4m49l27L66K76j85
4443c4k62M1K57J15R4l36J25J67l60n4Q3r0N58l67OJ61k09L5l23J94K24r5K49
4466A79j51j09M36q7m14k2j46N18k85R5R1J08j37L0k47j5M90m82j08K04M2J21
$$ plain form
4488 111 -90 -332 114 107 -83 2 314 178 516 -28 42 168 198 118 251 187 -3 252 -72 -256 26 73 188
4511 188 -111 -65 235 -188 -106 -516 -268 76 -91 -227 -172 256 -48 29 -401 72 133 51 -32 87 363 -97
4533 -97 -140 -185 -232 202 -140 190 329 490 147 -422 -275 343 -20 -146 -221 264 165 62 -25 -335 219 142 -91
4556 -91 -46 -249 -26 -85 267 -421 1 17 -48 -224 -239 178 119 184 -554 -11 135 -80 -41 85 267 4 75
4579 75 -96 -111 -2 -53 -30 -176 44 130 -223 -205 -38 210 -198 -10 73 431 275 -70 100 261 -236 119
4601 119 -166 155 169 -2 -49 -340 46 44 322 -205 201 -15 -154 -196 -123 243 54 277 -114 -25 171 183 -305
4624 -305 -325 -359 -152 103 -167 139 -11 159 -103 -289 -119 -20 -106 -167 -23 199 34 2 -164 -106 -11 -30 -99
4647 -99 217 358 145 -122 -73 124 228 -38 -137 -12 423 264 -144 -353 -53 185 -24 -53 -7 131 -25 -63
$$ packed form
4488A11k01k42M46pj90Q5L12j36L38n44P0J26L0q0J33o4j90K55l24j84K82M7J15
4511A88k99M6L00m23Q2m10K48L44j67j36N5M28l04P7m30M73O1q2q3J19K76m60
4533i7m3m5m7M34l42L30J39J61l43n69J47O18l63j26p5M85r9j03q7l10N54p7k33
4556i1M5k03K23n9L52o88M22J6o5j76j5M17n9O5p38N43J46k15L9J26J82k63P1
4579G5j71j5J09n1K3j46K20Q6l53J8J67K48m08J88Q3L58j56l45J70J61m97L55
4601A19k85L21J4j71m7k91L86kK78n27M06k16j39m2P3L66j89K23l91Q9J96J2m88
4624c05k0l4K07K55k70L06j50J70k62j86J70R9q6o1J44K22j65l2j66N8R5j9o9
4647i9L16J41k13k67M9J97J04k66r9J25M35j59m08k09L00K38k09k9M6J38j56l8
$$ plain form
4669 -63 -289 -546 140 -110 -123 119 -99 177 -122 -407 113 206 118 85 153 40 -73 -26 240 87 23 -38 159
4692 159 -54 158 186 -253 -128 -63 -9 34 -122 84 223 41 -410 195 -39 295 239 -60 0 -121 188 -18
4714 -18 -181 -124 240 116 -145 234 -45 -37 386 -44 -55 -114 41 -292 -66 -40 60 -129 47 -189 -119 95 -404
4737 -404 296 41 -3 -139 -93 -127 -18 149 86 -36 129 -105 -128 -82 101 20 -6 59 -195 140 328 -436 -150
4760 -150 -122 -170 210 -232 321 209 101 -338 -219 127 118 223 -1 90 79 -86 -193 -114 70 -24 85 258 90
4783 90 300 220 -124 -147 62 342 -78 235 -54 8 28 -94 -248 -123 -4 -207 76 -72 164 105 -139 -236
4805 -236 -61 6 45 -257 -38 103 154 -178 -285 59 -89 -24 -7 -114 -262 -17 -7 -158 -112 157 90 -251 28
4828 28 323 247 -244 -64 83 234 269 -74 72 257 66 -293 -179 83 119 373 94 -55 97 254 52
$$ packed form
4669f3k26k57O86k50j3K42k18K76k99k85N20R3q8l3O8j13j13M7K66j53o4o1J97
4692A59k13K12K8m39J25O5N4M3j56K06J39j82m51O05k34L34n6k99O0j21L09k06
4714a8j63N7L64j24k61L79k79QM23m30j1n9J55l33K26K6J00j89J76k36P0K14m99
4737d04P00k55m4j36M6l4J09J67o3j22J65k34k3M6J83q1k6O5k54L35J88p64K86
4760a50K8m8L80m42N53j12j08m39J19L46rJ05k24R1j1j65j07P9J84r4J09J73j68
4783I0K10q0l44k3K09K80m20L13k89O2K0j22j54J25J19k03K83j48K36n9k44r7
4805b36J75O7L9l02K19J41N1l32j07L44j48O5J7j07j48K45J0j51M6K69o7l41K79
4828B8K95p6m91J80J47J51L5l43J46J85j91l59J14K62L6K54k79j49J52J57k02
$$ plain form
4849 52 -290 200 -59 -28 -60 175 59 39 -276 -276 -37 -121 229 -65 42 28 122 15 -112 -145 235 -41 -128 61
4873 61 115 291 -328 -56 -239 -153 352 -174 26 212 45 -15 -220 181 173 19 -312 4 134 1 175 -379
4895 -379 -112 -18 67 139 42 -34 -25 -319 -302 52 69 235 -3 -175 -11 175 -80 -249 -5 -106 83 291 62
4918 62 -88 286 194 -148 -202 113 71 203 -163 90 16 -94 -59 127 83 -369 159 8 61 43 -280 -256 31
4941 31 27 296 -211 274 174 9 -66 -93 -11 90 141 -223 -49 72 329 37 63 -203 62 -101 34 -12 -203
4964 -203 -145 191 -247 71 278 -253 -173 205 11 92 11 -340 -94 18 38 -330 -92 130 161 210 61 -82
4986 -82 -18 -156 -168 378 273 -242 -541 -289 -21 110 -13 -191 -38 319 -305 -103 -244 -69 35 -25 191
5007 191 391 197 322 -122 124 54 267 -35 -139 -41 122 31 91 45 -20 83 254 324 204 204 239 -70 -353
$$ packed form
4849E2l42M90k59L1l2K35j16k0l15%K39q4L50k94J07j4R4j07j27l3L80k76q7J89
4873F1N4J76o19K72j83Q6N05n26K00J86j67o0k05M01qj54l31L16J30j33J74n54
4895c79K67R4Q5P2r7p6Rk94J7L54J7J66k38j72J64J86k55j69K44j01J89K08k29
4918F2j50L74r2l42n4L15m2J32l66K53p4j10L5J86m4m52N28j51N3j8l23K4K87
4941C1mK69n07M85j00j65p5k7Q2J01N1l64J74J21K57k92K6k66K65j63J35m6j91
4964b03N8L36m38L18K07n31Q0L78j94Q1q1l51K46J12K0l68K38K22L1M9j49j43
4986h2O4j38j2N46j05n15k99K52K68J31j23j78J53L57o24K02j41J75J04o0K16
5007A91K00j94J25m44K46p0K13l02j04R8J63r1O0m6o5J03J71P0j20%L5l09k83
$$ plain form
5030 -353 -172 98 274 -142 50 -3 -95 88 -299 -266 247 17 -105 -123 -15 183 -309 90 75 0 -149 -133
5052 -133 188 345 -58 128 -225 274 411 -112 -75 33 263 -67 45 -360 10 142 -145 102 -21 213
5072 213 -94 -62 -5 46 122 -5 -190 -215 90 -411 -218 -285 9 49 371 -47 -245 3 -97 -320 -210 -181 161
5095 161 -147 -323 99 82 -44 -214 -265 -86 -68 129 80 63 185 -69 -196 98 92 250 -43 -110 29 -209 -221
5118 -221 -116 -142 -102 231 -51 -55 369 352 -273 -43 -29 228 2 63 -186 -177 567 116 -257 -231 53 207 -138
5141 -138 -115 -54 -70 206 -274 117 129 207 21 157 61 -98 -92 -16 13 49 34 42 -102 144 -232 -187 -103 -428 -91
5166 -91 85 -27 248 -14 131 131 -61 -220 -29 233 66 123 -59 65 -27 18 44 -60 -19 56 -55 107 71
5189 71 -88 -129 -171 -148 7 -27 96 -34 -24 13 -88 -28 -8 125 -11 91 -43 142 -118 -173 -366 -35 188
$$ packed form
5030c53J81K70J76m16J92n3r2J83l87L3N13k30j22j8J08J98m92L99j5p5j49J6
5052a33L21J57m03J86l53M99J37n23L7J08K30l30J12m05L70J32k87K47j23K34
5072B13l07L2N7N1P6j27j85k5L05n01J93o7K94M0L22m18j98K48j00k23J10K9L42
5095A61l08j76M22j7j26j70n1J79J8J97m9j7J22k54j27K94oJ58k93o7J39k38j2
5118b21J05k6M0L33k82mM24j7o25K30J4K57k26O1k49RP44m51l73K6K84J54l45
5141a38K3O1j6K76m80L91J2P8j86J36r6j59OP6K9L6j5Qj44K46l76M5Q4l25L37
5166i1J76j12K75k62J45%j92j59J91K62j67N7j82J24r2M5K6j04M1P5j11J62l6
5189G1j59m1m2K3J55l4J23j30J0L7j01O0K0J33j36J02j34J85k60n5j93L31K23
$$ plain form
5212 188 -59 -282 96 105 231 58 -270 35 66 -185 196 354 267 51 -154 9 -70 317 -62 -68 -152 130 -149
5235 -149 -58 -123 -57 -149 137 208 32 -24 179 -256 -75 36 115 -95 -80 -167 376 178 -92 -280 -259 171 -101
5258 -101 -161 149 332 156 -122 -139 -188 95 127 114 31 253 8 -138 -356 11 228 91 -136 -76 25 231
5280 231 -45 -353 -196 395 120 3 18 57 98 -35 -144 280 0 -224 49 -317 -111 179 43 -34 39 41
5302 41 350 -70 -95 22 -196 -191 -51 115 -60 98 -153 -20 168 81 -147 -57 139 342 149 -19 -153 -241
5324 -241 -117 59 -251 -177 18 126 -65 2 -26 90 -236 -112 -79 71 -130 98 68 111 143 -189 -128 209 21
5347 21 -77 -182 116 -263 -53 -45 101 210 125 -25 345 -42 306 4 151 -130 211 158 -175 -38 -254 117
5369 117 -1 5 141 35 473 -101 83 148 51 -164 -179 281 101 317 -115 -9 189 1 -18 -86 -115 -79 -83 208
$$ packed form
5212A88k47k23L78RJ26j73l28L05L1k51L81J58q7k16k05J63p9L87l79oq4K82k79
5235a49R1o5O6r2K86P1j76n6K03m35J81J11P9k10J5q7N43j98k70j88K1M30k72
5258a01o0L10J83j76k78j7m9K83L2j3q3K22k45j46k18L67K17j37k27O0J01K06
5280B31k76l08J57N91k75j17J5L9M1j33j09M24k80k24K73l66K06K90j36p7P3K
5302D1L09m20k5J17k18NJ40J66j75J58k51J33J88q7k28R0J96K03j93j68j34q8
5324b41J24J76l10P4J95J08j91O7k8J16l26J24L3J50k01K28l0M3L2l32O1L37j88
5347B1r8j05K98l79K10QJ46J09q5j50L70l87L48l02J47k81L41n3l33J37k16L71
5369A17j18OJ36j06M38n74J84O5r7k15j5M60j80K16m32J06J98j88j9o8k9L6mK91
$$ plain form
5393 208 -114 68 107 75 63 -100 65 158 53 -32 -79 50 59 -2 -130 -119 50 -177 -124 103 -6 148 -107 -116
5417 -116 -221 91 233 -48 -126 113 -117 -225 -84 -67 163 88 7 34 -15 146 298 -64 -177 68 213 -61
5439 -61 36 -38 -5 -168 246 116 297 0 127 -274 354 27 -8 -326 58 136 -303 -30 125 -26 -342 -105
5461 -105 -238 106 -51 -168 -47 123 -202 93 49 -47 38 85 184 -117 -23 33 -63 13 34 193 -196 -38 -94 130
5485 130 -274 -190 -394 104 224 -243 48 157 -35 46 274 -85 -209 -208 47 83 -34 -93 490 -156 275 158
5507 158 141 62 -25 -112 9 128 158 -23 -25 -49 61 271 197 -98 310 -10 -262 4 49 183 57 251 -246
5530 -246 -102 195 95 58 -134 -231 178 18 15 190 -146 -18 -41 224 -76 90 -77 -222 -209 188 -148 65
5552 65 12 131 53 -264 -269 279 -108 58 22 117 10 165 97 -103 49 42 -151 -76 -108 94 -156 -106 -284 -301 -225
$$ packed form
5393B08l22J82L9l2j2j63J65R3j05q5m7J29Ro1j28J1J69k27N3K27j09J54k55r
5417a16j05L12J42k81p8K39k30j08J41J7K30p5q1K7m9J61J52l62j13K45J45k74
5439f1R7p4L3j63M14j30J81k97J27m01O28l27l5l18L84P8m39K73J55j51l16K37
5461a05j33L44j57j17J21J70l25K95m4r6Q5M7R9l01R4N6r6P6K1J59l89J58n6K24
5485A30m04Q4k04M98J20m67K91J09j92Q1K28l59j24JK55L6j17n9N83o46M31j17
5507A58j7p9q7q7J21J19L0j81kk4J10K10p4k95M08l20k52K66M5J34j26J94m97
5530b46J44K97j00l7j92r7M09j60lJ75l36J28k3K65l00J66j67j45J3L97l36K13
5552F5n3J19p8l17nN48l87J66l6R5j07J55o8k00J52pj93P5l2K02k50N0j78j7P6
$$ plain form
5577 -225 -312 -284 9 409 133 -295 59 -35 -89 -254 -36 7 15 224 -111 47 -82 -128 19 1 323 265 -188
5600 -188 400 194 -147 278 244 -29 92 -100 167 -204 -117 51 255 -306 70 167 -26 184 35 -30 132
5621 132 -72 37 35 -116 15 -48 146 -56 -83 -433 -24 -167 -34 -31 -30 18 45 -60 77 118 -178 45 -208 150
5645 150 -143 22 367 31 -79 -202 106 -107 163 65 476 185 296 150 84 77 355 -140 -178 -56 310 -30
5667 -30 -321 150 256 299 -21 -108 -302 145 -12 27 -265 -111 3 -12 -63 -176 385 -106 30 -131 -208 195
5689 195 -151 -98 82 -118 43 -164 -5 73 113 -148 188 -139 -50 -52 -29 -217 -92 -211 213 187 -8 41 187
5712 187 -158 177 -131 141 -27 -6 57 149 -4 -170 -97 199 -83 -139 37 284 117 -239 -75 -14 61 -171
5734 -171 -65 325 -105 161 65 -114 166 120 -186 -205 -250 3 -15 -69 -18 -171 39 59 -78 206 82 403 -120
$$ packed form
5577b25q7K8K93M00k76m28L54r4n4j65K18M3QK09l35J58j29m6J47j8L22n8m53
5600a88N88k06l41M25l4k73J21j92K67l71Q7J68K04n61L76R7j93K10j49o5J62
5621A32k04J09kj51J31o3J94k02k7l50M09j43J33LJM8K7j05J37M1k96K23k53L58
5645A50k93J65L45l36j10j23L08k13K70r8M11k91J11j46o6pK78m95l8J22L66l40
5667c0k91M71J06M3l20q7j94M47j57L9k92J54J14j5n1j13N61m91J36j61p7M03
5689A95l46N3J80k00J61k07J59P8M0k61L36l27Q9kK3j88J25j19M24k6j95M9J46
5712A87l45L35l08K72j68K1O3R2j53j66P3K96k82n6J76K47j67l56J64O1P5k32
5734a71J06L90m30K66r6j79K80m6l06j9m5K53j8n4N1j53K10K0j37K84j24L21n23
$$ plain form
5757 -120 -167 84 -81 -25 435 22 98 79 -184 155 -4 146 78 354 17 -243 -160 -32 -101 33 -215 112
5779 112 -33 5 -255 129 -79 -57 82 150 -88 -96 -4 -157 301 -124 146 -182 -68 84 159 -63 206 165 133
5802 133 5 149 -56 -18 -45 -107 -30 -187 -5 145 -158 163 233 -126 -200 44 163 145 264 137 128 -175 39
5825 39 -143 205 -174 -158 270 -56 -183 -105 1 227 -191 120 67 22 -220 -130 2 -74 -55 -207 73 125 -227
5848 -227 398 39 22 -145 282 -3 -22 112 76 -249 172 78 -298 15 -315 159 15 132 -5 -77 40 46
5870 46 -112 -244 -251 30 -288 -334 -85 104 -174 129 9 108 21 -70 -211 -245 128 -246 510 240 98 -19 132
5893 132 -161 -237 -25 -169 -227 -147 60 -230 -54 -136 164 -58 -245 64 283 40 -318 -129 -78 -56 174 24
5915 24 160 -142 158 -36 -64 51 -74 18 118 -91 238 366 -249 -69 34 348 -10 -17 187 -185 -46 142
$$ packed form
5757a20m7K51j65N6M60m13P6j9k63L39j59J50o8K76l37k60Q3J28o9J34k48L27
5779A12j45L8k60L84k08K2J39O8k38qR2j53M58m25K70l28J14J52P5k22K69m1l2
5802A33j28J44k05L8k7o2P7j57J82J50l03L21P0l59p4K44J19j8J19j27rl03K14
5825C9j82L48l79J6M28l26j27P8J06K26m18L11n3m5k42R0J32p6J9j52K80N2l52
5848b27O25l59j7j67M27k85j9J34l6l25M21r4l76L13l30M74j44J17j37p2J17O
5870D6j58j32pK81l18m6K49J89k78L03j20R9q7r1j41l4L73l74P56k70j42j17J51
5893A32k93p6K12j44n8Q0K07k90J76q2L00k22j87L09K19k43l58J89N1K2K30j50
5915B4J36l02L00j94k8J15j25R2J00k09L29J28o15J80J03L14l58pK04l72J39J88
$$ plain form
5937 142 194 118 60 29 32 131 -21 -162 88 103 -55 -91 -315 215 159 -20 27 167 -283 64 -136 52 -170 -87
5961 -87 113 83 -141 61 9 174 -165 48 132 -26 -92 -175 -213 -184 175 77 11 264 -101 -292 -282 -84 289 -171
5985 -171 30 -279 -185 167 -57 349 -132 145 127 -108 69 111 59 86 -82 -405 139 149 28 17 17 145 209
6008 209 -137 -47 -160 -211 -30 -3 -249 12 -172 -62 348 -243 -137 203 229 -156 268 102 13 -33 243 -154
6030 -154 -102 -153 -172 -270 -235 -26 -104 -99 -49 204 -109 -366 163 200 171 -105 -43 89 167 63 -293 -225 215 -115 -267
6055 -267 -102 173 306 -178 50 -88 -89 63 -237 -31 -27 192 89 -208 -15 142 -167 -226 -43 105 104 220
6077 220 112 -126 277 51 -63 63 397 118 -384 114 -115 81 15 -112 -45 -59 78 -34 -90 -8 -2 159
6099 159 -35 -111 -12 -91 -144 -131 -80 -104 179 244 -154 -152 129 -172 -132 62 -17 -89 -58 -84 209 143 215 -345 -51 -87
$$ packed form
5937A42N2p6n8l1LR9j52j41K50J5j58l6k24N30n6j79M7J40m50L47k00J88k22Q3
5961h7K00l0k24K02n2J65l39K13Q4j58o6q3l8K9L59r8o6K53l65j91J0J98L73m60
5985a71K01l09R4L52k24M06m81K77j8k35J77M2n2K7j68l23N44J0j21j1%J28O4
6008B09l46R0j13n1J81K7k46K61j84J10M10n91J06L40K6l85M24j66q9m6K76l97
6030a54N2n1j9r8L5K09p8NN0K53l13k57N29L7k9k76O2J32P8j04l56O8M40l30j52
6055b67J65K75J33m84K28j38jJ52l00K06MK19j03k97J93J57l09n9J83J48jJ16
6077B20j08k38M03k26j14J26L34k79n02M98k29J96o6j27O7j4J37j12n6Q2OJ61
6099A59j94p6R9p9n3J3N1k4K83O5l98KK81l01M0J94p9p2L1k6K93o6P2n60K94l6
$$ plain form
6125 -87 -39 -253 72 168 -61 263 175 190 95 204 -184 25 198 130 -48 103 261 72 -165 31 -103 129
6147 129 -69 29 -70 -72 -56 -304 102 -306 -51 165 226 235 135 64 -209 -32 199 -155 115 -30 -109 218 -56
6170 -56 29 52 -222 -3 -109 76 -81 127 -13 -18 -4 -77 55 -26 24 -160 -41 -105 229 -218 147 63 10 216
6194 216 -101 48 -36 -254 136 215 49 -13 -77 -152 -64 19 -84 -77 -128 -78 54 -23 -88 61 188 228 -141 -73 -182
6219 -182 -309 57 10 -20 10 -140 175 -187 -35 16 87 -304 32 203 251 331 139 -1 -145 15 -48 340 -80
6242 -80 43 -193 -6 -94 237 -9 -49 4 -38 97 -93 109 -63 341 -17 -133 -201 113 167 -93 292 251 81
6265 81 -172 69 -135 280 79 22 339 -15 -135 12 118 -33 262 68 -85 108 367 -28 130 -16 -153
6286 -153 173 149 110 58 19 -13 72 59 -200 -9 116 -133 53 -9 183 -63 -179 187 136 17 -43 -308 40
$$ packed form
6125h7M8k14L25R6k29L24q8J5r5J09l88K09J73o8j78J51J58j89k37J96j34K32
6147A29j98R8r9kJ6k48M06m08K55K16O1Rj00p1k73J77K31l54K70j45p9L27k74
6170e6Q5K3k74K19j06J85j57K08j40nJ4p3J32q1N0j84J19o4L34m47L65q4n3K06
6194B16l17J49q4k18L90P9j66o2o4p5Q8Q3j03Pn1N0J32p7o5J49J27M0l69O8j09
6219a82j27L66m7l0L0j50L15l62J52N1P1l91L36J71M8Q0j92j40j44J60o3L88m20
6242h0J23k36J87q8L31k46m0N3m2J35j90K02j72M04l58j16o8L14N4k60L85m1j70
6265H1k53K41k04M15k01n7L17l54j20J47J06j51K95j94j53J93K59l95J58j46j37
6286a53L26k4l9n2l9l2Q5j3k59J91J25k49J86o2J92k46j16L66n1j19o0k65L48
$$ plain form
6309 40 160 -164 249 29 -329 81 -3 71 80 -190 -86 319 -192 -115 120 27 78 120 -94 -338 59 10 140
6332 140 7 -22 -299 65 197 -156 16 6 86 -39 -125 179 143 103 9 10 58 33 139 27 -173 42 -58 -279
6356 -279 -64 52 10 -168 228 -27 -92 380 120 -59 96 181 -229 -12 166 222 104 -236 -143 129 -225 23
6378 23 114 27 -41 -93 61 -77 117 38 168 -210 -26 261 172 24 340 -1 42 -133 -144 151 -203 -154 121
6401 121 174 119 253 34 -58 240 321 76 -21 207 75 62 -53 -246 -127 -75 374 -302 -232 283 81 164 -214
6424 -214 -66 55 34 163 -135 -131 137 -147 100 47 -212 17 -57 -75 -41 133 124 115 -23 17 30 -172 166 -12
6448 -12 -102 -52 -151 -263 293 -82 112 -31 -62 325 308 84 -138 -140 157 -88 -107 46 -169 -139 237 298 -85 -202
6472 -202 33 -263 209 -4 -360 340 -41 -19 61 -200 -213 -79 65 -7 323 82 -16 72 -138 -242 35 117
$$ packed form
6309D0J20l24M13k20l58M10q4P4Rk70J04M05n11P7K35r3N1M2k14k44L97m9J30
6332A40j33k9k77L64J32l53J72j0Q0j25q6L04l6m0r4JM8k5J06j12k00K15j00k21
6356b79K15J16m2j78L96k55o5M72k60j79J55Q5m10K17J78N6j18l40R3K72l54K48
6378B3R1q7o8n2J54j38J94p9J30l78J84K87q9j48L16l41M3j75j1K95l54M9K75
6401A21N3n5J34k19r2K98Q1k45r7K28j32j3j15j93J19N2M49o76P0N15k02Q3l78
6424b14J48J21k1J29k98MK68k84K47n3k59K29p4j8L4J74rrj38M0J3k02L38j78
6448a2r0N0r9j12N56l75J94j43l1L87j7k24k22kK97k45j9J53k15L0L76O1l83j17
6472b02K35k96M72k13l56P00l81K2Q0k61j3J34J44p2L30k41r8Q8k10j04K77Q2
$$ plain form
6494 117 -105 -48 -14 137 -209 9 -102 218 129 -252 167 -19 -151 -229 -200 427 271 -49 -61 -22 -116 -216 34
6517 34 -52 -154 264 312 -230 186 -341 -80 -223 204 182 46 17 -78 -165 28 80 -71 57 63 125 -219 218 -246
6541 -246 -177 -141 173 -205 -161 -51 -68 51 -213 52 -28 302 164 192 168 109 261 -226 -226 -209 24 19 -71 -69 -21 46
6567 46 -84 -335 63 49 1 4 249 39 -12 68 110 -92 18 -246 -58 -109 -277 275 -291 -288 76 157 -45 122
6591 122 84 -39 -151 53 129 6 1 -51 -58 -111 88 195 -96 -73 0 -180 -34 -270 -88 34 99 165 -59 -99
6615 -99 -37 63 222 19 -169 169 267 21 -107 -114 -27 -152 -279 155 30 76 1 225 214 -82 -50 -346 -176
6638 -176 -125 -75 -125 200 75 -126 -34 -20 -99 185 -300 -136 -49 -210 379 -81 87 134 52 -154 -241 -222 -34 100
6662 100 91 64 88 187 -20 219 25 -2 -167 -83 219 28 -373 43 78 -20 -55 -12 23 -104 -9 -166 30 -36 -13
$$ packed form
6494A17k22N7L4J51l46K18j11L20q9l81M19j86j32p8K9O27j56l20j2L9r4j00K50
6517C4q6j02M18M8n42M16n27K61j43M27k2j36k9r5q7J93N2j51J28OO2l44M37m64
6541b46O9L6L14l78M4J10j7J19k64K65q0L30j38K8k4n9J52m87%J7K33nr0KM8O7
6567D6j30k51L98j4m8LK45k10n1Q0M2k02J10k64J88n1j68N52n66LL64Q1k02J67
6591A22l8j23j12K04P6j23nn2pn3J99J07k91K3P3j80J46k36J82J22O5O6k24m0
6615i9O2J00J59k03j88L38R8k46j28pQ7j25j27M34j25M6p5K24j1k96L2k96J70
6638a76N1N0n0L25j25k01R2J4p9K84m85J64Q7j61N89m60J68M7q2k06q7J9J88J34
6662A00rk7K4R9k07K39j94k7j65Q4L02j91m01M16L5r8l5M3L5j27R5j57J96o6K3
$$ plain form
6687 -13 -128 -85 175 102 92 -105 -280 69 -140 45 69 -66 69 93 23 19 58 47 169 107 -50 212 61 2
6711 2 -171 76 67 72 -143 -17 86 -105 -97 -193 -19 144 -43 127 11 -111 131 123 123 -65 74 -198 -102 -59 228
6736 228 9 -91 -308 -23 100 290 -84 -52 94 309 -205 -99 -5 -93 114 -67 -154 -152 -13 21 48 -62 88
6759 88 31 -91 -219 -389 66 -192 -190 343 166 -56 -100 -110 167 -16 81 31 -107 -120 15 -136 -20 172 141
6782 141 120 -287 148 -303 -236 55 -13 -109 54 101 89 243 -142 -39 -217 -112 -25 308 160 -35 -151 -323
6804 -323 -174 29 -10 -5 112 120 -285 -88 48 -21 228 -203 -323 -212 228 17 -62 126 -77 5 -158 -179 -208
6827 -208 -2 -227 -139 -123 17 8 136 5 157 -201 180 -186 372 -2 86 -10 -174 94 39 218 -191 -27
6849 -27 -116 -146 37 52 -153 196 -142 -28 -13 -100 -149 -116 -43 167 -188 171 11 72 235 7 56 -39 70 -258
$$ packed form
6687a3j15M3K60p3j0j97j75L49k09J85K4j35J35K4p0mL9j1J22o2j57K62j51n9
6711Bj73K47rNk15J26J03j91Qr6J74J63j87J70j16j22K42q%j88J39k72R6M3K87
6736B28k19j00k17K85J23J90l74L2J46K15n14J06R4q8K07j81q7KJ39L4K7j10J50
6759H8n7j22j28j70M55k58KN33j77k22m4j0K77j83R7n0j38j3J35j51J16J92l1
6782A41k1m07M35m51O7K91o8r6J63M7j2J54l85J03j78J05Q7L33j48j95j16j72
6804c23J49K03l9NJ17Qm05J97J36o9K49m31j20J11M40k11p9J88k03Q2j63k1k9
6827b08K06k25Q8J6J40rJ28j31J52l58L81l66N58l74Q8r6j64K68n5J79m09J64
6849b7q9l0J83J5k05L49l38J14J5q7m9L3P3K10l55L59j60O1J63k28M9r5J09l28
$$ plain form
6873 -258 117 26 176 162 -310 -188 -120 109 -176 -149 34 -42 42 -193 9 -55 -301 136 -9 56 15 -34 -88 -221
6897 -221 -139 165 -5 -74 -319 -295 34 -176 43 -205 -15 33 -162 -306 207 24 -153 -145 -72 34 -134 185
6919 185 -42 109 150 60 -141 -120 83 206 -137 -66 206 -325 68 -244 -6 -134 -167 -253 240 128 137 38 70
6942 70 136 -49 1 -21 -11 -53 -50 -247 -168 142 -11 64 -104 190 -364 -2 16 -50 254 -120 -98 -187 19 -143 -43
6967 -43 -30 38 -27 -106 -78 -23 252 30 155 -41 101 5 70 24 -9 -28 83 185 171 -214 -96 -36 -202 14 130
6992 130 -70 -37 -254 54 -105 -57 -272 -281 -193 161 204 -128 -51 -154 25 122 -3 64 -42 -35 60 -179 123 98
7016 98 106 356 -13 -139 236 84 118 -172 40 72 193 11 159 -101 -36 -523 -53 -128 176 29 -136 64
7038 64 -262 270 -4 235 -255 -67 167 -48 135 -270 186 247 -91 201 -73 122 17 287 -134 192 -45
$$ packed form
6873b58L75r1J50j4m72J22O8K29k85K7J83p6Q4k35K02o4k46M37j45O5m1m9n4j33
6897b21Q2L04j70o9k45K4L29k10K19k48J90M8j95j44N13j83j77QP3J06j68L19
6919A85k27J51M1r0k01K1K03J23l43P1K72n31L93l12K38j28l3q6M93j12Rr9L2
6942G0O6j85N0k2J0m2Lj97P9L10j53P5j68K94n54L62J8o6L04l74K2q9K06j62J00
6967d3J3O8o5p9K8N5K75k22J25j96J42r6O5m6l3j9J11J02j4l85J18O0j66K16J16
6992A30k00L3k17L08j59M8k15rQ8L54M3l32P7j03J79R7j25O7j06PR5k39L02k5
7016I8QK50l69j26L75j52L4k90K12L2J21j82J48k60O5m87M70p5L04j47j65K00
7038F4l26N32k74K39m90J88K34k15J83m05M56O1l38K92k74J95j05K70m21L26k37
$$ plain form
7059 -45 -156 -20 -183 117 -27 -217 -183 38 -72 -60 127 -7 -75 -58 -92 -37 9 6 -258 -90 240 76 -180
7082 -180 -287 75 32 150 23 0 89 19 -55 61 -93 -43 20 -280 8 100 89 215 297 111 64 233 -105 -67
7106 -67 111 -26 -50 -215 206 -200 126 -165 -222 67 8 139 -163 -19 -174 171 12 167 -59 100 -41
7127 -41 179 -207 -247 -218 208 87 28 119 -314 -73 49 -77 51 78 -13 -116 75 -14 27 113 -74 -206 -20
7150 -20 267 9 -97 10 196 -80 -112 182 131 53 -452 -143 7 123 91 -150 17 -32 -96 258 55 32 143
7173 143 -203 36 336 269 36 143 65 -58 -122 -219 -73 -137 -70 280 -230 -57 -107 176 25 19 288 -58 153
7196 153 -187 -202 -165 77 -122 -54 -125 -151 221 136 -167 -201 -353 -150 -9 7 64 240 -10 8 40 -68 54 82
7220 82 -141 30 27 -112 -49 62 175 -34 -57 -207 151 110 -323 99 23 293 336 23 -170 -86 -14 -231 -279 4
$$ packed form
7059d5j11J36j63L00j44j90L4K21j10J2J87j34o8J7l4N5M6lk64J68L30j64k56
7082a80j07L62m3J18j27k3Q9p0p4J16j54N0O3l00K88R2j1J26Q2j86m7J69l38L8
7106f7J78j37k4j65M21m06L26k91n7K89n9J31l02J44j55L45j59J55k26J59j41
7127d1K20l86m0K9M26j21n9R1m33K41J22j26J28K7r1j03J91q9M1Q6j87j32J86
7150b0K87k58j06J07J86k76l2K94n1p8n05L09J50J16l2k41J67m9o4L54k03k3J11
7173A43l46K39L00o7k33J07p8j23o4r7J46o4O7L50n10J73n0K83j51oK69l46K11
7196A53l40j5L7K42j99O8p1k6L72q5l03l4j52K03J41J6N7J76k50J8L2j08J22K8
7220H2k23J71lj39O3J11J13k09k3j50L58m1m33M22p6K70M3l13j93Q4P2k17m8K83
$$ plain form
7244 4 -110 120 378 173 -23 40 221 45 262 156 95 390 -74 152 -387 240 -14 84 137 -237 -4 -284
7266 -284 -285 77 94 239 -122 272 310 173 138 137 151 -54 112 -203 -164 -24 386 37 -19 -107 -54 133 -18 180
7290 180 -292 -137 -42 -24 36 -45 60 -234 -8 -49 -246 -12 -258 -281 135 181 -55 -185 6 -71 216 195 -50
7313 -50 255 -52 24 -118 78 -157 7 -58 -110 -297 64 23 -101 186 -166 -83 45 -138 -54 -21 -127 81 20
7336 20 68 337 191 41 -30 62 172 -169 133 -103 34 214 77 -98 -236 -155 -11 149 96 -61 -80 28
7358 28 13 137 10 -85 -136 135 219 31 -61 -236 -68 -8 -138 241 221 145 -282 55 120 393 -190 364 -18
7381 -18 -47 -148 48 96 -39 142 -22 48 439 132 61 260 -27 -109 21 -225 -71 233 94 23 327 124
7403 124 27 -64 -14 -8 -80 86 -90 -72 22 145 -61 74 -8 94 88 189 -66 -65 30 -78 -87 263 302 -61 -174 -83
$$ packed form
7244Dj14K30K58k05j96O3J81j76K17j06o1K95m64K26n39O27k54R8N3l74K33k80
7266b84jL62J7J45l61L94L8j37l5jJ4k05J66l15L9J40M10l49n6q8N3J87j51J98
7290A80m72J55R5J8O0q1J05k94K26m1j97K34k46k3M16M6k36j30J91p7K87k1k45
7313e0L05l07P6j42J96k35J64o5n2j87L61m1j24K87l52Q3J28j83Q4L3j06K08o1
7336B0M8K69j46j50p1R2J10l41L02k36J37J80j37j75j38Q1J44J60n3j57j9J08
7358B8j5J24j27r5n1K71Q4j88r2j75J68O0j30L79k0p6m27L37O5K73n83N54l82
7381a8k9j01J96M8j35J81j64P0L91l07p1J99k87q2J30k46J54L04j39p1L04k03
7403A24r7r1N0Op2J66j76J8R4J23k06J35q2J02oJ01k55JR5j08rL50L9l63j13R1
$$ plain form
7429 -83 167 137 -186 -144 -217 86 -61 100 164 -159 78 -153 82 102 19 -153 96 198 -18 224 172 -97 403
7452 403 -322 301 28 332 106 -155 -115 -79 -47 224 -8 133 -180 -123 79 -130 65 161 402 -321 272 -38
7474 -38 -73 193 -194 -146 14 24 113 -65 -131 -147 -80 192 -6 93 -77 31 -170 11 -117 333 38 -103 7
7497 7 -206 -201 136 -330 -288 207 104 133 -116 95 35 -164 -132 254 203 30 171 151 389 91 -13 -152 -143 -74
7521 -74 87 574 -65 -33 -137 81 -28 134 82 -275 -364 -431 99 -32 128 111 58 -245 -337 -105 51 6 -242
7544 -242 -38 222 40 -206 231 133 9 59 116 376 71 -177 186 -75 49 -23 -33 -56 -300 -83 237 -42
7566 -42 -62 104 -75 -8 -191 78 18 107 120 104 -233 -244 244 -77 -46 156 29 94 -195 62 11 23 -310 -27
7590 -27 141 -54 -162 22 -276 -35 26 -27 -17 -339 167 143 86 26 -44 237 -155 44 -94 68 -206 177 47
$$ packed form
7429h3K50l0l23M2p3L03j47J61O4l23K37k31K35K0q3j72K49J02k16K42n2k69N00
7452D03p25O23k73L04k26k61M0L6L2K71k32J41l13N7K02k09J95R6K41p23N93l10
7474c8l5K66l87M8J60J0Q9j78o6j6O7K72j98R9j70J08k01J81j28M50k95j41J10
7497Gk13NL37m66M2M95j03K9k49K11o0j99L2L86n1j73J41k0K38k98j04j39RO9
7521g4J61M87o39L2j04K18j09J62n2l57q9o7N30j31J60j7n3l03r2K32J56m5k48
7544b42K04K60j82k46M37r8j24N0N7K60l05k48L63k61J24p2j0k3k44K17L20k79
7566d2k0J66j79O7j83K69o0Q9J3j6l37j1M88l21L1K02j27O5k89K57n1J2l33K83
7590b7J68j95j08J84k98K41O1n3J0l22N06k4n7o0p0K81l92J99j38J62k74L83j30
$$ plain form
7613 47 -292 182 -157 -99 -179 -200 200 84 -80 2 132 -35 41 -197 90 -94 -94 -173 -172 -95 49 -33 -98 140 -46
7638 -46 -135 153 -238 -415 158 -163 36 -1 -30 -229 132 -124 201 21 24 -79 103 217 -251 19 115 52 107
7661 107 186 126 -133 198 117 -278 107 -212 -41 -141 42 281 -321 76 -239 -148 149 -48 -251 -48 -73 -139
7683 -139 -38 270 -161 -27 -36 -65 9 -45 130 -43 -99 -69 19 -204 -165 0 -46 -305 124 218 113 161 -309 -86
7707 -86 51 -104 -173 -52 -80 -4 63 135 -159 -379 -189 -236 296 -208 -92 -37 -29 -131 -131 -17 140 -177 -181 158 55
7732 55 140 75 -207 -87 -86 -115 -110 165 127 -48 -35 169 -46 -257 -60 -359 116 80 106 -44 276 1 -231 79
7756 79 49 90 -310 142 227 26 346 -80 -157 -13 -198 -61 -39 -35 -332 10 -128 32 -114 210 -21 65 111
7779 111 -150 77 75 29 9 115 -156 -191 -209 -118 59 -4 20 8 173 -20 -123 -67 -187 -136 -248 -94 -102 -16 228
$$ packed form
7613D7l39M74l39N8q0k1M00j16j64Q2J30j67P6k38K87j84%p9JP7J44q2o5K38j86
7638d6q9K88l91j77N73l21J99l7k9j99L61k56L25j80Lj03J82J14m68K70R6o3N5
7661A07P9o0k59L31q1l95L85l19J71j00J83K39o02L97l15R1K97j97k03K03k5o6
7683a39J01L08m31J34rk9P4n4J75j73n6L0Q8k23L9J65m6k59M29R4j05M8m70K23
7707h6J37j55o9J21k8P6O7P2k94k20J90m7N32n04J16N5Qj02%J14J57l17mL39j03
7732E5Q5o5k82J20Jk9NK75l8j75J3K04k15k11J97k99M75l6K6j50L20k75k32L10
7756G9l0M1m00M52Q5k01L20m26p7J44j85J37K2Mk97L42j38J60j46L24k31Q6M6
7779A11k61K27km6k0J06k71l5j8R1J77o3K4j2J65j93j03N6j20N1j12J54qQ6K44
$$ plain form
7804 228 186 -266 113 37 -168 0 107 -10 86 91 -73 214 243 70 325 -50 9 -99 37 -172 21 -134
7826 -134 0 -19 -354 282 228 134 -144 -75 44 -140 333 90 -1 175 -143 -64 27 -41 -238 -49 32 -5 -165
7849 -165 -27 47 -83 348 -39 -244 -96 100 -35 -47 20 -60 -69 38 118 -3 -155 160 -314 -110 -30 -150 -3
7872 -3 -67 -122 98 471 125 164 68 226 -153 -58 100 40 -209 22 -87 -262 -13 207 -60 135 -38 36 123
7895 123 -242 157 188 190 94 311 194 45 -40 -84 281 98 170 -141 40 100 99 -93 26 -95 54 -73 -161 103
7919 103 53 26 75 -200 -229 47 -68 162 -77 -38 53 -119 4 111 -25 -262 136 133 18 -220 232 -81 368
7942 368 177 22 -102 40 282 -150 -73 37 -182 -224 -167 -30 7 -90 -65 -343 -198 -112 -95 49 -104 -82 109
7965 109 -103 -128 -254 7 142 -219 -49 283 224 15 53 -149 -340 87 -112 69 -69 6 111 -64 -161 -19
$$ packed form
7804B28m2m52L79p6k05J68J07j17R6Nj64K87K9j73K55l75N9j08J36k09J93j55
7826a34J34j9l35O36n4r4k78O9J19j84M73k43r1J76l18P9R1o8j97J89Q1l7j60
7849a65J38P4j30M31l87k05J48J96j35j2O7q0rJ07Q0j21j52L15m74K04Q0j20J47
7872co4n5K20L73l46L9r6J58l79R5J58o0k49K31j09j75K49K20k67J95j73P4Q7
7895A23l65L99L1Kr6K17j17j49q5m4L65j83P2l11J81O0jj92J19j21J49j27q8K64
7919A03n0k7M9k75k9K76j15K30k39L9R1j72J23J07j36k37L98lj15k38M52l13M49
7942C68j91j55j24J42K42m32P7J10k19m2N7J37L7r7K5k78J45Q6J7J44j53K2J91
7965A09k12k5j26K61J35l61J70L32n9k09L8k02j91M27j99J81j38P5J05j75r7J42
$$ plain form
7987 -19 -13 135 -167 -178 -201 223 -92 -176 95 -303 -54 -148 101 -246 275 -94 98 159 -21 149 -85 -196 -117
8010 -117 200 -128 13 69 2 25 -85 -90 -235 -49 -93 222 91 117 189 12 -73 6 -141 -125 -86 -78 -209 -235 53
8035 53 111 31 -77 -419 55 248 25 233 42 49 -54 -58 157 -14 -97 -163 -122 -255 -233 -12 -363 283 323 -182
8059 -182 -274 -13 -205 -169 205 183 39 -197 203 -223 -26 -4 -232 91 -67 24 -174 261 -264 -132 62 -126
8081 -126 181 -272 -229 -60 21 -32 134 -260 46 -145 -25 -127 -305 95 9 161 -76 22 144 -133 -47 -35
8103 -35 -201 58 251 -50 143 -35 -300 41 -31 -306 -35 -7 337 -259 169 -65 -200 -120 137 -32 265
8124 265 -18 146 31 -75 56 -16 -76 -11 -49 -132 153 -94 113 -132 -40 147 64 -96 116 26 243 -186 27
8147 27 -48 -33 5 -290 -154 -90 -200 155 28 -221 120 -190 304 200 156 103 5 -84 125 -194 -110 -114 160 -157
$$ packed form
7987a9OJ48l02j1k3M24l15q4K71l98K49r4K49l47N21l69J92O1j80J70k34j11P9
8010a17L17l28J41N6o7K3j10nj45J86m4L15j31K6P2j77q5P9j47J6L9Qj31k6K88
8035E3N8q0j08l42M74J93k23K08j91Pj03mK15j71q3o6M1j33K2K21l51O46M0n05
8059a82r2K61j92L6L74k2j44k36M00m26J97K2k28L23j58R1j98M35n25J32J94j88
8081a26L07m53M3J69Q1n3J66l94L06j91J20j02j78M00q6J52k37R8J22k77Q6J2
8103c5j66K59J93l01J93j78k65L41p2k75K71K8L44n96M28k34j35Q0K57j69K97
8124B65k83J64j15j06J31p2o0O5l8q3K85k47K07k45R2J87q3j60K12r0K17m29K13
8147B7p5J5L8k95J36O4j10L55j27k49L41l10M94j04m4n3r8q9K09l19Q4mK74l17
$$ plain form
8171 -157 -206 -121 -92 -47 -97 -22 260 97 58 -133 61 16 244 209 -89 96 -78 -85 62 71
$$ packed form
8171a57m9Q5K9M5n0P5K82j63l9j91J94m5K28l5k98J85j74pJ47R
8191G1
$$ Imaginary data points
##PAGE= N=2
##DATA TABLE= (X++(I..I)), XYDATA
$$ plain form
0 0 0 0 0 0 0 0 8 -8 8 -8 8 -16 16 -24 24 -32 40 -48 56 -64 75 -88 104 -118 136 -155 177 -202 227 -259
30 -259 290 -325 366 -408 456 -508 564 -628 696 -771 854 -944 1047 -1159 1284 -1425 1582
47 1582 -1766 1972 -2215 2500 -2844 3267 -3802 4502 -5464 6878 -9165 13500 -24664 117235
61 117235 210461 -10970 -63194 -57139 -86909 -140990 -41150 95613 143194 100953 63728 -8253
73 -8253 -94999 -130612 -84822 -26246 50781 131161 141010 43254 -46804 -69875 -82969 -109357 -60280
86 -60280 62804 145125 121355 47561 -28338 -86893 -108109 -84178 -36254 40211 126706 142088
98 142088 48891 -53865 -82835 -85280 -99448 -52222 71816 148419 103150 18692 -32948 -69935
110 -69935 -99112 -81309 -20401 45550 100295 115516 52981 -42512 -82640 -77194 -80178 -53662
$$ packed form
0@%%%%%%Qj6J6j6J6k4L2m0M8n6P2q8J04j20J39j63J92k22K54k91L32l79M29m86
30b59N49o15O91p74Q64r64J072j192J324j467J625j798J991k206K443k709L007
47A582l348L738m187M715n344O111p069Q304r966J2342j6043K2665l8164J41899
61A17235R3226k21431n2224O055k9770n4081R9840J36763M7581m2241l7225p1981
73h253q6746l5613M5790N8576P7027Q0380R849r7756r0058k3071j3094k6388M9077
86f0280J23084Q2321k3770p3794p5899n8555k1216K3931M7924P6465Q6495J5382
98A42088r3197j02756k8970k445j4168M7226J24038P6603m5269q4458n1640l6987
110f9935k9177J7803O0908O5951N4745J5221o2535r5493m0128N446k984K6516
$$ plain form
122 -53662 50359 137233 101880 12571 -26245 -47245 -97374 -106713 -26082 66303 100884 95696
134 95696 55549 -30730 -100810 -92202 -50406 -26199 23910 107511 121836 31372 -53258 -66834
146 -66834 -71179 -83938 -36237 64717 113706 76397 20493 -20011 -58420 -83105 -70557 -27251
158 -27251 35077 98866 109333 39354 -43847 -70943 -67299 -67744 -35247 49473 109212 86766 25520
171 25520 -22068 -59732 -85353 -70471 -14556 48957 92877 92480 33700 -40210 -67934 -59212 -56625
184 -56625 -35010 40619 108358 87895 14922 -30250 -48206 -72147 -71258 -15268 53106 82234
196 82234 72277 35124 -20825 -65532 -70666 -53545 -25639 31458 95889 94082 19422 -43455 -54217
209 -54217 -56783 -63227 -27021 48042 90671 69199 20771 -22149 -55649 -71413 -56793 -15258
$$ packed form
122e3662J04021Q6874l5353q9309l8816k1000n0129r339Q0631R2385L4581n188
134I5696m0147q6279p0080Q608M1796K4207N0109Q3601J4325r0464q4630j3576
146f6834m345j2759M7701J00954M8989l7309n5904m0504l8409k4685J2548M3306
158b7251O2328O3789J0467o9979q3201k7096L644m45L2497Q4720N9739k2446o1246
171B5520m7588l7664k5621J4882N5915O3513M3920l97n8780p3910k7724Q722K587
184e6625K1615P5629O7739k0463p2973m5172j7956k3941Q89N5990O8374K9128
196H2234r957l7153n5949m4707n134J7121K7906N7097O4431j807p4660o2877j0762
209e4217k566o444L6206P5063M2629k1472m8428m2920l3500j5764J4620M1535
$$ plain form
221 -15258 39510 82433 76372 20252 -34545 -51707 -54462 -58106 -27901 41544 87796 68661 16629
234 16629 -24349 -51252 -66121 -54097 -13872 36346 73149 72059 26272 -30447 -56330 -56407 -51890
247 -51890 -25353 38141 87673 68552 8571 -29133 -42988 -57793 -57605 -16143 41642 72542
259 72542 62288 23494 -24122 -55693 -59174 -44292 -16111 31380 75285 69390 14897 -31065
271 -31065 -44362 -50196 -53162 -21375 40669 78172 59942 14317 -23068 -46540 -56073 -46693 -12634
284 -12634 35617 71011 64101 18396 -28061 -47569 -50259 -45096 -15731 38305 74369 58888 12375
297 12375 -24986 -42695 -50808 -44552 -12493 36297 69861 60226 15189 -27805 -45300 -46636 -41849
310 -41849 -15274 36164 72102 56923 10007 -25006 -40268 -49030 -44488 -11436 38156 66561
$$ packed form
221a5258N4768M2923o061n6120n4797j7162k755l644L0205O9445M6252j9135n2032
234A6629m0978k6903j4869J2024M0225N0218L6803j090m5787n6719k5883p7M517
247e1890K6537O3494M9532j9121n9981l7704j3855j4805J88M1462N7785L0900
259G2542j0254l8794m7616l1571l481J4882K8181M7491M3905n895n4493m5962
271c1065j3297n834k966L1787O2044L7503j8230m5625l7385k3472r533R380L4059
284a2634M8251L5394o910m5705m6457j9508k690N163K9365N4036L6064j5481m6513
297A2375l7361j7709q113O256L2059M8790L3564r635m5037m2994j7495j336M787
310d1849K6575N1438L5938j5179m6916l5013j5262q762M542L3052M9592K8405
$$ plain form
322 66561 53357 13421 -24557 -43889 -47337 -39046 -12020 33778 66782 54622 9374 -27431
334 -27431 -40042 -44253 -41597 -12790 36448 65677 49640 9252 -23911 -40046 -46384 -39489 -9717
347 -9717 34412 61743 50117 10273 -25300 -40110 -43707 -38661 -11684 34211 62968 48213 7345
360 7345 -24579 -37860 -43603 -38311 -10085 33649 60335 47084 9407 -23970 -39645 -43389 -36104
373 -36104 -8878 32575 58949 46509 8025 -23768 -37782 -41769 -35946 -9500 33213 59347
385 59347 45757 7715 -24580 -38057 -40358 -33882 -8052 31404 57074 46014 8617 -23746
397 -23746 -37880 -40142 -33016 -7167 33124 56986 43554 6381 -23463 -35244 -38245 -32647 -7490
410 -7490 31921 56559 43988 6742 -24813 -36724 -36664 -29328 -5963 29979 54266 43248 6604
$$ packed form
322F6561j3204l9936l7978j9332l448Q291K7026M5798L3004j2160m5248l6805
334b7431j2611m211K656K8807M9238K9229j6037m0388l3163j6135o338O895K9772
347i717M4129K7331j1626l9844l5573j4810l597N046K6977M5895K8757j4755m0868
360G345l1924j3281n743N292K8226M3734K6686j3251l7677l3377j5675l744P285
373c6104K7226M1453K6374j2440l8484l1793j4014l987N823K6446M2713K6134
385E9347j3590l8042l2295j3477k301O476K5830L9456K5670j1060l7397l2363
397b3746j4134k262P126K5849M0291K3862j3432l7173k9844j1781l001N598K5157
410g490L9411K4638j2571l7246l1555j1911O0P336K3365L5942K4287j1018l6644
$$ plain form
423 6604 -24077 -35070 -36364 -30538 -6569 32125 55568 40677 3022 -24249 -32944 -34175 -29536
436 -29536 -6741 30961 53940 41181 4581 -24458 -34313 -34563 -27736 -4623 31136 51841 37334
449 37334 3237 -22478 -31701 -34777 -29652 -4734 31764 51789 36622 1980 -24679 -32892 -32509
462 -32509 -25626 -5049 28680 49691 37292 2956 -24082 -32930 -33645 -26860 -3448 31056 48779
475 48779 33609 1028 -22243 -30696 -32232 -27239 -5036 29729 49306 34950 1002 -24289 -31499
488 -31499 -31051 -24795 -2945 29358 46758 32707 1966 -20721 -30615 -33085 -26097 -1523 31396
501 31396 46241 31172 383 -21887 -29609 -29485 -23510 -3255 28250 46097 33413 1881 -23016
514 -23016 -31022 -29522 -22117 -1636 28383 44855 30842 862 -20704 -27966 -30002 -24803 -1929
$$ packed form
423F604l0681j0993j294N826K3969L8694K3443j4891l7655k7271q695j231M639
436b9536K2795L7702K2979j2759l6600k9039r855k50O827K3113L5759K0705j4507
449C7334l4097k5715r223l076N125K4918L6498K0025j5167l4642k6659q213L83
462c2509O883K0577L3729K1011j2399l4336k7038q848p15O785K3412L4504J7723
475D8779j5170l2581k3271q453j536M993K2203L4765J9577j4356l3948k5291p210
488c1499M48O256K1850L2303J7400j4051l0741k2687r894k470O988K4574L2919
501C1396J4845j5069l0789k2270p722J24N975K0255L1505J7847j2684l1532k4897
514b3016q006J500P405K0481L0019J6472j4013k9980k1566p262k036N199K2874
$$ plain form
527 -1929 30731 45832 29518 -994 -22091 -28345 -28183 -21490 -1042 27181 43030 30558 1696
540 1696 -21301 -29662 -28666 -20829 -734 28251 42679 28105 -900 -20358 -25343 -26947 -22782 -2527
554 -2527 28265 43041 28711 -719 -20648 -26822 -26863 -20390 421 27143 39774 27494 1471
567 1471 -19745 -28276 -27731 -19172 1006 27381 40209 26509 -2062 -21471 -24484 -23054 -20007 -3500
581 -3500 25582 41633 26697 -2635 -20211 -24680 -25895 -20562 747 27340 36747 22747 146
594 146 -17566 -26113 -26943 -18680 237 25369 38987 26121 -2785 -22537 -24852 -21800 -18222 -1682
608 -1682 26474 39328 23321 -3843 -19204 -23373 -24867 -17572 3179 26326 34626 21444 -669
621 -669 -17063 -23668 -23941 -17683 -114 24786 37948 25031 -2550 -21070 -24742 -21647 -15719 893
$$ packed form
527a929L2660J5101j6314l0512k1097o254J62O693K0448K8223J5849j2472k8862
540A696k2997q361R96P837K0095K8985J4428j4574k9005j9458m985j604M165K0255
554b527L0792J4776j4330k9430j9929o174m1O473K0811K6722J2631j2280k6023
567A471k1216q531N45Q559K0178K6375J2828j3700k8571j9409l013J430L047J6507
581c500K9082J6051j4936k9332j7576m469j215N333K1309K6593R407j4000k2601
594A46j7712q547q30Q263J8917K5132J3618j2866k8906j9752k315L052L578J6540
608a682K8156J2854j6007k7164j5361m169j494P295K0751K3147Q300j3182k2113
621f69j6394o605k73O258J7569K4900J3162j2917k7581j8520l672L095N928J6612
$$ plain form
635 893 24822 36372 23026 -2583 -19190 -23123 -22557 -16850 1644 27560 36665 19847 -4905
648 -4905 -18145 -21067 -22377 -16552 2887 25687 32930 20074 -1229 -17901 -23782 -21098 -12733 1555
662 1555 21540 33323 23420 -2481 -19269 -21636 -20686 -17195 575 27323 36002 18298 -5833
675 -5833 -17330 -20361 -20896 -13762 3865 23582 30856 19755 -1572 -18341 -22617 -19307 -12654 2267
689 2267 23330 32301 18178 -4592 -17213 -18717 -19603 -14906 1887 23212 31000 18200 -2282
702 -2282 -16926 -20983 -19270 -13801 631 22255 32151 18960 -3953 -17573 -20285 -20367 -14112 4381
716 4381 24638 28507 14717 -3263 -15449 -20332 -18730 -11217 2360 20088 29330 19457 -3325
729 -3325 -18953 -19687 -15751 -12638 1208 22534 30583 15370 -5463 -15223 -17679 -19023 -13690 3464
$$ packed form
635H93K3929J1550j3346k5609j6607l933N66N707J8494K5916R105j6818k4752
648d905j3240k922j310N825J9439K2800P243j2856k1303j6672n881K684Q365J4288
662A555J9985J1783r903k5901j6788k367R50L491J7770K6748Q679j7704k4131
675e833j1497l031n35P134J7627J9717P274j1101k1327j6769m276L310O653J4921
689B267K1063Q971j4123k2770j2621j504q86M697J6793K1325P788j2800k0482
702b282j4644m057J713N469J4432K1624R896j3191k2913j3620k712q2O255J8493
716D381K0257L869j3790j7980j2186m883J602P513J3577J7728R242r873k2782
729c325j5628p34L936L113J3846K1326Q049j5213k0833r760k456j344N333J7154
$$ plain form
743 3464 23081 28740 16148 -3065 -16411 -19729 -17922 -11428 3519 22423 29182 15930 -5090
756 -5090 -17586 -19216 -15882 -9641 3890 20440 26820 14917 -4716 -16614 -17159 -15267 -11833 1776
770 1776 22500 29746 13798 -6831 -15832 -16373 -16747 -11886 5166 22080 24480 12818 -2999 -15175
784 -15175 -19853 -16423 -8303 3758 18829 27144 16033 -6435 -18858 -16474 -12728 -10926 2170
797 2170 22584 27461 10020 -8075 -13145 -14516 -16502 -10803 5307 20704 22257 12370 -2613 -14371
811 -14371 -18879 -15267 -7764 3986 18745 24792 14137 -6223 -17214 -15760 -12619 -10184 2118
824 2118 20401 25507 11350 -6841 -14743 -14905 -15434 -10738 4683 21203 23385 9771 -5764 -14205
838 -14205 -16185 -14505 -7687 5438 18278 21393 11498 -3991 -15135 -16050 -12859 -8001 2472 17987
$$ packed form
743C464J9617N659j2592j9213j3346l318J807O494J4947J8904O759j3252k1020
756e090j2496j630L334O241J3531J6550O380j1903j9633j1898n45J892L434J3609
770A776K0724P246j5948k0629r001n41l74M861J7052J6914K400j1662j5817j2176
784a5175m678L430Q120J2061J5071Q315j1111k2468j2423K384L746J802J3096
797B170K0414M877j7441j8095n070j371j986N699J6110J5397J553r887j4983j1758
811a4371m508L612P503J1750J4759O047j0655k0360j0991J454L141K435J2302
824B118J8283N106j4157j8191p902j62n29M696J5421J6520K182j3614j5535q441
838a4205j980J680O818J3125J2840L115r895j5489j1144r15L191M858J0473J5515
$$ plain form
852 17987 24778 12480 -7143 -15962 -14416 -13268 -9465 3992 21132 23384 8888 -5890 -12911
865 -12911 -14939 -14787 -7584 6066 18165 20684 11168 -4196 -15139 -16436 -11593 -5854 3726 17759
879 17759 22939 11069 -7374 -14822 -12464 -11198 -8946 3539 19365 22024 8613 -5889 -12541
892 -12541 -14381 -14171 -7672 5863 18835 20113 9389 -5256 -14222 -15378 -11571 -5455 4466 16664
906 16664 20731 9767 -6844 -14540 -13229 -10916 -7154 4046 18079 20749 8551 -6967 -13334
919 -13334 -12891 -11388 -6842 4617 17609 19653 8023 -6172 -12663 -13192 -11557 -6817 4757 17303
933 17303 19473 8449 -5884 -13559 -14081 -10947 -5528 4750 16560 19441 8114 -6651 -13718 -12602
947 -12602 -10097 -6408 4237 17075 19134 7353 -6635 -12844 -12784 -11163 -5886 4786 16462 18269
$$ packed form
852A7987O791j2298j9623q819J546J148L803J3457J7140K252j4496j4778p021
865a2911k028J52P203J3650J2099K519r516j5364j0943j297M843N739R580J4033
879A7759N180j1870j8443p448K358J266K252J2485J5826K659j3411j4502o652
892a2541j840K10O499J3535J2972J278j0724j4645q966j156L807O116R921J2198
906A6664M067j0964j6611p696J311K313L762J1200J4033K670j2198j5518o367
919a3334M43J503M546J1459J2992K044j1630j4195o491n29J635M740J1574J2546
933A7303K170j1024j4333p675n22L134N419J0278J1810K881j1327j4765p067J116
947a2602K505L689J0645J2838K059j1781j3988o209O0J621N277J0672J1676J807
$$ plain form
961 18269 7966 -6087 -13475 -13091 -9930 -5411 4191 16512 19328 7528 -7058 -12806 -11964 -10298
975 -10298 -6066 5179 17412 18142 6541 -6691 -12942 -12672 -9551 -4312 5213 15998 17670 6967
989 6967 -6848 -12863 -11495 -9199 -4855 5036 16581 17468 6453 -6464 -12021 -11951 -9351 -4463 5525
1004 5525 15661 17362 7069 -7166 -13093 -10744 -8043 -4659 4745 16207 17470 5543 -7433
1017 -7433 -11714 -10862 -9394 -4320 6310 15782 15473 5708 -6220 -12415 -11391 -7513 -3606 4628 14991
1032 14991 17166 5616 -7758 -12402 -10162 -8256 -4483 5227 15886 15439 4860 -6536 -11393 -10872
1046 -10872 -8549 -3549 5282 14630 15471 5146 -8010 -11935 -9830 -7850 -4504 5075 15590 15139
1060 15139 4109 -7201 -11383 -10350 -8590 -3145 6199 14685 14701 4684 -7283 -11701 -9523 -7445
$$ packed form
961A8269j0303j4053p388L84L161M519R602J2321K816j1800j4586n748Q42J666
975a0298M232J1245J2233P30j1601j3232o251K70L121N239R525J0785J672j0703
989F967j3815o015J368K296M344R891J1545Q87j1015j2917n557P0K600M888R988
1004E525J0136J701j0293j4235n927K349K701L384R404J1462J263j1927j2976
1017g433m281Q52J468N074J0630R472l09r765j1928o195J024L878L907Q234J0363
1032A4991K175j1550j3374m644K240J906L773R710J0659m47j0579j1396m857N21
1046a0872K323N000Q831R348Q41j0325j3156l925K105J980L346R579J0515m51
1060A5139j1030j1310m182J033J760N445R344Q486J6j0017j1967m418K178K078
$$ plain form
1074 -7445 -4249 5157 15432 15276 3778 -7841 -10766 -9557 -8464 -3200 6319 14358 13498 4276 -6391
1089 -6391 -11501 -10494 -7020 -2231 5845 14041 14313 3915 -7453 -10954 -8862 -7270 -3134 5921 14771
1104 14771 13612 3498 -6935 -10798 -9938 -6384 -1827 5417 13748 13782 4574 -6902 -11133 -8729 -6441
1119 -6441 -2984 5798 14491 13602 2642 -7248 -9925 -8840 -6842 -2195 6022 13500 12815 3980 -7075
1134 -7075 -11199 -8810 -5574 -2313 5143 13698 13210 3122 -7254 -9699 -8278 -6492 -2619 5919 13628
1149 13628 12670 3094 -6965 -10736 -8282 -5303 -2361 4846 12791 13261 2631 -7846 -10258 -7888
1163 -7888 -6182 -2510 5779 13885 11791 2131 -6805 -9742 -8648 -5927 -1732 5231 12610 12311 2748
1178 2748 -7400 -10271 -7213 -5275 -2568 5081 12971 11868 1862 -6885 -9580 -7985 -5855 -1611
$$ packed form
1074g445L196R406J0275j56j1498j1619k925J209J093N264R519Q039q60r222j0667
1089f391n110J007L474M789Q076Q196K72j0398j1368l501K092J592M136R055Q850
1104A4771j159j0114j0433l863Q60L554M557P244Q331L4r208j1476m231K404K288
1119f441L457Q782Q693q89j0960r890k677J085J998M647Q217P478o85q835j1055
1134g075m124K389L236L261P456Q555m88j0088j0376k445J421J786L873Q538P709
1149A3628r58r576j0059l771K454K979K942P207P945M70j0630j0477k412K370
1163g888J706L672Q289Q106k094r660q936k937J094K721M195O963P379k99r563
1178B748j0148k871L058J938K707P649P890j103j0006q747k695J595K130M244
$$ plain form
1192 -1611 5857 12668 11313 2011 -7129 -9542 -7311 -5260 -2184 5071 12681 11752 1673 -7540 -9254
1207 -9254 -7563 -5419 -1633 5611 12536 10739 2014 -6759 -9492 -7241 -5111 -1241 5521 12378 11180
1222 11180 790 -7785 -9088 -6491 -4663 -1799 6015 12385 10719 1123 -7164 -9345 -7172 -4763
1236 -4763 -750 6002 11851 10568 1201 -7306 -8803 -6473 -4053 -1617 5713 12185 10299 1111 -7345
1251 -7345 -8720 -6394 -4489 -869 6088 11717 10138 1071 -7279 -8833 -6716 -4349 -643 5809 11684
1266 11684 9522 445 -6707 -8209 -6288 -4249 -661 5403 11196 9839 906 -7361 -9099 -6279 -3398
1281 -3398 -832 5374 11268 9584 429 -7417 -8226 -5924 -4379 -1426 5702 11610 8894 88 -6823
1296 -6823 -8065 -6233 -4355 -421 5746 10511 8862 825 -6986 -8841 -5818 -3127 -578 5109 10873
$$ packed form
1192a611P468O811j355r302r140k413K231K051L076P255P610r29j0079r213j714
1207i254J691K144L786P244O925j797q725q773k733K251K130L870O762O857j198
1222A1180j0390q575j303K597J828K864P814O370j666r596q287k181K173K409
1236d763M013O752N849j283r367q507j497K330K420K436P330O472j886r188q456
1251g345j375K326J905L620O957N629j579r067q350j554K117K367L706O452N875
1266A1684k162r077p152j502J921K039L588O064N793j357q933q267j738K820K881
1281c398K566O206N894j684r155p846q09K302J545K953P128N908k716q806o911
1296f823j242J832J878L934O167M765j649q037p811j855L023K691K549N687N764
$$ plain form
1311 10873 9208 101 -7463 -7733 -5173 -4043 -1371 5902 11426 8832 -299 -6981 -7706 -5584 -3684
1326 -3684 -791 5639 10155 8003 330 -6746 -8325 -6254 -3173 -55 5131 10756 9013 263 -7371
1341 -7371 -8175 -4476 -2854 -678 5510 11144 8092 -790 -7102 -7114 -5159 -3884 -445 5832 10600 7129
1357 7129 15 -6384 -7800 -5930 -2914 551 5118 9667 8075 -30 -7330 -7966 -4186 -2338 -935
1372 -935 4872 10413 8155 -830 -7528 -6890 -4416 -3683 -304 6456 10332 6394 -886 -6375 -6850 -5202
1388 -5202 -2770 654 5179 8578 7206 392 -6619 -7847 -4560 -2251 -684 4599 10430 8026 -1074
1403 -1074 -7873 -7146 -4131 -3107 -337 5374 9455 6384 -1656 -6210 -6568 -4795 -2941 -100 4885
1418 4885 8663 7172 -455 -7047 -7808 -4444 -1730 -62 4973 8965 7041 -1041 -6970 -6394 -3868
$$ packed form
1311A0873j665r107p564k70K560J130K672P273N524k594r131o682p25K122J900
1326c684K893O430M516k152p673p076j579K071L081L118N186N625j743q750p634
1341g371q04L699J622K176O188N634l052q882o312j2J955J275L439O277M768l471
1357G129p114o399j416J870L016L465M567M549j592q105p300o36L780J848J403
1372i35N807N541k258q985o698O38K474P33L379O760L876l938p280n489m75J648
1388e202K432L424M525L399j372o814p011j228L287K309J567N283N831k404r100
1403a074o799P27L015J024K770N711M081l071q040m554l58J773J854K841M985
1418D885L778j491p627o592p61L364K714J668N035L992j924q082n929N76K526
$$ plain form
1433 -3868 -2676 -665 5229 9695 6873 -1107 -6838 -6472 -4426 -2760 386 6062 9064 6126 -1419
1448 -1419 -6512 -6511 -3781 -1830 204 4500 8916 7168 -1016 -6974 -6664 -3552 -2206 -227 5243 9672
1464 9672 6384 -1894 -6450 -5822 -3687 -2299 296 5577 8461 5766 -1185 -6135 -6388 -3971 -1822
1479 -1822 386 4901 8815 6146 -1743 -6972 -6167 -3489 -1713 610 5208 7916 5348 -1685 -6181
1494 -6181 -5735 -3411 -1881 136 4996 8716 6044 -1572 -6760 -5914 -3257 -1815 220 5409 8406
1509 8406 5008 -1915 -6423 -5714 -3708 -1529 514 4901 7728 5193 -1548 -6090 -5576 -3310 -1741
1524 -1741 145 4509 8245 5239 -1952 -6722 -5810 -2658 -1670 171 4733 7914 5064 -1990 -6068
1539 -6068 -5412 -3507 -2077 400 5244 7964 4607 -2211 -6251 -5417 -3318 -1177 987 4684 7161
$$ packed form
1433c868J192K011N894M466k822p980n731L66K046J666L146N676L002k938p545
1448a419n093JK730J951K034M296M416j748q184n958L10L112J346J979N470M429
1464I672l288q278m556O28K135J388K595N281K884k695o951m950k53K417K149
1479a822K208M515L914k669p889n229Q05K678J776K323M598K708k568p033m496
1494f181M46K324J530K017M860L720k672p616n188Q46K657J442K035N189K997
1509H406l398o923m508P09K006K179K043M387K827k535o741m542N14K266J569
1524a741J886M364L736l006p191m770R12L152R88J841M562L181k850p054m078
1539f068O56J905J430K477M844K720l357o818m040Q34K099K141K164L697K477
$$ plain form
1554 7161 4993 -1697 -6549 -5643 -2721 -713 298 4482 7759 4993 -2113 -6568 -4641 -2877 -2220
1569 -2220 377 5778 7839 3796 -2380 -5712 -5306 -3037 -1189 1189 4197 6860 5156 -1595 -6379
1584 -6379 -5709 -2562 -1011 763 4641 7859 4308 -2778 -5765 -4276 -2215 -1861 125 5062 7302
1599 7302 4069 -2301 -5537 -4934 -2568 -1287 870 4760 6924 4430 -2016 -5793 -4736 -2426 -992
1614 -992 800 4508 7037 4508 -2418 -6071 -4522 -1725 -1344 -20 4689 7622 4206 -2696 -5818
1629 -5818 -4439 -2423 -1243 1520 5250 6231 2988 -1750 -5206 -4920 -2480 -958 918 4226 7047
1644 7047 4116 -2880 -6406 -4667 -1660 -1235 287 4587 7138 3684 -2476 -5287 -4605 -2439 -994
1659 -994 1035 4777 6051 3099 -2346 -5587 -4101 -2092 -902 710 4201 6685 3567 -2751 -6047
$$ packed form
1554G161k168o690m852R06K922K008J011M184L277k766p106m455J927J764O57
1569b220K597N401K061m043o176l332M06K269J848K378L008K663j704o751m784
1584f379O70L147J551J774L878L218l551p086k987J489K061L54J986M937K240
1599G302l233o370l236O03K366J281K157L890K164k494o446l777J057K310J434
1614i92J792L708K529k529o926l653J549K797L81J324M709K933l416o902l122
1629e818J379K016J180K763L730R81l243m738l456K86K440J522J876L308K821
1644G047k931o996l526J739L007M25J522M300K551l454o160k811O82K166J445
1659i94K029L742J274k952n445l241J486K009J190J612L491K484l118o318l296
$$ plain form
1674 -6047 -4355 -1656 -947 929 4515 6302 3282 -2308 -5262 -4414 -2125 -923 1066 4728 6539
1689 6539 2857 -3028 -5495 -3859 -1833 -908 1081 4443 6235 2889 -2452 -5600 -4133 -1524 -353
1704 -353 945 4207 6223 3114 -2602 -5368 -3816 -1754 -1106 808 4763 6255 2762 -3000 -5003
1719 -5003 -3683 -1491 -573 745 4111 5723 3240 -2726 -5146 -3832 -1597 -696 525 4492 5864
1734 5864 2381 -3135 -4896 -3445 -1776 -781 802 4484 6012 2361 -3161 -5548 -3632 -897 -480
1749 -480 717 3914 5712 2536 -2685 -5138 -3639 -1543 -730 1153 4407 5546 2493 -2551 -4800
1764 -4800 -3524 -1011 -358 725 3918 5648 2635 -3159 -4793 -3357 -1254 -718 1129 4254 4989 2318
1780 2318 -2598 -4696 -3571 -1536 -447 1312 3998 5502 2415 -2797 -4998 -3311 -1313 -441 829
$$ packed form
1674f047J692K699P09J876L586J787l020n590k954Q48K289J202J989L662J811
1689F539l682n885k467J636K026R25J989L362J792l346n341l148J467K609J171
1704c53J298L262K016l109n716k766J552K062O48J914L955J492l493n762k003
1719e003J320K192R18J318L366J612k483n966k420J314K235R01J221L967J372
1734E864l483n516j761J451J669R95J583L682J528l651n522k387J916K735M17
1749d80J197L197J798l176n221k453J499K096Q13J883L254J139l053n044k249
1764d800J276K513O53J083L193J730l013n794j634J436K103N36J847L125P35k671
1780B318m916k098J125K035J089J759K686J504l087n212k201J687J998Q72J270
$$ plain form
1795 829 4096 5159 2217 -2692 -4946 -3492 -1137 -176 1422 3905 5020 2156 -2671 -4715 -3191
1810 -3191 -1064 -625 785 3761 5498 1837 -3119 -4570 -2764 -1094 -217 1293 3920 4842 2152 -2838
1826 -2838 -4473 -3009 -865 -214 1124 3822 5004 2015 -3202 -4629 -2558 -737 -289 1139 3861
1841 3861 4887 1828 -2972 -4533 -2972 -860 -156 1009 3746 4928 1585 -2861 -4357 -2608 -635
1856 -635 -535 1130 3998 4977 1640 -3130 -4308 -2394 -712 -320 915 3877 4465 1711 -2933 -4371
1872 -4371 -2854 -934 -96 1006 4050 4915 1227 -3010 -4108 -2450 -1015 -406 1276 3723 4620 1476
1888 1476 -3121 -4451 -2310 -633 -193 938 3635 4797 1262 -2962 -4433 -2305 -989 -282 1074
1903 1074 3803 4056 1039 -2746 -3917 -2433 -696 -12 1332 3641 4114 1492 -2740 -4239 -2365 -200
$$ packed form
1795H29L267J063k942m909k254J454K355R61J598K483J115k864m827k044J524
1810c191K127M39J410K976J737l661m956j451J806J670Q77J510K627R22k690m990
1826b838j635J464K144O51J338K698J182k989n217j427K071J821M48J428K722
1841C861J026l059m800j561J561K112P04J165K737J182l343m446j496J749J973
1856f35J00J665K868R79l337m770j178J914J682L92J235K962N88k754m644j438
1872d371J517J920Q38J102L044Q65l688m237j098J658J435O09J682K447Q97l144
1888A476m597j330K141J677M40J131K697J162l535m224j471K128J316P07J356
1903A074K729K53l017l785j171J484J737O84J344K309M73k622m232j499J874K165
$$ plain form
1919 -200 -428 896 3660 4627 1308 -3031 -4107 -2194 -702 7 1351 3931 4166 924 -2959 -4239
1935 -4239 -2073 -898 95 1224 3745 4013 1095 -2942 -4188 -2317 -789 149 1165 3413 4242 1183
1951 1183 -2749 -3828 -2157 -494 -121 982 3476 3805 886 -2937 -3688 -1975 -697 -71 1149 3567
1967 3567 3574 764 -2879 -3655 -2040 -268 135 981 3197 3530 598 -3229 -3940 -1548 -496 -215 1141
1984 1141 3720 3923 655 -3353 -3569 -1802 -407 -129 1162 3535 3380 499 -3249 -3780 -1893 -446
2000 -446 -79 1291 3229 3610 656 -2820 -3516 -1740 -512 -55 1223 3322 3569 809 -3126 -3470 -1306
2017 -1306 -58 -182 1301 3283 3452 416 -3069 -3545 -1807 -203 -25 1061 3380 3482 639 -2779
2033 -2779 -3201 -1875 -437 214 1088 2925 3305 446 -2975 -3273 -1513 -21 -130 1300 3126 3574 554
$$ packed form
1919b00k28J324K764R67l319m339j076J913J492P09J344K580K35l242l883j280
1935d239K166J175R93J129K521K68k918m037j246J871J528R38J016K248Q29l059
1951A183l932j079J671J663L73J103K494L29k919l823p51J713J278O26J220K418
1967C567Pk810l643p76J615J772M03Q46K216L33k932l827p11K392J052K81J356
1984A141K579K03l268m008k16J767J395K78J291K373j55k881l748n31J887J447
2000d46L67J370J938L81k954l476o96J776J228M57J278K099K47k760l935l44K164
2017a306J248j24J483J982J69l036l485m76J738J604J78J086K319J02k843l418
2033b779m22J326J438O51Q74J837L80k859l421k98J760J492j09J430J826M48l020
$$ plain form
2050 554 -3207 -3430 -1413 -34 -75 1304 3222 3045 -29 -2776 -2747 -1233 -393 -160 1321 3075 2900
2067 2900 533 -3012 -3398 -1685 -64 179 1062 2734 2968 270 -3234 -3455 -1098 220 -20 1203
2083 1203 2857 3194 73 -2925 -2510 -1117 -617 -141 1342 2757 2602 -83 -2408 -2889 -1740 150
2099 150 511 875 2114 3142 619 -2796 -3248 -1347 -70 54 708 2966 3242 111 -3334 -2928 -725
2116 -725 -276 -50 1270 2838 2550 -246 -2564 -2809 -1209 -270 173 1017 2656 2858 566 -2794 -3266
2133 -3266 -1054 109 -31 736 2997 3051 151 -3117 -2476 -694 -160 -217 1158 3392 2824 -446 -2899
2150 -2899 -2719 -1250 -117 293 1752 2579 2289 -307 -2693 -3002 -874 617 500 696 2155 3009 -99
2167 -99 -3053 -2513 -750 166 -145 1065 2916 2620 -541 -2817 -2647 -1117 -229 620 1463 2755 1919 -200
$$ packed form
2050E54l761k23K017J379m1J379J918j77l074k747K9J514Q40K33J481J754j75
2067B900k367l545l86J713J621K43Q83J672K34k698l504k21K357J318k40J223
2083A203J654L37l121k998M15J393N00M76J483J415j55k685k325m81J149J890
2099A50L61L64J239J028k523l415m52J901J277J24O54K258K76l131l445M06K203
2116g25M49K26J320J568k88k796k318k45J600R39M43Q44J639K02k292l360m72
2133c266K212J163j40P67K261N4k900l268O41J782N34n7J375K234n68l270k453
2150b899J80J469J133M10J459Q27k90k596k386l09K128J491j17J96J459Q54l108
2167i9k954N40J763R16l11J210J851k96l161k276J70J530Q88Q49Q43J292q36k119
$$ plain form
2185 -200 -2555 -2562 -1156 418 563 1001 2355 2597 -255 -2806 -2654 -734 401 -217 1199 2511 2614
2202 2614 -506 -2827 -2133 -582 -374 -108 1180 2544 2199 -46 -2370 -2595 -1269 -37 406 1401 2325
2219 2325 2377 -56 -2882 -2749 -763 676 74 1181 2645 2199 -689 -2520 -2415 -619 -16 -11 1467
2236 1467 2541 2052 -296 -2497 -2262 -720 -92 460 1192 2509 2195 -122 -2625 -2307 -576 17 62
2253 62 1034 2485 2121 -681 -2854 -2289 -511 324 139 1418 2398 1679 -634 -2464 -2198 -518 97 374
2271 374 1347 2516 1959 -730 -2521 -2391 -460 137 482 989 2122 2073 -785 -2316 -2324 -808 385 295
2289 295 1090 2462 2164 -188 -2358 -2195 -546 155 294 1141 2230 1671 -711 -2563 -1837 -542 218
2306 218 286 936 2184 2065 -400 -2534 -1852 -470 53 345 1336 2141 1884 -791 -2286 -2169 -473 253
$$ packed form
2185b00k355pJ406J574J45M38J354K42k852k551J52J920J135o18J416J312J03
2202B614l120k321O94J551K08K66J288J364l45k245k324k25J326J232M43R95R24
2219B325N2k433k826J33J986J439o02J107J464m46k888j831J05J796O03NJ478
2236A467J074m89k348k201K35J542O28N52P32J317l14k317k503L18J731N93M5
2253F2R72J451l64k802k173N65J778Q35j85J279R80p19k313j830K66J680O15K77
2271C74R73J169n57k689j791J30J931N97L45N07J133m9k858j531qJ516J193r0
2289B95P95J372k98k352k170J63J649P01J39Q47J089n59k382j852P26J295P60
2306B18O8O50J248j19k465k134O82J382N23K92R91Q05k57k675j495J17J696P26
$$ plain form
2324 253 124 804 2013 1882 -867 -2762 -2126 -211 289 136 1258 2494 1523 -689 -2434 -1951 -282
2341 -282 -77 207 1187 1994 1610 -593 -2409 -2000 -442 349 177 1023 2079 1756 -914 -2660 -1513 -197
2359 -197 38 20 1181 2218 1371 -736 -2215 -1723 -392 289 468 1231 2198 1714 -620 -2428 -1715 -62
2377 -62 244 290 1010 2042 1320 -784 -2479 -1732 -545 346 549 786 2327 1511 -738 -2110 -1814 -301
2395 -301 242 212 1202 2078 1060 -917 -2307 -1508 -385 391 421 1237 1677 1274 -804 -2258 -1617 -150
2413 -150 625 523 901 2132 1310 -839 -2655 -1541 -185 -42 478 1235 1804 1123 -746 -2232 -1319 -450
2431 -450 388 291 928 1889 1285 -755 -2344 -1648 -231 170 269 1075 2210 1187 -781 -1886 -1345 -147
2449 -147 368 -49 1177 1660 1300 -667 -2374 -1532 -110 398 196 1187 1720 1175 -737 -2333 -1385 -201
$$ packed form
2324B53j29O80J209j31k749j895O36J915N00j53J122J236r71k212j745M83J669
2341b82K05K84R80Q07l84k203j816M09J558P91j72Q46J056l23k670j746J147J316
2359a97K35j8J161J037q47k107j479M92J331O81J79P63R67m84k334j808P13J653
2377f2L06M6P20J032p22k104j695P47J187Q91K03K37J541q16k249j372K96J513
2395c01N43l0R90Q76j018j977j390P99J123P76L0Q16M40m03k078j454O41J467
2413a50P75j02L78J231q22k149j816J114J356J43N20P57N69o81j869j486R13Q69
2431d50Q38r7O37R61o04k040j589O96J417M01R9Q06J135j023j968j105N41J198
2449a47N15m17J226M83l60j967j707Q42J422N08k02R91N33n45j912j596R48J184
$$ plain form
2467 -201 259 296 1123 1731 794 -925 -2309 -1436 200 426 80 896 1815 1100 -752 -1966 -1055 -266 300
2486 300 285 1118 1542 955 -756 -2170 -1263 -18 443 510 652 1759 1058 -923 -2057 -1340 78 274
2504 274 314 999 1835 805 -1323 -2035 -1409 -175 262 402 1196 1644 1150 -907 -2150 -929 -136 184
2522 184 78 946 1709 1190 -1293 -1689 -1332 -11 -50 440 1230 1719 590 -1047 -2203 -1493 363 226
2540 226 242 954 1564 891 -1090 -1978 -1093 21 388 381 836 1495 821 -1000 -2008 -1257 8 609 367
2559 367 693 1599 1098 -820 -2001 -982 284 172 125 1089 1466 632 -1107 -1666 -1000 -137 256 310 817
2578 817 1518 805 -823 -2113 -1293 277 284 64 865 1551 793 -1296 -1626 -1023 -76 230 47 1075 1496
2597 1496 901 -911 -1917 -1141 195 717 372 745 1707 423 -1402 -1749 -899 246 194 355 1154 1499
$$ packed form
2467b01M60L7Q27O08r37j719j384Q73J636K26l46Q16R19p15j852j214R11P89N66
2486C00j5Q33M24n87j711j414R07J245M61O7J42J107p01j981j134P17J418J96
2504B74M0O85Q36j030k128p12O26J234M37J40P94M48m94k057j243J221P93L20
2522A84j06Q68P63n19k483l96L57J321l9M90P90M89j129j637j156P10J856j37
2540B26J6P12O10o73j981q88Q85J114L67pM55O59o74j821j008P51J265O01k42
2559C67L26R06n01j918j181J019J266j12m7R64L77q34j739n59O66Q63L93N4N07
2578H17P01p13j628j290Q20J570Pk20Q01O86p58k089l30O03R47L06j83J028M21
2597A496n95j812j006P76J336N22l45L73R62j284j825l47Q50J145n2J61P99L45
$$ plain form
2615 1499 678 -951 -1814 -1001 80 476 422 849 1550 577 -1312 -1794 -802 379 495 264 1209 1496 594
2634 594 -1082 -1784 -757 43 155 300 851 1452 414 -1074 -1782 -992 -79 598 545 886 1506 357 -1195
2653 -1195 -1753 -827 260 317 620 736 1443 775 -849 -1523 -735 474 115 217 873 1416 564 -886 -1574
2672 -1574 -721 11 322 512 894 1273 582 -1265 -1726 -989 202 358 242 760 1300 620 -1105 -1857 -629
2691 -629 402 366 238 1087 1243 170 -1027 -1441 -697 75 758 289 1028 910 186 -1190 -1656 -715 262
2710 262 502 470 789 1208 506 -1323 -1711 -627 306 589 337 1081 1282 271 -1072 -1708 -379 529 458
2729 458 475 601 1057 359 -1231 -1209 -639 378 618 500 795 1290 392 -962 -1696 -834 466 504 143 723
2749 723 1137 359 -903 -1403 -386 315 452 507 781 1325 262 -1351 -1600 -863 482 634 289 672 704
$$ packed form
2615A499q21j629q63Q13J081L96n4M27P01r73j889m82R92J181J16k31R45K87r02
2634E94j676p02J027Q00J12J45N51O01j038j488p08P90R13O77n3L41O20j149j552
2653a195n58R26J087N7L03J16P07o68j624o74P88J209l59J02O56N43q52j450o88
2672a574Q53P32L11J90L82L79o91j847m61P37J191J56j16N18N40o80j725p52J228
2691f29J031l6j28Q49J56j073j197m14P44P72O83m69P39j18p24j376m66R41R77
2710B62K40l2L19M19p02j829l88J084R33K83k52P44K01j011j343o36J329R08p1
2729D58J7J26M56o98j590K2N70J017K40j18K95M95q98j354p34Q62J300L8l61N80
2749G23M14p78j262n00J017P01J37N5K74N44j063j613k49P37J345J52l45L83L2
$$ plain form
2768 704 59 -1241 -1490 -540 197 226 164 1029 1143 286 -1011 -1336 -530 260 255 378 815 893 138 -1025 -1303
2789 -1303 -305 141 245 432 830 1232 438 -1293 -1194 -545 167 404 319 820 1004 68 -1064 -1549 -571 598
2809 598 350 218 591 902 525 -1033 -1385 -504 391 413 106 957 1262 -40 -1075 -1258 -440 -26 260
2828 260 484 793 1136 -30 -1054 -1445 -743 453 429 537 638 953 373 -1231 -1677 -536 54 162 244
2847 244 689 866 73 -1268 -951 -33 260 179 187 1063 881 -20 -901 -1171 -616 154 499 433 759 441 76
2868 76 -1267 -1487 -305 660 387 377 463 1053 357 -1252 -1506 40 650 271 327 834 1117 36 -877 -883
2888 -883 -284 180 694 590 661 732 172 -877 -1458 -199 369 254 -100 498 1166 392 -1093 -1571 -152
2907 -152 320 183 -141 516 918 -164 -1084 -1223 364 90 327 369 906 683 164 -923 -1177 -744 162
$$ packed form
2768G04o45j300k49R50P37K9o2Q65J14q57j297l25Q06P90nJ23M37P8p55j163k78
2789a303R98M46J04J87L98M02p94j731R9O49P12K37q5N01J84r36j132m85R78J169
2809E98k48j32L73L11l77j558l52Q81Q95K2l07Q51L05j302j035j83Q18M14K86
2828B60K24L09L43j166j024l91P02J196k4J08J01L15n80j604m46J141N90J08Q2
2847B44M45J77p93j341L17R18K93q1QQ76j82r01q81k70N55P70L45o6L26l18l65
2868G6j343k20J182R65k73j0Q6N90o96j609k54J546O10l79N6N07K83j081r13o
2888h83N99M64N14j04P1P1n60j049n81J259N68j15l54N98O68p74j485m78J419
2907a52M72j37l24O57M02j082r20j39J587k74K37M2N37k23n19j087k54M33R06
$$ plain form
2926 162 451 139 361 575 333 -918 -1441 -352 598 46 156 786 961 -19 -1211 -904 -356 275 156
2945 156 521 777 616 163 -1069 -1063 -499 361 401 341 528 681 48 -947 -1314 -371 581 272 293 685 788
2966 788 103 -1152 -815 95 236 78 173 300 857 -136 -1065 -1191 -460 481 306 211 330 549 -106 -953
2986 -953 -1203 -23 749 475 359 834 663 15 -908 -1150 -94 520 259 158 652 1053 155 -808 -678
3005 -678 -306 422 147 313 492 767 -11 -775 -1191 -298 327 378 452 566 984 332 -1272 -975 -253 639
3025 639 446 265 775 633 -129 -1346 -928 -195 397 321 361 475 476 -87 -937 -1468 -43 374 211 238 490
3046 490 689 341 -988 -929 -268 497 355 469 725 498 -325 -1185 -1067 -12 403 348 352 341 748 -141 -1206
3067 -1206 -1189 -69 470 242 85 614 513 8 -777 -633 69 274 319 141 601 474 73 -778 -1009 109
$$ packed form
2926A62K89l12K22K14k42j251n23J089R50n52J10O30J75r80j192L07N48O31j19
2945A56L65K56j61m53j232ON64Q60M0o0J87J53o33r95l67R43R52l09K1L92J03
2966G88o85j255L37R10J41j58R5J27N57r93r29j26P31R41j75r5J19K19o55q47
2986i53k50J180P72k74j16M75j71o48r23k42J056O14k61j01M94M01q98r63J30
3005f78L72P28k75J66J79K75p78p64m16Q93O25N1P4J14M18o52j604K97P22Q92
3025F39j93j81N10j42p62j217M18P33N92p6M0J14Jn63q50n31J425M17j63K7K52
3046D90J99l48j329N9O61P65j42J14K56k27q23q60J18J055M15n5Mj1M07q89j065
3067a206J7J120N39k28j57N29j01n05p85J44P02K05M5j78M60j27m01q51k31J118
$$ plain form
3087 109 512 388 215 659 658 -422 -1084 -1001 -206 398 399 210 352 392 24 -1056 -727 -132 646 321 311 662
3109 662 617 -37 -835 -906 -48 375 427 466 473 591 -173 -978 -1263 -234 471 244 176 330 687 -110 -1037 -660
3131 -660 104 413 267 69 388 662 -1 -898 -565 144 533 295 286 397 323 87 -693 -739 152 426 377 85
3153 85 426 276 139 -737 -856 -194 603 272 80 308 673 -122 -849 -740 -101 467 429 295 453 277 -374
3174 -374 -1030 -1085 218 428 311 247 690 615 -228 -987 -550 46 606 260 4 485 434 -258 -927 -726 320
3195 320 567 95 7 635 190 -161 -835 -949 -146 442 204 286 464 414 57 -797 -793 -150 547 121 195 679
3217 679 548 -454 -985 -634 77 552 306 125 518 491 -125 -961 -535 -94 422 150 131 127 404 -529 -858
3238 -858 -627 125 467 250 265 550 498 -461 -1147 -801 14 431 449 387 286 534 -441 -853 -605 53 429
$$ packed form
3087A09M03j24j73M44jj080o62Q3P95O04Jj89J42M0l68j080L29N95P78l25j0L51
3109F62m5o54p98p1Q58M23N2L9PJ18p64q05k85J029P05k27o8J54L57p97r27L77
3131f60P64L09j46j98L19K74o63q97L33P09L89k38rJ11p4k36p80m6Q91K74m9k92
3153H5L41j50j37q76j19O62P97l31j92K28L65p95p27J09O39N68l8j34J58j76o51
3174c74o56n5J303K10j17o4M43p5q43p59M37N96N60l46k56M81n1o92o69K01J046
3195C20K47m72q8O28m45l51o74j14Q03N88k38Q2J78n0l57q54MO43O97m26P4M84
3217F79j31j002n31L51P11M75k46j81L93k7o16q36M26M41N16k72j9mK77r33l29
3238h58K31P52L42k17J5K85n2r59o86L46Q15M17J8o2j01K48r75m12K48O58L76
$$ plain form
3259 429 143 13 149 244 47 -985 -691 49 428 315 259 586 276 -138 -861 -756 261 398 238 242 300
3280 300 380 -136 -793 -601 174 140 285 -86 468 391 -290 -820 -521 108 571 335 -191 242 605 -174 -863
3301 -863 -650 -34 264 602 270 715 501 -134 -835 -655 284 455 65 -132 363 504 5 -720 -470 375
3321 375 621 419 197 238 289 -274 -1216 -705 53 217 220 327 409 395 12 -587 -729 -3 112 116 218 418 358
3344 358 -431 -662 -272 150 409 136 50 329 -2 -237 -791 -312 -22 209 31 -164 422 378 -182 -777 -898
3365 -898 399 264 63 237 513 323 73 -798 -518 227 707 272 -69 74 44 -30 -736 -516 18 451
3385 451 253 271 230 425 -43 -1051 -536 72 386 296 170 184 305 -322 -716 -490 267 422 -15 60 383
3406 383 322 -413 -741 -408 255 361 364 145 411 163 50 -518 -524 301 136 188 40 291 374 -377 -945 -531
$$ packed form
3259D29k86j30J36R5j97j032K94P40L79j13n6L27l10m14p23J05J017J37j60MN8
3280C00Q0n16o57J92P75l4J45l71N54p7o81n30K99O29M63k36n26M33L63p79o89
3301h63K13O16K98L38l32M45k14o35p01J80R39J71l90j97M95J41m99p25K50Q45
3321C75K46k02k22M1N1n63r42N11P58J64LJ07Q2j4l83n99j42P26J15MJ02K00o0
3344C58p89k31L90M22K59k73q6K79l31k35n54M79K90K31j78j95N86m4n60n95j21
3365h98J297j35k01J74K76j90k50q71K80P45M80m35l41J43l0p4p06K20N34M33
3385D51j98J8m1J95m68j008N15O08L14r0j26J4J21o27l94K26P57J55m37P5L23
3406C83o1p35l28L33O63J06Lk19K66k48j13n68oQ25j65N2j48K51Q3p51n68M14
$$ plain form
3428 -531 171 467 50 -380 413 509 -210 -852 -408 1 394 65 73 484 285 -353 -770 -262 273 82 303
3449 303 258 612 421 -258 -930 -305 281 872 10 16 386 111 -194 -820 -317 372 452 296 325 277 138 -426
3471 -426 -945 -588 81 361 185 86 188 -11 -396 -620 -449 422 336 70 155 274 368 -248 -1075 -223 88
3492 88 504 -199 153 528 454 -343 -781 -365 207 354 306 166 435 352 -147 -571 -188 270 467 192 157 262
3514 262 359 -400 -539 -302 395 373 252 421 521 459 -424 -792 -441 142 484 -192 98 489 289 -264 -603
3535 -603 -353 53 325 251 260 203 449 -342 -762 -479 301 573 83 421 508 355 -536 -524 -155 163 457 -5
3557 -5 59 -34 -54 -490 -803 -370 225 277 111 -82 -153 373 -476 -467 -114 -57 348 292 192 275 215 -207 -614 -327
3581 -327 382 862 -70 -248 559 169 -53 -999 -271 -234 497 -77 156 379 261 -157 -915 -247 326 414 97
$$ packed form
3428e31P02K96m17m30P93R6p19o42M44M09L93l29QM11j99o38m17N08N35j91K21
3449C03m5L54j91o79o72O25N86N91q62OL70k75l05o26N03O89Q0j56K9m8j39n64
3471d26n19L57O69K80j76r9J02j99l85k24J71Q71q6k66Q5J19R4o16q27Q52L11
3492H8M16p03L52L75p4p97m38M16N72J47m8j40K69q3m99m24L83M58J97k75l5J05
3514B62R7p59j39K37O97k2j21J69J00o2q83l68L51N83L42o76K90L91k00n53l39
3535f03K50M06K72p4Rn7K46p91m20K83P80K72m90L38Q7j53q91J2L69L18K94m62
3557eO4r3k0m36l13M33N95N2j66j93p1N26q49RL53N7M05n6j00Q3o0m22m07K87
3581c27P09M80r32j78Q07l90k22r46P28L7P31n74K33K23j18m18p58O68N73Q8l17
$$ plain form
3602 97 -69 396 -26 -276 -471 -461 -160 464 33 2 330 222 -345 -582 -400 311 102 -275 7 294 289 -223
3624 -223 -471 -547 423 -28 103 -47 332 162 -192 -516 -671 256 626 181 -139 282 32 -393 -554 -169
3644 -169 122 227 41 -28 370 360 -244 -510 -451 -54 381 30 -121 396 276 -179 -433 -519 166 382 113
3665 113 -136 314 141 -288 -404 -109 494 94 184 -112 465 481 -499 -436 -55 232 205 209 -74 219 -74 -200
3687 -200 -265 -274 -31 287 107 124 -76 174 -241 -311 -249 315 476 135 -31 694 70 -238 -819 -291 100 306
3709 306 114 -133 188 12 -315 -245 -453 137 311 -128 -135 -145 228 -213 -609 -500 154 321 -135 -254 385
3730 385 251 -478 -573 -244 258 253 181 -168 235 147 -131 -357 -162 449 133 233 167 252 141 -371 -510 -435 331
3753 331 403 215 -18 114 274 -535 -586 -406 541 289 156 373 299 187 -270 -386 -167 101 418 -158 -130
$$ packed form
3602I7j66M65m22k50j95J0L01O24m31l1L28j08n67k37J82P11k09l77K82K87nn12
3624b23k48p6R70m51J31j50L79j70l54l24j55R27L70m45l20M21k50m25j61L85
3644a69K91J05j86o9L98j0o04k66N9L97M35l51j51N17j20m55k54q6O85K16k69
3665A13k49M50j73m29j16K95O03m00R0k96N77J6r80O3L81K87k7Mk83K93k93j26
3687b00o5rK43L18j80J7k00K50m15p0O2N64J61l41j66P25o24l08n81N28L91K06
3709C06j92k47L21j76l27P0k08N90J74m39pj0L73m41l96J09O54J67m56j19O39
3730C85j34p29r5L29N02np2l49M03q8k78k26J95O11l16J00o6Q5j11n12j39P5P66
3753C31P2j88k33J32J60q09n1J80R47k52j33K17p4j12m57j16K19K68L17n76K8
$$ plain form
3774 -130 297 54 -152 -762 -159 103 146 72 106 -165 150 -303 -356 -47 564 418 115 -75 283 393 -504
3795 -504 -980 -264 -16 34 -270 -21 172 66 -386 -631 112 172 38 -106 -46 360 323 -239 -398 -259 -129
3816 -129 338 -119 -238 441 294 -201 -441 -88 227 650 -16 -127 261 273 -281 -655 -157 299 400 -107
3836 -107 -43 110 61 -254 -499 -12 222 363 -120 135 -7 -382 -343 -522 -230 357 486 66 -130 178 437
3857 437 -230 -475 -343 215 192 -145 32 376 187 -238 -692 137 498 352 293 91 74 25 -127 -486 -242
3878 -242 458 204 3 227 18 15 -74 -538 -17 232 345 10 58 -31 96 -84 -430 -319 361 161 0 -253
3900 -253 190 -63 -386 -580 -85 410 88 -283 98 163 196 -378 -398 65 496 350 -8 -61 590 170 -557
3921 -557 -494 -279 248 80 35 301 409 165 -397 -597 -394 366 302 306 262 411 148 -600 -259 -274 432 65
$$ packed form
3774a30M27k43k06o10O03K62M3p4L4k71L15m53n3L09O11j46l03j90L58J10q97
3795e04m76P16K48N0l04K49J93j06m52k45P43O0j34j44O0M06l7n62j59J39J30
3816a29M67m57j19O79j47m95k40L53L15M23o66j11L88J2n54l74M98M56J01n07
3836a07O4J53m9l15k45M87K34J41m83K55j42l75L9j79K92N87J29m20j96L08K59
3857D37o67k45J32N58k3l37J77L44j89m25m54Q29L61j46n9k02j7m9j52l59K44
3878b42P00k54k01K24k09lq9m64N21K49J13l35M8q9J27j80l46J11O80k00j61k53
3900b53M43k53l23j94M95M95l22l71L81O5L3n74k0M63M31j46l58n3O51m20p27
3921e57O3K15N27j68m5K66J08k44n62k00K03P60o4Mm4J49k63p48L41j5P06l67
$$ plain form
3943 65 30 -75 43 170 -339 -619 234 358 131 -117 -26 241 5 -279 -378 -179 521 202 -179 -349 285
3964 285 216 -157 -382 -240 128 110 -135 -139 188 173 -185 -353 -2 162 310 38 304 197 83 -298 -433 -242
3986 -242 192 -235 -3 -112 251 27 -122 -363 178 243 332 -365 -49 267 407 -128 -401 -211 109 246 -250
4007 -250 -239 310 -40 -223 -318 -212 428 53 -69 -84 156 101 -93 -471 217 476 331 -255 109 164 38 -84
4029 -84 -570 -167 747 133 -42 23 285 248 -312 -211 12 540 211 -172 -76 103 312 -292 -451 106 -110
4050 -110 102 -51 135 278 -169 -18 -486 36 122 215 77 -88 66 69 -207 -424 -123 158 -2 84 -7 318
4072 318 88 -430 -144 -124 81 114 -190 226 23 214 -168 -367 214 19 396 -53 116 123 33 -468 -365 -38
4094 -38 107 -190 -208 317 275 335 -439 -481 147 88 282 -171 -104 8 -64 150 -14 -94 258 221 45 -153 -20
$$ packed form
3943F5l5j05J18J27n09k80Q53J24k27k48R1K67k36k84r9J99P00l19l81j70O34
3964B85o9l73k25J42L68j8k45mL27j5l58j68L51J64J48k72K66j07j14l81j35J91
3986b42M34m27K32j09L63k24j49k41N41O5Q9o97L16L16J40n35k73J90L20J37m96
4007b50J1N49l50j83r5J06O40l75j22j5K40n5j94l78O88K59j45n86L64N5j26j22
4029h4m86M03R14o14j75O5K62l7n60J01K23N28l29l83R6J79K09o04j59N57k16
4050a10K12j53J86J43m47J51m68N22Q6R3j38j65J54Lk76k17L01K81j60Q6r1L25
4072C18k30n18K86K0K05L3l04M16k03J91l82j99N81j95L77m49J69Pr0n01J03L27
4094c8J45k97j8N25m2O0p74m2O28n9J94m53O7J12p2K14j64q0L52l7j76j98J33
$$ plain form
4117 -20 -185 -179 -132 -254 21 242 -278 95 150 -94 -342 -400 -101 123 127 -346 77 95 -108 -536 -313 -37 455
4140 455 185 -226 -57 82 284 -391 -183 -97 153 64 156 -176 206 -137 -250 -381 58 352 8 28 36 51
4162 51 143 -324 -554 100 154 414 -150 133 78 -121 -258 -400 -168 236 58 74 167 79 -21 -322 -179 -233 247
4185 247 80 -207 -174 60 122 187 -267 290 269 208 -194 -215 71 148 -179 -221 407 323 -114 91 262 290 13
4208 13 -247 -387 101 322 -5 -2 1 261 161 -259 -442 -52 276 174 26 130 287 96 -165 -323 74 204
4230 204 122 -128 -251 71 -137 -112 -242 -295 268 248 63 -284 142 -4 -677 39 -25 376 146 233 -99 -101 116
4253 116 -47 -236 62 54 350 -116 26 121 -115 -346 -216 -33 233 137 115 -77 308 -90 -161 -427 -121 256
4275 256 -77 -288 -14 242 -102 -112 -205 182 530 -167 163 -145 -90 9 -314 -221 -86 328 28 133 28 151
$$ packed form
4117b0j65OM7j22K75K21n20L73N5k44k48n8K99K24Mm73M23J8k03m28K23K76M92
4140D55k70m11J69J39K02o75K08Q6K50q9R2l32L82l43j13j31M39K94l44K0QJ5
4162E1R2m67k30O54N4K60n64K83n5j99j37j42K32M04j78J6R3q8j00l01J43n4M80
4185B47j67k87L3K34O2O5m54N57k1o1m02k1K86P7l27m2O28q4m37K05J71K8k77
4208A3k60j40M88K21l27LLK60j00m20j83L90L28j02j48J04J57j91k61j58L97J30
4230B04q2k50j23L22k08K5j30n3N63k0j85l47M26j46o73P16o4M01k30Q7l32kK17
4253A16j63j89K98qK96m66J42R5k36k31J30J83K66r6k2j92L85l98p1k66L06L77
4275B56l33k11K74K56l44j0r3L87L48o97L30l08N5R9l23R3J35M14l00J05j05J23
$$ plain form
4297 151 19 -357 -521 126 304 372 -190 97 -55 39 -578 -475 -48 489 221 -61 -19 193 254 -342 -348 127
4319 127 221 156 235 262 3 310 -363 -354 195 386 -78 41 72 426 -57 -541 -174 69 373 179 306 -51
4341 -51 2 -166 -19 -510 -83 277 -69 130 -109 -144 -12 -340 -239 -172 233 -43 28 63 180 -82 -33 -115 82
4364 82 303 67 27 64 38 15 -211 -301 57 316 110 -61 -294 250 110 -67 -176 399 110 9 -229 0
4386 0 168 -169 -339 -122 141 469 137 -36 255 26 178 -23 -477 17 81 233 88 -54 -67 -50 -156 -329
4408 -329 -77 177 -200 -94 44 -214 171 -14 -44 -81 555 68 -131 286 -11 65 -1 -184 -92 319 33 26
4430 26 -258 346 69 158 -399 -59 320 334 -38 -47 197 75 -334 332 1 249 79 -175 169 335 -130 -56
4452 -56 77 -20 291 0 -200 15 -30 -41 -84 19 163 301 308 -141 203 -57 26 -126 -59 92 -296 158 -317
$$ packed form
4297A51j32l76j64O47J78O8n62K87j52R4o17J03M27N37k68k82M2K12O1n96oM75
4319A27R4o5P9K7k59L07o73RN49J91m64J19L1L54m83m84L67K43L04j94J27l57
4341e1N3j68J47m91M27L60l46J99k39l5J32l28J01O7M05k76P1L5J17k62M9q2J97
4364H2K21k36m0L7k6k3k26r0L58K59k06j71k33N44j40j77j09N75k89j01k38K29
4386@J68l37j70K17K63L28l32j73K91k29J52k01m54M94O4J52j45j42j3J7j06j73
4408c29K52K54l77J06J38k58L85j85l0l7O36m87j99M17k97P6o6j83R2M11k86p
4430B6k84O04k77Q9n57L40L79J4l72rK44j22m09O66l31K48j70k54L44J66m65P4
4452e6J33r7L11k91k00K15m5j1m3J03J44J38Pm49L44k60Q3j52O7J51l88M54m75
$$ plain form
4475 -317 -388 241 -182 -120 -301 141 123 103 -207 -74 234 50 -187 -365 -62 215 -42 -214 54 45 -114 -54
4497 -54 -278 134 219 224 -259 -9 -235 129 -399 -103 126 57 4 -5 10 48 -220 -166 -252 -15 119 21 83 89 222
4522 222 -83 -147 -112 -61 169 -3 9 258 -59 -226 4 -127 135 94 381 87 -16 135 -197 -79 -70 -77 -252
4545 -252 -80 -226 1 84 -84 -255 -374 -80 291 173 -97 182 202 134 -28 -384 80 64 -276 -116 37
4566 37 286 -209 -201 -24 -21 183 -17 33 38 131 37 -152 -312 210 123 129 -16 -119 -205 -139 -224 -402 32 301 -180
4591 -180 -16 -6 191 -103 -104 -96 -123 143 275 150 154 7 258 -49 32 151 388 -69 -397 92 215 21 -422
4614 -422 -28 -92 141 -13 -40 110 85 94 -247 -221 150 205 317 -404 -28 -143 -51 -101 81 -84 -149 73 125 -3
4638 -3 281 21 -219 -116 63 324 107 -10 185 218 56 -357 -427 62 233 288 10 111 -56 -117 -251 -302
$$ packed form
4475c17p1O29m23O2j81M42j8k0l10J33L08j84k37j78L03K77k57j72K68rj59O0
4497e4k24M12Q5Nm83K50k26L64n28K96K29o9n3rJ5L8k68N4q6K37J34r8O2OJ33
4522B22l05o4L5N1K30j72J2K49l17j67K30j31K62m1K87k94j03J51l32J18Rpj75
4545b52J72j46K27Q3j68j71j19K94L71j18k70K79K0o8j62l56M64j6l40J60J53
4566C7K49m95QJ77LK04k00N0NR3r4j89j60N22q7Oj45j03q6O6q5j78M34K69m81
4591a80J64J0J97k94jQk7K66J32j25Mj47K51l07Q1J19K37m57l28M89J23j94m43
4614d22L94o4K33j54k7J50k5Rl41K6L71N5J12p21L76j15R2n0J82j65o5K22N2j28
4638cK84k60k40J03J79K61k17j17J95L3j62m13p0M89J71N5k78J01j67o1j34n1
$$ plain form
4660 -302 347 184 125 -308 44 59 -21 -165 63 177 366 249 -59 24 242 71 -109 -111 23 161 34 -181
4682 -181 -95 75 -118 -494 -285 488 185 72 11 -42 135 45 -286 -210 28 57 -61 172 236 350 139 -284
4704 -284 -224 205 280 -20 -171 116 -5 -62 -225 -76 409 1 -51 112 101 -86 -118 -86 228 -107 214 -54
4726 -54 -256 154 80 276 -288 104 174 -19 190 -256 -112 43 79 -77 -129 95 0 -112 313 11 69 147 -9
4749 -9 -557 207 83 -72 240 -81 291 -228 -301 -44 182 665 -229 -226 0 105 -95 -35 -230 215 194 -16
4771 -16 -37 93 -248 -79 17 -65 -3 32 84 -17 41 189 136 -130 -191 63 97 -82 77 22 -61 199 -15 -89 82
4796 82 -37 215 -143 16 249 145 -371 -47 -16 80 12 -165 -72 123 -115 -45 -8 12 -15 86 -180 5 -26
4819 -26 228 -151 -278 -70 -44 44 -149 -44 6 -18 -105 -160 244 251 -133 -16 -7 -97 -89 -14 179 284 169 -150 -16
$$ packed form
4660c02O49j63n9m33L52J5q0j44K28J14J89j17l08Q3K18j71j80kJ34J38j27k15
4682a81Q6J70j93l76K09P73l03j13o1n3J77r0l31P6K38K9j18K33O4J14k11m23
4704b84O0M29P5l00j51K87j21n7j63J49M85m08n2J63j1j87l2L2L14l35L21k68
4726e4k02M10p4J96n64L92P0j93K09m46J44J55L6j56n2K24r5j12M25l02N8P8j56
4749in48P64j24j55L12l21L72n19p3K57K26M83q94LK26J05k00O0j95M45k1k10
4771a6k1J30l41J69R6q2O2L5N2j01N8J48n3k66o1K54L4j79J59n5q3K60k14p4J71
4796H2j19K52l58J59K33j04n16L24L1R6o8j77R3J95k38P0L7K0k7J01k66J85l1
4819b6K54l79j27K08K6Q8j93J05N0k4q7n5M04Pl84J17Rr0QP5J93J05j15l19J34
$$ plain form
4844 -16 -227 132 335 -131 74 33 150 -58 -153 -139 78 220 69 78 62 220 181 -115 55 143 -125 13 -107
4867 -107 228 230 36 135 153 96 167 -92 -408 187 12 -7 -72 202 396 -54 -189 -72 75 18 218 -61 -14
4890 -14 331 -154 16 119 131 304 -109 -61 141 300 -82 52 6 73 202 197 -101 -87 126 2 -173 -28 374
4913 374 357 -82 -42 126 16 130 -141 -90 -49 118 140 -66 191 319 -152 -301 -150 314 84 138 131 -32 -245
4936 -245 90 -273 -69 255 190 -33 -121 -16 147 77 -56 -264 72 159 -276 -154 -55 295 -120 -220 183 52
4958 52 49 -335 147 270 313 -253 -52 287 -55 183 -230 4 21 310 171 -116 -237 158 244 45 66 79 -83
4981 -83 -179 -168 -178 265 -25 181 -118 48 48 -59 -232 -375 -107 58 -75 90 -73 133 18 -309 -83 -209
5003 -209 53 7 89 32 -9 -289 -95 -75 169 -35 223 -73 -148 10 -127 -252 -272 224 227 70 13 17 -50 -218
$$ packed form
4844a6k11L59K03m66K05m1J17k08r5J4K17J42j51Rj6J58l9k96J70Q8k68J38j20
4867a07L35Kj94R9J8n7P1k59l16N95j75j9o5K74J94m50j35J17J47n7K00k79M7
4890a4L45m85J70J03J2J73m13M8K02J59l82J34m6O7J29nk98J4K13j24j75J45M02
4913C74j7m39M0J68j10J14k71N1M1J67K2k06K57J28m71j49J51M64k30N4pj63k13
4936b45L35l63K04L24o5k23q8J05J63p0j33k08L36Q7m35J22R9L50m15j00M03j31
4958E2ll84M82J23M3n66K01L39l42K38m13K34J7K89j39k87j21L95Q6j99K1J3j62
4981h3r6J1j0M43k90K06k99J66%j07j73j43K68J65j33J65j63K06j15l27K26j26
5003b09K62m6Q2n7m1k80J94K0K44k04K58k96p5J58j37j25k0M96Lj57n7Mo7j68
$$ plain form
5027 -218 -112 119 116 5 42 -33 96 -208 -255 -307 -193 121 111 -148 -62 141 -82 66 -139 -94 62 249 159
5050 159 -136 28 -145 -170 121 218 86 176 -65 -312 172 78 -231 22 -258 -43 -24 -347 -6 -41 124 121 -485
$$ packed form
5027b18J06K31lj11L7p5J29l04m7n2J14L14j0k59Q6K03k23J48k05M5J56J87r0
5050A59k95J64j73k5K91R7j32R0k41k47M84r4l09K53k80K15J9l23L41l5J65lo06
$$ [...]
8191C9
##END NTUPLES=NMR FID
##END=
