##TITLE=1H_SR149_EtAc H2O
 
 8 sc, 
 22.11.2022
##JCAMPDX= 6.0         $$ Bruker NMR JCAMP-DX V2.0
##DATA TYPE= NMR FID
##DATA CLASS= NTUPLES
##ORIGIN= UXNMR, Bruker Analytische Messtechnik GmbH
##OWNER= root
$$ XWIN-NMR		Version 3.5
$$ Tue Nov 22 16:18:27 2022 Russian Standard Time (UT+4h)  she@DPX200
##.OBSERVE FREQUENCY= 200.1313499994
##.OBSERVE NUCLEUS= ^1H
##.DELAY= (6, 6)
##.ACQUISITION MODE= SIMULTANEOUS
##.ACQUISITION SCHEME= undefined
##.AVERAGES= 8
##.DIGITISER RES= 18
##SPECTROMETER/DATA SYSTEM= spect
##.PULSE SEQUENCE= zg30
##.SOLVENT NAME= CDCl3
##.SHIFT REFERENCE= (INTERNAL, CDCl3, 0, 15.7039)
##AUDIT TRAIL= $$ (NUMBER, WHEN, WHO, WHERE, WHAT)
$$ ##TITLE= Audit trail, XWIN-NMR		Version 3.5
$$ ##JCAMPDX= 5.01
$$ ##ORIGIN= Bruker BioSpin GmbH
$$ ##OWNER= she
$$ F:/spectra/data/she/nmr/H-F/1/audita.txt
$$ ##AUDIT TRAIL=  $$ (NUMBER, WHEN, WHO, WHERE, WHAT)
(   1,<2022-11-22 16:16:29.20 +0400>,<she>,<DPX200>,
      <created by zg, POWCHK disabled, PULCHK disabled
       configuration hash MD5:
       00 E9 B6 7A A2 85 ED C7 34 08 36 98 17 FE 4E 26
       data hash MD5: 16K
       FF 6A 2B D7 E3 27 88 06 B3 39 61 29 7C 06 30 F6>)
$$ ##END=
$$ 
$$ hash MD5
$$ 92 82 A0 40 2C 94 38 BD D4 DD 33 A2 61 27 EC E5
##$RELAX= 
##$RELAX= 
##$RELAX= 
##$RELAX= 
##$RELAX= 
##$RELAX= 
$$ Bruker specific parameters
$$ --------------------------
##$DU= <F:/spectra>
##$EXPNO= 1
##$NAME= <H-F>
##$PROCNO= 1
##$TYPE= <nmr>
##$USER= <she>
##$AMP= (0..31)
100 100 100 100 100 100 100 100 100 100 100 100 100 100 100 100 100 100 
100 100 100 100 100 100 100 100 100 100 100 100 100 100 
##$AQSEQ= 0
##$AQ_mod= 1
##$AUNM= <au_zg>
##$AUTOPOS= <>
##$BF1= 200.13
##$BF2= 200.13
##$BF3= 200.13
##$BF4= 200.13
##$BF5= 200.13
##$BF6= 200.13
##$BF7= 200.13
##$BF8= 200.13
##$BYTORDA= 1
##$CFDGTYP= 0
##$CFRGTYP= 5
##$CHEMSTR= <none>
##$CNST= (0..31)
1 1 145 1 1 1 1 1 1 1 1 1 1 1 1 1 1 1 1 1 1 1 1 1 1 1 1 1 1 1 1 1 
##$CPDPRG= <>
##$CPDPRG1= <>
##$CPDPRG2= <>
##$CPDPRG3= <>
##$CPDPRG4= <mlev>
##$CPDPRG5= <mlev>
##$CPDPRG6= <mlev>
##$CPDPRG7= <mlev>
##$CPDPRG8= <mlev>
##$CPDPRGB= <>
##$CPDPRGT= <>
##$D= (0..31)
0 1.2 0 0 0 0 0 0 0 0.06 0 0.03 0 0 0 0 0.0002 0 0 0 0 0 0 0 0 0 0 0 0 
0 0 0 
##$DATE= 1669119388
##$DBL= (0..7)
120 120 120 120 120 120 120 120 
##$DBP= (0..7)
150 150 150 150 150 150 150 150 
##$DBP07= 0
##$DBPNAM0= <>
##$DBPNAM1= <>
##$DBPNAM2= <>
##$DBPNAM3= <>
##$DBPNAM4= <>
##$DBPNAM5= <>
##$DBPNAM6= <>
##$DBPNAM7= <>
##$DBPOAL= (0..7)
0.5 0.5 0.5 0.5 0.5 0.5 0.5 0.5 
##$DBPOFFS= (0..7)
0 0 0 0 0 0 0 0 
##$DE= 6
##$DECBNUC= <off>
##$DECIM= 32
##$DECNUC= <off>
##$DECSTAT= 4
##$DIGMOD= 1
##$DIGTYP= 9
##$DL= (0..7)
0 120 120 120 120 120 120 120 
##$DP= (0..7)
150 150 150 150 150 150 150 150 
##$DP07= 0
##$DPNAME0= <>
##$DPNAME1= <>
##$DPNAME2= <>
##$DPNAME3= <>
##$DPNAME4= <>
##$DPNAME5= <>
##$DPNAME6= <>
##$DPNAME7= <>
##$DPOAL= (0..7)
0.5 0.5 0.5 0.5 0.5 0.5 0.5 0.5 
##$DPOFFS= (0..7)
0 0 0 0 0 0 0 0 
##$DQDMODE= 0
##$DR= 18
##$DS= 0
##$DSLIST= <SSSSSSSSSSSSSSS>
$$ [...]
##$SUBNAM2= <"">
##$SUBNAM3= <"">
##$SUBNAM4= <"">
##$SUBNAM5= <"">
##$SUBNAM6= <"">
##$SUBNAM7= <"">
##$SUBNAM8= <"">
##$SUBNAM9= <"">
##$SW= 18.0517283424941
##$SWIBOX= (0..15)
0 0 2 0 0 0 0 0 0 0 0 0 0 0 0 0 
##$SW_h= 3612.71676300578
##$TD= 16384
##$TD0= 1
##$TE= 0
##$TE2= 300
##$TE3= 300
##$TEG= 300
##$TL= (0..7)
0 120 120 120 120 120 120 120 
##$TP= (0..7)
150 150 150 150 150 150 150 150 
##$TP07= 0
##$TPNAME0= <>
##$TPNAME1= <>
##$TPNAME2= <>
##$TPNAME3= <>
##$TPNAME4= <>
##$TPNAME5= <>
##$TPNAME6= <>
##$TPNAME7= <>
##$TPOAL= (0..7)
0.5 0.5 0.5 0.5 0.5 0.5 0.5 0.5 
##$TPOFFS= (0..7)
0 0 0 0 0 0 0 0 
##$TUNHIN= 0
##$TUNHOUT= 0
##$TUNXOUT= 0
##$USERA1= <user>
##$USERA2= <user>
##$USERA3= <user>
##$USERA4= <user>
##$USERA5= <user>
##$V9= 5
##$VALIST= <valist>
##$VCLIST= <CCCCCCCCCCCCCCC>
##$VD= 0
##$VDLIST= <DDDDDDDDDDDDDDD>
##$VPLIST= <PPPPPPPPPPPPPPP>
##$VTLIST= <TTTTTTTTTTTTTTT>
##$WBST= 1024
##$WBSW= 4
##$XGAIN= (0..3)
0 0 0 0 
##$XL= 0
##$YL= 0
##$YMAX_a= 751587
##$YMIN_a= -839276
##$ZGOPTNS= <>
##$ZL1= 120
##$ZL2= 120
##$ZL3= 120
##$ZL4= 120
##$ABSF1= 10
##$ABSF2= 0
##$ABSG= 5
##$ABSL= 3
##$ALPHA= 0
##$AQORDER= 0
##$ASSFAC= 0
##$ASSFACI= 0
##$ASSFACX= 0
##$ASSWID= 0
##$AUNMP= <proc_1d>
##$AZFE= 0.1
##$AZFW= 0.1
##$BCFW= 1
##$BC_mod= 2
##$BYTORDP= 1
##$COROFFS= 0
##$CY= 11.3945322036743
##$DATMOD= 1
##$DC= 2
##$DFILT= <>
##$DTYPP= 0
##$F1P= 2.36226072786647
##$F2P= -0.459571619588291
##$FCOR= 0.5
##$FTSIZE= 0
##$FT_mod= 4
##$GAMMA= 1
##$GB= 0.15
##$INTBC= 1
##$INTSCL= 1
##$ISEN= 128
##$LB= 0.24
##$LEV0= 0
##$LPBIN= 0
##$MAXI= 10000
##$MC2= 0
##$MEAN= 0
##$ME_mod= 0
##$MI= 1.114404
##$NCOEF= 0
##$NC_proc= 0
##$NLEV= 6
##$NOISF1= 3.799351
##$NOISF2= 2.8
##$NSP= 1
##$NTH_PI= 0
##$NZP= 0
##$OFFSET= 15.70392
##$PC= 1
##$PHC0= -17942.77
##$PHC1= 11.20072
##$PH_mod= 1
##$PKNL= yes
##$PPARMOD= 0
##$PSCAL= 0
##$PSIGN= 0
##$REVERSE= no
##$SF= 200.130013532006
##$SI= 16384
##$SIGF1= 3
##$SIGF2= 2
##$SINO= 400
##$SIOLD= 16384
##$SREGLST= <1H.CDCl3>
##$SSB= 0
##$STSI= 0
##$STSR= 0
##$SW_p= 3612.71676300578
##$SYMM= 0
##$S_DEV= 0
##$TDeff= 0
##$TDoff= 0
##$TI= <>
##$TILT= no
##$TM1= 0
##$TM2= 0
##$TOPLEV= 0
##$USERP1= <user>
##$USERP2= <user>
##$USERP3= <user>
##$USERP4= <user>
##$USERP5= <user>
##$WDW= 1
##$XDIM= 8192
##$YMAX_p= 0
##$YMIN_p= 0
$$ End of Bruker specific parameters
$$ ---------------------------------
##NTUPLES= NMR FID
##VAR_NAME=  TIME,          FID/REAL,        FID/IMAG
##SYMBOL=    X,             R,               I
##VAR_TYPE=  INDEPENDENT,   DEPENDENT,       DEPENDENT
##VAR_FORM=  AFFN,          ASDF,            ASDF
##VAR_DIM=   8192,          8192,            8192
##UNITS=     SECONDS,       ARBITRARY UNITS, ARBITRARY UNITS
##FACTOR=    0.0002768,     1,               1
##FIRST=     0,             0,               0
##LAST=      2.2672688,     0,               0
##MIN=       0,             -839276,         0
##MAX=       2.2672688,     751587,          0
$$ Real data points
##PAGE= N=1
##DATA TABLE= (X++(R..R)), XYDATA
0@%%%%%%qJ6j6J6j6J6k4M0m8N6p2Q8j04J21j45J73k02K37k78L23l71M26m88N57
$$ 0 0 0 0 0 0 0 -8 8 -8 8 -8 8 -16 24 -24 32 -40 48 -56 65 -80 93 -109 128 -150 173 -198 228 -260 297
30B97o36P25q22R27j040J166j305J457j626J809k005K219k456K715k997L304l639
$$ 297 -339 386 -436 491 -549 617 -688 769 -857 952 -1053 1166 -1290 1425 -1572 1732 -1907
47a907M007m412M859n351N891o493P171p935Q804r802J0959j2318J3941j5921
$$ -1907 2100 -2312 2547 -2804 3087 -3406 3765 -4170 4634 -5168 5791 -6527 7414 -8507
61h507J8390k1554K5758l1610M0266n4237Q0028j41167N01116K92654j464631
$$ -8507 9883 -11671 14087 -17523 22743 -31494 48534 -92633 408483 701137 -763494
72g63494R92076k28396k52821Q79216r55524k7029P08776k92391m1364k29889
$$ -763494 228582 186 -252635 626581 -328943 -355972 352804 60413 19049 -210840
82b10840K25159N6809l6604K48105q48209N64327P11109j246494N63257J47179
$$ -210840 14319 71128 34524 282629 -565580 -1253 709856 -536638 26619 173798
92A73798o20634J138720q32638n51419J340010o75403j78650M36818n76077M74534
$$ 173798 -446836 691884 -140754 -692173 647837 -27566 -206216 230602 -345475 129059
102A29059J60546m67141J6165J48625L10574l93916l5554K35941l79073P02935
$$ 129059 289605 -177536 -161371 -12746 297828 -96088 -131642 104299 -274774 428161
112D28161l32618q17101J214087l39084n33820P67845p61110L23532O39726j039912
$$ 428161 95543 -721558 492529 153445 -380375 387470 -373640 -50108 589618 -450294
122d50294L46806L65322m08384K91952j76450j51732K23305J52113j40098m25861
$$ -450294 -103488 261834 -146550 145402 -31048 -182780 40525 192638 52540 -373321
132c73321N23425O1703m58912M81625m57570M3045P89044r71756J16961O84602
$$ -373321 150104 211807 -247105 234520 -223050 -180005 609039 -362717 -245756 438846
142D38846p20541L85843O8006n87126O23647k4933l90032K18269j8571K7391L4511
$$ 438846 -281695 104148 172154 -414972 208675 183742 -206290 11979 -6592 20799 55310
153E5310k3791j83468O2911M55398n14768j16558N88249m86641J77342K26593
$$ 55310 31519 -151949 -89038 366360 -148408 -264966 323283 -163358 13984 240577
163B40577o77645O15686J07687o74219N42230r2722k75743M69942k88384j81453
$$ 240577 -437068 178618 286305 -387914 154316 61594 -214149 255793 -32591 -214044
173b14044L33279j7716j69231k23J35781j24412J07297Q8263m46049M00632J90321
$$ -214044 119235 101519 -67712 -67935 67846 -56566 50731 138994 -307055 93577 283898
184B83898o23326M40326L5565m15919N47190k69147k83627N48438k82514j20357
$$ 283898 -339428 100898 136463 -279456 267734 -1413 -285040 263398 -19116 -139473
194a39473L05788k63383K6075K45538j95500j45679K55163L2805k77874K07324
$$ -139473 166315 -97068 -70993 174545 -20955 -166634 88529 121334 -156540 50784
204E0784J1527k34553L70794j95938k60412N17997k77388j82654M45879l56605
$$ 50784 62311 -172242 198552 2614 -257798 260199 -17189 -199843 246036 -110569
214a10569j2775L71446l63606J5454K56946k23519L2279J38777j91906L0167K27473
$$ -110569 -123344 248102 -115504 -100050 156896 -66623 -34344 104433 -87473 -57306 170167
225A70167k29328r3818L44016k18149j20643L43335k88484j0052L30647l75735
$$ 170167 -59161 -152979 191037 -27112 -147755 195580 -92904 -102956 227691 -148044
235a48044Q3803K69931l75646J63881J83027l57563J76548J71514k98428R6512
$$ -148044 -64241 205690 -169956 -6075 176952 -180611 -4063 167451 -130977 -34465
245c4465J62658k19097P0364J39505k42227J13905J69289l19094J45550J91056
$$ -34465 128193 -90904 -20540 118965 -123262 -9357 159932 -159162 -13612 177444
255A77444l50552J76840J59553l39104K01780J04819k91155K12014L9417k47773
$$ 177444 -173108 3732 163285 -175819 25961 130780 -160375 51639 91056 -156717
265a56717K33215R139k54354K37605L6181k68218K11423N6738k53662K02381L0779
$$ -156717 76498 85637 -168717 68888 105069 -163149 48274 105012 -148650 53731 84510
276H4510k33787K31539j6949k29480K73401m8993k36680K90844n1943k30765K72357
$$ 84510 -149277 82262 65313 -164167 109234 60241 -176439 114405 62462 -168303 104054
287A04054n1669j98533K49941p4905j62844K54982j11312j50003K79964j32087
$$ 104054 52385 -146148 103793 28888 -133956 121026 9714 -140289 139675 7588
297G588j58138K90471j25926j56079K67606j20008j23331K40998j41269q7098
$$ 7588 -150550 139921 13995 -142084 125522 5514 -117817 123181 -18088 -105186
307a05186K43453j72108p7083K62270j85702q3095K67741j81431p7598K47139
$$ -105186 138267 -33841 -110924 151346 -34356 -117451 150290 -31141 -108739 138400
317A38400j78083m4889K17134j95548k882K08433k22833J2586K19094k28121L024
$$ 138400 -39683 -84572 132562 -62986 -65868 142565 -80268 -67682 151412 -76709 -73685
328g3685K17226k11881L926J93889k04487L0828J69959k20633O5669J63698k45518
$$ -73685 143541 -68340 -64414 129475 -75012 -44184 125775 -94858 -29189 134509 -111009
339a11009Q2477J70677k51952P7082J66295k33823P7652J38197k20623J04981
$$ -111009 -28532 142145 -109807 -32725 133570 -100253 -22601 115596 -105027 -46
349d6J09669k33656J38756J00864k51010J52586R7600k45089J48209Q2587k16949
$$ -46 109623 -124033 14723 115587 -135423 17163 114763 -130326 17883 100470 -116479
360a16479J40496N5481j88126J46721L1666j89718J66673L6906k17434J73280
$$ -116479 24017 79498 -108628 38093 69759 -119959 46714 83620 -133814 39466
370C9466N4303k24999J74060L4875k07068J96271j2212j84862K16878n3922j54533
$$ 39466 93769 -131230 42830 77705 -129363 66908 54696 -130166 86712 32790 -121743
381a21743K18472p6619j36543K03300n4484j36191J61127k0253j23986J47398
$$ -121743 96729 20110 -116433 86867 32383 -103808 57319 37066 -86920 60478
391F0478l4467j35173K02624o1111j71594K49481q8102j53396K61054j44895r9910
$$ 60478 26011 -109162 93462 32351 -139243 110238 22136 -131260 129794 -15101 -115011
402a15011K51167j67019m8720J82646j50554J1096J30101j44722q406J54402r3049
$$ -115011 136156 -30863 -79583 103063 -47491 -36395 93706 -51016 -59422 94980 1931
413A931r5171J65772n5693j05292J94299j33666p7766K61300k07087l7328K33211
$$ 1931 -93240 72532 16839 -88453 105846 -27820 -105586 155714 -51373 -88701 144510
424A44510k40448P2353J64545k66593J09746J25176j73450N7461L7727o8285N1092
$$ 144510 -95938 -23585 140960 -125633 -15887 109289 -64161 -6700 31027 -37258 13834
435A3834L9060j04315n260J71108j37981o7346K08815j88944L4861J94942l08140
$$ 13834 52894 -51421 -56681 114427 -23554 -90900 117915 -71029 -36168 158774 -149366
446a49366J30730J69117k79305J70466O049j80760K45466p4308j59044J53509
$$ -149366 -18636 150481 -128824 41642 47691 -133069 112397 38089 -120955 32554
456C2554J3862n7312j2536L4711l3425J9334J03381k10251O4388K04555k73354
$$ 32554 46416 -10896 -23432 11279 -22146 -2812 100569 -109682 -45294 159261 -114093
467a14093J26275P4520k67583L12629n2722k78288K98350p7603p9569J52411j85978
$$ -114093 12182 86702 -180881 131748 79026 -199262 99088 21485 -58084 94327 -91651
478i1651N9621J35777j11471n0799L0666J04998r0299j8850Q6198j70790J91863
$$ -91651 -32030 103747 -7724 -58523 -27857 77141 -13158 -32008 54190 -116600 75263
489G5263M0524l19938K77500q465j80841K70139k49918j8597L29364k79375j3370
$$ 75263 115787 -204151 73349 64884 -115957 154182 -95736 -114333 215031 -64344 -77714
500g7714J34673j01467J12825n9721q4982P0577N5411J9988j85170J05498J04893
$$ -77714 56959 -44508 68317 8596 -76386 -5809 49602 69590 -115580 -10082 94811
511I4811j81367J88225j36921j33772M00100k56594j18461K75559k34618J57307
$$ 94811 -86556 101669 -35252 -169024 231076 -25518 -143979 131580 -103038 54269
521E4269O6933l27100K45718O7446j53698M8607n8817Q5396J5615m2822j8820
$$ 54269 121202 -205898 39820 107266 -46432 2175 -56642 28754 44369 1547 -17273
532a7273r1049K38495p7063k10855K55298j48943L7904J99688m01823J93302K19583
$$ -17273 -108322 130173 53110 -157745 97553 -51390 -13486 186202 -215621 -22319 197264
543A97264l19469J57804m6677q6605K64035j86060q8086J33667N173K6961j24992
$$ 197264 -122205 35599 -11078 -97683 166352 -19708 -107794 25873 31046 58007 -66985
554f6985M3079M5275l3750J35758k47406L1444K98885k93886P1688P3387k25974
$$ -66985 -23906 21369 -12381 123377 -124029 -92585 206300 -87586 -15898 57489 -168485
565a68485L44457j19556k76101L24717q2888m4513Q9389j87572J31038P8508r4101
$$ -168485 175972 56416 -219685 105032 22144 -22369 67020 -120552 10486 88994 -5107
576e107l8661k7741J72378q5952p3965J06552j65647K11243L1498l53370K95498
$$ -5107 -43768 -71509 100869 14917 -59048 47504 -118143 93100 124598 -228772 66726
587F6726J3099j75252K23804k41943L7130K76666k74101J4273R1831o0597J05156
$$ 66726 79825 -95427 128377 -113566 -76436 200230 -73871 -59598 32233 -28364 76792
598G6792r3751m0513M7437M8826M7410k08520J01121J22228j71729J53004j28699
$$ 76792 -16959 -57472 -10035 38791 86201 -122319 -21198 101030 -70699 82305 -46394
609d6394q9454L47348k44852r3694K36091j83554J21416L4470k38787J92632M2891
$$ -46394 -135848 211500 -33352 -127046 109045 -74509 46907 81377 -157410 35222 78113
620G8113j04896J8834l6486P4707n597j1366l4377p4127K20416r4978j64150K23344
$$ 78113 -26783 -7949 -44435 30272 24675 13309 -21068 -95195 125221 30243 -133907 89437
632H9437j30551L2314J43878l02820J67839J44378k48232J32127k3591p5145J73124
$$ 89437 -41114 -8800 135078 -167742 97 144475 -103757 28370 4779 -70366 102758
643A02758j07022o5280P6103K8191k708q6283N9439m062j0280J03522j97546N8326
$$ 102758 -4264 -69544 6559 34750 32042 -54241 5198 1136 -9144 94378 -103168 -44842
655d4842J92754k32724P9999N8554j65583K15788p0481j65889K04110n5661m7973
$$ -44842 147912 -84812 -4813 53741 -111842 103946 33465 -132424 71686 16025 -31948
666c1948P5440r0221L1561O4134l2895o4909K2636R8706r9066Q907N8332j25022
$$ -31948 43492 -46729 -15168 48966 16071 -48838 -26202 72504 -26562 -17655 40677 -84345
678h4345J49383o019j96478K04288k9079j19193J66228j26423j7220J62263j35148
$$ -84345 65038 59019 -137459 66829 37750 -81443 84785 -41638 -58858 103405 -31743
689c1743j2594Q0976m8099J4509J3616l3737j6660P6840j0731j15175J15164N358
$$ -31743 -44337 36639 -11460 3049 16665 -17072 -33732 43108 32377 -82798 32366 37724
701C7724j04597J31848q4077n2629J78245j38821k7675J39002j24338L6233P1476
$$ 37724 -66873 64975 -19102 -71731 106514 -32307 -59982 79020 -45318 -9085 62391
712F2391j22662N0681O3977p5831j735M6949k8725j2110N7747o4872j7374J17115
$$ 62391 -60271 -9590 54387 -21444 -23179 23770 -4955 -17065 40682 -24190 -41564 75551
724G5551r9979k5341J23558j15413K1502R4968j41419O0562P3769j26135O4218
$$ 75551 -24428 -49769 73789 -41624 -20122 74846 -66573 -6011 67758 -58377 5841
735E841L5188r2774O8909K1722q8517M9604M7509q2496K3547N6336q4465L8342
$$ 5841 41029 -51745 17164 38886 -49631 -27 47482 -35014 -11467 44869 -39596 -1254
747a254N3616j10837O3951N1178j20559P9474K9903j10824R2194J0507r8474Q6388
$$ -1254 52362 -58475 5476 56654 -63905 15569 45472 -65352 26842 37349 -61125 25263
759B5263M314p9020P3924k477p0129P5520k075p9230Q0125L595q5253Q2678q00
$$ 25263 29577 -49443 24481 22004 -48125 27395 25320 -53910 26215 29810 -55443 27235 26435
772B6435q1293Q7575j3304p3002R1909k5826o5020R5145l3646o1827R6511l5268
$$ 26435 -54858 32717 19413 -53589 38320 12494 -52526 42619 8973 -52854 43657 8389
784H389o0045R4729l7294n4296R2953m4620m4656R2911n5274l5715R4646o1639
$$ 8389 -51656 43073 5779 -48517 44436 -184 -44840 48071 -7203 -42918 51728 -9911
796i911l2810R2975n8988l0966Q6261n6743k5911Q3403o1404k1109Q6441o9890
$$ -9911 -42721 50254 -8734 -39700 46561 -10182 -36093 47310 -14094 -35203 51238 -18652
808a8652j5884Q9735p8698q847Q8416q2513p57P8778p9929R366O5415p7708J7358
$$ -18652 -34536 55199 -23499 -32346 56070 -26443 -27200 51578 -28351 -18985 46430 -31278 -13920
821a3920N9571p7667J6874O1751p6971J3344O4238p8266J5575O3055q2870K5554
$$ -13920 45651 -32016 -15142 46609 -30362 -17018 47220 -31046 -15471 47584 -35286 -9732
833i732N6657q8668L9469M8328r2415M8796M1430q9697N0152L5139q1969M8781
$$ -9732 46925 -41743 -2274 46054 -46361 2435 43865 -45832 4320 39459 -42510 6271
845F271K8617p6423N1121K3807p7809N6877K2050q2080O1860K0115q2690O4493
$$ 6271 34888 -41535 9586 33393 -44416 12461 34511 -47569 14291 34406 -48284 16209
857A6209J5015p7950O5971O687p1675O9600j653o9669P4739n616p0477P7062q361
$$ 16209 31224 -46726 19245 25932 -45743 23857 22204 -47465 27274 21658 -48819 28243 19882
870A9882o6914P7025j5306n8811P6629k3299m9713P4061k8843m2707P2339k9570
$$ 19882 -47032 29993 14687 -44124 32505 9206 -40507 33554 4711 -37996 34343 4773
882D773m4421P2052k3430m8795P0494k3986m6199P7892l8420m3235Q9794n1982
$$ 4773 -39648 32404 8974 -39821 30673 6687 -39512 38380 -40 -43275 46519 -5463
894e463l4646Q8328o3708j5576P9998o9492n526O6466n5723k831M7883m4986k380
$$ -5463 -40109 48219 -15489 -31065 48933 -20559 -26085 40381 -15342 -18173 29710 -15276 -17656
907a7656N3452m8261k0314P5234m9226k8558Q1480o7879n347Q6160r6335J5706
$$ -17656 35796 -12465 -32779 42455 -6771 -35329 46151 -21728 -27075 59085 -37250 -21544
919b1544P5605r2953L8054L6797q0951N5749K2035o5457K7810K7336l1097m33
$$ -21544 54061 -38892 -838 35959 -44992 10757 32792 -32665 -4855 22481 -8616 -9049
931i049K8393l6821L949O1122p8092L849Q2815r2863L3136M9284j08830Q5070
$$ -9049 19344 -17477 -13528 47594 -30498 -26649 56166 -36697 -3561 45723 -63107 21963
943B1963K3603j06247Q0929l826m6814O3620m0883k2362N3587n556l7970M274
$$ 21963 45566 -60681 20248 16422 -30392 33228 -7655 -30017 23570 18014 -19956 -15682
955a5682M3253l7511L839L8242q3874O5197M4488j26809Q6324J2263q3554J12358
$$ -15682 27571 -9940 -6101 32141 -51733 13464 57952 -68857 17467 29730 -53824 58534
967E8534o7862n2262J25635o6592k5242M7079l8325L1211N388l0900p573K8662
$$ 58534 -9328 -61590 64045 -2547 -27789 19290 -19035 12176 17564 -13336 -20909 7753
979G753L4502p9990K6772M6387p7345Q4803l3831r1204J53317o0390o4811J03258
$$ 7753 42255 -37735 -10963 35424 -41921 42882 9051 -82153 71164 10774 -54037 49221
991D9221q9906M1504O3373j24145M9275M3969l6472Q731k8520K4097P839M789
$$ 49221 -40685 819 64192 -59953 -10678 33291 -3181 5550 -22970 1127 8966 13755
1003A3755o842o7450R8737k03r8262R7798n9928m161J18971j57841K8233J10404
$$ 13755 6913 -60537 38200 37997 -60265 37533 -22395 -26556 92415 -65426 -37193 73211
1015G3211j11248N6118j3282o3124J12102l6989n1132K5170J1292L3634n4989
$$ 73211 -38037 18081 4799 -58325 53777 16788 -34344 -9174 2118 35752 -19237
1026a9237R098J1116k3559R1735j00134l4237J44618j05091K0504M3998j27467
$$ -19237 -10139 977 -22582 69153 -30981 -65218 79400 -25691 -5187 38811 -88656
1037h8656J41713J222j36543J04828k0018n787M4704q9457L6089L9274j0375k0051
$$ -88656 53057 54279 -82264 22564 2546 -3241 41463 -47994 -11905 27369 16994 -3057
1049c057m9782Q7769j5209m3856N6000r4930P9891O7781j72169R2637K9400p7072
$$ -3057 -52839 34930 19721 -24135 31865 -63065 16826 84607 -87562 5075 34475 -42597
1061d2597J12024j05133k5970J42209q7628j2666K0483k4301O4648l6724k4332
$$ -42597 69427 -35706 -61676 80533 -7095 -19761 722 -23579 41069 4345 -19987
1072a9987K119J7845O3250j05566J1711P6357q1610Q3215m6897r2671J77455p1482
$$ -19987 -17868 -23 63227 -42339 -30628 45729 -35881 47334 437 -92234 85221 13739
1084A3739p0254R8265q6397O4085L8280j26601O6201K8967j8939K66m7546N1970
$$ 13739 -56515 41750 -44647 19438 57718 -68883 -2682 26285 7346 7612 -39934 12036
1096A2036M86k447R2p9188J11857K860j11086R7819n3192L877J02906j55739M0097
$$ 12036 12522 10075 10167 -69021 42836 45696 -65390 32429 -20763 -16886 86020 -69719 -29622
1109b9622R7131r9439M9401k3357l8257R4838m2153l3337J0803J7273L5246o3075
$$ -29622 67509 -31930 17471 -5886 -44143 50695 8542 -24795 -13992 3281 38527 -24548
1121b4548J6965R218k1210Q3303r7541k0751J27270r7537K0140L4527j00593J17689
$$ -24548 -7583 1635 -19575 63728 -33813 -54564 72706 -24831 -4691 29836 -70757 46932
1133D6932q353j04967Q6006j6246n749K8985n9395K4797K4265K249k6665l2627
$$ 46932 38579 -66388 19618 3372 -2377 26608 -32787 -7990 16275 18524 -8141 -40768
1145d0768P6681l0362k3934M6979q0294P0216L9917j29073Q3190J3025o0886Q2485
$$ -40768 35913 5551 -18383 28596 -51698 18518 58435 -70638 12552 25577 -35309 47176
1157D7176o9883j6276R0894n7285r881J6738r353K5437j6448m958j5148K3671
$$ 47176 -22707 -38983 51911 -5374 -15255 1483 -7870 17567 1119 -3839 -18987 4684
1169D684L6486p9551L1150L8273o3944O6523l3373n5496J11031n4319l8395P0394
$$ 4684 41170 -38381 -7231 31042 -32902 33621 248 -55248 55783 1464 -36931 33463
1181C3463n6450K3778L3792o6770K4948K7604j7924r570J170J2943j4229K3536
$$ 33463 -22987 791 34583 -32187 -7239 20365 2441 -7129 -5959 6984 -7245 16291
1193A6291j4000m1405P4427k4422m9336P1182m7371r93O2506q1889K1707N1574
$$ 16291 2291 -39114 35313 10891 -38445 32737 -14634 -15627 46879 -35010 -13303 38271
1205C8271o0916K4639R818l3411L2518L282k8307L541K6671j2676k0157L2538
$$ 38271 -22645 1994 11812 -21599 10919 14201 -14106 -10565 16106 3430 -16727 15811
1217A5811k4172m506M7655n8260O958N4552o2860K2390K7673n8438M4987J0196
$$ 15811 -8361 -12867 34788 -23472 -16514 38038 -24822 -2432 25241 -33197 11790 21986
1229B1986n2629L8277N852l0068K3787k46k3739K1720J2178l6557J5670K6135
$$ 21986 -30643 7634 13486 -16582 7205 6959 -16780 4940 17118 -19439 -3769 22366
1241B2366m2037K0446J9348m8701L8671J0459n2790M5330J087m1487M4780j0812
$$ 22366 -19671 775 20123 -28578 10093 20552 -32238 13092 14179 -27308 17472 6660
1253F660l1730M2553j0366k8592L3490m759k5518L0054m631k8631L5607m965l3460
$$ 6660 -25070 17483 7117 -21475 12015 7256 -18262 11792 7161 -21470 14137 9172 -24288
1266b4288L9898p838l1587M2194j4303k6799M2833j8613k2040M0629k0749j8068
$$ -24288 15610 7772 -23815 18379 4076 -22723 20110 1497 -20543 20086 -663 -18731
1278a8731L9113k2152j6621L9308k3264j5721L9374k4905j3053L8077k7188q767
$$ -18731 20382 -1770 -18391 20917 -2347 -18068 21306 -3599 -16652 21425 -5763 -14530
1290a4530L6367k9694n617L5664l0220n360L4978k9593m779L4811l1592k758L5821
$$ -14530 21837 -7857 -13474 22190 -8030 -13390 21588 -8005 -12784 22027 -9565 -12323 23498
1303B3498l5273Q76L4878l8622O808L1503m0636J1537K7452l8441J2653K2441
$$ 23498 -11775 -10899 23979 -14643 -7835 23668 -16968 -5431 22021 -16420 -3767 18674
1315A8674l3647J2563J9596l1891J1637K1419l3326J0916K3846l6509J3755K3566
$$ 18674 -14973 -2410 17186 -14705 -3068 18351 -14975 -4059 19787 -16722 -2967 20599
1327B0599m0061J9201J9829m0716K4618J3059l8060K8049P149l4317K7752N044
$$ 20599 -19462 -261 19568 -21148 3470 16529 -21531 6518 13667 -20650 7102 12146
1339A2146l0991K4923N661k9605K3436O456l0948K5710N607l3607L0443K531l4501
$$ 12146 -18845 6078 11739 -17866 5570 12026 -18922 6788 12395 -21212 9231 11762 -22739
1352b2739L4583k159l2225L6371o915k7868L5565j0028k3647L3759j1422k1512
$$ -22739 11844 9685 -22540 13831 6916 -20952 14613 4585 -19062 14697 3275 -18237
1364a8237L3144j1768k1540L3411j1971k1084L3480j3688j9092L3649j6026j6681
$$ -18237 14907 3139 -18401 15010 3039 -18045 15435 1747 -17345 16304 278 -16403
1376a6403L3189j7833j4680L3189j9059j4408L3851j9776j3495L3889k2645r936
$$ -16403 16786 -1047 -15727 17462 -1597 -16005 17846 -1930 -15425 18464 -4181 -14117
1388a4117L4310k7112n683L2872k9057o25K8205k9119K937K4976k6333Q70K3114
$$ -14117 20193 -6919 -12602 20270 -8787 -9412 18793 -10326 -7389 17587 -8746 -7876 15238
1401A5238k1720j205K3502k4232j030L0259l1087p75L3274l5779P947K7521m1878
$$ 15238 -6482 -7687 15815 -8417 -9447 20812 -10275 -11050 22224 -13555 -5608 21913 -19965
1414a9965J9399K1271l9974K1429J0467k7727K1330K396k2412J5198J1067k0768
$$ -19965 -566 20705 -19269 2160 12627 -15100 6230 8626 -13786 1412 12479 -8289
1426h289J927J9704k1944M794K2330l8398J8304K6156m8029K6596J2215l9208
$$ -8289 -6362 13342 -8602 -3808 18522 -19876 -1572 24584 -23445 3151 15366 -23842
1438b3842M0251r297l2258M0843j0786j6571J8614j0040n25J0199k945j5688R968
$$ -23842 16409 7112 -25146 15697 4911 -11660 6954 -3086 -3611 6588 3643 -12045 -2077
1451b077K0898l2548R809J9182l7054L6502j826m7842N5690j1835l1525M3917
$$ -2077 18821 -13727 -3918 15264 -21790 14712 12886 -34956 20734 8899 -22626 21291
1463B1291l3676J718L8099m1041L367J9848r451K234o946M012l737J1814M094
$$ 21291 -12385 -10667 27432 -13609 -10242 9606 155 2389 -4557 -545 -4282 7532 11626
1476A1626l9599L7239R479m3297M2943k4905j5402O2302n6147n538M7843m0855
$$ 11626 -27973 9266 18745 -24552 18391 -6514 -21916 40386 -15761 -21299 26544 -14311
1488a4311K1627J329l4198L8319j889j6048k296K402K2365k3674N669K362k1825
$$ -14311 7316 8645 -25553 12766 10877 -5171 -7467 -5065 17300 -6374 -705 1657 -20168
1501b0168N2452l3560l3125O4686l9447N394L0023o6489N0318K0919n8867L3989
$$ -20168 32284 -1276 -34401 30285 -9162 -3768 26255 -40234 10084 31003 -27864 6125
1513F125q426k496K7460l6177L960J2529Q028j965l6148L6510k8j9937L4176n3750
$$ 6125 -2301 -4797 22663 -13514 -9554 2975 11003 9038 -27110 9400 9372 -10565 23611 -30139
1527c0139K3082N3247p7439K8520J7031l9650O0539m0208l0621O3019k5528k792
$$ -30139 -7057 46190 -31249 -2729 14302 -25348 35191 -5017 -35638 27381 1853 -939
1539i39p36j6167L5943j4078n468q533m813N1560m6918j1560M3111m3565M4448
$$ -939 -1675 -17842 18101 4023 -1445 -9978 -14791 36769 -10149 -21709 21402 -22163 22285
1552B2285p264o7109Q0563j3589l7164M2253m6249K8460L1933n8630J8017Q083
$$ 22285 15021 -52088 28475 14886 -22278 19975 -26274 2186 34119 -24511 -6494 1589
1564A589N727O734l7133K4568P49K923J3808n8987M6885K5137o0186M3935k7174
$$ 1589 7316 14050 -23083 1485 2234 5157 18965 -40022 6863 32000 -28186 15749 -11425
1577a1425q691P0628p3523j662N1834m0061K8295j6464k8261N0800j3545j0437
$$ -11425 -20116 50512 -23011 -24673 27161 -12900 15395 -1069 -29330 21470 7925 -2512
1589b512q779K59L9057l5651J458Q907k4212N9238m0096l7796P2090l9083O256
$$ -2512 -11291 -11032 28025 -7626 -6168 2739 -21473 37765 -2331 -40127 31963 -7120 -864
1602h64K2220o3994N8551J2425n4759L1601j2562J0732J7346l9132J3935M393
$$ -864 21356 -42638 15913 28338 -26421 5180 -7382 3350 20696 -18436 -4501 -108
1614a08J2734j598m2991M3755r69k2016L3233n2184K6552M6387p3102K8596J3160
$$ -108 12626 11028 -31963 11792 10823 -11193 22040 -30144 -3592 42795 -30307 -1711 11449
1627A1449l1022N0545l8943j9854N1070k1777j165m790p491K7589j4600P0j1408
$$ 11449 -19573 30972 -7971 -27825 23245 1468 303 -4487 -11978 15611 1011 1081 -10327
1640a0327j69M2521m4558k812L3748l7364L8048r712m9148O4481j5086k7284L2496
$$ -10327 -10496 32025 -12533 -15345 18403 -18961 19087 9375 -39773 24708 9622 -17662 14834
1653A4834l2381J9615J9955l8024J1011O165O778l124j9605K0309q792Q466P961
$$ 14834 -17547 2068 22023 -16001 -4990 1175 7953 4829 -14776 5533 -3259 5207 13168
1666A3168m3084L9939R016m1671L7041k1759o485M5700m7664J518L2639k6897
$$ 13168 -29916 10023 19039 -22632 14409 -7350 -13835 31865 -15799 -14281 18358 -8539
1678h539J4199m250j5534K2287k128p186q716R899J3167k3202J3308l194j4093
$$ -8539 5660 1410 -14124 8163 6035 -1151 -9867 32 13199 -10003 3305 111 -13982
1691a3982L7705k9648j4398M2532l0610N248J8328l6738K7476R771l0886J6798
$$ -13982 23723 -5925 -20323 22209 -8401 -3153 15175 -21563 5913 15684 -15202 1596
1703A596J029n014P482o562k763J833J2942j1544j2308K5845j4912l717K1051
$$ 1596 2625 -2389 5093 -1469 -4232 -2399 10543 -1001 -13309 12536 -2376 -6093 14958
1716A4958l0898J5384J9988l6763J8990P987k2554K2932p508j5431K0800l376
$$ 14958 -15940 -556 19432 -17331 1659 9646 -12908 10024 2516 -12915 7885 4509
1728D509j0515O121K962n755L320N685j5816R545J2725k4901J2851R152k3233
$$ 4509 -6006 115 3077 -2678 642 6327 -9489 56 12781 -12120 731 9883 -13350
1741a3350K1410k110k1938K6568o312j6261K0881q950p868J6888r242q124J4834
$$ -13350 8060 5950 -15988 10580 4268 -11993 8888 -62 -7930 8958 -284 -8408 6426
1754F426l401j1016J2585j480j2136J6244m476j4394K0791o964j3292K0991j0456
$$ 6426 3025 -7991 4594 3114 -9022 7222 2746 -11648 9143 2179 -11113 9878 -578
1767e78q789K0120j2906o248J8312j2032n043J5994j1239m296J5835j1797m464
$$ -578 -9367 10753 -2153 -8401 9911 -2121 -7164 8830 -2409 -6705 9130 -2667 -7131
1780g131J6797j2638l974J6693j3514k176J5657j4434l96J4910j4919J33J4852
$$ -7131 9666 -2972 -6946 9747 -3767 -5943 9714 -4720 -5116 9794 -5125 -4992 9860
1793I860j5082N05J4712j6091J965J4812j8053M026J3981j8837O612J1138j8489
$$ 9860 -5222 -4717 9995 -6096 -4131 10681 -7372 -3346 10635 -8202 -1590 9548 -8941
1806h941Q948Q652j7286Q737P571j4988P161P323j4210O576Q675j6001P058R862
$$ -8941 7 8659 -8627 110 7681 -7307 -146 7177 -7033 -457 8218 -7783 -725 9137
1820I137j8046R343Q574j9456J2904N684j9045J4835K303j6005J4533m36j2850
$$ 9137 -8909 434 9008 -10448 2456 8140 -10905 3930 6233 -9772 4761 4325 -8525
1833h525J3044n07j1712J1126J315j2418J0658K557j4368J2733J759j5901J5972
$$ -8525 4519 4012 -7700 3426 4741 -7677 2981 5538 -8830 3903 5662 -10239 5733
1846E733j173j5333J8372m985j2661J8554p725r387J6828q271p242J4509p255
$$ 5733 4560 -10773 7599 2614 -10047 8507 782 -8605 8223 -48 -7290 7219 -36
1859c6o716J3495o478p600J4531o671q645J6066q013q008J6964j0369o029J6911
$$ -36 -6752 6743 265 -7335 7196 525 -8120 7946 -67 -8075 8889 -1480 -7509 9402
1873I402j1969m024J5719j2425k276J4376j2456j617J3865j2193j375J3356j2480
$$ 9402 -2567 -6591 9128 -3297 -5573 8803 -3653 -5270 8595 -3598 -4973 8383 -4097
1886d097l11J2924j3204P21J2268j3254J700J1191j3157K105J1208j3179J774
$$ -4097 -4408 8516 -4688 -3967 8301 -4953 -3253 7938 -5219 -3114 8094 -5085 -3311
1899c311J1423j3632K794J1581j6064N096J1695j7785P529Q957j7330J0876N152
$$ -3311 8112 -5520 -2726 8855 -7209 -2113 9582 -8203 -674 8283 -9047 1829 6981
1912F981j6204J1506L341j2488Q748J914r573P322L939j2077N802Q751j4788O485
$$ 6981 -9223 2283 5624 -6864 1884 3798 -5775 1547 5486 -6591 -789 7962 -6826 -341
1926c41Q016j7607J3600M389k0834J8094M12j5753J7434p298q050J6440q415o078
$$ -341 7675 -9932 3668 8057 -12777 5317 5729 -10024 7410 112 -7938 8502 87 -5991
1940e991R067j183l935K589J896q018Q221N046j9016J3960N318j8920J9338p687
$$ -5991 3076 1893 -2042 547 2443 -5575 2646 7692 -11324 2636 7954 -10966 8372 685
1954F85j3335K7270j6131q620K0256j4958M394P752j5417P636O004n070m281K316
$$ 685 -12650 14620 -1511 -10131 10125 -4833 -439 7313 -8104 -468 5536 466 -3815 -1499
1968a499O702q893O767j384j3948K4862r665j7823K6831j6090l50J9544k9920
$$ -1499 5203 -3690 3077 1693 -12255 12607 2942 -14881 11950 -4140 -4490 15054 -14866
1981a4866J2924J6073k3208J0512j327m825J2639q994k684M50P838K291j8543
$$ -14866 -1942 14131 -9077 1435 108 -4717 7922 -1072 -3756 -3306 4532 6823 -11720
1994a1720J5072p27r468K1509k6016J802L0419l1350Q416R452k2076K8250r389
$$ -11720 3352 2625 -6843 14666 -11350 -9548 20871 -10479 -2063 7389 -14687 13563 4174
2007D174k0343K3122n720L74o98r483J2901k891K732p802q481K8496j7548q381
$$ 4174 -16169 6953 1233 1607 909 -8574 4327 1436 4168 -3634 -12115 16381 -1167 -9548
2021i548J9888k4262K2239N844l8794L2454M99j8009K1690k3609O541K2184k3307
$$ -9548 10340 -13922 8317 14161 -24633 7821 8320 -9689 12001 -11608 -5067 17117 -6190
2034f190K665Q02M851P503j8404Q915k477L250J4931l4540J5894J9674k9259K2170
$$ -6190 -3525 -2723 2128 9631 -8773 142 -2335 915 15846 -18694 -2800 16874 -12385 9785
2048I785j3487j3035M1851k9207r373K3282j7213J6944o070j8981K1291k138J308
$$ 9785 -3702 -16737 25114 -4093 -13466 9816 -7397 9547 3477 -15504 5787 3649 4957
2061D957r735o554K5421j5830R14L790k0734L6624j2199k8980L5412j7415L773
$$ 4957 -4778 -11332 14089 -1741 -827 2963 -17771 18853 6654 -22326 13086 -4329 -556
2074e56J7270l9772K4604J5150k6251J2723j0179N882J4853k0301L511j693J0291
$$ -556 16714 -23058 1546 16696 -9555 3168 -7011 -1129 13724 -6577 -3066 -4759 5532
2087E532O914k9966J9382M057j2623K3283l2139N293L5646l6839R139P175j9141
$$ 5532 12446 -17520 1862 5919 -6704 16579 -15560 -10267 25379 -11460 -2321 4854 -14287
2100a4287L2510j7255j8105K4768p100M961p514r003J9089p662M318r003j0098
$$ -14287 18223 968 -17137 7631 531 5492 -2022 -11025 8064 402 4720 -4283 -14381
2113a4381L3889k0717r874K1110k3860K4126K135l7502L3649j270j4664J7231
$$ -14381 19508 -1209 -11083 10027 -13833 10293 12428 -25074 8575 7305 -7359 9872
2125I872k2675J1218J6208k0655L395j918R088L711j8244J1955n073M716J2583
$$ 9872 -12803 -1585 14623 -6032 -2637 -4555 4533 8244 -10000 1955 -3118 1598 14181
2138A4181l2877J8375J4922k6366K0832j3310q799L4491k6320n819J8794j3399
$$ 14181 -18696 -321 14601 -11765 9067 -4243 -13042 21449 -4871 -10690 8104 -5295
2150e295J2417n481j2432J4770j028J513j0269q53J8195j5420M691J392j5818
$$ -5295 7122 1641 -10791 3979 2951 4464 -5805 -6658 11537 -3883 808 2200 -13618
2163a3618K9059j2449j9431K7880j5036K378J2751k6647J6481R612j7382P320
$$ -13618 15441 2992 -16439 11441 -3595 -1217 11534 -15113 1368 10980 -6402 918
2175I18l754L201N344q319J627l760J0780l03j7899J7572l871o853J7230k2568
$$ 918 -2836 365 5709 -2610 -983 -4743 6037 5734 -12165 5407 1536 -5317 11913 -10655
2189a0655N846K0532k5030Q536N803j3904J7518o945j1149J3344j706j975j924
$$ -10655 -4809 15723 -9307 -771 5032 -8872 8646 1701 -9448 3896 2190 215 -1709
2202a709J64L164k608N828r361j065J6854j6039Q21J1511j6588J3663K037j9390
$$ -1709 -1545 1619 -989 4839 -4522 -5587 11267 -4772 -3951 7560 -9028 4635 6672 -12718
2216a2718J7835p70j0852J1222o841j213Q723n681l476L580M012n513k79N705
$$ -12718 5117 4347 -6505 4717 -2124 -3337 5386 -295 -3771 -191 3821 -1692 -1971 3734
2230C734q800P079L891j5629J2929K186j3631J3808n374p285J5314r369m818J1445
$$ 3734 -5066 2013 5904 -9725 3204 5390 -8241 5567 193 -7092 8222 -1147 -5965 5480
2244E480o397j565N951m918j360O594k816o006Q073q78p347R673m204o289J2918
$$ 5480 -917 -2482 3469 -1449 -2809 3785 969 -5037 3036 2158 -5189 4484 280 -6009 6909
2259F909p635n218J2722q564k035J0116r410K97Q791q582j91P664o618q15P254
$$ 6909 -726 -5944 6778 -1786 -3821 6295 -3115 -2818 5973 -2609 -2800 4864 -1754 -2569 4685
2274D685o702r12Q396p684j014Q965q356n6Q412r076J350P685r428K056P188r289
$$ 4685 -2017 -2929 5467 -2217 -3231 5734 -2622 -2678 5734 -3342 -1992 5693 -3735 -1679 5509 -3780
2290c780K369O704r376L172O217j0001M251N693j0164N017M450r502N838L079
$$ -3780 -1411 5293 -4083 -911 5306 -4695 -444 5249 -4915 102 4552 -4950 888 3967
2304C967q857N783K953q307M975L275q192M982L492r256O099L571j0353P457K326
$$ 3967 -4890 893 3846 -4461 514 3789 -4403 579 4071 -5185 914 4485 -5868 1589 3915
2319C915j0072Q991N9r031R542j399p205Q287j754n604O898j165n692O322J59
$$ 3915 -6157 2834 2893 -6138 3404 2005 -5200 3087 1333 -4271 2627 1462 -4230 2092 2251
2334B251o960O883M21q045Q587r39q261J0404l158p004J0892n176m684R910o114
$$ 2251 -4709 2174 2595 -5450 3137 2198 -6063 4341 1183 -5821 5071 -105 -4789 5121 -993
2349i93k784Q305n524k230P046m297k839O988l801l737Q185m651m033R582o284
$$ -993 -3777 4528 -996 -3226 3820 -477 -3316 3672 -129 -3866 4319 -332 -4365 5217 -1067
2364a067l066R895p903j105R033q684M94P662q183J160O325p261J078O050o895
$$ -1067 -4133 5762 -2141 -3246 5787 -2897 -2403 5259 -2924 -1764 4561 -2700 -1622 4428 -2467
2379b467M74O558o936L62O778p668J177O802q485K054O261q507K793N387q377
$$ -2467 -1993 4565 -2371 -2009 4769 -2899 -1722 5080 -3405 -1351 4910 -3597 -804 4583 -3794
2394c794L227N092q391L476M747q477M253M152q911N220L394q600N794J970p688
$$ -3794 -567 4525 -3866 -390 4357 -4120 133 4285 -4626 594 3988 -4612 1182 3152 -4536
2409d536O197J156p028N420J508o327M585J783o980N399K491q850O540K231r114
$$ -4536 1661 2817 -4211 1209 2717 -3610 975 2758 -4222 1177 3668 -5182 1358 3589 -5525
2424e525Q476o87q433J0505k873o780R160l908l090O737m377k124N336j109m321
$$ -5525 2951 2264 -6169 4336 1463 -5317 3843 -65 -3155 3582 -795 -2919 2417 1308 -3013
2439c013L501J754n723N561J34q689J0744j695r374J1807n672l716J1421j0686
$$ -3013 488 2242 -3481 2080 2214 -6475 4269 2574 -6800 5007 -665 -4381 7040 -3646
2453c646J35R349q275J665K434l878L053Q02k083k801N198J350q365P500j695
$$ -3646 -3511 5838 -2437 -772 1662 -2216 837 1639 -444 -3245 1953 3303 -5062 2438 743
2468G43n638J2701j0857l185J5263j2747K068O893j2457J0562J321j0959P630
$$ 743 -4895 7806 -3051 -6236 9027 -3720 -1652 5241 -7216 3346 4667 -6292 1338
2481A338l20p15P78l360K795j327M440l599p234J3974o296n084J1181j3749P894
$$ 1338 1018 303 1081 -2279 516 -811 3629 30 -7204 6770 474 -4610 6571 -7178 716
2496G16R103j9871J1068L540r609J1224r148j880J1199o636l13k112K810M702
$$ 716 9819 -10052 1016 4556 -5053 6171 -2977 -4857 6342 -294 -607 -2719 91 4793
2510D793q175N060m267K87J2872j8081L764J2133j5182J2343m536j2463K2040
$$ 4793 -3382 1678 -2589 -2302 10570 -7511 -3747 8386 -6796 5547 1011 -11452 10588
2523A0588r544p482J0729r085Q364M67j0720P293l94M045m785o992J3547p068
$$ 10588 1044 -6438 4291 -4794 3570 4037 -6683 610 216 4261 -524 -7516 6031 -1037
2537a037J247M073j6331J8882N30j8731J6946q083k42J4415k1562O587J1193j0929
$$ -1037 210 4283 -12048 6834 7364 -11367 5579 -2504 -2746 11669 -9893 -3306 7887 -3042
2551c042N995p247J491R739q692K241n646N036J0583j8879P786L872r415J7772
$$ -3042 2953 -4294 -2803 6936 -1756 485 -5161 -125 10458 -8421 -635 3237 -6178 11594
2565A1594j6783n162K3435j6816K746M412j3663J8922m833j2141J0239l571O695
$$ 11594 -5189 -10351 13084 -3732 -986 3426 -10237 8685 3852 -8289 1950 -1621 5074
2578E074m132q331J0924m669N740l675j3081K1652o986q905J3137j6422J2798
$$ 5074 942 -7389 3535 -1134 4606 931 -12150 9502 2516 -6389 6748 -9674 3124
2591C124Q625k4976J4747K414p456J1491j5155L417J1849r295K038o305N780P826
$$ 3124 11749 -13227 1520 3934 -3522 7969 -7186 -3769 8080 -1215 823 -5482 298 8124
2605H124j3611O823l850p1J5374k1709L971J4454j5869J2406o424j1042K3185
$$ 8124 -5487 1336 -2514 -2585 12789 -8920 -4949 9505 -6364 6042 -382 -11424 11761
2618A1761j1148o412Q837p849J0562l328r068P992k060O411o860p184J5639q704
$$ 11761 613 -5799 3038 -4811 5751 2423 -6645 1347 -713 5698 -1162 -8346 7293 -1411
2632a411J741L562j5699J9444j344j6999J6032q015J385J1067j9130P545Q126
$$ -1411 330 3892 -11807 7637 6293 -10706 5326 -2689 -1304 9763 -9367 -1822 6304
2645F304q492M566o827L375O358p054K765o116N974P544j6368Q521J847p573J4617
$$ 6304 -2188 2378 -4449 -1074 5284 -1770 995 -5121 853 8397 -7971 550 2397 -5176 9441
2660I441j4204k831J8053j3877K367L797r749J2863l442p988O502j423L963m248
$$ 9441 -4763 -7594 10459 -3418 -1051 2746 -7003 5860 2418 -5570 932 -491 3472 -776
2674g76l042O556m762N962l916q207J5851p437m823J0160j2115Q394N458j5968
$$ -776 -3818 2738 -2024 3938 22 -8185 7666 229 -4594 5566 -6549 1845 7303 -8665
2688h665J0090J516n830O891p075J002N795l637l65k812M979O83n887N956n247
$$ -8665 1425 2941 -2889 4002 -3073 -2071 3724 87 -278 -3090 1889 2572 -3315 2641 -2606
2703b606J522Q284j3393M963O889j0649Q311k467o972J1868n186m370O056l219
$$ -2606 -1084 7200 -6193 -1230 5659 -4990 3321 854 -6118 5750 564 -3806 2250 -969
2717i69J639M49k455P01P46K911n289L16O003o907L778J668q398R692j492p951
$$ -969 670 1119 -1336 -635 111 3022 -2267 -1951 4052 -2855 923 2591 -5807 3885 2393 -5558
2733e558R187l898k207O738o657N24N109l922m48J643k91r06J647l47l629N203
$$ -5558 3629 -269 -2476 4262 -2395 -1871 3238 -684 -1132 511 220 -686 961 614 -3015 2188
2749B188n79n551O578k415l365P283n790j189P153o155J58M659n045J583K915
$$ 2188 1609 -3942 2636 221 -3144 4139 -1651 -2840 4313 -1842 -1684 2975 -2070 -487 2428
2764B428m289Q55L240l024p57L536k747q48M410m153n80N336n123J11M813n380
$$ 2428 -1861 -1006 2234 -790 -1547 1989 -758 -1606 2804 -1349 -1929 3407 -1716 -1605 3208 -2172
2780b172J321L914n586J992L407n251J968K937m785K080K586m821K409K492m988
$$ -2172 -851 3063 -2523 -531 2876 -2375 -407 2530 -2255 -175 2411 -2410 -1 2491 -2497
2795b497K576K199m723K835J623m508L035J535m593K941J708m657L132J467n023
$$ -2497 79 2278 -2445 390 2013 -2495 540 2075 -2518 423 2131 -2526 606 2073 -2950
2810b950M026J002n332M753K05m803N021r38l793M951j463l117M150r86k728L321
$$ -2950 1076 2078 -3254 1499 1704 -3099 1922 984 -2809 2142 679 -2438 1712 726 -2002 1319
2826A319m38l097L565j1m134M393k06m542N383j411m039O132k811k910N788l503
$$ 1319 881 -2216 1349 1338 -2796 1597 1391 -3151 2232 821 -3218 2914 103 -2807 2981 -522
2842e22j531M643l360p66L677k599j125L356j762j958L944j934k428M951k942
$$ -522 -2053 2590 -770 -1536 2141 -458 -1583 1773 11 -1947 1997 63 -2365 2586 -356
2857c56k135N679m267r76N371n083M77M282n024J296L193m269J241K568l382O02
$$ -356 -2491 3188 -1079 -2055 3316 -1767 -1290 2992 -2032 -736 2457 -1812 -571 1997 -1385 -783
2873g83K799l320K35L489l832J46L971m556R48L711n164J945L064n136K444K276
$$ -783 2016 -1304 -1069 2420 -1412 -1266 2705 -1851 -903 2808 -2356 -411 2653 -2483 -39 2237
2889B237m557K501J802m250K408J880m147K183J907m218K587J686m527L066J313
$$ 2237 -2320 181 1983 -2267 141 2021 -2126 57 1964 -2254 333 2019 -2508 558 1871
2904A871m324L260P45l929L336N15l846L216O65l845L367M23m194M184J4m358
$$ 1871 -2453 807 1552 -2377 959 1474 -2372 844 1509 -2336 1031 1454 -2740 1444 1458 -2900
2920b900M712r61l500M979k175k511M587k180j694L144j566j223K647q49k528
$$ -2900 1812 851 -2649 2330 155 -2356 2231 51 -1643 1501 -65 -1288 1359 510 -2018
2935b018L187J89l822M003p04l803O011k929l390O673m056j248M937n105J448
$$ -2018 1169 1358 -2464 1539 835 -2968 3043 114 -3276 3397 -659 -1907 3030 -2075 -627
2950f27L327m329J033J637j133k45O65j66j788L537j194m244O313k598k850O435
$$ -627 2700 -1629 -596 1041 -92 -337 328 162 -1626 1911 717 -3527 2786 188 -2662 3773
2966C773o439J222O203q228L040K870n264M849j669k998M093q65o11j272J273
$$ 3773 -2666 -1444 4759 -3469 -429 2441 -2823 2026 357 -2641 1452 587 -24 -1296 -23
2981b3J414k978L392l040j330P740p554mO427p736N525P09q414Q969j414m562
$$ -23 1391 -1587 1805 -1235 -2565 5175 -2379 -2383 4044 -3692 1833 2542 -5872 3097 1683 -2879
2997b879M919m021K182K100l930J340q96L472j473m562O546l962P57M615j0327
$$ -2879 2040 -1981 201 2301 -1629 -289 -1185 2287 814 -3748 2798 -1164 -407 4208 -6119
3012f119P327L600j0008P955l377k575R364q952J74N623m306L351l373o40M335
$$ -6119 1208 4808 -5200 2755 -622 -3197 6167 -2785 -2611 3012 -1294 2057 -1316 -1956 2379
3027B379k893K427m634R15P604r156L226K029o778J1165o482o294J2151p085J089
$$ 2379 -514 1913 -2721 -1806 5798 -3358 -132 1897 -4881 6284 -198 -6492 5659 -1426 -337
3042c37L518r145Q671M54o119L610k811M646p31n252N149l718M415Q31j0585J0799
$$ -337 3181 -5964 2707 3161 -2958 652 -2159 2487 1756 -3496 1653 -2065 2350 3181 -7404 3395
3058C395j112o039Q720j0045L850Q984j3206N224J904m393P832p615o10O116l405
$$ 3395 2283 -3756 4964 -5081 -1231 7753 -5453 -229 1675 -2718 5114 -2501 -3111 3005 -400
3073d00K693n555J562O498p465M321k998k767J2201j1017j146Q844r009Q013j990
$$ -400 2293 -3262 -1700 4798 -2667 1654 -1344 -4111 8090 -2927 -4073 4771 -4238 3775 1785
3088A785r695J2861l643l581M122o123O939j32n645L566k860O009j907p673R377
$$ 1785 -7910 4951 1308 -2273 1849 -4274 2665 2533 -3112 454 -2406 3603 1696 -5977 3400
3103C400m290O67M852j2467R733L643j1203Q527m602o80R422j1074J801M901l729
$$ 3400 -890 -223 4629 -7838 1895 5538 -5665 2862 -1740 -2420 7002 -4072 -2271 2630 -1099
3118a099M189n910J009M974m309L566n708J149Q923j0580L390K266o642J1351
$$ -1099 3090 -2820 -1811 3163 -1146 2420 -3288 -2139 6784 -3796 -406 1860 -4782 6569
3132F569p253n670J1922p020J562K210p924Q781q19m817K939k737N272j993m227
$$ 6569 -684 -6354 5568 -1452 110 2320 -5604 3177 2358 -2459 480 -2257 3015 1022 -3205
3147c205N049m084M861j90r130J0364k148m574P389q979M292O486j0830M878J008
$$ -3205 1844 -2240 2621 2431 -6699 3665 1517 -3057 4332 -4647 -355 6131 -4699 179 1187
3162A187l000N573n896L53L733k096J960m818K617L797o078M624l128j821R214
$$ 1187 -1813 3760 -2136 -1783 1950 -146 1814 -3004 -387 3410 -2668 1956 -1172 -2993 6221
3177F221q976O7O648p322N745j020o569Q572k455k730K903l168L570n24k272J410
$$ 6221 -2755 -2688 3960 -3362 2383 1363 -5206 3366 911 -1819 1084 -2084 1486 962 -1310 100
3193A00j708M370k737l309O216m485J597K930p934O696J185o798O075k872j085
$$ 100 -1608 2762 25 -3284 2932 -1553 44 2974 -4960 1736 2921 -3877 2198 -674 -1759
3208a759N355n539O39K782j782R24j723J131M32q97K051m030K262L260o107L785
$$ -1759 3596 -1943 -1304 1478 -304 620 -1103 28 460 -437 1614 -2416 -154 3106 -3001 784
3224G84L66m172O292l635k754O219l876j27K571l486K152R80k131L16O50Q38j819
$$ 784 1150 -3022 3270 -365 -3119 3100 -776 -903 1668 -1818 334 1314 -817 -501 149 987 -832
3241h32Q31P85k491L441j301l164N185k565j663M267m102R68L214m428J544J831
$$ -832 -1 784 -1707 1734 433 -2731 2454 -111 -1774 2493 -1609 -641 2573 -1855 -311 1520
3257A520k610J314M88j499O69J202j472n76K327j630p63K779k781K55K984l744
$$ 1520 -1090 224 712 -787 -118 1084 -388 -964 1363 -267 -1030 1749 -1032 -777 2207 -1537
3273a537J003K508l565J648J439l163J976R89k740J564J055k330J206J025k325
$$ -1537 -534 1974 -1591 57 1496 -1667 309 1298 -1442 122 1177 -1153 53 1078 -1247
3288a247J330J209k685J480J256k787J661R32k698K012N90k704K203M77k668K228
$$ -1247 83 1292 -1393 87 1343 -1444 217 1149 -1549 463 1053 -1651 552 1029 -1639 589
3304E89K80k522K512j58k441K799n04k167K690q10j626K458j009j374K241o91
$$ 589 869 -1653 859 701 -1740 1059 555 -1612 1078 268 -1358 1100 91 -1283 958 267
3320B67j478J965l47j716K237m99k073K872q70k112L265j536j504L251k170p86
$$ 267 -1211 754 407 -1309 928 429 -1644 1228 358 -1754 1511 -25 -1529 1722 -448 -1234
3336a234K883k221k54K086j733j90J699j264o39J876r99j174K401j348j177K995
$$ -1234 1649 -572 -826 1260 -473 -663 1036 -228 -867 1009 10 -1164 1237 -111 -1288 1707
3352A707k239o55L142k902K23K542l073R96J718k645J197J064j993Q63J014j587
$$ 1707 -532 -1187 1955 -947 -724 1818 -1255 -259 1459 -1186 11 1075 -918 -55 959 -628
3368f28L08J420j785K28J851k339N11K041k888J139J668l041J799R76k799K015
$$ -628 -320 1100 -685 -457 1394 -945 -434 1607 -1281 -142 1526 -1515 284 1260 -1539 476
3384D76N08k254J708L44j910J461N60k022J304Q24k178J396P90k423J868N06k515
$$ 476 984 -1270 438 782 -1128 333 893 -1129 175 999 -1179 217 1007 -1416 452 958 -1557
3401a557K154J74k201K195k08j943K168k33j884K063k32j823K217n28j766K489
$$ -1557 597 771 -1430 765 557 -1386 782 549 -1335 728 496 -1327 890 362 -1404 1085
3417A085q36j585K442j159j020K208j313q12J917r42q65J631p20j088K013p67
$$ 1085 249 -1336 1106 -53 -1073 1135 -178 -990 927 -15 -880 751 31 -1057 956 189
3433A89j618K662j196j384K923k142n81K987k705J16K141k334Q81R56j735O53
$$ 189 -1429 1233 37 -1347 1576 -566 -1147 1840 -865 -749 1392 -942 -61 895 -840 -187
3449a87Q91p50o46J212k62j224K159j452j209L550k765n32L227l530J589J701
$$ -187 704 -46 -692 520 258 -966 1193 -259 -1468 2082 -683 -1215 2012 -1518 71 1772
3465A772l942K769N04k360K043r98k43J181p16j50n79J669n48j755K709k142L13
$$ 1772 -2170 599 1103 -1257 786 -212 -455 726 10 -140 -719 950 402 -1353 1356 -786 -473
3482d73K839m795K421K198m408L463j010k249M411k784r17K344j615J318q97n10
$$ -473 2366 -2429 -8 2190 -2218 1245 235 -2014 2397 -387 -1304 1040 -575 743 -154 -664
3498f64J136r46J927k437m07L977m062J462J475m456N357j396m168N454k805p4
$$ -664 472 -474 1453 -984 -1391 2586 -1476 -14 1461 -2995 2362 966 -3202 2252 -553 -627
3514f27K767m643K804J179k394J401j811K042K68k339K370k649K239J848n979
$$ -627 2140 -2503 301 1480 -914 487 -1324 718 986 -1353 1017 -1632 607 2455 -3524
3529c524M632ol200N141n198M95N462n918K037Q03k696M587l129j053K478j491
$$ -3524 1108 1102 -2098 3043 -2155 -1660 3802 -2116 -79 724 -1972 2615 -514 -1567 911 -580
3545e80K399l066j66L635l710K901j499l160P201m518j654M809n280M209O21o231
$$ -580 1819 -1247 -1413 2222 -1488 1413 -86 -3246 3955 -563 -2217 2592 -2688 1521 2142 -4089
3561d089N806r60j614K401m080L363O74k602J874k987L693N72n347N009k385m4
$$ -4089 1717 757 -857 1544 -2536 827 1501 -1101 773 -2214 1479 2051 -3296 1713 -672 -716
3577g16M481p763L802L544o109M742k842j405O384n583K85K116k093L706l719
$$ -716 3765 -3998 -196 3348 -2761 1981 -861 -2266 4118 -1465 -1180 936 -1157 2549 -1170
3592a170l02L071k653L296l614j082O390n565J492J548n109P284k798m599O483
$$ -1170 -1472 1599 -1054 2242 -1372 -2454 3936 -1629 -137 1411 -3698 3586 788 -3811 2672
3607B672l723J344J778n617M769J05k133J615l237M014k28l403L487l520L015
$$ 2672 -1051 293 2071 -3546 1223 1328 -805 810 -2427 1587 1359 -2044 1443 -2077 938
3622I38K040p304N639j1l414N397o020J320N457o343K436J22j942M668m123j53
$$ 938 2978 -4326 1313 1302 -2112 3285 -2735 -1415 4042 -2301 135 257 -1685 2983 -1140 -1293
3638a293K162j566K943l937K88L894m196L189j788k772P095m888j099M283m855
$$ -1293 869 -697 2246 -1691 -1403 2491 -1705 1484 -304 -3076 4019 -869 -1968 2315 -2540
3653b540M261k09n147N358j348q74J542l264L288k11j635J427k722L768m09m064
$$ -2540 1721 1512 -3635 1723 375 -499 1043 -2221 1067 856 -779 648 -2074 1694 1285 -2779
3669b779M633k747M79L390o422L670K246m760L821k175q87M375l939L49J268j013
$$ -2779 1854 -893 -414 2976 -3446 224 2470 -2290 1531 -644 -1531 2844 -1095 -746 522 -491
3685d91K043k636O43J240j615K645l164L4M119m441J807R12l673N051k150k762
$$ -491 1552 -1084 -441 799 -816 1829 -1335 -1301 2818 -1623 184 1096 -2577 2474 324 -2438
3701b438M389k608N77J306l030K384J21j035M72j093K060j058p82J731k480K378
$$ -2438 1951 -657 -80 1226 -1804 580 701 -334 138 -955 1105 47 -735 996 -1484 894
3717H94M15l824L822q79j815L323l254N47K817l211J002O92j185J358q64k17L11
$$ 894 1309 -2515 1307 428 -1387 1936 -1318 -771 2046 -1165 -163 529 -656 702 -162 -379 -68
3734f8K48N18j853J357N80j992K333j433j041L313k734j65K416k651J381P53k359
$$ -68 180 698 -1155 202 782 -1210 1123 -310 -1351 1962 -772 -937 1479 -1172 209 962 -1397
3751a397J808J51j177P69j16j27M2L23m79l63J529j267m19J823j856N88J317k457
$$ -1397 411 562 -615 154 38 -89 -47 276 -203 -566 963 -304 -723 1100 -756 -168 1149 -1308
3769a308J503Q07k170J512J21j336J398k59j029J067J32r71N83M63j089O89N22
$$ -1308 195 1002 -1168 344 465 -871 527 268 -761 306 438 -533 50 513 -576 113 635
3786F35j499J045N66j708J282K85j588J537j07j454J644k59j258J486l71r92J395
$$ 635 -864 181 747 -961 321 606 -982 555 448 -1006 638 379 -879 607 236 -756 639
3803F39m98r30J474n22q94J399n61p07J256o20o61J313o16p52J315n54q05J437
$$ 639 141 -789 685 163 -731 668 107 -600 656 36 -625 688 72 -680 635 81 -724 713
3821G13p47p35J682j051o20J750j298k57J498j464J20J272j346J90R75j029P3
$$ 713 -34 -769 913 -138 -758 992 -306 -563 935 -529 -409 863 -483 -293 682 -347 -274
3838b74Q54q05k11J137r04m31J515j207k65J643j684J96J533j940P13J034j791
$$ -274 580 -225 -436 701 -203 -634 881 -326 -591 1052 -632 -436 1097 -843 -130 904 -887
3855h87R97M80j338Q90L12j000N37M56q73K81P64j149L38R94j584P32Q99j850
$$ -887 110 590 -748 142 454 -546 -9 447 -426 -145 619 -530 -192 802 -782 -50 849 -1001
3873a001J223M58j731J541p1j344J475k79r88J115j71p66Q52L4r85Q68K83j288
$$ -1001 222 680 -1051 490 419 -925 550 271 -717 398 227 -539 313 347 -638 230 513 -775
3891g75J070K22j397J401j21j339J592l83j114J536o00p80J363o21p17J298n32
$$ -775 295 517 -880 521 400 -939 653 270 -844 692 92 -688 675 54 -663 635 103
3908A03p76J250m99p30J368p09p03J467q29n33J304r08k51J194r31k97J132p80
$$ 103 -673 577 78 -652 716 7 -696 771 -58 -591 713 -195 -446 748 -183 -480 652 -128
3926a28l28J138q82l56J437j144k77J480j400J48J231j607N78Q78j352N69M64
$$ -128 -456 682 -200 -556 881 -263 -540 940 -460 -312 919 -688 -110 768 -584 -15 449
3943D49q63L98M34p02n1R47p81l65J331j283Q5J524k078P35J297k142J317L26
$$ 449 -414 -16 418 -284 -335 612 -169 -534 797 -486 -401 1123 -955 -220 1077 -1065 252 578
3961E78j684J743l69j027J123l42j24J41k4j56j17R86j192j30J726j938P98R25
$$ 578 -1106 637 268 -759 364 22 -102 39 15 -141 -258 728 -464 -594 1132 -806 -8 917
3979I17k426K320p8k243K492j079n84J866j961N07R56r77M45n26N48M5n81J051
$$ 917 -1509 811 733 -1510 982 -97 -681 1185 -776 -269 687 -290 155 -371 177 222 -359 692
3997F92j672J100J195k927K152K8j923L007k223p04L067k528N69Q42j741J958
$$ 692 -980 120 1315 -1612 540 568 -1355 1652 -571 -1275 1792 -736 -167 675 -1066 892
4013H92p09p81P90n21J303j429j67J645k020J883n08k395L900j861j238K855l185
$$ 892 183 -598 192 -329 974 -455 -622 1023 -997 886 378 -2017 1883 22 -1216 1639 -1546
4030a546J876J332l657K616k31r73J694k213J113O78j058J041j951J726P64k750
$$ -1546 330 1662 -1995 621 390 -583 1111 -1102 11 689 -369 672 -1279 447 1211 -1539
4046a539K571j555l18L269m331J449K231l406K900j362j677L799k417j74R62j323
$$ -1539 1032 -523 -841 2428 -1903 -454 1777 -1629 1271 -91 -1768 2031 -386 -560 402 -921
4062i21K253j657l72J313j551K502j999j392L927l051R19J265l884M342o88l252
$$ -921 1332 -325 -697 616 -935 1567 -432 -1824 2103 -948 -29 1236 -2648 1694 1006 -2246
4078b246L693k261O89J856l752K305L83j055J264k502K102M70k018K198k634J569
$$ -2246 1447 -814 -125 1731 -2021 284 667 -388 876 -1626 476 946 -1072 1126 -1508 61
4094F1K219m670K986J8k166L997l820k3L789l622J571j38j710L369k148m01J028
$$ 61 2280 -2390 596 614 -1552 2445 -1375 -1398 2391 -1231 340 202 -1508 1861 -287 -688 340
4111C40j124K479k392l84K516k634K452j023k722M926k608j043K868l580K856
$$ 340 -784 1695 -697 -1081 1435 -1199 1253 230 -2492 2434 -174 -1217 1651 -1929 927
4126I27O45l842L133p53l01J308k701K000J70r52J226k550K452N63l107L033j983
$$ 927 1572 -2270 863 110 -191 1117 -1584 416 586 -366 860 -1690 762 1325 -1782 1251 -732
4143g32J54L116m702J945J866l222K976j841j059L542k634K83N59j047K209j961
$$ -732 -578 2538 -2164 -219 1647 -1575 1401 -440 -1499 2043 -591 -308 251 -796 1413 -548
4159e48N5J016j386K460k248p54L354k983J245O97l147L932j073k405L014j950
$$ -548 -493 523 -863 1597 -651 -1405 1949 -1034 211 908 -2239 1693 620 -1785 1229 -721
4175g21P50J115k630J772P8m68M72j567J916m16r65J642k347J761J093l434K714
$$ -721 29 1144 -1486 286 364 -104 368 -1199 717 301 -664 978 -1369 392 1485 -1949 765
4192G65m15j529K964k832K04K509k573J061M4j023J823j211r2L55l50J269j711
$$ 765 350 -1179 1785 -1047 -843 1666 -907 154 198 -825 998 -213 -305 50 -300 969 -742
4209g42M91J045j782J963j033j344L067k138k12J842k327J600M53k139J716k38
$$ -742 -251 794 -988 975 -58 -1402 1665 -473 -685 1157 -1170 430 883 -1256 460 222
4225B22m62O18q14O40j55Q0L8r99J633n80j119J885j596L59J539k510J298Q49
$$ 222 -240 378 -436 204 49 129 167 -832 801 221 -898 987 -609 -250 1289 -1221 77 926
4243I26j895J531m35q44J473p71l71N73j26O2l17M09l42p5R35j382M37J101j719
$$ 926 -969 562 127 -717 756 -15 -386 187 61 123 -194 215 -127 -202 733 -649 -212 889 -830
4262h30J042L09j530J715m70j126J553o94l82R12p03o8O09k50m43M45K31p77O17
$$ -830 212 521 -1009 706 236 -890 663 -31 -413 499 -204 -272 337 87 -356 89 320 -457 160
4281A60J54r95J125j91j078J410m77p54J305q18l33J152q32k54R52o34k67P93
$$ 160 314 -681 444 253 -825 585 108 -646 659 -159 -492 660 -172 -426 526 -108 -375 418
4299D18n38k77Q81n91l55J004o47l38R85p62j42R72q94m4R10q68K5P97q82J43
$$ 418 -120 -397 484 -107 -462 542 -105 -443 542 -220 -362 610 -284 -328 582 -286 -261 536 -346 -203
4319b03P95r59J42Q02j006L33O78j038M64N26r94M77M09q13L78L94p37L17N20
$$ -203 592 -367 -225 577 -429 -96 582 -456 8 534 -460 17 426 -387 -9 385 -352 -35 485
4338D85q86L24O64j053M40O24j216P32M37j266R46J94j044R45o3p61Q08p5o47
$$ 485 -401 -77 587 -466 -26 598 -618 114 551 -715 231 425 -619 326 263 -498 310 235 -412
4357d12O02R7o81N27K30q58O73K39j059R53L6j037J187l14q20J201n81m66R93
$$ -412 190 287 -394 133 363 -495 178 417 -642 311 347 -690 497 183 -637 564 -17 -483 510
4376E10n99l04Q09m87k90O71k75m23P17k47n90R24l30o72J126n89m80J165q12
$$ 510 -89 -393 416 -71 -361 310 35 -388 329 82 -508 416 86 -586 540 -49 -529 636 -176
4395a76k58J065q59r3Q83q55K9P76p18r2P63o10j43P89p68j6Q32q54K8P95q25
$$ -176 -434 631 -228 -321 562 -293 -264 512 -206 -298 465 -145 -288 501 -267 -283 549 -305 -277 518 -307
4416c07J23P11r15K35O95q92J72O84r01L19O03j003M33N88j042N56L65r59P41
$$ -307 -184 527 -388 -153 542 -350 -178 506 -395 -76 527 -476 -43 545 -497 59 424 -535 206
4435B06J53q29O01J61o31M44J60o03L73L87q71M18N92j130O97L58j235J142j1
$$ 206 359 -470 131 292 -339 105 265 -338 35 422 -449 -31 561 -569 128 486 -749 393 382
4454C82j146J265l68o38J002n61k78P17k96k99K64J76m09K19L97j060Q50L65j413
$$ 382 -764 501 133 -505 497 -64 -342 375 79 -220 44 220 -189 30 427 -633 217 582 -831
4473h31J283k00j054J686j065n06J600j291K10O70j019P22K9m50K10l7M12o38
$$ -831 452 252 -802 884 -181 -687 913 -378 -168 502 -517 205 234 -216 -6 -43 369 -269
4491b69K07M55j060J291m42j248K098j222m65J671j890Q83R08j914J248j9o58
$$ -269 -62 393 -667 624 182 -1066 1032 -190 -655 1016 -874 9 917 -997 251 232 -426
4508d26R08q36K71J88j08L68j153J143R5j315J718j317j36K079k539Q67J168k054
$$ -426 482 -354 -83 105 -3 365 -788 355 450 -865 853 -464 -600 1479 -1060 -193 975 -1079
4526a079J859o58j230K132j194p1N04q34J184p52l4M01r32J720j204p69K179k018
$$ -1079 780 122 -1108 1024 -170 -241 263 -571 613 -139 -173 228 -704 1016 -188 -957 1222 -796
4544g96R60P78k682K726l79j893K343j667M15J371k220J184Q7l99Q30j583J234
$$ -796 164 942 -1740 986 607 -1286 1057 -610 -195 1176 -1044 140 227 -172 658 -925 309
4561C09L0q31J474k094J113J479k984K087l07j461K921k452k22K373k232J151
$$ 309 339 -492 982 -1112 1 1480 -1504 583 276 -1185 1736 -716 -938 1435 -797 354
4577C54j38j262K078j182pK65p89J877j605j35J433k009K142o63k153L375j812
$$ 354 216 -1046 1032 -150 -157 108 -681 1196 -409 -544 889 -1120 1022 359 -1794 1581 -231
4594b31m63J987k877K086O28k572K074q18jJ151k076J328m0l88J048k199J772
$$ -231 -694 1293 -1584 502 1130 -1442 632 -186 -187 964 -1112 216 176 -212 836 -1363 409
4611D09M62k132K341j811Q4K613l434J300J195k274K434j439r14K454j683L93
$$ 409 871 -1261 1080 -731 -647 1966 -1468 -168 1027 -1247 1187 -252 -1166 1288 -395 -2
4627bK1p70J838j459K12M59j253K331j725q40K635k386J214N98k785L092p09j712
$$ -2 19 -751 1087 -372 -160 299 -954 1377 -348 -1188 1447 -939 275 873 -1912 1180 471 -1241
4645a241K246j810Q83R29k167J457k82l4O80j785J625k16q50J618k253J313J273
$$ -1241 1005 -805 78 1007 -1160 297 15 -19 661 -1124 501 285 -565 1053 -1200 113 1386
4662A386k923K216m99j192K682k508J08J956j998J191l56q82J729j147K29k0m99
$$ 1386 -1537 679 180 -1012 1670 -838 -730 1226 -772 419 63 -819 910 -237 -8 -28 -527
4679e27J624j719L17J081j809K019q41j597K839j720j99J544k204J597L81j798
$$ -527 1097 -622 -305 776 -1033 986 145 -1452 1387 -333 -532 1012 -1192 405 786 -1012
4695a012J442m92J0N34j139R51l60Q8M71j510J594j81j313J845j529K53J688k472
$$ -1012 430 -62 -52 482 -657 294 -66 22 493 -1017 577 396 -917 928 -601 -348 1340 -1132
4713a132J167P26j628J587q36n74J446j004K17Qk30P56q83N11j12n28J429j387
$$ -1132 35 761 -867 720 -116 -690 756 -248 -31 -23 -253 503 -380 131 19 -509 920 -467
4731d67l6J459j768J020L61j693J826m50j036J339q24J07N71p66L19J05R8k11
$$ -467 -503 956 -812 208 569 -1124 702 252 -784 555 -269 -162 409 -357 -38 67 165 -46
4749d6l27Q15o64J41O12j297J061K31j393J389m09p27J368j044p8J008r19J71
$$ -46 -373 442 -222 -81 531 -766 295 526 -867 522 113 -614 754 -290 -368 640 -279 -108
4767a08L28m02K02L2k0k51L32J84p70P02j5p47J082o20m88J243q98j11Q71q89
$$ -108 220 -182 20 52 32 -219 113 297 -473 229 214 -533 549 -71 -559 684 -214 -325 546 -343
4787c43K50N39p67K67L84m59k2L97k93j59N67n02j35P54o64r8P82q12J70O22q64
$$ -343 -93 446 -321 -54 330 -129 -151 246 -47 -206 361 -141 -276 478 -186 -284 498 -314 -144 478 -386
4808c86L43M86q06L33L72o82L57L09o52L09L36o46K88L42o34L62K71o75M53K04
$$ -386 -43 443 -363 -30 342 -340 17 326 -326 -17 319 -327 -39 303 -331 31 302 -373 80 284
4828B84o47M08K34o38M62J55o70N49J45p04N75J02o96O55k9o63P62j56n44O82
$$ 284 -363 45 279 -359 103 258 -412 137 282 -422 153 255 -441 214 185 -478 284 128 -416 266
4848B66j85m24N73j44m51N70m6n09N29j8n94O97j31n99Q37l15n01Q71m53l40Q11
$$ 266 81 -343 230 86 -365 205 159 -350 179 161 -433 264 133 -466 371 56 -445 426 -27 -367 444
4869D44n58j47O31m71j22N24l67j50N22l33k30N88l65k96P51m89k18P59o63j7
$$ 444 -114 -261 370 -101 -223 301 -66 -216 306 -27 -257 331 -34 -330 421 -68 -286 473 -190 -207
4889b07O95p31R0N99o92J40M60n84J60M13n57P6M95n37L8N29o22J30N27p26K26
$$ -207 488 -243 -153 446 -246 -106 354 -230 -70 343 -214 -138 357 -180 -142 387 -235 -105 422 -304 -78
4910g8N02p51L18L59o82L61L31o89L59L33p06L89K57o90M75K09o99N30J11n97
$$ -78 424 -327 -9 350 -332 29 360 -329 30 363 -343 46 303 -387 88 297 -402 128 239 -358
4930c58N14k1m76N11K7n27M30R2m68L84J21o29N44R5p27P33o9o43Q43l50m77Q36
$$ -358 156 135 -341 170 197 -330 100 192 -276 108 229 -400 144 239 -488 245 176 -467 376 26 -451 385
4952C85m38k29N57l81k1L52k52j86L09Q2n07M66Q4o89Q34k52p18J175o13l86J016
$$ 385 -53 -282 275 -106 -127 225 -27 -213 96 178 -329 137 221 -468 366 114 -604 571 -42 -428 588
4973E88r37J82P01r04L51K62m55L37j12o4j2J46J01o21O93p8o55J058q02j75J216
$$ 588 -349 -167 534 -370 -19 243 -212 125 13 -51 -63 83 184 -437 256 178 -477 581 -221 -396 820
4994H20j343L92P40j240R58p3q37J009l99j74L11l53M30l55J92J8n67J106p61
$$ 820 -523 -131 609 -631 327 254 -583 426 27 -147 164 -189 241 -114 78 96 -471 635 -126
5013a26m09J308j317N59O93j718J447K0j209J333p71q9R11j023L91L8j02L99p99
$$ -126 -535 773 -544 15 708 -1010 437 457 -752 581 -190 -279 632 -391 0 38 -64 335 -464
5032d64P13j85m01J065j401N44J051j806J290j46j143J913j298l77J444j311O89
$$ -464 249 64 -337 728 -673 -129 922 -884 406 260 -883 1030 -268 -645 799 -512 177
5049A77O7q87J149o01J03R4o37J234r42o9R34j497J468j48j659K149j070m08J528
$$ 177 244 -643 506 -95 8 102 -535 699 -243 -312 622 -875 593 445 -1214 935 -135 -543 985
5068I85j967J071O87j567J128m91j3P98j196P52k46p8Q59j637J104L89j441J716
$$ 985 -982 89 776 -791 337 -154 -167 631 -565 187 -59 -137 722 -915 189 578 -863 853
5086H53j269k55K032k177O59Q78j614J693p62q67J610j068M35k1p15J299r77K54
$$ 853 -416 -671 1361 -816 -157 721 -893 800 38 -829 781 -287 148 127 -588 711 -266 -12
5104a2L43j184J803r93q30J917j772Q73P52k302K115k85j223J618j415N39Q72
$$ -12 331 -853 950 -43 -873 1044 -728 145 897 -1405 710 425 -798 820 -595 -56 816
5121H16j550R99m04O6P27j501J199k07o26J457j886P84J255k212J557l24j117
$$ 816 -734 265 -139 -73 654 -847 352 145 -481 976 -910 -126 1129 -1083 474 150 -967
5138i67K231j695j41J409j430R63k67p81J301q66L49q5o81J573j292P6R69j591
$$ -967 1264 -431 -572 837 -593 370 103 -678 623 -243 106 21 -660 913 -379 -303 666 -925
5156i25J633l70j557K203j213j95J340j910J208M51j432J192o81J89O01j156Q96
$$ -925 708 338 -1219 984 -229 -424 916 -994 214 665 -767 425 -256 -67 534 -622 274
5173B74m09L7P99j623J235J31j268J696j302r3J716k017P51O73j367J432p19n17
$$ 274 -135 -98 701 -922 313 444 -824 872 -430 -523 1193 -824 -73 600 -767 665 -54 -571
5191e71J144p66L22j97k83R01q63M31L7q22J501j050l54J390j461P84M60j586
$$ -571 573 -193 129 -68 -351 550 -313 118 155 -667 834 -216 -570 820 -641 143 603 -983
5209i83J525l20q17J149q82K86M89q36N33k02J48J96p84Q86m15k18R16j322P33
$$ -983 542 222 -595 554 -328 -42 447 -389 144 -58 90 286 -498 388 -27 -245 671 -651 82
5228H2N77j408J178k88p40J331r69j28R02q15L60k0k78M06k76K62k93k9O07q65
$$ 82 659 -749 429 141 -599 732 -237 -365 537 -278 82 62 -216 190 -86 176 -117 -146 461 -404
5248d04M33L33r33J003l44p25J229p21j61P85q84L86L53o54L30O0j38N2l9J37
$$ -404 29 362 -571 432 88 -637 592 -129 -290 495 -389 -3 350 -304 26 86 -52 0 -39 98
5268I8k87L28J0n70P14k56m22Q33o67JP37r16L15M36o95M31M7l84L36J3j87K1
$$ 98 -189 139 149 -421 293 37 -385 448 -219 -218 519 -397 -82 354 -341 90 137 -247 89 102 -85 -64
5290f4K11j59j66M12l73k5N45o15Q7N42p21L17L04o42M69J26n74M51M5l57K54
$$ -64 147 -12 -178 234 -139 -164 381 -234 -147 395 -326 -9 295 -347 122 248 -326 125 170 -187 67
5311F7P6l25K43J21m07K67J82m51K92J36m90M44M6m88M18K8m41M46o1l61M73j10
$$ 67 143 -182 61 182 -225 42 224 -227 65 201 -289 155 201 -287 131 159 -282 164 103 -258 215 105
5333A05l43M31q2l67M37j53k67M63j83k58M09j40k58M24j64k86M53j53l01M57
$$ 105 -238 193 111 -256 181 28 -239 224 41 -217 192 52 -206 218 54 -232 221 68 -233 224
5353B24j86k78M94k37k64N56l61j75N09l96l6M59m38rL64l38k7L39k47q1L43k78
$$ 224 38 -240 254 17 -247 309 -52 -227 282 -114 -150 309 -129 -138 226 -112 -139 200 -47 -128 215 -63
5375f3j06M38l71p4M71m63L3M18n09J40L65n04K23K22m25J98J95l33J19J88l40
$$ -63 -169 269 -102 -176 295 -168 -135 283 -226 -86 279 -225 -2 220 -205 -7 188 -145 -26 162 -178
5396a78J24K48l83J30L22m73J99K76n21K99K05n07L22J35m56L58P0m26L28R1m12
$$ -178 -54 194 -189 -59 263 -210 -11 265 -256 43 248 -259 63 198 -258 100 170 -256 72 163 -249
5417b49L36O2l76L39K0l75L97j7m15M18j5l34L75p0l02L46k4l36L64m5l33M27
$$ -249 87 149 -227 112 132 -243 154 137 -278 140 125 -209 166 96 -206 140 116 -220 144 99 -234 193
5439A93j06l77N32j93k97M87k49j83M66l59n9L74k58p2K28j27j07K35o6k99M17
$$ 193 87 -290 242 49 -248 239 -10 -193 273 -86 -145 229 -29 -101 127 0 -107 128 62 -237 180
5460A80j28l49O09l55k42O66n62k1N69o12K31K80n12L17P7k30O8N4pj50K29p9
$$ 180 52 -297 312 -43 -285 381 -181 -202 367 -245 -14 266 -246 71 148 -82 -14 40 33 -117 112 33
5482C3k96N82l60k61P31o48J21N17q69N30K13o94O27k04k36M62l25L2L0K4J30
$$ 33 -263 319 -41 -302 429 -219 -98 419 -450 80 293 -401 226 22 -214 248 -77 -45 -15 9 139
5503A39l81L99j35k51O74p40J24O85r82O02J41q52J019m23m07P97o03J91J93m63
$$ 139 -242 157 22 -229 445 -295 -171 514 -468 134 275 -577 442 19 -388 409 -194 -3 190 -273
5523b73M53k52J32rl64P01m97o6O24j013P89J61j083J135m00m49J013j014L00
$$ -273 180 -72 60 51 -313 388 -109 -175 449 -564 225 386 -697 438 38 -411 602 -412 -112
5542a12O06r19O14k54r4N28o55M41j91j49P04j031N44L71r80J119o06n34J411
$$ -112 494 -425 189 -65 -159 369 -286 155 -36 -185 519 -512 32 403 -577 542 -64 -598 813
5561H13j179K01O60j129R98k26o82R51o18L12Mn46Q69o55K05L42j017J235m31
$$ 813 -366 -165 495 -634 364 138 -544 407 -211 101 105 -441 428 -227 -22 320 -697 538 107
5580A07p75J370j158L61Q18j576J111P6q85J093q98J87O78r21O13l61K1O75j109
$$ 107 -668 702 -456 -95 723 -853 258 334 -551 542 -356 -169 509 -412 201 -160 -139 536 -573
5599e73P53o1o00J216j226J81J117j485R35j1j023J533r12k90R44r56P53j74o14
$$ -573 180 119 -481 735 -491 -310 807 -678 257 246 -777 756 -156 -446 498 -458 295 121 -493
5618d93R18o63L99L0q44J296q08j53R43j402J114J59j415J537o93l22J145j385
$$ -493 425 -238 161 191 -653 643 -165 -318 625 -777 337 496 -919 618 -75 -397 748 -637
5636f37O68M76r88Q33o07J60N74r49P72m12j16R08j336P25L90j122J308q10m02
$$ -637 31 507 -481 352 -255 -95 479 -470 302 -110 -226 682 -654 71 461 -661 647 -163 -565
5655e65J448j336L58N55j071J099m60m35Q35o95M68j37n03R46p74L12K85j069
$$ -565 883 -453 -95 460 -611 488 28 -407 428 -267 201 64 -439 507 -267 45 330 -739
5673g39J328n33o56J288j156M57O54j454J133j00o44Q93p94K84M03p23N96m17
$$ -739 589 56 -600 688 -468 -11 643 -811 322 222 -422 471 -323 -39 364 -359 237 -180
5691a80J36M77r63Q18k33m71J057j111K99Q23j248Q67j10p61J179p62j28O68o48
$$ -180 -44 433 -530 288 55 -416 641 -470 -171 652 -596 271 161 -600 579 -183 -311 357 -291
5710b91N00j80l20N84m97L52j33m08Q93p31O7O04r96Q28Rr21J115n18k10O97q32
$$ -291 209 29 -291 293 -204 148 15 -393 500 -231 -164 440 -556 272 281 -640 475 -43 -253 444 -388
5731c88M16K34n27M19k50J17J54m16M60l62J20M03q49O52P3o66Q23n02k45Q56
$$ -388 28 262 -265 154 -96 21 175 -241 219 -143 -23 380 -469 183 256 -410 413 -89 -334 522
5751E22q02J94L77n96M71j05k42L19j89J50j53J6K28m07L50l2m13O58l75k67O80
$$ 522 -280 -86 291 -305 166 61 -181 138 -51 99 -54 -38 190 -217 133 101 -312 346 -29 -296 384
5772C84o12J79L50o14M08O8l45L01j14m9J47j13K4q3J61l5k57L94k44q6L92m78
$$ 384 -228 -49 301 -313 95 163 -182 119 5 -44 103 -10 14 -69 92 57 -200 194 -50 -136 256 -222
5794b22J76L27n62L50Q5m06M02r3k51L02o5j22J33%j40R3J04k14P7J84l40J89
$$ -222 -46 281 -281 69 154 -252 150 57 -194 108 43 -79 54 54 -86 7 111 -103 -26 158 -182 7
5816GJ68m08L47kl33L60m0k96L35j19j52K78j44j17K11m4j78K28p9j17J78m9j61
$$ 7 175 -233 114 112 -221 139 99 -197 138 19 -133 145 1 -116 95 51 -127 101 22 -95 83 34 -127
5839a27K37o0k12K69q3j65K91j64j53L43j77j36L23k62l0K74k62k9L03k50jK32
$$ -127 110 50 -162 107 24 -141 150 -14 -167 176 -1 -137 186 -76 -106 168 -94 -123 180 -70 -71 161
5861A61k08k8K35j83m2K06j73o1K66k24m2K83k76K6K68l48J08K28l60J83J20k88
$$ 161 -47 -75 160 -23 -65 141 -32 -93 173 -51 -93 190 -86 -60 208 -140 -32 196 -164 19 139 -149
5883a49J38J06k21J30Q8j81P5J17k04P6J69k66J11J86l51J82J19k88K36K5k64
$$ -149 -11 95 -126 4 92 -89 -14 103 -101 -25 144 -122 -11 175 -176 6 125 -163 73 98 -166
5904a66K28J7k40K25L4k43J94K9k28J81N6k44K19M3k69K55K3k95K92o3j90K59
$$ -166 62 79 -161 64 98 -145 49 78 -150 31 87 -157 62 105 -164 91 114 -181 111 48 -142 117
5926A17p7j79K50r8j69K66n5j89K34m6k16L01j06j75K82j72n9K50k11oJ68j21
$$ 117 40 -139 111 13 -156 110 55 -134 100 54 -162 139 33 -142 140 -32 -91 159 -52 -58 110 -11
5948a1p3J79j05r9J99o3j65K91j47j73L38k45p8L99l76N4K94l48J25R8k11J73
$$ -11 -84 95 -10 -109 90 27 -138 153 6 -167 171 -74 -152 247 -129 -75 219 -129 -4 94 -117 56
5970E6kr1j0R9J4j68K21j13j55M01l44m9M43n21K06K47n12M40o2l26M10k00k5
$$ 56 54 -37 -47 52 66 -102 119 6 -149 252 -92 -141 302 -219 -13 234 -278 162 100 -226 184 -16 -41
5993d1J21j19Q6p8J25n3k25L71k60o8M18n58L32K25o53N96j26l61N78m61J6L88
$$ -41 80 -39 47 -31 94 41 -184 187 -73 -141 277 -281 51 276 -377 219 93 -268 310 -151 -135 253
6015B53m41K44p6p5K52l01K63j53j31N14o25K66L19p21P25k53m79Q76o06k2N21
$$ 253 -188 56 -20 -95 157 -144 119 -34 -165 349 -276 -10 309 -412 313 60 -419 457 -149 -171 350
6036C50p05M93lm20M91l13J73J7l41N21m19J18L53q00P40j16n63Q72o90R2O80
$$ 350 -355 138 135 -285 206 -107 66 83 -258 263 -156 -38 315 -485 255 139 -424 448 -242 -150 530
6057E30r78N15J89n98O37m57J3M30n24M15k79l5N34p64N01K4n81R68p20j36R08
$$ 530 -448 67 256 -342 295 -162 -149 281 -243 172 -107 -142 392 -372 129 153 -428 540 -180 -316 592
6078E92j013N59J48q37R81m45k68O24o40M71j5m78O52n67L07J65p42R24m62k12
$$ 592 -421 138 286 -551 430 -15 -283 341 -299 172 157 -321 331 -236 71 236 -506 418 -44 -256
6098b56Q20j093O34L57j077R75l49l29Q72r33L63L48o49O26m93O5N02p38N93k83
$$ -256 564 -529 105 462 -615 360 11 -318 554 -379 -16 332 -317 309 -184 -119 383 -355 238 -45
6118d5k60R20j007L22M85r67J003m59n33J154q98J89M58q68Q51k92l68O26n99
$$ -45 -305 615 -392 -70 415 -552 451 -8 -541 613 -285 -96 362 -506 345 53 -315 311 -288
6137b88M87o9n62Q62o87K33M12j033J022k15o94J077r08K33P00j153P56j1n06
$$ -288 199 130 -432 430 -257 -24 388 -645 377 162 -532 545 -363 -130 570 -583 173 162 -344
6156c44P54p08K27L65o17N98m71N0O00q85O07n6n49J004q47jQ12j019O62J6p40
$$ -344 410 -298 -71 294 -323 275 -196 -146 454 -431 176 120 -429 575 -272 -273 539 -480 182 198 -542
6177e42J005n32j46N17o02N37j74l39N56n30M03K9o72R30n47j09O95r72O48K03
$$ -542 463 -69 -215 302 -300 237 63 -276 280 -250 153 182 -490 440 -107 -216 479 -493 155 358
6197C58q97R17l98k45P16p65L33K00m40M70m38J51L15n56N18l08j26O76q21L86
$$ 358 -539 378 -20 -265 451 -314 19 219 -221 249 -189 -38 277 -279 239 -69 -195 481 -340 46
6217D6K60p47Q05l72l39Q35p08J40L08n27N16k19j65L30l41L34j45k12N02n12
$$ 46 306 -441 364 -8 -347 488 -220 -80 228 -299 217 -2 -167 163 -178 156 11 -201 301 -211
6237b11K56K05o72O98k10l97O76n73J52M32o93M37M3l17L52k69O7J19k07K45k72
$$ -211 45 250 -422 276 66 -331 345 -228 -76 356 -337 100 143 -174 178 -91 -24 95 -112 133 -139
6258a39J42K12m95M54j52k60N80n28P2M35n88L26Q3m13M49j81j24K47j81R3m0
$$ -139 3 215 -280 174 22 -238 342 -186 -114 321 -267 59 142 -271 178 -3 -127 120 -61 32 -8
6279hqR6j95K21r4j91M04l35L3K99m40K72J04l95L91j00k00K85j53n6J90j72L8
$$ -8 -16 80 -115 106 12 -179 225 -110 -77 222 -218 54 158 -237 154 54 -146 139 -14 -70 120 -52 -14
6302a4L4J5k0n5J46j81P3J73l13K01L2k73L11j12j95L29j51r8K25j36l3J42j03
$$ -14 20 35 15 -40 106 -75 -2 171 -142 59 91 -182 129 17 -178 151 0 -98 127 -9 -42 100 -3
6325cj5O1j2r0R8Rj13J31n5j33K20o9j54K50j30r3K48j85m3J97k02RJ78j63K6
$$ -3 -18 43 31 -59 39 48 -65 66 11 -122 98 29 -125 125 -5 -98 150 -35 -78 119 -83 -74 104 -59 -33
6350c3J26j52J2J44j58M5J03j03n6J82j65l0K22k07rK28k20J2J76k22P0J40j93
$$ -33 93 -59 -47 97 -61 -16 87 -16 -72 110 -55 -85 137 -70 -79 149 -71 -59 117 -105 -35 105 -88
6373h8J02J01j73Q2N8j57Q5O3j36M2J08j74N4J28j92O0J44k43J65O8j96J40K5
$$ -88 14 115 -58 24 82 -75 10 73 -63 -21 87 -87 -33 95 -97 -37 107 -136 29 97 -99 41 66
6396F6j66J59j8j30J43k0j14J25J2j19O6N8j25J17M2j76J41Mj88J94l2j60K54
$$ 66 -100 59 41 -89 54 34 -80 45 57 -62 4 62 -63 54 96 -80 61 65 -123 71 39 -121 133
6419A33r7j16J93j12p2J15l4q8J67o9j17J60k9j27K02j15j02K29j49k5J58j32
$$ 133 36 -80 113 1 -71 44 10 -78 89 20 -97 63 34 -93 109 -6 -108 121 -28 -53 105 -27
6441b7qJ32j34rR7n5o7J43o6q5K00j35r7K40j80j2K17k52Q4R8j88J29L6j03N2
$$ -27 -35 97 -37 -46 51 -4 -71 72 6 -79 121 -14 -111 129 -51 -63 154 -98 -14 84 -104 25 61 -42 10
6466A0J3m3%O9m4r8K27j30q6K68l11R0K01l46K40M1k77K80j17p6J87j15K4mk9
$$ 10 23 -20 -20 49 5 -93 134 4 -82 186 -125 -35 166 -180 60 101 -176 104 -13 -89 98 -17 7 3 -26
6491b6O9j35J66q0j00L04l21Q9K52m50L46Ol73M47j92j52L49l24J61N8k00J87
$$ -26 43 -92 74 -6 -106 198 -123 -34 218 -232 114 120 -253 194 2 -150 199 -125 36 94 -106 81
6513H1j47J07K6j78K58k36L4K90m66L52M0m52N41l04j30N29n49J81J66l27L45
$$ 81 -66 41 67 -111 147 -89 -55 235 -231 121 161 -291 250 -54 -184 345 -204 -23 143 -184 161
6534A61j91n9K44k99K59j45m9L45n16K85J09m64O41l57j99O14o25K58K55o27N87
$$ 161 -30 -89 155 -144 115 -30 -79 266 -250 35 144 -320 321 -36 -235 379 -246 12 267 -360 227
6555B27j75k51M33m27L02Nl00M27l82J43K14n38N61k26k56O41o87K65L96p82N97
$$ 227 52 -199 234 -193 109 114 -186 241 -141 2 216 -322 239 13 -243 398 -289 -24 372 -410 187
6576A87j26l55O50n79J54K72m42M50k93m9M15n88M77j19l84P33o22J00M87p88
$$ 187 61 -294 356 -223 -69 203 -239 211 -82 -131 284 -304 173 54 -330 403 -219 -119 368 -420
6596d20O93j49n70Q45n72O6M12o45N60j52k94M94n40L83N6n28O69m49K3N22q40
$$ -420 273 124 -446 399 -173 -107 305 -340 220 68 -226 268 -272 111 167 -361 308 -141 -118 404 -436
6617d36O60j7o06Q07o10j1O66q24M26Q5m30O15n02J17L08n22N29l16j36O42p79
$$ -436 224 207 -399 408 -202 -213 453 -371 55 140 -290 325 -177 -60 248 -274 255 -61 -197 445 -334
6638c34M42R3o27Q87n41j99P61q54M67J71o91P36l53j17M38n89M84q6l55N68n49
$$ -334 108 201 -426 461 -80 -279 482 -372 95 266 -425 311 -42 -159 279 -310 174 88 -267 301 -248
6659b48L25J80o95P70l53k44P38q47M06L27q03P09k68k65O53o53K72J72m13M88
$$ -248 77 257 -438 332 -21 -265 473 -374 32 359 -444 265 -3 -268 385 -268 4 176 -237 251
6679B51m04M3L83n69N05k07k95P57p08J71L74p07O64j99m47P68n47J00K99n53
$$ 251 -153 -110 273 -296 209 2 -293 464 -244 -73 301 -406 258 59 -388 380 -167 -67 232 -321
6699c21N08j79j93M12m54L59k9m05O03m73J44L46p49O21m7n01O94n13M8M48o08
$$ -321 187 8 -185 227 -227 132 103 -302 301 -172 -28 318 -431 190 143 -358 336 -177 -129 319 -289
6720b89M15m9k69M51m18J40J63l51M09k95j3M17n86L67O0m56O10m05q6N16n61
$$ -289 126 77 -192 259 -159 -19 144 -207 202 -93 -106 311 -275 92 152 -304 306 -99 -185 331 -230
6741b30L11P1m24M55k02p3K57l33K77j06j26K90l37K44N7m14N26l06r6M22m95
$$ -230 81 152 -272 183 -19 -92 165 -168 109 3 -123 167 -170 74 131 -283 243 -63 -159 263 -232
6762b32K52J97m80L99j00k06L83l19J11Q3j52J87k15O9J37k70K98j63r8L34l79
$$ -232 20 217 -263 136 36 -170 213 -106 5 88 -64 123 -92 -23 114 -156 142 -21 -119 215 -164
6783a64J27J97l63L05m6k32L29j71l8J25j57J06Ql3L7r6J19p4p6K01k16P7J47
$$ -164 -37 160 -203 102 56 -176 153 -18 -56 69 -88 18 26 -7 30 -66 53 -21 -97 104 -112 -35 112
6806A12k85K52ok52L25j26j07K18k12M0J37j59P9j2kJ7n1P7j10P1O4j68J73n6
$$ 112 -173 79 73 -179 146 20 -87 131 -81 -41 96 -63 16 4 2 19 -32 45 -65 6 70 -98 75 19
6830A9j15J87j25q3K32j58j1J57j57L4Q3j18M7L4m3J4K2j7l6Q7m8m6J10q4m3J38
$$ 19 -96 91 -34 -117 115 -43 -54 103 -54 -20 63 -55 -8 26 -17 -3 19 2 -34 53 5 -41 69 -15 -58 80
6856H0j15j8J39j34L2J39j81K6J06j53R6J8j05O1L4q1N2L2o0L5N2j03K0J23j71
$$ 80 -35 -53 86 -48 -16 123 -58 -32 74 -79 17 35 -70 -9 25 -56 -4 28 -32 3 55 -48 -28 95 -76
6881g6K3J35j60Q3Q9j75J37pj33J44m9o0O7ln3N3N2j20O2M7j23L4R5j34R2K5j17
$$ -76 -53 82 -78 5 94 -81 56 49 -84 60 11 -49 18 15 -38 15 67 -53 9 56 -67 -33 62 -72 20 45 -72
6908g2J08kj38J75p3o8J61j20k3J06n2l0M1k5m2O3nq3J29k2j04J37p0q8J87j08
$$ -72 36 34 -104 71 -2 -70 91 -29 -52 54 2 -28 13 -12 -54 9 4 -79 50 28 -76 61 -9 -97 90 -18
6934a8l0J37j16J1N3m9ON2m1n0R1jj42J71p6o8J63j52QJ53j52M9P5j32P8Mn0K4
$$ -18 -48 89 -27 -16 37 -12 -6 46 5 -45 46 45 -97 74 -2 -70 93 -59 -51 102 -50 -1 74 -58 20 24 -26 -2
6962bK7k0l8R4o8o5J67j41k1J70j90N3J48k39J83Nj54J95j14l5R9p3K7m1N3%j14
$$ -2 25 5 -33 61 -7 -72 95 -46 -67 103 -87 -34 114 -125 58 63 -91 104 -10 -45 54 -19 8 -33 20 20 -94
6989i4J98j23m3K05k79J43J18k90K85r3j62K93k07lJ52k26J50j8n8J29j47J18
$$ -94 104 -19 -62 143 -136 7 125 -165 120 27 -135 158 -49 -52 100 -126 24 6 -52 77 -70 48
7011D8m4j11K67k66J08J37l61L73j12k38M23l34L8K60l89K75pk09K77k37J27N6
$$ 48 4 -107 160 -106 2 139 -222 151 39 -199 224 -110 -72 188 -201 74 67 -142 135 -102 25 81
7033H1k06K62k39O1K10m25L53n3k84N03l87J4L86n24L51l7k92M42l07N1J87l17
$$ 81 -125 137 -102 -41 169 -256 97 44 -240 263 -124 -110 276 -248 103 66 -226 216 -91 -40 147 -170
7055a70L18j74j16L63m27L03J5l82N69m08l0M47o23M28O0m94N61l14n6L77m56
$$ -170 148 -26 -142 221 -206 97 112 -270 299 -109 -139 308 -315 113 173 -321 240 -74 -130 247 -209
7076b09L13k5k64M20m13K03J47m62N44l13j15N12o53L63J65n56O35l55j64N68
$$ -209 104 79 -185 235 -178 25 172 -290 254 -59 -174 338 -315 48 213 -343 292 -63 -227 341
7096C41n85K96J27m32N01l42K0K91m55M31k18k13N97o05K87K14o46P02k93l18
$$ 341 -244 52 179 -253 248 -94 -74 217 -238 193 -25 -238 359 -246 41 255 -391 311 18 -300
7116c00O55o08K58K17n95N98k48j42M67n85L94kl75N35m80J73L20o72O09j69l47
$$ -300 355 -253 5 222 -373 225 -23 -165 302 -283 111 109 -266 269 -211 -38 282 -390 219 50 -297
7137b97P04o48J52M41p12N63j58l44O46n53J92K10m74N38l49o6M73n97M57q8m61
$$ -297 407 -241 -89 352 -360 203 45 -299 347 -206 -14 196 -278 260 -89 -155 318 -279 178 90 -371
7158c71P60n40K0M63p33N85m0n03O73m67J02L21n88N08j42k23M37m95L23Q4n05
$$ -371 389 -151 -131 332 -401 184 144 -359 314 -153 -51 270 -318 190 48 -175 262 -233 90 174 -331
7179c31O37m01n1N20p24M44J22n87O93m16r1N18n89L47K7l55N24l99M4K77m75
$$ -331 306 -95 -146 374 -350 94 216 -371 322 -94 -185 333 -256 91 118 -237 287 -112 -68 209 -266
7200b66M85k77j49N34n97L09J57n62O72l35k01N70n88K89J47m74M93k65o0L56
$$ -266 219 -58 -207 327 -270 39 196 -366 306 -29 -230 340 -248 41 188 -286 207 -58 -118 238
7220B38m64L49n9k76M77m62K05J91n42N23j57k37N37n43J80K84m94M02j43k01
$$ 238 -226 123 64 -212 265 -197 8 199 -343 180 23 -214 323 -220 -40 244 -250 152 9 -192
7240a92M43m26J85J18l10L77l11L0K81m03L62j19k55M76l81M1L12m85L95n4l10
$$ -192 251 -175 10 128 -182 195 -116 -86 195 -208 154 35 -220 256 -125 -84 228 -257 138 84 -226
7261b26M19k63J5K07l09K54p4q1K18k89K02qk59L82k49m3L15l92K57O3l30L61
$$ -226 193 -70 -55 152 -157 97 23 -58 160 -129 73 65 -194 188 -61 -104 211 -181 76 139 -191 170
7283A70k10n2K62k74J24M0j57K01j44L4O2j41J76j38j6K20k82J54N9k38K97j24
$$ 170 -40 -92 170 -104 20 60 -97 104 -40 -6 56 -85 91 -47 -63 157 -125 29 88 -150 147 23
7305B3j60K81j95M3R0j70J39k0p4Q6p8Q7m8l2P8j17Q4O3j70J47n5j05K05j37l1
$$ 23 -137 144 -51 -8 82 -88 51 31 -43 43 -35 52 4 -28 50 -67 17 80 -90 57 2 -103 102 -35 -66
7330f6J68j90Q6N9j29J10j6o8P5l4k3K5qP2j21J03k9q7J56j11k2J35j49M6P5j06
$$ -66 102 -88 -2 57 -72 38 22 -46 29 -5 -28 -3 -11 61 -60 43 14 -73 83 -28 -50 85 -64 -18 57 -49
7356d9O8L3j12R5ro5P1k0l5L3nqj8N3m4j9O2n8J7J00j40M5N6j13J19k8j05J37
$$ -49 19 52 -60 35 26 -39 32 12 -23 10 5 -3 -21 32 -12 -31 31 -27 -10 90 -50 -5 51 -62 57 29 -76 61
7384F1l8q2Q5n0J0K5K4k0k8L5m5J9P0j29R5N1j36J01k8q2J32p4l4J10p3k5P9n5
$$ 61 23 -59 26 -24 -14 11 35 15 -13 22 -23 -4 66 -63 32 83 -53 48 20 -62 70 -4 -38 72 -1 -26 53 -2
7412bK8oLk7J1J2n0P9j7o7J01m2r0J43j04k4J07r7K2O8p5M7Ml9J8rJ9l7K1J8n2
$$ -2 26 20 23 -4 7 19 -31 48 31 -36 65 23 -67 76 -28 -52 55 -42 -20 48 -27 20 24 -15 3 -6 13 -24 -3 15 -37
7443c7J08r5k5J39j71N5R0j30Q6Nr9R9l6k0N4l3J8m0N1no5J10j05j0J43j68R7
$$ -37 71 -24 -49 90 -81 -26 64 -66 20 25 -74 25 -11 -31 23 -10 8 -32 19 14 -51 59 -46 -56 87 -81 16
7470A6K0j42J87q0p7J43p7J0K6q1R9m9M3k4p4J49j23RJ53k37J42L8j86K20j29
$$ 16 36 -106 81 1 -76 67 -10 0 26 -55 44 -5 38 14 -60 89 -34 -25 128 -109 33 71 -115 105 -24
7495b4m8J82k08J07L7j38J65j07L0N5j27J56j18j2J98k81J78L5k43L26k02o3K94
$$ -24 -72 110 -98 9 46 -92 73 -34 -4 51 -76 80 -38 -50 148 -133 45 80 -163 163 -39 -102 192
7518A92l06J37R6k49K20j22l7J84k25J52m1p4K33k93J62R6l19L63j97j02L45l73
$$ 192 -114 23 119 -130 90 -32 -69 115 -110 42 1 -73 160 -133 29 125 -194 169 -28 -130 215 -158
7540a58J76J63l68L26j17j53L08l07J50M1j84K76k68R8J61l57L51j47j57M25m48
$$ -158 18 181 -187 139 22 -131 177 -130 20 61 -123 153 -115 -17 144 -213 138 -9 -166 259 -189
7561a89J91K01m83M68k13j68M35l79J05J62l26L73k25l7K81m02L42p2k80M99m44
$$ -189 2 203 -280 188 -25 -193 242 -137 -32 130 -196 177 -48 -85 196 -206 136 64 -216 283 -161
7582a61J20K79n41M79j14l05N17m37J15L04n29M21j37j72M06m62K58J03m27N06
$$ -161 -41 238 -303 176 62 -243 274 -163 -48 256 -273 148 11 -161 245 -217 41 144 -283 223
7602B23l36K4L68n63M22j0m32O28m61K3M27o14M40o6l46N60m45J50K23m67M86
$$ 223 -113 -89 279 -284 138 128 -304 324 -137 -114 313 -301 139 73 -273 287 -158 -8 215 -252 234
7623B34k73j21M63n45L42O4n07O21l70q4N00o26M43K1m83N63l58J8L51n41M40
$$ 234 -39 -160 303 -242 100 164 -343 278 -92 -176 324 -302 141 162 -321 242 -116 -98 253 -288 152
7644A52j02k59M95m78K07K07n24N50l07j73N91o41L15K02n55N96l19j72N46n68
$$ 152 50 -209 286 -192 15 222 -302 248 -59 -232 359 -282 33 235 -320 276 -43 -215 331 -237
7664b37K89R5l98N20m08O2K80n03N08k06k40N79n52K04K26o06O20j99k90N60n43
$$ -237 52 147 -251 269 -139 -77 203 -300 208 2 -238 341 -211 -7 219 -387 233 34 -256 304 -239
7685b39K52K13n47N47k89o5L97n15L37J3l59N29m38J10L29n99M81q2l41O02m97
$$ -239 13 226 -321 226 -63 -128 269 -246 91 104 -255 274 -164 -54 275 -324 157 75 -266 336 -161
7706a61Q9L38n51M43j17k61M63l96J51J74m09M67k90m7L72n04L49Kl89N51l74
$$ -161 -72 266 -285 158 41 -220 243 -153 -2 172 -237 230 -60 -107 265 -239 110 112 -277 274 -100
7727a00l3L82n11L85j9l64M95l45M4K60m03L34j09j66L45l69K06J12l53M12k53
$$ -100 -133 249 -262 123 104 -260 235 -110 -66 194 -209 125 16 -150 195 -174 32 144 -209 203 -50
7748e0n2L48m33K42R8l39L80k33n4K71l45J89L1k22L19k11M0J29k89K86j03j53
$$ -50 -102 246 -187 55 153 -186 194 -39 -93 178 -167 22 53 -169 150 -61 -21 108 -181 105 2 -151
7770a51L59l53J53J20l45L63j44j72L55l04J19J23k74K54j14n4J72k39J66J4j64
$$ -151 208 -145 8 128 -217 146 2 -170 185 -119 0 123 -151 103 -11 -65 107 -132 34 48 -116
7791a16K56k29N7J81l06K27l2j80K90k03J1J66k34J52K0j28J66j38L9M1r3J14
$$ -116 140 -89 -32 149 -157 70 38 -142 148 -55 -44 122 -112 40 60 -68 98 -40 -1 40 -53 61
7813F1q7j6J24j73J34Kj69K23j13p1J96j73Q1K6j22J29n8k6Q5p8L7%k4P3o8O4
$$ 61 -26 -42 82 -91 43 45 -124 99 -14 -85 111 -62 19 45 -77 52 -6 -32 53 -25 12 12 -12 61 -7 57
7839E7j2j02J15n2m5J21j06K3Q6j73J14J0r5R1m1j7Q5r0J2L4j7L9p4N3j0m8Q8
$$ 57 45 -57 58 6 -39 82 -24 -1 85 -88 26 36 -59 32 -9 -26 59 -31 -19 15 -2 37 -37 16 6 -42 46
7866D6q0L7O9j34Q2K4j10J23l1p5R6p1PM9n2M2lj4Kj8Plk4N9n8K5M6p9N9j2m7
$$ 46 -34 3 72 -62 20 44 -66 57 26 -49 47 -24 -17 32 -20 22 19 5 7 -11 -4 -7 -31 28 -30 -5 41 -38 21 9 -38
7897c8R2n8l1Q3r1L2L6m8M5k5kRj2K6m5L7%m7P5k7p5R5m3k9J02p7K1M7j14R6J
$$ -38 54 -4 -35 48 -43 -11 25 -23 22 -3 -5 4 -8 18 -27 10 10 -37 38 11 -64 31 -12 -41 61 -16 5 52 -62 34 35
7928C5p4Q2l6j5J1lJ8n6L7J4l6O2n9nQ3j14N9K8p6P9l4m4Q9m6MJ2k0K9k9M8l5
$$ 35 -39 43 7 -8 3 0 18 -38 -1 13 -23 39 -20 -25 58 -56 3 31 -45 34 0 -44 45 -1 3 15 -5 24 -5 43 8
7959Hm8Q6r1K4R0j33J37l6r5J43j09j4R7j21Q5rm0O0q1O0j5l5Q9j17M5Q5j43J28
$$ 8 -40 46 -45 -21 69 -64 73 37 -58 85 -24 -38 59 -62 23 14 -26 34 -47 13 -2 -37 52 -65 -20 65 -78 50
7987E0l1j11J58j03RP7j43J26k2m0R2j02N8jj01J52j22K9J25k17J85m7j30K42
$$ 50 19 -92 66 -37 -28 49 -94 32 10 -30 62 -40 18 17 -84 68 -54 -25 100 -117 68 21 -109 133
8011A33j76K0J29k26J55pj12J76j57O1P0j73J88j24j3J49k27J99m1j66K68k17
$$ 133 -43 -23 106 -120 35 28 -84 92 -65 -4 66 -107 81 -43 -56 93 -134 65 24 -142 126 -91
8033i1M4J99l13K60o5j65L07k44O1J26k65K63j10j02K69l34K23L7k66L38k42J0
$$ -91 -47 152 -161 99 34 -131 176 -68 -7 119 -146 117 7 -95 174 -160 63 100 -166 172 -70 -60
8055f0K61l90K86Kk94L91k59LK62l60K36j3k09L15k92J36J38l42L48j93r1L42
$$ -60 201 -189 97 99 -195 196 -63 -60 202 -158 78 65 -144 171 -121 15 153 -189 159 -34 -125 217
8077B17m13K56P7l65M47k86m8L48m44K87mk87M40l09L7K24l61L17j15j83L92m07
$$ 217 -196 60 137 -228 219 -67 -115 233 -211 76 72 -215 225 -84 -47 177 -184 133 18 -165 227 -180
8099a80J85J62m35M82k44j54M64n14K58J62m16M44k34j12L70m63L09Ml12M44l62
$$ -180 5 167 -268 214 -30 -184 280 -234 24 186 -230 214 -20 -132 238 -225 84 88 -224 220 -142
8120a42Q0K64m59M17j20k67N46n22J87K37n36M96j57k20M76m94K52J16l80M67
$$ -142 -62 202 -257 160 40 -227 319 -203 -16 221 -315 181 24 -196 280 -214 38 154 -226 241
8140B41k97m7L58n22M02o3l17N24m26Q2L27n65M92j15l34N51m72J67K36m91M51
$$ 241 -56 -103 255 -267 135 72 -245 279 -147 -65 262 -303 189 74 -260 291 -181 -14 222 -269 182
8161A82j66j68M36n09K64J27m24N29l47n8M35n99M25l3l43N47l96K7L44n31M06
$$ 182 16 -152 284 -225 39 166 -258 271 -76 -134 301 -298 127 94 -249 298 -98 -71 273 -258 148
8182A48q5l20N25l94J15J92m40M58k12
$$ 148 63 -257 268 -126 -11 181 -259 199 -13
8191a3
$$ Imaginary data points
##PAGE= N=2
##DATA TABLE= (X++(I..I)), XYDATA
0@%%%%%%%Qj6J6k4L3m1N6p3R7j21J46j85K28k74L30l92M61n44O44p54Q75j010
$$ 0 0 0 0 0 0 0 0 8 -8 8 -16 17 -24 32 -41 56 -65 81 -104 124 -150 180 -212 249 -295 349 -405 470 -540
29e40J160j329J522j738J973k230K517k834L181l564L984m441M942n492O090o744
$$ -540 620 -709 813 -925 1048 -1182 1335 -1499 1682 -1882 2102 -2339 2603 -2889 3201 -3543
45c543P458q237R084j0010J1032j2158J3394j4751J6256j7935J9815k1936K4349
$$ -3543 3915 -4322 4762 -5248 5784 -6374 7020 -7731 8525 -9410 10405 -11531 12818
58A2818k7121L0341l4137L8693m4279N1313o0481P2992r1207J20557j77985M65693
$$ 12818 -14303 16038 -18099 20594 -23685 27628 -32853 40139 -51068 69489 -108496 357197
70C57197r22949K72615Q31514r74114Q98307n41458m66523R66944k59316l25890
$$ 357197 -565752 -293137 538377 -435737 462570 -78888 -545411 421533 162217 -163673
80a63673O0475L9204K86791k88103K14380m28584M6238R84859j066363r3586R07404
$$ -163673 -103198 -63994 222797 -65306 149074 -279510 -233272 751587 -314776 -408362 499042
91D99042q68692O66435n9975j076086J334260j52817q67843P67225l76630P4762
$$ 499042 -369650 296785 236810 -839276 494984 342167 -525676 241549 -135081 -60319
101f0319M38211n96714L0951K54389J56360k27581k77700M46568k60655K14214
$$ -60319 377892 -218822 -187871 66518 222878 -4703 -282403 164165 -96490 117724
111A17724J68343r62551Q94789L00854j086196P71902j95062l27287R18165q60901
$$ 117724 286067 -676484 218305 519159 -567037 204865 9803 -317484 600681 -260220
121b60220j20139Q19864n36693O8528J00823k78404K82323Q0066j28066l17053
$$ -260220 -380359 439505 -97188 -28660 72163 -206241 76082 156148 28082 -288971
131b88971L03923L44633o21157K84914M2933l70724P96063n78944m26105J017379
$$ -288971 14952 359585 -261572 23342 66275 -304449 491614 -87330 -513435 503944
141E03944n71666j31073N09959o48547L76560K98962o02849K16371J39760r6139
$$ 503944 -67722 -198795 311164 -337383 39177 338139 -264710 -48339 91421 -4718
151d718N3933o5172o1279r194L54038k64689l80870O64503k31849k68601M96425
$$ -4718 49215 -15957 -77236 -86430 267608 2919 -377951 286552 54703 -213898 282527
162B82527n51344K11831M98925p95774L03004L20739n18291L87713m3561l64714
$$ 282527 -268817 -56986 441939 -353835 -50831 269908 -248383 139330 95769 -268945
172b68945L78476L6102k36912O729J50667m4670n8231J64988l10788J24063M13924
$$ -268945 109531 145633 -91279 -84550 66117 21447 -36784 128204 -182584 -58521 355403
183C55403o08148J44892M07363n50870L35657R3681n18295N13964l1847l84795
$$ 355403 -252745 -107853 299510 -251360 84297 177978 -340317 173647 141800 -242995
193b42995L75388j23045j42144K89442j40324j88415K23808J04274k85855Q1338
$$ -242995 132393 9348 -132796 156646 16322 -172093 51715 155989 -129866 -48528
203d8528J88751k79253K04983N8221l99963M23230j298m27917M49555j18945k73899
$$ -48528 140223 -139030 65953 124174 -275789 147441 146143 -281774 167781 48836 -225063
214b25063M45461k28592j88502L63096j64211j06467K03926j31605n7386K23609
$$ -225063 220398 -8194 -196696 166400 2189 -104278 99648 -31957 -89343 134266
224A34266j26732j89407L15043n4716k80650L33993r4650k24337L81474k20416
$$ 134266 7534 -181873 133170 78454 -202196 131797 37147 -187190 194284 -26132
234b6132j52126L93835k84420n6349L32231l15017Q663K97142k77152k7901K52876
$$ -26132 -178258 215577 -68843 -125192 207039 -107978 -99315 197827 -79325 -107226 145650
245A45650j81510m8939K05646j75642k6244K44749k44074k6235L03749k89097
$$ 145650 -35860 -84799 120847 -54795 -81039 163710 -80364 -106599 197150 -91947
255i1947j1350L03085l08648L0674K60730k97547P2268J92359k74278J17314J48282
$$ -91947 -103297 199788 -108860 -78186 182544 -115003 -42735 149624 -124654 -7340 140942
266A40942k80982J30931J64716k86916J00244J85272k68429Q5476J67384k58479
$$ 140942 -140040 -9109 155607 -131309 -31065 154207 -114222 -28746 138638 -119841
276a19841J17405J32316k74193J68194J09564k98916J97504J06422l02325J91384
$$ -119841 -2436 129880 -144313 23881 133445 -165471 32033 138455 -163870 27514
286B7514R9643k73970J80046O9709k43161J94451L2251k38863K26616J3332k54908
$$ 27514 127157 -146813 33233 102942 -140219 54232 86483 -152380 74236 87568 -167340
297a67340K44287J7495k57590K30821J6459k27270K14536j2751j93635K26050
$$ -167340 76947 94442 -163148 67673 84132 -143138 71398 58647 -134988 91062
307I1062m7594j88771K51317o0652k00837K62294n7860j99679K51370o2317j70399
$$ 91062 43468 -145303 106014 45362 -155475 106819 48959 -150720 100650 38333 -132066
318a32066K35151r0804j30742K38613j27714j15447K56009j38860j23732K56607
$$ -132066 103085 12281 -118461 120152 -7562 -123009 133000 -5860 -129592 127015
328A27015j26179j21482K36707j24022r5326K21718j47855o3891K26888j80267
$$ 127015 836 -120646 116061 -7961 -103287 118431 -29424 -93315 133573 -46694
338d6694m9504K41961j93577n2967K41508j82513m8650K17335j76840j9441J96108
$$ -46694 -96198 145763 -47814 -100781 140727 -41786 -90436 126899 -49941 -69382 126726
349A26726j98746J4028J97916k26846K9003K03041k32430L2761J88625k15351
$$ 126726 -72020 -57992 139924 -86922 -57919 145122 -87308 -54547 134078 -81273
359h1273L9225J56593j93994N5794J27970j95003P5446J32659k19034P4695J58575
$$ -81273 -42048 114545 -79449 -23655 104315 -90688 -15242 117417 -101617 -26922 131653
370A31653k30202O8699J54062k26976R6381J17828k29837J38404P7496k21707
$$ 131653 -98549 -29850 124212 -102764 -6383 111445 -118392 20012 97508 -124199
380a24199J64089M1950k05163J65196M0030j89441J25152O0913j60211R4126N6229
$$ -124199 39890 81840 -123323 41873 81903 -107538 17614 78527 -81684 12442 68671
391F8671j65298J30017N4530k22524J77039N6552k43924K10130N891k18949K42170
$$ 68671 -96627 33390 87920 -134604 42435 98987 -144937 65193 71084 -147865 94305
402I4305m8091j74424K14918p3791r3777J65563r6141p0122J60205m5355j33969
$$ 94305 46214 -128210 86708 12917 -80860 84703 -11438 -81560 78645 33290 -100679
413a00679J36235L1004j61643J43137k870j75382K36377o9350j87361K73183j28642
$$ -100679 35556 66560 -95083 48054 45184 -130198 106179 36829 -150532 122651 -5991
424e991r9690K52243k11867k2316K26709j80059j5715J12530q0225J9058M9132
$$ -5991 -105681 146562 -65305 -87621 139088 -40971 -56686 55844 -24381 -5323 43809
435D3809p3493l1554J44385n4918j51362K05161o3540j22924K45606k03930m8847
$$ 43809 -29684 -61238 83147 28229 -123133 82028 18488 -104436 141170 -62760 -111607
446a11607K95819k60775J4349J78014k31669J57478N5815k36328J50519O9370
$$ -111607 184212 -76563 -62214 115800 -115869 41609 97424 -138904 11615 80985
456H0985j07613l188L3906N668k7976Q4629j11087n2897K56643j98267n7236K32701
$$ 80985 -26628 -29816 4090 9758 -18218 66411 -44676 -97573 159070 -39197 -96433 136268
468A36268k57791J39267J44869l65744K28525J00009k35031J71859q5734n1884
$$ 136268 -121523 17744 162613 -203131 25394 125403 -109628 62231 -23503 -75387
478g5387J93170j20125p2655O4398P4244m3214r3586J22226r1047L2407J58987
$$ -75387 117783 -2342 -74997 -10599 63645 20431 -73155 49071 -41976 -9569 149418
489A49418l12023J35496J96010l01618J94989l6361j97693L62005j72268j84523
$$ 149418 -162605 -27109 168901 -132717 62272 25911 -171782 190223 17955 -166568
499a66568K58031r5636J4532K7631j27693R8424M4750j1173j18244J6134J91830
$$ -166568 91463 -4173 10359 37990 -89703 8721 53471 42298 -75946 -59812 132018
510A32018j84943M8127O1995k29567L23599o1182l19944L45990j03423p5321K15051
$$ 132018 -52925 -4798 57197 -172370 151229 90047 -229897 116093 12670 -62651 152400
521A52400l12175J20640K19096k51434L7463K4485J4450O2711j00337J6892m4842
$$ 152400 -159775 -39135 179961 -71473 -34010 -9525 4925 67636 -32701 -15809 -60651
532f0651J23212M6606k84136K08054L8421j65770K48569k64229k1761L82316l31335
$$ -60651 62561 109167 -174969 33085 71506 -94264 154305 -109924 -131685 250631 -80704
543h0704k055J66220j86320K13353o8927k00763K05295P620l2759o4844j4182
$$ -80704 -82759 83461 -102859 110494 41567 -159196 46099 53719 20960 -43884 -58066
554e8066J23847p8137O6886r4147j02357L36995j96650j37197K52078k19229J63188
$$ -58066 65781 -12356 54530 -39617 -141974 195021 -1629 -138826 113252 -105977 57211
565E7211Q8136l85463K85581Q4901k23805J45663j16934L0911J57546j51930k4074
$$ 57211 145347 -240116 45465 130366 -93439 52224 -64710 -33799 123747 -28183 -52257
576e2257J1867J08363o375j67372J40886o4617K9137J58416l45434J53862K21547
$$ -52257 -40390 67973 61598 -105774 35112 -29505 -368 158048 -187386 -33524 188023
587A88023l08524J65391m3392j38228L28981k03324j32446K22891q6021L9439
$$ 188023 -120501 44890 1498 -136730 192251 -11073 -143519 79372 -6649 32790
597C2790k2424r1836J02215J3452K2732j33091K608K12712j80014K6091N4545
$$ 32790 10366 -81470 20745 34197 56929 -76162 -73554 139158 -40856 -14765 39780
608C9780j82635K90443q3189k68354L07842q6627o4734J56868k36183J07896J52290
$$ 39780 -142855 147588 64399 -203955 103887 17260 -47474 109394 -126789 -18893 133397
619A33397j84424K3109J3135L1478K8765o8411J4889n4684J30660J7236k41456
$$ 133397 -51027 -27918 -14783 16695 45460 -22951 -8062 -62746 67914 85150 -156306
630a56306J98571J5934j36941J96747k07048L033K75426k65431J8765J30543j47818
$$ -156306 42265 58199 -78742 118005 -89043 -86010 189416 -76015 -57250 73293 -74525
641g4525J39354l1076j32764J18305K2771k3692o3439K3726O3273o4793P7023
$$ -74525 64829 33753 -99011 19294 42065 18373 -45066 -21340 41933 -22860 54163
652E4163r3563n3478K41893j76008o5638J89351j72071J00950O7005k37396J77015
$$ 54163 -39400 -92878 149015 -26993 -92631 96720 -75351 25599 92604 -144792 32223
663C2223M7284j48500R8272m4030j7995Q8081m7143n1475J5694R0902n8299o4321
$$ 32223 79507 -68993 29279 -14751 -32746 55335 8192 -43283 -27589 63313 5014 -59307
675e9307J07467q7365M0889R1680k13447J24338J01329k03470J33879j0211j17024
$$ -59307 48160 -39205 1684 93364 -120083 4255 105584 -97886 35993 25782 -91242
686i1242J81658q1492r1602J29257l7935k4053L1749k9009r830M7620J5591j07880
$$ -91242 90416 8924 -82678 46579 8644 -15409 16340 -12669 -22499 25121 40712 -67168
698f7168O1862P9804j37303P8861K0234j23560J62314n0466j24900J72702o8893
$$ -67168 -5306 74498 -62805 16056 36290 -87270 75044 24578 -100322 72380 3487
709C487n6588J21539j02153l966J03068p6503k6777O2055j4024l2534M5665k1183
$$ 3487 -53101 68438 -33715 -37681 65387 -11116 -37893 24162 10138 -22396 23269 2086
721B086n1480J03941l9927q9874J34853n4009o4554J31786j00670k0423J29645
$$ 2086 -49394 54547 14620 -75254 59599 5590 -58964 72822 -27848 -48271 81374
732H1374j15648P15R3415r6391K4942O2884q9317J7842P2985p1572j4576P8862
$$ 81374 -34274 -33559 59856 -36535 -11593 51291 -38026 -20184 52801 -18771 -33347 45515
744D5515o0279j4655Q4214q6464J653R8768j09857J6364R0419j14997L8995P0549
$$ 45515 -14764 -29419 54795 -31669 -30016 68752 -41105 -24741 65678 -49319 -10324 60225
756F0225j13195M7772N6878r6441M3123M2315q2910M4747L9535q8301M5564M8937
$$ 60225 -52970 -5198 51680 -44761 -1638 40677 -42233 2514 42049 -46252 -688 48249
768D8249r5536M5062N0139r6685N2162M0392r5414O2606K7767r2591P1213J8223
$$ 48249 -47287 -2225 47914 -48771 3391 43783 -51631 10975 38742 -53849 17364 35587
780C5587r1410P5734J5245r0718P5627J3080q7063P6538N660q1297Q1276o031
$$ 35587 -55823 19911 35156 -55562 20065 33145 -53918 22620 28280 -53017 28259 22228
792B2228p5949Q8015j5250p3948R0041j6175p0936Q4433j5762o4751Q1498k0223
$$ 22228 -53721 34294 19044 -54904 35137 18962 -51974 32459 16697 -48054 33444 13221
804A3221o1561Q6146k7268o1004R3535l5951n8535R8457m3736n1876R5291m8229
$$ 13221 -48340 37806 10538 -50466 43069 7118 -51417 47040 3304 -48572 46719 -1510
816a510l9430Q5671n2399k6997P9662n5322k4220P9811n3501k8150Q1272n2316
$$ -1510 -40940 44731 -7668 -34665 44997 -10325 -34545 45266 -8235 -36385 44887 -7429
828g429k9133Q2873n7266k3093Q3165o7459j0972Q1611p8012M22P8416q1630O327
$$ -7429 -36562 46311 -10955 -34048 49117 -18342 -29314 52297 -25715 -25293 53123 -28507 -22180
841b2180P1994p7584R270O3662p3094J3339N8370p4753J8399N8699q0622K2409
$$ -22180 49814 -27770 -18500 45162 -27932 -14593 43777 -30976 -12577 46122 -34500 -12091
853a2091N9985q4381K5966N7021q3713L0511M9311q1088L7208M1096q1518M4246
$$ -12091 47894 -36487 -10521 46500 -37213 -6702 42609 -38479 -1271 39825 -41693 2553
865B553L7642q4525M7934L6280q4245N0367K9957q0105N4868K0165p4363N8071
$$ 2553 40195 -44330 3604 39884 -44361 6006 35963 -44142 10726 30891 -43472 14599
877A4599J1248o7812N9098O945o6561N7931J1946o8939N3477J5363o8726N8789
$$ 14599 25847 -41965 17133 24078 -42483 15448 27394 -41545 11932 27295 -41431 17358
889A7358O973p3075P5291l633p5109Q4424j7908o2157Q6749l4090m8437Q0337
$$ 17358 24331 -48744 26547 22914 -52195 32229 14321 -47836 38913 4823 -43614 36723
901C6723l2964l6754N9574k5905k7044N3996k3473m2702O7944j2623o2856P6768
$$ 36723 3759 -32995 26579 674 -26370 27626 4153 -38549 29395 16772 -46084 30684
913C0684k0406n6106R4264n3275m4147J05235o8765j9972P9624p5586J5383N8040
$$ 30684 10278 -45828 48436 -4839 -48986 56249 -12516 -32488 47136 -28450 -13067 44973
925D4973p2068R898M6618l2407j2811K9960j5555j9408N6358m0555m0680R7331
$$ 44973 -27095 -17197 29421 -2986 -15797 14163 -1392 -20800 35558 -4997 -45677 51654
937E1654n6572l3639R2025q9218J9630Q2829j18402M0750N7220q1303M9317j727
$$ 51654 -4918 -38557 53468 -35750 -16120 66709 -51693 -10943 46277 -35026 14291 12564
949A2564m9185N7355J282m2887L303M1254j6959l0191N0383m9323M623Q4982j15319
$$ 12564 -36621 20734 22016 -20871 -17568 23686 6727 -23464 26919 -22404 -17781 67201 -48118
962d8118K3194Q7922j11731O6578J2846j05211J21282j6746q5019P5853k2138
$$ -48118 -24924 62998 -48733 17845 30691 -74520 46762 30016 -55003 20850 -1288
973a288k553K6175m0469L359K1251K7160n4000j5061Q2204o7459J9137M0317j15462
$$ -1288 -3841 22334 -18135 -14776 6475 33635 -20365 -35426 46778 -20681 -1544 38773 -76689
986g6689J11628K1037j35553J10665k4654m2041J02482j06116m74R5241o1325
$$ -76689 34939 55976 -79577 31088 6434 -35607 66875 -39241 -39715 55526 -5799
997e799k754k651N687K7414k3050O149m4339M8987N2196j23112O3036K6941p7486
$$ -5799 -8553 -11204 -5517 21897 -1153 4996 -39343 9644 61840 -61272 1764 28705 -48781
1010d8781J19005q9694n9366J65847r6977k1325O5615q6519Q3467R526r4008M9158
$$ -48781 70224 -19470 -78836 87011 -9966 -31291 34324 -52195 31272 40798 -53210 -4052
1022d052J6371J2384l2453k3087N1147l4042M8221k8737q8859J50147m5465p8077
$$ -4052 12319 24703 -7750 -30837 20310 -13732 34489 5752 -83107 67040 21575 -56502
1034e6502J07060j02684N5355Q4839j72707P5694N7504p4203N7663n9917j474
$$ -56502 50558 -52126 3229 88068 -84639 -8945 48559 -25644 32019 -27898 -29372
1045b9372P5571m0503j3518l0374N4157L0978q8815N5614l0315m039J11854j52521
$$ -29372 46199 5696 -7822 -38196 15961 46939 -41876 13738 -16577 -20616 91238 -61283
$$ [...]
8191b98
##END NTUPLES=NMR FID
##END=
