##TITLE=1H_SR148
 DMSO-d6
 8 sc, 
 20.2.2023
##JCAMPDX= 6.0         $$ Bruker NMR JCAMP-DX V2.0
##DATA TYPE= NMR FID
##DATA CLASS= NTUPLES
##ORIGIN= UXNMR, Bruker Analytische Messtechnik GmbH
##OWNER= root
$$ XWIN-NMR		Version 3.5
$$ Mon Feb 20 16:32:32 2023 Russian Standard Time (UT+4h)  she@DPX200
##.OBSERVE FREQUENCY= 200.13135
##.OBSERVE NUCLEUS= ^1H
##.DELAY= (6, 6)
##.ACQUISITION MODE= SIMULTANEOUS
##.ACQUISITION SCHEME= undefined
##.AVERAGES= 8
##.DIGITISER RES= 18
##SPECTROMETER/DATA SYSTEM= spect
##.PULSE SEQUENCE= zg30
##.SOLVENT NAME= DMSO
##.SHIFT REFERENCE= (INTERNAL, DMSO, 0, 15.7039)
##AUDIT TRAIL= $$ (NUMBER, WHEN, WHO, WHERE, WHAT)
$$ ##TITLE= Audit trail, XWIN-NMR		Version 3.5
$$ ##JCAMPDX= 5.01
$$ ##ORIGIN= Bruker BioSpin GmbH
$$ ##OWNER= she
$$ F:/spectra/data/she/nmr/H-F/1/audita.txt
$$ ##AUDIT TRAIL=  $$ (NUMBER, WHEN, WHO, WHERE, WHAT)
(   1,<2023-02-20 16:31:31.96 +0400>,<she>,<DPX200>,
      <created by zg, POWCHK disabled, PULCHK disabled
       configuration hash MD5:
       00 E9 B6 7A A2 85 ED C7 34 08 36 98 17 FE 4E 26
       data hash MD5: 16K
       0B 13 5C 1D 5A 65 79 8A 19 FC E0 97 C3 8D 9F 8A>)
$$ ##END=
$$ 
$$ hash MD5
$$ 76 DF 20 A1 32 3D 95 77 7D 9D 84 41 96 33 57 04
##$RELAX= 
##$RELAX= 
##$RELAX= 
##$RELAX= 
##$RELAX= 
##$RELAX= 
$$ Bruker specific parameters
$$ --------------------------
##$DU= <F:/spectra>
##$EXPNO= 1
##$NAME= <H-F>
##$PROCNO= 1
##$TYPE= <nmr>
##$USER= <she>
##$AMP= (0..31)
100 100 100 100 100 100 100 100 100 100 100 100 100 100 100 100 100 100 
100 100 100 100 100 100 100 100 100 100 100 100 100 100 
##$AQSEQ= 0
##$AQ_mod= 1
##$AUNM= <au_zg>
##$AUTOPOS= <>
##$BF1= 200.13
##$BF2= 200.13
##$BF3= 200.13
##$BF4= 200.13
##$BF5= 200.13
##$BF6= 200.13
##$BF7= 200.13
##$BF8= 200.13
##$BYTORDA= 1
##$CFDGTYP= 0
##$CFRGTYP= 5
##$CHEMSTR= <none>
##$CNST= (0..31)
1 1 145 1 1 1 1 1 1 1 1 1 1 1 1 1 1 1 1 1 1 1 1 1 1 1 1 1 1 1 1 1 
##$CPDPRG= <>
##$CPDPRG1= <>
##$CPDPRG2= <>
##$CPDPRG3= <>
##$CPDPRG4= <mlev>
##$CPDPRG5= <mlev>
##$CPDPRG6= <mlev>
##$CPDPRG7= <mlev>
##$CPDPRG8= <mlev>
##$CPDPRGB= <>
##$CPDPRGT= <>
##$D= (0..31)
0 1.2 0 0 0 0 0 0 0 0.06 0 0.03 0 0 0 0 0.0002 0 0 0 0 0 0 0 0 0 0 0 0 
0 0 0 
##$DATE= 1676896291
##$DBL= (0..7)
120 120 120 120 120 120 120 120 
##$DBP= (0..7)
150 150 150 150 150 150 150 150 
##$DBP07= 0
##$DBPNAM0= <>
##$DBPNAM1= <>
##$DBPNAM2= <>
##$DBPNAM3= <>
##$DBPNAM4= <>
##$DBPNAM5= <>
##$DBPNAM6= <>
##$DBPNAM7= <>
##$DBPOAL= (0..7)
0.5 0.5 0.5 0.5 0.5 0.5 0.5 0.5 
##$DBPOFFS= (0..7)
0 0 0 0 0 0 0 0 
##$DE= 6
##$DECBNUC= <off>
##$DECIM= 32
##$DECNUC= <off>
##$DECSTAT= 4
##$DIGMOD= 1
##$DIGTYP= 9
##$DL= (0..7)
0 120 120 120 120 120 120 120 
##$DP= (0..7)
150 150 150 150 150 150 150 150 
##$DP07= 0
##$DPNAME0= <>
##$DPNAME1= <>
##$DPNAME2= <>
##$DPNAME3= <>
##$DPNAME4= <>
##$DPNAME5= <>
##$DPNAME6= <>
##$DPNAME7= <>
##$DPOAL= (0..7)
0.5 0.5 0.5 0.5 0.5 0.5 0.5 0.5 
##$DPOFFS= (0..7)
0 0 0 0 0 0 0 0 
##$DQDMODE= 0
##$DR= 18
##$DS= 0
##$DSLIST= <SSSSSSSSSSSSSSS>
$$ [...]
##$SUBNAM2= <"">
##$SUBNAM3= <"">
##$SUBNAM4= <"">
##$SUBNAM5= <"">
##$SUBNAM6= <"">
##$SUBNAM7= <"">
##$SUBNAM8= <"">
##$SUBNAM9= <"">
##$SW= 18.05172834244
##$SWIBOX= (0..15)
0 0 2 0 0 0 0 0 0 0 0 0 0 0 0 0 
##$SW_h= 3612.71676300578
##$TD= 16384
##$TD0= 1
##$TE= 0
##$TE2= 300
##$TE3= 300
##$TEG= 300
##$TL= (0..7)
0 120 120 120 120 120 120 120 
##$TP= (0..7)
150 150 150 150 150 150 150 150 
##$TP07= 0
##$TPNAME0= <>
##$TPNAME1= <>
##$TPNAME2= <>
##$TPNAME3= <>
##$TPNAME4= <>
##$TPNAME5= <>
##$TPNAME6= <>
##$TPNAME7= <>
##$TPOAL= (0..7)
0.5 0.5 0.5 0.5 0.5 0.5 0.5 0.5 
##$TPOFFS= (0..7)
0 0 0 0 0 0 0 0 
##$TUNHIN= 0
##$TUNHOUT= 0
##$TUNXOUT= 0
##$USERA1= <user>
##$USERA2= <user>
##$USERA3= <user>
##$USERA4= <user>
##$USERA5= <user>
##$V9= 5
##$VALIST= <valist>
##$VCLIST= <CCCCCCCCCCCCCCC>
##$VD= 0
##$VDLIST= <DDDDDDDDDDDDDDD>
##$VPLIST= <PPPPPPPPPPPPPPP>
##$VTLIST= <TTTTTTTTTTTTTTT>
##$WBST= 1024
##$WBSW= 4
##$XGAIN= (0..3)
0 0 0 0 
##$XL= 0
##$YL= 0
##$YMAX_a= 48934
##$YMIN_a= -71558
##$ZGOPTNS= <>
##$ZL1= 120
##$ZL2= 120
##$ZL3= 120
##$ZL4= 120
##$ABSF1= 10
##$ABSF2= 0
##$ABSG= 5
##$ABSL= 3
##$ALPHA= 0
##$AQORDER= 0
##$ASSFAC= 0
##$ASSFACI= 0
##$ASSFACX= 0
##$ASSWID= 0
##$AUNMP= <proc_1d>
##$AZFE= 0.1
##$AZFW= 0.1
##$BCFW= 1
##$BC_mod= 2
##$BYTORDP= 1
##$COROFFS= 0
##$CY= 11.3945322036743
##$DATMOD= 1
##$DC= 2
##$DFILT= <>
##$DTYPP= 0
##$F1P= 2.36226072786647
##$F2P= -0.459571619588291
##$FCOR= 0.5
##$FTSIZE= 0
##$FT_mod= 4
##$GAMMA= 1
##$GB= 0.15
##$INTBC= 1
##$INTSCL= 1
##$ISEN= 128
##$LB= 0.24
##$LEV0= 0
##$LPBIN= 0
##$MAXI= 10000
##$MC2= 0
##$MEAN= 0
##$ME_mod= 0
##$MI= 1.114404
##$NCOEF= 0
##$NC_proc= 0
##$NLEV= 6
##$NOISF1= 3.799351
##$NOISF2= 2.8
##$NSP= 1
##$NTH_PI= 0
##$NZP= 0
##$OFFSET= 15.70392
##$PC= 1
##$PHC0= -19108.51
##$PHC1= 12.40078
##$PH_mod= 1
##$PKNL= yes
##$PPARMOD= 0
##$PSCAL= 0
##$PSIGN= 0
##$REVERSE= no
##$SF= 200.130013532006
##$SI= 16384
##$SIGF1= 3
##$SIGF2= 2
##$SINO= 400
##$SIOLD= 16384
##$SREGLST= <1H.CDCl3>
##$SSB= 0
##$STSI= 0
##$STSR= 0
##$SW_p= 3612.71676300578
##$SYMM= 0
##$S_DEV= 0
##$TDeff= 0
##$TDoff= 0
##$TI= <>
##$TILT= no
##$TM1= 0
##$TM2= 0
##$TOPLEV= 0
##$USERP1= <user>
##$USERP2= <user>
##$USERP3= <user>
##$USERP4= <user>
##$USERP5= <user>
##$WDW= 1
##$XDIM= 8192
##$YMAX_p= 0
##$YMIN_p= 0
$$ End of Bruker specific parameters
$$ ---------------------------------
##NTUPLES= NMR FID
##VAR_NAME=  TIME,          FID/REAL,        FID/IMAG
##SYMBOL=    X,             R,               I
##VAR_TYPE=  INDEPENDENT,   DEPENDENT,       DEPENDENT
##VAR_FORM=  AFFN,          ASDF,            ASDF
##VAR_DIM=   8192,          8192,            8192
##UNITS=     SECONDS,       ARBITRARY UNITS, ARBITRARY UNITS
##FACTOR=    0.0002768,     1,               1
##FIRST=     0,             0,               0
##LAST=      2.2672688,     0,               0
##MIN=       0,             -71558,          0
##MAX=       2.2672688,     48934,           0
$$ Real data points
##PAGE= N=1
##DATA TABLE= (X++(R..R)), XYDATA
0@%%%%%%%%%%%%%%%Qj6J6j6J6j6K4l2L2m0M8n6O7p5Q8j04J19j35J52j69J90k14
37a13K39k68L00l35L74m15M58n05N60o21O85p54Q31r15J006j110J225j352J494
56G84j655J842k057K306k604K967l416L990m755N835p487J0351j6735N9248j6558
71C2056n5843N8659j6390q341J0868k4358j2755L8706j8300j8527J9625k0467
83a5067l9604K0187J4647j438N951j0896M830M6018m268l6525J1242J7034p433
96D678Q273O86j417K1139k493k1836J4530L763l1538r554Q202J545O590j2647
110a0079j5727K4664R492l2669k980J6103q658K034Q551m190J8953J3753k3283
123d036M609K6620j5580j6248J3285L018L597N863j6668R82K1569j7358k4827
$$ plain form
0 0 0 0 0 0 0 0 0 0 0 0 0 0 0 0 0 8 -8 8 -8 8 -8 16 -16 16 -24 24 -32 35 -40 48 -56 63 -72 80 -89 101 -113
37 -113 126 -142 158 -177 197 -218 240 -265 295 -326 359 -395 436 -479 527 -583 642 -710 784
56 784 -871 971 -1086 1220 -1384 1583 -1833 2157 -2598 3237 -4250 6101 -10634 48614 32056
71 32056 -23787 34872 18482 10141 21009 -3349 -16104 22602 4302 -14225 5400 -15067
83 -15067 -54671 -34484 -19837 -21275 -15324 -26220 -21390 24628 20360 -16165 -4923 12111 4678
96 4678 12951 13637 12220 33359 30866 9030 23560 27323 -4215 -13769 -5567 -4022 2568 -10079
110 -10079 -25806 -1142 8350 -24319 -27299 -11196 -19854 -17820 -9269 -13459 5494 19247 -4036
123 -4036 573 27193 11613 -4635 8650 11668 15265 21128 4460 5442 27011 9653 -15174
136a5174J2977K893j4817J181R12P81J1508r160j3761J5479O971j5378p45J0309
150f024Q119O604o072q47J8932j65j8702L937R513n462k029k313k239J1983m085
165A1150k1754M488J0980j5722r521O760K047M905K47r572R528J3708j4238o798
179a3792J5398L029l777M244R02P118R405j2855q461J3603j887j5724P33M853
193B789m74M58p352m001J0112m141j6395L456R103l447q54K689M835R525j601
208D702j0026P241R260q427m083P379M313K242k627n488N659L237j4538o925P646
223d35p25n816l02J050M581J771r874k732R931j840q435M886P982K599J848j508
239B981J432P725l437j0046M067O723l906l090J991K666J324n559p882K300K734
$$ plain form
136 -15174 -2197 696 -14121 -12940 -12028 -11247 261 -8899 -22660 -7181 -210 -15588 -16333 -6024
150 -6024 2095 8699 2627 1780 20712 20547 1845 5782 15295 9833 7804 5491 3252 15235 11150
165 11150 -10604 -6116 4864 -10858 -20379 -13619 -11572 -6667 -6420 -15992 -6464 7244 -6994 -13792
179 -13792 1606 4635 858 5102 6004 13122 22527 9672 1211 14814 12927 -2797 -2064 2789
193 2789 2315 2773 -4579 -8580 1532 -2609 -19004 -15548 -6445 -9892 -10746 -8057 -3222 6303 4702
208 4702 -5324 1917 11177 2750 -1333 6046 10359 12601 9974 4486 10145 13382 -1156 -8081 -435
223 -435 -1160 -6976 -7278 -6228 -1647 124 -9750 -12482 -2551 -4391 -12826 -7940 42 2641 4489 2981
239 2981 4413 12138 8701 -1345 2722 9445 5539 2449 4440 7106 8430 2871 -5011 -2711 23
254B3q199m573N928M053j052k234L18M995J098o682j031P645K681k549J284M931
270F636M245j598n766P0M176l176o457J369M223j21l769k795J639J467n548n732
286a1137L298M354k298j491L618M581J181l439j405M816K240l964n56N686L247
301H731j838k597Q01J942k637o311r98L854p86l899m43L256P55l803l562J623
317e912K793j858k144L584N274O01j965P67L356O51l622j494L711K649k118j714
333B559J778K165k896m780j330J722j015l661k92L557J714k662j700J986J400
348a455k160j999K313M427J050j048J201L811L45l984j295K034L59k184j275K196
364B336K467j787l965o26J529k366m046R7K899J508j046j70K658K113k612k584
$$ plain form
254 23 -8176 -12749 -6821 -2768 -3820 -6054 -5736 -741 357 -6325 -7356 289 2970 421 1705 6636
270 6636 10881 9283 3517 3587 7763 4587 -1870 -501 3722 3601 -168 -2963 -1324 143 -5405 -11137
286 -11137 -7839 -3485 -5783 -7274 -3656 925 2106 -1333 -2738 2078 4318 354 -202 5484 8731
301 8731 6893 4296 5097 7039 4402 -1909 -2907 947 161 -3738 -4181 -925 -170 -3973 -7535 -5912
317 -5912 -3119 -4977 -7121 -3537 1737 2338 373 1140 4496 5147 1525 31 3742 6391 4273 2559
333 2559 4337 6502 3606 -1174 -2504 -782 -1797 -5458 -5750 -2193 -479 -3141 -4841 -2855 -1455
348 -1455 -3615 -5614 -3301 1126 2176 1128 2329 6140 6485 2501 1206 3240 3599 1415 140 2336
364 2336 4803 3016 -949 -1575 -46 -2412 -6458 -6361 -3462 -1954 -3000 -3170 -512 1601 -1011 -3595
380c595J906K444n91l61K216L504J097k546j588J606o62l947j241J399J464k35
396H70j695oK197j705m584n96K014l01p51J151K653L020n28k469J538J974k680
413A02j779K720J945J028J3r71J344J044m694k763J627l01k219K38R86J543O41
430E04k921j485K196p10k818J145K951J424P97K4R67K702j568l590J371K029j509
447A509l85R49Q90J037j596l680J051M27l718j479K385L67L95O8o15J659J401
464F65l314p97L326K13p15J886J243J125R31k484j041K504j752k791J736Q61q06
481G90K74j261q38J686k068l266J591J481j532N62J220N25J694q37j989K255J535
498A822k468N58K561M4L18j74j277J376L1l582m24K327j357q32R09n36K73K53
$$ plain form
380 -3595 -1689 755 164 -197 2019 5523 6620 4074 2486 4092 3430 -517 -1758 -359 1105 870
396 870 -825 -831 1366 -339 -4923 -5519 -3505 -3806 -4557 -3406 -753 2267 1739 -730 808 2782 102
413 102 -1677 1043 2988 4016 4029 3058 4402 5446 752 -2011 -384 -685 -2904 -2666 -1680 -137 504
430 504 -2417 -3902 -1706 -2416 -5234 -4089 -1138 286 1083 1107 2074 4776 3208 -382 989 3018 1509
447 1509 1124 2073 2963 4000 2404 -1276 -225 202 -3516 -4995 -2610 -2243 -1848 -1780 -2395 -736 665
464 665 -2649 -3446 -120 93 -622 1264 2507 3632 4563 2079 1038 3542 1790 -1001 735 1596 790
481 790 1064 -197 -1035 651 -1417 -4683 -3092 -1611 -3143 -2581 -1361 -836 858 21 -1968 287 1822
498 1822 -646 -88 2473 2517 2835 2661 1384 2760 2791 -791 -1215 1112 -245 -1077 -168 -704 -431 -178
516a78k734l13K477j913j037K668P73J3J411q66k1K167j631j891K628R68j270
533A251Q68M75r75J093j706k768J558J74k888J002J655q56O32k32j903J436N26
550f58k904J026L113j043N60J959o55R21N08k715k0K346j975o32K439n05m15O85
568B035k112j141J088k043j857K448J60p97J854j19m98J581j244j890K147P53
584C65j469K001J459l80J171k68j882O27M0k955Q90J439j363M43O70j446L88J83
602h7l188N49J490j737M97K472m93N57J647j692l18J959j753p64K705k2p45J714
620B791o12j060J115j572k039J184j49j595J318K39q97J009l20j689J076L46j824
637b679J130J742o51J105J074p75N59N48j712K98J229j351J69J120r49K23K96
$$ plain form
516 -178 -2912 -3225 -748 -2661 -3698 -1030 -257 -244 1167 301 280 2447 816 -1075 1553 2521 1251
533 1251 2119 2594 1619 2712 1006 -1762 -204 -30 -2918 -1916 -261 -1117 -485 -717 -2620 -1184 -658
550 -658 -3562 -2536 577 -466 94 2053 1398 2319 2827 112 92 2438 463 -169 2270 1765 1350 2035
568 2035 -77 -1218 -130 -2173 -4030 -1582 -1422 -2219 -365 -484 -982 599 -645 -2535 -388 365
584 365 -1104 897 2356 1976 3147 2879 997 1624 1664 -1291 -401 1038 -325 118 788 -658 -270 -87
602 -87 -3275 -2726 -1236 -2973 -2476 -4 -497 60 1707 15 -303 1656 -97 -861 1844 1822 1077 2791
620 2791 2179 1119 2234 662 -1377 -193 -342 -1937 -619 -380 -1277 -268 -588 -2277 -1201 -855 -2679
637 -2679 -1549 193 -458 647 1721 946 1505 2053 341 639 1868 517 686 1806 857 1080 1376
654A376j615n24O03j434l73J045p52K84J252r92j27J347q82o24J665k93r4J437
672A299j48p4J299q57j174J174l01j396R78Q0j001N40j32j389N39o5j480M66O59
691i83o67M42Q90o73P97O46j327O00J128o54L99R24k13L92L96j367k40Q03j163
710A30n85P79o18k84O51q08m89R25j001j066J055J69l54J130K35n1J099j21r81
729a85P88N09j089O85P70n87P64K9j028jL2j445k52M60n68P0N61k20J81L63r34
750a097m43R17n25QJ003L32M24Q26n13N0M08n94n75L94R4k01M16j80k36L94q09
771I3j184K83k30o42K45L97L49M32L4l31M32J48q60J54P57K30L49P04qJ34L13
792A799j033l62j1l75j67K75k42J69L54o83m15O8l65o26P9M38L42N30J95K29O41
$$ plain form
654 1376 -239 -763 -160 -1594 -1967 -922 -1674 -1390 -138 -1130 -1257 90 -792 -1416 249 -44 -138 1299
672 1299 1151 1077 2376 1519 345 1519 1218 -178 800 880 -121 419 287 -1102 -563 -628 -2108 -1642 -983
691 -983 -1650 -1208 -318 -991 -194 452 -875 -275 853 199 598 1522 1309 1701 2097 730 490 1293 130
710 130 -455 324 -294 -578 73 -735 -1224 -299 -1300 -2366 -1311 -1142 -1496 -366 -131 -182 917 796 -185
729 -185 603 1112 23 708 1478 891 1655 1684 656 655 687 -758 -1010 -550 -1118 -1048 -487 -707 -526 -163 -1097
750 -1097 -1540 -623 -1148 -1140 -137 195 619 1445 932 982 1390 796 221 615 709 508 924 744 508 902 93
771 93 -1091 -808 -1038 -1680 -1435 -1038 -689 -257 -223 -554 -122 26 -834 -680 77 307 656 1360 1352 1486 1799
792 1799 766 404 393 18 -149 126 -116 53 407 -276 -691 -623 -988 -1614 -1535 -1097 -755 -225 -30 199 840
813H40l85m74K57M5O8J36J37N29J31j93m25O4n03n45k72qL1L3L9on6K06m95k12
837a058J65K44K00K04L15N06J51J6p1M04l79k92J08M9K21j73k65n9r4j95n50j76
859g29q7M4J3r9K34M17l51O2pK0J43J18J99O00K78P5k32M76l73l28j41M3J04j30
883C49n8l90J17j80l28l43p6J23J8k46N22N84j42k95K81N9q2J08J86K05O26p3
905I65j59J16q3n09o0k52j23Q4o6k38K66J81n32k82k83P6N7n7l5R21K74k76L02
928B87K07j47j69R6j82L90L86l21K60K58k61n52j51j98k60j68l35L46L46p0k46
949d84J28J04m64K4j73L42N14j73K11O51K71m75J04j1k46L53j06n77L66K76o62
970b7J0J69m39k17j89l99M03J31k68L99N62k05k09K60q5J14J86j35K83P23l46
$$ plain form
813 840 455 -19 238 283 351 487 624 1153 1284 1091 666 730 227 -318 -590 -598 -567 -534 -495 -501 -557 -351 -846 -1058
837 -1058 -893 -649 -449 -245 70 576 727 743 672 1076 697 405 513 562 783 610 345 286 192 -3 -553 -729
859 -729 -816 -772 -759 -858 -624 -207 -558 -496 -503 -483 -340 -222 -23 577 855 930 698 1174 801 473 332 375 479 349
883 349 291 -99 18 -162 -490 -833 -909 -786 -768 -1014 -492 92 -50 -345 -64 -5 -87 21 207 412 1038 965
905 965 806 922 839 330 270 18 -105 -21 -87 -325 -59 122 -410 -692 -975 -899 -842 -899 -934 -13 261 -15 287
928 287 494 347 178 274 92 482 868 547 807 1065 804 252 101 -97 -357 -525 -860 -514 -168 -238 -484
949 -484 -356 -252 -716 -692 -865 -523 -9 -182 29 680 951 476 580 569 323 676 570 -7 359 635 -27
970 -27 -17 152 -287 -504 -693 -1092 -689 -558 -826 -427 135 -70 -279 -19 -104 10 196 61 344 1067 721
991G21j60K82o5k57j87m75L4L57m23k81M43k27k99K5k58J29K31k32k94P46J89
1012ak24L28L78l38K38p6j55L81Q6m45L62R6j51k16j03l21J57q3n86J95M11m14
1034d81j27J54m7J4Kj82K93O41m40L95L57k1l02L12j68NM23n37j77L95j07l64
1056C8K4l28Q8N8k62k89L88m1m70M18L53n29J44K38r5O23M2m48L83L94k53j91
1078B85K35k46O6P8l87K17L04l41k74K29m88k36N7k24K71K67k45J26M60l00m0
1099a86L13k67O8M36k96J16O61j73k09K45k78j37J03n34k65M02M7m64L86L1l89
1120c90Q5p6l73K90J19r6K14M88k86L19q3o0K3K11m50J56N68l11q0M65k73k99
1142A61j68j70k65K93k77k02N17k14O4J63j89j46L21k84m7N26R0k41N44J23k27
$$ plain form
991 721 561 843 778 521 334 -141 -107 250 -173 -454 -11 -238 -537 -512 -770 -641 -410 -642 -936 -190 -1
1012 -1 -225 103 481 143 381 305 150 531 617 172 534 630 479 263 160 -161 -4 -87 -673 -478 -67 -481
1034 -481 -608 -454 -501 -487 -485 -667 -374 267 -173 222 579 558 256 568 400 405 828 291 114 509 402 38
1056 38 62 -266 -178 -120 -382 -671 -283 -324 -794 -376 -23 -552 -408 -170 -265 358 400 -48 335 729 476 285
1078 285 520 274 340 418 31 248 552 211 -63 166 -322 -558 -501 -725 -454 -187 -432 -306 154 -146 -186
1099 -186 127 -140 -72 364 68 184 845 672 463 708 430 293 396 -138 -403 -1 46 -418 -32 -1 -390
1120 -390 -305 -381 -754 -464 -345 -441 -227 261 -25 294 211 151 174 385 -65 91 659 348 268 733 460 161
1142 161 -7 -177 -442 -149 -426 -628 -111 -325 -261 -98 -287 -433 -112 -396 -443 83 173 -68 476 599 372
1163C72J39j98k39K57j68j80J22L39n11K27n9l17j7j05k74K3L39q6M3N14k33K5
1185A3J12l27j8L58j07q9M32J1N7Q9p8q6r3l03q6Q1J6k84J38P9j70l3k3r2J22
1210b81Lj92L88O2j1K83r9l1J85J18l20N0M31k58o8K77l04j25K05o91J49L03l35
1233b61q9J16OJ00k8l11J56k9P2KK19K60j01N7opn9J90J8m7Q1k74J72m5j97k7
1259c2k4j98J22L3k80J85o1mQ8o8m4m4JJ03Q2M75l5j53K60n6r1j00m9j28K97j90
1285H9l8K71k20j83j25Oj67J92k33M8J78K32l29K62p7J88k09j7K0L94nj02K83
1308D58j70J19l7k39j16N0l1l47K78N3J70l59n9J24q2k91j00K63J53J14j1j3J69
1331I6j8L3o6J53O1n8j46L20lk00J46j71l4j30p9J2j64J26j17k1K47j04J46j53
$$ plain form
1163 372 511 313 74 331 163 -17 105 444 -67 160 101 -216 -233 -338 -612 -589 -250 -336 -293 221 -12 13
1185 13 125 -202 -220 138 31 -58 374 385 442 531 453 367 274 -29 -115 -34 -18 -302 -164 -85 -255 -288 -311 -403 -281
1210 -281 -278 -470 -82 -20 -31 252 153 122 307 425 105 155 586 328 260 537 233 108 313 -378 -229 74 -261
1233 -261 -350 -234 -228 -128 -156 -467 -311 -340 -268 -266 -47 213 112 169 163 156 97 287 305 258 339 65 237 192 -5 -32
1259 -32 -56 -254 -132 -99 -379 -194 -255 -259 -171 -239 -283 -327 -326 -223 -141 334 299 146 406 350 259 159 110 -18 279 89
1285 89 51 322 102 -81 -206 -200 -367 -175 -408 -360 -182 50 -279 -17 -94 94 -115 -132 -112 282 277 175 458
1308 458 288 407 370 131 15 65 34 -313 -35 18 188 -171 -230 -106 -188 -479 -579 -316 -163 -49 -60 -73 96
1331 96 78 111 45 198 259 201 55 375 372 172 318 147 113 -17 -96 -84 -248 -122 -239 -260 -13 -117 29 -124
1355a24m9lK32j94P3R6o7L80j76O4QO2j33j3P6Ok04J92j97r7l5r1ML9j19l0j30
1382d30L23kK0O1L2j2R6L7J1m3Q4j30R9O5q2Q5l0J73k58j63P1n8J0m8J7k32J35
1409a69J9j15L5J78k41J30l7J63K71j54P3mJ43j65P6q8M1L10n48N0J79L1j19k32
1433a73K29j38n2k8j32J66p3l8r0J91J56k0N7j04J53J07k89K16J80qp6j66L03
1456C71j26p8j85m3J29J2k39R7m0k5l7rJ11o6j87N0J18J88j04L1J93M6P8j51j03
1481C1J57R3j97j13Q0J25p6j87Q0rk5l16R7J11m0q3rJ67J92j09j54K20P9j46j87
1506b19L46J82j92J17j41K2J51j54j71L2J24j89l4K64J2r3k99PJ90l3j17K2M8
1529a25R0L8OJ26J99k27k19J85Pn1j80J95J0L11j93Nk35L9j6r2p7L2q6L6J9K95
$$ plain form
1355 -124 -173 -176 56 -138 -65 31 -36 344 168 232 240 302 169 156 232 238 34 226 29 -68 -103 -194 -190 -151 -270 -300 -430
1382 -430 -107 -109 -89 -28 4 -8 88 125 136 93 177 47 146 211 129 214 184 357 99 -64 7 -51 -41 -89 -72 -304 -169
1409 -169 -150 -265 -230 -52 -293 -163 -200 -37 234 80 153 149 292 127 203 115 156 466 -82 -32 147 178 59 -173
1433 -173 56 -82 -134 -162 -294 -128 -201 -239 -329 -138 18 -2 55 -49 104 211 -78 138 318 310 234 68 371
1456 371 245 167 -18 -61 68 80 -159 -62 -102 -127 -164 -173 -62 -128 -315 -265 -147 41 -63 -32 161 207 285 134 31
1481 31 188 281 84 -29 51 176 100 -87 -7 -16 -41 -357 -260 -149 -189 -272 -281 -114 78 -31 -185 35 114 -32 -219
1506 -219 127 309 117 234 93 115 266 112 -59 -27 97 -92 -126 138 150 57 -242 -235 -45 -78 -195 -173 -125
1529 -125 -35 3 9 135 334 107 -112 73 80 29 -151 44 54 365 172 177 -58 -19 -35 -127 -204 -172 -258 -222 -203 92
1555I2j68o6J03J22J72l50K29l10J96J82k02K17J14j54j13j5q8M1J00j46l0O4
1577a0o7O7j62J13l6r8MR6P7rj39J92O1j38NR0j57J12k2o1M09j86q5j09K15k51
1603h9Q8L2l89M14r4r6O2N4j76K4N2J27K06l83m9J27K01j85K30n0P9N3r0J21j34
1628A35j30K0l9j03J12J17k2k25J09j36K3J11k7j85j1O5K75j32P9J6J61o9j87
1651d3m7K20q9J6m2J31J0r2RO4n5k16j12J30P0L2Q4j07O7j13Q4n5o6k2Q9k0J08
1678C5L2KJ97k15J25j59q4j70M28k92P9K2K38k39O1k17j4J33j10k3K13j14J7J43
1702H8j63K09q9Q4k04M4O1Q2j29P8J33j06m1j30J17N1k88J25l6J55r0M1q1J66
1726G7n9k23j4R0J91j64R0J90j02j02N0J6lj0k96K38J05Q6L8k72J73mj61n4l5
$$ plain form
1555 92 -76 -142 -39 83 255 -95 134 -176 20 202 0 217 331 177 64 49 -39 2 102 -44 -74 -10
1577 -10 -77 -10 -172 -59 -95 -193 -189 -93 -16 -25 -164 28 89 -49 -44 46 -111 1 -21 -82 327 141 56 -53 162 -89
1603 -89 -1 31 -358 56 -38 -134 -72 -18 -194 -170 -118 9 215 -168 -217 -90 111 -74 156 106 185 238 148 269 135
1628 135 5 25 -14 -117 -5 112 90 -135 -26 -162 -139 -28 -55 -240 -251 -186 89 -43 36 52 213 144 -43
1651 -43 -90 130 41 57 15 146 156 64 73 137 82 -134 -246 -116 -46 -14 70 -37 30 -83 1 -54 -120 -142 -53 -73 35
1678 35 67 69 266 51 176 17 -67 -237 191 -101 -22 0 238 -1 60 -157 -171 -38 -148 -171 42 -72 -55 88
1702 88 -75 134 45 129 -75 -31 30 112 -17 61 194 88 47 -83 34 85 -203 -78 -114 41 -49 -8 -89 77
1726 77 18 -205 -219 -129 62 -102 -12 178 76 -26 24 40 37 27 -269 -31 74 160 198 -74 99 95 -66 -120 -155
1751a55R8k2j23K22o1J8k31J19K67l2j48k6J08N9J6k06K26K1o8k13J51L26k03
1774A43l14jK17N1p5k76o9N08k33m2Q4L2k05J0oK67J25j74j43J97j2k30NQ4J80
1799A23p2k2N9N5k07K2r7K55p6j67p5J50%j2j36J94N9N4j05r1L30k38j23J03K2
1824EJ86n9k63K52K06k49l2N8R0o3l51P6L32%k32LK35l04Qk45K16J57p3M9n8J79
1850A23Qj7k44R9o1J82j49J40Q8r5j42K02l5k5j20r5M5K10k63l1M59k17k27n5
1874b20k0K48N4l35K21J48k0k54R9K53J8j71j44J57J5k7j53J24J17j54m0N3N6
1897B5J17l47k4J49J41k12J6J14n9J28q4j2K0J86k36n2J62O7r8j7J96J09j52k08
1921g1j47J80J75k08J21%J05m57OK34L24l32j51L12L9k6n5k08J78J69l07K0J21
$$ plain form
1751 -155 -57 -79 -202 20 -41 -23 -254 -135 132 100 -48 -74 34 93 109 -97 129 150 82 -131 20 346 143
1774 143 -171 -172 45 96 21 -255 -324 184 -49 -91 -7 25 -180 -170 -176 91 216 42 -101 96 84 -146 -141 -57 123
1799 123 51 29 88 143 -64 -42 -139 116 40 -127 -202 -52 -52 -64 -200 -6 53 107 2 -89 241 3 -120 -17 5
1824 5 191 132 -131 121 327 78 46 104 194 131 -220 -144 188 188 -44 -41 194 -110 -102 -347 -131 26 -47 2 -56 123
1850 123 131 114 -130 -31 -92 90 -59 81 169 74 -68 134 99 74 -46 -141 -96 114 -149 -180 279 62 -165 -220
1874 -220 -240 8 62 -273 -52 96 76 -178 -79 174 192 21 -123 34 49 22 -131 -7 110 -44 -84 -31 25
1897 25 142 -205 -229 -80 61 -151 -135 -21 -80 48 -36 -48 -28 158 -78 -130 32 99 1 -16 180 289 137 -71
1921 -71 -218 -38 137 -71 50 50 155 -302 -296 -62 262 -70 -221 91 130 104 49 -159 19 188 -119 -99 22
1944B2Q3r3J04q1J92k50M3N2QL6k49O1P8K0k3j46J88J18j99r9J32m3J7j10O7K15
1970A43o0o6j37L23o3j35J0j45J57no0Q5Ko4m8J51j36J01j26j02M2J15M1k29R8
1995a08K85j01j57P3Q2r3O8o6l8P5q5K24k34K08lk73J16o3J26P6k74N8J98j70
2019g6Q0N8Pk24j4L40p7kk27J9L10m3j27j9p8r7J13m5P9j41K63k50K87j08J4J02
2045A44l54K67j21j52K7K96Rj32r0K22n3k72J58J24M2n7Qn4MJ17j53r9J73p5K90
2070B69l07j9J17p4M8j10J10J5j88L2K7J84j77R4mJ91q6k15P2J84o0J6j60L6J61
2095A56j69j14L01n8q9k27K64k45J12N9k0J28j1q0j02J02l7J13l05K21KJ6J21
2118A38K4j9n2j61j29L02r5J01k9k26L40k12J0p0J63q9m7K9K1P8j81P4J60J3k23
$$ plain form
1944 22 105 12 116 35 227 -23 20 72 80 116 -133 -72 6 26 3 -143 45 163 -36 -135 -3 -46 -29 -139 -72 143
1970 143 83 17 -120 203 140 5 15 -130 27 22 -38 47 49 -15 -63 88 -48 53 -73 -175 -133 -18 23 -206 -108
1995 -108 177 76 -81 -8 74 -19 49 -17 -55 20 -65 159 -75 133 130 -143 -27 -90 36 112 -162 -104 94 -76
2019 -76 4 62 69 -155 -169 171 94 92 -135 -116 194 151 24 5 -73 -170 -57 -102 -23 -164 99 -151 136 28 42 144
2045 144 -210 57 -64 -216 -189 107 116 -16 -106 116 63 -209 -51 73 115 58 66 12 16 133 -20 -119 54 -21 269
2070 269 -38 -57 60 -14 34 -76 34 49 -139 -107 -80 104 -73 21 17 208 122 -93 -21 163 103 119 -41 -5 156
2095 156 -13 -127 174 116 27 -200 64 -181 -69 -10 -30 98 87 7 -95 7 -30 83 -222 -1 1 17 138
2118 138 162 143 91 -70 -199 103 8 109 80 -146 194 -18 -8 -78 85 -4 -51 -22 -1 77 -104 -30 130 143 -80
2143h0Q1j5J40k21N9Q3o6N2n7J51j71K00q1r8L3o5j4j41J63N4K9j84J95J9lj19
2169e6O0P1m6j57J68O9l1j43M1J18j54Nm6J62j14J31k54J62L0k0J2j20J72K4j92
2194a08K4J80l7r0M4R6j86N6o1K87k45O6q3J56o7J6j21J23m2p7J76j70J11J3M
2219F5J6j39p5K37j02O3o2J9o3j41K09J80k25j17J28j1p0O5j38K59j51o1j9R6
2243c7K5pj06K19j05P1j7n4J2j3l0MQ2m1K4R3j60L6J02k69K30j22J00m4r9J44
2269C8j42J29r8%J53n8j85J79k7j9K7j21J28O8k9n0Q9o0Rj66M5K47j17O5k35R3
2295c7j54L71j79J81J3j35J35k51N0l9l4N6J21j14o3J11N5j1Q8l41J73J59j97
2318d2p4J81j28J07k29K24J19klk20J19l1%J32m7k3r7O7j83J70M5P4k78R5J20
$$ plain form
2143 -80 1 -14 126 -95 -36 47 -19 33 -24 127 -44 156 75 -23 10 -55 -69 -210 -47 7 36 -148 47 66 63 -56
2169 -56 4 75 29 -128 40 109 78 -65 -24 94 -60 -55 -101 61 -53 78 -176 -14 16 -4 8 -112 60 84 -108
2194 -108 -84 96 59 -31 13 109 -77 -21 -82 205 -40 26 -57 99 32 48 -73 50 8 -69 107 -63 48 61 65
2219 65 81 -58 -133 104 2 65 3 22 -41 -182 27 207 -18 -135 -7 -18 -88 -23 -161 98 -53 -114 -133 -37
2243 -37 -12 -19 -125 94 -11 60 43 -11 1 -12 -42 -38 44 3 27 120 -40 -4 98 -171 59 -63 37 -7 -106 38
2269 38 -104 25 -73 -73 80 22 -163 16 -11 -30 -3 -124 4 72 43 -7 82 22 31 -135 -90 157 40 105 -130 -37
2295 -37 -191 180 1 182 195 60 195 -56 -6 -45 -79 -23 98 -16 -79 32 87 76 164 -177 -4 155 -42
2318 -42 -116 65 -63 44 -185 39 158 156 153 -67 52 21 21 153 106 83 -14 53 -130 40 85 159 -119 -24 96
2343I6r3Q0n7l4j8J10j24K9j6j16J40M3k13R3j9m3J85jl9r2L4N0Jn1LJ70j05J7
2371C0j2P2j76n0J01K34J6j82j9Q5j99J18j19J74q8l8M1K3k67L02j00J03m1r5
2395h7J01O3m7L2P3j20N9p3J5m8o6O2J39k50j9K59k16J11Rj01K33j76J18k30N0
2420a09K13J10k27J4q7J50j99Q4J02N4k3q0P4l1j28j30J61r7L7k3J72j2K9j37
2444h3J89k49j8J66q5R0J23j98M9N1m7L8L7j1j20l4J09k4j0J6k3M0m1J76l5q8
2470A8P0L9j14k1Q4k5j09Q0p6k6P8jN5j69P5L7K5M4j4q6MP6k4j2j9j30J71J29
2498A59j06J1j47M8Q8m7p5N1j05R2n5LL30k73j9p5O3P0J05L7j77o8J63pn3n9k0
2525f6O3J95k65L32l83J72J06k12k3O8P7N7j36n0j19R8J63oj11L3M4j21O0L0l4
$$ plain form
2343 96 3 83 26 -8 -26 84 -40 -11 -27 -143 -3 40 -173 -80 -99 -142 43 42 3 -89 -55 -5 -4 -55 -52 118 13 30
2371 30 18 90 -86 -136 -35 199 215 33 14 99 -100 18 -101 73 -15 -53 -12 11 -256 46 -54 49 8 -87
2395 -87 14 77 30 62 135 15 74 1 16 -32 -98 -36 103 -147 -166 93 -123 -12 -3 -104 129 -47 71 -159 -109
2420 -109 104 214 -13 1 -86 64 -135 -51 51 105 82 2 76 45 -83 -213 -52 -149 -112 -135 37 25 54 -83
2444 -83 106 -143 -161 5 -80 10 133 -65 -16 35 -12 26 63 52 -68 -102 7 -17 -27 -11 -34 6 -35 141 106 18
2470 18 88 127 13 -8 76 51 -58 22 -54 -80 -2 -3 52 -117 -42 -5 20 64 50 -36 -32 44 20 8 -11 -141 30 159
2498 159 53 64 -83 -35 53 6 -69 -18 -123 -31 -86 -83 247 -26 -45 -120 -57 13 118 155 -22 -90 73 66 13 -46 -66
2525 -66 -3 192 -73 259 -124 48 154 -58 -81 -13 64 121 -15 -65 -184 -86 77 71 -40 -7 37 -84 -24 6 -28
2550b8JP9j11J51O3j17J80q2k65J2J72Q9p2p3PR4j36K1N4q3J82m6k13J14n3M7
2576a3J08k33jJ00j33J13P5L7j0p1n1J77J67j87Rm6o6OP2m1n3Nk2J38M2M2k11
2603d7m6J65o3j50J35J30k10J80j34J3JJ01o6j12J74r4K4p6J26Pn6L5o7p2Q1L5
2629A4L5r5R6j68J16k1l8k7j27K46j03K23j33j24L9M2m4R5j83K9l2J58q0K3O6
2654Gj56J27k4M3J17l5j38m6m7L6J47Jj26J10p4K19j09J26k08m2Q7NJ1k0j01J55
2680F5j02r3J04K7L2q4r0K71J0j09J43j44j89J09J61k3K5p0j5j57j5P5J27q9L9
2705Hk3n3J36n5r6J51J63k54j8P3j76J12K7Pqm0K35l88M5J21j2J5J53n9R2q4j44
2732g2k1J90J05k68k9K15j04r8J63k08J27J11j43l2J86k05J63k21M3K43p1j32
$$ plain form
2550 -28 -27 52 -59 92 155 38 218 136 -129 -117 55 144 72 -1 6 100 -36 -15 39 -44 138 92 -121 -7 -60 -13
2576 -13 95 -138 -139 -39 -172 -59 16 53 43 -28 -79 98 265 78 87 41 -25 -19 53 12 -41 -36 -58 80 122 164 -47
2603 -47 -93 72 9 -141 -6 124 -86 94 -40 -27 -26 75 9 -103 71 -23 1 -75 51 58 2 37 -30 -102 -21 14
2629 14 49 -46 50 -118 -2 -23 -61 -88 -215 31 -72 151 18 -106 -67 -25 -69 26 -157 -128 -160 -2 -82 -59 7
2654 7 -149 -22 -46 -3 114 79 -59 -105 -152 -116 31 32 -94 16 -58 161 52 178 -30 -72 15 20 31 11 -90 65
2680 65 -37 -130 -26 1 33 -51 -141 130 140 31 174 30 -159 -50 111 88 113 43 28 -129 -144 -69 58 -31 8
2705 8 -15 -68 68 13 -83 68 231 -23 -41 32 -144 -32 -5 2 -6 -46 189 -199 -154 -33 -45 -30 123 64 156 72 -72
2732 -72 -93 97 202 -66 -95 120 16 -82 81 -127 0 111 -32 -64 122 -83 80 -141 -98 145 74 -58
2754e8J7J15r2K16j90j93J37N3j51k9J44J02Q6j59q8q0L2J15m0K30j60j13J79
2777G3p9M0n2J13j52M0L1k2M2l9J59j29K7k3P8j98K6k81L54Mj09J63kJ10j97J80
2803A57j20J14j88J9J4r3J33m3N1p9O7k8p7P6N9j92K15n9Q8r0j93N7K03k53R7
2828f5m5J61j36J26mJ10k82MJ90j5j28J52k6j30J06l0j5J23j44R3N1j34J19j04
2852b3J6Q9p4o0km2l8J20P0J09k65L44j31j63J24o7j20j4J42n3N3J8j07J04J12
2877A42j48K73k37l5K9k3K0K4M6j35Q1pJ15j44k8O7j46J29J03j68l3J22j56J48
2901C9k3o4Q6k16K09j39J81P4k48k7M1Q4n3l5J47KK1q3j83M02r1K0j53R9q7j00
2927i7j7O7rK14j6l01J03l8l8P7J09m5Q9j99m4J77M1J54k13m4P4q1J54n3j0M6
$$ plain form
2754 -58 -41 74 -18 198 8 -185 -48 5 -146 -175 -31 71 157 -2 -90 -170 -138 -23 -63 167 7 -106 73
2777 73 -6 34 -18 95 -57 -17 14 -8 34 -5 154 25 52 29 107 -91 -65 -346 8 12 -97 66 64 174 -23 157
2803 157 37 151 -37 -18 -4 -97 36 -7 44 -35 32 4 -73 3 62 -130 85 26 114 24 -169 -112 91 -162 -65
2828 -65 -110 51 -85 41 37 147 -135 -131 59 44 -84 68 42 -88 18 -12 -27 96 -48 45 96 -38 81 -23
2852 -23 -7 82 8 -52 -54 -96 -134 -14 56 165 -100 244 113 -50 74 7 -113 -127 15 -38 15 33 -74 30 142
2877 142 -6 267 30 -5 24 1 21 45 91 -44 37 30 145 1 -27 40 -106 23 126 -42 -75 47 -109 39
2901 39 16 -48 38 -178 31 -108 73 147 -101 -128 -87 -3 -56 -91 56 58 79 -4 -187 215 124 144 -9 90 3 -97
2927 -97 -114 -47 -56 158 142 -159 -56 -94 -132 -55 54 9 98 -101 -145 32 73 227 14 -30 44 -37 117 64 54 100
2953A00Oj56P4q0k14K59k4O4j5N0o3k9J7j16R6N3j30K06Nj65M9o6R6j3l5J5k7
2980d3l1Q1N6k0qQ7j03l9j19jJ63n4N2k0j12K77j26lj3k4l0K19k12K5K2j01%J08
3008C1k5Jj5P1r5r6o5K16j8j17K44j1n8k2k8q1Q6l7J07q9jL5n1J23k21K35r1o6
3036c8J1J6k1O1r3J43j59J82M0k5k4m2J45k45J2m7N2n7K1P5nl7M8P4j67l0M4k
3064f8k1l2J59Mo8k0J69k08J51j69J33rm4pl2J40j41NNQ6Lq4J04oj77K32j44Q2
3092D3j55MK09k57L11p7q2L4J32j96J8O7j07J56q3J07j90O5R8k76K96j91P2k0
3116b2j7l8J67o0J1J2m8M2j6j68J15K3j29K39k10M6J04J18k54R3j7qO6m3n7Q3
3142C2o3Q1mj1k06J83p4l9R1j1k4%M0N1qn1L4J19%j57J61k04J28j45K27j43K8
$$ plain form
2953 100 106 -50 24 -56 -270 -11 -35 29 14 64 1 -28 -11 -127 -31 22 -108 98 103 -62 -13 -79 17 4 -31 -16 -43
2980 -43 -74 7 63 43 35 122 19 -20 -139 -140 23 -31 21 1 -111 166 40 37 24 0 -30 189 -23 2 24 -77 -77 31
3008 31 6 7 -8 63 -32 -128 -193 23 5 -112 132 121 63 41 13 -68 18 -19 88 -1 -2 33 -18 105 -116 119 28 -38
3036 -38 -27 -11 -32 29 -64 79 -80 102 142 117 93 51 196 -49 -37 -84 -32 -89 -68 7 2 -35 13 87 -80 -110 -66 -68
3064 -68 -89 -121 38 42 -26 -46 123 -85 66 -103 30 21 -23 -30 -62 78 -63 -58 -53 33 36 -48 56 50 -127 105 -39 43
3092 43 -112 -108 101 -156 155 78 -4 30 162 -34 -16 51 -56 100 17 124 -66 -1 97 -179 117 -74 -2 -22
3116 -22 -39 -77 90 30 41 53 5 47 31 -137 -22 1 -128 111 -99 -53 51 169 -85 8 -9 -17 49 6 -51 32
3142 32 -31 50 46 35 -171 12 -62 -101 -10 -21 -45 -45 -5 46 38 -13 21 140 140 -17 144 -60 68 -77 150 7 35
3169C5nk8n1k6R0l0%P9o4q8Q3q3J17q0OJ00k84J43K10j10o1N5O9j7k0R8k32Q5
3197iM5j26L5J29j13Q2k3j01j0J98k13P9K39k00Q4p4P1j59J15j68K04K3j69J41
3221H0j84J43Pp0j63J05J37r2J22k10J70P9k03J13O9j20q8Q3K8k6j24J09L4m4
3245d5Q7m5N4j3Qj6j02R6m3m9M7J47j49K3o7jJ25l52K23J09M7K5j84KJ64Lp1j20
3273i7K59k20J15j11K3P3n9K2K9k46J74J32M5j27J06r8n3o3O0L6r7Q6J0Q3J02
3298A84m5j13M3K6K0r2j54K81q9Rj08j12K38j37K2N9pj97L23k54J25o9n2N3K22
3323A76j57J22k47J49P5k24J69j34J03J0k09K75L6j93j4L6Q4j21O3j6m5k1j10
3346a93J60N9o6N9J2m2J37j19q9mJ36m0J14j76J11k7m5m5pQ8p1j0N3J18j43l5
$$ plain form
3169 35 30 2 -49 -75 15 -15 -15 64 0 -88 -5 -88 29 -51 -45 55 -229 -86 124 14 -47 8 77 60 40 138 -94 -9
3197 -9 36 -90 -55 74 -39 43 20 -81 -91 107 -106 -27 212 12 96 22 93 -66 49 -119 85 108 -61 80
3221 80 -104 39 46 -24 -187 -82 55 -37 85 -125 45 124 -79 34 103 -17 -105 -22 6 -20 -144 -35 -1 -45
3245 -45 42 -3 51 38 46 30 -72 24 -19 -68 -21 126 -23 0 -67 -68 57 -295 -72 37 84 109 -75 -73 91 94 23 -97
3273 -97 162 -58 57 -54 -31 42 -17 5 34 -212 -38 94 139 12 118 20 -33 -96 -36 0 -97 -11 -1 82 184
3298 184 139 26 69 95 115 23 -131 150 61 70 -38 -150 88 -49 -27 32 25 -172 151 -103 22 -47 -99 -46 176
3323 176 19 141 -106 43 118 -106 63 -71 32 42 -167 108 144 -49 -63 -27 57 -64 -1 -17 -62 -83 -193
3346 -193 -33 26 -40 19 31 -11 126 7 -82 -86 50 10 124 -52 59 32 -13 -58 -65 23 -48 -58 -5 113 -30 -65
3372f5J26poj4J21k54J28k8j14J02N8k26R1J47j82K24j12j03J23j17K8P8l9K5
3396a6L6j59O8J29q0J69k84J04k4R2p6kN2j68K33j7k9m3oO7j72J81K5r4N1j37
3422a00J61j55J73j69J00P6n0j6Jj33J11n4K0Q4r1L8j3O9p2r6O9N2j38L2N7l4
3448g8j4J79k05m4J04J7j51J35J55l14K41J53j66k0l1J17P8j93O0N5N2j77rJ90
3472A34m7j62J12k09K57j39jM7L0k5l1R3J11k85J05J09j55pkK03L7l32J8J88k84
3497b35J22O1J68j99pJ24l8LK7N8m4N4r9j19J07q6J90k27K65o2J04j31r6mN8J3
3523GM9r4O3r1P2n6J72j78j0oR0R4K4k02N0J05n2n2j0Qm6K21j85K5l9R8q4j6O4
3552B1r7J60o4k06K68j38j58K43J9j18JJ24L4j04r4K19r3P9m0n1k3oL3%n3P2m6
$$ plain form
3372 -65 61 54 48 34 155 -99 29 1 -113 -11 47 -179 -88 59 -123 101 -11 -114 9 -108 -80 -2 -41 -16
3396 -16 20 -139 -71 58 -22 147 -137 -33 -57 35 -41 -43 9 -159 74 57 28 -15 -21 46 -126 55 80 -14 37 -100
3422 -100 61 -94 79 -90 10 86 36 20 21 -112 -1 -55 -35 49 -42 -4 -17 52 -20 -116 -47 5 -133 -101 -44 -78
3448 -78 -92 87 -118 -162 -58 -41 -192 -57 98 -216 25 178 12 -8 -39 78 156 -37 23 78 130 -47 -56 134
3472 134 87 -75 37 -172 85 -54 -55 -8 22 -3 -34 59 170 -115 -10 99 -56 -63 -65 138 175 -157 -139 49 -235
3497 -235 -113 -52 116 -83 -90 34 -4 -1 26 84 40 94 -5 -124 -17 -103 87 -140 125 63 167 36 -60 -64 -6 7
3523 7 56 -38 25 -66 6 -50 122 -56 -66 -72 18 112 136 -66 -16 89 37 -15 -25 -17 -63 158 -27 -2 -41 57 -27 -43 21
3552 21 -76 84 20 -186 82 -56 -214 29 48 -70 -69 55 89 -15 -109 110 17 96 56 5 -18 -24 9 9 -44 28 -18
3579a8l9J13K5n7r0J42j06J58k27J4J70j15J04r5q6J80j78J21j44Q7J29n6m0K1
3603A3l8J94j12j48N9%Q1p5N2N6r8J02l4o0j02M8p0k7K31O5k19l2K67j44J49R5
3629B53l48Q2M9r1K06j94J23k17M5J77j77k8L24j39j86J86j38L7J46r8n7m0J15
3652C0J44l21N7J57j22J23j57R5J45rk79P7K09j01k0PQj29O2J31p7j27j31J25
3676a03J04J25k22l3K24j86L3N5O3J66n4p7j90J13N9n1k7J6J39k73M4q5J20J05
3700F5o2m2L3MO3%j2J2o0M4l3q6J72k08M2M9n5J50l4k18K37j14l1J52R9j31l06
3727b70K54P2p4J82j45k0K2Q4j80J04o4O9r3Q0n5K74k52j25L6P5o9Q5P4k17J49
3752dr8M8Q9o8R9p7K7ql8n7K13j33R0j08r8O9N7Pm5L7N9j39o9J84k6Q2m4m3j02
$$ plain form
3579 -18 -57 56 81 24 -66 76 -30 128 -99 -85 85 -30 74 -21 -107 73 -105 16 -128 -41 88 32 -8 13
3603 13 -25 169 57 -91 -32 -32 49 -26 26 82 -16 86 52 -8 -110 -62 -132 -159 72 137 -82 -114 153 9 158 253
3629 253 -95 -13 36 -55 151 -43 80 -137 -92 85 -92 -120 204 65 -121 65 -73 -36 110 12 -45 -85 30
3652 30 174 -147 -90 67 -55 68 -89 6 151 142 -137 -60 149 48 28 35 43 -86 -24 107 30 -97 -228 -103
3676 -103 1 126 -96 -129 95 -91 -58 -3 60 226 172 95 -95 18 77 26 -1 15 154 -119 -75 -160 -40 65
3700 65 3 -39 -6 -2 61 61 49 61 1 45 12 -74 98 -110 -68 -19 -74 76 42 -176 61 -53 -84 68 167 36 -270
3727 -270 -16 56 -18 164 19 -1 21 105 -75 29 -35 34 -59 21 -34 240 -12 -137 -101 -26 -95 -10 64 -153 -4
3752 -4 -102 -54 35 -33 66 -11 16 8 -30 -87 126 -7 83 -25 -123 -54 3 10 -35 2 61 -78 -147 37 11 93 49 6 -96
3781i6K20Pj63M6j35q2K65n4J9j01q0J68N3k08J72qm5l6P3o3K5l7m1R2K0L8j22
3808g3J56j63O2J41j37J17l4J08k23R4P0m4q5P9j07J16L9k27R5P6P9j54J49q9
3832D5M4lJ7o0qL4j08j7J11k5qq7r1lL1O3M1M8M6k56J34J94j81l3J0j6J42j12
3860d8J56j4j37lq0M0J13q2J11n8p0J2K54j18m8j37J07M9j16J76o0Q9j25L0m9
3885hj20J65j4j12L1lL8M6J0o8R2j16o6J77k03K28J3j87J61M0p9J3j12J34k14
3910a54J97Q9j15M4j42J01M5k66L25oq3L4j55M8M9OM8j54m9K64j49o0OJ30j06
3935e3O0p9Q4m3N0k1omJ6J3K0l1p6J42N6k36j55L70j20qJ91j97J35P7k54J55j99
3962a13J39O7j03m5K90k46P6J19j71k66J10k7J65mjk9j14J61n0l2R2K7n8M5kk02
$$ plain form
3781 -96 124 131 -32 14 -121 -203 62 8 27 -74 -154 14 67 -141 31 23 -22 -58 15 -48 -23 -60 -101 -9 11 49 -73
3808 -73 83 -80 -18 123 -14 103 69 177 -46 48 118 74 -11 68 -39 77 116 -111 -16 60 139 -15 134 45
3832 45 89 86 103 43 35 69 -39 -56 55 30 22 -65 -156 -159 -128 -65 -24 24 70 -186 -52 142 -39 -72 -62 -78 64 -48
3860 -48 108 94 -43 -46 -126 -86 27 -55 56 -2 -72 -60 194 76 28 -109 -2 47 -69 107 47 136 11 41 -8
3885 -8 -128 37 23 -89 -58 -61 -23 23 33 -35 57 -59 -125 52 -151 77 90 -97 64 104 25 38 -74 60 -154
3910 -154 43 132 17 61 -81 20 65 -201 124 118 35 69 -86 -38 11 17 65 -89 -138 126 -23 -83 -77 53 -53
3935 -53 7 -72 12 -31 19 -2 -8 -12 4 17 37 6 -70 72 128 -108 -263 107 -13 -21 170 -27 108 185 -69 86 -113
3962 -113 26 93 -10 -55 235 -11 65 184 13 -253 -143 -170 -5 -9 -10 -39 -153 8 -42 -74 18 45 -13 32 30 -172
3988a72K81j80K06L8j47L4N7K7k15J22r9Q7l1J07r2J14j55O4J1j46m2J48k2L0
4012B5m9J15j32M8o2n1J81j00j4N6n7K7L9k0N4M9k00J03n4J30k67J65m2P1N3j70
4038a02J27k01J89m9J4p6R3j0k5j13L47q4L9k05K5k8R4J46l0k52J8J69j37O3q7
4063g5J32j7j16P8m1n4J56O8k14J18N3j33N7kJ3j3J0m0J0j20K39k35J17q2J09
4088A8J8j64K08j39n2K72l10J94j03K08o1j41M1j13M4K09k16K57j75k9o5M7K34
4111A82k83n9P5K17q1K1Kjk10J34j97J38l2Q0j69j0L09j53J9q7J70j13K2m0M6
4136b0Qm2L6pK3J99l66L49k82j5K32l23K48j40K14j22k54J38K47j76l2O8j71K60
4160G2j48p2J51Q7j23O2o5J18k1j20J86k28J07o4N4n7L09k44J75j38J8k5k8RM4
$$ plain form
3988 -172 109 -71 135 173 26 60 117 144 -71 51 -48 39 8 115 23 137 -18 46 57 -89 -131 17 -5 25
4012 25 -24 91 -41 7 -55 -106 75 -25 -39 17 -40 -13 26 6 60 109 -91 12 -42 88 -179 -14 -56 15 68 -102
4038 -102 25 -176 13 -36 -22 -98 -5 -15 -40 -153 194 110 149 -56 -31 -59 35 181 151 -101 -83 86 -51 12 -75
4063 -75 57 40 -76 2 -39 -93 63 131 -83 35 88 -45 12 10 23 10 20 -20 -10 -130 109 -126 -9 -91 18
4088 18 36 -128 80 -59 -111 161 -149 45 -58 150 89 -52 -11 -124 -80 129 -87 170 -5 -34 -99 -52 182
4111 182 -101 -160 -85 132 51 72 74 73 -137 -3 -200 -62 -94 -14 -183 -193 116 -37 -18 -105 65 -48 -26 -66 -20
4136 -20 -12 -54 -18 -25 -2 197 -169 180 -102 -117 115 -208 40 -100 114 -8 -262 -124 123 -53 -85 -17 -188 72
4160 72 -76 -148 3 90 -33 29 -36 82 61 -59 127 -101 6 -58 -4 -61 248 4 179 41 59 34 6 15 59
4185E9p7lo1M3p3NN1J07j07N1L7m4J1k3L6r5M2j61K97j65K9n5pP2J73L6j01l0
4213D7j18J5N1L8J2j48J24q7P0J19j42j89L31j40n4m7rK44j51K04j43j60J71q0
4237d2j7Q2J8n9j15J27p0Q4n5kjo3J13n2k7J4P2K8jj42O4p4J11P7l4j2M0r9k9
4266f4P2n0J27k26P6K8J26N8k10J71n7k02J87L7l7P1mj71k5K76o0j25N3o1RJ9
4292A8l8L6o3J66m4j40J30k84J31m0J98n5j1m6K03l7j91J00p3q6J64k08J99j08
4316g9J36j59J64J3n6l9j83J84j30J70J27k13m4J1J5K23n1P8j92J27k17J32jM8
4340F4L5j73J10m6K7j53K10r8O5j14j2J01p9J35j30Q4j5l1j47J34Q8j17J2J0m6
4365h6J56o1k37K56K4j45J6M4J8J44j54n4J4Q2l9j31M3L04k93K2O3J50Mp2j9K4
$$ plain form
4185 59 -18 -21 -82 -39 -112 -107 -56 51 -56 -5 32 -12 -1 -24 12 -83 -41 -202 95 -70 -41 -96 -103 -31 142 178 77 47
4213 47 -71 -56 -5 33 45 -103 21 -66 4 123 -19 -208 123 -17 -71 -118 -127 117 -34 170 27 -133 38 -42
4237 -42 -59 23 41 -18 -133 -6 -76 8 -47 -49 -50 -113 0 -52 -79 -65 7 35 34 -108 -44 -118 -7 70 36 24 64 -35 -64
4266 -64 8 -42 85 -141 -65 -37 89 147 -63 108 51 -151 36 73 36 107 103 -68 -93 183 123 -2 51 -10 -1 18
4292 18 -20 16 -47 119 75 -65 65 -219 -88 -128 70 15 4 -42 161 124 -67 33 -40 -126 38 -170 29 -79
4316 -79 57 -102 62 75 19 -20 -203 -19 -149 21 148 -65 -109 -98 -83 140 89 167 -25 102 -115 17 16 64
4340 64 99 -74 36 -10 17 -136 74 -24 41 -73 -85 16 -63 72 -58 26 11 -20 -167 -33 55 -62 -50 -40 -86
4365 -86 70 9 -228 28 52 -93 -77 -33 -15 129 -25 -79 -65 17 -22 -153 -110 194 -99 -77 -14 136 140 68 49 73
4391G3o1j28K07n6j05J71p5k18M21k85J08K0q3J53j52J47k66O7K39j85kN4j01
4414e7j9J1l4lJ12r2J36j41J20P7j54K05k84K57k02R4j08K12j06j30J57j27nJ54
4438G3j36j18K07J27lj8p2l0m6p2p1K19j16J7J71r4p1J27j24J71O3k99L10l20
4462a05L53o5k58J89k43J8J49P1j51q9Q9J95q3q4kK8kJ56j18J7pm6l8o4R5Rj72
4489a58J49L6j43J56J25k31K13j98J12Q2k12J60j07J12k86L42k45O6OJ02k49J27
4511d1O3l3m3R6J56k01J70q3q6p6j6J8p4J24L5Kj23R7R7Nk6j15M1k2J05p3N0p
4539D0k7K1M3k32L13j32m2J34q3j5M5j42K8J9M9n1j8l7R5J18k09J73k25O6R3l2
4565hp0pJ9J03j29J29j59r2K62N1q8m5R4j07J55k12j08K7J36k6J0M3R2N5l5O5
$$ plain form
4391 73 12 -116 91 35 -70 101 26 -192 229 -56 52 72 -11 142 -10 137 -129 -62 177 -8 -10 44 -57
4414 -57 -76 -65 -99 -102 10 -82 54 -87 33 110 -44 161 -123 134 -68 26 -82 130 24 -106 51 -76 -81 73
4438 73 -63 -181 26 153 150 132 60 30 -16 -88 -159 60 -56 -39 132 38 -33 94 -30 141 204 -95 215 -105
4462 -105 248 183 -75 114 -129 -111 38 109 -42 -131 -42 153 70 -14 -16 12 10 166 48 65 58 12 -26 -90 5 14 -158
4489 -158 -9 27 -116 40 165 -66 147 -51 61 143 -69 91 -16 96 -190 152 -93 -27 -21 81 -168 -41
4511 -41 22 -11 -54 42 198 -3 167 84 -2 -78 -94 -76 -150 -26 9 11 -112 -15 82 87 61 -54 -13 -35 70 -3 47 40
4539 40 13 34 77 -155 158 26 -16 118 35 20 65 -77 -49 -30 19 -32 -50 -87 8 126 -83 90 -135 -69 24 -8
4565 -8 -78 -85 -66 37 -92 37 -122 -214 48 99 11 -34 60 -47 108 -104 -212 -185 -49 -75 -65 -22 70 125 90 155
4591A55k12L1J74p6j03J7o8J22p7K24k19k8l9R9M4j03M8q8K99j96j21o5J75O2
4615E5j80J15p3o0J70l8qo0P6J64q7r5O3PP9j87K1Q6Q7k8j75J27M1n6K1K7rp3
4643A0j45K05l0n8j1J71j81M9N5m4K2K7n5o8JL9p3L7K12j23j07k3K36k5j03qL4
4670D4Nj68J3O0J56j55n7J28q8J16j30J21Nr8j3K21j43N2o3j91P6O8O8O1n0M5
4696H3K7Mp3l9R6p9J04j59J18j40KK47k15K8J9J0j57j0L1J02j70J57R8j46J64
4721A02j06k9j47Q3J99j8q1j75L19l22J42p2Q1m3j3K2L3K1J4K4o8m5Q5J25k51
4746a20K5K50p4j03J45m5r4r4O1%N2j06K2J29j5j21L8%l8J51L4k73J49k1n4K38
4772A36j05j08J54o6l2L3m0O5O5r1J16k04M9p8J16M9n7J19j41Q1q0o6P8m7J29
$$ plain form
4591 155 -57 -26 148 72 -31 -14 -82 40 -37 187 -32 -60 -99 0 44 -59 -11 -99 200 4 -117 -182 -7 55
4615 55 -125 -10 -83 -143 27 -11 -19 -79 -3 161 74 -21 42 49 128 -59 -38 48 135 107 -68 59 100 44 65 92 83 10
4643 10 -135 70 40 -18 -29 142 -39 10 65 21 43 70 15 -53 -52 -13 -86 -49 163 40 -67 -90 146 121 18 10 44
4670 44 49 -119 -106 -46 110 -45 -102 26 -62 54 -76 45 50 -48 -61 160 17 69 6 -185 -109 -41 27 88 38 83
4696 83 110 114 41 2 98 19 123 -36 82 -58 -56 191 -24 4 23 33 -124 -134 -103 -1 -171 -14 84 -62 102
4721 102 -4 -33 -180 -97 102 84 3 -172 147 -175 -33 -105 -24 -67 -80 -58 -25 -4 10 34 -34 -79 6 131 -120
4746 -120 -95 155 81 -22 123 78 -16 -110 -49 -49 3 -103 -81 48 33 -88 -50 -50 -88 63 97 -176 -27 -48 -102 136
4772 136 31 -77 77 11 -21 12 -28 37 102 11 127 -77 -28 -106 10 59 2 121 -20 61 -19 -85 -7 -54 75
4797G5o0R6m8k2j18J85j72J63j10n1J47j43O1JN3j59Q1J55n9j55p1M4K34o7j43
4822h3Q9j13J66L6p2L4n5m6K56k44j57L38k35L02k31M5j7J22k37P5J35Jn4q4J57
4847A28j00O9J7j00R2j04j27J03L9Q5k76R9J23j02J46j95P2j10J14J3O8p4p8J79
4871H1mmq3p3l0j8J62N1qJ44k88P4R6j78m2oK3J03j20Q7R3j1n9J01L3j80J85k03
4899g4P2M6J09m5J7j36l8M9j52K58j81lm6K31m6j0k74K43n9N4k56L43j70j5J72
4924H9L6k51J89k06K61j53k5J3O8O6p7m2k9J17p4m9J4J81k14J62k1J7j9J7k00
4949a30R3n7J56l3j09J07j13R6k5j1j26J88J7Q4r5J0j45R6q8m1J41O5o5%n1j9
4975e5nJ18J1j55o3J33L6j6r7j0J23l0J00j22P7M1k11Q4L2o0J2k4N1J9JM0P9j15
$$ plain form
4797 75 15 111 63 41 -77 108 -64 99 -11 -62 85 -58 3 4 57 -102 -21 134 75 -80 -151 -107 127 60 -83
4822 -83 6 -107 59 95 23 57 2 -44 212 -32 -189 149 -86 216 -15 30 13 135 -102 -27 108 109 55 -29 128
4847 128 28 97 114 14 106 2 -125 -22 17 102 -174 -75 48 -54 92 -103 -31 -141 -27 -14 54 -20 -98 81
4871 81 77 73 -10 -83 -113 -131 31 82 74 218 -70 4 100 -78 -120 -126 -103 0 -120 -33 60 49 -10 91 124 -56 129 -74
4899 -74 -2 44 153 108 125 -11 -49 0 -152 106 -75 -78 -124 107 61 51 -223 20 -39 15 -241 102 -68 -83 89
4924 89 125 -126 63 -143 118 -35 -60 -47 21 87 10 -32 -61 56 -18 -67 -53 128 -86 76 55 72 53 70 -130
4949 -130 -37 -94 62 29 -80 27 -86 10 -15 -26 -152 36 53 137 42 52 -93 3 -85 -126 15 80 15 15 -36 -55
4975 -55 -60 58 69 -86 -149 -16 20 4 -93 -103 20 -10 90 -32 45 86 -125 -41 -9 -69 -57 -81 -30 -11 -10 30 109 -6
5003fK10k29J44j61j68K55n0O9J3%P9r2j11J02j67l6J65O3m9M2j00Q0j3rj86J75
5029B0j4M3n5NK1n1k42M04j80m3J92j90J17n1J37l2o5j4K13k14o5o7J08J89q0
5054H6j65J3J86j33m6k6K02j70n4J35r3Q1l8J01mJ54k97J61j40L4k7Q3n3RJ28
5079A27j74K50k04J50k5p3j39L5R3K9k02J85q0Q0l7l5O9j47N7ro7J31%j30o4J90
5105A0M4M0j01j72J56m8j1J52j56n1K04p5j07K49j39J86l01K31j16J49j69j1M3
5128GO1j06k4jKj2l6N0J50k43J54j03J43%o7RO8R8k43J65q9J99j81J8KL4lJ0P
5157F9k35J52Ll4J33q2J09j11J32l01K54n0j58J00K9p8O5l8j0Q6j72M2oJ5J32
5182D6k2k21J35J13l6k0k9Rp8J63O8k6k19PJ67l1J08j38J11j56J39pk0l2m7J0
$$ plain form
5003 -6 204 -25 119 -42 -210 45 -5 64 77 77 156 64 -47 55 -112 -148 17 80 31 73 -27 53 40 31 -155 20
5029 20 6 49 -6 -1 20 -31 -273 131 -49 -92 100 -90 27 -24 113 81 16 2 215 1 -64 -131 -23 166 86
5054 86 -79 -66 120 -13 -59 -85 117 -53 -107 28 -65 16 -22 79 75 229 -68 93 -47 -13 -40 43 -10 -1 127
5079 127 -47 203 -1 149 124 51 -88 -53 40 69 -133 52 -28 52 15 -20 49 -98 -41 -50 -117 14 14 -116 -180 10
5105 10 54 94 -7 -179 -23 -71 -82 70 -86 -137 67 -8 -115 134 -5 181 -120 111 -5 144 -25 -36 7
5128 7 68 -38 -62 -63 -61 -73 -109 -59 91 -152 2 -101 42 42 -25 -16 52 150 -93 72 -17 182 1 19 21 55 52 62 69
5157 69 -166 -14 -11 -45 88 6 115 4 136 -165 89 39 -119 -19 10 -68 -3 -41 -51 35 -137 -95 -101 -86 46
5182 46 24 -197 -62 51 15 -5 -34 -25 -103 60 128 102 -117 -110 57 26 134 -4 107 -49 90 83 63 31 -16 -6
5208fM1p7L6q3Q2m0LM8J43j81O1O5j06K8k2Kj28R0j1J19k40J64J6K1o0l0Q6OK8
5237E5r9J19j12n8J34j66J74j28M7M4N4j50J7P7j95J81jk1L5O9q3K8j53n3L02
5262A17p2j82J49M3l26L35Qj04J99j45M4r5qlj69J55J9J51k0k15Q5L8J0l6m1j46
5288b09K78N1r6J43j25N4o7K9p2J65j71o8K30j84l8OK47j30mQj10p9q3K8J34N9
5314dJ01M1j16m3O5o3M6j44K32l4j23j12J47j18J79mr3K8p0J44q1J15k21J89j06
5339d5J32j20mn1K37Qj95R3p0J10l3j29J52m2k48J40P3K4N7KM4J5k11m3N8J57
5365A11Q2j49k10J4L5K01oj73N9j6M5J6j37Q2J89j64J00m8J1j62J34n3P7r0N2
5390@o8l6M8M5J07k45J72j81K92j63L1K34k73Q9j44P8j2q2O0K36k79Q0J33k68
$$ plain form
5208 -6 35 -42 -6 -89 -7 -47 -44 4 147 -34 27 92 -14 14 -8 -6 -134 -44 -55 64 -176 -12 4 25 -35 -65 21 27 55
5237 55 -44 75 -37 -95 39 -127 47 -81 -34 10 64 -86 -69 8 -187 -6 -7 -28 7 76 -7 21 -132 -185 117
5262 117 45 -137 12 55 -271 64 72 -32 167 22 66 -29 -37 -40 -209 -54 -35 116 96 -119 -34 4 14 -22 -63 -209
5288 -209 69 120 24 167 42 96 29 58 -14 151 -20 -88 142 -42 -80 -74 173 43 39 47 -63 -142 -225 -197 -63 -4
5314 -4 97 138 22 -21 44 -19 27 -117 115 81 -42 -154 -7 -125 54 50 -43 -15 -85 59 -22 93 -128 61 -45
5339 -45 87 -33 -37 -88 149 157 -38 55 -15 95 62 -67 85 43 -205 -65 8 32 89 91 135 150 -61 -104 -46 111
5365 111 193 44 -166 -152 -117 84 78 -95 -36 -52 -7 9 -128 -46 143 -21 79 31 42 -120 14 -39 38 -52 0
5390 0 -68 -104 -56 -11 96 -149 23 -158 134 -29 2 236 -37 52 -92 -14 -26 -108 -48 188 -91 -11 122 -146
5414a46J59J37k03J1O1Jn9J08l9J6r6J19K0j0j42K0J62j69O2m5k6Q3j7r1N3J6
5440a5o5J75o4j6j46J83r5K34j50p8m6R4K8N1q6kp3K16j80j03J73r6J95j25n8
5465d9N4Rk9lL2ML7k8P3K5j24R1j1j56J4J4K5pJ68j44K9L4o8P7l7J16j73q0M4
5494f3Q0O4p6Q5k11L5o1N3J38J0l3j30K32m1q6lP4j94Q8m3M5J07k2Pn4J44r5j28
5522g8J04r1J47l23K65r9j05J61L1l4qk10K65R3lk7q4p6J62j85O0J54J9q7m0J29
5548A40j95J48j24K16j30J10j14j4N6j73J79q5j90J1J48R0R2Oq6Jjj49k1R0J18
5573A23qj12po7K2J11j03r8J62J12j53m2l0O7J19p5o6K89k18Rl2J42j36N6Kr8
5599c1O7j71K55%k2k07P2R3j42J72q9q9J58n5j24Q1N2K19k27m4K9jQ1j94L9j7
$$ plain form
5414 -146 13 150 -53 -42 19 20 -39 69 30 46 -50 69 89 79 -63 -43 119 -50 12 -33 -59 24 7 -84 -31 -15
5440 -15 -80 95 31 15 -131 52 -43 191 41 -37 -83 11 39 90 4 2 -71 145 -35 -138 35 -61 134 9 -49
5465 -49 5 14 -15 -18 14 18 55 27 100 125 1 92 81 -75 -61 -47 -22 -29 139 -5 24 58 -10 67 30 146 -27 -107 -63
5494 -63 17 81 5 90 -121 -86 -147 -94 44 54 21 -109 123 82 -4 -7 67 -127 -39 -82 -37 70 48 55 1 145 50 -78
5522 -78 26 -65 82 -241 24 -75 -180 -19 12 -22 -30 -240 25 118 115 88 4 -72 90 -95 -35 119 138 51 11 140
5548 140 -55 93 -31 185 55 165 51 37 93 -80 99 14 -176 -165 -17 73 165 171 85 86 85 -64 -85 5 123
5573 123 115 3 -4 -71 -49 62 -41 -139 23 135 -18 -60 -90 -23 96 21 -45 244 26 35 3 145 9 65 67 -31
5599 -31 36 -135 120 120 98 -109 -37 56 -86 86 -3 -92 66 11 -113 -32 20 239 12 -32 -3 -4 77 -117 -78 -95
5625i5J03p5N7oR5j13m8J78j08rr7jK27j63K3J1M1L3j58P0R1j87J49N2r2oJ8r3
5653a03J03j6R5k35J07J53j1l4K7j73R0Nl4O3J38j63Q5k1j03j06K17lj27L7J2
5678Cm4N1O9j16j6Q1j70J72q4k3l0P3k00K80n3m6l1k4lO0m9J63N7j08k1J1j05
5705a03J68M8o7l8K6K6N5k33J80K6k89J80q5J66j0j58oJ59J5J11j39O8j53l4K88
5730B01k76L1Rj21J27K0O9k69J95Nl8o9K59j99M2m9k5Q6k03K92j73J26j24O0K0
5755dj06L3K56n4k2n7l0l3q3K03k16M3l2K86j90n0J16o7k30K98J42k56p1J41p6
5780e9j5L1R0Q2r8m4j34J54L4l0j60J88J85j24j9%j50J24k0n9P3j05N0j28J66
5805C2j16OM3O9n2j84K19k9J26j15j11Q2m7J13p7l2O4q7J00J21k18K8j7L4J20
$$ plain form
5625 -95 8 -67 -10 -16 79 -34 -82 96 -12 -21 -118 -119 108 -55 -32 -21 20 53 -105 -35 56 -131 18 70 -22 -28 -10 -103
5653 -103 0 -16 79 -156 -49 104 93 59 86 -87 3 8 -26 37 175 12 97 76 -27 -133 84 81 -46 -9 3
5678 3 -41 10 79 -37 -53 28 -142 30 -54 -77 -107 -34 -234 46 -7 -53 -84 -108 -111 -51 -100 63 120 12 -9 2 -103
5705 -103 65 113 46 8 34 60 115 -118 62 88 -201 -21 -106 60 50 -108 -114 45 60 171 32 100 -53 -87 201
5730 201 -75 -44 -35 -156 -29 -9 60 -209 -14 -9 -47 -116 143 -56 -14 -63 -88 -2 -205 87 -86 40 -84 -24 -4
5755 -4 -110 -77 179 125 103 46 16 -17 -100 103 -113 -70 -102 184 -6 -56 60 -7 -237 61 203 -53 -124 17 -59
5780 -59 -74 -43 47 129 31 -13 -147 7 41 11 -149 39 224 100 81 81 -69 55 35 -24 49 -56 -6 -134 32
5805 32 -84 -78 -35 34 -18 -202 17 -12 114 -1 -112 -30 -77 36 -41 -73 -9 -96 4 125 -93 -65 -82 -48 72
5830G2k23J13J51j69Q0MO2n2K0m1n4k2J80k64J6r9K44J28k83J22J70J2k8k37J38
5855D0j3O8j85O1P9j71Q5O5L8O2k26J08N8o7ln5l2J2j1J49o9J05j02R6q0j90L02
5882A24o3o4q7P4qK36l82J33J49q2j9l3R5J4o1P1Q7o6k11J05r6rJ13j58J16J06
5908H4j08O5O0j1j28J94j89J18k6p8J13j35K0K6m9m0J82r1j06J36N5m4j8J56m7
5933A39j48l6p6P4N7Oj96J69O4K5J6k02J38R9j98m0N1O9R1k9j94K42j08j6Ol8
5959c5k0J47O9m1j04J07j25M1N1j16P1m3j78K63MK0K4j26j16K28m6m7K0j13M2
5984b3o1N6M6Q2j29k1K10p9Nj28J3K3q9m7J16J00O9j77%Q2j3o0K8j06J82K7r2
6011A4R5k55K60j81J4l1J54J7j33J30j74JM4K8J03n1k5J25k39P3j83K99j01R4
$$ plain form
5830 72 -151 -38 113 -56 24 28 90 38 58 17 -37 -59 121 -143 -127 -226 18 146 -137 -15 155 167 139 -98 40
5855 40 27 95 -90 -29 50 -121 -36 29 67 129 -97 11 69 2 -1 -56 -88 -76 -87 62 -7 98 -4 92 12 -178 124
5882 124 61 -3 -90 -16 -24 212 -170 -37 112 30 11 -22 73 87 26 97 184 118 -93 12 -84 -93 20 -138 -22 84
5908 84 -24 41 101 90 -38 156 -33 85 59 -19 94 -41 -21 5 -44 -84 98 7 -99 37 92 48 30 186 139
5933 139 -9 -45 -121 -47 10 16 -180 -11 53 78 94 -108 30 129 -69 -109 -58 11 102 73 -121 121 13 -3 3 -35
5959 -35 -55 92 161 120 16 123 -2 39 90 -26 45 2 -176 87 91 111 135 9 -107 121 75 28 48 -65 -23
5984 -23 -84 -28 18 100 -29 -50 160 81 86 -42 -29 -6 -95 -142 -26 74 143 -34 -34 48 35 -25 3 -103 79 106 14
6011 14 109 -146 114 -67 -53 -84 70 87 -46 84 -90 -89 -45 -17 86 35 10 135 -104 -31 -214 85 -16 78
6035G8j26PK3p3O8K6Oj25J47j35K14j01l6J35p5r8N8Pp7O1J34J6q8j0j66k7J86
6062B9j2r9M1n0J56L2j36M1l5Q6q2J47j08r8J53m5Q2m6k6K7L8r8M2m8K8j3j06
6089a00o8R0M7lJ39k15J67j39J72m6q0J7q6J99j97L11l03L0J24j68J50j30N7l2
6113f4J91m4K2j63K3J9j03J65j01n4P7J99k04Rm1P4Q0j02r2N6J10J00p0k14M8
6138g9J6R5j61O3J19m2J07j40K6M7j24J64k63J05L7p7K60p2k9p6R5j12N9j28K9
6163h1P0J9j98K89k5j35J64k08J12J01j4p1l2K39l51M5M5j59J83R7j68O9P1q2
6187b0Q5r0J26p1j72K0N1m0j5J50j28K63j59R1J23k62K8oQ7j33R1J68j65n6N9
6212B5L5k1j10J66o1N4l6L0k10J21l0M6Q6k17j40L40j07J94k69J43O1k01L9m2
$$ plain form
6035 78 -48 -41 -18 -91 -23 3 9 -116 31 -104 110 9 -27 108 33 -65 -7 0 -77 -16 118 134 46 36 -130 -157 29
6062 29 17 -82 -41 -91 65 97 -39 2 -33 53 -29 118 10 -88 65 20 102 56 30 57 95 -3 39 -9 19 6 -100
6089 -100 -168 -78 -31 -34 105 -110 57 -82 90 44 -36 -19 -105 94 -103 208 -95 -65 59 -109 41 -89 -32 -64
6113 -64 127 83 105 -58 -35 -16 -119 46 -55 -109 -32 167 -37 -28 -69 5 85 -17 -109 -53 57 157 87 -127 -79
6138 -79 -63 32 -129 -66 53 11 118 -22 4 51 -73 91 -172 -67 -30 -107 153 81 52 -24 71 -41 18 -110 -81
6163 -81 -11 8 -190 99 74 -61 103 -105 7 108 94 23 -9 230 -121 -76 -31 -190 -7 90 -78 -9 62 -20
6187 -20 65 -25 101 30 -142 -122 -71 -111 -126 24 -104 159 0 91 214 -48 -20 -26 61 -72 19 187 22 -34 25
6212 25 60 39 -71 95 34 88 52 82 -128 -7 -37 9 95 -122 -262 78 -29 165 -104 39 100 -101 -62 -104
6236a04J17K3K0j30n5J46J03r6k4J24k16J09j37R1J35N1n2rj00M0N7Qk5j35n3
6261a12O0K8o4J37J44k42J43r9RJ8J67l19N4RN6J7k3Q0q4QK5j67K13j59J78N7
6287A34k03l8O2O7r9L4m5J46n8O5j13j57J87O0O9j45O3o1J4j08P3N0K4O4lm3j11
6314g2o1J10L6K9M8q9P5L5q4j58O0k9l6k2J24p0J3Q2K8J40j40j20pJ48r4P7j54
6341a31K44k13L9j25NR4J37n4M8Ko4j04J31N8m5n3J4L2r3o2N5k3K10k19R5J74
6367A52j87nK1n9Q9K3j04J49R6j33j28J24j72P6J74J32k31j34n0J16J17j75K7
6390h2K38j68L0k3O4j3m5R1J05k23K7O7j4L1p5j16J73j14M6l3K3j98K95mn1M9
6416H0k2j53J50j07j7J03o9m6Q6l8M5o7J37jj52J00jJ27k64RO1Q9p6J23r4L9q6
$$ plain form
6236 -104 13 36 56 -74 -129 17 120 24 0 124 -92 17 -120 -29 106 157 105 96 -4 36 93 101 76 -59 -112
6261 -112 -52 -24 -88 49 193 -49 94 -5 4 22 189 -130 -76 -67 -11 6 -17 63 -21 -13 12 -155 58 -101 77 134
6287 134 -69 -107 -45 22 -77 -43 -88 58 0 65 -48 -205 -18 42 111 -34 29 -32 -18 -126 -53 -3 21 85 82 39 -72
6314 -72 -133 -23 13 42 90 1 76 111 27 -131 -71 -100 -136 -158 -34 -104 -91 -9 19 159 19 -101 -108 40 -54 23 -131
6341 -131 113 -100 -61 -186 -181 -87 50 -4 44 46 -18 -122 9 67 22 -31 -17 15 -78 -140 -85 -108 102 -117 -22 152
6367 152 -35 -40 -19 -78 11 34 -70 79 175 42 -86 38 -134 -58 116 248 17 -117 -167 -51 66 -109 -82
6390 -82 156 -12 18 -5 59 46 1 92 197 -26 1 68 54 85 10 -106 67 -47 -1 -34 -11 -209 86 82 31 80
6416 80 58 -95 55 -52 -69 34 -35 -81 5 -33 12 -55 82 81 -71 29 28 155 -109 -100 -39 50 -26 97 3 42 -44
6443d4K5J05Qj47n4J02l9m6J97q8QM2k21R7O8J63k82J03J51j33m1j59L06m7j03
6468b9J10o0L3Nrj10k0Q1J16j17o1J03j58Q6L4l0K9J15m7j90J54J37o9j96K9n4
6494a18p5K47N1p3q2J48j57J03J56k88j6M6M7J28q9j44K11k9j15n4L8K09k43J89
6518I0rk12J73j00N2R8k06J24n9J8K7M5ol22K47k0K36l12J86m3K9PM3N3j36l6
6544c3J2O2p4l5P2p3J41n0K9omk1k3j51N3J46j2k9j67K14M5l2j2j48K8Q6l1j05
6572a18Q1j5M1M0Rp5n6J45Lo2OQ1l0N8j66J07j16M3k0J97j27rr9M2o4J31k01J00
6600g4J47J1j42Q8M8k9M8j15j67J79k13L20L1q3j31kJ42mj36J01Qn7NJ16l1J1
6626G1R7j94J24J6Lq4k5q2p3J70P5q6m5j26J58N8j18Q2Q5k39J06L1pk6p3k2J03
$$ plain form
6443 -44 -19 86 94 -53 -107 -5 -44 -90 107 19 27 69 -152 -55 13 176 -106 -3 148 15 -26 -185 121 74 -29
6468 -29 81 21 54 59 50 -60 -80 1 117 0 -61 42 -116 -30 4 -26 3 118 71 -119 35 172 103 -93 -64 -118
6494 -118 -193 54 105 32 -50 98 -59 44 200 -88 -104 -58 -11 117 28 -116 95 66 -49 -103 -65 144 -99 90
6518 90 81 -131 42 -58 -6 92 -114 10 -49 -31 -4 41 35 -287 -40 -60 176 -136 50 7 36 43 86 139 3 -33
6544 -33 -21 41 -33 -68 4 -69 72 22 51 45 41 20 -3 -154 -101 45 33 4 -163 51 96 64 52 -96 -68 18 -13 -118
6572 -118 -37 -52 -11 29 38 -37 -93 52 55 -7 -1 80 50 108 -58 49 -67 -24 -44 153 26 17 -82 -40 -104 27 -174 -74
6600 -74 73 84 -58 30 78 49 97 -18 -185 -6 -219 101 132 49 -82 -84 58 54 -82 19 27 -30 -25 91 60 71
6626 71 168 -26 98 114 117 33 8 -74 -147 23 98 12 -33 -159 -1 57 -61 21 106 -133 -27 4 -3 -29 -102 -124 -21
6653b1J34j8p8P8J7k9k02K30m9J2k1n9n0JK9J63o2j37jP2J98k11r7Q1R8l4q2J6
6681b2j5l8M8K4K1jl5r4N6K42j12j51O8JJ0M5M4j15Q3k2O8p8K8P8j29O4r8Q2M
6710E6m0M5J5k71J56J96j45M5J9q7J34k16K00r1K0n%j04K6lJ45k52K37j47J4O2
6736Ij5L2N3j16J05j67K21J61l31J14rr9q5J05L0N5m5n9r5K53k21O8L1Q3p4n5
6762e1R5l6O7Q3r3l8r1K18j99j01K09o6no8J20K4j29P8N9j03Q7J5o6Q4k0j74Q7
6789a4Q5m6O0o4j30J39Rr9j8N0O4J09j27M0P4r4L1j29J30j01J7MK9J8j65J08o7
6816h7J29m6q6N2p7K38j47n9J54p3J92j59j42O8q8M3J84J32k40o7J8j37K43j91
6840a46J75K5q8k4nJ61j2j59N2M4k5M6j46J33j17J80p1p2L7l7J57n7n3j24P7m1
$$ plain form
6653 -21 113 95 17 95 112 83 -119 111 62 74 53 -6 -56 -55 -26 137 75 -62 -63 9 207 -4 -101 -20 78 44 -38 -22
6681 -22 -37 -75 -27 -3 18 17 -18 -112 -56 186 74 -77 -9 -8 2 47 91 -24 59 37 105 27 55 133 4 68 -30 52 56
6710 56 16 61 76 -195 -39 157 12 57 76 -11 123 -93 107 16 36 31 31 -73 -47 -50 95 -157 80 -67 -53 9
6736 9 -6 26 79 -37 68 -99 122 283 -48 66 57 -42 -127 -22 8 63 18 -41 -136 117 -104 -36 -5 78 4 -51
6762 -51 44 8 75 158 65 27 -64 154 -45 -146 63 -3 -8 -76 44 68 -61 17 76 -27 60 75 9 93 73 -101 -14
6789 -14 71 25 85 21 -109 30 39 -60 -78 -28 36 145 18 58 132 38 69 -60 70 -31 -14 -10 19 37 -128 -20 -87
6816 -87 42 -4 -90 -38 -115 123 -24 -83 71 -2 190 31 -111 -43 -131 -88 96 228 -12 -79 -61 -198 45 -146
6840 -146 29 54 -34 -58 -63 98 86 -73 -21 23 -2 44 -102 31 -86 94 23 -49 -12 -49 108 51 -2 -126 -49 -90
6866i0J73J26l49K21p8L4m9O8l8J51k71J64l1M6k42L29k87J27j98K34n5Q6J7j39
6890e1J37r7j83K79j21J8M1q1J5Op5J89p0P0K4l8j7J3l1lJ0j89J59L3j16J62p1
6917A3J33k86K70r1j41K04r3j35q3K85j38J26r7J0M2n3J32p8L8N1qn9j17J98j
6942A22p8r1J9j8L1l8J36K3J18k82J48j8q8N9P9L4m0j13j5R0j81L1L24l24N4p9
6968i7J30J31k0k59J40j05K7P9j22J26r2R6p4R7n6K38k42j11Q3M2j0P8j84K2k7
6993a10N8Q6J10k3p8r4r4J56Jq8j9Q1l2N5n4J0J03j55l6J57r2n4QN7K27k68P7
7020a1k2j06L20k51J03j09J27j89K43j17j27J23J30r9j27M3K05r0n1pO9P8k05
7043g0K3o6N9J56j35O7k01K25Q4j71N4N1r1nN8j04J01j56K30j32P0R1k17R6q0
$$ plain form
6866 -90 83 209 -140 81 3 37 -12 56 18 169 -102 62 31 77 -165 164 -123 4 -194 40 -15 71 88 -51
6890 -51 86 -11 -194 85 -36 -18 23 -58 -43 -37 -112 77 7 77 101 63 46 59 28 25 35 -154 5 38 -78 84 13
6917 13 146 -140 130 39 -102 102 9 -126 -209 76 -62 64 -33 -23 19 -34 98 20 58 109 101 42 -75 123 122
6942 122 44 -47 -28 -46 -15 -53 83 106 224 -58 90 72 -16 43 122 156 116 3 -12 78 -103 -72 252 -72 -18 -97
6968 -97 33 164 144 -115 25 -80 -53 26 -96 30 -62 34 -40 57 1 239 -3 -114 -31 11 1 79 -105 -83 -110
6993 -110 -52 34 144 121 43 -51 -145 11 12 -76 -95 -14 -46 9 -45 -35 68 -87 -123 34 -58 -112 -104 -47 180 -88 -11
7020 -11 -33 -139 181 -70 33 -76 51 -138 105 -12 -139 -16 114 15 -112 -69 136 46 -5 -12 57 135 -70
7043 -70 -47 -113 -54 102 -33 34 -167 58 142 -29 25 76 -15 -20 38 -66 35 -121 109 -23 47 138 -79 17 -63
7068f3N4j0k6N0j05rQ7j7L5j44J11J87j95K43j10j91MJ08j16R4J40j17N3j13l
7093e3o1K50n1R8k15L7j7j17J08j3j0j05K58k38j0K35j46N3m7K0N3K6j52J16p4
7118e5K9N9p1J81j18K8p9Q1k0JP8op0L2K1j63L3M7j5J20n7r0n0J79M9j33k2j6
7146b7J02k54J79P0j88N2M6O5j6L8j1%j34J91m0J5o4pM7j32J06k5n9p8J3J41j14
7173h4N5m5J04o6r4K0J00J7j2O5j11J13O7k04J17l6J0N4r2q4J99%j52J15j67P5
7199c6l7J87p7j21Q3q3oJ64p0J0Pj16J91k3j14ok4o4J10j9J29j46O2K1L5P4n4
7226G7p0n8J28k28K19n0q7P7r6o7J23qk9M0n2J00n4R4m3m7l8J23p2J12Q7j58n4
7253c1m5J5J6k1J11l7J44n2P8k14m1l1l2J52m5J09j34K81k43l0J07p9Kj5O7R6
$$ plain form
7068 -63 -9 -19 -45 5 -100 -109 -22 -39 -4 -148 -37 150 -45 198 88 -103 -99 9 -107 -13 127 10 63 -50 -53
7093 -53 -114 136 85 183 -32 5 -12 -129 -21 -34 -44 -149 109 -129 -139 96 -50 3 -44 -24 29 55 -97 19 -55
7118 -55 -26 33 -38 143 25 53 -26 55 35 36 114 108 38 70 91 -72 -39 8 -7 113 56 -34 -84 95 144 11 -11 -27
7146 -27 75 -179 0 70 -118 -66 -20 45 29 67 56 56 -78 113 73 88 24 17 64 -68 38 13 -46 -124 -111 30 -84
7173 -84 -29 -74 30 -36 -130 -110 -10 7 -5 60 -51 62 129 -75 42 6 16 70 -22 -106 93 93 -59 56 -111 -36
7199 -36 -73 114 37 -84 -1 -84 -90 74 4 14 21 -95 96 73 -41 -47 -71 -135 -25 -44 85 -61 1 22 57 131 77
7226 77 7 -51 77 -151 68 18 -69 8 -88 -155 -32 -40 -69 -29 -81 19 -35 59 16 -31 -69 54 -18 94 181 23 -31
7253 -31 -76 -61 -45 -66 45 8 152 100 178 -36 -77 -108 -140 12 -33 76 -58 223 -20 -50 57 -22 -20 -35 32 128
7279A28O7r5k50K64p5J6n9m0M1k4k3Oj13K07N6j39q1N2j04K39j42J31j15%q1K14
7305H0j9q0l9J04l6N1j32J15Q3k01Q5J00j91R8n3m5L07j20l2j77Q7K80k40J1j72
7330a36J21NN9Kj29P6O6j47K88p9m0n0L5j10O8Q4r3j83J00K3j93K69o2p2K7j0
7356h1P9k5L0j52J01J35j43J46j15j21P9N7P6j6j21pJ81k4lj07R1n9K3P0j25j
7382c2J30j15mj5J38j41j04J68qq5J39J7k09J23J0m7k48L39j73q7K92Oq7p0J38
7407G5l5j86J58Q9k46J39J03j23l9R0JkM4l6l5p4q7J33n9J58N7n3p0j43L9J43
7433D1L3k0N5j6j21r6J04J52j2j63m7J73n5j4J36k16k1R1n4J04l0j20L7J30k86
7458b15J97MJ90p8q6j1p6lJ29q7KM9J11q2j46J11j6L1R2P4o5j92P4j01M8j03J95
$$ plain form
7279 128 195 100 -150 114 39 55 -4 -44 -3 -27 -50 -44 -157 50 106 -33 -114 -62 -166 73 -69 62 -53 -53 -134 80
7305 80 61 -19 -58 46 10 61 -71 44 127 -74 11 111 -80 18 -35 -80 227 107 75 -102 -15 265 25 36 -136
7330 -136 -15 -10 49 51 -78 -2 64 -83 205 126 86 36 71 -39 29 113 20 -163 -63 -40 -233 36 -26 -98 -71 -81
7356 -81 -2 -27 3 -149 -48 87 -56 90 -25 -146 -67 -10 66 50 -71 -78 103 79 76 -31 60 1 24 94 -31 -32
7382 -32 98 -17 -21 -36 102 -39 -143 25 17 -68 71 88 -121 2 12 -35 -283 56 -117 -204 88 94 7 -63 75
7407 75 40 -146 12 101 -145 -6 97 -26 -65 25 26 24 68 32 -3 -77 -164 -31 -90 68 125 72 2 -141 -102 41
7433 41 74 54 109 93 -28 -124 -20 132 120 -43 -90 83 28 14 150 -66 -87 4 -50 54 24 -96 -59 71 -215
7458 -215 -18 -14 176 98 12 1 -75 -78 51 -36 -34 15 126 44 -102 9 -7 24 116 190 125 -67 7 -94 -46 -149 46
7485D6K7L1q6j13M9J39l7j18Q6m5j36K20j66Q3N8m2N6J21j18N4j07K7K2o4q0K1
7511g2J51j12pm6J68qk8n2M9j7J7k8j22J35Po5r2K33p5L6m8j37J94K6k25J8J37
7538C7J8j40K82k44n0K70k49L7J07j04P1q0J26o8n0M2K5m5Mj63K64k06J54Pk2
7563B3K1k2L3p9j46J16O6n6J61l3j3k68K00QJ71j14j08M3q8P6Q7j82K26j19P5
7588G8p3j09J58l4P7j99k2J02k9l2P9R6K4j2j11o5J40j47n3QJ96o5R0p4m4P7l1
7615B5j58K47j95M4J95k72l5J85q6J27m6k8J22Jp4m6k4j6K48k75R9k0J53q4j73
7640h6q8K48k9k22O2K13q5j38K06m0r1j7J44j76J40r8Q3o1M1k0J5J15P7j25j30
7665f2J33P3k10J54j88P0J35j02k4j02J5J29j72K06r8k6J53j82kJ81j26k6K82
$$ plain form
7485 46 73 104 18 -95 -46 93 56 -62 24 -21 -157 63 -103 -20 38 -4 52 173 55 109 2 29 51 -13 -93 -72
7511 -72 79 -33 -40 -86 82 74 46 -6 43 26 43 15 -107 28 35 -30 -122 111 36 72 24 -113 81 107 -118 -100 37
7538 37 55 -85 197 -47 -97 173 -76 -39 68 -36 35 -45 81 13 -37 5 30 -15 -11 -174 90 -116 38 45 23
7563 23 44 22 55 -24 -170 -54 12 -44 117 84 71 -197 3 11 182 68 -40 3 -85 -9 78 -104 122 3 78
7588 78 5 -104 54 20 97 -102 -124 -22 -51 -83 -4 92 116 104 -7 -72 68 -79 -132 -124 72 7 97 23 -21 56 25
7615 25 -133 114 -81 -37 158 -114 -149 36 -50 77 31 3 125 126 52 6 -18 -34 214 -61 38 18 171 87 -86
7640 -86 -174 74 45 -177 -115 98 13 -125 81 41 -50 -67 77 -99 41 -57 26 -35 6 -14 1 116 193 68 -62
7665 -62 71 144 -66 88 -100 -30 105 3 -21 -123 -108 21 -151 55 -43 -69 84 -98 -100 81 -45 -71 211
7688B11j15j65j5q0J85L1j08N8QL0P6j72J42m1J49j88NR7k87L03p5l6r4J73k13
7713a21K86n6K2J4j01p6Q7j43R3j7O8j68J5J38j11j06K01JPj0r1l2J02p9J2M8
7739a7K1Pl3M1r5N5RJ9m7j10J61l1l1L12l33j10L43j51K7L8K6j01j6L3j15J04
7765Fj13o7J43m5J68j6r4q5K76l61L04j44Q8o2j07K63m2j26J85j43%p5R1j2m8
7790a6J46j62LJ09KM1l4K8p2k03J66p0J57pk20J49ql7P4P2j19j14R0m4K8K1q5
7817a05J40k42J98J07k5o6j02m1J59j10Q3J19k24J66m0R5k52K45k3j98J69l7j52
7840a36J43K5J7j66l1J42o6N9k6J87j57q4K8J37p2m1J63k67J88L7m0J9O7q8k2
7865A6k3K13k91o2R8Q6m8N5j5j37O2j13J17j4O2p5n7j8K40k22J29O5j77Q9J66
$$ plain form
7688 211 96 -69 -84 -164 21 52 -56 2 10 40 116 -56 86 45 194 6 11 108 -179 124 49 13 -81 92 -121
7713 -121 165 109 131 145 44 -32 55 -88 5 -12 56 -112 -97 41 -70 -176 25 26 33 23 -68 -100 2 -77 -65 -17
7739 -17 4 11 -22 19 -76 -21 -12 7 -40 -150 11 -20 -51 261 -72 -182 161 10 37 75 101 0 -16 17 -98 6
7765 6 -107 -174 -31 -76 92 76 -18 -103 173 -188 116 -28 60 -2 -109 154 112 -14 171 28 28 -47 44 32 -16
7790 -16 130 -32 -29 80 82 123 89 117 45 -158 8 -62 95 88 -132 17 9 -28 46 118 -1 -115 -25 -69 -41 -20 -105
7817 -105 35 -207 -9 98 73 7 -95 -136 23 -87 -4 115 -109 57 17 112 -140 105 82 -116 53 16 -136
7840 -136 7 32 49 -117 -148 -6 -72 -13 -39 148 -9 -93 -65 72 0 -41 122 -145 43 80 40 59 126 38 16
7865 16 -7 206 -85 -147 -49 37 -11 44 29 -108 -46 -159 -42 -56 6 -69 -126 -144 96 -126 3 68 -109 -20 146
7890A46j67j5J17j26O1j24N5o8K35k06L34k62Q8j09j74L22j68r4J93k4m2J54N
7913A31k20L07n9k61P4o0J1m7R6k4K2j2J50mM1m6k05P1M1K9j42jJ28q2R3n0op7
7941a02J47R1j08l5j41J80p9R6n0R6k00OK23j12o0K5o0J12j68J83o4P8J95k32
7965B1Jq1Q4j59K0R9KJ15j74J26j06J44M3j21m7k2o1K91j12K0r3k2M0j53K02j22
7991f5N1N2Nj54J93L1j57P5K15k83O8N3k04K74k35K14j13Q4j64n6K03k7K9K3q1
8016C1L4m6l6M8n6n7o5K32R3l42K05o7J4J13j71O2k2J16K0m3k77Q0L47q3j46M0
8042B4q0q1J84Q7j95M3N0K0Qj14M8j17K50kp3n0M3n5j77J76O4l9j23N9M1J75k33
8069f7J41M4o1J7j33N7p5J6J0K0k7J17R1j93J02l2KK3j12O3j69J86pN0O7q2qk3
$$ plain form
7890 146 -21 -36 81 -45 16 -108 -53 -121 114 -92 242 -20 68 -41 -215 107 -61 -155 38 14 -28 126 131
7913 131 -89 218 159 -102 -28 -88 -77 -124 -28 -52 -30 -42 108 104 145 99 -106 -35 6 35 -107 -108 20 -62 31 -19 -25 -102
7941 -102 45 136 28 -7 -148 32 -47 49 -1 95 -105 -99 124 12 -48 -23 -83 29 -139 44 -20 58 253 21
7965 21 22 -59 25 -134 -114 -15 -13 102 -72 54 -52 92 135 14 -33 -55 -116 175 63 83 -10 -32 8 -145 57 -65
7991 -65 -14 38 43 -111 82 113 -44 31 246 -37 31 84 -120 154 -81 133 20 104 -60 -116 87 60 89 112 31
8016 31 65 19 -17 31 -25 -82 -147 85 178 -164 41 -26 -12 101 -70 -8 -30 86 106 63 -214 -134 213 130 -16 24
8042 24 -56 -137 47 134 -61 -18 32 52 60 -54 -6 -123 127 125 52 2 45 -10 -187 -11 53 14 -109 -50 -9 166 -67
8069 -67 74 118 57 74 -59 -2 -77 -61 -51 -31 -58 59 150 -43 59 27 29 52 -60 3 -166 20 13 63 130 48 40 17
8097A7j15Q9j3l3R0K2j27r7J74j9k3K3M4k9N4m2K12l17J15K1j2L7K9k60L64j93
8123A1j60J87J31r5N5k05K09j90J26j8l1Jo0Nj4R9j24p5J45q7K3L6J6J72k4k57
8149a24J62j28N2q1q8L9J28J33j62k4O8J21k8p1J8j50J00K6L0L7k7Q4o0l6J61
8174A80j56j57R9qm4k1J17j54J53K6j15P7p4Rj1J37j38
$$ plain form
8097 17 -98 -9 -22 -55 35 57 -70 -167 7 -12 -35 -12 32 3 57 15 227 -90 25 46 34 71 100 -160 204 11
8123 11 -149 38 169 74 129 -76 133 -57 69 51 20 21 -39 -34 -48 51 -73 -148 -3 -90 -67 -31 -15 157 133 -124
8149 -124 38 -90 -38 -119 -207 -168 -40 93 -69 -93 -25 96 68 -3 15 -135 -35 -9 21 58 31 115 55 19 180
8174 180 24 -133 -34 -42 -86 -107 10 -144 9 35 -80 -3 -77 -68 -79 58 -80
8191h0
$$ Imaginary data points
##PAGE= N=2
##DATA TABLE= (X++(I..I)), XYDATA
0@%%%%%%%%%%%%%%%%%%%%Oj4J6j6J6j6J6k2L0l2L2l9M7n0N8o5P3q2R0j01J11j24
42f6J39j53J69j86K05k27K49k74L01l31L67m05M48m96N51o16O91p80Q85j015J181
63F37j400J706k158K884m244P625k9986m6622P8929J9406k1653K1858k964j2957
77A1061L7873n516l4281J4451o768l7758J9646K3732j7240q415r621q340K5360
90D184q934m6735Q032L0635o325K909J0879j349J5400M191k0215J1430J6313k1694
104a279k511K5128O854J01p509j6536J4116Q414l6219j1432K2010o457q323R152
118d491n786K985Q737k4346o412K7331r283j8930K1102J4750q36P258p681k182
132B216K1467r213k4439J7169J4853j4516O12P540l542K730r322j8464Q160O998
$$ plain form
0 0 0 0 0 0 0 0 0 0 0 0 0 0 0 0 0 0 0 0 0 0 6 -8 8 -8 8 -8 8 -14 16 -16 16 -23 24 -26 32 -33 40 -42 48 -53 58 -66
42 -66 73 -80 89 -97 108 -119 130 -144 157 -174 193 -212 236 -260 291 -325 366 -414 471 -544 637
63 637 -763 943 -1215 1669 -2575 5050 -24936 -71558 7371 26777 5124 26982 24018 11061
77 11061 48934 43418 9137 23588 16820 -20938 -1292 22440 5200 -3215 -12836 -21176 4184
90 4184 -4750 -51485 -43453 -12818 -19143 -16234 -5355 -6704 8696 12887 -7328 4102 20415 -1279
104 -1279 -3790 21338 28192 28293 20784 4248 18364 26778 -9441 -20873 1137 -5320 -13643 -4491
118 -4491 -10277 -7292 1445 -22901 -29313 -1982 -11265 -30195 -9093 5657 4821 12079 4398 2216
132 2216 23683 14470 -9969 7200 22053 7537 8149 15689 12147 14877 5555 -12909 -4749 2249
146B249j9261m745J3258L958q83o080m401J3250J680j8361M612J8272j360r74
160A214O813K221R417N01j8339L007J5692j2890j2182J0641L682l205k068j1189
174f685P20R463j5646j3335J5044M985r086L902M802L367P325q081p755J5995
188E015N308j3333M142J2867K77q37l250m074P223k674j6709J527J0264o250o400
203f904K123R43K255l957j1310M261J0217p484m681J0709O663j59m52k275N690
218E639N995r402m430J2180K892p363M03K230N21j360r567n222Q450j190j1152
233a1376K672P629k049l028k035j85N685r79p693N684J0766k018k903M604L963
248H737L64l712m647L923N322n981m419O077K866n547n058j506J586r75o926j584
$$ plain form
146 2249 -17012 -21757 -8499 -4541 -5424 -11504 -15905 -2655 -975 -19336 -14724 3548 2188 1214
160 1214 8027 10248 19665 20166 1827 4834 20526 7636 -4546 6095 9777 6572 4504 -6685
174 -6685 -5965 3498 -12148 -25483 -10439 -5454 -14540 -10638 -5836 -2469 4856 -3225 -10980 5015
188 5015 10323 -3010 1132 13999 14276 13439 10189 6115 13338 10664 -6045 -4518 5746 -504 -6904
203 -6904 -4781 -3838 -1583 -5540 -16850 -12589 -2372 -9856 -14537 -3828 2835 2676 2224 -51 5639
218 5639 11634 2232 -2198 9982 12874 5511 5914 8144 8665 7305 -2262 -7484 966 -224 -11376
233 -11376 -8704 -1075 -3124 -6152 -8187 -8372 -2687 -3666 -11359 -5675 5091 3073 170 4774 8737
248 8737 9101 5389 742 4665 9987 4006 -413 5664 8530 2983 -2075 -3581 -1995 -2970 -9896 -11480
264a1480P727J953m574p5M273K031k432l863K354P275J10l382L990O374m87m219
280E575j982J410J175m619m564L956M205m097l845J250R98k566n267k070M393
295f048K808l298M58O339K876k625k135J554K999m53l317K212O295R82l585l96
311D666K302j028n433m122J375K319k216l052K550L426k195m250o96K401p9k630
327f662M5N917L684j169p04L010K109k430l590Q35L113K22k190M02L324K60m782
344A394l328M50K64l665k396K376L362M5k293N45L047o92l523l91L601K296p37
361C55O65L201L043j527l323j05J993j898l603Q47L014L70k268j524N85J38l514
378c551l424J826K350r40m47J980L055N71k542r25K680R85k376M95L495K000l52
$$ plain form
264 -11480 -3753 -1800 -6374 -6449 -2176 -145 -2577 -6440 -4086 3189 3299 -83 3907 10281 9794 5575
280 5575 3593 5003 6178 1559 -3005 951 5156 1059 -2786 -1536 -538 -3104 -8371 -10441 -6048
295 -6048 -3240 -6538 -6080 259 3135 510 -1625 -71 2928 2475 -842 1370 7665 8647 5062 4666
311 4666 6968 5940 507 -3615 -2240 79 -2137 -5189 -2639 787 -1408 -5658 -6354 -3953 -4032 -6662
327 -6662 -6617 -700 2984 1815 1111 4121 6230 3800 210 1045 4158 4380 2190 2592 5916 6176 1394
344 1394 -1934 -1484 -1220 -4885 -7281 -4905 -1543 -1498 -3791 -3246 -199 -891 -4414 -4805 -1204 1092 355
361 355 1020 4221 7264 5737 2414 2309 4302 2404 -1199 -352 2662 3032 764 -760 -175 -37 -3551
378 -3551 -6975 -5149 -2799 -3739 -4186 -2206 849 1420 -1122 -2047 633 1618 -758 -263 3232 5232 4880
395D880j677j54J842j871m413l41K803q72j874M18J056M78j943l343O75K560k197
412c973j273L256K597J04Q3l88J225J326k463j579L668J790j879Q1J306o3o88
429C130l170k063J834k01l170P07K686l96j112r37o40J631p88k692K366L723l01
446F07l08J963Q01L52r72k648J448K433k475q63K969L43j794r47j972j90L27l346
464d272r78M056L25k042J394J142n83J05j595n57L269Q27j922K721K703j020o07
481B966m55j052Q55j157k853J635K452j856o78Q73j025n80j350k700J560J923
497a442j833K31L371M82o34K06r18P66J031k098J75L845r8j213J531k36j042k26
515A898k727r94K270j081k048K471R99j726K4r04j040J405q29j872K949K098j373
$$ plain form
395 4880 3203 3049 4891 3020 -1393 -1734 1069 197 -1677 -1259 -203 275 -1668 -5011 -4336 -1776 -3973
412 -3973 -5246 -1990 607 711 794 406 1631 2957 494 -1085 2583 4373 2494 2575 3881 3818 3130
429 3130 -40 -2103 -269 -470 -3640 -2933 -247 -643 -1755 -2692 -3332 -1701 -2489 -5181 -2815 908 607
446 607 299 2262 3063 3415 2443 -205 1243 3676 1201 338 3307 3650 1856 909 -1063 -1253 -926 -4272
464 -4272 -5250 -1194 -869 -2911 -1517 -375 -958 -853 -2448 -3005 264 1091 -831 1890 4593 3573 2966
481 2966 2511 1459 2314 1157 -1696 -61 2391 535 -143 730 -295 -875 -2225 -4925 -3365 -1442
497 -1442 -3275 -3044 327 809 175 381 -537 229 1260 -838 -663 3182 3084 1871 3402 3166 2124 1898
515 1898 -829 -1823 447 -634 -2682 -211 788 -938 -914 -1818 -2858 -1453 -2282 -4154 -1205 893 -480
532d80R56J824q04L55m30k200J746J670k407Q17K384j276n49j69k433J02Q04l175
550c265PL147j076r60K016n59p87P68j594k04K919k68j166L165P11j228J019q15
568A830j367J337o76k107K315O52k158P21K86k075N10p39k052J590J232j989J002
585a688K147j232K49M63r85P33J450j565J029K352r51m04J174j492l86P26k249
602f29j16K109j632r70J822q74j529J005j185r09J934m33j113K453O39j153J347
619G66J91j322J261L63j464J624J269j666Q17P64j891j6p8j970N41Q90j878L90
637a409J631j199o00Q56j144r7R61p00L55K087l28K0J459o06m88O88j018l21J316
656A463m02l93J171l23j050M19j468j155R81q56j000J610N53r17R55J48j168R32
$$ plain form
532 -480 476 2300 1496 1851 1421 -779 967 2637 230 1047 3431 2155 1606 1437 -996 -894 -90 -3265
550 -3265 -3258 -111 -1187 -2147 -131 -690 -1477 -709 -2303 -2507 412 144 -1022 2143 2854 1626 2645 1830
568 1830 463 1800 1124 -983 1332 1984 -174 547 833 -1242 -732 -1471 -3523 -1933 -701 -2690 -1688
585 -1688 459 -773 -524 -61 -1046 -313 1137 -428 601 2953 2002 1598 2772 1280 894 1620 -629
602 -629 -745 1364 -268 -1238 584 -290 -1819 -814 -1999 -2908 -974 -1407 -2520 -67 572 -581 766
619 766 957 -365 896 1259 -205 1419 2688 1022 1839 2603 712 696 618 -1352 -811 79 -1799 -1409
637 -1409 222 -977 -1577 -721 -1865 -1962 -1001 -1701 -1346 741 413 433 1892 1286 798 1486 468 147 1463
656 1463 1061 668 1839 1516 466 885 -583 -1738 -757 -1613 -2613 -1003 -450 -1367 -412 -264 -1432 -500
674e00J1j074J456R52p46J106J126o48J19J28j414k5M12j286J22J165o79k27N02
693E00j299k13R2j294k27J363l26K43J414j05k20Q04o64o03J331l82n12J487K23
712A612l92R73p34j019M19p24j434Q42K46r60N78N39q06J23M6j332O40M35o78
731a626P27R90O1L18Q08n60J09M30p53k51R35j44k84N85l90l56N0j124n14M85
751e04m94n71O00L12k81N15m63k05P77j55m55P24O20J4N43K95j59J82mq18O4L69
773I06o33K8L19m38j29j21j051K80K33q56n7P32K77j96K56K0L9L91l53O1Q47K80
795H35j32M55J31P3k25k71o24K22r5o52L96J8k20k80j96l75k1j88m28M20O33N5
817d69J91N55r4K68r0m74L32N01j12J54M26J33k39j29m49l35k12n28k81L47J85
$$ plain form
674 -500 -489 -1563 -107 845 99 1205 2331 1683 1802 1930 516 491 903 -383 -261 904 225 -2 500
693 500 -799 -1012 -920 -2214 -2441 -1078 -1404 -1161 253 148 -72 732 68 -535 796 414 -98 1389 1612
712 1612 1220 2193 1459 440 859 135 -1299 -457 -211 -1171 -593 -54 -860 -737 -691 -2023 -1383 -948 -1626
731 -1626 -899 91 152 470 1278 718 827 1257 504 253 1188 1044 760 1345 955 599 649 -475 -989 -504
751 -504 -998 -1569 -969 -657 -938 -423 -886 -1091 -314 -469 -924 -200 420 434 977 1272 1113 1295 1291 473 537 906
773 906 273 301 620 182 53 -68 -1119 -839 -606 -1462 -1519 -787 -510 -706 -450 -430 -391 0 -353 -292 555 835
795 835 703 1158 1289 1362 1137 866 242 464 369 -283 113 131 -89 -369 -565 -940 -961 -1149 -1577 -1157 -524 -469
817 -469 -278 277 183 451 361 -113 219 720 608 762 1188 1321 1082 953 504 169 -43 -571 -852 -505 -320
838c20n7p7N4k11j14l98q2N39J89J06M84M91J66K10m84Q4Kj96j43J82K47K38k01
861G09k43J9l88n94n17m4J15PJ5N21J91J27k28j24J86j08r4K42N70N86J44oj36
884I50K11l64m37m34J64J04L0l31J50K11k81n95l6O0m26j80K86J55M84L87j67
905e9M13J39l39j07L62j28L50L3p5L22L39o51n29k9j64r5j86j5K00K6m03L9J46
928d11j50k53J90RL31K22jJ07N07k73Q7J77r3N5J65j56jL34l52m66J30j37m85
951d64O2r0j16L12k93l55O46K6l73j6N16j81L47K41j71O46R1n93k2M93k58qP0
974E10n7k5j6n19j77K72m33m92L96j35J18J60j83K02N65m39l53N53P8j61M40N0
996C54J65N46m47k76K65L0o54O9m9n0K79j39m68L88n3q94lM36j45n3J59Q5N47
$$ plain form
838 -320 -377 -454 -400 -611 -725 -1123 -1205 -666 -477 -371 113 604 770 980 496 580 582 386 243 425 672 910 709
861 709 466 485 97 -497 -1014 -1058 -943 -936 -921 -400 -209 -82 -310 -434 -248 -356 -450 -208 362 948 1092 1086 950
884 950 1161 797 360 -74 90 194 224 -107 43 254 -27 -622 -658 -598 -1024 -1204 -918 -763 -279 108 -59
905 -59 354 493 154 47 409 281 631 664 589 911 1250 599 70 41 -123 -218 -404 -419 -219 -193 -596 -557 -411
928 -411 -561 -814 -624 -615 -284 -62 -63 44 551 278 365 542 449 504 669 513 512 846 494 28 158 21 -464
951 -464 -402 -492 -608 -296 -589 -944 -298 -272 -645 -661 -145 -326 21 262 91 737 828 235 213 706 448 440 510
974 510 453 428 412 -107 -284 -12 -445 -937 -541 -676 -558 -398 -581 -379 186 -253 -606 -53 25 -136 304 354
996 354 519 1065 618 342 607 637 -17 52 3 -47 232 93 -375 13 -40 -934 -937 -501 -646 -699 -540 -455 92
1019I2K35k92L7M00m87P6J28Q9M24J99m52J10L45m77o92J67k41k18J89j94J36
1040d26M41l68k95N13k81k06P6J52J02M40lj13Q15m9n82K26j40j84K49q2j55L98
1062E28l8o65K79J0o05j78J34j51j35M84l04L25N55m30k90N11j30j00M09j19K29
1083C19M47r9l03J95r0m55J69k93n3L11l33j76N18k35m19P5j54j42M61k03k98
1104g58O76K28m13K97J94q7RJ83k30L82O0m65O46n3m03k25K32n18K23K7o71K59
1126d07L34m16n8L24j5k20K39k21J78L38r0j90O57N5k84K56p3o1J12k28j97L27
1148C60j25l61N3m0l0P6j58k68L51L1l78N4M23l67L12J1j51N06j12o6K41J17n5
1171D24j49J18l11J84K2p9j19J81k28j45K4k36j26R7L5K9J27j85J68J23m0j74
$$ plain form
1019 92 327 35 72 472 -15 61 189 278 702 901 449 559 904 427 -265 -98 -339 -557 -368 -562 -426
1040 -426 15 -353 -648 -135 -416 -622 -546 -394 -292 148 145 32 847 798 216 442 302 118 367 285 130 528
1062 528 490 -175 104 114 -491 -669 -535 -686 -821 -337 -641 -316 239 -191 -481 30 -100 -200 209 90 319
1083 319 766 667 364 559 469 14 183 -110 -163 148 -185 -361 157 -78 -497 -422 -576 -718 -257 -460 -758
1104 -758 -82 146 -267 30 224 137 146 329 99 481 541 76 722 669 266 41 273 -245 -22 5 -666 -407
1126 -407 -73 -489 -547 -223 -238 -458 -219 -440 -262 76 -14 -204 453 508 224 480 407 346 458 230 33 360
1148 360 235 -126 -73 -113 -143 -67 -225 -493 -142 -111 -489 -435 -12 -379 -67 -56 -207 299 187 121 362 479 424
1171 424 275 393 82 266 288 209 90 271 43 -102 -78 -314 -440 -343 -308 -279 -152 -337 -169 -46 -86 -260
1193b60J95J05m1K68J18k23L91J07l55K3j82K4j54m1rk7J58l76J86J42n19K8R6
1216c46k18K96J32j38L35J99j79P2J39k18r2K29r8K8L52j43j75L05k26k24k29
1237a99k92J18K78kk79L00K7k76P7k53Q1K27L6K4L10m9oJ06J07k3o8j35j69L00
1261B40K2k45Q1L20k16k79q8j16J6J13k30N9J85O8k45K75L2J03k4j12PK09Q5j90
1285G0J98K58j91p8l10J53mK3j02J23j52r5j82%M2M9k73J30M9P9j24J55P1J59
1309D8jk8R7J19K0j04RM7P2j72j7N1J27k06k42O7LQ1l70K8J89q3rJ01P4J1q8N6
1337a20J26K76l55K23j22K27j3l2R6L4J04l46N4j57q1K8j7j98j01K04o3O3q3M3
1361b10n5j72J77J00J84j73K69J75j72QM8P4q0n4r2K31M6j6k86J35j12j48M6k73
$$ plain form
1193 -260 -65 40 -1 267 385 162 553 660 305 328 146 170 16 -25 -34 -61 97 -279 -93 49 -470 -442 -346
1216 -346 -564 -268 -136 -274 61 260 81 153 292 74 -18 211 113 141 493 350 175 480 254 30 -199
1237 -199 -491 -373 -95 -97 -376 -76 -49 -325 -248 -501 -420 -193 -157 -133 177 128 122 228 335 312 244 109 -60 240
1261 240 262 17 98 418 202 -77 -165 -281 -265 -152 -382 -323 -138 -70 -315 -40 -8 95 71 -41 -34 175 260 70
1285 70 268 526 335 257 -53 100 96 119 17 140 -12 -107 -289 -289 -247 -198 -471 -341 -292 -213 -337 -182 -111 48
1309 48 47 19 116 235 255 151 160 207 279 107 90 141 268 62 -180 -113 -110 -29 -399 -371 -182 -265 -274 -173 -99 -88 -176 -120
1337 -120 6 282 -73 150 28 255 242 210 306 340 444 98 152 -5 -86 -58 -75 -273 -374 -170 -233 -170 -253 -210
1361 -210 -265 -437 -260 -160 24 -149 120 295 123 131 179 253 173 119 27 258 304 288 2 137 25 -123 -77 -350
1385c50k0J53n7J15l4K73K5k56L2J16J35k79J31L7K21nM3J68j56l69Mn1Q1J27
1409H4k32J95R5r1j52k54K13Q6k94o1M3J19R8J8K27q8J58o0q4J05J26j44N0K2
1433A79Q4k6j60R4k00Rp7j49p9J68Q6k08K14K11r2k63J00K2P1r2P5O5O0R2p0J06
1459B20K1k1j67q9K19m0p7r3K25k58j54o6N9j12J34pN1j13K82k05K5L81n1j94
1483c0Q5P8J6j29P7N8M0q8p0R6j05m9j42Q6p0pn1L6P7mK2k61L76K2q7j30m6J81
1511a9J75j36J0J78Q8l15J09n0j00J63m9n5J49j43r9j47J70J17j43l6L3%l2j13
1535b45K21O9j74N2Q5J19j3j99K7K12J27j37j48N8J07J1j08r6O4j16j50J51K9
1558e4j14Q8j52Q8N3ok4LJ76m4q6J16J8M6rj28p5P7J84j81MM7K56k34o9r6J13
$$ plain form
1385 -350 -370 -217 -274 -159 -193 80 105 -151 -119 -3 132 -147 -16 21 242 237 280 448 292 -77 -73 -124 -43 84
1409 84 -148 47 142 51 -101 -355 -142 -56 -350 -411 -368 -249 -151 -133 94 6 164 104 20 125 251 107 157 179
1433 179 263 237 77 171 -29 -20 -97 -246 -325 -157 -71 -279 -65 146 54 -209 -109 -87 -16 -108 -33 32 92 184 114 220
1459 220 241 220 53 -36 183 143 66 -27 198 -60 -214 -280 -221 -333 -199 -206 -155 -268 14 -191 -166 215 164 -30
1483 -30 55 133 149 20 97 155 195 107 37 133 28 -21 -163 -77 -147 -154 -205 -169 -92 -96 -74 -335 41 63 -24 -154 -200 -19
1511 -19 156 20 30 208 296 -19 90 40 -60 103 54 -1 148 5 -94 -241 -71 46 -97 -133 -100 -100 -132 -245
1535 -245 -24 45 -129 -77 8 127 114 -85 -58 154 281 144 -4 54 161 172 64 -32 32 -84 -234 -83 -54
1558 -54 -168 -80 -232 -144 -91 -97 -121 -118 58 14 -72 44 62 108 99 -29 -104 -27 157 -24 -20 27 283 49 -20 -116 -3
1585cr8j14j34J74j07j0K91J89k68q0J7J05L12l73J17p1J96N4j8o8K42k00k28
1608g5N7K05j47j58R3j50J65k6J8r6j0L6j84J45J29J17j37MJ04r7k9M8j4L5J01
1633A34Njj53K31j6j15j30j25j12K79K2k19o5J64O0qj05j07J59L47l26k8J75L6
1657A02k13L17j92Q6Qj75J35p4K9lQ2qj97J69l13K05j23J15o5O1J46k70J85L5
1681D2r3JO8J9K6K24l18k8K31j77Q1P3j72K41j80K4q1J2%j65R7l7P0K8l13L81
1707E4j9j77J11N5Ql9j53J91K0O2R7k26J57M1j35L7j46J60o1n5J15j5r2j67L6
1732a41M7m8J12r9Q7J09Nj59L7K54l46l5N1K90j77K5j29K52j0n8Qk2N6Pq0k97
1758b61K74p0o6RJ52L8j32k26L17j33J08k04L0L67k14r4L5J67k2j19J21M%j10
$$ plain form
1585 -3 -101 -215 -349 -175 -282 -292 -1 188 -80 -160 -143 -38 274 -99 18 -53 143 197 179 111 353 153 -75
1608 -75 -18 187 40 -118 -25 -175 -10 -36 -18 -114 -124 -88 -272 -127 2 119 -18 -14 90 -7 -36 12 -2 33 134
1633 134 139 138 -15 216 200 85 -45 -170 -282 -3 19 -200 -265 -101 -41 -49 -154 -261 -102 245 -81 -109 66 102
1657 102 -111 206 14 100 108 -67 68 -6 23 20 102 94 -103 66 -247 -42 -165 -50 -115 -54 92 -178 7 42
1681 42 -51 -50 18 37 63 287 -31 -59 172 -5 76 149 -23 218 38 62 -19 -7 -7 -172 -75 -112 -42 -14 -327 54
1707 54 35 -142 -31 24 32 -7 -160 31 51 113 210 -16 141 182 47 84 -62 98 37 -18 97 82 -10 -177 -141
1732 -141 -94 -142 -30 -129 -42 67 72 -87 -50 204 -142 -177 -126 164 -13 12 -117 135 125 67 75 53 109 116 36 -261
1758 -261 13 -57 -123 -114 38 76 -56 -282 35 -98 10 -194 -164 203 -11 -105 -70 97 75 -44 77 81 81 -29
1782b9o4j1K39j67r5M6K53k69k3o6J94O3j41O0j22K01r3j32J53qR2k82R2L23K
1807B16j6k07K57l85M9P5J23K3j51r8K29j08n2n1p3Q9N3j88m1K64J19o1j8m1J13
1832A20p7k85L5K67l1j62N0K01J1j77k6Q1J63k69Q4PJ29J02m20Q4J03o9o0o8O2
1857a45J19L3p8L2J94P7l75K18N9l4j81oJ57R0k86J39K4J7k9j02n3J79p9O4j34
1882a00J72J04k92j40K50J14L4j12k56L86k68j17L83p7N2j61L2J06K9L7l32OJ33
1905a7n9n2o2M42q9k99k7Q5J35j47m7J22K93k60KJ29j7Pk35K27R7j64j31qK67
1930A92j20j00m3j42L27p2j90k5J90j02pj02J12J48o8m5J03J06k62J46pJ44O6
1953B49j29o6M5n3j06p8J39J9O9j49q8K39r9j02j18K37r4j5l6l1L46j97o6J66
$$ plain form
1782 -29 -93 -104 135 -32 -127 -81 172 -97 -120 -186 8 71 -70 -10 -132 69 -24 -156 -3 -11 81 -201 -109 214 216
1807 216 200 -7 250 -135 -86 -11 112 135 -16 -114 115 7 -45 -96 -169 -80 -27 -215 -256 8 127 66 48 7 120
1832 120 43 -242 -207 60 29 -133 -83 118 129 -48 -74 7 170 -99 -15 -8 121 223 -197 -113 -10 -79 -139 -207 -145
1857 -145 -26 7 -71 -39 155 232 -143 75 134 100 -81 -87 70 160 -126 13 37 54 25 -77 -130 49 -30 34 -100
1882 -100 72 176 -116 -256 -6 108 142 30 -226 160 -108 -225 158 81 133 -28 4 110 139 176 -156 -150 -17
1905 -17 -76 -128 -190 252 163 -136 -163 -78 57 -90 -137 -15 278 18 20 149 132 139 -96 131 228 64 -67 -75 192
1930 192 72 -28 -71 -213 114 42 -148 -173 17 -85 -92 -194 -82 66 -2 -47 56 162 -100 46 39 183 249
1953 249 120 54 99 46 -60 -138 1 20 89 -60 -148 91 -8 -110 -228 9 -85 -100 -136 -167 179 -18 -84 82
1977H2P5p8j79M1O5J05j32ok6K62k77o9lK75j44j74K6M37j74k43J5O2J17Rj52
2002h6O1J63o8k18L13J50k51j03J90p7mL0l68J65R5l2m1J6P0Mk47L1L52k38k8
2027a21jK2J31p6Q6l7N9n3j60P6J78q5J09P7k31j3N3j43K28J1j86k3J91n3j21
2052h2N6J7M5j30j2m4J95R7l25K37J09j15N9j66R0Q1n0k51J38L2P3l1J43K2k24
2077c6j42K41N0n8q9j11K51j93L3l8j1K18p0j80J31J0R2k5j64N6J14J3k18K28
2101A02R1k36K6P6L7N3k18j07J74J25k03j76L52k18K1L8K7K9rN1j19O7K21k48
2125d4K5J07lP7l01J38L9j8q1J22kk60K60m5m7N9n5r9J76l8m2rJ8%K02j75N6p3
2153a3N6l3J13k76J56N4j33O1J14o6o9J66J1k04r9K14j50M0N4K1l4o9M0J01Oj49
$$ plain form
1977 82 157 79 -100 -59 6 111 -21 -27 -53 209 -68 -137 -140 135 -9 -183 -157 280 106 -137 -122 -60 57 66 -86
2002 -86 -25 138 70 -148 165 315 64 -39 151 74 70 100 -268 -103 -8 -40 -81 -65 5 9 -238 -207 145 -93 -121
2027 -121 -122 -100 31 -45 41 4 63 10 -150 -74 104 19 128 205 -26 -39 14 -129 99 110 -76 -99 92 39 -82
2052 -82 -26 -9 36 -94 -106 -150 45 142 -183 54 163 48 107 -59 31 112 62 -189 -51 -19 54 23 166 188 -36
2077 -36 -178 63 113 55 -34 -145 106 -87 -54 -92 -103 115 45 -135 -4 6 98 73 -91 -35 79 92 -126 102
2101 102 193 -43 -17 59 96 149 -69 -176 -2 123 -80 -256 96 -122 -101 -63 -36 -7 -16 35 -84 -17 204 -44
2125 -44 -19 88 85 162 -139 -1 38 20 -61 61 59 -201 59 14 -33 26 -29 -128 48 10 -32 -41 -23 -23 179 4 60 -13
2153 -13 43 10 123 -153 3 57 -76 -15 99 33 -36 130 141 -63 -162 52 -98 -58 -4 17 -17 -86 -46 55 61 -88
2179h8J15j16J15R3j33N9j69J54m0p4qM5K31k71j1O1m5J03j47J24P1Mo2nr3R9
2205A2q9r7K23J2o0Qj37K83p3o7o1L8N3O2j73M6K1N2n9k53L13j58o2J40moo6M3
2233e9N2N2q1O4LJ5Jl4k8NJ24m4N2l8k05Q2KL8J46l12K70o2J30m03K52j31J5J63
2261F9k61K32j38J07R9q0Q5l0K6r1nLn1j2N7%J33n6j27n5n8J51j72J09J28q5o7
2288h9K25j54J19j34j6K4l2M3J01j29j1J65j24m5k8J55N9k35J8K09j81j19K08
2311B9m0R1QK7l7l5K5r3QJ18j71J28J62k09N1j06Q8n3P6m4J71l0j78J41m4r2O2
2338E3j7j13m7J62j02P1o6J37m0r6J15l0m5Q8m5j3Q3j1J3m8K9K7j13J0M5k2l1
2365fl4q4J40J53k87M7nN4K7m8M0j7J58P3j56J7p2P1P7j24M9j50j11J34J05j08
$$ plain form
2179 -88 27 -89 26 119 -14 45 -124 30 -10 -84 -92 -47 184 -87 -98 -37 -82 21 -126 -2 69 73 11 6 -87 12
2205 12 -77 -174 49 61 1 9 -128 155 82 15 -46 -8 45 107 -66 -20 1 53 -6 -259 54 -104 -166 -26 -30 -36 -102 -59
2233 -59 -7 45 -36 28 31 46 47 13 -15 -10 114 70 122 84 -121 -39 -37 1 147 -165 105 43 173 -230 22 -109 -94 69
2261 69 -192 40 -98 9 108 28 113 83 109 18 13 16 -35 -47 10 10 143 87 -40 -95 -153 -2 -174 -65 63 -22 -89
2288 -89 136 -18 101 -33 -49 -25 -57 -14 87 -42 -53 112 -12 -57 -85 70 129 -106 -88 121 -60 -179 29
2311 29 -11 80 88 115 78 43 68 -25 -17 101 -70 58 220 11 62 -44 44 -9 67 23 194 164 -14 127 83 -9 53
2338 53 36 -77 -124 38 -64 7 -59 78 38 -58 57 27 -18 70 25 12 95 84 97 49 78 105 -8 2 47 25 -6
2365 -6 -40 -124 16 169 -118 -71 -76 -22 5 -43 -3 -20 138 211 55 72 0 71 148 24 73 -77 -188 -54 51 -57
2391e7N8%j2k6l4pq6J36J0J57k14J14M4r5J29j77k3L6J90M5k41l6P3M3q5J04o
2418D0o1M7N9j95K50l11J28P7j58J50j8L0j88K16K4p8Q9k21K02k59K65j34K00
2441A54j23k8KO6k25K79k96O3J72j9l2m9k7l2R4M1j90K72j66N5k7J49j69LO4j4
2467A7Mr8J67J3J6j02N4L9k93P9r3J22QJ42r0j26K11Pjj68N4o4J90Ml7J73k02
2494B6J4p7M5J0oq2J08n5Q3k2J00k25N5o2K17k63J26K3l6J26J05l41P3L4Q4p9
2520a9r8N6K8J45j44J11p6P8l6j31J35M3j33J86j31r8j9j5J76p5J95k17J44J09
2544B14j04q3j4n8n3K72j06O1k48M9Qj3J56k02K12n9o7J18j91N4NK17j45J15j72
2569c4L6Q9j54j2K29o4k13J6O5O5oO3n9N0m7pk4P5K6O4j41j4j19K6R7p7J7J32
$$ plain form
2391 -57 1 1 -11 -37 -71 -78 -164 -28 -18 139 -75 39 83 -12 117 -60 -83 -47 143 188 -53 -89 -16 27 -58 46 40
2418 40 -21 26 85 -110 140 -171 -43 34 -124 26 8 38 -150 66 90 12 101 -120 82 -177 88 -46 154
2441 154 31 3 5 71 -154 125 -171 -108 64 45 13 -36 -63 -95 -1 40 -150 122 -44 11 -16 133 -36 -33 31 17
2467 17 21 -77 90 103 119 17 71 110 -183 -104 -197 -75 -67 75 -15 -141 70 77 76 -92 -38 -102 88 92 55 228 26
2494 26 40 -37 8 18 12 -70 38 -17 66 44 144 -81 -26 -88 129 -134 -8 15 -21 105 210 -131 -58 -24 60 -19
2520 -19 -117 -61 -33 112 -32 79 3 81 45 -86 49 92 -41 145 14 -84 -103 -118 58 -17 178 -39 105 214
2544 214 110 27 13 -45 -98 174 68 129 -119 -70 -62 -75 81 -121 91 32 -35 83 -108 -54 -49 168 23 138 -34
2569 -34 2 91 -63 -75 154 90 -123 -107 -42 23 17 80 21 71 24 17 -7 68 94 158 17 3 -116 -90 7 -70 -53 79
2597G9oj02KN4j05k2J99Mj92L8M8K75k77N2J8l28J91K6K3J39j32L6k9K8l8P6p5
2624a8l19K20K5M8J76k09o4J99j22M0PJ42j44j8j2p1M5J53q3l8J00p1Q6n4J35
2649A53j47j74J53j0%j3qP8J5j30J07M1j5pK2j69L2J06M0j52J14k1K3n3j1Q9k6
2676C7rJ6Qj62R3n3k8O3P6J2j45K54k97q8K06J36k61R2L5J06k42J64o8o6J94n8
2702A5QJ38M0l67J12J02o1J22k11J07l7p0j1K2O6m8o7J47p0n0J81l9J1l1oN2N8
2729A13k06J08j8j18N0P2J2n1M1J49l19K50j28m2L2J72J5l5r8o1J27j56J69Q3
2753A61k00N2J46j76J19n8mk0J31k26R6r5R1j3q8L4N4K4j88K49r0l1P7j34N6L6
2779CP9K0k69J84j12J53J6jk09J53K2j00oP4M%J0JL8j1o1r5K24k32J20q1j42J50
$$ plain form
2597 79 73 -29 -27 27 -78 -100 99 103 -89 -51 -3 272 -5 47 65 -263 -72 -46 -23 116 -16 20 -9 19 -19 57 -18
2624 -18 -337 -117 -92 -44 132 -77 -141 58 -64 -24 -17 125 -19 -37 -49 -120 -75 78 -5 -43 57 -14 72 18 153
2649 153 6 -168 -15 -25 -25 -38 -46 32 47 -83 24 65 50 43 65 -104 -72 34 74 -78 36 15 38 -15 -26 63 37
2676 37 28 44 52 -110 -17 -70 -98 -35 41 53 -92 162 -135 -223 -17 119 -142 -50 -15 91 -151 13 -55 -121 73 15
2702 15 23 161 201 -166 -54 48 -13 109 -102 5 -32 -102 -113 -91 -25 -73 -140 7 -63 -113 68 29 40 9 3 55 113
2729 113 -93 15 -3 -121 -71 1 13 -38 3 152 -167 83 -45 -87 -55 117 132 97 -1 -62 65 -91 78 161
2753 161 -39 13 159 -17 102 44 40 20 151 -75 21 -74 17 4 -84 -50 4 28 -160 89 -1 -32 45 -89 -33 3
2779 3 82 102 -167 17 -95 58 74 73 -136 17 39 -61 -67 7 11 11 21 22 60 49 -12 -107 117 -115 5 -76 -218 -68
2807f8Q4m8J24j29J14j55J16j53K09n9n6l9l6J81N8m3j11K2O1j0j55J4N5k8m7
2832i9J52k0n1k7j27J97l0nm3QJ43l9j23K13k01K41j11j61J04O7q8Lk6N0j9n1
2858d3R4Nj58L8J86k04R0o7o7M4Q7l6K3M6j04M2L6n1n2K9L2l7O0Jj32J00J12J28
2886B02o5j90N1J15j06L2j19P2K0p3J3K39j47R0j73N6m5o8K40j66n3J09K1k2K53
2911B86j90r5j2q2K8K05k26o0J88L9j50J5J73qj22N4J26r1j27Q0n2O1L4j30q9
2936a45J97j7K6j21m7J2p3Q2J11j18K1J08j98K12%M8Jp7O5o1r0m4R6Q1j09k4J57
2963I3j85J47k5m8j11J37m9L1L9K32j64j90J16r7l7J97j84K06j57k2o0o3K23k6
2987Cp9K16m1j33K50k32m6J70j08kk8QJ01L7l3J40l06J39k06L7J97j83j7l3J45
$$ plain form
2807 -68 16 -32 92 -37 77 -78 38 -115 94 35 -21 -60 -96 85 143 100 -11 11 72 62 -93 -79 -24 -52 -99
2832 -99 53 33 -18 -45 -172 25 -5 -10 -53 -45 98 59 -64 149 -52 189 78 -83 21 88 0 3 -23 27 8 -43
2858 -43 51 56 -102 -64 122 -82 8 -59 -126 -82 5 -31 -8 38 -66 -24 12 -39 -91 -62 -30 -67 -7 -6 -138 -38 74 202
2886 202 137 -53 -2 113 7 39 -80 -8 12 -61 -48 191 44 134 -39 17 -28 -96 144 -22 -75 34 55 33 286
2911 286 96 1 -11 -93 -65 140 -86 -146 42 81 -69 -54 119 111 -11 43 169 78 -49 31 -21 40 74 -56 -145
2936 -145 52 35 61 -60 -107 -95 -168 -86 25 -93 -72 36 -162 50 50 98 99 22 87 26 -64 -108 -12 69 -40 -64 93
2963 93 -92 55 30 -18 -129 8 -41 -10 29 261 97 -93 23 -74 -111 86 -98 108 -49 -71 -131 -194 29 3
2987 3 -76 140 99 -34 216 -16 -62 108 0 -2 -30 -22 79 116 83 223 -83 56 -150 -113 84 -99 -116 -149 -4
3012dj23J50j21J16R8r0k6J11j85mK43j49p7J16J10q2q9J28r0j66J87R7j09l1
3036A0LP5k7j24P6K8O6j30n6QJ87j26O3J8j32K00k39K2R7J12k74J51Q7j09L1j42
3062a25K50r1j29J40j82K79k55J00j3k6N4q3J3J07R6j70j28J68j9J79j72K9j07
3085h5J01p5k9J10j71R4R%M0J07o5j89K00j54R9k9l6K3O6j42K59j17j27P5m6J87
3111A05j49qK6N9k41J64O7Q9m6q7J01j24p2J16P5j86J83j28j7R4K2j19N0O5n7
3136a8P7l1N3j52P2j17K05m7q9O9K3m1O1m8l5m0k4R7L1j11L1P2p6N2j7R8k00l
3164a08P1JK1Q4o0J87k65J68p6j28J43l4M2j20M7J7J7J9n8J30m7%m6j00J16J43
3190A64j85Q8q2jJ67j10j59Q9n5J29qpQ6n8J0j21m6J64L7l4q7N3p7r0J82j17j
$$ plain form
3012 -4 -127 23 -98 18 116 26 0 111 -74 -78 165 16 -61 55 165 83 -6 122 32 -134 53 150 41 10
3036 10 13 88 61 -63 13 41 107 -23 -79 -71 116 -10 53 71 -61 139 -100 -78 19 131 -143 8 95 -14 17 -125
3062 -125 125 34 -95 45 -137 142 -113 -13 -26 -52 2 -81 -68 39 135 -35 -163 5 -14 165 -7 22 -85
3085 -85 16 -59 -88 22 -149 -55 -46 -46 -6 101 36 -153 47 -107 -8 -37 -73 -50 16 -126 133 16 -111 -36 -82 105
3111 105 -44 -52 -26 33 -208 -44 23 112 66 -21 80 -44 -116 0 75 -111 72 -56 -73 21 43 -76 -26 39 -18
3136 -18 59 28 81 -71 1 -116 89 42 -47 22 45 4 65 17 -18 -58 -82 15 46 -65 -34 38 -38 14 -3 95 -105 -108
3164 -108 -37 -36 -15 69 9 196 -69 99 23 -105 38 4 46 -74 -27 -10 7 26 -32 98 51 51 5 -95 21 164
3190 164 -21 67 -15 -16 151 41 -118 -29 -84 45 37 30 116 58 68 -53 -99 65 102 68 -19 34 -43 -133 49 -68 -69
3217f9R7j09O0oJ3Q8o8l0m1N9M8o9n9K72j31j05M3N9J9rJ6J15M8k03o9m1N8J46
3245A32j19m3J9pl5P7n3n4R1J05l06Q9J35J00j88k5P0J74k9l28J58J40o6k0N6
3270G3k15L26j80n3O1q6L2P8j12oK22k86J81j42K5P4k6J49k62K18m1lp4j8p8J77
3296C4L2qo1j42J91R7j27Q6j12Q9j06m3J96q9Q9JL2k32L5k9j7O0n5M6M0j20Q9
3323b4n7O3r3O4j19N4J17K03l94L62j21l8k5J63k79K10q5J55j45J0J64k72Q3r8
3347a02O7p7Q0R5p5k5J34j32K19l21K46q5j5l5M8J81k58R7k12M0J02j2J38p2J98
3372B24j83l9J11n3l8L5j05J12p5L7j6M2O1n0oo5O9o2o5j22J36R3j86K4N5O4J0
3399Hj47J18J1L4k07L38j28j4j75Q4j7L1n2J74K0m6K5n4rJ3p1mJ48J4j22N3r2
$$ plain form
3217 -69 28 -81 -21 -27 -14 74 6 -24 -65 -6 42 -27 -86 186 55 -50 -7 52 71 62 78 193 241 38 -31 -72 -14 132
3245 132 13 -30 -11 -18 -53 24 -29 -83 8 113 -193 -104 31 131 -57 -82 -12 162 133 -195 -37 103 37 17 73
3270 73 -142 184 4 -49 12 -74 -42 36 -76 -82 140 -146 35 -107 -82 -8 -34 115 -147 71 30 27 -47 -65 -143 34
3296 34 66 58 -3 -145 46 143 16 102 -10 79 -27 -70 126 37 126 127 159 -73 -38 -67 -84 -24 -79 -33 7 -113 -24
3323 -24 -81 -18 -111 -47 -166 -112 5 208 -186 176 55 17 -8 155 -124 86 1 156 11 21 185 -87 -4 -102
3347 -102 -35 -112 -32 63 -12 -37 97 -35 184 -137 109 24 9 -26 22 203 -55 42 -170 -130 -28 -40 98 26 224
3372 224 41 2 113 60 22 57 -48 64 -11 26 10 52 113 63 57 -8 61 -1 -66 -188 -52 41 -145 -121 -66 -2 8
3399 8 -139 -21 -10 24 -183 155 27 13 -162 -78 -95 -64 -116 58 78 32 57 3 -6 7 -64 -68 80 94 -28 25 -67
3426f7J87j1j47J41j44%R6m4r5K09k88J93l7J1r9J38q7J20k6O1p1J5j00O2N6k1
3452E2j85N6N8j66J82k6o6O6l4P7j63K62r5q7J1K3N7r5J8J6j40J75N0L2p0QJ00
3479A16j17p8K8J10p5j6Q1p3l2j8R3R3n5J3k70J64l5J49o1j0M5m9R7j8j35J96
3505A43p8j17N4L0M0j0p0l0j33J31R1J0n3q2K5l7P5PO4j22P7J6Ml5m0J49r9j4
3533dO3Q8k39Q0J0J32j09o2m6P2M2n2mJR6Mm7l3L4m5o4R4N0K1qr4M6j19J10P3
3563I0o4O7Oj87jR4J64l8q7K8r0MJ08N8j18k4P6k41N7N3r1rj4K25p1m6J05Nm0
3592A9l0j9l2K06k5l2k45K80k40J37m2J41K1l22K96j71J95j73K63k01j13M1NK
3616c9K6N2n5L1J4j19Q0j3N9q6J4n1Q6Q9k74K25k0N0j51K34k48K11q3k11J28j3
$$ plain form
3426 -67 120 109 -38 103 -41 -41 55 11 -84 125 -163 30 -7 4 -95 43 -44 76 50 111 40 55 -45 17 73 52
3452 52 -133 -77 -19 -185 -3 -29 -95 -29 -63 14 -149 113 18 -69 -58 -35 22 -73 -55 -39 -179 -4 46 78 8 16 116
3479 116 -1 -79 -51 59 -16 -32 49 -24 -56 -74 19 112 57 70 -200 -36 -71 78 17 7 52 3 100 82 -53 143
3505 143 65 -52 2 32 72 62 -8 -38 -171 -40 51 61 8 -74 -49 -86 -11 -4 60 -62 15 31 35 0 -40 109 10 -4
3533 -4 59 147 -92 -12 -2 130 21 -41 -87 -15 27 -25 -29 -28 68 72 25 -8 26 -19 -83 11 61 82 74 -20 26 -93 17 90
3563 90 26 93 99 -88 -89 5 169 131 44 72 -18 -14 94 152 34 10 86 -155 -98 -45 -136 -145 -159 66 -5 -51 54 59 19
3592 19 -11 -30 -62 144 119 87 -158 122 -118 19 -23 118 139 -183 113 -58 137 -36 227 26 -87 -46 -41 -39
3616 -39 -13 39 -16 15 29 -90 -10 -23 36 -50 -36 -87 -1 88 -186 39 19 69 -82 152 -96 115 32 -179 -51 -64
3642f4L2lo8K39k66R0j4J66j33J84o4p4K8n1r9k9J45j93K43j12j55J42J01J1L
3667E9Kj1q0J07j0j10N5j77J39J09j11o7Q2p0J8J18j03NP6q8Q2j81J70J22j56
3692b0M6l8J15k03J42P0rn6r3L0l9PR1q0P5j21oj10K43Q3l5o7l1p9J95j34k7J43
3720I2j26K62m74K61q9J1pP5J3Q5k16J55j77N2J31j17J32m2M8m7p1J08QP6j04
3745C9p2j30K73j39m6J97mr9k1r2OK23j5j29j37J38O1O1p8J01k39J87j58k0J70
3770G7j87L1Q4R1o2K7j42L0N2r9J26j6l4M2n9J9J54k00L0J05k9J39j21j88Q6J04
3796F0k09K1R5J52k86N8J18j22R5j9K9j15O1O5j08J87j10M4J58j67L7l6Jl5j6
3821d2J00J1j08j8M1J30k9o0q1j14O7J80M7r5K4J00j88k2k3OJ13l7Q6o8lN9k00
$$ plain form
3642 -64 -32 -35 -103 136 -130 -40 -54 112 -21 163 99 25 53 2 -97 -126 19 -174 69 -43 -198 -56 45 56 59
3667 59 61 50 -30 77 67 -43 12 -165 -26 83 -28 -95 -13 -83 -65 53 -50 -45 31 -57 25 -156 14 136 -20
3692 -20 26 -12 103 -100 42 112 103 47 -46 -16 -55 -48 43 -37 38 -83 -89 -199 44 127 92 25 -6 -85 110 -24 -51 92
3720 92 -34 228 -246 15 -74 -63 -70 5 18 103 -113 42 -135 -83 48 -69 63 21 69 22 -49 59 67 143 39
3745 39 -33 -163 110 -29 -75 122 118 19 -2 -94 -88 135 120 -9 -146 -8 53 114 36 137 -102 85 -73 -93 77
3770 77 -110 -79 5 96 34 61 -81 -51 1 -98 28 12 -22 20 -39 -20 134 -66 -36 69 40 179 58 -130 -44 60
3796 60 -149 -128 -33 119 -167 -109 9 -113 -18 -37 -8 -123 -62 3 -105 82 -28 16 174 7 44 8 9 -26 -42
3821 -42 58 69 -39 -57 -16 114 85 25 -56 -170 -103 77 124 29 53 153 -35 -57 -80 -74 39 2 88 20 17 76 -124
3848a24NJ74j56J65m2j68K77r3Q0M6n5j50Q0K3j32J35o7j05R5m2K04j66j03J72
3872E3m1Q9r1p8oP9N4l7j17J23j20P6p1J7O2m0L40k76J5r5rJ20j01Q6j32J67J1
3899G8r8L9o1k6Q2O6j59J14k24K87j49m3J32j82J25L2j52J00k1j6K80k50N0M7
3923E1J52r3j66K50j90o1J58p5j01j1J43k03J37j06J47n7O4M8%p7K9k9L4j1j01
3948f8K8J39r8k4M1p4k3J08j5k5pO4N0k52J68J00q1j41J27n4j2L7N3k06K62Oj02
3975AO9p6o9J21j33J87j70M5j6k6K5M9j30J72l2j58K43L7j35L3R8k19O3K5J53
4000A57j45Q7M6j33M6j66K62j98j51K32J56k76K54j64J06j56j4M3k09J41N2J36
4022A06P2j60j11J00k2K9k1k1J60r4mP7m3k6jj7M9M0m8j78J17j5m1o9J87j59M7
$$ plain form
3848 -124 -119 55 -101 64 22 -146 131 38 118 164 109 -41 39 62 -70 65 -2 -107 -12 -54 150 -16 -119 53
3872 53 12 101 10 -68 -74 5 59 22 -95 28 -92 -16 -87 -70 -8 -48 292 16 31 -64 -73 47 -54 32 -100 67 78
3899 78 -20 19 -42 -68 14 80 -79 35 -189 98 -51 -94 38 -144 -19 13 -139 -39 -60 -76 204 -46 4 51
3923 51 203 110 -56 194 4 -57 101 26 -75 -86 57 -146 -9 -115 32 -25 39 87 87 10 39 10 44 33 -68
3948 -68 -40 99 1 -23 18 -56 -79 29 14 -11 -18 46 96 -156 12 112 31 -110 17 -37 -49 -12 41 -165 97 103 1
3975 1 70 -6 -75 46 -87 100 -70 -25 -41 -67 -42 7 -123 49 17 -141 102 139 4 37 135 -84 -21 4 157
4000 157 12 99 145 12 58 -108 154 -44 -195 37 193 -83 171 7 113 -43 -57 -14 -223 -82 -30 106
4022 106 178 18 -93 7 -15 14 -7 -28 132 38 34 111 68 42 41 24 73 113 65 -113 4 -11 -52 -121 66 -93 -46
4049d6O3o9J28j41%K06k38J9P9P0j05L3J9m3P2j21J21K0n6Oq7j6J66j35N6Pnj69
4077a66R1J10L4m1j50N8njJ19MO1j78R5l7p9L3O4k2j10M1J61k49L69k75K8j5O3
4104CrN8Mj6OJ03r9PK4j12j4K9r2R1P3n9P6R7q3K9k33J08m3L9K1J9K0M8k5Jj3
4135E8K6r7Q4N8q4j37J24kl8q9J92q0r5J08q3p4K36r3mR1j04J1J1j03J42j2j83
4162a37QK20j35R4k05R1P6o1J00j02O0m9l1l2p5K34r3O2M2j4j9j54N8j0j1N1k3
4189e5J26M7M5k00%J58%k92J64L7k3J6L9P9k19rP0j5Q2j10J07M4k26J33q5J91
4215A04r1LnJ19l02J98r0K4k4K56j4l0l0Rk58J17K8K5K9N3k35L0J23p6r0L8N8
4242c1j41J91K4N0K8j09K1j31M6K77j92L2Jkk17L91r9k57J61K9j75J26j80P3R9
$$ plain form
4049 -46 17 -52 76 -65 -65 141 -97 -78 1 71 -34 -1 18 -25 47 -74 47 67 11 17 -70 -86 80 -55 1 8 3 -166
4077 -166 -75 35 69 28 -122 -64 -69 -70 49 53 114 -64 31 -6 -85 -52 12 -10 -120 -79 82 -167 202 -73 -45 -60 3
4104 3 -6 52 56 40 46 149 50 57 81 -31 -45 -16 -108 -17 56 -3 73 170 87 116 -117 -9 -52 -13 8 27 47 95 70 71 58
4135 58 84 -13 71 129 45 -92 32 30 -8 -97 95 15 -80 28 -55 -129 107 14 10 101 -3 8 19 -84 58 46 -137
4162 -137 -129 91 -44 50 -155 -64 12 -49 51 -51 9 -40 -71 -103 -178 56 -37 25 67 53 34 -120 -62 -72 -83 -32 -55
4189 -55 71 118 163 -37 -37 121 121 -171 -7 30 7 23 62 141 -78 -87 -17 -32 50 -60 47 91 -135 -2 -87 104
4215 104 13 16 11 130 -172 26 -64 -40 -64 192 178 148 118 127 -131 -14 14 39 68 121 -114 -84 39 -37 -127 -89 -31
4242 -31 -172 19 43 93 121 12 33 -98 -52 225 33 65 66 64 -153 238 139 -118 43 72 -103 23 -157 -84 15
4267A5Mj30K58j65n8q7J24K03k6r9n5L7p4O0J43l2k39J63k0P1j33l0K9J19n0J9
4293D7q4Q1k8l4j4k8j15K01J95j60j24J9N3r3J85j80L8r0O3j9M0j17R3J17r7N7
4319Fn2m6k9J91j22M4o2k3M1J94l2k12K10l3j26K6n9l6M7n5J50OMJ46j35j15O3
4346iq9Q2k7L2J09j50J88j60k9J82j8j27j78K87j49j65J48L5j00K40j79J15L9
4369G7j09NL5j68J29NN1K3k77K01N1P6r7j07J32n0J51k4o8K0r4Kj25%K27j01p5
4396a10J17j56K48r5r6N1Q2J6o2L1o9P4m7k40K29Jj43J62n9N1j33J39k28K38K
4421Cj81R5J25Jn2P6m8j20n7J43j3m8N6l2J09P9rn5m0l2m4J27r7J0L0J73l06N1
4449e6L1l6o3R3K2O9j05o6J35O1n7Q2j19Lp5P0L8o3j9J03j46N8K05j65j30J18
$$ plain form
4267 15 19 -111 147 -18 -76 -163 -39 164 138 39 -16 21 -53 7 150 118 -121 42 22 93 -40 -70 -41 78 28 47
4293 47 -37 44 16 -18 -32 -60 -175 26 221 61 -63 -44 9 -84 101 -79 -41 -131 -68 -87 -47 -164 -71 46 -51 6
4319 6 -46 -92 -121 70 -52 -8 -70 -93 -52 142 110 -102 108 75 -51 -25 -84 -120 -73 -128 22 28 32 178 43 -72 -9
4346 -9 -98 -16 -43 -11 98 -52 136 -24 -53 129 111 -16 -194 93 -56 -221 -73 -38 -138 102 -77 38 77
4369 77 -32 -27 8 -160 -31 -26 25 48 -229 -28 23 99 2 -105 27 -23 128 104 36 56 -38 -36 -161 -161 66 -35 -110
4396 -110 7 -149 99 4 -92 -41 41 57 -5 26 -43 31 -16 -256 -27 -26 -169 -7 -66 -15 -148 -9 -237 1 3
4421 3 -178 -83 42 43 -9 67 19 -101 -158 -15 -28 -76 -20 -52 57 136 127 72 32 0 -44 83 -14 -4 26 199 -107 -56
4449 -56 -25 -61 -124 -31 -9 60 -45 -111 24 85 28 110 -9 -6 -81 -11 27 -36 -55 48 -98 -40 165 0 -130 -12
4475a2p8O0K03n3q9K38k74K7Q9j07J3j37J17J2j08L0J3m2qJ65p0j62K26q3M3j01
4501h8J7RJ20j64n5K96j55j29Q8j42L99n1j98pJ76j70O0l5R2jnL7k5j24R1j9P5
4528I2j44j98L37p8M2k06K21q7K2L6J0n6J09j21o6jl7J84o2M7L4K9j88K27j84
4553c8N6N9Pn0k8L8K4m8k6K25m16K79k6j47j7L9N3j85J78J22p4j9m7Q4j6r3K11
4580A45J0j72Ok4J2LJ20K0k3J28k58m4J3K18q5M1j17l4j08J79j8n3m4K03j04j03
4606h9O4L8L3q0K78j53j65o1J48p8R0M8M6o3Q4j89J4Jq7J53j08l7J99j72J12l
4632B3o1J93j96J50O1k19l0P6k6J34K7j42NK3O7o9j35L8J32lQ0o9j10R0j7r6R5
4659B1p7J55j89j4L06j01ok82K43R1j18j17O7j19J27mLO3j81J77rNP6j40M2Rq2
$$ plain form
4475 -12 -90 -30 173 120 31 269 -5 22 111 4 17 -120 -3 9 -99 -69 -56 -98 -106 59 -11 -173 53 -30 13 -88
4501 -88 -71 -62 58 -106 -161 135 -20 -149 -61 -203 196 145 -53 -60 116 -54 6 -29 63 62 57 94 69 -55 36 17 92
4528 92 -52 -250 87 9 51 -155 66 -21 1 37 47 -9 100 -21 -87 -88 -125 59 -3 44 78 107 -81 146 -38
4553 -38 18 77 84 34 6 44 68 20 -6 219 -197 82 56 -91 -108 -69 -16 -201 -23 99 25 6 -41 43 27 -66 145
4580 145 155 -17 -11 -35 -23 -20 100 120 97 225 -33 -77 -64 154 69 110 -7 -41 -149 30 12 -41 -85 118 14 -89
4606 -89 -25 13 46 -34 244 91 -74 -135 13 -65 25 73 119 56 140 -49 -35 -34 -121 32 -76 -113 86 -86 26 23
4632 23 -38 155 -41 109 170 -49 -79 -3 -29 105 132 -10 -5 18 85 16 -119 -81 51 48 128 59 -51 39 22 -74 21
4659 21 -56 99 -90 -104 202 101 95 -187 56 147 29 -88 -21 -140 -13 -17 -14 49 -132 45 36 41 117 -23 19 28 -54
4686e4jJ7M8Q3j04N8JJ2j50J94j49O4Q5j15K99l23lP8P2q4j43L9J26rm1r9J16
4713A7p7k5k6L1m0K61l70K08J55j05o2pJ6n0J99j99K45k59J45k00J37o5K32j56
4737EK01k29O8k21O4J99k72M9Q8J18n1o3J2O9r0O5j2m3J00j3l3m6j5pPN1J0r7
4765h6K11j18k2n1P9j85O0Q1J70q8O6j32M2L6j75L58k03J59k67J22j38J96k68
4788a53J27r8K24j45K9K1J1q7pJ24k4m3lJ6qm5jJJJ63j39N6j0Q0j13L6jp4K36
4817A74k24P1M8j43Q7K1j21K71k17R3M0j78J16j5p0q8K32p1p5R3l3m1l0J28j17
4842d9J54j24R3K9r8K2k12K82j27O9j87k1K36q8Q1j91J97j0l5rp4J65k0o1N1n1
4868B2j22P5o7R4K4j64N9Q1K46k95m7J50Q3%m1J44j92nj33J54J2Q0k35k8M6J44
$$ plain form
4686 -54 -55 -38 10 93 -11 47 48 60 -90 104 -45 19 104 -11 288 -35 -38 40 112 28 -115 -76 50 41 0 -99 17
4713 17 -60 -85 -111 -80 -120 141 -229 -21 134 29 -33 -40 -24 -74 125 -74 171 -88 57 -143 -6 -71 161 5
4737 5 206 -23 45 -176 -112 87 -185 -136 -48 70 19 -44 -32 37 -53 12 0 -43 57 44 11 -35 -50 -57 -50 1 11 -86
4765 -86 125 7 -15 -66 13 -172 -112 -31 139 51 117 -15 27 63 -112 246 43 202 -65 57 -81 115 -153
4788 -153 -26 -124 100 -45 -16 5 16 -71 -78 46 22 -21 -24 -8 -16 -61 -62 -61 -60 103 -36 20 10 90 -23 13 12 -62 174
4817 174 -50 21 69 -74 13 34 -87 184 -33 60 100 -78 38 23 -47 -135 97 26 -49 44 11 -30 -60 68 -49
4842 -49 105 -19 74 103 5 27 -185 97 -30 39 -148 -169 67 -21 60 -131 66 56 21 12 -62 103 83 22 73 22
4868 22 -100 -25 -92 2 26 -138 -79 2 248 -47 -94 56 139 139 98 242 50 45 -88 66 78 158 -77 -105 -59 85
4894H5j6Lmn5q4J62j47M4n4J39j39O9n5J3P1n0M1K7N0j69J7J39n5j61K24k9K9
4921I5m0n5P3k30J21K01j01k12J88j85K13J38j80K6m2M4K7j13N7N2rKKj95R8J00
4947G5r6j17K09k33J75n1N6q4J27k26K68j08j10N5PJ82k37O8r7N4J60p6P9j09
4971b9J5j23K00l6n2J62j75R2J29k83Q7L5R1l8r5P3O1r9J16j11M9Jr5R3O6j83
$$ plain form
4894 85 69 72 68 13 -71 91 -56 -12 -66 73 -66 3 -52 -39 32 -18 23 50 100 -69 -52 87 32 -129 95 66 95
4921 95 55 0 73 -157 -36 165 64 -148 40 -145 68 206 26 52 10 54 81 -32 25 77 68 70 72 -123 -25 75
4947 75 -21 -138 71 -162 13 -38 18 -66 61 -165 103 -5 -115 -60 -53 129 -108 -40 -137 -83 77 1 80 -29
4971 -29 -14 -137 63 27 -25 137 -38 54 183 -100 -13 22 113 75 -20 53 114 15 131 20 69 70 -25 68 134 -49
$$ [...]
8191d8
##END NTUPLES=NMR FID
##END=
