##TITLE=1H_SR147rek
 CDCl3
 8 sc, 
 17.10.2022
##JCAMPDX= 6.0         $$ Bruker NMR JCAMP-DX V2.0
##DATA TYPE= NMR FID
##DATA CLASS= NTUPLES
##ORIGIN= UXNMR, Bruker Analytische Messtechnik GmbH
##OWNER= root
$$ XWIN-NMR		Version 3.5
$$ Mon Oct 17 16:39:04 2022 Russian Standard Time (UT+4h)  she@DPX200
##.OBSERVE FREQUENCY= 200.1313499994
##.OBSERVE NUCLEUS= ^1H
##.DELAY= (6, 6)
##.ACQUISITION MODE= SIMULTANEOUS
##.ACQUISITION SCHEME= undefined
##.AVERAGES= 8
##.DIGITISER RES= 18
##SPECTROMETER/DATA SYSTEM= spect
##.PULSE SEQUENCE= zg30
##.SOLVENT NAME= CDCl3
##.SHIFT REFERENCE= (INTERNAL, CDCl3, 0, 15.7039)
##AUDIT TRAIL= $$ (NUMBER, WHEN, WHO, WHERE, WHAT)
$$ ##TITLE= Audit trail, XWIN-NMR		Version 3.5
$$ ##JCAMPDX= 5.01
$$ ##ORIGIN= Bruker BioSpin GmbH
$$ ##OWNER= she
$$ F:/spectra/data/she/nmr/H-F/1/audita.txt
$$ ##AUDIT TRAIL=  $$ (NUMBER, WHEN, WHO, WHERE, WHAT)
(   1,<2022-10-17 16:38:20.37 +0400>,<she>,<DPX200>,
      <created by zg, POWCHK disabled, PULCHK disabled
       configuration hash MD5:
       00 E9 B6 7A A2 85 ED C7 34 08 36 98 17 FE 4E 26
       data hash MD5: 16K
       38 3E 42 C5 D1 DF E5 C4 CF BC 85 41 D9 0B BD B5>)
$$ ##END=
$$ 
$$ hash MD5
$$ 87 B3 ED A2 31 1A 3F 9F DC 8E DB E9 E7 B2 FE 67
##$RELAX= 
##$RELAX= 
##$RELAX= 
##$RELAX= 
##$RELAX= 
##$RELAX= 
$$ Bruker specific parameters
$$ --------------------------
##$DU= <F:/spectra>
##$EXPNO= 1
##$NAME= <H-F>
##$PROCNO= 1
##$TYPE= <nmr>
##$USER= <she>
##$AMP= (0..31)
100 100 100 100 100 100 100 100 100 100 100 100 100 100 100 100 100 100 
100 100 100 100 100 100 100 100 100 100 100 100 100 100 
##$AQSEQ= 0
##$AQ_mod= 1
##$AUNM= <au_zg>
##$AUTOPOS= <>
##$BF1= 200.13
##$BF2= 200.13
##$BF3= 200.13
##$BF4= 200.13
##$BF5= 200.13
##$BF6= 200.13
##$BF7= 200.13
##$BF8= 200.13
##$BYTORDA= 1
##$CFDGTYP= 0
##$CFRGTYP= 5
##$CHEMSTR= <none>
##$CNST= (0..31)
1 1 145 1 1 1 1 1 1 1 1 1 1 1 1 1 1 1 1 1 1 1 1 1 1 1 1 1 1 1 1 1 
##$CPDPRG= <>
##$CPDPRG1= <>
##$CPDPRG2= <>
##$CPDPRG3= <>
##$CPDPRG4= <mlev>
##$CPDPRG5= <mlev>
##$CPDPRG6= <mlev>
##$CPDPRG7= <mlev>
##$CPDPRG8= <mlev>
##$CPDPRGB= <>
##$CPDPRGT= <>
##$D= (0..31)
0 1.2 0 0 0 0 0 0 0 0.06 0 0.03 0 0 0 0 0.0002 0 0 0 0 0 0 0 0 0 0 0 0 
0 0 0 
##$DATE= 1666010299
##$DBL= (0..7)
120 120 120 120 120 120 120 120 
##$DBP= (0..7)
150 150 150 150 150 150 150 150 
##$DBP07= 0
##$DBPNAM0= <>
##$DBPNAM1= <>
##$DBPNAM2= <>
##$DBPNAM3= <>
##$DBPNAM4= <>
##$DBPNAM5= <>
##$DBPNAM6= <>
##$DBPNAM7= <>
##$DBPOAL= (0..7)
0.5 0.5 0.5 0.5 0.5 0.5 0.5 0.5 
##$DBPOFFS= (0..7)
0 0 0 0 0 0 0 0 
##$DE= 6
##$DECBNUC= <off>
##$DECIM= 32
##$DECNUC= <off>
##$DECSTAT= 4
##$DIGMOD= 1
##$DIGTYP= 9
##$DL= (0..7)
0 120 120 120 120 120 120 120 
##$DP= (0..7)
150 150 150 150 150 150 150 150 
##$DP07= 0
##$DPNAME0= <>
##$DPNAME1= <>
##$DPNAME2= <>
##$DPNAME3= <>
##$DPNAME4= <>
##$DPNAME5= <>
##$DPNAME6= <>
##$DPNAME7= <>
##$DPOAL= (0..7)
0.5 0.5 0.5 0.5 0.5 0.5 0.5 0.5 
##$DPOFFS= (0..7)
0 0 0 0 0 0 0 0 
##$DQDMODE= 0
##$DR= 18
##$DS= 0
##$DSLIST= <SSSSSSSSSSSSSSS>
$$ [...]
##$SUBNAM2= <"">
##$SUBNAM3= <"">
##$SUBNAM4= <"">
##$SUBNAM5= <"">
##$SUBNAM6= <"">
##$SUBNAM7= <"">
##$SUBNAM8= <"">
##$SUBNAM9= <"">
##$SW= 18.0517283424941
##$SWIBOX= (0..15)
0 0 2 0 0 0 0 0 0 0 0 0 0 0 0 0 
##$SW_h= 3612.71676300578
##$TD= 16384
##$TD0= 1
##$TE= 0
##$TE2= 300
##$TE3= 300
##$TEG= 300
##$TL= (0..7)
0 120 120 120 120 120 120 120 
##$TP= (0..7)
150 150 150 150 150 150 150 150 
##$TP07= 0
##$TPNAME0= <>
##$TPNAME1= <>
##$TPNAME2= <>
##$TPNAME3= <>
##$TPNAME4= <>
##$TPNAME5= <>
##$TPNAME6= <>
##$TPNAME7= <>
##$TPOAL= (0..7)
0.5 0.5 0.5 0.5 0.5 0.5 0.5 0.5 
##$TPOFFS= (0..7)
0 0 0 0 0 0 0 0 
##$TUNHIN= 0
##$TUNHOUT= 0
##$TUNXOUT= 0
##$USERA1= <user>
##$USERA2= <user>
##$USERA3= <user>
##$USERA4= <user>
##$USERA5= <user>
##$V9= 5
##$VALIST= <valist>
##$VCLIST= <CCCCCCCCCCCCCCC>
##$VD= 0
##$VDLIST= <DDDDDDDDDDDDDDD>
##$VPLIST= <PPPPPPPPPPPPPPP>
##$VTLIST= <TTTTTTTTTTTTTTT>
##$WBST= 1024
##$WBSW= 4
##$XGAIN= (0..3)
0 0 0 0 
##$XL= 0
##$YL= 0
##$YMAX_a= 412309
##$YMIN_a= -256251
##$ZGOPTNS= <>
##$ZL1= 120
##$ZL2= 120
##$ZL3= 120
##$ZL4= 120
##$ABSF1= 10
##$ABSF2= 0
##$ABSG= 5
##$ABSL= 3
##$ALPHA= 0
##$AQORDER= 0
##$ASSFAC= 0
##$ASSFACI= 0
##$ASSFACX= 0
##$ASSWID= 0
##$AUNMP= <proc_1d>
##$AZFE= 0.1
##$AZFW= 0.1
##$BCFW= 1
##$BC_mod= 2
##$BYTORDP= 1
##$COROFFS= 0
##$CY= 11.3945322036743
##$DATMOD= 1
##$DC= 2
##$DFILT= <>
##$DTYPP= 0
##$F1P= 2.36226072786647
##$F2P= -0.459571619588291
##$FCOR= 0.5
##$FTSIZE= 0
##$FT_mod= 4
##$GAMMA= 1
##$GB= 0.15
##$INTBC= 1
##$INTSCL= 1
##$ISEN= 128
##$LB= 0.24
##$LEV0= 0
##$LPBIN= 0
##$MAXI= 10000
##$MC2= 0
##$MEAN= 0
##$ME_mod= 0
##$MI= 1.114404
##$NCOEF= 0
##$NC_proc= 0
##$NLEV= 6
##$NOISF1= 3.799351
##$NOISF2= 2.8
##$NSP= 1
##$NTH_PI= 0
##$NZP= 0
##$OFFSET= 15.70392
##$PC= 1
##$PHC0= -18033.84
##$PHC1= 11.00069
##$PH_mod= 1
##$PKNL= yes
##$PPARMOD= 0
##$PSCAL= 0
##$PSIGN= 0
##$REVERSE= no
##$SF= 200.130013532006
##$SI= 16384
##$SIGF1= 3
##$SIGF2= 2
##$SINO= 400
##$SIOLD= 16384
##$SREGLST= <1H.CDCl3>
##$SSB= 0
##$STSI= 0
##$STSR= 0
##$SW_p= 3612.71676300578
##$SYMM= 0
##$S_DEV= 0
##$TDeff= 0
##$TDoff= 0
##$TI= <>
##$TILT= no
##$TM1= 0
##$TM2= 0
##$TOPLEV= 0
##$USERP1= <user>
##$USERP2= <user>
##$USERP3= <user>
##$USERP4= <user>
##$USERP5= <user>
##$WDW= 1
##$XDIM= 8192
##$YMAX_p= 0
##$YMIN_p= 0
$$ End of Bruker specific parameters
$$ ---------------------------------
##NTUPLES= NMR FID
##VAR_NAME=  TIME,          FID/REAL,        FID/IMAG
##SYMBOL=    X,             R,               I
##VAR_TYPE=  INDEPENDENT,   DEPENDENT,       DEPENDENT
##VAR_FORM=  AFFN,          ASDF,            ASDF
##VAR_DIM=   8192,          8192,            8192
##UNITS=     SECONDS,       ARBITRARY UNITS, ARBITRARY UNITS
##FACTOR=    0.0002768,     1,               1
##FIRST=     0,             0,               0
##LAST=      2.2672688,     0,               0
##MIN=       0,             -256251,         0
##MAX=       2.2672688,     412309,          0
$$ Real data points
##PAGE= N=1
##DATA TABLE= (X++(R..R)), XYDATA
$$ [...]
1799c18N4o0J01j08nJ53RP6L72k25O6qK6M64l50o0J63R2Q9q4l43Q8j49J14l62
1824b05L29j53m77J92J48k8j47L35m92J94r1J46K55m7p6K67P9J93j66r0L02R2
1846E60m06k4K17m6j82k1k54O1n6N3Ok56J0jo6Q9J49k7K55m3O3M2LL2k54K22j22
1873DM0K5K7j3P2L03m21j14J4k59K22j2k5j5j95K65K15k48M4j22M0j77J27J72
1897c1J59J32k40j28L74k50j0j89L90m29K68JR4N3j7k62J56J06R4K8l62K7J42
1920A06q7L2J07k54K62Q5l81j78j81L4J47R0K9O0J15j01j02K78j37Q8p3o8K66
1943A37L4L8K73j64K97j60k27r5j19j01J0r2r3J91o6J89l01r3J49O4l71K73J1
1966b16j84N27n4L13j19J96k26K01m85M32l9k43L02n30K29K19L4r6k88Q1k58J31
$$ plain form
1799 -318 -264 -324 -223 -331 -336 -183 -174 -98 274 49 115 107 133 597 247 187 350 442 531 447 104 192 43 157 -205
1824 -205 124 -29 -506 -314 -166 -194 -341 -6 -498 -304 -395 -249 6 -41 -117 150 229 422 256 166 468 560
1846 560 154 130 347 301 119 98 -156 -95 -151 -98 -92 -348 -338 -339 -405 -316 -167 -194 61 18 81 123 126 158 -96 126 4
1873 4 44 69 96 83 155 458 37 -77 -63 -322 -100 -112 -137 -152 -347 -82 133 -115 -71 -193 -153 -330 -203 -31
1897 -31 128 260 20 -108 266 16 6 -183 207 -222 46 47 141 194 177 -85 71 177 271 299 -63 -36 106
1920 106 19 51 158 -96 166 251 -130 -308 -489 -455 -308 -218 -189 -129 -14 -115 -217 61 -76 12 -61 -129 137
1943 137 171 209 482 318 615 455 228 133 14 -87 -77 -169 -262 -71 -137 52 -249 -342 -193 -129 -500 -227 -216
1966 -216 -400 127 73 386 267 463 237 438 -47 385 346 103 405 -125 104 323 357 261 -27 54 -204 -73
1988g3k45L4j48j78M45J60M1j13L17j65J24j63J82k30O7KK71k15J9j1j06M8R4
2011A57k55O1M4r9R1k01J42O8m9J93k00j92Q8R8n3J71j96J99M5N8Rj60K81k58
2035D2j64Q4J59l28J46J70J89l89K32M5l90OK26l4k40N65k4l55j26K48k41L60
2057A81k19j94J8O5J29k47r3M00m5K50j49J98l33l92N12k53J84M14j36N2k53J35
2079B24J2k52L60n73L5M55j67l26N8J55k89P6oK60k57o8j25J00N17j93K55l45
2101i4L53j11j98K01K44l84l2L16j03j15l0j42K05k13L42l79j62R6o1J31j79L49
2123C4L2n10L31j57L84p9J26k55J35j0K19j78P3J17J28q6l11m40L87j59k07L68
2145e8K01l33r6J70P1k77J21J43L7n4j00j9p5J00L22K5J24j82o9Q2r2o4J2K06
$$ plain form
1988 -73 -318 -284 -432 -610 -165 -5 36 -77 240 75 199 36 218 -12 55 57 328 113 132 121 15 63 157
2011 157 -98 -37 7 -92 -1 -202 -60 8 -41 152 -48 -240 -152 -54 -107 64 -132 67 112 170 179 19 300 42
2035 42 -122 -38 121 -207 -61 109 298 -91 141 186 -204 -198 28 -6 -246 319 295 -60 -186 62 -179 181
2057 181 -38 -232 -214 -149 -20 -267 -360 40 -5 245 96 294 -39 -431 81 -172 12 426 290 342 89 224
2079 224 236 -16 344 -229 -194 261 94 -232 -174 -19 -308 -232 -238 22 -235 -303 -428 -328 189 -4 251 -94
2101 -94 259 148 -50 151 395 11 -21 295 192 77 47 -95 110 -103 239 -140 -302 -206 -267 -136 -315 34
2123 34 66 -444 -113 -270 114 35 161 -94 41 31 250 72 145 262 390 304 -7 -447 -60 -219 -426 -58
2145 -58 143 -190 -286 -116 -45 -322 -201 -58 -21 -75 -175 -194 -269 -169 153 178 302 120 51 133 41 -23 -11 195
2169A95j10J08j57r1J55Qn66J28K52J7J31k40J30j22K21K38k77r9J94q9k04Q6
2191i2K12K6J75m13k4M9K03j54K8k29K4J76M5J72O8l12J7J83j40l4L8P7j27Rp1
2216i4R7j65R8r9o9K67k20q9J63J63r3l9J83N4q0J74j45m1M0J3k87J59L97k15
2240A72p5J72l41J76k93k43L67j7l87L48j0k17K52n3J78m46L46k1j02J57j21q4
2262b42K71l57L07M35j96j95mL52j68j06l4j39j41K43k24K24k29K49j78j29J22
2283a39r0O4j90K85m07N51J61r9j76K27j8j48n4J49j85J63j57K5J91P6l83K13
2305E9j87O8r7K8m5j28K57K8n2j80P0J23n2P6J9M4m6Q0J21k7j34Rq7K31k03l23
2331c48M95R2l20R1O6nk86J31Q3j9K72k28m58L19m2K26j19l60O71n11l0L04p6
$$ plain form
2169 195 85 193 36 -55 100 108 -458 -330 -78 -61 70 -170 -40 -162 59 297 20 -79 115 26 -178 -92
2191 -92 120 146 321 -92 -116 -67 136 -18 10 -219 -195 -19 26 198 266 -46 -29 154 14 -20 18 95 -32 -23 -94
2216 -94 3 -162 -64 -163 -232 35 -185 -274 -111 52 -41 -80 103 157 77 251 106 65 105 118 -169 -10 387 172
2240 172 97 269 -72 104 -189 -432 -65 -82 -469 -121 -131 -348 -96 -149 29 -417 -71 -92 -194 -37 -158 -242
2262 -242 29 -328 -21 414 218 23 19 371 203 97 63 -76 -217 26 -198 26 -203 46 -132 -261 -139
2283 -139 -229 -165 -355 -70 -477 74 235 136 -40 187 169 21 -33 116 -69 94 -63 -38 153 229 -154 59
2305 59 -128 -60 -157 -129 -174 -302 -45 -17 -69 -249 -179 -56 -108 -32 -13 31 -15 65 186 159 25 34 -53 178 -25 -348
2331 -348 147 239 -81 10 76 71 -215 -84 -1 -20 252 24 -434 -115 -157 69 -50 -410 261 -250 -280 24 -52
2354e2O1k07J65K43j97P4j4J39k06L0j74K62o1l62J17L73M6j49k10J33K43l15
2376f1k7qk05K01n3P4p2J28QK5r6j59J41Q0r9K28j00J21j8pK37k34k87J52J02
2401G1k76N13l25LJ81l74K92k26O8k97K02j57K34nj27K34o3J03J28N4k24J85l27
2424a33M50m6p9j95J89j43L41o01L62j53%j47n3K39k19L04k11o5k21J36P2j51
2446c24L42k27J85j30j1K18Q7n8QJ0R1k9j68p4K23J65k52K47j65r7L1K27m04K40
2470A35n0k79K50P7j04j69K11q7j64M4K25k24J27J92k20P0Q3j02j04J39K45Q2
2492C77l75q4J49j86K71j16l7J26j24Q9O3k72J81oo1r0k6K6k32L48M0j8l6j85
2516a78R2K2r6K85l40K82%k36L93j0j9o3J2J68k73j02L68l32j73L17j04j69J08
$$ plain form
2354 -52 9 -198 -33 210 13 87 73 212 6 36 -138 124 63 -299 -182 191 237 88 -122 11 254 -61
2376 -61 -88 -96 -301 -100 -153 -79 -151 -23 -15 10 -86 -245 -104 -24 -123 105 5 126 108 101 338 104 -183 -31 71
2401 71 -205 308 -17 -14 167 -207 85 -141 -73 -370 -168 -325 -91 -96 -223 11 -52 51 179 233 9 194 -133
2424 -133 317 271 192 -3 186 43 384 -217 145 -8 -8 -155 -208 31 -188 116 -95 -160 -381 -245 -173 -324
2446 -324 18 -209 -24 -154 -165 53 140 82 90 100 191 162 -6 -80 143 308 56 303 138 41 72 299 -105 135
2470 135 85 -194 56 133 29 -140 71 -16 -180 -136 89 -135 -8 184 -36 34 117 15 -89 50 295 377
2492 377 2 -82 67 -119 152 36 -1 125 1 90 153 -119 62 56 -5 -95 -121 -95 -327 21 61 43 7 -178
2516 -178 -86 -64 -160 125 -215 67 67 -169 224 214 195 132 144 312 39 -63 305 -27 -200 117 13 -156 -48
2539d8k02K8oK27%p6k89L11j42K2L42k4q9m9J15k50K78j06L15n89J49K77j72k7
2563ej5oJ3q5N6k38K56ol44L16j38K7L1o1M1J82o0J78o4P3J21j92J20n2l8N0Q6
2590B46o9k49J70j07R8j07J99j3m18P8k61L14j5M9K66j26L9m7m2Q1k50j39L77
2613G4R1J06k42j6J70Ok27J43K5j97q1J53P8o6J08k77L50j94j28J89q5k04l9R3
2637a70N0m2OK29l23K58Q9q4K18j15Om2o1k7K49k61K44r6J32k82K1l8j26J38K09
2662A82J28l82R7n3Q5M7k76N2J39Mk93J04K91j66K23M7l49m8R1L36l13K68q0j32
2686BK91j72q0OJ17m11J48j20K10J36j12m3j90j8R8J15J13j44j99J10J88j61J82
2709F6l9O9j55J28j83K64k27K80n8j81p8L6Q1k7kL5P7j8l83L98m24K16J28p3k09
$$ plain form
2539 -48 -250 -222 -228 -1 -1 -77 -366 -55 -197 -175 167 143 54 5 120 -130 148 42 357 -232 -83 194 22 -5
2563 -5 -20 -26 -13 -98 -42 -280 -24 -30 -374 -58 -196 -169 -138 -199 -158 24 -36 142 78 151 272 80 200 148 110 160 246
2590 246 177 -72 98 -9 89 -18 181 168 -250 -172 -433 -119 -134 -85 181 55 94 47 5 86 -164 -303 74
2613 74 165 271 29 13 183 189 -38 105 130 -67 -148 5 83 17 125 -152 198 4 -124 65 -20 -224 -263 -170
2637 -170 -120 -162 -156 73 -250 8 97 13 231 116 122 80 19 -8 241 -20 224 128 260 -22 -1 -39 -165 -27 182
2662 182 310 -72 25 -28 57 104 -172 -120 19 23 -270 -166 125 -41 182 229 -120 -168 -77 259 -54 214 134 2
2686 2 293 121 41 47 164 -247 -99 -219 -9 127 15 -28 -218 -236 -138 -23 90 -54 -253 -143 45 -116 66
2709 66 27 96 -59 69 -114 150 -77 203 145 -36 -114 -78 3 -24 -26 9 86 68 -315 83 -341 -125 3 -70 -279
2734b79N19k77o3J99Qj61K18j39o8j10J31j50L76j49j2K23n8j68k48K06j0Q8K32
2757C08m44K9oJ36n5j55K59k39j03K55J61l61J97p0K26R7j59Nk50N0K34Q3k09
2780a1K14R0j95J85o2l28l2K92j43j98J97j06J5j4J27j6r7l0L5K5m6M4Q4j84N9
2805i5%M7K29j5k54j38M40j67N7K39l67J56p2J5J03l85L52m91K70R6J48l4k13
2828g9Q2J10P1k18P2k13q6J13K5O8K7K09r9j40J70r5J89j72JQ0r0Q3j37K46k70
2853e3j38L03j15K4k43J71p5M5j10K08J70k96k2J75J8O2R5k93R6LQ5j90k5J79
2877G4j61R6M6p3J92j29j65L4J76j83l0J64j32J25k90K15K4K97l59j12Mj63M75
2900A25o9r0Q8j41K00k6j12k8j39N42P8l04R4j91j32K18j26k52L12l21K48J51
$$ plain form
2734 -279 240 -37 -100 99 107 -54 164 25 -43 -153 -22 -172 204 55 43 266 208 40 -208 -2 -12 76 308
2757 308 -136 -107 -113 23 -32 -187 72 -167 -270 -15 146 -215 -18 -88 138 235 76 81 -169 -119 115 198 -11
2780 -11 203 293 98 283 221 -107 -139 153 10 -188 9 -97 -82 -96 31 15 -82 -112 -77 -52 -98 -54 30 -154 -95
2805 -95 -95 -48 181 166 -88 -226 214 47 104 343 -24 132 60 75 178 -207 145 -346 -76 20 168 134 -79
2828 -79 3 113 184 -34 38 -175 -261 -148 -123 -55 -28 181 82 -58 112 17 206 34 35 115 25 108 -29 217 -53
2853 -53 -191 112 -3 21 -222 -51 -126 -81 -191 17 187 -109 -131 44 62 124 219 -74 22 25 110 -80 -105 74
2877 74 -87 9 55 -18 174 45 -120 -86 90 -93 -123 41 -91 34 -256 -41 -17 280 -79 -191 -187 -350 125
2900 125 56 -34 54 -87 113 87 -25 -53 -192 350 428 124 218 27 -105 113 -13 -265 47 -274 -26 125
2922A25N1J17k85j0r6K48k08J91j44j32L76k20j01j2o9J82M70m21K09k62K17l84
2944a58K17L7K6J64l10P8r4J31q6J77l08K99j04k85M30k56J77K2q4k0r0J60k7
2967I6P8n7j87K43p8j16Q9j23K54k20l8M2M0j35J45m6j60J14K77k97j12L69j74
2990Dn2j9k29L78J74k26j07q2l1L1M5P0L40l37K0J32M2m0Op6j63R1J43lj90P7
3016bJ31k44N1P6k57R1J2J17pj83OJ34j86K66K26j34o1O1N6k06K26o1J0J31l48
3041i5K32j76J32q4R1r9K6k55K68%r2j79J65m3j59J81P7j62K37k24k05M12j69
3064a21J81O0j7J69k62j07K33r4O4J13k17n3N3k6j74J78k2J02p5K5j56O6J53k44
3088a71M0J88j95L07l56J83n4mk2J02q4J83l01L22J00k93J00k41J59j61J19l5
$$ plain form
2922 125 176 293 8 -2 -98 150 -58 133 -11 -143 233 13 -88 -100 -169 13 483 62 271 9 226 -158
2944 -158 59 96 122 286 -24 54 -40 91 5 182 -126 173 69 -216 214 -42 135 157 73 53 -37 123 96
2967 96 174 117 -70 173 95 -21 68 -55 199 -21 -59 -17 23 -112 33 -13 -173 -59 218 -79 -191 178 4
2990 4 -48 -67 -296 82 256 30 -77 -159 -190 -159 -114 -44 296 -41 -21 111 153 113 119 43 -120 -29 114 111 -79 -2
3016 -2 129 -115 -64 12 -245 -154 -142 -25 -32 -215 -209 -75 -261 5 231 97 36 97 153 -53 173 112 122 253 -95
3041 -95 137 -39 93 9 100 1 27 -228 40 40 -52 -231 -66 -109 -268 -87 -10 -172 65 -159 -364 48 -121
3064 -121 60 120 103 272 10 -97 136 42 106 219 2 -51 2 -24 -198 -20 -42 60 -15 10 -146 -80 73 -171
3088 -171 -131 57 -138 169 -187 -4 -58 -62 -84 18 -66 117 -184 138 238 -55 45 -196 -37 -198 -79 -114
3110a14J32J04j30L7j15J91L9k48P5L86m61r1K53m8L01m08J06j99j70K42J46j09
3132h1J75r4O8m5N5n4J46j4l07J85Kk52L08j03n7q8O5K04k27Q7J84q6k65N1K06
3157F3n6p8L6n3J71l4J94M5q9j69J89l55O2K30j46K25l27K35l68n8L10q1J27j70
3181i7r7o1p5L01J34k36k37K57J73m7J06j25j11j5P0J16p9K10n7K09m35K52L6
3204A92J9L8j93L9K78l57k83K88r0K28k87J59J60k94o6J86K8Pj00Q5n5J38K9j29
3228B0K24l0k19J3J49j68R4L2l00J82N2m3P9j23j2Lm8k0J16j23m3n4J48M4Pr5
3254a15J82k15R0K05j46J43O9J92k54j1o4o6J72k8j93j89K60j36O3q1J35k5M5
3277C3j48M0j5M3P2l6k2j65p5M94q3j52J3J3J53k6K77k14r6l56L25q0O1j07M4
$$ plain form
3110 -114 18 122 -8 29 -86 105 144 -104 -29 357 -104 -195 58 10 311 -97 9 -190 -360 -118 28 -81
3132 -81 94 0 68 23 78 24 170 156 -151 34 36 -216 92 -11 -68 -156 -91 113 -114 -27 157 71 -194 -143 63
3157 63 7 -71 -35 -88 83 49 243 288 199 30 219 -136 -74 156 10 235 -92 143 -225 -283 27 -54 73 -97
3181 -97 -194 -255 -330 -29 105 -131 -368 -111 62 15 121 -4 -115 -130 -60 56 -23 187 130 339 -96 156 192
3204 192 211 249 56 95 373 16 -267 21 -69 159 -128 31 191 -103 -169 17 45 52 -48 37 -18 120 149 20
3228 20 244 214 -5 8 157 -11 83 115 -185 -3 49 6 85 -38 -50 -47 -95 -115 1 -122 -165 -219 -71 -27 -20 -115
3254 -115 67 -148 -58 147 1 144 213 405 151 140 76 10 182 154 -39 -228 32 -104 -41 -122 13 -12 33
3277 33 -115 -75 -90 -47 25 -11 -33 -198 -273 221 138 -14 -1 12 165 139 416 202 106 -250 75 -5 56 -51 -7
3302gM6L05m43J42Rk76J47KL28r9k81P0j1K22j31r%j54Q6Q2J11l85K04N4j52M06
3328B66m05R4o8K77k05l4l8J0K93Kj51k30J01n6M6Q1N0k9k45P7J46N6O8p7JR1
3354A21k18J49Q6J7k99K04J05j6j6k72K9K44k00J41J10j86p6J67O5j16Oj03J00
3377D2p3r1j23L52j75P4j6K59j20j16n4k0L89l58L18j30l41M20j40Q6k44j77K97
3400E9N7k9j04K13k87K96l11L2l2k86M24Q7q7j28l12K96O2O7l1J13r2K93j05j12
3424H3k83J42j29L15j20J41P7J22j05j70k09K10j18K59n02J67pK84p0j83J3K0
3446f3m3m1L37j13M4k17j09L48p5p7J72J8j22j36K9j8O8O9j37L02l62K9J29p6
3470d4M3j11J71O5j45Q0q3j09R5r9J28n1on2L89l71M41k11j69P3k13Q9K59j19
$$ plain form
3302 -7 39 344 -99 43 52 -224 -77 -75 253 154 -127 -57 -68 154 23 14 14 -140 -54 28 139 -246 -42 12 -140 266
3328 266 -139 -45 -113 164 -41 -75 -113 -103 190 192 41 -189 -88 -144 -98 -17 33 4 -241 -164 -18 38 106 29 30 121
3354 121 -97 52 138 155 -144 60 165 149 133 -139 -110 134 -66 75 185 -1 -77 90 155 39 45 -58 42
3377 42 -31 -122 -245 107 -68 6 -10 249 129 13 -41 -61 328 -30 288 158 -183 237 97 183 -61 -238 59
3400 59 116 87 -17 196 -91 205 -106 -74 -106 -392 32 119 32 -96 -408 -112 -50 17 -14 99 7 300 195 83
3424 83 -200 -58 -187 128 8 149 226 348 243 73 -136 74 -44 215 -287 -120 -127 157 87 -96 -83 -63
3446 -63 -106 -147 190 77 121 -96 -205 143 68 -9 163 181 59 -77 -48 -66 2 71 -66 236 -126 -97 32 -44
3470 -44 -1 -112 59 124 -21 59 -24 -133 -38 -137 -9 -60 -66 -118 271 -100 341 130 -39 34 -179 -90 169 50
3494E0R3m42R7R6n7J91j16K16r9j16J45Or1Oj62K13k04J63r3Q7Q0k15J06P6k22
3519a92K05N9K1J3kk3J83J0j62j5Kj5m7j75K54k22l5L91m28J30N9M9l2N5o9j61
3545a47J7R3J03n0j21R3L27n12J29Q7l2J3j03J31J2p3M9P8j79L00j32n6lK8K39
3570B91m66M8k7L89l4k94j69K85o5l5n9J86k50L13R0k33N1%o3L42k87k06L52j87
3594b8K69k42j4k7K4K18k32q3k47M39K0k05J52j12J4J41k24R0J6M6j41J99K62
3617C35n47L61k75J0J84K8k59n9M13k63J26L05n73K24k5j90K2K62r8j03K46k07
3639h3j48K62Nq4p5J64k46K91K00j41m0J17k68L26l24L34k04k59K34j30M8j0J3
3662a8j23K04n9q0K10k78q6J82r4J96j33K6J77o0j39J91L1k34o3J71J96k19Q1
$$ plain form
3494 50 143 -299 -202 -106 -163 28 -88 128 29 -87 58 64 -27 -21 -183 30 -174 -11 -104 -17 63 -152 -46 30 -192
3519 -192 13 72 93 106 104 81 264 274 112 97 99 84 37 -138 116 -106 -141 250 -178 -48 11 60 28 83 14 -147
3545 -147 -130 -37 66 16 -105 -12 315 -197 -68 19 -13 0 -103 28 40 -33 16 94 -85 215 83 27 24 52 291
3570 291 -175 -127 -154 235 201 -93 -262 23 -42 -77 -136 50 -200 113 203 -30 21 21 -42 300 13 -193 159 -28
3594 -28 241 -1 -15 -42 -18 200 -32 -115 -362 77 97 -108 44 -68 -54 87 -137 -47 -31 15 -126 73 335
3617 335 -212 149 -126 -116 68 96 -163 -222 191 -72 54 359 -214 10 -15 -205 -183 79 -19 -122 124 -83
3639 -83 -231 31 36 -48 -123 41 -205 86 286 145 105 222 -46 280 -44 290 86 -173 61 -69 -21 -31 -18
3662 -18 -141 63 4 -76 134 -144 -230 -48 -142 54 -79 -53 124 64 -75 116 147 -87 -150 21 217 -2 79
3685G9l0m4l0j29J44J11J16k28k96J59J86k11J92lj28p6K85j72J29N8n6J40l31
3708a35J01j59P7K09j48r8J54m1j54K58j14J12k43K20J14j52j43K39r2k8k75K00
3730i8K15k14P3j12P2L02k42J66m63J79M11k07j99Q6K43k41q1L2m0K14J7j59J30
3753H4j63J00RO1j21j04k6J43nj2n1J03K9Q5K02n01J70j18M4m9o9K58j5J76l94
3778a64J41L3m6J58j41q9K38j22j69J97J99j28R4m06L03N0k82J66k45o1J17K16
3800E9j25K38k97K12j00k06k4M75l55%J24P7j04r8K14J01n0j41J1k35P6L92l03
3823e9l47K39J33L7n4j94L91o7j13L6l0q7K01j58k2K54o5nj81J80l8j11K34j55
3847A9l02M43m52J77J48j8j96Po7L20m19K25J9J75k59K22k36K37k26L63k72r8
$$ plain form
3685 79 49 5 -25 -154 -10 101 217 -11 -307 -148 38 -173 19 16 -112 -188 97 -75 54 112 56 196 -135
3708 -135 -34 -193 -116 93 -55 -153 1 -40 -194 64 -50 62 -181 39 153 1 -142 97 5 -23 -298 -98
3730 -98 117 -97 -24 -136 -64 238 -4 162 -301 -122 289 82 -117 -31 212 -29 -110 -78 -118 96 113 -46 84
3753 84 -79 21 30 91 -30 -134 -160 -17 -22 -34 -85 18 47 132 334 -167 3 -115 -71 -120 -189 69 54 230 -164
3778 -164 -23 10 -36 122 -19 -108 130 8 -161 36 235 107 201 -205 98 148 -134 32 -213 -274 -157 59
3800 59 -66 172 -125 87 -13 -219 -243 232 -123 -123 1 78 -26 -124 90 191 141 0 11 -224 -148 244 -59
3823 -59 -406 -167 -34 3 -51 -245 146 79 -34 2 -28 -115 86 -72 -94 160 95 90 -91 89 51 -60 174 19
3847 19 -283 160 -292 -115 33 15 -181 -174 -241 79 -340 -115 -96 79 -180 42 -194 43 -183 180 -92 -190
3869a90M64m14K54j90P2j43q7O4L36o2Q8j26J96k70%N7J11K2l78J38K21k46J82
3892I9k4r1J0r1J41p1O0J0J44j20j82L63k34K19j90J14k53J74p2j22L19k37K1
3915a3o7P3j20K79j00O3q8p1K2n0L29m18k0M33n9k40n3K60l42J92k95L51J26k57
3939f5j35K2K43P1k60J20j67J29L3n1j00L03l68M93j84Lm7j49k64M33m25M49J95
3962B79k53LJ91k96l5J24j70L60m44K94j54J20q1mJ58K22k33L8o0l69L33k0Q4
3985H7k24L2J21J16l90J94n8L5J74k2n7K4K34j41k52j2M7J59J17r8mk36L75r0
4009A31p8J99j04lj31r4K54Q0l7l40N1J71m07L40R8k33k23M11l08K58j36k3L97
4032B73m00J68l6J8J23k37J85J2j14r7P8L8j80M02j39M8j37J13k02J88j32K7J00
$$ plain form
3869 -190 274 -140 114 -76 -4 -147 -234 -170 166 104 192 66 262 -8 -8 49 160 182 -196 -58 163 -83 99
3892 99 75 -16 -6 -97 44 -27 33 43 187 67 -115 248 14 233 43 157 -96 78 6 -116 203 -34 -13
3915 -13 -80 -7 -127 152 52 115 27 -44 -22 -72 257 -161 -181 252 193 -47 -100 160 -182 10 -285 66 192 -65
3939 -65 -200 -178 65 136 -124 -4 -171 -42 -9 -60 -160 143 -225 268 84 87 40 -109 -373 60 -365 84 279
3962 279 26 29 220 -76 -111 13 -157 203 -241 53 -101 19 -62 -66 92 314 81 119 59 -310 23 3 87
3985 87 -137 -105 16 132 -258 -64 -122 -87 87 65 8 32 266 125 -127 -139 -92 67 184 86 82 -154 221 131
4009 131 53 252 148 145 14 -80 174 254 217 -123 -72 99 -308 32 130 -103 -326 85 -223 35 -101 -124 273
4032 273 -127 41 5 23 146 -91 94 106 -8 -105 -27 11 -169 233 94 142 5 118 -84 104 -28 -1 99
4055I9j82j02P2J29k88K08R8j01L6j33K95j4n3k8R4j13L23j91k57J91q4J10j01
4078HJ33k53K75k40J1l2K56P5k09M7j34RQ2l6m4K28n4j15J69q7J59j72q8J66m21
4103b67J91K76j88O3q9M4m1L24n92K12m2j55J71k1OL3J76N5k43j80K18o9O3K72
4127B17k52O9j15J12M5j48j7K29k30l2P9J35j54n7J29K18k94P7k8N1J51p0L5j8
4151A32L8k55J20j16K78j58p6L05k24l4O1lk34K77j34K77J64k30k06N5j17K26
4173A46L2k51O8j17J29j59J65l2O4k17L20l61K71o1k8m0L2K63k23m8l7Lr6L86
4197B09l4j53j14j20J82J51m2j13K09j16m6j47K70M2J33q6j14l0q9q8M6pJ7J27
4221H7l34Q4J05N0k72K78j33r7M38j93j30K60j06k6k9L8J72r7J08K0j42l1j34
$$ plain form
4055 99 -83 -185 -113 16 -272 -64 34 -67 -31 -164 131 117 64 36 130 17 340 149 -108 83 -1 109 8
4078 8 141 -112 163 -77 -66 -98 158 233 24 71 -63 -54 28 -8 -52 176 122 7 176 89 248 76 -12 154 -267
4103 -267 -76 200 12 75 -14 30 -11 313 -279 -67 -109 -264 -93 -114 -108 -75 101 156 -87 -267 -49 -118 -55 217
4127 217 -35 34 -81 31 76 -72 -89 140 -90 -122 -43 92 -62 -119 10 228 -66 11 -17 34 185 115 150 132
4151 132 170 -85 35 -81 197 39 -37 268 44 10 71 68 -166 111 -23 254 418 188 -18 37 -80 146
4173 146 178 -73 -5 -122 7 -152 13 -19 45 -172 148 -213 58 -3 -31 -71 -39 224 1 -47 -84 -81 -177 209
4197 209 175 22 -92 -212 -30 121 79 -34 175 59 13 -134 136 178 311 225 111 81 -8 -96 -50 -57 -40 87
4221 87 -247 -163 -58 -8 -280 -2 -135 -232 206 13 -117 143 37 11 -18 20 192 95 203 223 81 50 -84
4244h4RL31l84k3K2K64j22J13K73j90q3n25L46k3J96j04L6p0J88k21L87j42j98
4267dJ94k02%J39j70J40J44j30o8j12N2o2Q4k24K75L0K03m43M41k86J83m1L6j25
4291E4j23R7N7n0J22j8N1j96PJ09l5k01K65k63j0K58l54K79k44J52nK05o4j51
4315e8k37K05J95p1o3L17j86k12K19J13j93k24J04L30m0j47r1K39M9j26o1p6P8
4338F4k16O6J59O6K0k49j84J55R6j88J45J08l91M92l53L18rl4K36k33l0k70L79
4361A47l12K78j59n2K82L9k56M0p7n0M8L3o6Q0M7O6jp0j51J45r0P5K33k27J00
4386A02p7k7j73L09n5J1N0P3j5j10p2onk66M47J26l06k57M70k68J70j86N5p9O3
4411b6N9j26J67k30K08n4J03k11K43j84l3R7r6M05k70j08O0J16q5J7Oj39N2J4
$$ plain form
4244 -84 -75 256 -128 -151 -129 135 13 126 399 209 126 -399 -53 -76 120 16 52 -18 170 -51 336 194 -4
4267 -4 190 -12 -12 127 -43 97 241 111 43 -69 -17 -79 5 -219 56 86 289 -154 287 1 184 143 179 54
4291 54 -69 28 85 35 157 139 190 -6 1 110 75 -126 139 -124 -134 124 -230 49 -195 -43 -48 157 93 -58
4315 -58 -295 -90 105 34 -29 288 102 -110 109 222 29 -195 -91 239 199 52 -39 200 249 123 62 -14 64
4338 64 -152 -86 73 139 159 -90 -274 -119 -23 -211 -66 42 -349 143 -210 108 99 65 301 68 38 -232 147
4361 147 -165 113 -46 -98 184 223 -33 7 -70 -120 -72 -39 -105 -25 22 88 87 17 -134 11 -79 -4 229 2 102
4386 102 25 -2 -175 134 79 90 140 213 198 88 16 10 5 -261 186 312 6 -251 219 -49 121 -65 -10 -89 -26
4411 -26 33 -93 74 -156 52 -2 101 -110 133 -51 -84 13 -83 322 52 -56 4 120 35 52 58 -81 -29 -15
4435a5j8K48k47N4j30o6J58o1J16j95m4L38q7J14p9k26J69k7J44k5j92j34M5K01
4459D1QM6K3k26N9J54j68k51M33j10Jp1r6L13l38L23j71n9K12l76J58K92l42K62
4483A17o3l8l6l7k85K28J20j23L8J9N8L53k60k49k14J54K68n3k1P5Lq8J09pp8
4508a0R8j48N0Q2j65J10n3J57p3j14j24J34M7k6n0m3J91K6o8j45J07j0k03J81
4532d9J35L8Q3k88J41l16M23l43K56J17k90j18J38q6J75R6k15K25j15M2j59K03
4554I3p4J00k05J41j64J76Q1J67m40K01Q6j12l01K04Rr8j6K30l52L76q3p3N3O9
4578F8m9m0J76k74O8O4p8J36j6l71M59J3J01j18j39N9K0M4k45Q3j43p8L77m9K6
4603I4k05J9K2j8j8K31k34K44n4p6j60J50p9J12M7l5M3J51l62J40k64K71j22R5
$$ plain form
4435 -15 -33 215 -32 22 -108 -174 -16 -77 39 -156 -200 138 51 165 86 -140 29 2 146 121 -71 -205 -160 41
4459 41 49 95 118 -108 -49 105 -63 -314 119 9 10 -61 -157 156 -182 141 -30 -89 123 -253 -95 197 -145 117
4483 117 54 16 -20 -57 -342 -114 6 -117 -79 -60 -2 351 91 -158 -372 -218 50 -3 -24 51 54 -34 75 68 -10
4508 -10 88 -60 -10 72 -93 17 -36 121 48 -66 -190 -56 -9 -35 -85 -128 63 89 21 -124 -17 -27 -230 -49
4532 -49 86 124 207 -81 60 -256 167 -176 80 197 -93 -211 -73 -159 16 112 -103 122 7 49 -110 93
4554 93 19 119 -86 55 -109 67 148 315 -125 76 162 50 -251 -47 -38 -136 -152 78 -274 102 19 -54 -1 68
4578 68 19 -21 155 -119 -51 13 -65 71 55 -316 143 156 257 139 0 59 79 123 -122 -39 -182 -260 117 68 94
4603 94 -111 -92 -70 -88 -106 125 -109 135 81 5 -155 -5 -84 28 75 40 83 234 -128 12 -252 19 -103 -8
4627hK20l45J12P6K2k71K16k16rL64k11N1N8j27J51o5q6J14o5l16N26l0j27J37
4651A71l37J91O6n0L4j76J12j73K88n7Q4l8o0k10P7j04L15m9j45n2M2L71n16K03
4675a3Q7j02q6J49j01J73j68J98o0j43K14m4k96K91j34K21l26K73j21J49q1K18
4697B98m87O8K60j95K02r0l2J3N3N1k4N3q8k51N4J15n3M3k9Q1RJ21p6J08k24m6
4723f6J87j61R1p3N7kJ8j71J52j03J36Qj28q8r5QJ1L65n7L1k15P4J0J17j35j7
4749d6j02K93Q3k85PJ52q9k91K44J31q8j40m7JK0J94P7k98q4K55J41k95K51p8
4773FK58j71k83L55n6J23k72J52k7n5l8o7p6J51J30j0j32k41L27j45J69o9k17
4796a88K08j94K35l2j33Q8K12n05M98l86K99L25n21L50o4k2q4m5j76L36j35j72
$$ plain form
4627 -8 212 -133 -21 55 77 -194 22 -194 -203 161 -50 1 59 -68 83 18 -68 46 -19 -335 191 161 34 171
4651 171 -166 25 91 41 75 -101 11 -162 126 69 153 115 55 -155 -78 -182 133 84 -61 -113 -71 300 -216 -13
4675 -13 74 -28 -114 35 -66 107 -61 137 77 -66 148 104 -192 99 -35 186 -140 133 12 161 80 298
4697 298 -189 -121 139 -56 146 56 24 37 90 141 117 170 82 -169 -115 0 -53 -10 -39 42 51 172 96 204 -20 -66
4723 -66 121 -40 51 -22 35 33 51 -120 32 -71 65 73 -55 -143 -238 -230 -219 146 89 120 -95 -21 -11 106 -29 -46
4749 -46 -148 145 228 -57 -50 102 13 -278 -34 97 9 -131 -178 -177 -157 37 114 -184 -268 -13 128 -167 84 6
4773 6 264 93 -190 165 109 232 -40 112 85 30 -8 -75 -151 0 130 120 -12 -253 74 -71 98 29 -188
4796 -188 20 -174 61 29 -104 -16 196 -309 189 -197 102 427 -94 256 192 170 86 41 -135 201 66 -106
4818a06K03n1K24m53M09l08k08M85k88j61K57M0P6o2k74j5M7K59J67l39Q9J41
4840A32o7j7O2l2jk15P3J72j49L07k92j12J00J49l28M6M00l19j26J32K26j51J10
4863A00n9j21j34r1K04J21N3J21K33l41o3o8K59m81L17j93K26N0kj72j51K40M7
4886I5k75K27j48Q8P8m2o4m3P5j19r0L54Jj44L6J13k21j20L04j14k8m4N3K7K6
4911B5k74J53k19L57J63j49j22K02k78J38l2Q4RJ58p0L1n2j25M2o9J81q7j90K10
4935H6k75K07J54k12j77L15k6J06j0k57Q3j18K68m69M82j36O0j74j11J52N4k77
4957b75L28j46K94j91K00l0k30l4j82J47k34J81L0N8o0M6K42k30o2MK59k5j83
4980i3J45j33%J93j06k43M46r1rr9O3pk06J3K39j66l79M72k63J70k0J24j74L02
$$ plain form
4818 -106 97 46 270 -183 226 -82 -290 195 -93 -254 3 43 119 57 -217 -232 -185 74 241 -98 -9 132
4840 132 65 48 110 78 77 -138 -65 107 -42 265 -27 -139 -39 110 -218 -172 228 -91 -217 -85 141 -10 100
4863 100 41 -80 -214 -305 -101 20 73 194 427 86 23 -45 214 -267 50 -143 83 133 131 -41 -192 48 95
4886 95 -180 47 -101 -13 65 23 -41 -84 -9 -128 -218 136 137 -7 29 142 -79 -199 105 -9 -37 -81 -28 -1 25
4911 25 -249 -96 -315 42 205 56 -66 136 -142 -4 -36 48 57 215 145 176 124 -1 41 -28 153 66 -124 86
4935 86 -189 18 172 -40 -217 98 72 178 168 -89 -6 -124 144 -325 157 21 81 -93 -204 -52 2 -275
4957 -275 53 -93 201 10 210 180 -50 -84 -266 -119 -353 -172 -142 -84 -144 -98 144 -86 -148 -144 115 90 -93
4980 -93 52 -81 -81 112 6 -237 209 118 109 10 73 66 -140 -127 112 -54 -433 39 -224 -54 -74 50 -124 178
5004A78j64j55J19oJ42n36L92r7K52m1k76K12K5J66j57j72J17j48J98J68k89O3
5026iK59l03N2J9r6J71k55L43l22J88j20J33L2l36K14J25j20M8O5k00l8PJ42j51
5050a52N2Q1j86K84j95q4L28j85J64l2r1r1K67k93k2K40J73O3l52J46L5p3j24
5073d7o7R7p0J71j60K38k21J96k96q7L73k30O5L82j28r7M4J37k33j54J41j43r0
5096a79J68o5J87k8m76L04o5RK41p0k15j1J8K43k03K36O6J4p4J90k83o0P5Q0k09
5121a07J81j35m8M8r0L18l40K83J16l4k84J55Qj10J20L8k26k4J70k6K47k10J93
5144B43m89N35l10K26l33n9K27l1K42k34R0q5J6j15j27K19N4m1k49P9J64J88l84
5167a74M1L51l98J66L29k66J0K75l93J22k33K05Q9j44M4j70O1j9J15q9Q7j81K35
$$ plain form
5004 178 14 -141 -22 -28 114 -422 -30 -127 125 84 -192 20 45 211 54 -118 -1 -149 49 217 -72 -9
5026 -9 250 -53 -1 18 -78 93 -162 181 -141 47 -73 60 92 -244 -30 95 -25 23 88 -112 -150 -143 -1 -152
5050 -152 -100 -19 -205 79 -116 -200 128 -57 107 75 -16 -107 160 -133 -155 85 258 321 -31 115 150 77 -47
5073 -47 -114 -17 -87 84 -76 162 -59 137 -159 -246 127 -103 -38 344 216 119 163 300 67 -87 54 -89 -179
5096 -179 -11 -76 111 83 -393 -89 -154 -145 96 26 -189 -200 -182 61 -142 94 160 174 100 290 7 -53 22 102 -107
5121 -107 74 -61 -109 -61 -151 167 -173 110 226 192 -92 63 71 -39 81 119 -107 -131 39 13 260 50 243
5144 243 -246 289 -21 205 -128 -187 40 9 251 17 107 22 38 -77 -204 15 69 28 -221 -142 22 210 -174
5167 -174 -133 218 -180 -14 315 49 59 334 -59 63 -170 35 124 -20 24 -146 -85 -104 11 -78 9 -172 63
5190F3J71j77j09j19K0K93k95J40l9MR4J15k4P7l24p8J99m3J21j14j9M60m10j51
5214a45j28L48K8k96J99j2J8q4K88j68M7J68n18L08j20K12j02k10J9J02O9j66
5236a43K38m6MK2k32J37M5k46K93j19L0mk04L6L37l09J70j1j05q7K49j5l44K38
5260f6L85j65k97J37M2J71j39l6q4M07k90kO3p1Jk00L07k0L1k43J49k31P7J07
5284C3J72k41Q4k59J04m5J60kl09R7J72NJ67k4M5k07j91M70L2j60k99L9K60q2
5308B1q6Q3J9j13K17r1o7J21j14J03q1J55Q2m8k53J11j47Q3J12r6j09J04J22r1
5332C7K77n01L40r8ql02L98N7l49k5K97j01J91k55m9jj22K12m4J86o6j8R3J25
5356B74k99j54K36p4K31k58n5K89l01r1K72Lk9p3j56K44N5l43L07m30K59MJ60
$$ plain form
5190 63 234 57 -52 -171 -151 142 -153 -13 -52 -48 46 161 137 214 -110 -188 11 -32 89 -25 -44 416 6 -145
5214 -145 -273 75 103 -193 6 -6 12 -72 216 48 95 263 -255 53 -67 145 43 -167 -148 -46 23 -143
5236 -143 95 49 53 75 -157 -20 25 -221 72 -47 -17 -21 -225 -189 148 -161 9 -2 -107 -194 55 40 -304 -66
5260 -66 319 154 -143 -6 36 207 68 32 -52 355 65 63 126 55 56 -144 163 143 174 -69 80 -151 -74 33
5284 33 205 -36 48 -211 -107 -152 8 6 -303 -206 -34 -29 138 114 159 -48 -239 231 263 103 -196 -157 103 21
5308 21 -65 18 37 -76 141 50 -17 104 -10 93 12 167 249 201 -52 59 -88 -5 107 11 -98 6 128 37
5332 37 314 -187 153 55 47 -255 143 200 -149 -174 123 22 213 -42 -91 -92 -214 -2 -46 140 74 56 149 274
5356 274 -25 -179 57 -17 214 -44 -99 190 -111 -202 70 73 44 -29 -185 59 114 -229 78 -352 -93 -89 71
5379G1j35J03Q1j98l9K6K09j0j90P6K56l75q1K27k20P7J50L4l6q9K01k64K29N7
5403A60j96K3pj29J14O7k92K47J35k21N9q9K72j64j27K96k74L97l02k15M46j23
5425G7q0j09M5K49j35k12J95k1J39j07o2mJ13OQ3p2j29k4P7ql6j38J42k0M2rJ05
5452A07k71K48j76M77l32m22M87m8j8k3j72J95j02j44m7L87j25N4Nj37P2Jk54
5475b38L86j90R2k07K47j41L04l21j39K20o2J35j07N2K66p0j81j64O2j34N7L33
5497B00k42J03j56L29k67N9p1j38K56J26k79k69K79j63K30J35K70l80k55K04k81
5518c10K90j9J40j38J41j45J73q0N1l5k24L11j51J69lj68M0j16Mj10K5jJ32o2
5542h6L7L7j2j56O3J40j34P5r1J75K8r5j1K4J93k62J85l2m1K27l15L87k97j98
$$ plain form
5379 71 -64 39 120 -78 -117 -91 118 108 -82 -6 250 -125 -206 21 -199 -122 28 62 26 -63 138 -126 103 160
5403 160 -36 -13 -20 -149 -35 32 -260 -13 122 -99 -40 -129 143 -21 -148 148 -126 271 -31 -246 200 77
5425 77 -3 -112 -67 182 47 -165 30 9 148 41 -21 -25 88 94 177 105 -24 -48 29 21 -15 -153 -11 -31 11 2 107
5452 107 -164 84 -92 385 53 -369 118 70 52 29 -143 52 -50 -194 -241 146 21 75 80 -57 15 16 -238
5475 -238 148 -42 50 -157 90 -51 253 -68 -207 13 -49 86 -21 31 297 227 46 -118 -56 -190 -133 200
5497 200 -42 61 -95 234 -33 26 -45 -183 73 199 -80 -349 -70 -233 -3 132 402 22 -233 -29 -310
5518 -310 -20 -39 101 -37 104 -41 132 52 103 68 -156 155 4 173 170 2 42 -74 -70 -180 -155 -156 -24 -86
5542 -86 -49 -12 -24 -180 -117 23 -111 -36 -127 48 76 -19 -30 -6 187 -75 110 78 37 264 -51 336 39 -159
5566a59K98k27J84j93J21j9p7M3J25k33J45J34j96k6J38k1J52j08j28j80L09l62
5588b80M09m9j05K24l78J02J60o1o9Jl6Q6k6r3j0j71N60q5k61R5n7J89l8m75L24
5613d4j5J84l26J35Q2J68k73K11j41J5J20p9K7k85Q6O1o5L20l66R9j49J39K59
5636A63o8k5j54q5n4J53N8P2J77l70J32J40l1j46K7R5L2k22j16K28j51J81q3j03
5660a50Q5J96j75K28j71J09R4k68k7J39k4l40L59l16K87N1j71J11m2l1q3J36l1
5683c4L25k53J32l9O0j32j03k6J13L6l27K77J22J74j39j61J21k32L63l49K9J57
5705A14n6K54n59K98p9J84k09J17P4k11J21J15k55K23K87l94O1R6k88K53j9k59
5727a32K84l14J75Q1k50J29J16L4q8K3k34J70q0J72M6k51J00No5P0k4M5K85l43
$$ plain form
5566 -159 139 -88 96 -97 24 5 -72 -29 96 -137 8 142 -54 -80 58 37 189 81 -47 -227 82 -280
5588 -280 129 80 -25 199 -179 -77 83 22 -47 -46 -82 4 -22 -115 -125 -296 264 179 -82 13 -44 145 107 -368 -44
5613 -44 -59 125 -201 -66 16 184 -89 122 -19 -4 116 37 64 -221 -135 -74 -139 181 -185 -86 -235 -96 163
5636 163 95 70 -84 -169 -223 -70 -12 60 237 -133 -1 139 108 -38 -11 84 116 -106 -222 6 -145 36 -47 -150
5660 -150 -65 131 -44 184 13 122 216 -52 -79 60 36 -304 55 -261 26 77 -94 17 -25 -56 -139 -3 -34
5683 -34 291 38 170 131 191 59 -44 -70 43 79 -248 29 151 325 186 25 146 -86 277 -72 -43 114
5705 114 58 312 -247 51 -28 156 -53 64 138 -73 48 163 -92 131 418 24 85 181 -107 146 127 -132
5727 -132 152 -162 13 94 -156 -27 89 123 35 58 -176 -6 -86 86 132 -119 -19 -14 -79 -9 -33 12 297 -46
5751d6J25r4l75L23j00R9K8q2J00j8K59l08j07K06Oq5J20O6j32K04q9j55J7j84
5775b22JP1P5Q5Kp3j63K91j10N8ko8q5K21J49q4J66j18k95J34j6J67k10K28l49
5800a47M19n05K68j53J75J07k00J9lO7K1k19J58qJ98l91J89K16j30j48K6r7K48
5823A10m40L41J25j28m7O5J0j14J71J14l6k36J48k0j28J05j33K27p3J7L9k18j5
5846a16o1M04j66l38K06K16l43M15k55l9J14K24k96m3J5K38Qk9m5j51J95j6L4
5869A71j93K4qQ7l46J97J06j88OJ58J0j37j13J23J44n4o9K13k7k28o7Q1J37m7
5893b0o4R5m0j41K26Kj39J33pK32j26j36j46l8K25l7j29J0k32L21O4J97l31L73
5917B92l62R5J17M1j66j27O3pK34p6jm62K19K24K2r7M2q7K87r2j1k33L08l06J56
$$ plain form
5751 -46 79 -15 -390 -67 -167 -68 -40 -122 -22 -40 219 -89 -196 10 16 -69 51 117 -15 189 100 -55 -38 -222
5775 -222 -221 -150 -75 10 12 -61 -224 67 -43 15 13 -55 -140 81 230 146 312 194 -101 33 17 184 -26 202 -147
5800 -147 272 -233 35 -118 57 164 -36 -17 -20 47 68 -151 7 -1 197 -194 -5 211 81 -67 -41 -138 110
5823 110 -330 11 136 8 -39 26 36 -78 93 207 171 -65 83 63 -65 40 -93 134 61 78 117 -101 -116
5846 -116 -177 227 61 -277 -71 145 -198 217 -38 -77 37 261 -35 -78 -63 175 183 154 109 -42 153 137 171
5869 171 -22 2 -6 81 -265 -68 38 -150 -144 14 24 -113 -226 -103 41 -13 -82 131 104 -124 -191 -110 27 -20
5893 -20 -84 11 -29 -170 56 58 -81 52 45 277 151 15 -131 -169 56 19 -110 -100 -332 -11 53 250 -81 292
5917 292 -70 25 142 183 17 -110 -47 -54 180 104 103 -359 -140 84 106 9 51 -36 251 159 148 -85 223 -83 73
5942G3j02nP4J15p1j61j3M8K39r9l8J24j87k05J13K67l3k84Q6L48j91Q1k44L63
5966B98k63L6j6P2Q0k63J06J25l59rL02q7m1l8j42K10k9J36R5j77k14P0M0k39
5990c07L35J5j3k32J88K76l62J20p8m3J02N8j05Q8k01J49k23M30k29Mn5J71Q4
6013A72l97K10l1kM4M8j84L02j87M2j75J78mr1Q1j15n6J55K66k19r7Q4k7O6j91
6038a28J05k17K53K8R5j94J9J54J69k53m7J20l30K42R0r8n9J63q9j98L32l51J01
6061i3L0J07j64N5L6pJ70k57R1M1K32l04M7j25p7J94k4J93j53j07O3L5R9j24K5
6086a7K6K10n16L35k41J46J72J15j19p5j13Oj48M5L75j23K0J13j91l2J38j84M9
6109ij40Q4J68j9r8j9J32J3r2p4o5J67Ko4q7rj8L08r2k20m8M03J4j54k42K94l77
$$ plain form
5942 73 -29 -34 40 155 84 -77 -90 -42 197 98 60 184 -3 -208 -95 172 139 -145 -59 289 98 179 -65 298
5966 298 35 71 55 127 207 -56 50 175 -184 -193 109 22 -19 -57 -199 11 -18 118 213 36 -178 -108 -68 -307
5990 -307 28 43 30 -202 -14 262 -100 20 -58 -101 1 59 -46 42 -159 -10 -233 197 -32 -28 -83 88 172
6013 172 -225 -15 -46 -48 -4 44 -140 162 -25 17 -158 20 16 -75 6 -109 -165 -10 256 37 -60 24 -3 63 -128
6038 -128 -23 -240 13 41 136 -58 -39 115 284 31 -16 104 -226 16 106 8 -51 112 23 -175 157 -194 -93
6061 -93 -63 44 -120 -65 -29 -36 134 -123 -32 9 241 -63 -16 -141 -218 -24 -48 145 -8 -115 -52 -17 82 -42 -17
6086 -17 9 219 -297 38 -203 -57 115 230 111 36 -77 -71 -219 -174 201 78 98 211 20 -12 126 -58 -9
6109 -9 -149 -65 103 84 -14 -33 99 112 20 -54 -119 48 50 -14 -101 -110 -128 180 88 -132 -180 223 237 83 -159 135 -242
6136b42J33J40p8J88o6m5j32O3K33q1Mj58J26m0j5q4L1k02J50J04P3r4R0q4Ql1
6162iP0j12j98N86m27J09j09J68j06Q4L1m0l99L02P6r7K5nJ92j32q8l5Q8o0J33
6187D7M9P6j35K88l56J56j78J83m1j71J50j13PM4o0O2j00O2J33k72N2k7R8N2j57
6212a51K95l94P3o0J29L6M5Q8J7r0P5m1j26J94J48k81N7J98l32R6J19J7p7j01
6236f6m6L11l60K02J10j10K2k68OJ66L9Q9j48JJ78L6k2%J26j84j83R5J31q5k0
6261B0k24j46M52lj91R9r1l2P1q4K55l6K21j68J08l17J4j38Q6K2Q6j39L8j0J48
6286D1L9J66l43J73M5N4k19j8n5K44OK7J0l13K56k8R4m87M94m44K91k1j67O5O3
6311b7l8k67J50q%K72j19k9N2k6j02l0Q0L88r4l91K58k13M6J62J32K9k04j53K28
$$ plain form
6136 -242 -109 31 -47 141 75 30 -102 -39 194 113 117 -41 85 45 30 -54 -23 -225 -75 29 102 8 98 14 22 -9
6162 -9 61 -51 -249 337 -90 19 -90 78 -28 56 87 47 -352 -50 26 -71 -46 -51 141 9 -79 -114 -26 -86 47
6187 47 96 172 37 325 -31 125 -53 130 89 -82 68 -45 -38 6 -54 8 -92 -30 103 -169 -117 -144 -46 6 -151
6212 -151 144 -250 -177 -237 -108 -72 -27 61 78 -12 63 22 -104 90 238 -43 14 212 -120 -24 95 112 35 -66
6236 -66 -112 199 -161 41 151 41 63 -205 -199 -33 6 95 -53 -52 126 162 140 140 266 82 -101 -6 125 40 20
6261 20 -204 -350 102 99 -92 7 -84 -116 -45 -129 126 90 311 143 251 -66 -52 -190 -104 -82 4 -135 -97 -107 41
6286 41 80 246 -97 76 121 175 -44 -62 -117 127 133 160 170 -143 113 85 179 -308 186 -258 33 12 -155 -90 -27
6311 -27 -65 -332 -182 -190 -190 82 -37 -66 -14 -40 -142 -172 -92 296 202 -189 69 -144 -98 64 196 225 21 -132 96
6336I6k8q4o5J3J88j62L5R3n4k41K86j49m6K16m06K57L19k14p7MRn5m5J90j98
6361a18j30M08j53L7j41J81r0n7M6j44K26J07l6k42K94j89k6r0Ql19M86r8k3o8
6385a31N8K53n74L02K08k66N8N8k20K19o0K02N3P4j89o3l9l3N2j05N3L11k95L22
6409B48j25k24J04P6k54N71n58K78N6l9k46kK53n6j69N3R1l4K5pr8J19j05k6m2
6434a11J13J6k12K20mL1j07L25l74p1K16P8M5j87J17J0L3m4j68J18r6j75N35n54
6458b46L78j99J64J21k5j34o2M5l0r1Kj2J49Oj50O5M9j15o0O8j80L32j91K73j64
6483gL5J0O3j63PJ9J51n4N5n7o9r9K43j17k8j39R6K89k55N5k76K24J9j34K32k05
6509a05j23P3J21k96N73j42o3J8J0k10p1Q1JJ27q4L46k67k55L87j86K9P2J02l98
$$ plain form
6336 96 68 -16 -81 -68 120 -42 -7 86 32 -209 77 -72 -118 98 -308 -51 268 54 -23 -19 -10 -65 -110 80 -118
6361 -118 -248 160 7 44 -97 84 -6 -63 -17 -161 65 172 136 -106 188 -1 -27 -117 -109 -428 58 -40 -63 -131
6385 -131 -73 180 -394 -92 116 -150 -92 -34 -254 -35 -95 107 160 234 45 -18 -57 -90 -38 -143 -90 221 -74 248
6409 248 123 -101 3 79 -175 396 -162 116 172 133 -113 -115 138 82 -87 -34 57 23 48 41 -57 62 -43 -69 -111
6434 -111 2 18 -194 26 22 53 -54 271 -103 -174 42 120 165 -22 95 105 138 94 -74 44 -52 -227 308 -246
6458 -246 132 -67 97 218 193 59 -3 42 12 -79 -77 -89 60 66 -84 -19 30 -85 -145 -77 -257 75 -116 157 -7
6483 -7 28 38 101 -62 -55 -36 115 61 116 59 -10 -109 134 17 -11 -150 -54 235 -20 35 -241 -17 2 -132 100 -105
6509 -105 -228 -155 -34 -330 243 101 38 56 66 -144 -215 -134 -133 -6 -90 256 -11 -266 121 -65 -36 36 138 -260
6533b60J89lJ80j21p5J31K5N9k54J33j4%j85K40J15j91j36K15P5l25J06J33l14
6556b77L43m3P0J23M8j59r3r4L48m11O1j3r3J82j53K27j46J80k0k8Q4J64m16K34
6580A18j42J04Q0k1o4j46N9K6J26j31j10J01q6J03L5j04m3Q2j31o8J86P2q4k22
6604b60K74m9K18l15L11k98R3J12j3k4K1j07O1mj2N2j90K86j34J53j7j32j55j7
6628a46j51K03k27J24M8K38l21K98p5M9K71m09J75k08j03M38k3j06L8J88Rj43
6650A67m5j94J25J2J0J56L6jl18l05K74J90p9M0l6J07j16L33m94J67qJ2k28K03
6674Ho1J4j30J7L07j36L4J93p4K0j87j99J11N69q90K76M01j69j76P9M37l36j88
6697h0J37K38l32k01J95j48K51J09l94K03L22k43Q3j79l6J46k9%m1l7J79J0l3
$$ plain form
6533 -260 -71 -74 106 -15 -90 41 66 125 -129 4 -10 -10 -195 45 160 -31 -167 48 123 -202 -96 37 -277
6556 -277 66 23 93 216 264 105 12 -82 266 -145 -84 -97 -190 -8 -161 66 -80 100 80 52 136 300 -116 118
6580 118 -24 80 160 139 75 -71 -12 14 140 9 -101 0 -86 17 52 -52 -95 -13 -144 -212 -26 46 -38 -260
6604 -260 14 -35 183 -132 179 -119 -26 86 73 49 70 -37 24 20 8 60 -130 156 22 175 158 26 -129 -146
6628 -146 -297 -94 -321 -197 -149 89 -232 66 -9 40 311 -98 77 -131 -234 204 181 75 113 301 310 167
6650 167 122 -72 53 65 75 231 267 266 -52 -357 -83 107 28 68 32 139 23 356 -138 29 21 33 -195 8
6674 8 -53 -39 -169 -152 155 19 53 246 172 192 5 -194 -83 486 -404 -128 273 104 -72 7 444 108 -80
6697 -80 57 295 -37 -238 -43 -191 60 169 -225 -22 300 57 140 -39 -75 71 42 42 1 -36 143 153 120
6720A20R4m64L81k14R8K19j83r4k0J93Lj69K10j30j6nl1J53j25l2M2J04j03L05
6744C36l63K5o6m2M4L7J45J27l02P2Mq5K32k14L22l82K00j35J85l90L98j92K07
6767A63k31j46J94J70j58Rj56K52k91J30L2j92L13K42m19PjQ2j4J3NO9m2J0k24
6792a83J65k63K63r7M1J1O7k7p4K22k58J26J9j92O8K63o2j39j20K39j44o3M4K17
6816A23k77M0P0o1K14J40j16ok3k8pJ86j82j68N5j09O5j25K08j12O5J31R0j50
6840B3N2o4o1j09r4J27J27np1J65Q0k36r9J48Q7m7O1j23k00M58k52K70k08k82
6864b53K32k04J68o8J66L7j16K2NO9Q3K0k26N5K01l4k00J51J27j66r8K54l65J41
6888AM0J21m0l0l69J42l9K04J03o5m2J10k30R7J90m6J4k85K00j21j65K86j64J06
$$ plain form
6720 120 214 -250 131 -83 15 234 51 -43 -63 130 133 -36 174 44 28 23 -8 145 20 -12 30 134 31 336
6744 336 -27 -2 -68 -110 -66 -29 116 243 -59 13 17 -68 164 -50 272 -110 90 -45 140 -250 148 -44 163
6767 163 -68 -214 -20 150 -8 1 -155 97 -194 -64 -32 -224 89 331 -88 -81 -82 0 -14 -1 4 73 31 41 -183
6792 -183 -18 -281 -18 -115 -74 -63 4 -23 -97 125 -133 -7 12 -180 -112 151 89 -50 -170 69 -75 -138 -94 123
6816 123 -154 -114 -44 -105 109 249 133 127 104 76 69 255 73 -95 -40 -149 -84 -209 -1 -113 -48 83 173 23
6840 23 75 11 -50 -159 -253 -126 1 -4 -75 90 170 -66 -165 -17 70 23 84 -39 -239 219 -33 237 29 -253
6864 -253 -21 -225 -57 -125 41 78 -38 -16 -11 58 141 161 -65 -10 191 157 -43 108 235 69 -29 225 -140 1
6888 1 41 162 122 92 -277 -135 -174 30 133 68 26 136 -94 3 193 147 161 -124 76 -45 -210 76 -88 18
6912A8k1J88j62j33j24L95k63K39Pk67J80N9j32J78j90K73k38j61K41q5J12j81
6934f7N4J51m5J26j71N8n7J08q6k6r5J46q1p5j23K56p5j09K18R8j45j32j00K25
6958E3q8j39K21J89k47J22j40K66j79N1j42J3Q5J84l36N7K1k62K60k29K29N5J04
6981A48j48k5J21L3L0j55j6O4nJ27l57M42m79K28K05l5m64K40K17j28J86k00R7
7004A26l8k39O0J27m1%Q6q2kJ48k08P3n2K56j84O2Mn7l7P7q3k5j2K5J8j02L68
7031B68k00j26J92k67J11j69J67L2J8k5M0n9m2J5q0K47j90N5J5k38J39J69M8J27
7055B47l71K76k53K63mj83P3j46k0j11L33k79l0K63k28M9l1J80j91L90m09O4j47
7078b65J13K78j66R1m6n9j14M92n23L15j37K43k40q5K40o0k02K75j94j39J81k4
$$ plain form
6912 18 -3 185 23 -110 -234 161 -102 137 144 -123 57 116 -16 162 -28 245 7 -154 87 2 114 -67
6934 -67 -13 138 93 219 48 106 49 157 71 45 -50 96 15 -60 -183 73 -2 -111 107 205 60 -72 -172 53
6958 53 -35 -174 47 236 -11 111 -29 237 58 109 -33 -20 65 249 -87 -30 -9 -271 -11 -240 -11 44 148
6981 148 0 -25 96 129 159 4 -12 52 47 174 -183 259 -220 8 213 178 -286 -46 171 43 229 29 126
7004 126 88 -151 -91 36 -5 -5 81 -1 -3 145 -63 10 -42 214 30 92 96 39 2 79 -4 -29 -41 -16 2 -100 268
7031 268 68 -58 134 -133 -22 -191 -24 8 26 1 41 -18 -60 -45 -125 122 -68 -13 2 -236 -97 72 120 247
7055 247 -124 152 -101 162 158 -25 48 -98 -118 -229 104 -175 -205 58 -170 -121 -152 28 -163 227 -182 -118 -265
7078 -265 -152 126 -40 51 5 -54 -168 324 -199 116 -21 222 -18 -103 137 77 -125 150 -44 -183 -2 -26
7100b6jr7Q9j05L14j41jj95J65J62r2j43N4l09K80Q2R2j91J16nR0r9k76J13K43
7125A19l00p3L12j50J04k1k13L86k9q9r1J06n4Kk36K84P2k98K19k01Q4KJ84K7
7149A46r6l72L80J46j79l6j19K21K00j43j94j31K33kj78Q5K83m04Q0J42jo7k07
7172b13L00O5l16J37J06j56J08m6k47K95k68M10j10l84K85j30K87k52J88j1J56
7193B04k05J2p3L6j65R7K00J6l72L40n1JP1n2j69J72j69K20k40J94Pj64L55k57
7217HP8O7j2j56K9N5j3jK00l70K23J08k22o0R7n4K4M8m9l8K33m2j86N4P9m26M08
7244H2M8j21j96J64P7j0ol7j65R7J19J5Oj71K98k40PJ5M3QR0j30m2p5K31P9k99
7271a13K18J3j13L8l3m00K16J41K61k19j24k9J99k77J74p2J70o5r8L34P4l88K33
$$ plain form
7100 -26 -27 -124 -35 -140 174 33 32 -163 2 164 72 -71 -17 -326 -46 36 128 -63 53 48 138 39 -237 -124 119
7125 119 -181 -254 58 -92 12 -9 -222 164 135 46 -45 61 7 9 -227 57 129 -169 50 -151 -67 -65 119 146
7149 146 50 -322 58 204 25 -11 -130 91 291 148 -46 -177 56 54 -124 -39 244 -160 -80 62 61 -6 -213
7172 -213 87 152 -164 -27 79 -77 31 -15 -262 33 -235 175 65 -319 -34 -164 123 -129 59 48 204
7193 204 -1 11 -62 -26 -191 -94 106 122 -250 90 39 40 111 59 -110 62 -107 113 -127 67 74 -90 265 8
7217 8 86 153 141 -15 14 69 56 55 255 -115 108 216 -6 -66 31 -23 1 49 0 -38 195 153 -33 21 100 -326 82
7244 82 130 9 -187 -23 54 44 38 1 -164 -67 52 67 73 -98 200 -40 -33 -18 25 33 123 -7 -49 -124 107 186 -113
7271 -113 105 118 5 43 10 -390 -174 -33 228 9 -115 -144 55 -222 -48 -120 50 -15 -113 221 295 -93 140
7294A40m5n2o8J85L1kk88j05J86M37n69K40j50r8K62k17J94l46K53k59K04K26
7316A59l23N4J57L9j45J87Qn8j59j3J69j94K23l43J85j25K25j77J63n7j9j71K14
7339aj66L50l53J40pr6L11j16J60j96lL9k47K09M1N5r5N4R9k41J45l1K5L5k11
7364a00J29m1M4j81o3M28l50K4mpJ29j3K92k10j98M17l85J02O9l21K00j02L4K90
7388A83o1N7j61M1j13J10L5k40m2J13K34k8N9k68J72nj00K04k69j7J46M8l3p5
7412a0k10J91M1j07Q3J71r0O5J03j86m4o7K69k68n5P4L0qn8O7P7Rj27K81l94M54
7438B91m33Q0J28q3j50K34q8j17K21q4n8r5J38j31J19R6j87Q4P6j1Lp2q4J80o8
7463a1L3j43j10K17j8j5Nj38J50J2k14L13M7k25J0M6M6r5J76L5k81K63k56M13
$$ plain form
7294 140 95 43 -25 160 191 189 -99 -204 -18 419 -150 90 -60 -158 104 -113 81 -265 -12 -271 -67 159
7316 159 -164 -110 47 86 -59 128 136 78 -81 -94 75 -119 104 -239 -54 -179 46 -131 32 -25 -44 -215 -1
7339 -1 -167 183 -170 -30 -37 -133 178 62 222 26 23 62 -185 24 65 120 25 79 178 -63 82 51 76 111 -100
7364 -100 29 -12 32 -149 -212 216 -134 -110 -114 -121 8 -5 287 77 -121 296 -89 13 82 -239 -39 -141 -107 183
7388 183 122 179 18 59 -54 56 91 -149 -191 -78 156 128 187 -81 91 86 -14 190 -79 -96 50 98 65 -10
7412 -10 -220 -29 12 -95 -12 159 69 134 237 51 7 -60 209 -59 -114 -40 -10 -18 -76 -9 68 77 -50 231 -163 291
7438 291 -142 -62 66 -17 -167 67 -21 -138 83 -1 -59 -154 -16 -147 -28 68 -119 -35 41 30 33 -39 -123 57 -11
7463 -11 22 -121 -231 -14 -32 -47 -42 -180 -30 -18 -232 81 128 -97 -87 -41 5 -90 86 121 -160 103 -153 260
7487B60o6k18OK05mm88N04l40J95n3J25j86J35l6l1o9l0m4Q6j2K0k00M36k45J09
7512E9j34J10q8l5J14%J15n06J80J12J82m72K80L30k18p4k12L57k80J89J27j49
7534a3k47L27l53J49K44j57j08K51m7l1Q5j54k9J19q5O7J8j25Rj3J16j15K48O5
7558B21m8l67J63j1q0M1P4k2l5NJ28p8J98k53J70J0l3k7L3N5j2k8m9qk91K05J90
7585A51j03k6k22K39j44Q2R0k9J71j64l3Nj79l0J05J92j74m2pJ08m7J24N7k13
7609h9k4J9M0J24r7J1L93k64n58L09R4L7j64K1J44L6r4K06j92j23J35O0J38j98
7633c6J89o5k6rr6n9K90k53n4M5m5K6J19J36j13j94M4K47k51k7L17r8j47L44j35
7658A49j41j93M05j51j10J85m17K37J62l22L67j65O8k74K22j9k29L38J0p2j47
$$ plain form
7487 260 194 -24 -18 187 183 -305 199 -141 54 1 126 -60 75 39 8 -61 -91 -135 -49 -61 -41 -241 195 -50 59
7512 59 -75 35 -53 -88 26 26 141 -365 -185 -73 109 -363 -83 247 29 -45 -257 100 -180 9 136 -13
7534 -13 -260 67 -286 -137 107 -50 -158 93 46 15 100 -54 -83 36 -49 18 36 -89 -80 -93 23 -92 156 221
7558 221 173 -194 -31 -42 -122 -81 -7 -29 -64 -59 69 -9 189 -64 106 116 83 56 89 144 132 104 55 47 -244 -39 151
7585 151 48 22 -200 39 -105 -23 67 38 209 45 12 17 -162 -192 -87 105 -69 -111 -118 -10 -57 67 124 -89
7609 -89 -113 -94 -54 70 -27 -16 377 113 -445 -136 -42 -5 -169 -148 -4 32 -62 144 -48 -171 -36 24 162 -36
7633 -36 153 88 62 53 -43 -102 188 -65 -119 -74 -119 -93 26 162 49 -145 -101 146 -105 -132 185 87 -60 284 149
7658 149 8 -185 220 69 -41 144 -273 -36 126 -196 171 6 74 -200 22 3 -226 112 122 50 -97
7679i7k91M07K4N8j17J23ol83J80K8K12j91P9K98l25l6p5J85j0r5kO8o3O3j03
7704f9j25J51Q8M7j80J6K98l53P5L4oO5p9K5j21J73j30K0J30k19j02J91J17mj54
7729a12k07K69K41j38j81l2K22j39J68j54n6P5Q0q2%KJ2R5lk9p9J26k42j00J1
7754b53J81K58k37K03j15P6n3j8l8J7j74K64k62L05l36M16j66k39L27k60J11p
7776@r1J38J56r1l0k97L7J06J31J42j64L2j85LL11j58l9K9L8p2N4k28J6K36l67
7801b93M96k3p8l12J66p4Q1q2P8J96m2j31J93j81K4J23Q2j03j8j63p8o6L25J23
7825B43p0m90L78q4rJ29l4j41J09j04J45k27J34j07j39K22m1L9J0J52l13J62p4
7848a10M01k56N4l7j49K98m77L68P0k46LK0k9J4p2m3q3K13K25j05q6j46J59K5
$$ plain form
7679 -97 -388 19 43 101 -16 107 101 -282 -102 -74 138 -53 26 324 -1 -37 -112 73 63 -32 -34 34 -29 34 -69
7704 -69 -194 -43 45 92 -88 -72 226 -127 -52 -18 -24 41 -38 -13 -134 39 -91 -71 59 -160 -262 -71 46 42 -112
7729 -112 -319 -50 191 53 -128 -160 62 -77 91 -63 -119 -44 36 -46 -46 -44 -32 63 60 31 -48 78 -164 -264 -253
7754 -253 -72 186 -51 152 37 113 60 42 4 21 -153 111 -151 154 -182 234 68 -171 156 -104 7 0
7776 0 -91 47 203 112 82 -215 -178 -72 59 201 37 69 -116 -113 198 40 1 30 68 -4 50 -178 -162 74 -293
7801 -293 203 180 102 -210 -44 -118 -37 -119 -41 155 113 -18 175 -6 18 141 223 120 102 -61 -139 -205 120 243
7825 243 173 -317 61 -23 -32 97 63 -78 31 -73 72 -155 -21 -128 -267 -45 -86 -47 -37 115 -198 -36 -110
7848 -110 291 35 89 52 -97 201 -276 92 162 -84 -81 -61 -90 -76 -148 -191 -274 -61 164 59 -27 -173 -14 11
7872A1J5J8L4K7J4j45J07j65O0K04k31K49j04K57k63j47K02k74M16k06L2o6l9
7895Fj63J62q4L4K07k86J10r2N3m0J24m19L85n8J52J53k50R7j68J63q9j8J60l26
7919a87K09J99m20K43m3K8J16l23J7K99k02k8J60j19p7M09n45J19J64J91l18J31
7941B3j56R0l9J68j82K38j26M1k20J82r6j8J89j54Q0K85j81q8j03N8k50K60j45
7964a44L12l48J8K66j9j50k7K34q1q4j3j56L07k34J63k1r2J75j16J47r6J7j82
7987a24L29k32J48l57K18Q1N2j07m04M16k9J27k65N1J39j21R9o2P3r5j34K00L3
8010C6Q0j24k22P2J64m6l6M2J2m5O1J01p7K28m24K0J98j03o6q4K15R8j64n4J62
8035D4oO3J2l42L26k7j50K55k32q0j73L74j02J9n2j16oK46j88M8L3J89k84k9K06
$$ plain form
7872 11 26 44 78 105 119 -26 81 -84 -24 180 -51 198 94 351 88 -59 143 -131 285 79 111 45 6
7895 6 -157 5 -79 -45 162 -124 -14 -106 -53 -93 31 -388 -3 -61 91 244 -6 91 -77 86 -3 -21 139 -187
7919 -187 22 221 -199 44 1 29 145 -178 -161 138 -64 -92 68 -51 -128 281 -264 -145 19 210 -108 23
7941 23 -133 -43 -82 86 -96 142 16 57 -163 19 -77 -95 94 -60 20 305 124 36 -67 -9 -259 1 -144
7964 -144 168 -180 -162 104 85 -65 -92 142 61 -23 -36 -192 115 -119 44 23 -69 106 -10 137 41 58 -124
7987 -124 205 -27 121 -236 -18 63 115 8 -396 20 -9 118 -147 -96 43 -78 21 -41 32 -63 -197 3 36
8010 36 116 -8 -230 -158 6 -40 -76 -34 -22 -67 -6 95 18 246 -178 -158 40 -63 -129 -213 2 100 -64 -118 44
8035 44 38 101 113 -229 97 70 -80 175 -57 -137 -310 64 -38 -19 -71 -187 -193 53 -135 -87 -54 135 -149 -178 28
8060B8k1J28m6O3l71J37J47j72Jl0L88j47M6k04J61Jj37J68k88P5j66J38J21J0
8084C0m7k38K44Q5j47J41k54J68O8O0O1j88l7qK55mj73M29n01K2p8J60j36j26
8108b14J9K19J88j03k34K48k29m9K6Q1J72n8j29k6L23l57O1kmQ8P5Q2k28M0L0
8133A9q0m4qK13k47J34J07j80L7J43k33k0J61R3N1j63J39m3L0n9o9q5K1R7m3j19
8159a48R3J90j48J14q7J05j65j15J99O6k75L05k70K96k32k22L09o8q0J29j70L24
8181A50r0l7K7m22K75k34L22o6J66k46
$$ plain form
8060 28 7 135 89 152 -219 -82 65 -107 -106 -136 252 105 151 -53 108 109 -28 140 -148 -73 -239 -101 20 30
8084 30 -17 -255 -11 74 -73 68 -186 -18 50 110 171 -17 -54 -62 193 189 16 445 -56 -34 -112 48 -88 -214
8108 -214 -195 24 212 109 -125 123 -106 -155 -129 -48 124 66 -63 -89 234 -123 -62 -64 -68 20 95 177 -51 -11 19
8133 19 -61 -105 -113 100 -147 -13 94 -86 -49 94 -139 -159 2 95 146 -17 122 79 109 50 -19 -104 -83 14 -29 -148
8159 -148 -55 135 -13 101 14 119 -46 -161 38 104 -171 134 -136 160 -72 -294 15 -53 -133 -4 -174 150
8181 150 60 23 50 -372 -97 -331 -9 -75 91 -155
8191a55
$$ Imaginary data points
##PAGE= N=2
##DATA TABLE= (X++(I..I)), XYDATA
0@%%%%%%%%%%%%%qJ6j6J6k4L2m0M8n6O5p3Q8j04J20j39J62j86K13k44K77l12L52
35A87l97M48n02N60o25O97p77Q63r56J056j167J289j421J566j725J901k094K309
53A212k548K813l113L453l841M293m822N450o218P180q424J0100j2496J6228k2888
68a3621L8372j39023n1605K85851R666j43405k9192J63624J45750O5026j02600
79B28843j64947k3251J45320O5700p3085j27545j03166m3J28298M5090j29476
90h262j36713k5778K5791O0610N0097m4095q9305J2860R1957N7439R416j9767
102a5750m7470Q514Q8838N5261k7537l1520r403j010K5259L5239j0743m5124l3732
115i178j0964K3032L8523k2892p9810k8712M5469M5290R958k5405m4249k290O3664
$$ plain form
0 0 0 0 0 0 0 0 0 0 0 0 0 0 0 -8 8 -8 8 -16 16 -24 24 -32 33 -40 48 -56 64 -75 87 -99 114 -130 147 -165 187
35 187 -210 238 -264 296 -329 368 -409 454 -502 554 -613 676 -745 821 -904 997 -1097 1212
53 1212 -1336 1477 -1636 1817 -2024 2269 -2553 2897 -3321 3859 -4565 5535 -6961 9267 -13621
68 -13621 24751 -114272 -165877 119974 129640 -13765 -42957 120667 266417 331443 228843
79 228843 63896 40645 185965 251665 178580 51035 -52131 -52174 76124 121214 -8262
90 -8262 -144975 -170753 -144962 -84352 -34255 -78350 -167655 -154795 -62838 -5399 4017 -15750
102 -15750 -63220 -54706 34132 89393 61856 30336 20933 19923 45182 80421 69678 24554 -9178
115 -9178 -20142 2890 41413 18521 -61289 -90001 -44532 758 10716 -14689 -58938 -61228 2436
128B436N2360j9485m3999r103K2519L0542J7699j1661k4927r909P808J2575N081
141C1936j7752l2371j5025J4243J6432k564j0927r705o216J0638J9444p08j9071
154b1646j1931K584J4118K1340J0137j2299j0993R568J3248K932n460j3946j1422
167a3770J0796J9649L077o803m657k879L495Q430l548j7696o516R573Q161N061
181A2373M045m614o525J039M39n362l064n518j0227M59J3567M152q711l653j125
196a2725l472K347K757m750n79P362N796O079Q004r26m943M528O924l528n747
211G127O79K85R44L935n98n589l136l284m671l24K96n727n422J685M210J987K316
228e287J094j191K006N189K278m20M74j25K52K457K175j537j435L86m46r41j199
$$ plain form
128 2436 54796 35311 -8688 -17791 4728 35270 52969 41308 16381 6472 14280 26855 31936
141 31936 14184 -18187 -33212 -18969 -2537 -5101 -16028 -25733 -31949 -21311 -1867 -2575 -21646
154 -21646 -33577 -30993 -16875 4465 14602 2303 -8690 878 14126 17058 11598 -2348 -13770
167 -13770 -2974 16675 19752 12949 8292 5413 8908 17338 13790 -3906 -10422 -849 7312 12373
181 12373 16418 11804 5279 6318 6757 1395 -1669 -7187 -17414 -16955 -3388 764 -7947 -11600 -12725
196 -12725 -16197 -13850 -11093 -15843 -16422 -9060 -3264 2815 10819 9893 4950 9478 16402 12874 7127
211 7127 7806 8091 9035 12970 12372 6783 3647 363 -4308 -4632 -4336 -10063 -15485 -13800 -9590 -7603 -5287
228 -5287 -4193 -5384 -3378 1811 4089 3669 4143 4018 4270 6727 8902 7365 5930 6316 5870 4929 3730
245C730m150l812M02j424m453o33L362J829j82K520K266j317k632o98J246K296
261a650J153P8L371M178J196K76J056k087n645k573K93L17K6l63K34K050K028
278C938p82m228k351m87k070j260K635L329K326K344Q73q92r79k048l247j275
294d174M9j218K66L133K679K81R12J62j952j585o19r64R47L779J902q30K479M255
312I502p65l700j289j491l469k377n22J329J177m77n70J588J34l275k194J117
328e282m0j917P34L280L033J889J670Q84J43R61j19q58P48J3j046m42m91j496
346A664K25M73j431k466q59n65j912j402p14j147Q49K885K473J542K180J357k87
363B865K73P16j344N74J794K98o37J723J204j410k310j803k504k748k179k43J656
$$ plain form
245 3730 -420 -4232 -3830 -5254 -9707 -10340 -6978 -5149 -5331 -2811 -545 -1862 -4494 -5192 -3946 -1650
261 -1650 -497 -419 2952 7130 8326 8602 9658 7571 1926 -647 -354 -37 -11 -374 -140 1910 3938
278 3938 3156 -1072 -3423 -3910 -5980 -7240 -4605 -1276 1050 3394 4267 3375 2396 348 -2899 -4174
294 -4174 -4125 -5343 -5077 -1944 735 1016 1928 2090 138 -1447 -2066 -3030 -2083 1696 3598 2768 5247 9502
312 9502 8737 5037 3748 2257 -1212 -3589 -4111 -2782 -1605 -2082 -2652 -1064 -930 -4205 -6399 -5282
328 -5282 -5322 -7239 -6505 -3225 -192 1697 3367 4251 4394 5355 5236 4378 5126 5139 4093 3651 3160 1664
346 1664 1889 2362 931 -1535 -2394 -2959 -4871 -6273 -6987 -8134 -7285 -4400 -1927 -385 1795 3152 2865
363 2865 3138 3854 2510 3084 4878 5176 4539 6262 7466 6056 3746 1943 -561 -3309 -5488 -5731 -4075
380d075J814m61j040K061J568k050j458K068R44j140K66K752K912J449q59p13
396D038K40j54k272j916k62j059r99J490J809l95l40K57j103j395j030r17j38
413d146K216J356P80J964J961o76p10j29j750j729J95q38k14K546J067j186r03
430a96N07j761j582PJ51K31K247N94K71K301J560k646q41K238n02k703O17Q45
448A338q98l48L33p88L02R49j553j856P82q79k703J993K467q93l85K060M94o5
466C50J245O57j016j27J4j171R32K053k64l36R80r5j733r00j538k103p95K87k87
485c847Q72J458P55o21j08Q46O90n47r43Q89J472N35R75J913P48k2m46k018j875
504G26p41j839k109J235J746j746k71K479p0k109k21j21o56M36N22K75K507K534
$$ plain form
380 -4075 -2261 -2722 -3762 -1701 -133 -2183 -3641 -1573 -629 -1769 -1503 1249 4161 5610 4751 4038
396 4038 4278 4124 1852 -64 -326 -1385 -2384 -894 915 520 180 437 -666 -2061 -3091 -4008 -4146
413 -4146 -1930 -574 206 2170 4131 3455 2745 2616 866 -863 -668 -1506 -1720 826 1893 707 -196
430 -196 311 -1450 -3032 -3025 -2874 -2643 -396 198 469 2770 4330 1684 843 3081 2579 -124 493 1338
448 1338 440 92 425 -363 -61 888 -665 -2521 -1739 -2618 -5321 -3328 -861 -1754 -2139 -79 415 350
466 350 1595 2252 1236 1109 1123 -48 884 2937 2673 2337 3317 3222 1489 589 -949 -3052 -3847 -3560 -3847
485 -3847 -2975 -1517 -762 -1383 -1491 -645 45 -502 -1445 -556 916 1451 2426 4339 5087 5065 4619 2601 726
504 726 -15 -1854 -3963 -2728 -982 -2728 -2999 -520 -590 -2699 -2920 -3041 -3697 -3261 -2739 -2464 43 2577
522B577j30R40K489m14l181n71m02j390N39J271j41r4L37j181p22j72j519k149
540c913J72L60n69J099J595L48R66J104k04k27Q65j437j627R52J208M81J140M62
558B775j104N85k57k384j221J170r61j562N45J396J7R19J381l41q6r0j817l82
576a417J667j39j376J636K278p66o08J072q64k141p18J96p99P02K85q37O58J401
594B30K81R1R13j40j899m51R19m1Q4J448Q57l65M48N6j015j508K38p02j839R0
614b305O24l7k6J182K0k74K69p4p77K01J170m56N80K747Q03j920K97J440j834
633A630j036P09p53r45N19m61q62J042J17k678O3J011j096j080J553K29r12J360
651a590K572N04L39N48j258p75J712j16l89Q16M63j466M01J069q88j548r94j512
$$ plain form
522 2577 2447 3387 5876 5462 2281 1710 1308 -82 457 1728 1587 1493 1830 649 -73 -245 -1764 -3913
540 -3913 -3741 -3381 -3950 -2851 -1256 -908 58 1162 958 731 1596 159 -1468 -516 692 1173 2313 2775
558 2775 1671 2256 1999 -385 -1606 -436 -1397 -2959 -2414 -1018 -1001 -82 1299 958 872 782 -1035 -1417
576 -1417 250 111 -1265 371 2649 1883 1275 2347 1483 -658 -1376 -1180 -1979 -1277 -992 -1829 -1171 230
594 230 511 602 1515 1375 -524 -975 -56 -97 -13 1435 2292 1927 2375 2431 1416 -92 146 -556 -2395 -2305
614 -2305 -1681 -1718 -1744 -562 -542 -816 -547 -621 -1398 -1197 -27 -483 97 2844 3647 1727 2024 3464 1630
633 1630 594 1303 550 -395 124 -337 -1199 -157 -40 -2718 -2655 -1644 -2740 -3820 -2267 -2038 -2950 -1590
651 -1590 982 1486 1825 2373 1115 340 2052 1936 1547 2363 2826 1360 1761 2830 1942 394 -600 -2112
669b112j412O63L50m44L03R68N74Q83N14o33p62M54K96K17J292J140l8R62O20
688C835j185r16J06m31r85r10p03Q1L85j63n91J137J27j046q02N72L06m77M53
707a207N18R11O73N55O76K11l25j063p40L45j79r42J39M51J27j57j77L12r60m39
727a271k86m40J31N25N59Q29J343j89l59K66L37o11n60N2o57m94N35N71L05J69
747G55J43p87p69m53Q5n95M0J22R20J237O30j01N62N17q11q87K04J1o05K0O20
768H58M50k96l45l57l49r84j234p61L87L59L22R29R99K70l38K97M79m18J54j72
788B50n4L46R92N45O9J9o18j135r8k37l38o16m69n21M77N59o3J76R2j69j99m06
810a398K74Q1J74M99O20J140N24N6k88N01l71j110p00J19K1k67K89P96m27n83
$$ plain form
669 -2112 -3524 -2861 -2511 -2955 -2652 -1684 -1110 -227 287 -346 -1108 -654 -358 -141 1151 2291 2253 3215 3835
688 3835 2650 1734 1840 1409 424 -486 -1189 -1108 -723 -886 -1477 -340 -213 -1259 -2061 -1489 -1183 -1660 -1207
707 -1207 -689 222 895 1450 2126 2337 2012 949 209 554 375 -567 -428 23 150 -7 -184 128 -832 -1271
727 -1271 -1557 -1997 -1866 -1341 -782 47 1390 1201 842 1108 1445 834 274 326 -331 -825 -290 281 586 755
747 755 898 111 -658 -1111 -1026 -1621 -1581 -1459 -539 698 1328 1227 1789 2306 1495 608 812 823 218 238 858
768 858 1308 1012 667 310 -39 -1023 -2257 -3018 -2631 -2272 -1950 -1021 -22 248 -90 207 686 268 422 250
788 250 196 542 1534 2079 2148 2167 1549 414 316 79 -259 -875 -1344 -1865 -1388 -829 -892 -716 -624 -793 -992 -1398
810 -1398 -1124 -1043 -869 -370 250 1390 1914 1970 1682 2183 1812 702 2 121 142 -125 164 960 533 -50
830e0n33m61M65r08q25j54Q85Q90J30P39Q40n49k06K71l7p9m13O2J07P45O7K46
852A232Q0j65m87m08k27k56n48k80LK17J08N09K45K06j15J39r01j79k0J65J88
873d94L02M08J96L59j85R6j78l67q26j24N00N17J18N9M76j32k52m91j00K33n71
894d56l93L22P24K54l88N67l88n84k55k20K9K04j88k08N43O41l5O0J24J22n67
915i2k91j7L83O64K07K40J26l07j1J81m48o64m82k19M2j7P78l36m10N3K66m57
937h11j65M3j18j73K51P10N15L84K77j11k23N79m97j60L87om47k72O39j78j87
958D37J60k21n07m47m43o14J92PK6J9J017M01m19O71M02k53q46L86j49L52P12
979H83j7L01R0K25m43n51k97o41q46K04N87L8M39J14k48j53K00q7n53m37Q05m45
$$ plain form
830 -50 -583 -1044 -579 -1487 -2312 -2466 -1581 -691 -561 178 1018 469 263 534 497 418 5 67 174 919 986 1232
852 1232 1312 1147 660 252 25 -231 -779 -1059 -1056 -839 -731 -222 23 229 114 253 -648 -827 -847 -682 -494
873 -494 -192 216 412 771 586 682 504 137 -689 -813 -313 204 322 381 857 725 473 -18 -118 115 -456
894 -456 -849 -527 197 451 63 630 242 -342 -597 -817 -788 -584 -772 -980 -437 204 169 229 353 475 -92
915 -92 -383 -400 -17 647 854 1094 1220 913 902 1083 635 -29 -511 -730 -688 -705 73 -263 -673 -620 -354 -811
937 -811 -976 -933 -1051 -1224 -973 -263 252 636 913 802 579 1158 661 501 888 882 435 163 802 624 437
958 437 597 376 -131 -578 -1021 -1635 -1443 -1436 -1410 -1391 -374 27 -392 279 681 428 -418 -32 -181 171 883
979 883 866 1167 1257 1482 1039 488 191 -450 -1296 -1092 -505 -467 -28 86 -162 -315 -115 -202 -755 -1192 -387 -832
1001h32J00J073N44L3m4L51p61k14o6l44n00P80J41k05Q14L85r78o62M63j82r47
1022a051jM91j25M08M85J22J12O82o62n14K98l40n10k14N38N1K27M17o9m45j22
1043b22O8k58L92K54n81K54R7k5M81Q54k06n51j60l2j53J1o3j22n45JN25L24l17
1066B6l45o32J20m18J36M21L92n32M07O09L11M34l72k9l10J5l10M37M38J20J87
1087A105P8j18l66o84k84l08k46m11K97jJ3L76R3J1k43k5M1J62L8L26K12K81P95
1110A142J06L11J9l74o99k90K63j20k95n7j21l93L67K79o00o06J29l34l95P23
1130i45L72P3M70j07K1N07N71m06o42P62K77o55O12N30n89k73L76o18m35M14l04
1151A1r43L80L12m14j48R86k73q22O58L84o83j00O05j23k72P25K14k80M99R9o19
$$ plain form
1001 -832 -732 341 885 918 874 1225 464 250 184 -160 -660 120 261 56 870 1255 277 -385 78 -104 -1051
1022 -1051 -1052 -561 -686 -278 207 329 441 1123 461 -53 245 -95 -605 -819 -281 -230 -3 414 345 -100 -222
1043 -222 -154 -412 -20 234 -347 -93 4 -21 460 1314 1108 557 397 365 212 223 160 38 -507 -506 19 343 26
1066 26 -319 -951 -831 -1249 -1113 -692 -300 -832 -425 184 495 929 557 528 218 233 -77 360 798 918 1105
1087 1105 1183 1065 699 15 -269 -577 -823 -1234 -937 -938 -925 -549 -456 -445 -688 -713 -672 -510 -472 -146 66 347 1142
1110 1142 1248 1559 1578 1204 505 215 478 358 63 6 -115 -508 -141 138 -462 -1068 -939 -1273 -1668 -945
1130 -945 -573 -500 -30 -137 -116 391 962 556 -86 676 953 298 910 1440 851 578 954 336 -99 315 11
1151 11 -932 -552 -240 -654 -802 184 -89 -911 -253 131 -552 -652 -47 -170 -442 283 497 217 716 815 196
1172A96q4M60m39l51K11j08k63O30M00k98m22L03k76l17J02M5o12N65P52k32n
1193B57K71l10o32K74l1p89K57J31J2j57J017N28o23M1L07m67k46K75k02M47J46
1214E06j62J85N52n17n20K0O1l71o92M31J9J36J56p0J69K53k45k06j36J66k32
1235d97K2O46J92K20J26m3j61l8Q1n36J37M3q5K3P2m5L9l55l54O7l58M83p07j23
1259a151N34L41M7K41K15M59l79j58J44J22p1k15L52P0J61l27K64m4l39l88m7
1280a69j07l37k75J40K45L16j2k09J20M6J37J20l4j51j45JN77L86k37M30m93m1
1302C08K7k16o0j04l44K57J18Q3L48l13k8k81J15l39J05k62J63K89M6O6N41l31
1324A88l1L7m86k21L78j83K91O3N10j12l11O4K55k93l73lJ13L72k50M76O7J45
$$ plain form
1172 196 112 572 133 -218 -7 -115 -378 252 652 354 -68 235 -41 -358 -256 -211 -823 -258 494 262 257
1193 257 528 218 -414 -140 -171 -960 -703 -572 -560 -717 300 828 205 246 553 86 -160 115 -87 360 506
1214 506 344 529 1081 564 44 64 125 -246 -938 -507 -488 -352 -196 -266 -97 156 -89 -295 -431 -265 -497
1235 -497 -475 171 363 583 709 666 505 467 548 12 149 192 107 130 202 157 196 -159 -513 -446 -804 -321 -1028 -1151
1259 -1151 -617 -276 -229 12 227 686 307 149 293 415 344 129 481 551 712 385 649 605 266 -122 -169
1280 -169 -276 -613 -888 -748 -503 -187 -199 -408 -288 -242 -105 15 -19 -170 -315 -314 263 649 412 842 349 308
1302 308 335 119 59 -45 -389 -132 -14 69 417 104 76 -205 -90 -429 -324 -586 -423 -134 -88 -22 519 188
1324 188 157 194 -292 -513 -135 -318 -27 36 546 434 123 187 442 149 -224 -227 -114 258 8 484 551 696
1346F96k93m80L09Ln56l14N36k24j9j8L0J97r0q3K58l49k16M18r6L54K50J70R
1369D92J67j12L45k07l37m1L1J46l34l7K36l73k57K68l26K6l34m45K00J64N5L01
1391c72O6M00k38L56J6R2l14J6M54N7l8J93JJ20k74j24j72k43j05n01K2K29m6
1414d05j90QL24m4J57j99j74J24J64J11M47J61j43K43Q4j37k31Pk90j28q1k2L43
1437A29O4j47J60k3k26m02K36l29r8M87j04K16K96J74l16L23m73N5j17J02r5k63
1459c51N58m5q5K90J01l9l43k77pK39p8P1N2K04R0p1Q2L8k29l94K26j51j37R2
1483a64l4QP6oo8K1Rj44r7K53k58n2N36j31N70J96j58j33k28J25l05M88j26k71
1507A07k8K64k59LK93j85o66j73l4J15J81J03l14J14M53k8n1n1K28l72J57M88
$$ plain form
1346 696 403 -77 232 235 -321 -635 -99 -323 -342 -360 -330 -133 -223 -306 -48 -397 -613 -195 -291 63 313 483 492
1369 492 659 547 892 685 348 307 338 484 150 113 349 -24 -281 -13 -339 -313 -647 -1092 -892 -728 -673 -372
1391 -372 -306 94 -144 212 228 320 6 22 476 533 495 688 689 809 535 411 239 -4 -109 -610 -588 -359 -405
1414 -405 -595 -587 -263 -307 -150 -349 -523 -399 -235 -124 323 484 341 584 668 531 300 307 17 -111 -192 -214 129
1437 129 193 46 206 183 -43 -445 -209 -538 -636 -149 -253 -37 259 433 117 440 -33 22 -95 7 -88 -351
1459 -351 207 162 77 367 468 429 86 -191 -198 41 -37 34 86 290 380 309 391 429 200 -194 32 -119 -256 -164
1483 -164 -198 -190 -114 -120 -188 -167 -158 -302 -399 -146 -404 -456 80 -51 519 715 557 424 196 321 16 504 378 107
1507 107 79 343 84 87 380 195 -471 -644 -678 -563 -382 -279 -593 -479 -26 -54 -105 -156 72 -300 -143 345
1529C45k70K4N57M5k81L43K93o65l26J98m13m44N02k80j66L32J55k88l27M39j68
1550c95m38Q66m48l55O37L19L19r1M81n23j61M60j73k86J19L5k90J70K31l80m69
1571c72J98j07k10J3J10l12J27J69M8K76J92r1K58k11K67j49k86M71J83K6q7J82
1593F95k63m25J91j91l78L16j39j48K36k8mJ04k44K98j96m0J21J09k23L23k05
1614i1L21n3M03k57l73k13J74q6J35j65q8O0J76K01r9J04l63J54n4l0JJ72O3J49
1638B41j4J24j59j73L6j52J08j17j96L8K22j67J45N8l7j49k08K41j6J1K14J92
1660B42QK16MJ1R2k04j91k0j69K52k84p0K53j26K18k99R4k64k50Jk89J00K64K61
1684a50L62r8P0L8K45J45o85M67j56K40j10J44J1k65k2j53k57K87j74m7k05j06
$$ plain form
1529 345 75 99 656 701 420 763 1056 391 65 263 -150 -594 -92 -372 -538 -206 -51 -339 -666 -227 -395
1550 -395 -833 33 -415 -770 -133 186 505 414 895 372 211 671 498 212 331 366 76 246 477 97 -372
1571 -372 -174 -281 -491 -478 -368 -680 -553 -384 -336 -60 132 41 299 88 355 206 -80 391 574 600 513 695
1593 695 432 7 198 7 -371 -55 -194 -342 -106 -134 -138 -34 -278 20 -176 -216 -95 14 -209 114 -91
1614 -91 230 177 580 323 -50 -263 -89 -175 -40 -205 -293 -233 -57 144 45 149 -214 -60 -114 -144 -143 29 92 241
1638 241 227 351 192 19 55 -97 11 -106 -302 -264 -42 -209 -64 -6 -43 -192 -400 -159 -175 -164 50 242
1660 242 250 466 470 481 573 369 178 158 -11 241 -43 -113 140 14 232 -67 27 -237 -487 -486 -775 -675 -411 -150
1684 -150 212 114 184 222 467 612 -73 394 238 478 368 512 523 258 236 83 -174 113 -61 -108 -313 -419
1706d19j34R2M99l01K9K4M08l49k9J14P1J01J42pL68j02Q4k72q1k20j25J94Rj65
1730f9r2R2K53k88j14K57o4l58j12J39j16k7K19K33M09j50j78j0J56j95L1J15
1752A31k75J10K9N07m41J23J24k09ok94k8K88P0j26l8O4P2k03K25l9j11k11J46
1775i2J14k29j38J15O8J66k24J79OJ06k25K14j63K73O3j34L09k17Q8j69m1L35
1797D04j60l77R8J03j83q3N5J54l07Q7l8J66nj97J53j01J40j82K43J14K04o8r8
1820A22L5K55k10k9J17M9l24K06J76j72m56J09Q7m84J22K02k87K9p9O3L91j17
1842a95l4j04K22k15K97K03M23k25n8J42l17R7j83J55j79J99l45N9K08r4o2R5
1864H9l57N9j8j66J93J36j16m6lM12m0RP6p3J81l50M7K39l44L50k59J67m20M14
$$ plain form
1706 -419 -553 -461 38 -263 -234 -210 198 -151 -180 -66 5 106 248 241 609 507 591 319 238 18 -107 87 96 -69
1730 -69 -161 -69 184 -104 -218 39 -25 -383 -495 -356 -472 -499 -280 -47 362 212 34 24 180 -15 16 131
1752 131 -144 -34 -5 502 61 184 308 99 93 -201 -229 59 129 3 -35 29 101 -102 123 84 -27 -238 -92
1775 -92 22 -207 -345 -230 -162 4 -220 -41 -35 71 -154 60 -103 170 233 99 408 191 279 110 69 404
1797 404 244 -133 -35 68 -115 -198 -143 11 -296 -209 -247 -81 -86 -283 -130 -231 -91 -273 -30 84 288 220 122
1820 122 157 412 202 173 290 339 15 221 397 225 -231 -122 -35 -519 -397 -195 -482 -453 -532 -469 -78 -195
1842 -195 -229 -333 -111 -326 -29 174 597 372 314 456 139 236 53 208 29 228 -117 -58 150 56 -6 89
1864 89 -268 -209 -227 -393 -200 -64 -180 -226 -229 183 143 152 228 155 336 -14 33 272 -72 278 19 186 -234 180
1888A80l40K46j37j28l1O2n0M4M22k61M5O5k06o4r3K34Q1M8j47K04q8j49P6J49
1912A62m9j79k43r2N86l15J76J14l9J74K7K9m08O4K17l95K69j63M4J67k81L1j19
1935b23J80k38J6P1k72J89K04N9J06J28k19J36r1r5J78M36m3l17O3k42N21p8j96
1958B73k68j11R3l07lj17L09k87K70K72k85J63J68l84j36J71N5L1j05O07Rj14
1980C04j10J72j67k27K32Q5k16q0K21m10O2j7K54j48Pk16j27k03O03m27P6L43
2002A1L9J02O7p1j73J76k13J24q1j26K97L8m73J67K18J50k57k19Q9r4O1L00k2
2025A10k95J24j54K79j15r1K20j24P7l49L6M04J67n85M39R3j96j4R0j73j96J66
2047h7j00J71K59m8l13j21J41J14j29K02m6j06m0L17n0p5k79P2K15j74m1k72J28
$$ plain form
1888 180 -160 86 -51 -179 -210 -148 -198 -154 268 7 52 117 -89 -153 -246 -12 69 117 -30 174 86 -63 13 162
1912 162 113 -66 -309 -401 185 -130 46 160 121 295 322 351 -57 7 224 -171 98 -65 -21 146 -135 -104 -223
1935 -223 -43 -281 -265 -194 -466 -277 -73 -14 92 220 1 137 46 -49 129 565 522 205 268 26 547 469 273
1958 273 5 -106 -13 -320 -323 -440 -131 -418 -148 124 -161 2 170 -214 -350 -179 -124 -93 -198 409 418 304
1980 304 194 366 199 -28 204 289 73 -7 214 -196 -134 -151 103 -45 -38 -254 -381 -584 19 -408 -332 11
2002 11 50 152 219 148 -25 151 -62 62 -19 -145 152 190 -283 -116 102 252 -5 -224 -135 -229 -168 132 110
2025 110 -185 -61 -215 64 -51 -142 78 -46 31 -318 -282 122 289 -296 143 236 40 26 116 -57 -253 -87
2047 -87 -187 -16 243 195 -118 -239 -98 16 -113 89 43 -63 -103 214 164 89 -190 -118 97 -77 -118 -390 -262
2070b62J43j69R2K93r6RN6j04l0l0K82j51k8J91L4l2J08k9j86k41O9r4j17P1M8
2095a73m4R4L93m37l67K04R5q8O3K49j46J93M8K13k11M09j88j70J17N7R6l02Q7
2118A92l5p6q2p9L3l38K27j27K11K7k8l26J2J42J41L0l0K38j22J3k2N6J89j68
2142G8M7J25J38Nl78p8J7o0l6j1J30j30J37k59P2K9L0j4j04K28j03RK89J09k95
2167b5K48j15K89k44j91J66j55P3n4Q0j7L0J23j09K6q4p4N4j72j76l3L68l9l4
2191f5J5P1j36k2M6N3l07M36j83R8J56o20N74n6k65K08J97m02L90j76o7J36r7
2214a6K77K00j31k79q0K7J1j8k08J21L77j23l37kN1j24L97j56mk60J24Q8j32J70
2238b7J05Q3J50M3j75j75J03K55p2k13J21k06J11J35k20J1r9k95K58j03O7k5R4
$$ plain form
2070 -262 -119 -288 -196 97 1 10 66 -38 -68 -98 184 33 5 196 230 198 306 277 91 -150 -81 -175 -292 -221 -173
2095 -173 -217 -123 270 -167 -534 -330 -235 -323 -260 -11 -157 36 84 297 86 495 307 137 254 311 407 105 192
2118 192 157 81 -1 -80 -47 -385 -158 -285 -74 -47 -75 -401 -389 -247 -106 -76 -106 132 10 23 1 57 246 78
2142 78 125 250 388 393 15 -63 -46 -106 -142 -153 -23 -153 -16 -275 -203 -174 -144 -158 -262 -34 -137 -128 161 270 -25
2167 -25 223 108 397 153 -38 128 -27 46 -8 72 55 85 208 99 125 41 -33 21 -151 -327 -360 8 -31 -65
2191 -65 -50 21 -115 -137 -91 -38 -345 91 -92 6 162 -458 116 60 -205 3 200 -202 188 12 -55 81 -16
2214 -16 261 461 330 51 -29 -2 9 -9 -217 -96 281 158 -179 -181 -130 -254 143 -13 -17 -277 -153 -65 -197 -27
2238 -27 78 161 311 354 179 4 107 362 290 77 198 -8 103 238 18 29 -70 -365 -107 -210 -143 -168 -74
2261g4O5j4j4n6J35j78K34m78N17R6n9q7N4K21R5l08j96n3K77q0r1r1k75M59p1
2286B8j07M2k8j21k66K21M77k16l9R1Mkj3j35J01K08l31K17k09L23J25k19l3r9
2310A9J1j47p4J39k8J42j53L1J2j50Q9K42o65M99J07O8j16k03K73j22k6N5L8K73
2334C14K8l83K79k12q0Q9R3p1K45k00J14M5k35j40j8n2m4Q4n5M23n74M98l45K20
2358B3j44j03J76o4N5n0J35l72M01K18q0J20j97r0J01P3j53Q9j60K31j53P1J35
2381B62j86r4q3J07k40J6K42l04K6L00j29M7k1O3M2n3j33L29L6Qj18o5L05l49
2405HJ96k24O2m4J00j87J19l54L09j61J9O0j25O8R7k29J56P1k36K98p1J18j6P6
2429A10l04J86P5k5m9J43N0K04k19N2j44J3j83j45J54k6j28M7K09j48K20k27J22
$$ plain form
2261 -74 -9 -23 -37 -93 42 -136 98 -380 137 233 174 87 141 362 457 149 -47 -100 177 97 6 -85 -360 99 28
2286 28 -79 -37 -65 -186 -452 -231 246 30 -9 82 86 84 71 -64 37 245 -86 131 -78 245 370 151 118 19
2310 19 30 -117 -191 -52 -80 62 -91 -60 -48 -198 -109 133 -532 -33 74 142 26 -177 96 -26 -52 3 41 314
2334 314 342 -41 238 26 -54 35 128 57 302 102 216 261 26 -114 -132 -184 -228 -144 -199 224 -350 148 -197 23
2358 23 -121 -224 -48 -112 -57 -107 28 -344 57 275 195 315 118 28 129 202 49 138 -22 209 56 127 262
2381 262 76 -18 -101 6 -234 -218 24 -280 -254 46 -83 -36 -57 6 48 -5 -138 191 227 235 117 52 357 8
2405 8 204 -20 42 -2 98 -89 30 -324 -15 -176 -157 -97 -222 -154 -57 -286 -130 -59 -295 3 -68 50 34 110
2429 110 -194 -8 67 42 -7 136 186 390 171 223 79 92 -91 -236 -82 -108 -236 -189 20 -128 92 -135 -13
2452a3j62J17k1o2R6k43J13K29N2K32p7j16k43P8J61j02J2P9k17K71j19j05j42
2475a82L43qk08n7p4J18m3J60J79j93k60K01J01j95J51K04m90K32n5Q6P0R0l83
2498b13M17J61k11om32O38j49k77N4K72k33o7N0l13L39J3m93L97l72L99n6K6l3
2521h9L0J29j74J66k35K27J43n68K66R9J94l34L09j95lM2J64j86lP3J82m16K28
2544D9j89N0J44p5L4r2m5j28k48M84R9k54M19r0j17j15J76j04J95j72n5L65j72
2567A59j75K30k24k26K13j10J07J56j90j85j05L55L23o47P6J28J52q2K02j68J55
2588A44m3J81j59MJ49m10LK01J02m28K81N3K02l38Q9Q3ll66K2K63Jj73J97m3p7
2613f5K08k09K69p9k07R3j74O9JK00L8l6j07J44p2o6J03J41n10M91k03j92K61
$$ plain form
2452 -13 -175 -58 -79 -141 -45 -288 -175 54 106 338 261 145 -98 -20 141 39 51 130 -87 184 65 -40 -182
2475 -182 161 153 -55 -112 -186 -68 -111 49 228 35 -225 -24 77 -118 33 237 -253 -21 -76 10 80 170 -213
2498 -213 204 365 154 148 -284 354 205 -72 -18 254 21 -46 4 -309 30 43 -450 -53 -425 -26 -82 -56 -89
2521 -89 -59 70 -104 62 -173 54 197 -371 -105 -6 188 -146 163 -32 -35 7 171 -15 -18 55 237 -179 49
2544 49 -140 -90 54 -21 13 -79 -124 -252 -500 -16 83 -171 248 158 41 -74 102 -2 193 21 -34 331 159
2567 159 -16 214 -10 -236 -23 -133 -26 130 -60 -245 -350 5 328 -319 -243 -115 37 -45 157 -11 144
2588 144 101 282 123 127 276 -134 -131 70 172 -256 25 78 280 -58 31 114 111 -255 -233 30 31 -142 55 12 -65
2613 -65 143 -66 203 124 -83 10 -164 -95 -94 106 144 108 1 145 73 7 110 251 -259 232 29 -163 98
2636I8l03K84m6J46j13Lj26j80J22j91J68R3m7k4K33l04L57k74N4J12J44o9J2
2659A49j35K86l01J43k1j78m8l34M52r5K68j56n4p9O5K42k09J81l11J34j02OK61
2682A64m3j40k11q0L22L07n58L87Mj38K30Rj90l2K1J07k68K10Q6j43q2k24L49
2705H7k38m9J45n0J99n9K07j60l14N4M19k25o8J25p8M2j33K32J07M2k14j40O9
2728@Q8p3r2R5J62m7l66L04j13l18K46K51j07q3O2l0j35n2K06n1J50j31q7J08
2752a3K66j33J6q7M11l27j69K20k96J62j00N1M9j83O6J38k6j31L0j05J6R4qj41
2776b00L94m37J07J29p1j23K75n8j84J03j24K87j63K10j96P7K07j46Q2j14l6n3
2798c4M9j71K41j07l1N4K5N5k90J42RR3J5j12K96l6n8k66J40j18J98J18j1J0K
$$ plain form
2636 98 -205 79 33 179 66 69 -57 -237 -115 -306 -138 -45 -92 -116 117 -187 170 -104 -50 62 206 137 149
2659 149 14 300 -1 142 121 -57 -105 -439 13 -82 186 30 -24 -103 -38 204 -5 176 -135 -1 -103 -97 164
2682 164 121 -19 -230 -310 12 319 -239 148 152 14 244 253 63 31 52 159 -109 101 187 44 -38 -262 87
2705 87 -151 -200 -55 -105 94 35 242 82 -232 -178 241 16 -52 73 -5 37 -96 136 243 285 71 -69 0
2728 0 88 15 -77 18 180 133 -233 71 -42 -360 -114 137 30 -53 9 -21 -156 -208 -2 -53 97 -34 -121 -13
2752 -13 253 120 136 49 460 133 -36 184 -112 50 -50 1 50 -133 -67 71 45 -86 -56 -161 -145 -51 -59 -200
2776 -200 194 -243 -136 -7 -78 -201 74 16 -168 -65 -189 98 -65 145 -51 26 233 87 169 55 19 -34
2798 -34 15 -156 85 -22 -53 1 26 81 -209 -67 -58 35 50 -62 234 198 140 -126 14 -104 94 212 201 211 213
2823B13j98J97L6l78L09k95p1J79J25j95r4J91k34K39k61Q4R4q8M8k28K00J68
2845D1k62L92m33K97J76l41L25N6l96p3R3J93R3j79J64k52Q5J42r5o5j41K01j27
2868a06J86j66k5O6j00j14J48L6n2L57l59M0K8j24L51J6m6p4K94j61kp8rK2n5
2893G3l91N11k31j36J49m2P1j78J8j49N75k63o1J86m7M1k31O5J15l45K42k24N26
2916B74k42k5k08K66K40l8k97M0q1M9j11M4j35J75l67J03K63n8Q8k79K92p4j2
2939i3Q6J05j33J8J00j85L7K2O2K98j82j28J12K27k23p8k23K95k7p4l42L03p2
2962i5J29Q7k33QJ44M7k75Q1J71j89J51k13R1K85j4k07M3L8j93J56K57j90m7J21
2986A53j8l6j40j5K34k25L3k20K85j34jj93L6J95j17L0p3N3K12j00k15r9K44J18
$$ plain form
2823 213 15 212 248 -130 179 -116 -187 -8 117 -78 -172 19 -215 24 -237 -153 -59 -147 -99 -327 -127 41
2845 41 -221 171 -262 35 211 -130 195 251 -145 -218 -125 68 161 -18 146 -106 -21 121 26 -39 -180 21 -106
2868 -106 80 -86 -111 -45 -145 -259 -111 -75 -127 230 -129 -89 -61 -185 166 182 136 62 356 195 193 115 106 128 73
2893 73 -318 193 -38 -174 -25 -67 4 -174 -156 -305 270 7 -54 132 85 126 -105 -40 75 -270 -28 -252 274
2916 274 32 7 -201 65 305 267 -30 10 -71 -22 -133 -89 -224 -49 -416 -313 -50 -108 -20 -299 -7 -81 -93
2939 -93 -7 98 -35 -17 83 -102 -65 -43 19 317 135 7 119 346 123 45 -178 117 90 16 -326 -23 -95
2962 -95 34 121 -112 -104 40 87 -188 -107 64 -125 26 -187 -96 189 175 -32 11 49 -144 12 269 79 32 153
2986 153 135 99 -41 -56 178 -47 -14 -234 51 -83 -84 -277 -241 -46 -163 -133 -206 -153 59 -41 -256 -355 -111 7
3010GP4J08j96N8J78j32J64l88K45j6k4J07q0k31J35J80m15n6L65o1p4L7o7j22
3034b04J81j84K31J09J82k67j33Q9K25j34j82K40j08L59j54q9j29k10M24l35m6
3055a35L59l23P6j42K28k94J41J8k58K57J34j80Q3O6P8l08O5N08j02k84K02m9
3077A40Qk55J03K33J9j76J22j33k45O5j0l6J47J38R1l10J79km29J49J24l6l7J46
3101eO8o5j83J81J50R7j62n5m6J89m3j76Q3M4o3j32O5Q0j39J48O4j35n7J11Rk21
3127a93L13k42K07j57K4J50M6O0l03j3o5K89r5R4j09j48M19k13j09K3J94j92j39
3150a59J69M3P6j19j42L35j14l08J32j0J54l1j6k82J12J79q8p1P5J42j6P6o7j35
3174f5q9J33k8J3R2p5J3j22K37L3Nq4j74J73mj85J72n3p5k02J90J54j13j95J71
$$ plain form
3010 7 81 189 -7 51 229 97 261 -127 118 102 78 185 105 -126 9 189 -226 -282 83 22 -52 -15 -82 -204
3034 -204 -23 -207 24 133 315 48 -85 4 229 95 -87 153 45 404 250 161 32 -178 246 -89 -135
3055 -135 224 -99 -23 -165 63 -231 -90 -72 -330 -73 61 -119 -36 30 108 -200 -135 373 271 -13 189 140
3077 140 148 -107 -4 229 248 72 194 61 -184 -119 -129 -165 -18 120 211 -99 80 78 -351 -202 -78 -114 -151 -5
3101 -5 63 -2 -185 -4 146 243 81 26 -20 169 126 -50 33 77 14 -118 -53 27 -112 36 100 -35 -92 19 28 -193
3127 -193 120 -122 85 -72 -48 102 148 208 -95 -108 -173 116 21 115 6 -142 277 64 -45 -22 172 -20 -159
3150 -159 10 53 129 10 -132 203 89 -219 -87 -97 57 26 10 -272 -160 19 -69 -140 -65 77 61 137 70 -65
3174 -65 -154 -21 -49 -36 56 -19 -6 -128 109 142 147 63 -111 62 58 -127 45 -8 -83 -285 -95 59 -54 -249 -78
3199g8M63n30K04r2K17o7r8k3q0n9K27o0m6j60M79m05M5K41r5k14K52j49j17K6
3223a19M4J44J00l74J59k22J99J69j75M3j74J20qJ5J00K1P1j25J10j84N5J60j67
3246c8J27k43J77Mj78N5J28p9j44K49l02K36L9k37n3K33p8J48j51K52o2k08J25
3269@k7q9P9J41l7N8j31j0K42k65K20o0k10n3L50j36l18J40N5m8o2J2J34k09J20
3294a04o0j70K86r3J69j07K0P0K07k7Ol59L10j10M1K04j82R8l67J35J37J14m76
3317b58O1L92l13j67L55j38m4J10m5q9J58p2n0L42p2p2Lk4k63J42m6K86k19K07
3341A84j67j17j8K18n0k6O6j72p4J14j5m9J66j03q5K11j47P7J63K3k2j97J40j33
3365a3qK19l51K44l7J4J19j11n3K17r1r1Q6k41K0k19R3J91k42J46J0j30J37J1
$$ plain form
3199 -78 385 -145 59 -33 184 117 19 -4 -84 -143 84 24 -22 -182 297 -108 -63 178 83 -131 121 -28 -145 -119
3223 -119 -75 69 169 -205 -46 -268 -69 100 -75 -32 -206 -86 -94 -79 21 42 113 -12 98 -86 -31 129 -38
3246 -38 89 -154 23 27 -151 -96 32 -47 -191 58 -244 -8 31 -206 -259 -26 -104 44 -107 145 83 -125 0
3269 0 -27 -116 -37 104 67 125 -6 -16 226 -39 181 121 -89 -142 208 72 -246 -106 -51 -99 -161 -149 -15 -224 -104
3294 -104 -164 -334 -48 -141 28 -79 -59 11 218 191 197 -162 148 38 79 283 101 199 -168 -33 104 218 -258
3317 -258 -197 195 -118 -285 70 -68 -112 -2 -47 -136 22 -50 -100 242 170 98 101 77 -186 -44 -90 196 -23 184
3341 184 17 -100 -118 100 50 24 90 -82 -156 -42 -57 -106 60 -43 -128 83 -64 13 176 199 177 -20 120 -13
3365 -13 -21 198 -153 91 54 68 187 76 23 240 149 58 144 -97 -77 -296 -203 -12 -254 -108 -98 -228 -91 -80
3389h0M07n82J37K04o8J15Jj92j06M20j05L18l34k0M7j09P5j23M6P5l12n4J94
3412d6J44K41n86P5J2M02m88L67j29K79m50K93M7l71L68K8j00R4j70j07KL1r5
3435a59K89J31l57L50l9o6J18l80J07L6K16k92j04J22Mmk20K03J41k83J35J43
3457I1q7j2J21qO3j07o8K57k62o7L17k09l7M4j08M6o1K54j77j67J36M9j24q3o6
3482b65M81l96K6J11P3j28j92L47P0k88J51J9j22J20q2J39J26p0m1q7J82k43K81
3505B12l27K23k12J24K2j16O0k34K19k4j61J84p1O2P6j26K2J55j17K82k26k37
3527b10K37j13k12L68J67R2r6k55j6J00p3J16o0n3K28j58L4m94N51k53J33j89
3549a56k9O7J96m40M42ok7j0r5R3j49L14N8j08m80M57m29K89K43k34J04j54j01
$$ plain form
3389 -80 327 -255 -118 86 18 133 134 -58 -164 256 151 469 135 115 162 53 128 5 51 126 -186 -240 -46
3412 -46 98 339 -247 -172 -160 242 -246 121 -8 271 -179 114 161 -210 158 186 86 180 10 -97 -95 -64 -159
3435 -159 130 261 -96 254 215 149 267 -113 -6 30 246 -46 -150 -28 -24 -28 -248 -45 96 -187 -52 91
3457 91 4 -8 113 105 168 61 -7 250 -12 -79 238 29 -8 36 -72 -26 -87 167 -10 -177 -41 8 -116 -199 -265
3482 -265 216 -180 -154 -43 30 -98 -290 57 127 -161 -10 9 -113 7 -75 64 190 120 79 -8 174 -69 212
3505 212 -115 108 -104 20 42 -74 -14 -248 -29 -53 -214 -30 -101 -39 37 -89 -67 88 -29 253 27 -210
3527 -210 27 -86 -298 70 237 329 233 -22 -38 62 -11 105 45 -8 220 62 96 -398 153 -100 33 -156
3549 -156 -185 -118 78 -362 80 74 47 37 -58 35 -114 200 258 150 -330 127 -302 -13 230 -4 100 -54 -155
3572a55J79j03L78l46K1J21k77j4j5J36N0l3J99l6j57L02l07m7M9j25K5L83j77
3595E1J29n3O5J9k36q0J49r3qJ41j80K6J16j11L3j05J16K7L1j06jJ20K6j01j18
3620a43J06M3J71k0j13j43M9Q1j31J03j8Q9J35j91n0J07m0m8j13K69k83L8j89
3643b91K73n7m9j14K28k6J96j61j31Q7n1K19j57K68k86JK8j6J43r5R1k29M22l63
3667g0J71K8k17J80j32j13K03J36l71L65J69m66k1k47M84J22k13j77p8L15j2p1
3689a5J08k07j19K52j75L52j59j80J42K33O1j93J05k82m5q3K85l05P0M76m42P5
3711d6O9K9n6j09K09J0l18m3L92l1n3jkK12j77J79l19J30j83mL11n7N4l77M17
3736B36k53K23l43m6K11k92L67j95m6L42k54M7L0o2j82J41M43k24J31k12J72m18
$$ plain form
3572 -155 24 -79 299 -47 -26 95 -182 -196 -211 -75 -25 -58 141 105 -52 250 -57 -104 -55 -180 -155 228 51
3595 51 180 127 192 211 -25 -105 44 -49 -57 84 -96 -70 46 -65 -32 -137 -21 6 37 -69 -70 50 76 -25 -143
3620 -143 -37 6 177 157 44 -99 -50 31 -100 3 -15 74 209 18 -32 75 35 -13 -126 143 -140 -102 -291
3643 -291 -18 -75 -124 -238 -10 -36 160 -1 -132 -45 -96 123 -34 234 -52 -51 -23 -39 104 9 100 -129 293 -70
3667 -70 101 129 -88 92 -40 -153 50 186 -185 180 349 -117 -138 -385 99 221 8 -169 -247 68 56 -15
3689 -15 93 -114 -233 19 -156 196 37 -143 -1 232 293 100 205 -77 -122 -205 80 -225 -155 321 -121 -46
3711 -46 23 52 -4 -113 96 106 -212 -255 137 106 53 52 50 262 85 264 -55 75 -108 -112 199 142 196 -181 236
3736 236 -17 206 -137 -183 28 -264 103 -92 -138 204 -50 -3 27 -35 -217 -76 367 143 274 62 234 -184
3758a84L30l15K71m5l07J14N7j1j3P9n5j81K31R6q4o9j9K04k55J41J7J04k5K2
3782A03Q4l92M17j80M7J26k4k49K21q5%m5JJ57k41K30l56N6k4J83j05l7J43k6
3806DJ20j87p4j63L69o8K98j38l0j20P7l2j41k0L4j13K83N6Q1k79K53k9l02r2
3830b13K10j3J10j52P1p8L5M9j41J76k58K23M7j0Q1m29J51L8K5K52k04K89j30
3853A29k44o9M26k07J71k35kN5J99k35J58k36j47J61j83N14k84k44J47J67j48
3874a07J44l2j04J77m03K37L9nO4o4j29J08J90R9j72J16j37l6L1O5j70K06l85
3897b68P4R1K36j13M30o01L68j80q0J51j38J83j30j22J12k3J94l16o1K53k00N15
3919C75m08K58j64k45M65j02m06J80mQ6k6j21K94j23j78L7K04k06n3J54K04n8
$$ plain form
3758 -184 146 -169 102 57 -250 -136 -79 -90 -103 -24 -79 -260 -29 67 -17 -86 -105 99 -156 -15 2 106 81 103
3782 103 187 -205 212 32 79 205 181 -68 153 68 68 23 24 181 -60 170 -186 -130 -154 29 -76 -113 30 4
3806 4 124 -63 -137 -300 69 1 299 161 131 11 88 56 -85 -105 -71 -184 99 155 236 -43 210 181 -121 -213
3830 -213 -3 -16 94 -58 13 -65 -30 19 -122 54 -204 19 66 56 137 -292 -141 -103 -78 174 -30 259 129
3853 129 -115 -184 242 35 206 -29 -31 24 223 -12 146 -90 -237 -76 -259 255 -29 -273 -126 41 -107
3874 -107 37 5 -99 78 -325 -88 -49 -54 10 -54 -183 -75 115 214 42 158 21 -15 16 81 -89 117 -268
3897 -268 -194 -103 133 20 450 -151 217 37 -43 108 -30 153 23 -99 13 -10 184 -132 -193 60 -140 375
3919 375 -33 225 61 -184 281 179 -227 -47 -51 35 9 -112 182 59 -119 -82 122 -84 -137 17 221 163
3941A63j44j12K40k20k53K85Q7R6k2n7PL2m0M2L3Pqm1j57j12K39j22k76L08L3
3966Hqo7J43L1l67O8q9M26k44J06n0J72K9l48J70M24k81k97K36j28J29P5l12K49
3990G5k23P9O3R5k04k33L53j35L9J8J01p7j72K29PK46j52o0j49N3QJ3Q8k0q6J2
4016c2R9j10k9K86l61O5L18r4j5m8j74K1L53k25j9J6J8j63r9J24J41k37M13l34
4040h6Q0k04J24O4j42K19J47j5j48Ok20R9p4J3k5K47m88L87k61M15Rl2k55R8j05
4065a47R5p8J08N1n2L5r0O3K65l01j3j6n9J70J41j33n9L18k13j1J32k25j45L15
4089A51Q9l73J38k07J92m4j11L88k02o7l2l7L0K30l01J64j22J79K57n37N0L58
4111A93k13L6j30K3J78k66J49J67j45J70l01K62k27j6K39N4Ql28J16p7J86P6k49
$$ plain form
3941 163 19 -93 147 -73 -326 -41 46 142 120 63 70 102 62 104 137 144 136 95 -62 -174 65 -57 -333 -25 8
3966 8 0 -67 76 107 -260 -192 -281 145 -99 7 -43 129 158 -190 -20 404 123 -174 62 -66 63 138 -174 75
3990 75 -148 -69 -6 89 -115 -348 5 -130 -91 -73 28 -49 -221 8 15 261 109 49 -100 -47 -39 -26 62 42 -44 -32
4016 -32 67 -43 -72 214 -147 -82 236 142 127 79 -95 -74 279 54 35 51 69 -94 -193 -69 72 -165 248 -86
4040 -86 -6 -210 -86 -22 -164 55 202 187 39 45 -175 -76 -150 -137 -162 85 -403 -16 -277 138 147 115 -140 -42 -147
4065 -147 -52 -130 -22 29 -23 12 -78 -15 250 -51 -64 -80 -139 31 172 39 -20 298 85 74 206 -19 -164 151
4089 151 240 -133 5 -202 -10 -54 -165 223 21 -46 -78 -115 -85 145 -156 8 -114 65 322 -215 -165 193
4111 193 -20 16 -114 -91 87 -179 -30 137 -8 162 -139 123 -104 -120 119 173 181 -147 -31 -108 78 154 -95
4134i5l8j18J79K00o5k09J20o4J62j67K01n4k96J48k24M12R7j77K4L6k57K43O4
4157A22J27k87R0k01K05kN5j15q8Q0l0O5k38J68Q4J81j97p3K93k74q1J29m3J35
4181A05Mj43J17j50O5j9J96m02J72L12j92j61K26j93k8l9L22j79j50K35q3J0q5
4204f0Q3j26MJ87j04J9J40J06m32L50k88O4j75M18l57R5J73j57Jo9Jr9M36k1j16
4229G3k42K68j24k78M5r5L38P1j06j79J73J88l80q8L37l6J39j55K07j75Q7r9n4
4252h5J19J05n8O7Km1j99J85l0k9J64k11j03J0j61K49M2r2J14j16k97K96K4mM3
4277fO9J44P2k16N4o7p2j52N7K66m3k37J67j64M8J29j66J20k65L73o3M6k52Q1
4301g7K8J05l55L46K2J07n00M52J83k08n1j86K56L8m04K15J74j1j01k58J62k8
$$ plain form
4134 -95 -133 -251 -72 128 63 -146 -26 -90 72 -95 106 52 -244 -96 -320 92 189 12 36 72 -185 58 122
4157 122 249 -38 52 -149 56 54 109 -6 -94 -14 -44 21 -217 -49 35 216 19 -54 239 -35 -116 13 -30 105
4181 105 109 -34 83 -67 -2 -21 175 -227 -55 257 65 -96 130 -63 -91 -130 192 13 -137 98 15 25 -60
4204 -60 23 -103 -99 88 -16 3 143 249 -183 167 -121 -57 -232 186 -171 -76 97 -60 -59 -128 -127 -226 210 189 73
4229 73 -169 99 -25 -303 -258 -353 -15 56 -50 -229 -56 132 -248 -336 1 -35 104 -51 156 -19 68 -31 -85
4252 -85 34 139 81 148 150 109 -90 95 65 36 200 -11 -114 -104 -265 -16 26 -66 48 -68 -365 -69 -45 -49 -6
4277 -6 63 207 279 63 117 50 -22 -174 -117 149 106 -131 36 -128 -80 49 -117 3 -262 111 48 94 -158 -77
4301 -77 -49 56 -299 47 69 176 -324 128 311 103 52 -134 122 160 -244 -29 145 134 33 -225 -63 -91
4323i1J55j80L30l96J05n2O1J48o2j2r9K84o7K12n33K82J95l13o5r0J25J77k59
4346a45K07k3j07J67K5k8j02l6j69M63k06j06O3n3K00k42K75j79J07K5k08j71
4368b43K38L58k77j56J67L6j16j11QK52k26J93n1m6M7K6oj61j0r2L66j24j36j66
4392b30Q4J3j7J08P7j48J83k01l1J64K41l24J51n1K8l20N66l35J22j34J29k11
4414a36J65K23j46n4j84J34J99J1j06R1m28K77N3j23j96L02n1k0Ln6j01K02M6
4437A05j42K47k61k4j1m7Q9j34J56j13jJ13J10o1O1J47m38L46j65J32r7L5j64
4460a17K27k00J88o3O5q8qK40q5k60J39j34M8L6j65K44k50M47l37j36K28K0p0
4483c1J04k3r5J05k25m9K70j89L37n82K39O9J46q1k4J04l9L43m41J69j12j0K73
$$ plain form
4323 -91 64 -116 214 -182 -77 -129 -68 80 18 6 -93 191 124 336 -197 85 280 -33 -98 -188 -63 114 -145
4346 -145 62 39 -68 99 124 96 -6 -42 -211 252 46 -60 3 -50 150 -92 183 4 111 136 -72 -243
4368 -243 -5 353 76 -80 87 123 7 -104 -96 156 -70 123 72 26 73 99 93 -68 -78 -170 196 72 -64 -230
4392 -230 -146 -133 -150 -42 35 -113 70 -131 -162 2 243 -81 70 19 47 -273 293 -42 80 -54 75 -136
4414 -136 29 252 106 52 -132 2 201 212 106 197 -231 46 99 -24 -220 82 31 11 14 -42 -143 59 105
4437 105 -37 210 -51 -75 -86 -133 -44 -178 -22 -135 -136 -23 87 26 87 234 -204 142 -23 109 12 47 -117
4460 -117 110 -90 98 35 100 12 4 244 159 -101 38 -96 -48 -12 -177 67 -183 264 -73 -209 19 39 -31
4483 -31 73 50 -45 60 -165 -214 56 -133 204 -378 -139 -70 76 -5 -29 75 36 379 -62 107 -5 -15 258
4506B58k55O1j05j4J9J74k54K47N1r5j48j63J44j3J23J37k03Rq8J91j4j41K05
4529A26m2j72j12K17j72J06j51K62j32K38lo6k57J2NK15k28L01k49K2J2K05j42
4552eRp8k3J45k77L66p0j47n9J05o0N2nk56K12P9J02K02o8l66J21k64L33J88j32
4577A04j97J77j24j76J77r6J59R2L2k08r0J07o3J08n4r2N0K46k1q2J86j30L8k86
4601a43J73j4j15J00pk45J34m6K06j67K84j81N5j88L56k21j47L87k12m2J67j41
4623gr7N3J31k63J97Kq6K37r8k6q7Pm1J27k12J07J30p4o1p6J46j79J02P4P4j51
4649g1M3l4n0J59M3N5j64np7L79j92j33J01J8J36q8j7j07PK2o5Q2j25J50R2k06
4675d7k66J24L49j67k92L10m0J38k49M3R7M7k61L69O3j46j53N3p1L5p4Q1K70k93
$$ plain form
4506 258 3 64 -41 -55 -36 138 -116 131 182 87 -61 -224 -80 -93 30 167 -36 -27 -115 76 62 -79 126
4529 126 84 -88 -200 17 -155 -49 -200 62 -70 168 165 99 -158 -146 -141 74 -154 147 -102 -80 -68 137 -5
4552 -5 4 -74 -97 48 -229 137 67 -80 -139 -34 -94 -42 -47 -303 -91 -12 90 292 224 -142 -21 -285 48 236 104
4577 104 -93 84 -40 -216 -39 -135 24 116 148 -60 -150 -43 -106 2 -52 -144 -94 152 131 49 235 105 143 -143
4601 -143 30 16 -99 1 -6 -251 -117 -163 43 -124 160 -21 34 -154 202 -19 -166 221 9 -33 134 -7
4623 -7 -104 -51 80 -183 14 16 -70 167 69 43 -44 -37 -78 49 -163 -56 74 0 -61 -137 9 -170 -68 6 80 -71
4649 -71 -28 -62 -112 47 90 145 -19 -24 -101 278 86 -47 54 72 208 120 103 -4 3 25 -40 42 -83 67 159 -47
4675 -47 -313 -189 160 -7 -299 11 -29 109 -140 -97 0 47 -214 155 218 72 -81 -28 -99 -64 -138 -57 213 -80
4699h0N0j0K22o8K7o4K4j96M11o14P6K8J28r7P0r5K91j20j09L66l85J10J66m5
4723H6l81K98J3j61K99k83L4k8o5J66l20L25j89R6j33J25K10J62l23J06P8J79
4745B94n78L23J10q6j09P0J29k03l9P1k2J55j93L14k35k0q2K61k37L98j74j11
4767C6J7P0j32m4K54l28L11j52L6P1j25L4j13J19j18L55l10L6m2o5J81l50K1M12
4791A74N7J16k62kn2o2LJ12j74P8k04K85nJ28l61P1j63M36N1m29J72J04n1K42
4815B64k96L8k22J75M5j37j18L58j05MR3j74M1K93l60pK56n9j06mn6J02Kj15K35
4840A47j20l46J20K55j26KJ57j99K47l28K29k17K70j52J28j6Q5k43R4J24m9J12
4862A74j44R4j61K12k01o2J27m9r7J83j22J72j31k8J58j66l4J86k01J3m5Q2K55
$$ plain form
4699 -80 -30 -40 182 114 141 77 101 -95 316 -298 -222 -194 -66 -163 -93 -188 103 -17 -126 240 -145 -35 131 86
4723 86 -295 3 16 -145 154 -129 -95 -123 -188 -22 -342 -17 -206 -110 -243 -118 92 254 -69 37 115 294
4745 294 -284 39 149 63 -46 24 153 -50 -89 -18 -40 115 -78 236 1 -19 -101 160 -77 321 147 36
4767 36 53 123 -9 -53 201 -127 184 32 68 139 14 48 -65 54 -64 291 -19 17 -25 -90 91 -259 -238 174
4791 174 231 347 85 83 31 -31 -28 84 -90 -12 -216 69 64 192 -169 -98 -261 175 226 -203 -31 73 22 264
4815 264 -32 6 -216 -41 4 -133 -251 107 2 6 99 -75 -34 259 -101 -108 148 89 -17 -21 -77 25 27 -88 147
4840 147 27 -319 -199 56 -70 -68 89 -110 137 -191 38 -179 91 -61 67 51 136 -107 -13 111 62 174
4862 174 30 124 -37 175 -26 -88 39 -10 -107 76 -46 126 -5 -33 125 -41 -75 111 -90 -77 -122 -40 215
4885B15j10j74M2L0j59K82k06K08J64j70l14N05l74J90k42J16k22K46o1J52k60
4906a42K0q5K80R7l06R7j61K33p1M5o1J73k14K61j6l38J11L3P8r1LMmO2j6L1j18
4933i5j46L15m11L55J32k47j23L73l05J99J28j56J47j32nJ84j46O3n7l6j02M85
4955D20j41j19j14k2P1RN3L6j98k31K73j73J46l26J87P2K9j03J09Q8M1k18KL63
4979B54J7j88k1j10J7N3j39R9K03k83O2J28l59L47kr5P5K00k32Q1o2J4j04r2K24
5004H7q3P6p0m13K75Q0K52l35N8o7K59k97L87k73J25k79K35k45K10j41K11l28
5026b76J24J66L6R2j00j33j52K97k21J52J44k09P9k5J0q7R2J77%k87L66m17R6
5049g6K71l48L25k52Q7R2j49J99j41K5j07M4k00N1K7N0O3J40kk93J82q7L08l15
$$ plain form
4885 215 105 -69 -27 3 -156 126 -80 128 292 122 -192 313 -61 129 -113 3 -219 27 -34 118 -142
4906 -142 -122 -207 73 170 -136 -39 -200 33 -38 7 -54 119 -95 166 150 -188 -77 -44 34 -57 -54 -50 -54 8 -8 23 -95
4933 -95 -241 74 -337 18 150 -97 -220 153 -152 47 175 19 166 34 29 213 67 130 73 37 -65 420
4955 420 279 160 46 24 95 104 157 193 -5 -236 37 -136 10 -316 -129 -57 -28 -131 -22 66 107 -111 -109 254
4979 254 271 83 62 -48 -31 22 -117 -18 185 -98 -36 92 -267 80 78 -17 58 258 26 107 45 59 -45 -137 87
5004 87 4 80 10 -403 -128 -48 204 -131 -73 -140 119 -178 209 -64 61 -218 17 -228 -18 -159 52 -276
5026 -276 -152 14 50 142 42 -91 -243 54 -167 -15 129 -80 -1 -26 -16 -103 -11 166 166 -121 245 -172 -76
5049 -76 195 -153 172 -80 7 99 -50 149 8 33 -74 -30 -230 -179 -152 -102 -39 101 99 -194 -12 -99 209 -106
5073a06J25o9K13n5M2k43j92J51J69q8J65O8k40O5o4j10K03J04j04j9m3n1J86
5096A07m3J12k19m0rK41k37K41j84O1q8J96j04K4J96k43M5L62m21j17K21k35J13
5119b1Q8L99n33L6N6R7l85K19J8R5P3o5j29L17k02j97K26m21M47l09J71N1k87
5142b56L98j56J0N3m9r0j17M49k31j60K89j44P1m32J51PL34l34kK49O4k9k84Q5
5166a24K61L6k08J28R2k00l5O2J20r4R1n3k03jr4J48J62K9k16J43Q7k30K57k36
5190g8lq4K06k8R2j63p7J67Q8m8k65J12K20k76J37L2r1K1J37l18J54m9J48n3j92
5215b11K84%J02p2j93L66l90M36k07o4l8k09LK61J57l04J02K98m98O9J13J7j74
5238a52L66k90K3J79L5k48M33J2k48k13J32p6KN7j1k4Q4j43L25k28l2J79p9jk88
$$ plain form
5073 -106 19 -50 163 108 150 -93 -285 -134 35 -53 112 180 -60 5 -59 -169 34 138 34 15 -28 -79 107
5096 107 64 176 -43 -83 -92 149 -88 153 -31 30 -58 138 34 58 254 11 56 418 -3 -120 101 -134 -21
5119 -21 67 466 -67 -31 25 122 -263 -44 -26 69 142 77 -52 265 63 -134 92 -329 118 -191 -20 31 -256
5142 -256 142 -14 -4 49 0 -90 -207 242 11 -149 140 -4 67 -365 -214 -207 127 -207 -209 40 104 75 -209 -124
5166 -124 137 173 -35 93 185 -15 -50 12 132 38 129 76 -127 -128 -222 -74 88 117 -99 44 131 -99 158 -78
5190 -78 -81 -165 41 13 105 -58 -135 32 120 72 -193 -81 139 -137 0 32 -59 -38 99 -219 -65 -114 34 -19 -211
5215 -211 73 73 175 103 -90 276 -114 322 115 51 13 -196 -193 68 225 -79 23 321 -177 -108 5 22 -152
5238 -152 214 -76 -53 126 161 -87 346 358 110 -103 29 -47 -45 12 1 -23 61 -82 243 15 -17 162 83 82 -206
5263b06K46J1j68L22j19J25j89j66M80m71R4J44j62k13K72o4j36K93Q4k9l95J49
5285i8p9Q0J71j78L33k72j08L50j18l2k62L75l20M3M74l84n8n6K13J57k74J2m0
5308g1N3m3K11j49J2n7j12J77q2l5J53l25K52j48o0L69j31k22L0K14k71jJ26J98
5332H8O6k39l7m9L90k66l7R2j45J46j49J81J32j27j05o6p4L62l14NJ83J85l02
5355h0J52j55j48L26j87J46K22k27l52L20j74J99Q2j4k00j37L97j51k9q8J69r0
5377a9j28J06k29N21k61J41j08j75j7Q9p7L41Jj84J55k49K08j02k8p3J7P7o4J25
5401F7L0J37m54L68k28M3l6k2M5l9J47r9j54L47j11K48j26j03j7k49j6K70j08
5424f0j83M32j09j04J6O7l6k21J94r3J92j2j29K20j56M6l7j01K51j07o1j63j26
$$ plain form
5263 -206 40 51 -117 205 86 211 22 -144 336 -135 -41 103 -59 -272 0 -64 -200 93 177 148 -247 -98
5285 -98 -177 -97 74 -104 229 -43 -151 199 81 49 -213 162 -158 -115 359 -25 -83 -139 74 231 -43 -31 -71
5308 -71 -18 -61 150 1 13 -44 -156 21 -61 -96 57 -268 -16 -164 -224 145 14 -208 -178 36 -235 -236 -110 88
5332 88 154 -85 -122 -171 219 -47 -84 8 -137 9 -140 41 173 46 -59 -125 -199 163 -151 -146 37 222 -80
5355 -80 72 -83 -231 95 -92 54 276 49 -303 17 -157 42 124 110 -90 -227 170 19 -10 -98 71 -19
5377 -19 -147 -41 -270 251 -10 131 23 -152 -169 -80 -157 184 185 1 156 -93 115 13 -15 -88 -71 6 -58 67
5401 67 97 234 -220 148 -80 -37 -73 -95 -50 -89 58 -41 -195 152 41 289 163 60 43 -206 -222 48 -60
5424 -60 -243 189 80 -24 -8 59 23 -198 -4 -97 95 83 -46 174 18 64 27 -74 177 70 9 -154 -280
5447b80K27k6K21k41k30L68j4M3Kk9j22O7k5j71j8K25n0J7k20J30K50k01J04J26
5471A53j01K78l83J78q4o8oj10o5K27Q1Nj63M4j9K28k13K0K26k98J70o4j78J67
5495B5k23L49o4p4K09m25L14j27j6j28R1m5J39k08K42j9j19K25j1l01K23j00l4
5518g7j76L88k83j14R0K85m1N2L4j79R0j6K3K8J61j31k19Q3q6R5j16O8P1J26k28
5543g2j6O5L4j12J29pR2j18K02r9o4q1J17r8m00M48k27K56j0j97%L41j83j0Q1
5568G1R3q1Q1k23R2k11J54M0J1J37k68K5N1Mn6J50j18l57K61KN6NK47o9QJ27M9
5595B81J59l48O3P7k44J16p9Q8j23O2r7K13q0Or7j06J4K3P2mm09M16J67n12M02
5620F0P7r3J1r7k77M40qj52r9K73j70j2K02%k22R7l2R9J45j40p0j33Q5K90k91
$$ plain form
5447 -280 -53 -79 142 -99 -329 39 25 68 70 41 -81 -14 -39 -210 -228 -3 -53 -36 -256 -126 124 -77 27 153
5471 153 52 330 -53 125 41 -27 -33 -143 -208 19 100 105 -58 -14 -33 195 -18 2 228 -70 100 36 -142 25
5495 25 -198 151 87 13 222 -203 111 -16 -32 -160 -69 -114 25 -183 59 40 -79 146 135 -166 57 -43 -77
5518 -77 -253 135 -148 -262 -172 113 72 124 158 -21 69 53 76 104 265 134 -85 -2 -88 7 -109 -41 30 156 -72
5543 -72 -88 -23 11 -101 28 21 113 -5 197 98 34 -47 70 -28 -428 20 -207 49 39 -158 -158 183 0 -10 71
5568 71 164 83 164 -59 33 -178 -24 16 27 164 -104 -79 -28 -24 -80 70 -48 -405 -144 -142 -86 -81 166 97 105 232 281
5595 281 440 92 155 232 -12 104 25 113 -10 52 -45 168 88 94 -3 -109 -95 -72 0 -4 -413 3 170 -342 60
5620 60 137 44 55 -42 -319 121 113 -39 -138 135 -35 -47 155 155 -67 30 -2 97 242 102 32 -101 -16 274 -17
5645a7K71l94o9K26j45O0P3j46J47L01l82J77j35J64k2k80L43k65J41j38K58l34
5667a66K36k56K03J3o6K5k4K62l43J14j80K75j51J96j28J10j08J17j12k01J23
5688f1k6j64J63R2J92k99l3j6NL07k82Q1j77J85J72o4o8L1J78m46J78j16O1N4
5712e3m0J61k4J67j88J18k56J55M6k53K44k6l1k5J00M2k04M07l63k04K94J24n1
5735A40k78l1L22j83j04J48k34J61J41k71K80j99O0j24J87J21k58J03J14j06K34
5756B23k10N4k11J92n7kn8j1L56l70J41j49J5k6J61l31K83M8R1k01J66j4M5k21
5780h6K42j79k23R3K24j34J69j62N4q1L38k86k26K64k13PL64k10ok9J60j40K52
5803A92l01K28l08L75j45q9j7J13j28K2R4j95K25nK55n62L63L5r8k03J35p9J7
$$ plain form
5645 -17 254 -140 -209 17 -128 -68 5 -141 6 307 -75 102 -33 131 109 -171 172 -93 48 -90 168 -166
5667 -166 70 -186 17 30 -36 -11 -35 227 -116 -2 -182 93 -58 138 10 120 12 129 17 -184 -61
5688 -61 -87 -251 -88 4 196 -103 -136 -152 -147 160 -122 -41 -218 -33 139 75 7 38 216 -230 -52 -168 -107 -53
5712 -53 -93 68 44 211 23 141 -115 40 86 -167 77 51 20 -5 95 137 -67 340 -23 -227 67 191 140
5735 140 -138 -169 153 -30 -134 14 -220 -59 82 -189 91 -108 -48 -172 15 136 -122 -19 95 -11 223
5756 223 13 67 -144 48 -9 -11 -69 -80 276 -94 47 -102 -87 -113 48 -283 0 48 139 -62 104 90 135 -86
5780 -86 156 -23 -246 -153 71 -63 106 -56 -2 -83 255 -31 -257 7 -206 -199 165 -45 -51 -80 80 -60 192
5803 192 -109 119 -189 186 41 -48 -65 48 -80 -58 36 -159 66 61 316 -246 117 152 54 -149 -14 -93 -76
5826g6oL13l55L9J28n9k6J85l93L8L57J66l56k4K01k6k04j29K79q4M5j71J31q3
5850a10K47m5n9J58k91J66R5m27L25J34m19M45j77l28M14l28K4l2L18k38Q2J37
5872I1J27l19J53l1L7J24L1j90K8Ql9J10k02J58R6j57q7L09o30M10N5J2j00n7
5896f3L1J41%k43K09j60o6j64M94j11n2J26J2k64Q9l6L77j97n7k3L8j40J69j22
5920a2k6r0J29k96J68M55m21K09m6m4j18Rq7L8L76j68j96K85k69J61N5k73K24
5943F3k17K98k68O7J37k6J34k83o6K3j6L23k17J8J95k76j8j3J54n9K03k25R1p4
5967e2L8l5l4J09l5j2R6k65K12p5J99k63NK54J6Jj30jk63M94k89l6J61j80j60
5992b45K47J16k04M0R3l17K47K5J0j35L61k08j47mK43j98K1J85k69L30j49J03
$$ plain form
5826 -76 -82 231 -124 -85 43 -16 -42 143 -250 -212 145 311 -45 -69 132 106 -98 -227 52 -32 13 -158 -27 -110
5850 -110 137 92 33 191 -100 66 161 -266 59 193 -226 219 42 -286 128 -200 -176 -208 110 -128 -46 91
5872 91 218 -101 52 21 58 182 213 23 51 59 20 130 -72 86 182 25 -62 247 -383 27 82 94 -6 -63
5896 -63 -32 109 109 -134 75 -85 -151 -315 179 68 16 142 154 -110 -21 -57 320 123 66 43 81 -59 110 -12
5920 -12 -38 -128 1 -295 -127 328 -93 116 70 26 -92 -83 -170 -132 244 76 -120 165 -104 57 112 -161 63
5943 63 -154 144 -124 -57 80 54 188 -95 -161 -138 -154 169 -48 -30 165 -111 -129 -142 12 -47 156 -69 22 -52
5967 -52 -14 -49 -83 26 -9 -21 75 -190 22 -53 146 -117 -112 142 158 159 29 28 -235 259 -30 -66 95 -85 -245
5992 -245 2 118 -86 -46 47 -270 -23 2 12 -123 238 30 -117 -121 122 -76 -55 130 -139 191 42 145
6014A45Poj61j15K39J02k06M3R2l09Q1K72k60K42l05L00k36J21l12mN21l31J21
6037D1k27M00o9O4j52O1j38J79k97Q1J56j44J59l39K94n6q7J30j64J01n3J12j55
6060a03J33j9q9J71p3k0k1m11N21Q7n3R5o8o7m38M32L2J75j25j07J98k28M3K3
6084H8j68M68m87K38j71K24j47k04K56j2oo1J00j00J70k59n2L13l0j49O4n9j25
6107a09J11q0K35j20Jk13R4J73K5j28J22k00J78k94L31R5m01L49m16K10K39j61
6129D1j71R2O0J3J37k11K91l46j52K99L4K1m2p7o2K41K1k19J10Q6Pj52k43K96
6153G4j57j81N09k96L4j03L28k37M7q8K26r3j8j12Q5O3q5J92j69J10j06n1J62
6176A34j26j57K94K1j25l1K2M3Lk11J67l6L69l48M9k23K95J3l00Q0N8j81M41k63
$$ plain form
6014 145 152 146 -15 -130 109 211 5 48 140 -169 -88 184 -76 166 -139 161 -75 46 -266 -270 251 -80 41
6037 41 -186 214 145 209 57 118 -20 159 -138 -57 99 -45 114 -225 69 13 -74 56 -108 -7 -60 52 -103
6060 -103 30 11 -78 93 20 0 -21 -432 89 176 123 218 150 83 -355 77 109 284 159 52 250 22 65 88
6084 88 -80 388 -99 139 -32 192 45 -159 97 85 79 18 118 18 188 -71 -123 190 160 11 75 16 -109
6107 -109 2 -78 157 37 38 -175 -81 92 117 -11 111 -89 89 -205 126 221 -180 169 -247 -37 202 41
6129 41 -130 -38 22 35 172 -39 252 -94 -246 53 87 108 66 -11 -73 168 189 -30 80 166 173 21 -222 74
6153 74 -83 -264 245 -51 -17 -120 208 -29 18 -70 156 63 45 -67 18 81 -4 188 19 129 23 -28 134
6176 134 8 -149 145 166 41 10 32 75 78 -133 34 -2 367 19 68 -155 140 153 -147 -67 -9 -190 251 -12
6200a2l7N5M6p9j67L11j19J9o7J20r5L0O3Q1l08J42j2p6K78r4o5ml9Oj35q0M16
6227A78Ol48L04k07R2j6k25L70q3l06K20J27j4j68J44k3j45L86k12k85J25J49
6249F9J2n2k38J74k7J14m6J42j71j62J76O7k59K51k65L87k53J44j8nP7r4RJ91
6273B23j81p9J82q8n3j09Q4N2Op8k41L8J76k7K12j42J4J14J52j95j2q3m2j3m8
$$ plain form
6200 -12 -49 6 52 -27 -194 117 -2 17 -50 70 -25 5 68 149 -159 -17 -29 -105 173 79 14 10 -29 -23 -158 -238 178
6227 178 184 -164 140 -67 25 9 -216 154 71 -235 -15 112 98 -70 74 51 -94 292 80 -205 -80 69
6249 69 81 29 -209 -35 -62 52 6 148 -23 -185 -9 58 -201 50 -215 172 -81 63 45 40 117 23 32 223
6273 223 42 -37 145 57 4 -105 -21 31 37 -41 -282 -244 -68 -95 117 -25 -11 103 255 60 48 -35 -77 -90 -138
$$ [...]
8191h3
##END NTUPLES=NMR FID
##END=
