##TITLE=1H_SR147_K3
 D2O
 32 sc, 
 14.11.2022
##JCAMPDX= 6.0         $$ Bruker NMR JCAMP-DX V2.0
##DATA TYPE= NMR FID
##DATA CLASS= NTUPLES
##ORIGIN= UXNMR, Bruker Analytische Messtechnik GmbH
##OWNER= root
$$ XWIN-NMR		Version 3.5
$$ Mon Nov 14 15:56:37 2022 Russian Standard Time (UT+4h)  she@DPX200
##.OBSERVE FREQUENCY= 200.1313499994
##.OBSERVE NUCLEUS= ^1H
##.DELAY= (6, 6)
##.ACQUISITION MODE= SIMULTANEOUS
##.ACQUISITION SCHEME= undefined
##.AVERAGES= 32
##.DIGITISER RES= 18
##SPECTROMETER/DATA SYSTEM= spect
##.PULSE SEQUENCE= zg30
##.SOLVENT NAME= D2O
##.SHIFT REFERENCE= (INTERNAL, D2O, 0, 15.7039)
##AUDIT TRAIL= $$ (NUMBER, WHEN, WHO, WHERE, WHAT)
$$ ##TITLE= Audit trail, XWIN-NMR		Version 3.5
$$ ##JCAMPDX= 5.01
$$ ##ORIGIN= Bruker BioSpin GmbH
$$ ##OWNER= she
$$ F:/spectra/data/she/nmr/H-F/1/audita.txt
$$ ##AUDIT TRAIL=  $$ (NUMBER, WHEN, WHO, WHERE, WHAT)
(   1,<2022-11-14 15:55:44.81 +0400>,<she>,<DPX200>,
      <continue with go, POWCHK disabled, PULCHK disabled
       configuration hash MD5:
       00 E9 B6 7A A2 85 ED C7 34 08 36 98 17 FE 4E 26
       data hash MD5: 16K
       09 64 40 A6 F5 1A 47 CF 79 F3 16 3F 63 C4 DC F3>)
$$ ##END=
$$ 
$$ hash MD5
$$ 2A DA EC 71 D0 C6 90 D4 C7 38 8A 5E 13 E8 09 99
##$RELAX= 
##$RELAX= 
##$RELAX= 
##$RELAX= 
##$RELAX= 
##$RELAX= 
$$ Bruker specific parameters
$$ --------------------------
##$DU= <F:/spectra>
##$EXPNO= 1
##$NAME= <H-F>
##$PROCNO= 1
##$TYPE= <nmr>
##$USER= <she>
##$AMP= (0..31)
100 100 100 100 100 100 100 100 100 100 100 100 100 100 100 100 100 100 
100 100 100 100 100 100 100 100 100 100 100 100 100 100 
##$AQSEQ= 0
##$AQ_mod= 1
##$AUNM= <au_zg>
##$AUTOPOS= <>
##$BF1= 200.13
##$BF2= 200.13
##$BF3= 200.13
##$BF4= 200.13
##$BF5= 200.13
##$BF6= 200.13
##$BF7= 200.13
##$BF8= 200.13
##$BYTORDA= 1
##$CFDGTYP= 0
##$CFRGTYP= 5
##$CHEMSTR= <none>
##$CNST= (0..31)
1 1 145 1 1 1 1 1 1 1 1 1 1 1 1 1 1 1 1 1 1 1 1 1 1 1 1 1 1 1 1 1 
##$CPDPRG= <>
##$CPDPRG1= <>
##$CPDPRG2= <>
##$CPDPRG3= <>
##$CPDPRG4= <mlev>
##$CPDPRG5= <mlev>
##$CPDPRG6= <mlev>
##$CPDPRG7= <mlev>
##$CPDPRG8= <mlev>
##$CPDPRGB= <>
##$CPDPRGT= <>
##$D= (0..31)
0 1.2 0 0 0 0 0 0 0 0.06 0 0.03 0 0 0 0 0.0002 0 0 0 0 0 0 0 0 0 0 0 0 
0 0 0 
##$DATE= 1668426807
##$DBL= (0..7)
120 120 120 120 120 120 120 120 
##$DBP= (0..7)
150 150 150 150 150 150 150 150 
##$DBP07= 0
##$DBPNAM0= <>
##$DBPNAM1= <>
##$DBPNAM2= <>
##$DBPNAM3= <>
##$DBPNAM4= <>
##$DBPNAM5= <>
##$DBPNAM6= <>
##$DBPNAM7= <>
##$DBPOAL= (0..7)
0.5 0.5 0.5 0.5 0.5 0.5 0.5 0.5 
##$DBPOFFS= (0..7)
0 0 0 0 0 0 0 0 
##$DE= 6
##$DECBNUC= <off>
##$DECIM= 32
##$DECNUC= <off>
##$DECSTAT= 4
##$DIGMOD= 1
##$DIGTYP= 9
##$DL= (0..7)
0 120 120 120 120 120 120 120 
##$DP= (0..7)
150 150 150 150 150 150 150 150 
##$DP07= 0
##$DPNAME0= <>
##$DPNAME1= <>
##$DPNAME2= <>
##$DPNAME3= <>
##$DPNAME4= <>
##$DPNAME5= <>
##$DPNAME6= <>
##$DPNAME7= <>
##$DPOAL= (0..7)
0.5 0.5 0.5 0.5 0.5 0.5 0.5 0.5 
##$DPOFFS= (0..7)
0 0 0 0 0 0 0 0 
##$DQDMODE= 0
##$DR= 18
##$DS= 0
##$DSLIST= <SSSSSSSSSSSSSSS>
$$ [...]
##$SUBNAM2= <"">
##$SUBNAM3= <"">
##$SUBNAM4= <"">
##$SUBNAM5= <"">
##$SUBNAM6= <"">
##$SUBNAM7= <"">
##$SUBNAM8= <"">
##$SUBNAM9= <"">
##$SW= 18.0517283424941
##$SWIBOX= (0..15)
0 0 2 0 0 0 0 0 0 0 0 0 0 0 0 0 
##$SW_h= 3612.71676300578
##$TD= 16384
##$TD0= 1
##$TE= 0
##$TE2= 300
##$TE3= 300
##$TEG= 300
##$TL= (0..7)
0 120 120 120 120 120 120 120 
##$TP= (0..7)
150 150 150 150 150 150 150 150 
##$TP07= 0
##$TPNAME0= <>
##$TPNAME1= <>
##$TPNAME2= <>
##$TPNAME3= <>
##$TPNAME4= <>
##$TPNAME5= <>
##$TPNAME6= <>
##$TPNAME7= <>
##$TPOAL= (0..7)
0.5 0.5 0.5 0.5 0.5 0.5 0.5 0.5 
##$TPOFFS= (0..7)
0 0 0 0 0 0 0 0 
##$TUNHIN= 0
##$TUNHOUT= 0
##$TUNXOUT= 0
##$USERA1= <user>
##$USERA2= <user>
##$USERA3= <user>
##$USERA4= <user>
##$USERA5= <user>
##$V9= 5
##$VALIST= <valist>
##$VCLIST= <CCCCCCCCCCCCCCC>
##$VD= 0
##$VDLIST= <DDDDDDDDDDDDDDD>
##$VPLIST= <PPPPPPPPPPPPPPP>
##$VTLIST= <TTTTTTTTTTTTTTT>
##$WBST= 1024
##$WBSW= 4
##$XGAIN= (0..3)
0 0 0 0 
##$XL= 0
##$YL= 0
##$YMAX_a= 3056342
##$YMIN_a= -3102420
##$ZGOPTNS= <>
##$ZL1= 120
##$ZL2= 120
##$ZL3= 120
##$ZL4= 120
##$ABSF1= 10
##$ABSF2= 0
##$ABSG= 5
##$ABSL= 3
##$ALPHA= 0
##$AQORDER= 0
##$ASSFAC= 0
##$ASSFACI= 0
##$ASSFACX= 0
##$ASSWID= 0
##$AUNMP= <proc_1d>
##$AZFE= 0.1
##$AZFW= 0.1
##$BCFW= 1
##$BC_mod= 2
##$BYTORDP= 1
##$COROFFS= 0
##$CY= 11.3945322036743
##$DATMOD= 1
##$DC= 2
##$DFILT= <>
##$DTYPP= 0
##$F1P= 2.36226072786647
##$F2P= -0.459571619588291
##$FCOR= 0.5
##$FTSIZE= 0
##$FT_mod= 4
##$GAMMA= 1
##$GB= 0.15
##$INTBC= 1
##$INTSCL= 1
##$ISEN= 128
##$LB= 0.24
##$LEV0= 0
##$LPBIN= 0
##$MAXI= 10000
##$MC2= 0
##$MEAN= 0
##$ME_mod= 0
##$MI= 1.114404
##$NCOEF= 0
##$NC_proc= 0
##$NLEV= 6
##$NOISF1= 3.799351
##$NOISF2= 2.8
##$NSP= 1
##$NTH_PI= 0
##$NZP= 0
##$OFFSET= 15.70392
##$PC= 1
##$PHC0= -18034.91
##$PHC1= 10.0007
##$PH_mod= 1
##$PKNL= yes
##$PPARMOD= 0
##$PSCAL= 0
##$PSIGN= 0
##$REVERSE= no
##$SF= 200.130013532006
##$SI= 16384
##$SIGF1= 3
##$SIGF2= 2
##$SINO= 400
##$SIOLD= 16384
##$SREGLST= <1H.CDCl3>
##$SSB= 0
##$STSI= 0
##$STSR= 0
##$SW_p= 3612.71676300578
##$SYMM= 0
##$S_DEV= 0
##$TDeff= 0
##$TDoff= 0
##$TI= <>
##$TILT= no
##$TM1= 0
##$TM2= 0
##$TOPLEV= 0
##$USERP1= <user>
##$USERP2= <user>
##$USERP3= <user>
##$USERP4= <user>
##$USERP5= <user>
##$WDW= 1
##$XDIM= 8192
##$YMAX_p= 0
##$YMIN_p= 0
$$ End of Bruker specific parameters
$$ ---------------------------------
##NTUPLES= NMR FID
##VAR_NAME=  TIME,          FID/REAL,        FID/IMAG
##SYMBOL=    X,             R,               I
##VAR_TYPE=  INDEPENDENT,   DEPENDENT,       DEPENDENT
##VAR_FORM=  AFFN,          ASDF,            ASDF
##VAR_DIM=   8192,          8192,            8192
##UNITS=     SECONDS,       ARBITRARY UNITS, ARBITRARY UNITS
##FACTOR=    0.0002768,     1,               1
##FIRST=     0,             0,               0
##LAST=      2.2672688,     0,               0
##MIN=       0,             -3102420,        0
##MAX=       2.2672688,     3056342,         0
$$ Real data points
##PAGE= N=1
##DATA TABLE= (X++(R..R)), XYDATA
0 0 0 0 0 0 0 0 0 0 0 32 -32 32 -64 64 -96 96 -128 160 -192 226 -286 322 -396 450 -546 640 -737 865
28 865 -977 1125 -1294 1464 -1678 1886 -2136 2415 -2698 3032 -3383 3772 -4208 4666 -5186 5742
44 5742 -6345 7020 -7735 8531 -9410 10356 -11418 12576 -13864 15305 -16904 18725
56 18725 -20784 23142 -25910 29145 -33052 37838 -43870 51766 -62559 78338 -103644 151029
68 151029 -271100 1274956 1706641 -937218 -2241358 -2862586 -1871489 -157678 1906893
77 1906893 2939905 2751542 1179140 -805952 -2425005 -2752406 -1892338 -149117 1587106
86 1587106 2632503 2331650 903350 -1010662 -2396272 -2702081 -1767204 -111596 1549972
95 1549972 2406758 2103393 749422 -952712 -2206454 -2394861 -1482669 104704 1607841
104 1607841 2365204 2015959 738492 -860418 -1988198 -2124512 -1228486 246870 1621208
113 1621208 2257465 1853550 590596 -908886 -1918949 -1987076 -1129772 240574 1497609
122 1497609 2044115 1601472 394147 -987733 -1895564 -1918172 -1058569 262091 1419565
131 1419565 1883431 1436653 287048 -997706 -1795406 -1747631 -897777 354052 1421324
140 1421324 1805746 1341001 257136 -933290 -1661759 -1582857 -748299 434528 1409921
149 1409921 1726648 1236953 179639 -939340 -1590151 -1473298 -657381 457540 1343208
158 1343208 1589007 1083851 71567 -964844 -1537655 -1387024 -593959 460390 1281373
167 1281373 1482823 974542 2657 -964878 -1469496 -1279013 -492934 512454 1263934 1410918
177 1410918 891402 -42667 -939544 -1377236 -1156436 -391299 551817 1231308 1331014 808522
187 808522 -87109 -928311 -1317766 -1076325 -328917 565184 1184153 1238591 706107 -155107
197 -155107 -937109 -1270140 -1003170 -271757 572123 1133348 1150819 622134 -198837 -922182
207 -922182 -1206429 -920592 -206875 594922 1107452 1093430 564947 -223456 -894697 -1134638
217 -1134638 -832316 -137464 617679 1078300 1030618 503198 -251800 -877431 -1079261 -766928
227 -766928 -94410 618197 1033732 958321 431882 -293996 -875545 -1040311 -714395 -57737
237 -57737 614688 986374 885365 364329 -327819 -861696 -988580 -651898 -15391 620782
247 620782 955564 835039 321727 -340136 -836400 -931096 -582425 37915 637191 933483
257 933483 789247 276614 -356819 -812395 -876811 -523008 77839 636472 893371 730137
267 730137 225769 -380276 -802371 -840085 -480549 100136 627972 852419 669797 171441
277 171441 -406799 -790416 -801001 -434511 130099 625713 817602 619336 130753 -416257
287 -416257 -765518 -750153 -380604 164921 627109 791548 581427 98776 -422162 -736472
297 -736472 -701019 -333290 192810 624791 758386 535294 64914 -431242 -718343 -663043
307 -663043 -293932 209774 611410 720971 487287 25995 -443748 -702393 -628267 -258609
317 -258609 227676 599837 684851 445366 -4923 -449103 -677917 -586418 -219994 247723
327 247723 594998 656602 409286 -27912 -449157 -654170 -546835 -181932 266505 587161
337 587161 628010 372810 -55289 -452606 -632574 -512180 -151164 277753 572835 594980
347 594980 334444 -81943 -455111 -611908 -481046 -123181 289758 561134 564764 301132
357 301132 -103107 -455648 -589765 -444481 -91855 302013 551687 538968 271585 -121240
367 -121240 -451024 -565453 -411552 -64130 312316 539015 510932 240393 -139382 -449809
377 -449809 -544695 -383510 -42567 317029 522877 479449 209585 -157659 -449010 -526675
387 -526675 -356869 -21120 321397 509214 453229 182830 -171877 -443255 -503464 -326260
397 -326260 3483 328975 497613 430444 161842 -181017 -434041 -479499 -297541 24702
407 24702 333590 484633 407100 137497 -193004 -429549 -460140 -273328 41045 333856
417 333856 467304 378833 110724 -207204 -425463 -441302 -251813 54681 331919 450527
427 450527 353418 88811 -216843 -417358 -420874 -227188 72335 334453 438678 332498
437 332498 71243 -221053 -407021 -397762 -200336 89631 336704 425095 312086 52771
447 52771 -227503 -397509 -377302 -178341 103396 335560 407991 287838 33183 -235851
457 -235851 -391305 -360492 -160565 112893 330701 390056 264450 13776 -242853 -383369
467 -383369 -342412 -141499 123724 328677 375979 243976 -1612 -245472 -372071 -321469
477 -321469 -119383 137073 326753 362340 226217 -14325 -245990 -359389 -301105 -100680
487 -100680 146251 323793 347309 207222 -28702 -248688 -349752 -284338 -84815 152784
497 152784 316773 329321 186935 -44236 -251923 -340322 -267885 -70960 158007 310255
507 310255 314156 168801 -55744 -252991 -329332 -249346 -53675 166167 306583 301038 152972
518 152972 -64822 -250960 -315516 -231022 -37218 172794 300884 286426 136946 -75460
528 -75460 -250359 -305118 -215665 -24434 176282 292627 269598 119801 -87349 -251201 -295269
539 -295269 -200918 -12823 179169 284279 254167 103924 -95548 -248120 -283209 -183794 1125
550 1125 184003 279105 241818 91395 -101302 -243407 -269145 -166994 13886 187676 272388
561 272388 228237 77388 -108121 -241068 -259228 -153963 23111 187363 261778 212587 61914
572 61914 -117042 -239690 -249899 -141831 30779 186834 252872 198230 49181 -121462 -235311
583 -235311 -236733 -127432 41672 188989 246884 187582 40567 -123662 -226910 -222655 -111924
594 -111924 51437 190589 239755 176004 30784 -126652 -223241 -212289 -100873 57101 187091
605 187091 228832 161232 18084 -132653 -220402 -203964 -91992 62379 183944 217332 146730
616 146730 7361 -135910 -215572 -191898 -79117 69819 184051 210520 137769 3 -135996
627 -135996 -206898 -178882 -65676 77929 184295 203894 127914 -7483 -137199 -200682 -167464
638 -167464 -55816 82009 180959 194006 115539 -17202 -140215 -196777 -159679 -48188 84443
649 84443 176531 183727 103038 -25938 -142405 -191434 -149979 -38876 89058 174474 175256 92609
661 92609 -31710 -141175 -183438 -138186 -28213 94582 172170 167922 85415 -36714 -139888
672 -139888 -176409 -128810 -20238 97625 168291 159302 75775 -43034 -140850 -171208 -119690
683 -119690 -13622 97662 162437 150417 66104 -48288 -139914 -164342 -111536 -6536 100265
694 100265 158479 141319 57587 -53060 -137848 -157492 -101787 703 102361 155152 133949
705 133949 50043 -56638 -136016 -149374 -92686 7684 103484 150148 125568 41947 -61103
716 -61103 -134872 -144002 -84909 13349 104736 145658 116893 33945 -64684 -132123 -137485 -77112
728 -77112 18829 104926 140276 109592 26940 -67775 -129387 -129840 -68391 24681 105257 136530
740 136530 102016 20318 -70001 -126292 -122380 -60768 29925 105112 131392 94558 13761 -73050
752 -73050 -124907 -117030 -54240 33287 104182 125068 86571 6689 -75475 -121493 -110370 -47087
764 -47087 37283 103816 120169 79924 1661 -76482 -118111 -103619 -40163 41663 103502 115647
776 115647 73416 -2879 -77351 -114324 -96813 -33440 44875 102434 110933 66557 -7689 -78228
788 -78228 -111061 -91141 -28192 47431 100283 105195 59977 -12671 -79123 -107712 -85762 -22664
800 -22664 49278 98124 99648 54050 -16588 -79548 -104587 -79378 -17367 51325 95982 95055 49429
813 49429 -19801 -78688 -99772 -73576 -12264 53517 94004 90363 43264 -23208 -77913 -96009
825 -96009 -67656 -7877 55409 92411 85364 38470 -26437 -77747 -92154 -62776 -4212 55721
837 55721 89831 79640 32879 -29715 -77146 -88550 -57551 -82 56930 86468 74644 27911
849 27911 -31959 -76006 -84437 -52979 3798 57489 83913 70271 23780 -34108 -74577 -80378
861 -80378 -47691 6864 57694 81276 66091 20044 -35582 -73500 -76350 -42621 9539 58892
873 58892 78793 61380 15375 -36912 -72491 -72713 -39154 13063 58046 75813 57149 11563
885 11563 -39520 -71093 -69170 -34723 15295 58138 73110 53123 8754 -39896 -69434 -65329
897 -65329 -30654 17466 57923 69941 49393 5335 -41445 -67085 -61787 -27148 20657 57124
909 57124 67348 45785 2545 -41313 -65166 -58539 -23621 22021 56865 64298 42077 -350
921 -350 -42149 -63425 -54972 -20139 23766 56396 61398 38353 -3365 -42592 -61972 -51989 -17105
934 -17105 25054 55139 58798 34988 -5658 -42586 -60028 -47854 -14248 26227 53753 56021
946 56021 31200 -7857 -42603 -57433 -45176 -10679 28097 53266 53777 28699 -10066 -43024
958 -43024 -55311 -42044 -8253 28660 51996 50069 25310 -11854 -43145 -54168 -39360 -6136
970 -6136 29507 50685 48165 22373 -13790 -42841 -51374 -35395 -3245 30854 49631 45239 19178
983 19178 -15095 -42974 -49518 -31964 -989 30554 48116 42141 16822 -16501 -42473 -47902 -30168
996 -30168 1305 31395 47187 39805 13805 -18342 -42085 -44964 -27656 2949 32053 45285
1008 45285 37577 11657 -19663 -41298 -43470 -24348 5123 33232 44244 34962 9191 -20686
1020 -20686 -40399 -40964 -22148 6858 32817 42710 31877 7206 -22274 -40119 -39534 -19520 8717
1033 8717 32765 41090 29430 4622 -22377 -38514 -36864 -16834 10116 32701 39061 27544 2796
1046 2796 -23568 -38281 -34993 -14883 12010 32729 37972 25247 732 -24416 -37084 -32782 -12513
1059 -12513 12682 32643 36487 23068 -841 -24538 -36253 -30866 -10943 14045 32216 34015
1071 34015 20857 -2069 -24956 -35628 -28714 -8468 15050 30960 33260 19256 -4421 -24854
1083 -24854 -34133 -26863 -7149 15323 31347 31365 17371 -5048 -24921 -32734 -25575 -5323 16774
1096 16774 30700 29925 15113 -6332 -25384 -31566 -23291 -4150 17187 29907 28433 12852 -7445
1109 -7445 -25130 -30534 -21171 -2328 18714 28805 27055 11267 -9167 -25084 -29117 -19333 -1176
1122 -1176 18396 29064 25919 10524 -9905 -24634 -28515 -18070 194 18256 27846 23494 8936
1135 8936 -10612 -24673 -26639 -16075 1535 19064 26561 22215 6966 -11531 -24435 -26011 -14582
1148 -14582 2501 18988 25541 21095 5787 -11979 -24065 -23954 -12815 3797 19109 25173 18952
1161 18952 4788 -12543 -23406 -22852 -12237 5346 19063 24015 17426 2869 -12989 -22742 -21614
1174 -21614 -10418 5019 19571 23032 16367 1874 -13382 -22127 -20854 -9634 6527 19972 22122
1187 22122 15548 394 -13644 -21473 -19159 -8243 7306 18533 21575 13815 -339 -14476 -21236
1200 -21236 -18180 -6841 7883 18634 20331 12453 -1252 -14264 -19991 -16867 -5775 8285 18139
1213 18139 18992 11247 -2086 -14068 -19828 -16130 -4857 9119 17621 17888 9966 -2560 -14172 -18539
1227 -18539 -14506 -3697 9138 17718 17577 9404 -3356 -13893 -18902 -14058 -3292 9417 16810
1240 16810 16334 8025 -4203 -14081 -17639 -13117 -1991 9974 16588 15861 7132 -4542 -14282 -16789
1254 -16789 -12146 -540 10304 16184 14682 6126 -5221 -14512 -16342 -10917 -540 10148 15457
1267 15457 14086 5276 -5836 -14183 -15381 -9641 182 10866 15637 12912 4789 -6535 -13788 -14730
1281 -14730 -9346 1315 11172 15033 12182 3394 -6958 -13894 -13826 -7796 2162 10588 14179 11470 2640
1296 2640 -7079 -13243 -13280 -7189 2405 10808 14070 10662 2155 -7124 -13332 -12860 -6432 2905 10713 13456
1312 13456 9731 1071 -7522 -12991 -11801 -5946 3728 10613 13212 9070 108 -7755 -12995 -11541 -4773
1327 -4773 3602 10830 12400 8476 -435 -7796 -12451 -10654 -3795 4369 11010 11752 7354 -772 -8779
1342 -8779 -11977 -9632 -3329 4998 11206 11209 6797 -875 -8425 -11715 -9181 -2193 5558 10300 10727 5678
1358 5678 -1877 -8554 -11499 -8791 -2008 6002 10215 10436 5346 -2549 -8563 -10588 -8248 -1345 6254
1373 6254 10799 9798 4550 -3143 -8706 -10321 -6865 -913 6056 10376 8766 3786 -3332 -8501 -10442
1388 -10442 -6508 136 6453 9578 8621 3650 -3127 -8535 -9909 -5989 599 7174 9784 8155 2688
1403 2688 -4142 -8340 -9285 -5792 1010 6420 9565 7563 2134 -3987 -8780 -8309 -5187 598 6739
1418 6739 9073 6720 1534 -3839 -8370 -8480 -4498 1502 7002 8717 6900 919 -4480 -7805 -7864 -4099
1434 -4099 2409 6865 7994 5882 513 -5044 -7854 -7636 -3448 2279 6998 8378 5394 248 -5351
1449 -5351 -7828 -7493 -2806 2437 6731 8002 4924 258 -5247 -7552 -6984 -2747 3125 6847 7784 4673
1465 4673 -241 -5011 -6986 -6242 -1936 3058 6610 7452 4360 -681 -5144 -6996 -6143 -2478 3006 6560
1481 6560 6968 3898 -727 -5192 -7135 -5676 -864 3152 6179 6584 3145 -1570 -4966 -6894 -5405
1496 -5405 -409 3605 5757 6042 3236 -1779 -5353 -6449 -4774 -1202 3945 5680 5591 2846 -1503 -5066
1512 -5066 -6312 -3994 -488 3451 5973 5236 2309 -1989 -5037 -5821 -4085 -283 4037 5530 5259 2108
1528 2108 -2113 -5082 -5854 -3548 -176 3745 5590 4883 1628 -1960 -4940 -5824 -3219 -198 3934 5487
1544 5487 4134 1149 -1935 -4595 -5554 -3007 221 3941 4981 4199 1497 -2700 -5289 -5070 -2826 636
1560 636 3916 4784 4310 592 -2879 -4434 -5036 -2276 861 3958 4782 3378 626 -2455 -4603 -4251
1576 -4251 -2354 1245 4256 4396 3829 662 -2784 -4211 -3860 -2375 1426 3500 4288 3213 573 -3022
1592 -3022 -4917 -3820 -1562 1160 4075 4500 3280 833 -3231 -4491 -3725 -1964 1266 4190 4741 2886
1608 2886 -2 -2538 -4003 -4021 -1522 1714 3408 4189 2686 -272 -2839 -4217 -2938 -1054 1208 3528
1624 3528 4042 2416 -469 -2827 -4377 -3335 -1063 2199 3692 3751 2179 -232 -2905 -4560 -2854 -1281
1640 -1281 1304 3786 3903 1868 -639 -2705 -3693 -2603 -343 1291 3194 3298 2110 -484 -3114 -3679
1656 -3679 -2432 -430 1207 3161 3192 1859 -279 -2891 -3352 -2431 38 2030 3398 3015 1926 -884
1672 -884 -2901 -3827 -2327 -138 1842 3078 2783 1700 -751 -2443 -3563 -2031 -246 1935 3556 2955
1688 2955 1572 -1120 -2616 -2832 -1761 161 2105 2988 2860 1034 -885 -3021 -2924 -2169 -53 1402
1704 1402 2647 1984 216 -874 -2813 -2931 -1697 -23 2271 2799 2015 1134 -913 -2970 -2689 -1643
1720 -1643 -170 1351 2282 1695 661 -1443 -2837 -2426 -1252 647 1994 2729 1746 813 -1742 -2639 -2654
1737 -2654 -866 755 2379 3105 1689 100 -1523 -2257 -2361 -1063 240 1973 2898 2005 229 -1104
1753 -1104 -2611 -2218 -1001 1049 2216 2553 1441 202 -1758 -2367 -2080 -1262 989 2105 2140 1586 -69
1770 -69 -1568 -2414 -2610 -888 615 2232 2140 1306 129 -1809 -2440 -1708 -807 672 1963 2061 1978 -154
1788 -154 -1597 -2088 -1658 -243 970 1897 2130 1093 -131 -1660 -1897 -1735 -1124 1000 1665 2053 968
1805 968 -112 -837 -2455 -1918 -382 877 1572 2013 1267 -269 -1638 -2126 -1255 -574 937 1148 1105 1002
1823 1002 -479 -1789 -1916 -804 132 1070 2165 1494 937 -813 -1044 -1828 -1270 -662 1291 1595 2001 704
1841 704 -525 -1578 -2315 -1219 -659 583 2101 1380 387 -474 -1629 -1411 -1130 -134 1075 1556 1567 1045
1859 1045 -227 -1513 -2173 -879 45 834 2101 1272 555 -588 -1171 -1688 -929 201 827 1523 1142 755
1877 755 -743 -993 -1682 -237 -122 533 1394 1544 37 -657 -1340 -1713 -1338 -402 1275 1263 1081 441 -334
1896 -334 -1269 -1206 -540 -463 1207 1561 651 160 -998 -1297 -1846 -549 0 703 1300 1067 655 -828 -914 -1344
1916 -1344 -1115 610 783 1417 1110 299 -667 -882 -1097 -347 359 927 1250 895 759 -59 -1142 -1041 -387
1935 -387 -73 1320 1069 513 -148 -698 -860 -1255 -317 196 1054 865 825 -172 -591 -1104 -1307 -780 526 786
1955 786 1187 916 14 -532 -1287 -1005 -418 142 982 1214 806 -16 -399 -1045 -1123 -464 208 433 955 555
1975 555 -159 -1114 -1392 -874 -688 142 886 1138 1077 395 -579 -940 -1200 -600 218 657 713 580 -67 -714 -781
1996 -781 -746 -258 131 1067 904 646 -105 -140 -1345 -329 -572 705 441 880 734 -461 -570 -712 -1136
2015 -1136 -543 208 922 817 251 -169 -796 -740 -834 -163 -50 680 1108 398 -428 -587 -759 -992 -355 228
2035 228 620 575 773 -157 -374 -1322 -317 -358 133 923 670 844 -169 -341 -628 -45 -517 14 774 783 556
2056 556 -175 -503 -716 -631 -218 467 676 452 295 -230 -431 -1111 -41 -215 715 1006 392 541 -393 -870
2076 -870 -409 -166 -321 31 396 476 311 -95 -265 -560 -595 231 496 515 383 214 -99 -843 -800 -645 143
2097 143 -67 498 759 271 -290 -685 -622 -42 39 152 326 1025 226 482 -269 -598 -407 -74 479 648 791
2118 791 38 -564 -917 -146 -366 -144 140 454 213 -244 -159 -327 -888 -146 -314 767 97 335 176 -102
2138 -102 -7 -21 -618 -486 -13 352 416 334 -64 38 -395 -173 112 11 397 495 215 -46 -146 -588 -178 85
2160 85 245 29 307 146 -127 -690 -603 26 -403 357 418 292 214 -235 -864 -762 -840 -272 66 376 630 96
2182 96 218 -818 -763 -313 -557 -300 31 338 193 -190 -598 -357 -365 -263 84 436 649 -12 -60 -605 -226
2203 -226 -477 19 348 418 269 432 -432 -279 -161 170 309 165 344 124 -138 -469 -52 -243 -398 55
2223 55 61 398 291 -34 -451 -720 -423 -262 208 36 186 376 195 13 -212 -370 -212 78 248 -13 159
2244 159 335 158 -531 -286 -231 304 542 356 578 -425 -1 -262 -318 -154 109 225 265 462 355 -54 -573
2265 -573 -145 -534 -162 122 387 600 246 24 -414 22 -734 193 468 314 104 5 -246 90 -228 -858
2285 -858 -313 124 321 -252 25 -335 -65 -219 -153 -145 -218 282 -142 295 -56 -463 -632 144 87 179 336 389
2307 389 -210 -208 -366 -312 -397 424 -4 425 53 208 -692 -76 -568 -376 -106 272 392 433 36 -26 -263 -538
2329 -538 -35 421 286 35 292 486 -490 -29 -126 141 119 -107 648 114 81 -350 350 108 74 283 544
2350 544 400 619 212 357 -289 -579 -389 191 -252 790 193 100 -266 168 -344 -417 544 46 182 -602
2370 -602 -249 -1 175 -2 -36 4 718 362 218 -94 -167 -78 65 -203 348 391 -151 -6 231 -1083 -116
2391 -116 18 -78 588 579 291 325 -197 -590 -379 103 438 271 585 397 -318 -303 23 -632 20 75 99 -14
2413 -14 662 -91 -68 -223 -521 66 -68 480 449 84 48 -13 -716 -249 -175 -25 596 475 30 -119 -399 -582
2435 -582 -495 73 8 -247 -115 156 -370 -699 -291 -325 -321 972 442 90 -8 3 -393 -530 -566 -4 349 173
2457 173 192 110 197 59 -321 -48 -84 -316 664 67 495 113 -94 -516 -450 -238 257 195 421 506 -106 -451
2479 -451 -567 -410 75 71 635 743 460 29 -340 -94 193 -344 210 242 84 -170 337 -210 -517 -345 -56
2500 -56 213 343 238 54 -74 -257 -13 -68 414 62 543 1036 776 -203 -242 -553 53 -79 292 292 598 -244
2522 -244 199 -629 -252 -3 -113 23 82 222 98 218 -620 9 -405 34 72 641 35 78 -78 -449 -92
2543 -92 -23 65 103 893 412 251 289 644 -297 50 -68 379 909 -64 515 -353 -562 -2 -78 -11 -94 62 -195
2566 -195 13 -84 -462 -472 175 -246 -34 545 239 100 151 -145 -218 115 -141 40 239 223 -160 68 114 252
2588 252 -467 73 272 238 314 125 -78 32 -519 -526 401 -208 624 110 4 116 281 -234 -270 336 -205 728
2610 728 178 -81 -51 -213 141 -49 77 -14 458 -65 -103 -81 -137 -254 -475 34 -54 383 191 -387 -136 -516
2632 -516 -484 -608 328 191 273 -339 -205 -55 -366 -171 -210 68 125 190 -39 99 -87 -20 -421 -200 227 277
2654 277 105 -245 -294 -73 -137 -452 -116 -42 203 406 71 161 -281 -353 387 131 178 623 -212 264 142 -183
2676 -183 -97 -249 93 -68 -200 392 607 -117 -142 -218 187 48 -34 697 -40 -165 -114 23 339 -282 -167 417
2698 417 228 -3 -229 190 212 -635 -153 52 -16 46 207 75 121 -311 -207 -388 -234 561 52 -257 619
2719 619 -187 -47 3 -425 -574 -338 161 -39 -132 668 35 -28 -115 -259 434 474 45 172 160 -167 35 -472
2741 -472 715 192 139 208 60 -291 -524 -176 -262 -171 100 152 -308 -104 -263 -531 49 108 -166 -144 564 700
2763 700 468 222 -301 -515 -354 167 354 216 -261 -271 -7 -36 104 120 39 229 98 175 458 -529 -316 -236
2785 -236 163 381 231 475 215 678 82 218 -631 -72 535 -248 -226 84 50 36 -44 270 -157 40 236
2806 236 141 -202 -456 -335 -290 -113 -198 32 475 98 204 -110 -54 -480 -267 -267 -129 -437 471 8 380 -130
2828 -130 -716 16 -308 -75 417 198 -311 -340 -157 -269 -244 319 -146 -331 262 183 231 0 -484 -218 -294 -398
2850 -398 -20 616 512 30 -995 -304 -609 -309 94 677 168 133 439 -403 -453 -452 -18 -3 45 282 -52 166
2872 166 -193 -470 545 -43 0 514 -112 100 -16 -44 -470 -74 -55 319 300 34 347 171 67 284 -86
2893 -86 107 75 297 155 -149 -3 -134 -97 -333 82 -194 574 209 -378 272 99 -200 -424 3 262 -351
2914 -351 565 587 -448 -556 184 -205 -153 762 6 -133 382 -322 445 -32 -458 507 -10 395 458 121 -269
2935 -269 -77 -94 -461 314 -385 149 91 331 -211 -50 -75 -179 -211 66 397 69 39 219 244 -475 -539 -177
2957 -177 5 268 179 349 295 -325 -491 134 45 248 215 -84 386 560 170 -31 329 -241 486 95 -45
2978 -45 84 415 -326 30 -399 -528 -257 45 545 -367 28 -138 -287 -666 -70 131 175 -262 464 340 -478
2999 -478 106 106 -413 -13 111 325 177 -98 -23 17 -243 26 128 -114 307 -60 51 490 -161 -97 -191 -427
3021 -427 177 280 387 169 377 -500 -220 250 -130 54 222 -6 7 -248 -39 42 -41 -250 420 52 374
3042 374 319 -23 -508 527 -92 495 -73 -627 -245 -44 -92 -148 -316 -86 -2 -89 -368 -385 505 -446 131 116
3064 116 286 -347 85 -42 96 -67 -139 -129 226 344 176 -30 -180 -69 86 -469 -290 443 451 260 -477
3085 -477 162 29 209 589 -410 -168 -159 -20 151 23 3 105 -127 -607 -294 304 -163 194 -160 277 243
3106 243 -377 242 587 235 -50 103 -75 329 -67 -579 -57 -101 -383 -325 363 -557 17 278 32 -264 -294
3127 -294 -217 30 326 -499 -268 164 -5 -97 -17 514 683 -154 -166 -77 139 169 64 -93 -362 751 38 345
3149 345 17 466 -55 -272 323 -264 -130 -407 219 199 -575 -125 -335 55 329 298 107 -315 292 -246 48
3170 48 322 179 61 -157 -89 236 -22 106 -152 -775 -145 -29 -56 -643 -357 -220 -62 210 149 -67 -113 769
3192 769 -373 19 58 413 -6 -173 -42 34 -304 168 -299 -54 78 -306 -190 -120 172 -391 146 335 -234
3213 -234 -192 -7 -324 -271 178 376 -19 65 227 400 -242 -361 288 -103 170 -186 215 -415 -94 80 -4
3234 -4 117 174 -128 191 406 422 -329 13 32 -70 155 -31 -24 -166 -235 -33 315 -1 18 202 108 388 826
3257 826 259 244 488 -352 -212 304 -100 -441 201 -130 297 -156 -96 23 533 52 -141 -476 -240 227 -116
3278 -116 -447 80 27 -91 343 148 -508 -162 -353 -417 191 274 -683 -105 500 -96 -19 114 34 280 -188 28
3300 28 -188 0 114 6 83 -384 -177 -35 -121 188 37 -875 65 66 448 42 402 -330 95 199 -233 75
3322 75 -290 -211 268 102 -288 -61 383 397 490 -92 278 -4 84 315 193 443 368 20 -409 -169 -171 -95 -578
3345 -578 140 700 -358 65 305 -6 -62 468 -399 97 358 -125 110 66 103 -444 88 -233 -141 -131 383
3366 383 82 -263 -277 376 -206 468 -85 -325 86 641 138 -80 -489 -200 96 214 469 -92 32 62 -259
3387 -259 -504 -430 88 306 322 -122 114 142 103 236 -416 441 70 -371 -47 343 309 -268 -379 -299 -50 -101
3409 -101 -138 335 381 -318 22 66 -26 -98 48 386 -5 432 20 -492 -189 4 -166 430 21 632 -207 -350
3431 -350 -708 -83 -434 174 -93 244 112 -20 180 9 72 -338 -13 90 -252 168 310 -143 -9 -362
3451 -362 -41 279 173 157 -309 -268 -266 -336 126 109 -482 -117 41 75 -159 -495 -173 -131 361 -68 -102 594 -167
3474 -167 553 -38 39 37 -64 488 27 -230 -152 -266 -633 122 123 268 -8 97 217 -317 -269 22 277 73
3496 73 480 -73 375 -408 -181 -193 -67 313 -238 142 173 491 383 634 -151 184 -209 -397 -246 137 -56
3517 -56 119 -209 276 425 -150 53 545 -202 105 59 134 -139 -49 -203 -1 467 108 -19 162 176 -330 -312
3539 -312 -58 51 235 -145 -89 -377 269 184 160 -270 274 -177 730 65 -410 -115 56 -586 -300 210 19
3560 19 67 36 409 166 140 195 -438 43 33 116 94 -159 517 -36 -53 -475 86 288 113 -97 294 -158 -483
3583 -483 117 45 -272 121 189 -184 -35 -78 197 135 -119 77 -36 -489 354 417 67 -14 -419 -308 168 505
3605 505 135 527 -188 -180 347 -150 424 183 -193 193 384 277 437 251 -184 -274 543 -22 -66 162 18
3626 18 421 -118 -437 -172 -375 575 735 -746 254 289 -17 -181 48 -66 26 -52 106 -120 -258 -681 -8
3647 -8 270 -131 -97 -160 12 -279 -304 -88 259 -328 -393 -308 -47 1 66 -121 46 -159 -137 381 140 193 236 -155
3671 -155 -513 -583 -100 130 11 -168 -68 216 44 -204 169 -194 -73 16 -123 66 -195 -290 17 286 62
3692 62 451 -241 86 32 102 -362 -412 62 -288 -273 -12 -111 31 -77 -87 -28 -439 -318 306 -40 -141 3 522
3715 522 586 272 -146 -82 178 190 561 -269 77 79 289 -249 -423 -1 -263 -243 -349 -108 317 6 -201 -136
3737 -136 -124 397 -22 117 -258 151 -225 -358 -53 -34 -173 401 30 147 373 671 0 390 93 -262 -330
3758 -330 4 -76 409 -339 -100 -259 144 -51 147 112 249 24 354 252 177 151 -225 -306 -130 221 89 -69
3780 -69 -858 -262 -23 240 -506 -41 16 618 28 -9 -93 -104 191 -219 75 -178 407 -399 184 464 -262 -253
3802 -253 -152 60 635 629 -253 -94 -13 -7 -242 -643 313 365 99 1 -266 302 249 173 255 149 -52 178 166 648
3826 648 67 186 -121 -58 142 -183 -162 243 -316 -263 20 -144 -21 106 241 325 -21 -657 -123 -63 -104 -178
3848 -178 -30 82 469 -194 171 144 417 -413 325 304 102 -324 -48 571 -92 288 376 131 94 -22 -192
3869 -192 496 -115 67 257 -612 342 -564 225 -225 -187 219 -194 22 -174 -242 -42 -25 -168 143 -198 -279
3890 -279 -54 433 437 77 -538 204 -47 -41 -164 -271 7 -20 -524 304 85 119 213 -104 57 -13 385 -134 -558
3913 -558 -417 -318 -386 -192 170 -181 220 350 273 108 -107 -186 238 140 -28 645 73 59 148 136 -308 -5 51
3936 51 -123 -294 86 44 -58 -358 -303 282 228 -117 160 -239 101 32 161 132 -126 299 -63 -252 226 454
3958 454 -19 -127 -59 -667 -453 -273 13 44 673 43 824 43 269 -284 308 245 -45 -85 -200 -124 17 -149
3980 -149 -37 -389 75 35 -37 345 147 370 -150 -641 -103 422 -618 -100 -578 153 -222 115 628 99
4000 99 -765 -236 -159 164 -122 318 126 24 290 63 -64 288 -45 -198 418 -105 176 1 480 -351 -88
4021 -88 182 21 63 191 -146 -490 168 252 29 210 -254 196 -580 -298 -354 355 417 357 -455 -244 190 243
4043 243 -334 -95 394 -195 -2 64 94 109 139 -183 118 301 -137 53 -18 -669 -267 -217 207 -54 94 -363
4065 -363 230 55 228 -290 -130 -308 -30 -601 -647 330 386 566 62 -52 199 -262 77 -281 179 -37 43
4086 43 17 33 262 -101 88 -414 190 284 -48 -189 193 -428 93 -106 -26 -6 4 37 173 -21 142 -77 14
4109 14 386 24 131 -238 -402 275 -148 -123 -245 -103 605 -126 254 -363 143 18 30 -94 493 -25 328
4130 328 -330 -301 172 11 53 -215 -218 -661 2 -369 156 128 -197 -172 227 59 -116 214 4 99 -131 -191 -355
4153 -355 291 51 191 -293 26 31 149 -333 -152 27 -323 104 202 449 -32 -164 470 -220 -131 -388 351
4174 351 -109 40 103 175 309 84 334 -6 -234 -11 -164 -46 195 -101 -17 -3 -336 -153 41 140 -69 149
4196 149 89 -146 -338 548 -10 -554 -843 -144 -362 -302 -555 67 -41 -287 -948 127 801 -440 -322 -152
4216 -152 -246 141 432 203 277 194 402 76 -2 -211 412 603 176 14 -416 272 254 -598 256 -253 -382 425
4238 425 192 13 -581 68 -168 -127 -237 193 465 65 -28 365 104 -107 -385 -148 -7 -872 507 633
4258 633 -10 220 -134 -227 398 310 -83 -58 155 176 -404 321 81 -14 313 137 66 -218 134 126 9 168 -111
4281 -111 -18 251 111 60 209 -99 196 -96 -102 -121 -74 57 307 145 448 -474 510 -540 -187 72 -1 -221
4303 -221 231 -346 143 -370 -149 -134 -109 463 -232 -370 -168 266 -372 -18 220 -321 43 -17 -460 156 478
4324 478 30 -42 87 11 -91 133 -29 280 21 -119 -355 -360 -180 -241 597 -288 -158 -318 -797 -66 -61 350
4346 350 -303 -337 61 629 461 -35 -19 454 -23 250 92 -163 -48 378 432 624 138 338 -489 166 -67
4367 -67 -287 208 86 -373 355 273 223 155 -212 96 -261 306 -94 0 -45 12 177 155 -336 -426 133 31 115
4390 115 1 97 104 -220 -395 -286 -310 -669 48 202 -188 193 155 -311 -27 -129 -352 -73 233 535 324 -464
4412 -464 92 -331 -172 -5 61 223 63 202 222 -64 -233 153 -342 -117 78 -348 146 -198 183 19 -70
4433 -70 459 -148 -79 386 -291 93 -534 -104 369 -236 135 111 -75 200 281 -106 -76 144 132 -316 -225 69
4455 69 124 -357 -166 -93 -19 -260 390 144 -93 23 -366 7 122 126 7 29 68 -64 185 460 115 32 404
4478 404 -148 -95 -135 -29 -163 -495 -106 29 -5 164 -70 230 350 172 -146 338 171 -594 -155 349 423
4499 423 147 334 511 -43 15 -484 186 203 40 275 191 -675 54 186 -299 405 71 -134 56 -188 -436
4520 -436 4 -78 13 119 -27 -506 299 -108 211 -170 144 33 -87 -82 -520 374 -42 -429 -168 -65 -314
4541 -314 192 -49 483 111 161 340 -139 0 -411 270 108 464 369 443 -405 145 -421 -344 69 -246 -132
4562 -132 498 -222 -89 174 -154 -408 -73 -342 89 44 408 44 -137 235 -112 132 -331 -115 -99 -55 -560
4583 -560 -2 -215 -31 282 695 33 -172 -424 -211 27 -534 22 184 -13 177 388 234 17 202 26
4603 26 -72 -5 307 533 103 355 457 -286 90 351 282 -363 -220 28 -235 -187 59 127 111 -101 -183 193 -396
4626 -396 28 -210 179 438 -141 11 5 -508 -281 -64 -152 -370 24 150 -213 121 -216 170 197 -782 247
4647 247 -129 29 -111 8 256 -104 -199 159 -139 -67 -98 -168 -246 -227 446 -46 -646 -176 -110 -311 -135 -90 -147
4670 -147 -195 -106 -397 -53 169 67 -140 -544 565 314 105 28 -328 -491 375 -342 -21 174 52 -612 -159
4691 -159 468 -281 -129 -513 414 -70 -27 -233 -139 154 -347 2 151 308 -289 463 -79 153 80 192 346
4712 346 372 121 35 -205 -278 277 -214 161 -220 161 -212 -175 292 -156 165 269 182 -81 82 116 -515 116
4734 116 -494 -344 -231 28 563 -16 10 -329 -451 -217 -193 -10 -342 -27 139 -9 -72 79 -95 326 12
4755 12 77 6 285 -471 -123 369 -112 392 -18 271 -577 -131 -1 -66 20 155 13 533 290 533 -268 -100
4777 -100 -66 -111 -209 -603 -293 246 302 -761 410 290 291 -108 -22 316 -84 -176 -334 -195 145 159 -307 171
4799 171 173 111 235 64 -253 -10 66 -353 251 279 -198 310 -137 392 -448 -235 -262 204 147 -160 9 -44 340
4822 340 37 210 -253 238 75 -72 557 -557 -169 25 267 -182 45 118 280 -422 -75 -59 -178 -131 440
4843 440 -71 -97 39 319 -559 -112 88 117 11 -76 -170 99 324 -43 -131 109 -298 126 342 222 28 494
4865 494 658 225 186 -36 425 117 271 567 126 -85 -173 -239 311 2 272 425 -412 -261 -23 -33 452
4886 452 -44 -251 387 94 -327 -135 -197 448 552 -234 369 -35 -108 -193 -46 -247 -514 282 361 -362 199
4907 199 -307 10 220 -3 162 -18 39 435 246 59 53 -95 -296 -554 -5 258 179 -12 206 -463 65
4928 65 -541 287 94 133 309 125 -722 -343 -583 -127 -36 282 -325 -244 343 161 480 -138 -240 -445 523
4949 523 -354 222 -85 -52 -516 33 -598 300 39 -114 -136 212 -698 327 -155 -159 -163 -59 -340 -374 149 -209
4971 -209 575 -121 451 -130 -77 226 -211 -396 447 86 199 58 -655 -517 323 -158 -16 26 130 -459 10
4992 10 -398 357 238 43 37 48 143 -59 43 208 -152 -426 158 -14 -222 401 -143 83 589 -69 -374 332
5014 332 2 161 -140 -437 -3 -70 224 -342 -136 244 503 473 -289 -113 684 -335 -120 267 179 -175 377
5035 377 -15 229 422 15 -26 -145 -170 281 52 -673 70 247 -138 -206 224 413 141 218 7 -190 60
5056 60 -95 -299 -169 -21 92 -914 -304 300 -222 -173 332 -39 -54 322 73 666 339 146 -168 44 101
5077 101 15 -148 -321 -25 -21 207 -136 -383 -25 -321 -223 -125 219 -4 339 319 404 -169 -281 73 326 -103
5099 -103 -126 -50 -16 -179 -147 112 461 -90 -85 71 -10 703 -214 273 638 -116 -524 559 -392 58 -206 -413
5121 -413 -97 -12 56 -251 257 226 -231 -220 295 42 910 479 15 -120 -34 29 331 321 21 -207 -144 -344 -18
5144 -18 0 23 216 -267 -537 -43 17 60 -51 423 -311 -8 -313 -114 -183 578 -204 -11 176 261 -185 29
5166 29 68 127 -58 -131 -13 -354 44 156 -62 -159 -335 -213 132 59 156 -520 -145 165 -26 -439 -198 -117 -296
5189 -296 106 256 -302 -105 -116 86 -106 385 16 108 255 958 -4 127 70 227 200 224 -167 -461 -266 -476
5211 -476 -220 -562 -269 135 35 123 -289 184 -67 -236 -60 -671 9 114 -272 -570 16 389 334 -443 150
5232 150 -217 72 32 -9 134 144 54 282 363 -504 -187 112 -554 -149 -251 271 405 -403 -122 -49 -53 157 -44
5255 -44 260 542 387 292 149 -59 -95 314 417 37 155 737 389 -285 270 327 636 3 467 -109 39
5276 39 -337 -406 390 359 -91 -328 526 209 -279 -223 3 245 -99 515 -25 116 -175 295 145 -203 -279 70
5298 70 173 96 -224 -394 182 -415 -130 -82 -114 -267 318 -421 -371 -263 290 -18 641 -77 -252 -177 -78 -88 13
5321 13 505 309 -169 474 -53 -480 301 -713 8 264 333 41 22 374 -148 -242 -52 276 29 -34 -35 389
5343 389 -54 448 -216 -242 -214 19 138 184 341 -193 350 6 -241 -27 -4 543 42 -433 387 -191 136
5364 136 -202 -645 31 67 17 163 -307 215 -166 194 -219 -284 -75 248 -214 -298 165 -236 -247 325 -366 64
5386 64 -446 -232 134 172 -346 -85 -79 245 371 208 164 487 218 56 -289 32 -250 -249 481 -288 -113 47
5408 47 -239 105 408 -31 368 -312 38 -446 -132 247 -263 430 -148 -63 -512 -155 462 -506 392 -103 -125
5429 -125 403 62 212 72 -276 -317 -196 230 390 -52 -146 -203 179 611 -143 -170 359 531 -189 58 728
5450 728 -17 182 -193 -222 -400 -658 -67 368 64 662 -154 -169 -546 361 355 -148 -325 291 432 -296 -98
5471 -98 -610 14 -204 374 -16 -126 301 732 -103 113 197 -290 -102 192 213 -231 -373 -403 456 -206 158
5492 158 18 46 187 54 34 -181 394 -463 -699 -349 -44 -68 612 -2 110 400 -360 -333 -92 -486 -188
5513 -188 -372 116 -89 -138 -168 14 273 108 -76 78 313 402 168 607 300 20 -115 129 197 -338 125
5534 125 -54 148 -33 520 48 64 64 293 -345 176 -57 -201 137 405 137 -73 -51 258 22 -203 -109 -734
5556 -734 -171 296 308 -49 247 155 18 474 292 102 -138 -371 36 -709 -170 404 151 403 190 -532 -480
5577 -480 -241 -151 -26 -16 117 -393 321 235 -307 -59 -237 -26 -352 379 251 -21 367 -266 169 -215 -65
5598 -65 -289 69 153 1 -561 -179 70 -534 570 -132 -276 175 -36 -245 -17 17 -56 130 91 211 -69
5619 -69 -150 60 -147 282 218 -170 51 344 88 -60 94 200 88 187 401 306 -52 -93 -60 -99 95 -203 -75
5642 -75 -244 189 24 -145 35 -142 -33 -296 -649 -192 295 -374 199 -140 -245 -164 13 50 -288 -562 220
5663 220 -176 -326 -276 -20 -307 33 216 123 -184 -132 -164 -166 387 -164 32 213 -51 241 82 349 -34 143
5685 143 18 3 -84 226 -278 -90 -465 115 478 190 -65 -275 47 132 38 -347 51 235 -284 71 -232
5706 -232 466 174 -209 730 380 -23 -123 112 297 122 -455 5 134 41 -105 454 -74 -37 34 -472 129
5727 129 327 -64 -325 241 142 127 -347 179 -77 68 -219 -158 60 -60 320 -85 -113 -199 -42 -541 193 435
5749 435 77 258 -16 130 -384 380 304 206 -401 -304 -73 46 500 -44 108 302 226 102 -489 -340 -639
5770 -639 -267 -214 -252 -93 -529 574 307 -378 306 -95 -17 -337 -57 -266 -1 -213 241 149 -289 99 -5
5791 -5 -543 314 -618 109 -168 -204 -152 184 -7 -27 -421 169 -353 156 -344 197 408 434 164 -41 593 38
5813 38 -172 91 -145 150 -160 -66 -270 728 10 159 117 -212 -191 33 -194 -329 -107 46 77 -93 349 76
5835 76 924 454 -152 -51 341 147 210 494 418 -166 -270 -83 336 -105 312 124 74 -147 188 -487 -6
5856 -6 242 -580 151 -88 222 -231 -188 -144 -103 178 383 415 22 -498 40 -419 161 250 -225 -541 245 -265
5878 -265 -355 -186 -28 -155 -95 288 189 316 -136 -708 197 -220 159 373 -219 -210 -199 62 -251 -50 389 -241
5900 -241 -183 311 412 53 -258 200 -210 635 34 -208 339 107 -195 466 -311 -436 -321 259 -483 50
5920 50 77 -226 311 -156 56 307 574 -361 -295 -458 -169 331 -671 328 92 -452 -427 -579 610 -71 -75
5941 -75 308 424 127 -366 -120 -265 -4 -38 -7 -44 115 628 -34 188 -366 -231 240 -308 -142 -314 158
5962 158 182 -599 231 -121 -205 6 155 24 -213 170 -77 341 0 109 -230 -260 155 -224 183 249 -73
5983 -73 -241 15 25 102 -164 109 62 427 -71 -317 -312 -404 -243 -41 259 180 -576 191 21 5 -157 94 248
6006 248 -13 -168 385 338 -148 412 609 -228 -308 -102 177 -537 -202 264 -54 -268 -492 -239 128 504 298
6027 298 89 -355 94 -198 -28 -119 -254 173 -334 74 -216 77 -286 -205 -241 -147 24 -78 -342 -217 -229 -263
6049 -263 -120 -283 81 -119 69 -154 -133 -143 -91 -46 369 -160 -102 -188 363 112 118 86 208 -250 344 276 -273
6072 -273 -246 79 -376 -323 118 -159 251 -430 -133 199 -225 -225 -234 -260 515 150 -27 470 -254 -452 718 -247
6094 -247 520 98 364 -495 267 -252 -25 20 110 -438 -120 395 -230 -564 45 -403 5 -173 -34 -184 -233
6115 -233 104 27 -110 160 -287 62 -452 411 -122 30 -44 -494 -16 144 13 124 -219 106 -75 -133 99
6136 99 -164 -94 78 294 -17 39 -141 -430 -392 -91 452 -184 503 -108 -143 132 30 266 -178 172 -289 217
6158 217 57 636 183 390 613 101 -490 378 -122 -237 -84 -382 11 126 -148 202 285 153 135 280 65
6179 65 143 -259 -70 78 14 597 -402 -285 -270 394 62 -44 -365 -68 121 -129 342 -49 -280 151 -6
6200 -6 42 -259 -253 362 327 -17 33 79 -193 107 193 423 -77 159 -226 35 116 -497 250 70 -31 326 204
6223 204 -232 112 252 -80 194 -108 -191 477 136 -251 -72 272 -100 -150 -307 -60 218 428 64 300 -143
6244 -143 -13 -251 165 -53 -163 -146 451 -77 -11 -198 -68 -89 252 15 -22 753 -474 -480 12 -142 331 216
6266 216 -57 -341 543 251 -225 -196 305 266 257 -203 -11 -98 126 -111 14 -306 -30 -387 -327 -236 -398 -204
6288 -204 -104 401 288 152 130 397 315 -215 -355 -71 316 -16 -49 126 484 -164 77 -169 -169 230 -156 298
6310 298 285 -180 237 -124 -80 -84 -309 253 -173 224 -101 86 -188 -115 -336 148 -122 -79 125 -593 584 -112
6332 -112 257 190 94 26 201 117 123 135 -136 401 -150 247 -141 41 -64 -163 354 118 -675 -234 68 -57 198
6355 198 -106 -133 -338 -86 507 -341 -283 194 -93 125 94 6 -188 -287 -328 -33 481 18 46 398 199 122 -31
6378 -31 429 -283 -166 351 263 -251 -199 -212 -422 -485 77 282 -174 173 -227 625 281 227 -109 144 -281 20
6400 20 -218 -61 36 -94 82 -30 -152 -683 269 -26 204 227 -73 187 540 218 -416 -193 -306 -269 -613
6421 -613 13 -149 285 221 255 -108 -392 -22 242 -144 1 -496 139 185 141 -227 214 7 -65 147 87 346
6443 346 82 139 -103 -367 45 0 15 -73 324 -41 -182 212 -20 60 239 12 175 25 -632 -520 6 -406
6465 -406 -174 -244 -356 -479 -2 172 158 -92 -99 -7 -46 -117 314 -4 -73 48 -374 98 520 -354 427 51 217
6488 217 230 85 -41 -151 96 50 -442 107 414 395 266 383 372 -39 -66 -75 -206 -372 88 -236 -95 -196
6510 -196 -106 -108 162 -133 244 324 287 -357 -247 -519 -70 -451 267 51 -85 147 131 54 -477 149 -16 290
6532 290 -7 527 -117 111 -210 -110 -473 344 -289 -450 -220 -170 -195 -615 -9 491 163 493 -273 -268 -165
6553 -165 -4 341 -46 533 447 129 47 -197 -478 601 -457 -177 154 -131 240 -88 -278 -20 169 -169
6573 -169 -450 -61 293 -7 147 -203 -173 177 -20 61 -82 -251 301 -119 245 34 -252 124 176 -127 -410
6594 -410 405 42 -114 -469 -116 152 51 -300 231 -258 -132 590 220 11 -196 -451 154 -30 110 299
6614 299 -343 55 239 44 -132 -770 -550 302 -55 162 193 66 -176 -15 254 -567 -93 505 -285 -23
6634 -23 365 -53 271 108 -209 271 -7 -554 -307 -155 702 -67 -90 -333 258 23 65 -212 -458 -46 175
6655 175 -74 -27 -116 244 -144 1 -126 -48 83 -122 -274 -790 112 -511 -270 -20 88 278 185 239 -325 -477
6677 -477 609 -272 -42 -332 127 -290 103 -21 354 -201 -255 88 208 -86 93 433 -67 62 161 285
6697 285 -30 -329 332 -23 -65 151 -224 53 -173 8 -279 207 -364 -165 -295 -170 486 -291 -51 177
6717 177 405 64 141 344 49 210 -374 -214 10 -48 41 -592 176 -111 51 322 -8 -349 250 -395 234
6738 234 17 -189 -129 -495 -245 439 -194 509 85 -323 -33 362 53 -64 -387 -90 -231 -197 17 -1 585
6759 585 111 -235 45 299 -446 -59 -77 -657 -29 -235 -318 -379 157 -420 15 8 239 154 -85 -230 -43 797
6781 797 127 373 -2 -283 287 -590 125 203 321 -183 394 -335 -254 6 20 -175 -722 158 -160 292 18
6802 18 -52 -391 119 397 -89 41 30 322 44 -17 522 -520 -61 -134 83 125 192 181 105 -225 -87 -117 -42
6825 -42 -348 -84 302 -265 58 -129 -279 -59 271 327 70 -26 -146 -12 402 286 -50 -48 -153 -31 -5 29
6847 29 212 55 784 32 455 -346 488 -256 -107 303 -255 -287 91 -115 -132 -138 -15 -182 236 -151 220 102
6869 102 210 176 -174 169 103 -325 -296 -159 221 -425 -157 -206 -273 -210 31 484 -410 -96 241 523 -32 -23 -200
6892 -200 564 450 99 -124 -89 -14 -155 249 -239 -153 -136 86 436 -217 333 -486 -101 21 327 -604 -139
6913 -139 273 521 -290 -364 56 749 -345 -168 -72 204 -44 122 -48 -271 54 -409 -331 171 -852 -460
6933 -460 -292 48 -144 -80 -154 -122 353 -286 -55 -192 471 115 -195 182 -175 271 149 152 -366 -3 190 -18
6955 -18 344 -103 82 637 139 31 29 -36 -271 382 -79 214 -38 99 -321 -49 -45 -328 43 -141 517 447
6977 447 -404 -490 157 -216 128 395 3 -494 159 -501 63 -256 -247 119 -232 -170 -51 -212 254 79 8 142
6999 142 210 70 198 122 -458 429 150 -127 305 -13 -370 -124 -35 477 47 -390 -438 34 -293 -406 72
7020 72 126 14 -59 -408 150 -12 -539 -219 290 -131 69 -55 106 94 33 34 -220 -308 178 48 -103 -264 -16
7043 -16 110 -40 -31 49 -96 142 -176 -124 -2 120 -66 379 96 -359 -37 520 96 -2 -164 -93 80 -64
7065 -64 476 193 143 -109 361 -320 -31 159 -467 174 -508 -12 -301 26 -182 -154 -377 202 -113 363 203
7086 203 -120 55 -240 -372 293 -330 3 87 435 131 -418 -574 317 236 0 -110 246 -27 55 347 429
7107 429 516 20 -71 -193 305 -87 -49 -86 68 335 -395 -331 369 28 364 61 299 295 -47 479 122 278
7129 278 -476 88 152 -24 -86 537 -464 44 203 -454 -252 -199 234 559 27 -270 -298 72 272 -152 60
7150 60 82 -245 362 591 -198 50 113 389 408 103 25 -342 -292 -566 -208 349 419 -329 -258 199 -254 420 80
7173 80 233 12 25 23 -137 612 301 249 -67 368 455 262 -209 297 12 432 -73 -242 -416 528 -44 -119
7195 -119 -474 552 -331 24 -209 68 -311 -36 336 -26 -149 -116 -146 197 198 -132 261 136 364 236 -175
7216 -175 253 -124 -16 -214 429 545 -86 -135 316 165 -30 205 -378 -61 205 -7 312 -108 -144 -140 -315
7237 -315 -610 164 532 269 143 -32 487 383 322 -134 -145 423 -287 45 525 -36 -2 90 19 -297 -300 -4
7259 -4 467 -19 96 93 81 -144 -634 -255 345 53 -702 165 -457 -299 117 335 112 -8 6 -474 342 509
7281 509 -32 -180 164 503 16 367 449 175 -419 186 486 -181 -119 -216 316 -83 -304 -290 223 39 164
7302 164 -88 452 561 -80 -80 -71 -280 65 -194 -199 -262 191 6 224 341 30 -66 173 186 225 -93 -17 -238 -479
7326 -479 487 130 143 -277 -45 -135 -99 308 88 -149 -327 -236 507 175 156 -330 -118 265 -171 -502 406 -233
7348 -233 375 -565 -230 -107 53 -97 -58 -195 43 -179 -190 139 167 -77 -105 -290 -111 395 100 -311 -222 -301
7370 -301 59 -164 -254 -251 -91 -124 326 199 -350 -206 -103 145 -736 340 159 -6 244 214 -174 194 115 45
7392 45 63 374 504 -237 553 327 -73 -407 483 -335 -330 -46 -329 70 -29 -226 -552 528 149 150 -96 74
7414 74 -86 382 12 -159 -200 12 37 291 -221 497 427 292 195 -246 227 185 -298 189 300 -13 324 -357
7436 -357 -356 -244 -65 -117 120 -118 482 -35 215 -112 44 -33 376 428 271 180 236 -661 275 320 350 253 629
7459 629 -130 380 33 299 -470 -318 181 385 281 114 441 -30 -59 297 -133 84 -152 -259 5 208
7479 208 164 -113 -156 484 193 39 27 -44 337 -176 313 310 42 -92 107 222 -635 -30 -168 -266 430 -243
7501 -243 8 402 71 441 -115 -80 112 443 79 180 -76 -406 -85 -330 467 199 260 -287 107 -66 -46
7522 -46 194 -252 -439 -19 196 143 -278 -264 172 283 -333 13 201 -64 164 566 188 -106 182 28 -95
7543 -95 346 -410 -236 -104 -583 -15 1092 422 -503 190 59 -4 -2 -50 296 513 30 -248 121 -19 371
7564 371 265 7 47 261 -276 367 1 278 -141 -41 17 -105 -21 -440 234 -132 -196 -242 -488 -261 37 649
7586 649 360 -198 100 512 -146 92 -17 349 -274 40 -91 194 -276 293 -54 -201 365 -251 -249 -184 -332
7607 -332 -9 171 385 383 -523 4 -160 -240 25 -199 105 110 86 33 208 276 -355 100 -443 38 511 403 345
7630 345 165 411 -459 -12 -240 203 -303 -126 139 -276 386 45 85 -529 320 -140 -215 -488 -347 -210 -22
7651 -22 0 227 -567 376 -298 -327 -332 316 -116 -6 -414 -120 323 17 26 -516 340 -249 310 -15 -301 422
7673 422 280 2 186 171 -55 -49 144 252 721 302 -495 469 140 -343 282 -182 -193 -218 -212 269 177 -183 99
7696 99 -359 258 -368 114 308 -549 -534 57 176 222 -126 -100 148 325 -252 219 -82 321 144 139 50 370
7718 370 -692 0 202 -455 273 -477 -217 -407 -351 -620 612 -20 -298 -289 -39 -289 381 -3 -95 -192 334
7739 334 304 -487 -112 361 437 -218 153 57 -428 4 -73 -266 -70 287 -562 -153 -336 43 -190 172 -41
7760 -41 -22 571 -106 10 -114 0 292 -105 -148 -133 -199 -305 725 103 -53 31 -169 -545 -245 377 -471 -564
7782 -564 -93 -602 -102 -74 207 421 -315 -268 -42 8 1 -78 -455 0 -411 -367 -596 -109 -144 139 143 -120 -146 -95
7806 -95 275 -16 -28 -245 25 495 -66 85 -257 493 -114 283 370 -112 -76 185 242 -159 -162 -209 183 -54 30
7829 30 452 -153 326 399 489 115 -405 -130 -392 481 516 -264 24 157 -120 -333 -180 -334 -566 160 -144
7850 -144 -352 152 -124 619 -180 493 -328 -172 84 491 -117 33 -424 690 -40 57 43 91 -278 -381 484
7871 484 93 159 -270 -106 186 -102 -257 -130 -466 98 306 223 81 310 188 -218 101 66 -223 365 434
7892 434 210 117 111 224 268 573 -128 -472 -72 285 -310 130 403 -597 336 -127 119 198 -181 109 19 110
7914 110 -84 -93 -307 -89 42 145 144 256 -44 222 72 -83 369 -182 69 -101 158 -508 123 -246 63
7935 63 -51 45 -163 585 176 23 -201 51 228 42 -521 350 93 -170 -490 -378 245 113 199 -469 85
7956 85 -110 -199 615 351 231 358 177 -703 68 128 489 203 -319 -97 -299 284 -54 -114 296 65 -251
7977 -251 417 89 665 166 -85 -557 -276 -22 204 83 -361 76 0 417 108 -498 175 -9 55 -306 462
7998 462 -479 -154 -436 158 138 265 222 -306 218 -30 -453 442 -2 -662 -194 195 343 -20 -104 -151 -399
8019 -399 -146 -43 184 96 -275 288 -393 -144 -85 94 -71 163 224 -98 495 494 -171 204 -258 317 -106 -183
8041 -183 16 -53 -165 -65 -386 32 451 -346 -108 -95 -82 128 -376 278 -70 27 -72 40 44 515 -329 612
8063 612 365 -495 267 -10 -286 -383 -147 241 284 7 -66 121 -5 -604 -146 69 -189 -27 651 -141 -412
8084 -412 -493 225 354 53 -183 -13 115 542 -178 -169 154 -21 283 81 -52 -29 -59 -215 7 510 460 -73
8106 -73 244 214 -113 144 -55 -270 196 -36 -482 19 -317 347 267 153 9 141 325 50 -183 -158 -143 -175
8128 -175 280 56 -120 274 171 -218 -438 134 158 -386 351 -156 302 -318 -29 21 238 39 678 336 -396
8149 -396 233 -268 179 284 226 322 40 -96 -171 142 265 371 -309 -98 232 243 -111 -202 99 252 241 -151
8171 -151 -311 -287 30 213 -112 -43 -362 114 -228 -23 -183 103 -59 -791 -461 32 -26 -15 314 -256
8191b56
$$ Imaginary data points
##PAGE= N=2
##DATA TABLE= (X++(I..I)), XYDATA
0 0 0 0 0 0 0 0 0 0 0 0 0 -32 32 -32 32 -37 64 -64 96 -128 128 -178 192 -229 288 -319 381 -434 494 -578
30 -578 646 -745 846 -949 1080 -1205 1356 -1523 1689 -1895 2102 -2334 2594 -2859 3169 -3499
46 -3499 3855 -4259 4683 -5164 5691 -6265 6917 -7629 8438 -9356 10385 -11595 12991
59 12991 -14661 16679 -19161 22352 -26564 32433 -41224 55814 -84568 163511 -872794
70 -872794 -3102420 -2901328 -1672964 364558 2118405 3056342 2476942 821176 -1217119
79 -1217119 -2556027 -2647680 -1366642 520933 2182210 2853938 2308794 691668 -1206598
88 -1206598 -2486256 -2491629 -1311300 470694 1976698 2550014 1913886 382973 -1348324
97 -1348324 -2441904 -2398491 -1248596 416004 1808877 2287811 1664193 232564 -1328865
106 -1328865 -2288187 -2170358 -1044459 533885 1809895 2215552 1585890 223760 -1229561
115 -1229561 -2069769 -1886579 -791464 661125 1795680 2114990 1475286 160087 -1198027
124 -1198027 -1941746 -1734269 -700433 658338 1696840 1930246 1262811 11856 -1242962
133 -1242962 -1903043 -1653163 -638466 635328 1575791 1754132 1090480 -92309 -1230411
142 -1230411 -1794944 -1522112 -541125 672865 1540180 1667414 1008827 -118049 -1176535
151 -1176535 -1665736 -1355874 -402442 733624 1515371 1580914 915166 -160795 -1140321 -1560943
161 -1560943 -1232695 -321508 733328 1434775 1459897 799191 -231249 -1144873 -1508741 -1157660
171 -1157660 -268828 729431 1364245 1344244 685928 -295609 -1133739 -1430416 -1052742 -189216
181 -189216 746522 1315089 1258495 611921 -316629 -1086748 -1334823 -947159 -111721 770264
191 770264 1281599 1188583 542219 -347912 -1059724 -1260113 -858190 -52593 770164 1221155
201 1221155 1093481 454672 -391765 -1045954 -1202650 -793834 -17020 755449 1159036 1008013
211 1008013 380091 -425588 -1026621 -1141804 -719912 33041 758526 1116239 942071 325627
221 325627 -437586 -985947 -1064190 -638292 87488 767306 1081974 888466 281506 -447926
231 -447926 -954819 -1001749 -571943 127862 762886 1034569 816699 218907 -474588 -937339
241 -937339 -953442 -520557 150227 742036 976868 744787 160865 -496651 -919176 -908117
251 -908117 -471812 180435 736911 935846 688683 117477 -506910 -887422 -844769 -405829
261 -405829 220994 738698 903511 641858 84745 -504655 -849207 -787510 -349959 252583
271 252583 732863 866386 591919 43037 -518239 -827687 -743253 -307894 271000 715620
281 715620 818406 532147 -3971 -533142 -807378 -701879 -268945 286387 698322 773457
291 773457 481772 -37462 -537038 -780019 -652701 -222280 307118 689069 741823 442003
301 442003 -62709 -530231 -744266 -604508 -178112 329926 678673 706396 403201 -87620
311 -87620 -530485 -715721 -562566 -143302 341354 661532 665143 356174 -116822 -532848
321 -532848 -693931 -525713 -112635 348532 641352 628381 315512 -142632 -530562 -666450
331 -666450 -487897 -80393 362031 627983 596255 282903 -161252 -525186 -636592 -446733
341 -446733 -47065 371892 613232 563158 250476 -179315 -519906 -610434 -411563 -21313
351 -21313 376644 594776 529590 214573 -199188 -515966 -587729 -380885 2807 380943
361 380943 575130 496937 183321 -215618 -509557 -560412 -347167 28123 386562 559857
371 559857 468670 157493 -226293 -499052 -532614 -313761 51369 390258 544636 440875
381 440875 130678 -237711 -490906 -509142 -286876 69351 389587 524054 410424 102569
391 102569 -251732 -484602 -487577 -262294 84622 387137 503544 380836 77593 -260715
401 -260715 -474304 -463300 -234204 103106 387975 489111 358075 59892 -263865 -461337
411 -461337 -437581 -205867 121476 389245 473400 335190 40007 -270620 -449897 -413814
421 -413814 -181786 133806 384192 452882 307861 18217 -278481 -441646 -394317 -162594
431 -162594 142902 377465 432545 281054 -2994 -285062 -431195 -373210 -140941 155363
441 155363 374607 415012 258995 -18755 -285907 -416431 -348898 -116345 169389 373154
451 373154 400200 239722 -32325 -286216 -401953 -326091 -95448 179245 367896 382443
461 382443 217438 -47825 -289517 -392178 -308246 -79053 185363 360056 363116 194189
471 194189 -65011 -292796 -380913 -289404 -63246 190599 351688 343860 174416 -78383 -291451
482 -291451 -366728 -269008 -44789 198086 345704 329381 157753 -86732 -288507 -351704 -247569
493 -247569 -27091 205353 339675 313275 140113 -97065 -286402 -338336 -229496 -13251
503 -13251 208249 329952 295651 120953 -108964 -286359 -327288 -213907 -1666 209675
513 209675 319905 277812 103205 -119111 -283663 -313986 -195897 13202 213616 312270
523 312270 262737 89520 -124907 -277761 -298274 -177136 26896 217640 304541 247831 75317
534 75317 -131072 -274129 -285424 -160997 37780 217837 293809 230266 58980 -139820 -271311
545 -271311 -274493 -147572 46550 217129 283024 213972 44201 -145553 -266400 -260500 -132083
556 -132083 57382 218445 274477 201285 33458 -148471 -258266 -244738 -115733 68261
566 68261 219882 266212 187514 22554 -151112 -253038 -232381 -102082 75000 216343 254283
577 254283 172273 8887 -157716 -248713 -222433 -92197 79997 212156 242515 157364 -2603
588 -2603 -160655 -242861 -210115 -79279 86953 210878 234384 146212 -10007 -160324 -233070
599 -233070 -195045 -64901 95742 210499 226236 135818 -16547 -159683 -225469 -182821 -54084
610 -54084 100259 206736 214870 121423 -28097 -163295 -220513 -174182 -45838 102156 199725
621 199725 202107 107425 -37104 -164620 -214493 -163604 -35747 106917 196599 193312 98023
632 98023 -42751 -162629 -204676 -149454 -23510 112396 194677 185144 89026 -48256 -160969
643 -160969 -195849 -136788 -13980 115548 190363 175269 77864 -55859 -160937 -189771 -128420
654 -128420 -7544 116556 184248 164026 65705 -62997 -161460 -182937 -118992 -609 117678
665 117678 178934 154835 57227 -67074 -158707 -174634 -108590 8585 120429 175165 146884
676 146884 49355 -70067 -155633 -166299 -97997 15673 121904 169416 137858 40743 -73542
687 -73542 -152787 -159367 -89900 21342 121449 163413 127896 32435 -77594 -151078 -152334 -81632
699 -81632 26651 121158 157585 119549 24210 -80929 -147494 -144579 -73000 32485 122183 152364
711 152364 111828 18154 -83119 -143921 -136381 -64314 37945 121432 146730 103597 10632 -85656
723 -85656 -140624 -129008 -56475 41642 120003 140799 94253 3827 -87300 -137754 -122047 -48639
735 -48639 46032 118571 134327 86773 -1878 -89295 -133751 -113936 -40869 51017 117941 129254
747 129254 79267 -7633 -88932 -128832 -106376 -33887 54854 116686 123128 71857 -13038 -90727
759 -90727 -125246 -99804 -27528 56796 113731 116443 63748 -18519 -91748 -120467 -93178 -21945
771 -21945 58674 111576 111111 57504 -22884 -92202 -117030 -86177 -15842 61551 109936 105655 51642
784 51642 -26344 -90502 -111766 -79640 -10303 64259 107711 100149 45690 -29269 -90486 -107532
796 -107532 -73712 -5156 65884 104921 93500 39070 -33502 -90143 -103486 -68984 -989 65760
808 65760 101022 88460 33395 -36744 -89101 -99731 -62779 3588 67258 98277 82209 27565
820 27565 -39254 -87455 -94247 -56372 7731 67686 95463 77625 23649 -40720 -85780 -89953
832 -89953 -51325 11330 67848 92316 72647 18903 -42702 -84349 -85711 -45311 14719 67946
844 67946 88693 67562 14240 -45005 -82792 -80929 -41720 17334 67556 85260 62511 10012
856 10012 -46617 -81316 -76426 -36629 20493 67036 81659 57871 5862 -47681 -78651 -72388
868 -72388 -32086 23234 66810 79144 53642 3397 -48011 -76462 -67822 -27993 26124 66292
880 66292 75442 49121 -374 -49187 -74049 -63886 -24066 27165 65346 72252 44943 -3056
892 -3056 -49575 -72225 -60351 -20173 28497 64110 68791 40705 -5828 -50441 -69876 -56682
904 -56682 -17342 30753 63008 65840 36929 -8848 -49778 -67245 -52677 -13527 32211 61609
916 61609 62615 33218 -10549 -49480 -64597 -49240 -10101 33733 60937 59075 30049 -13016
928 -13016 -50038 -62496 -45693 -7454 34030 59000 55134 25656 -14759 -49927 -60531 -42553
940 -42553 -4557 34907 57656 53164 22646 -17535 -49010 -58277 -38916 -1524 35765 56054
952 56054 50197 20401 -18529 -48200 -55540 -35711 595 36059 54811 46508 17164 -20416 -48421
965 -48421 -52563 -32353 2986 37055 53176 44097 14171 -22150 -47379 -50048 -28781 5346 36691
978 36691 51696 41281 11484 -23418 -46304 -48244 -26559 7325 37153 49619 38341 8876
990 8876 -24216 -45836 -45774 -23920 9256 37839 47598 36219 6994 -25716 -45343 -43021 -21019
1003 -21019 11356 37004 45536 33177 4249 -26096 -43559 -40707 -18292 12501 37162 44248
1015 44248 29415 1939 -26844 -43041 -38323 -15690 14134 36998 42558 27838 -95 -27655
1027 -27655 -41604 -36148 -12979 15330 36928 40445 25170 -2497 -28031 -40299 -34192 -10926
1039 -10926 16695 36514 38495 22474 -3677 -28182 -39177 -31748 -8738 17601 35802 36745 20280
1052 20280 -5730 -28076 -38586 -29734 -6764 18792 35465 34773 18132 -7295 -28769 -36787 -27599
1065 -27599 -5588 19230 34959 33444 15748 -8510 -29008 -35389 -25249 -3507 19976 34197
1077 34197 31458 14162 -9812 -28784 -34102 -23391 -983 20608 33183 29973 12326 -10538
1089 -10538 -28210 -32296 -21343 130 21279 32155 27710 10871 -11412 -28297 -31181 -19553
1101 -19553 1244 21246 31200 25979 8427 -13034 -28111 -29433 -18270 2682 21748 29973 24324
1114 24324 7466 -13109 -27208 -28821 -16066 4119 21365 29128 23131 5553 -14044 -27532
1126 -27532 -27272 -14329 5271 21934 27967 21594 4258 -14339 -26525 -24957 -12584 6313 21873
1139 21873 27106 19876 2689 -15432 -25803 -24390 -11398 7181 21012 25870 18263 1663 -16221
1152 -16221 -25240 -23034 -9862 8152 21435 24831 16777 361 -15832 -24698 -20939 -8063 8781
1165 8781 21283 24036 14682 -801 -16269 -23797 -19789 -6638 9756 21336 23141 13771 -2206
1178 -2206 -16496 -22544 -19214 -5884 9949 20417 21046 12172 -3262 -16429 -22666 -17576 -4603
1191 -4603 10690 20172 20782 10831 -4326 -16441 -21340 -16654 -3360 11014 20083 19459 9728 -4494
1205 -4494 -16793 -21391 -15028 -2555 11974 19348 18656 9065 -4942 -16577 -19949 -14378 -1700 11703
1219 11703 18849 17627 7435 -6471 -16123 -18776 -12568 -173 11586 18442 16172 6594 -6590
1232 -6590 -16388 -18087 -11778 161 12209 17946 15328 5736 -7044 -15595 -17136 -10244 1264 12470
1246 12470 17240 14591 4913 -7278 -15379 -16536 -9767 1844 12957 17262 13811 3704 -8174
1259 -8174 -15224 -16290 -8717 2435 12394 16143 12469 2713 -8219 -15218 -14879 -7859 2959 12406
1273 12406 15770 12046 2098 -8461 -14740 -13816 -7091 3979 12726 15158 10498 619 -8560 -14962
1287 -14962 -13618 -6011 3953 11934 14505 10192 272 -9149 -13951 -12854 -5149 4875 11840 13941
1301 13941 8953 -262 -9530 -13632 -12024 -4156 5493 12246 13474 7778 66 -9723 -12674 -10507 -3686
1316 -3686 5626 12009 12716 7296 -1460 -9670 -12202 -10362 -2747 5575 12125 11789 6613 -1649 -9600
1331 -9600 -12641 -9970 -1766 6692 11769 11849 5806 -2323 -9551 -12135 -8901 -1404 6677 11393 11068 4965
1347 4965 -3022 -9694 -11764 -7918 -210 7134 11558 9966 4357 -3743 -9368 -10900 -7715 -331 7370
1362 7370 10617 9652 3704 -4009 -9244 -10452 -6163 789 7431 11253 8667 2646 -4085 -9679 -10079
1377 -10079 -6420 1591 7287 10856 8575 2682 -5025 -9222 -9632 -5635 2317 7407 10289 7502 1684
1392 1684 -4635 -9423 -9319 -4886 2178 7868 9565 6797 1179 -5167 -9119 -8576 -4082 2399 7832
1407 7832 9524 6416 696 -5609 -9236 -8368 -3617 2792 7636 9116 5875 467 -5501 -8700 -7440
1422 -7440 -2973 2938 7512 9246 5437 -280 -5698 -8496 -7608 -2009 3297 7730 8012 4822 -698
1437 -698 -6137 -8705 -7130 -1493 3553 8031 7600 4549 -1012 -6146 -8412 -6381 -1560 4230 7700
1452 7700 7335 4311 -1369 -5602 -8133 -6045 -1424 4115 7434 7121 3854 -1690 -6005 -7114 -5848
1467 -5848 -996 4007 6816 7170 3030 -1955 -6416 -7914 -5001 -868 4458 6823 6173 3188 -2063
1482 -2063 -5984 -6880 -5029 -445 3708 7163 6100 2218 -1849 -6142 -6448 -4938 45 4208 6443
1497 6443 5650 2261 -1973 -5917 -6717 -3900 434 4362 6413 5203 1591 -2482 -5916 -5911 -4118 314
1513 314 3982 6226 5029 1429 -2417 -5420 -5725 -3379 887 4401 6212 4715 1833 -3175 -5383
1528 -5383 -5950 -3267 419 4370 5946 3927 998 -2817 -5767 -5399 -2189 1031 4316 5188 4393 421
1544 421 -2601 -5590 -5047 -2672 1525 4137 5586 3716 528 -2691 -5867 -4270 -2439 1675 4104
1559 4104 5341 3445 491 -2882 -4647 -4400 -2159 1486 4067 4992 3159 134 -3282 -5030 -4133 -1788
1575 -1788 2340 4641 4623 3208 -346 -3162 -4419 -3974 -816 1565 4389 4756 2757 -610 -3791 -5010
1591 -5010 -4047 -1139 2264 4552 4652 2007 -609 -3335 -4706 -3321 -894 2273 4247 4121 2450 -571
1607 -571 -2985 -4186 -3598 -609 2228 4221 4408 1644 -561 -3589 -4393 -3476 -497 2256 4127 4157 2346
1624 2346 -781 -3267 -4063 -2926 102 2308 3631 3660 1945 -1147 -2846 -3464 -3072 -127 2726 3785
1640 3785 3458 1574 -1558 -3265 -3777 -2792 -57 2270 3536 3297 1573 -1251 -2876 -3483 -1987 -373
1656 -373 2186 3264 3396 1080 -1657 -2746 -3255 -2410 -161 2159 3449 2772 1041 -1648 -3013 -2732
1672 -2732 -1308 412 2291 3169 2494 601 -954 -2731 -3407 -1788 523 2555 3135 2454 719 -1462
1688 -1462 -3177 -3171 -1973 488 2136 3333 2312 579 -1633 -2962 -2988 -1623 534 2768 2838 2232 494
1705 494 -2113 -2820 -2690 -1054 243 2587 3207 1927 637 -1795 -3089 -2413 -265 639 2234 3180 1746
1722 1746 173 -1881 -2496 -2416 -876 791 2393 3057 1614 166 -1632 -2703 -2161 -638 806 2267
1738 2267 3165 1535 -575 -2185 -2923 -1926 -967 1515 2158 2374 1376 98 -1673 -2621 -2031 -331 1463
1755 1463 2363 2568 1526 -285 -1624 -2496 -1889 -609 844 2365 2256 900 -666 -1933 -2676 -1715 -145
1772 -145 1026 2177 2195 988 103 -1644 -2640 -2032 -621 1041 2356 2454 1438 -555 -1478 -2066 -2023 -542
1790 -542 1153 2053 1861 1638 -133 -1578 -2145 -1474 -160 1500 1985 2341 904 -383 -1464 -2301 -1580
1807 -1580 243 1521 2205 1674 344 -701 -1954 -2048 -1996 301 1216 2044 1642 926 -1152 -1600 -1862 -1371
1825 -1371 147 1188 1854 1817 811 -772 -1772 -2385 -1107 193 1827 1566 1336 739 -664 -1924 -2088
1842 -2088 -1085 443 871 2060 1665 873 -790 -1663 -1548 -1012 219 1374 1734 972 442 -1016 -1189
1859 -1189 -1866 -1070 174 1063 1656 1087 616 -562 -1938 -1576 -606 615 1056 1636 1614 150 -1236 -1661
1877 -1661 -1325 -874 454 937 1406 1154 162 -1083 -1262 -1396 -818 698 1283 1673 963 262 -1086 -1671
1895 -1671 -738 -261 130 836 1272 490 -202 -979 -803 -1170 -320 609 1279 1298 487 -94 -809 -818 -1283 -514 280
1916 280 867 1350 1104 -39 -845 -1525 -1110 -592 506 1051 1115 478 -284 -924 -1126 -620 -507 927 821
1935 821 1019 675 46 -1262 -546 -304 -603 134 1322 1342 480 155 -558 -1275 -1198 -639 571 716 1108 632
1955 632 -277 -468 -696 -988 -130 833 702 1237 545 -52 -940 -1448 -1050 -180 537 1301 1080 720 -186 -692
1975 -692 -646 -482 -237 360 1115 918 393 -166 -847 -750 -962 -212 579 658 1072 380 -370 -1080 -902 -893 77 325
1997 325 714 602 434 -262 -766 -468 -942 -339 343 1040 1395 601 -359 -748 -723 -155 266 865 567 237
2017 237 475 -108 -827 -1029 -1259 167 620 388 863 758 -740 -855 -748 -34 60 285 1211 1082 516 -105
2037 -105 -522 -898 -1028 181 296 1032 1031 376 399 -1033 -725 -610 -225 564 679 829 46 -135 -766 -842 -389
2058 -389 376 276 585 951 608 -116 -552 -483 -484 -165 422 1026 623 414 -276 -313 -1068 -546 225 262 670 764
2080 764 178 -400 -286 -789 -227 55 697 502 754 154 -82 -382 -247 94 -54 295 -29 959 -356 -22
2100 -22 -709 -372 -286 -269 520 764 325 265 453 -671 -1238 -383 18 263 496 422 169 7 -606 -169 -981
2121 -981 161 87 601 378 184 -239 -243 -536 306 -9 119 192 325 81 57 -270 -234 95 -11 246 594 193
2143 193 415 -111 -605 -139 -1 -238 332 -14 -256 -203 143 199 -71 103 -278 394 583 254 -227 -771 -403
2164 -403 -638 -36 95 440 420 62 -158 -133 -338 -794 -73 -305 -181 685 456 -50 -244 130 -328 -554 -291
2185 -291 364 216 42 -19 -183 -171 -8 -269 536 728 382 691 -10 -325 -449 -451 -609 68 559 807 181
2206 181 213 -682 143 41 -142 21 26 -260 221 90 -451 -832 -454 -266 450 169 351 482 280 30 -114
2227 -114 -437 -3 544 -43 575 263 -163 -125 -171 -454 -223 -295 -47 287 655 -158 200 -114 -824 -245 -65
2248 -65 389 312 602 171 -372 -98 -8 -278 205 154 418 -153 71 76 -157 33 195 -275 494 324 87 26
2270 26 -385 -356 -139 189 -104 581 -133 -207 90 -416 -766 -8 -110 22 196 66 599 76 -71 394 -407
2291 -407 -26 -221 -12 44 442 -172 284 173 -623 188 159 -152 454 9 185 -76 -859 -122 -99 437 785
2312 785 860 -4 -280 -62 -299 -676 -301 153 599 -292 -93 -115 -115 -556 -334 -268 390 882 205 387 69 -354
2334 -354 -461 -523 339 319 306 785 192 -160 -289 -603 -92 -321 -460 -639 -107 554 -714 -778 -508 109 -363
2355 -363 120 124 141 270 -202 -847 -379 401 -21 -47 -80 38 -87 -359 -742 -273 -40 -180 -19 282 153 64
2377 64 -11 -519 -440 -454 -79 375 70 443 169 73 149 -243 -63 23 525 133 456 -235 -174 159 50 -120 184
2400 184 213 810 428 386 161 6 -448 -191 -422 179 141 117 124 -248 -325 -282 -151 -87 1077 -13 62 -6 -181
2423 -181 164 -174 333 -94 464 561 102 -402 -388 -470 -257 -264 226 170 486 333 113 59 -362 -71 -280 18
2445 18 499 644 321 205 -94 -338 -60 479 487 -230 313 -324 -175 -92 -118 -507 142 603 -108 195 468 151
2467 151 -474 33 -403 146 -52 553 558 -201 112 -375 -576 -31 184 -71 469 32 29 -137 -538 -119 219
2488 219 415 83 107 358 489 -244 -231 100 -74 334 598 513 192 4 608 -484 -637 21 343 299 318
2509 318 -195 385 299 155 -357 128 221 689 645 71 45 -122 -282 -283 -440 374 274 350 962 305 -808 -251
2531 -251 -654 -455 -152 485 591 -179 254 -64 349 222 -609 111 246 399 50 74 9 221 -365 -203 152
2552 152 371 -484 137 -355 -499 89 -151 -66 -196 167 770 300 -328 -396 -249 -31 18 525 271 143 62
2573 62 234 -327 108 -2 -236 -354 192 529 -11 262 -394 -656 -133 -164 231 223 539 420 2 -323 -622
2594 -622 -358 -520 -234 340 362 -289 538 -156 -136 -21 21 -152 566 29 117 145 -110 -453 -624 -180 -184 389
2616 389 208 412 -27 -468 -335 -381 337 -355 684 421 -363 20 -214 -25 -609 20 696 275 -103 293
2636 293 -302 -357 -1066 -8 13 227 275 405 269 313 -358 5 -224 -290 189 101 255 149 22 -369 -569 -519
2658 -519 -101 386 134 300 11 -150 -179 -192 -27 -225 516 174 71 -53 -97 -10 -358 180 80 45 383 -317
2680 -317 -158 300 -427 2 -340 -242 301 88 357 102 -65 -176 -188 -351 130 113 16 -195 357 31 265
2701 265 7 -190 293 113 -50 439 344 275 130 -375 -422 -177 -77 -186 -143 -89 -53 -396 -162 128 107 84 339
2724 339 166 -224 14 -195 169 66 116 -47 578 -162 13 -218 10 74 -112 -6 723 -13 -43 -460 -286
2745 -286 57 172 -3 71 87 305 249 101 -493 -580 -98 -195 -48 208 425 629 391 33 -123 211 -293 165
2767 165 -74 434 -153 -342 -460 -11 -36 231 376 -128 205 78 166 -113 38 108 135 -166 224 286 300 -2
2789 -2 12 413 607 -210 -228 65 270 237 101 -44 -221 -112 718 -127 319 480 284 233 -223 180 183 -32 77
2812 77 17 24 305 198 -400 217 -296 -276 131 30 480 366 214 -86 178 -491 -153 -295 380 455 -42 247
2834 247 -406 -561 20 114 -386 269 68 -108 233 280 -271 -123 -543 64 -184 139 494 -104 36 85 -363
2855 -363 117 -427 -60 201 299 -263 -307 108 -166 -527 246 102 -403 460 -47 331 -74 -519 -140 257 -140
2876 -140 201 -17 137 -356 -295 -23 -31 -176 263 -29 246 -242 -448 -239 -340 265 -267 546 561 107 -49
2897 -49 80 -35 234 -386 -192 312 35 314 -15 29 -535 -168 -200 -17 -286 -88 745 202 286 -209 -421
2918 -421 -347 497 99 -223 216 311 -203 -661 245 -91 245 -168 -14 -513 18 593 -129 282 187 151 -32
2939 -32 359 281 -193 526 -138 -659 92 52 535 190 -43 -330 52 116 -9 -434 -195 453 133 -182 -89 -139
2961 -139 -111 101 -108 414 -259 154 154 -125 -67 -484 -313 68 20 285 133 83 -319 -474 110 -353 -100 339
2983 339 135 260 -321 258 231 -359 -760 -146 9 114 330 10 386 -242 -231 -467 194 47 -259 205 413
3004 413 220 -390 132 276 -61 191 -17 -79 -348 236 250 306 -296 64 -152 310 -18 -438 -393 -80 -75 132
3026 132 -99 150 309 478 189 289 -419 261 97 -112 -365 656 345 -351 -100 -517 -649 110 -23 95
3046 95 345 527 -583 242 -34 -137 -206 137 -288 -15 728 939 -364 30 -106 109 -112 -160 -31 77
3066 77 -206 -155 -641 157 -34 -203 51 684 248 276 -257 11 -320 76 75 268 17 71 15 61 55 65 433 -318
3090 -318 28 -145 -85 -163 280 -37 -164 -246 102 -232 371 362 86 -139 -442 242 149 131 233 191 487 -107 -405
3113 -405 61 -769 -198 -13 48 -59 -949 -274 -161 70 196 -54 57 203 24 -11 276 -242 -388 1 -272
3134 -272 308 -104 241 296 307 -301 -153 50 -16 -286 -83 191 -15 -251 -187 94 321 279 112 -128 216 317
3156 317 -307 394 -402 -146 290 42 -378 249 -486 -267 -406 -303 -268 -598 70 92 145 -202 -468 20 90
3177 90 50 -44 171 -33 -196 76 -343 -320 205 216 -53 330 167 4 120 -84 264 -195 -19 767 -245
3198 -245 -12 -363 -328 -162 -389 -466 635 -143 212 -286 -141 -32 -444 32 201 249 -170 -21 -334 30 -272
3219 -272 363 -142 236 48 512 364 328 3 290 -510 189 107 166 -11 -49 22 28 -275 203 -10 215 -152
3241 -152 193 -172 34 -212 -346 217 511 -36 11 121 -4 179 153 92 -299 -293 -45 -256 -64 -24 123 180
3263 180 55 -81 386 -40 30 -203 17 504 211 291 39 453 17 45 -359 165 277 101 -209 36 -7
3284 -7 -68 87 122 508 145 -389 -143 -318 -589 269 -477 -53 -49 -198 -88 -39 211 -325 -331 303 383 38 -3 -56
3308 -56 -271 -318 -219 446 -86 -194 -405 -147 -135 -180 -350 308 -172 201 246 611 -111 -138 -331 266 -16 -182
3330 -182 -145 86 -33 252 156 153 130 68 -246 288 98 -16 124 -161 347 14 5 -373 118 77 -183 8 108
3353 108 21 -183 -237 -231 -332 -166 296 -227 -284 -46 -11 -181 200 202 -261 -88 -208 -30 8 327 18 -208 -119
3376 -119 -54 -671 108 531 233 81 584 -362 -26 -164 -44 10 151 223 154 -142 221 354 -19 399 -8
3397 -8 -18 222 49 -367 -158 104 -289 -81 5 -555 349 -122 -290 369 -83 -72 -40 160 148 135 395 -110 94
3420 94 -93 -3 294 214 -16 -167 548 -143 -53 -237 -46 459 273 260 325 214 -386 -233 -390 -170 -407 -430
3442 -430 128 -192 613 302 -433 -231 -276 118 -450 -177 282 154 -73 -109 -153 -260 11 81 72 -294 70 252
3464 252 -103 -699 28 -113 355 169 253 63 57 130 -155 -79 -311 -222 -155 129 -67 -150 137 -159 -346 -142 -522
3487 -522 3 40 -12 96 485 -489 -93 10 98 -116 -65 12 -99 -329 -97 -591 43 84 -171 -35 102 387
3509 387 -24 -9 147 212 242 89 409 212 179 -29 -267 89 72 -228 -423 361 527 194 -263 56 -454 -64
3531 -64 16 193 542 398 26 141 -120 75 -253 83 494 239 -676 293 248 678 -724 140 515 421 -140
3552 -140 26 -318 -97 45 -363 140 211 170 -54 -18 57 224 -256 -1 604 -215 50 330 -263 -88 -69 -46
3574 -46 74 136 -446 -537 -261 -120 -349 -269 -211 -308 220 33 -8 -476 159 -248 -288 -71 17 232 118 203 113 -29
3598 -29 310 128 133 131 9 15 121 233 -631 -75 38 -129 -227 3 423 -18 3 -71 224 -534 -213 180 156 -122
3622 -122 -168 592 -385 -375 191 -125 -435 309 -266 34 -204 -274 308 -61 211 285 -561 171 -193 25 266
3643 266 63 -537 210 114 -143 270 -129 -435 2 351 -262 -313 -486 -24 -82 -183 391 392 303 341 -277 396
3665 396 -713 87 -340 453 -483 152 -21 -78 -57 372 26 116 126 277 39 -272 -559 -110 266 98 84
3686 84 -157 282 48 -124 -468 3 2 22 169 283 -127 35 -412 -352 -116 122 -59 283 58 -202 452 -47
3708 -47 -443 -340 349 166 -97 -27 -381 285 147 -11 46 -113 -22 -83 -328 661 189 -139 222 -264 453 -155
3730 -155 -445 -104 280 247 -129 -195 -312 -82 -11 59 -104 -539 220 -49 183 -171 368 -471 -198 -452 -107
3751 -107 -278 37 -147 -93 221 -77 53 -156 194 -442 80 69 298 135 -37 -115 325 -424 -42 -386 -183
3772 -183 -51 -52 210 207 193 86 -96 -210 -8 -285 -250 -177 -536 -1 -98 -55 -260 -152 124 -476 -284 94 -433
3795 -433 -13 535 -29 340 -202 -394 139 367 212 255 -145 -224 -303 321 -23 319 101 -106 -253 -220 -180 -45
3817 -45 58 392 84 -226 147 -293 -569 138 -142 -180 143 -255 -210 -11 -64 -241 183 -337 187 -604 -13
3838 -13 -172 -131 268 -431 48 384 -174 145 518 -55 -129 -366 -252 170 -320 -84 49 123 383 -145 -185 -182
3860 -182 210 498 24 86 35 24 585 -308 7 -60 231 -150 -262 -157 77 -579 -211 192 -373 216 -203
3881 -203 -221 200 274 710 -175 -126 -48 722 -238 -105 601 217 -82 241 22 -192 6 229 140 -16 399 -134
3903 -134 101 281 -421 -95 -52 122 27 -39 172 117 723 160 575 -57 236 -153 21 -11 8 136 242 -27
3925 -27 -153 180 275 33 -198 -189 -255 -39 -173 35 -49 177 -460 -53 -302 -328 -159 110 -96 -35 -258 332 195
3948 195 -292 -63 -305 252 248 216 -209 205 27 -53 -46 -393 -13 417 117 -266 -234 -238 239 121 52 173 87 -483
3972 -483 -145 117 -174 213 -32 -143 17 125 -444 -216 583 -270 -129 434 -467 584 -160 -254 97 -189
3992 -189 272 -499 -260 -244 559 137 468 71 405 88 -6 18 -39 343 -346 -237 -210 108 -10 -6 -495 -70
4014 -70 47 -368 22 362 -64 524 329 -10 474 -239 28 338 553 320 141 -400 -255 -1 -155 178
4034 178 421 240 -316 -154 478 181 -52 -350 -19 -252 363 245 -393 -88 -193 -145 112 -154 -60 -352 -408
4055 -408 252 176 46 123 91 -47 -92 90 -116 329 248 -48 438 -176 100 176 -548 -133 359 -61 -231 144
4077 144 64 -161 366 -115 -513 -318 -243 435 467 334 200 -134 174 -404 -81 529 -135 -389 252 116 251
4098 251 10 -170 146 327 -21 -51 65 227 179 124 -611 253 -488 -50 -44 125 -280 -326 125 166 107 39 -42
4121 -42 209 141 -76 347 -381 221 -271 -50 304 -342 -137 -188 -389 24 9 -505 103 -21 -150 301 249 335
4143 335 95 -48 -379 482 -184 -87 57 144 495 427 120 387 -109 10 -22 135 78 -332 486 26 278 -204
4165 -204 -62 106 43 -31 -118 172 -351 -325 302 108 23 -61 -5 -274 109 36 -149 -297 -3 -371 23 -631 108
4188 108 314 90 188 246 -260 -35 -139 -256 255 -137 -5 268 89 148 -29 52 -163 -241 -40 216 238 -304
4210 -304 -143 -467 -76 213 -92 -286 -222 145 -146 -18 -4 -40 85 198 468 -591 210 363 -22 -76 66
4231 66 242 373 -531 -140 296 258 55 72 43 617 -104 -464 15 -208 210 242 166 266 69 -361 -192 -433
4253 -433 340 -9 404 -226 -515 -501 536 51 2 41 185 141 -173 342 -488 427 -416 140 192 23 196
4274 196 -381 -227 201 -272 -235 -332 142 -37 104 79 364 181 324 189 -280 181 77 162 118 354 -105 -350
4296 -350 -92 -6 49 184 -204 32 -107 101 -219 -45 82 -217 -153 99 -13 0 -100 -334 3 -256 -66
4317 -66 355 179 -112 -259 -148 435 -102 -223 -199 119 -355 -236 206 -279 579 537 137 -76 132 86 -143
4338 -143 -37 -93 154 -670 -100 159 -273 429 -23 -138 -168 260 -11 31 18 357 -421 -485 388 250 -133 10
4360 10 404 -305 -50 111 264 -37 -37 283 -133 19 -166 305 455 -249 -75 -16 -260 102 337 120 40 -171
4382 -171 109 -101 115 111 30 141 -404 -28 -265 -13 -131 -271 -73 58 -207 -167 -3 328 310 -214 79 647
4404 647 -237 328 64 88 115 98 71 -332 28 -538 -158 56 -12 291 34 39 293 -331 196 -227 103 270
4426 270 173 346 -113 -106 302 -505 -243 -278 -150 121 633 142 -529 426 -93 185 541 -90 27 407 569
4447 569 152 -191 33 114 4 -212 -99 216 613 4 -351 -139 164 18 -418 3 -222 -219 552 -311 379
4468 379 141 107 -399 -200 -195 150 421 283 241 -127 -171 -206 -122 170 15 -301 -110 -94 381 123 17 -523 -365
4491 -365 149 331 121 129 -252 116 151 -101 16 72 337 465 237 -303 105 130 127 -241 -289 -214 362 230 698
4514 698 372 513 521 -491 -509 19 -204 602 257 -169 28 -590 -473 300 -155 174 93 127 193 -884 -400
4535 -400 -185 31 278 -11 -251 -89 304 525 -214 -388 -107 -96 -541 28 -164 -152 -518 7 -20 -277 -418
4556 -418 153 210 225 305 339 200 266 566 119 -377 38 320 79 125 432 197 -400 144 35 -297 303 371
4578 371 195 4 173 -278 -218 357 439 362 165 -24 125 412 -287 -184 -19 202 297 272 136 260 -71 -55
4600 -55 271 -6 462 -174 -200 62 -104 -200 722 -61 -185 -8 -517 -109 -13 -139 -35 -31 -59 345 -5 -38 52
4623 52 238 -400 148 -65 111 -98 199 52 -200 119 -285 42 84 220 54 107 445 -365 121 -6 -423
4644 -423 465 819 306 129 255 378 -204 -631 31 -494 -307 250 521 -231 -324 -171 -19 102 -382 -102
4664 -102 -173 115 -87 16 320 -25 5 24 579 -181 189 344 -236 -234 140 -272 -345 280 4 91 408 25
4686 25 -360 -529 162 25 -169 47 -38 -100 127 -277 -261 64 106 -468 -307 -101 102 -22 130 -101 -610 92
4708 92 146 -269 -563 -182 -16 -93 77 -105 -474 435 79 200 -266 150 -253 -161 142 192 146 -15 -123 -28
4730 -28 4 -176 39 -371 443 320 -395 -297 101 227 403 -301 221 222 -157 112 241 -337 443 110 -360 -103
4752 -103 -42 265 -541 -282 569 232 -60 317 -210 -169 347 327 -86 -270 679 58 440 97 226 -139 91
4773 91 162 133 48 -192 649 -141 -87 1 -309 -395 -23 47 -35 -767 -227 505 157 191 -420 255 44 252 288 -141
4797 -141 -39 -595 -320 275 52 -344 -64 -196 337 0 -150 -389 -150 -284 113 124 25 106 -209 158 315
4818 315 -149 246 14 -80 -163 8 199 87 -370 338 -377 -183 -191 32 -505 -347 546 -126 -112 47 -20 313
4840 313 -294 -80 208 296 -260 311 395 243 69 272 -314 -967 42 227 237 20 -268 -224 120 -95 36
4861 36 96 -27 28 -235 -45 -146 -575 -181 337 235 -231 514 430 -4 296 47 -248 -87 47 -184 -305
4882 -305 490 260 -278 474 -114 -224 124 457 -105 135 -369 -71 -8 41 -332 247 -462 -352 222 -129 -460
4903 -460 -226 163 -1 45 143 67 80 -396 48 -126 -136 -236 79 510 -639 -116 -189 204 -158 -149 -674 -158
4925 -158 497 76 -347 119 -327 -49 50 69 -14 -53 -146 99 -506 -391 -26 279 -107 -478 -190 536 -104 -183
4947 -183 292 84 -468 -290 -299 -55 107 63 98 -34 -468 -222 -346 172 137 -16 -296 -138 413 234 545 -449
4969 -449 -229 -282 224 383 -72 -251 -15 67 247 217 126 -35 250 -133 -238 192 386 135 -248 -27 348
4990 348 -68 -302 -331 -247 -215 -93 432 178 108 167 -141 -246 96 203 228 170 19 -168 649 -126 465 -243
5012 -243 165 63 276 580 -142 -100 126 213 525 165 -150 -336 -309 23 -168 208 -144 -54 381 -143 286
5033 286 -78 -56 -68 215 -67 -188 280 181 26 199 166 -248 314 -154 -99 183 -180 78 491 -54 -460 -389
5055 -389 -75 269 42 93 31 18 230 449 69 111 -509 244 459 24 105 -36 194 -478 181 -196 16 -235
5077 -235 -707 -176 336 -183 -100 -5 -184 362 52 -360 245 -50 -72 46 -452 -394 -299 329 -304 311 -271 18
5099 18 -652 -219 -224 21 -87 239 -244 -582 -420 52 243 37 292 -229 365 -206 189 -14 86 -175 -62
5120 -62 -316 -360 366 -375 141 475 -177 -216 -308 -185 430 -235 223 135 -165 -24 398 -199 293 -258 340 659
5142 659 54 -288 -112 596 465 -402 154 50 -686 -353 342 126 453 -273 -164 -2 -30 -381 -244 78
5162 78 -569 -153 235 639 183 136 -30 -239 362 12 -300 -72 76 -187 -1014 -297 -281 116 316 -57 -146
5183 -146 194 353 39 -107 34 -7 -396 -898 -192 103 -423 130 160 240 319 -160 -189 184 97 -60 311 211
5205 211 -155 -38 343 109 -247 -68 440 87 -128 -312 -449 -94 -438 219 -106 579 -329 -521 333 -257
5225 -257 217 115 214 80 -365 -231 -177 -102 -161 -79 111 -25 243 265 132 645 44 -478 21 36 4 335 32
5248 32 -342 -528 -171 -165 227 296 -505 82 224 542 -446 759 -142 249 295 466 -554 -409 -257 -115 -766
5269 -766 74 212 -107 339 376 349 -400 -53 -238 -431 406 278 65 119 -48 289 533 -226 257 76 -218
5290 -218 220 -168 -188 380 282 109 -376 -277 539 -78 -105 -182 251 213 172 -58 482 129 -340 81 312 67
5312 67 -486 -407 103 -537 -335 303 -167 77 74 -292 992 263 -92 195 -100 -218 202 -128 348 139 162
5333 162 -9 176 32 -57 396 -365 177 292 143 266 345 88 20 402 -346 -401 -265 -192 709 102 109 -127
5355 -127 -340 -479 607 -2 176 -107 -126 -482 459 -441 -755 228 189 413 -242 -425 -157 -279 33 -145
5375 -145 83 240 7 -100 -144 47 -377 -171 -251 455 -226 356 190 68 260 -336 -266 -106 78 -149 -60
5396 -60 246 210 -100 120 -74 -56 18 -88 48 105 -65 -420 397 -195 450 -154 -5 -180 330 150 -94 227
5418 227 -520 -65 173 -244 54 -359 125 -368 251 -139 270 237 50 -264 -398 689 146 -277 155 353
5438 353 43 -76 -71 -71 187 -315 3 -132 193 209 -81 -152 109 318 102 -97 23 -387 157 301 -294 245
5460 245 -498 -292 -368 -140 -497 52 -96 -570 13 533 -268 51 -223 349 59 -382 -284 -462 451 684 7
5481 7 78 99 248 206 35 709 49 -476 564 -265 -251 246 -118 -260 241 104 311 208 -269 107 219 405
5503 405 56 -266 134 443 354 -293 501 -33 -4 39 221 114 267 221 91 272 89 56 122 68 -763 -651
5525 -651 -27 -84 45 -14 6 -291 -45 149 537 117 -115 -111 -367 335 14 107 -52 360 17 -3 461 -183
5547 -183 -103 -190 206 171 291 323 -237 -52 271 -168 -312 -419 -219 383 257 501 -468 2 -727 102 283
5568 283 105 251 -23 -496 56 203 -207 703 -178 -257 -93 472 -111 -715 -111 10 375 198 70 295
5588 295 43 129 44 -208 -313 -592 297 643 -745 -318 559 -79 344 385 59 25 89 206 211 116 300 -475
5610 -475 510 -50 477 191 216 -123 -269 -257 209 193 112 450 -100 -328 -16 89 -196 183 109 449 249 111
5632 111 -360 486 297 -17 3 199 347 71 -287 14 -17 -394 17 -115 -358 -93 -508 145 26 -22 116
5653 116 325 -208 85 48 -199 438 232 50 262 -215 119 -270 274 -153 274 -130 -96 219 44 107 98 311
5675 311 -423 -258 -192 -35 511 -95 -116 -5 -181 331 285 79 -450 -321 39 -368 136 -372 74 151 21
5696 21 -179 -60 -138 13 -138 -8 368 -486 50 -44 155 319 48 25 508 -392 569 -286 -4 482 91
5717 91 -132 -65 -60 -62 -261 -16 -5 246 473 -63 -274 315 -248 -119 -74 -241 387 -228 -210 25 271 112 -298
5740 -298 207 86 177 175 -166 -265 -321 -62 -154 -311 149 -250 -236 155 519 -168 528 -276 297 -264 -19 410
5762 410 311 252 169 350 138 -53 -441 -256 286 436 252 -23 261 -157 333 -161 112 39 -2 -264 292 233
5784 233 -311 -102 -269 -228 -234 -62 -5 241 56 -314 180 -102 -135 137 -70 160 113 276 -177 274 -381 273
5806 273 -97 -575 399 518 120 356 -72 325 304 75 -598 105 -48 371 -145 -49 -58 -97 388 -512 176 257
5828 257 257 107 -157 -109 -104 -53 -71 99 235 -313 -631 -177 -26 297 -35 -155 -71 -651 75 -53 -213 -39 263
5851 263 381 -234 -17 119 142 233 -39 -153 457 38 -75 34 -168 4 -444 -35 -553 83 -361 264 -486
5872 -486 -209 -77 191 -156 230 -68 309 382 358 15 -121 335 -8 864 399 -111 84 298 -320 -76 394
5893 394 227 -402 -50 224 -209 -283 -156 -136 -100 15 419 40 322 96 -90 99 -208 -400 -25 147 202
5914 202 -170 443 432 -130 -492 -80 264 727 -286 -289 -152 -167 -395 -238 379 -96 -89 544 -292 -125 348 -239
5936 -239 -429 -188 93 -597 -362 -279 -558 243 295 139 -203 24 -113 -242 -321 -670 -269 -73 130 295 -67
5957 -67 -568 198 371 -291 293 -278 113 -829 189 305 44 298 -70 202 397 318 -395 38 412 -62
5977 -62 30 117 621 -506 -360 204 -469 174 -2 -140 -292 209 -77 236 67 157 -386 23 208 -276 -21
5998 -21 20 271 242 159 -141 -465 -89 463 108 -98 61 -490 274 56 568 176 20 -745 112 343 23
6019 23 -263 -264 113 285 -150 27 382 -239 139 45 30 -329 -201 54 -159 262 168 -18 -402 513 122 150
6041 150 309 -21 -641 114 50 72 -84 -387 -444 -3 -170 -136 -75 25 90 251 296 -224 -389 563 -345 -461
6063 -461 31 -85 101 267 -105 -362 -720 300 -59 -2 82 83 -216 -185 -50 -140 215 37 -166 -184 52 62
6085 62 188 110 -426 -307 -81 -233 -440 325 146 -295 122 407 223 -160 -123 -180 -429 -151 428 -119 -23 -100
6107 -100 -202 -349 389 -299 -551 66 392 159 -358 -234 -45 101 293 -111 -242 -237 318 28 -279 303 36
6128 36 287 -160 -38 436 393 -1 -207 171 274 -297 -55 254 69 59 -486 -240 148 203 -16 230 -271
6149 -271 505 252 -3 -92 -211 260 253 -97 59 399 -25 -211 321 290 437 202 389 -139 10 -353 -41
6170 -41 414 461 268 -251 -224 -147 -400 38 269 -114 125 177 -79 -181 403 -251 161 -494 282 374 449 50
6192 50 -217 -343 141 -91 -128 -97 -28 108 -742 95 60 233 -505 416 -449 -159 273 -207 59 32 -237 231
6214 231 276 352 270 -67 -233 -122 -45 272 68 181 176 124 -472 102 -124 -86 129 175 63 -492 -174 -367 -103
6237 -103 474 -161 -5 -347 -76 94 145 11 359 -129 247 -108 -68 547 -535 -76 -623 -192 174 2
6257 2 -168 160 -105 -218 -196 -697 -168 320 -139 -11 95 -124 165 -610 -473 300 -15 -134 -5 414 410 210
6279 210 280 -165 73 150 585 323 -14 188 -46 5 -124 521 35 -389 -87 -423 -321 -60 73 -215 204
6300 204 -197 -29 -75 -68 -134 352 113 275 -131 -174 71 197 363 228 -273 737 171 35 79 -182 -260 17
6322 17 -83 786 316 -115 293 -122 314 379 235 -393 486 203 121 178 282 132 -39 -436 95 317 169
6343 169 248 -280 -260 -211 -454 136 161 -419 231 -203 85 269 101 -393 1 -237 279 193 -412 427 -31 -300
6365 -300 -242 367 95 68 253 -453 -43 -309 -130 -16 26 -337 -331 -283 9 219 304 -62 81 -560 -584 15 -32
6388 -32 70 172 373 -243 -78 124 177 -35 -596 805 303 -324 189 -411 -160 67 230 -247 -608 -22
6408 -22 -68 -146 -482 -170 220 -200 -396 342 -100 -366 191 39 -275 -181 116 -126 -235 -35 -442 64 146 -269
6430 -269 50 726 -109 -263 23 -44 378 13 378 435 -363 -291 -188 -23 -74 46 -84 147 120 -142 490 82
6452 82 218 -62 17 -119 109 -255 -3 -140 -81 299 -82 -257 -117 -92 379 283 251 -730 673 474 83 -137
6474 -137 -377 132 -78 74 -161 31 -124 -624 350 97 -164 -402 -422 577 -246 208 -358 -62 -46 -207 208
6495 208 -58 130 -121 -169 -21 451 265 -346 -302 -491 -5 14 -146 298 84 494 192 -429 -202 76 -306
6516 -306 152 147 46 184 -76 -264 -85 -42 112 -77 263 367 160 179 114 195 -249 265 -87 46 223 -280
6538 -280 -536 195 -107 120 194 161 514 -452 -151 90 -109 -11 307 203 521 57 -153 -234 103 429 149
6559 149 141 -46 76 198 -72 -49 -36 91 -149 -116 438 304 6 46 -118 142 -143 259 -187 361 -116 220
6581 220 196 -139 213 -487 215 -152 -425 -22 -299 -381 -523 263 -47 312 310 233 159 -67 167 -56 28 -87
6603 -87 -232 223 530 66 395 428 436 -198 -1 115 63 -198 58 -395 -312 158 102 103 382 -109 196 233 -118
6626 -118 163 -213 -119 -326 61 390 -337 -155 495 422 -21 118 143 1 141 -54 -587 -468 302 378 42
6647 42 -202 54 -7 227 -273 44 82 -67 182 -160 415 -189 326 81 334 -407 -87 -151 174 -211 -218 -302
6669 -302 -53 -91 -153 -332 -823 -439 120 -155 420 -75 -320 -179 155 -125 -420 -243 -153 515 -134 81 -18
6690 -18 105 511 -665 -552 12 -209 15 122 299 -28 122 -113 204 46 -259 -94 18 60 -126 160
6710 160 93 -592 211 -115 -65 441 -132 227 -32 -217 304 147 128 162 -324 255 78 626 -129 -8 753
6731 753 343 -443 716 247 -68 205 170 466 92 -638 -315 -79 -601 222 -3 320 11 -233 -216 349
6751 349 -345 -4 259 -5 -47 -520 -237 -240 -454 425 25 -129 15 -266 275 -213 351 -325 193 68 -250
6772 -250 104 -281 177 -394 35 -36 -324 326 -37 111 240 133 165 51 158 -380 -70 -536 397 65 297
6793 297 -3 18 44 239 138 -214 13 111 -15 356 -378 229 -425 215 -182 -110 410 -398 -426 340 -11 339
6815 339 202 -210 452 412 145 21 -12 -18 382 540 -512 243 -245 251 -43 -184 -346 13 -6 279 -276
6836 -276 294 711 -483 -132 490 552 -186 359 -160 34 392 -85 -4 351 -329 256 -15 -261 224 127 708
6857 708 145 439 171 -356 144 173 -79 -160 344 -12 -346 378 -197 -183 168 -58 -338 209 214 -205 199 -85
6879 -85 353 -22 -36 -7 315 389 -200 -144 -2 116 -188 -142 -230 50 -69 -105 95 27 38 7 -383 -113 100 -129
6903 -129 -561 373 -597 526 -288 464 -358 192 -19 -68 64 -383 -224 -523 260 -385 -20 -29 -10 96 -441
6924 -441 247 755 -97 -26 332 -507 -135 48 -128 43 143 -491 -289 -137 -467 -372 104 78 436 -353 285
6945 285 -30 53 -502 -316 -236 -5 609 -73 379 163 231 19 -89 279 87 38 -36 -14 113 234 554 -257
6967 -257 -177 257 -103 -246 112 163 114 213 169 76 -437 -31 418 473 -384 555 -642 459 -211 318 -375 -409
6989 -409 -688 -190 284 -131 432 -187 124 13 -209 -282 443 102 -226 -187 141 66 -457 157 223 -154 405
7010 405 -219 -114 166 -167 74 494 -373 28 -152 -423 168 -288 76 338 -207 -7 -19 -171 128 -13
7030 -13 -346 308 -298 -934 -371 228 -63 272 -414 10 180 21 222 186 -69 -170 -272 -29 -444 280 -382
7051 -382 192 487 -253 226 353 -330 -28 -146 68 -68 -149 -100 317 155 23 97 -475 121 -121 169 295
7072 295 -32 -314 -2 282 -89 522 576 -77 2 -391 -29 -473 -13 372 -22 -298 -326 320 -140 -435 436
7093 436 -620 89 -227 -174 -523 -15 123 1 -47 164 131 309 14 81 394 -424 -194 -217 121 -199 -238 -70
7115 -70 -124 570 -225 124 -181 -197 30 139 505 -36 137 -15 26 -251 140 695 -95 -107 80 -38 518 336
7137 336 220 -237 216 -258 -91 28 252 189 467 -15 -105 63 111 74 145 171 608 313 305 -562 125 159 -145
7160 -145 28 492 264 -151 20 -97 255 -208 325 -10 661 341 169 -348 324 263 -80 253 14 441
7180 441 294 -6 273 382 -661 -263 -76 130 -379 -44 -362 29 758 332 -601 -62 12 -270 282 183
7200 183 -15 163 194 59 105 -287 180 -178 -415 120 -95 -226 -254 151 -65 -283 -326 -62 187 116 -446 251
7222 251 4 189 242 646 -512 213 -103 -240 -177 241 -373 152 -505 467 160 131 -86 -445 141 -138 -261
7243 -261 -282 461 -100 -331 159 -171 -7 566 30 -200 -145 47 -419 163 -106 -100 973 144 374 -123 221
7264 221 144 325 -323 -52 151 -277 -227 -85 -119 -484 451 -649 43 -179 203 275 -151 217 127 57 -134 54
7286 54 77 226 276 -52 -125 -21 -421 -331 337 -64 -71 4 -156 -45 -272 412 323 -696 -145 50 -387 60 -286
7309 -286 231 -190 421 -40 62 88 -193 -98 96 -45 -56 -380 -311 392 190 461 474 145 337 127 -266 147
7331 147 -270 -337 -82 27 543 -124 294 -295 -516 -319 -79 228 157 29 113 -89 214 -176 468 196 -364
7352 -364 305 -86 292 -28 -117 277 -28 79 382 -322 51 -273 -204 251 -195 -218 204 82 -140 -5 -108
7373 -108 -22 -160 -161 -492 192 165 553 -87 -403 23 -278 500 -205 89 234 -19 173 179 -300 -123 -108 273
7395 273 -84 -223 -414 264 660 170 69 113 62 -75 118 89 262 -317 -603 -191 -93 -174 319 75 143 -81
7417 -81 -318 580 143 9 281 -143 -123 -51 -85 193 334 -132 257 -87 143 -317 -392 -185 50 203 254 -291
7439 -291 -415 85 68 377 71 -258 -81 -178 263 -124 153 115 277 -14 236 124 657 145 166 455 151
7460 151 673 216 137 -443 524 -589 -107 186 8 -41 -783 562 180 -25 -453 63 -465 -470 -304 269 314
7481 314 61 92 131 -7 -135 350 -134 12 53 87 -449 203 218 -533 -41 436 193 -330 -498 228 223 -542
7503 -542 402 -204 -253 343 -389 -102 -140 -220 -385 -247 -463 127 -40 119 495 161 -318 -108 -60 322 -412
7524 -412 84 59 -907 -66 176 320 -208 128 419 22 -425 126 -199 64 15 71 -115 -122 -409 -120 221 -30
7546 -30 -93 77 -446 -222 617 -211 -129 202 -198 -264 -570 -34 -129 -365 -73 -352 89 456 -108 305 -438 11
7568 11 -220 -155 -3 346 -251 -51 111 -299 -107 -19 -445 31 383 -458 57 -115 -444 -493 110 -97 326
7589 326 -1 381 -387 -167 -82 397 -18 315 186 -270 99 267 -11 -602 -228 -127 47 -31 -724 -483 -142
7610 -142 -717 -352 -165 -277 17 -344 -437 335 -241 75 294 -115 -40 -206 -259 71 -116 42 -8 -196 359
7631 359 254 -178 548 -167 210 -133 132 460 -97 110 -171 174 -314 281 -162 -195 36 559 -163 132
7651 132 239 -131 105 -211 -100 -237 346 525 -86 -66 -487 44 -52 431 -44 -425 180 343 -324 -118 -70
7672 -70 -436 242 -520 24 -143 -109 95 -185 665 -346 -356 256 -180 487 406 -41 178 -271 -591 221 137
7693 137 -160 288 47 159 -255 308 283 -184 -5 6 307 59 -199 -357 -202 97 -5 -74 277 -132 -281
7714 -281 -194 -162 -591 101 420 -302 -5 256 -228 274 8 -234 146 -31 -255 121 46 572 366 195 241
7735 241 218 25 -124 149 -317 -315 18 -97 -223 -58 -246 -366 184 -331 435 261 -341 275 -128 -19 -462
7756 -462 34 -139 240 292 -174 95 81 505 -77 413 -82 408 -353 100 -215 368 -586 208 -154 509 -457
7777 -457 -165 71 96 -286 -131 -179 114 102 309 168 -158 420 17 -54 -394 639 73 130 76 -193 391 -136
7799 -136 -119 136 -473 263 -84 381 22 -175 231 -494 145 207 224 218 -38 -138 443 -142 97 -127 318 556
7821 556 -5 562 37 -335 5 -412 -184 -78 26 -170 -408 -404 96 36 -338 -1 -103 -52 -368 -325 427 387
7843 387 -187 -220 -127 619 294 -208 248 110 215 597 -213 -395 -17 207 -690 -68 -112 -20 -79 91 -359 -131
7865 -131 302 532 -4 -459 5 -176 218 -370 -101 47 -722 746 27 -148 328 -401 234 -141 173 42
7885 42 112 40 -253 -482 152 270 -136 -107 78 102 127 -132 -448 -166 54 -118 168 -187 43 -216 86 281
7907 281 -411 -256 -206 70 387 -153 -302 -687 -282 81 -223 287 -521 289 341 74 -199 -150 78 -325 -476
7928 -476 133 -209 118 157 352 -38 59 -173 229 113 -112 249 233 17 572 84 -194 250 16 133 -254
7949 -254 -365 147 -104 320 -168 -463 -121 -84 -55 7 -60 247 -417 -181 160 -393 243 312 120 377 -51 -69
7971 -69 -199 -456 118 51 -67 118 286 -168 198 408 -170 244 343 439 -87 -238 267 -686 0 -384 -126
7992 -126 -193 731 128 -171 -271 -53 -482 -193 -65 -235 -514 30 -139 166 69 428 96 145 93 -61 616
8013 616 84 -212 228 560 -36 -140 -234 -133 -99 331 37 370 371 524 26 212 -75 -60 -35 -244 -394 -547
8035 -547 21 344 203 -169 -142 16 168 -281 -202 -337 -194 -138 132 -385 -246 292 -259 239 9 -20 -249
8056 -249 167 -212 242 -44 -476 90 -85 567 -153 267 157 -22 -240 165 -143 98 -158 -87 -192 -380
8076 -380 2 -142 267 96 408 -28 -144 -485 -208 -101 123 11 302 445 370 -433 106 -69 183 8
8096 8 -576 -321 -25 -60 -185 478 -51 195 -323 103 -27 -276 -166 -368 -115 14 570 -645 -142 -338 435
8117 435 76 14 497 -78 256 -448 168 297 -110 -170 14 -412 21 -5 -49 -143 269 547 58 -123 -74 167
8139 167 -69 -255 -278 -150 -230 -29 -212 145 183 -172 416 -138 97 -153 156 -187 7 141 2 -481 -107
8160 -107 340 -275 -29 -84 63 107 -28 199 -164 216 52 138 -37 -63 -257 -374 -131 -50 -510 -173 -95 -290
8182 -290 426 311 -226 -277 291 122 438 -333 232
8191B32
##END NTUPLES=NMR FID
##END=
