##TITLE=1H_SR147_k
 D2O
 8 sc, 
 26.10.2022
##JCAMPDX= 6.0         $$ Bruker NMR JCAMP-DX V2.0
##DATA TYPE= NMR FID
##DATA CLASS= NTUPLES
##ORIGIN= UXNMR, Bruker Analytische Messtechnik GmbH
##OWNER= root
$$ XWIN-NMR		Version 3.5
$$ Wed Oct 26 16:45:29 2022 Russian Standard Time (UT+4h)  she@DPX200
##.OBSERVE FREQUENCY= 200.1313499994
##.OBSERVE NUCLEUS= ^1H
##.DELAY= (6, 6)
##.ACQUISITION MODE= SIMULTANEOUS
##.ACQUISITION SCHEME= undefined
##.AVERAGES= 8
##.DIGITISER RES= 18
##SPECTROMETER/DATA SYSTEM= spect
##.PULSE SEQUENCE= zg30
##.SOLVENT NAME= CDCl3
##.SHIFT REFERENCE= (INTERNAL, CDCl3, 0, 15.7039)
##AUDIT TRAIL= $$ (NUMBER, WHEN, WHO, WHERE, WHAT)
$$ ##TITLE= Audit trail, XWIN-NMR		Version 3.5
$$ ##JCAMPDX= 5.01
$$ ##ORIGIN= Bruker BioSpin GmbH
$$ ##OWNER= she
$$ F:/spectra/data/she/nmr/H-F/1/audita.txt
$$ ##AUDIT TRAIL=  $$ (NUMBER, WHEN, WHO, WHERE, WHAT)
(   1,<2022-10-26 16:44:30.98 +0400>,<she>,<DPX200>,
      <created by zg, POWCHK disabled, PULCHK disabled
       configuration hash MD5:
       00 E9 B6 7A A2 85 ED C7 34 08 36 98 17 FE 4E 26
       data hash MD5: 16K
       CA 4A 3F BC A7 91 0B 3D 36 C6 A6 6B A4 13 94 87>)
$$ ##END=
$$ 
$$ hash MD5
$$ E5 53 1C EB 45 5C BB B1 66 49 0A 8E 1E 86 1C 56
##$RELAX= 
##$RELAX= 
##$RELAX= 
##$RELAX= 
##$RELAX= 
##$RELAX= 
$$ Bruker specific parameters
$$ --------------------------
##$DU= <F:/spectra>
##$EXPNO= 1
##$NAME= <H-F>
##$PROCNO= 1
##$TYPE= <nmr>
##$USER= <she>
##$AMP= (0..31)
100 100 100 100 100 100 100 100 100 100 100 100 100 100 100 100 100 100 
100 100 100 100 100 100 100 100 100 100 100 100 100 100 
##$AQSEQ= 0
##$AQ_mod= 1
##$AUNM= <au_zg>
##$AUTOPOS= <>
##$BF1= 200.13
##$BF2= 200.13
##$BF3= 200.13
##$BF4= 200.13
##$BF5= 200.13
##$BF6= 200.13
##$BF7= 200.13
##$BF8= 200.13
##$BYTORDA= 1
##$CFDGTYP= 0
##$CFRGTYP= 5
##$CHEMSTR= <none>
##$CNST= (0..31)
1 1 145 1 1 1 1 1 1 1 1 1 1 1 1 1 1 1 1 1 1 1 1 1 1 1 1 1 1 1 1 1 
##$CPDPRG= <>
##$CPDPRG1= <>
##$CPDPRG2= <>
##$CPDPRG3= <>
##$CPDPRG4= <mlev>
##$CPDPRG5= <mlev>
##$CPDPRG6= <mlev>
##$CPDPRG7= <mlev>
##$CPDPRG8= <mlev>
##$CPDPRGB= <>
##$CPDPRGT= <>
##$D= (0..31)
0 1.2 0 0 0 0 0 0 0 0.06 0 0.03 0 0 0 0 0.0002 0 0 0 0 0 0 0 0 0 0 0 0 
0 0 0 
##$DATE= 1666788270
##$DBL= (0..7)
120 120 120 120 120 120 120 120 
##$DBP= (0..7)
150 150 150 150 150 150 150 150 
##$DBP07= 0
##$DBPNAM0= <>
##$DBPNAM1= <>
##$DBPNAM2= <>
##$DBPNAM3= <>
##$DBPNAM4= <>
##$DBPNAM5= <>
##$DBPNAM6= <>
##$DBPNAM7= <>
##$DBPOAL= (0..7)
0.5 0.5 0.5 0.5 0.5 0.5 0.5 0.5 
##$DBPOFFS= (0..7)
0 0 0 0 0 0 0 0 
##$DE= 6
##$DECBNUC= <off>
##$DECIM= 32
##$DECNUC= <off>
##$DECSTAT= 4
##$DIGMOD= 1
##$DIGTYP= 9
##$DL= (0..7)
0 120 120 120 120 120 120 120 
##$DP= (0..7)
150 150 150 150 150 150 150 150 
##$DP07= 0
##$DPNAME0= <>
##$DPNAME1= <>
##$DPNAME2= <>
##$DPNAME3= <>
##$DPNAME4= <>
##$DPNAME5= <>
##$DPNAME6= <>
##$DPNAME7= <>
##$DPOAL= (0..7)
0.5 0.5 0.5 0.5 0.5 0.5 0.5 0.5 
##$DPOFFS= (0..7)
0 0 0 0 0 0 0 0 
##$DQDMODE= 0
##$DR= 18
##$DS= 0
##$DSLIST= <SSSSSSSSSSSSSSS>
$$ [...]
##$SUBNAM2= <"">
##$SUBNAM3= <"">
##$SUBNAM4= <"">
##$SUBNAM5= <"">
##$SUBNAM6= <"">
##$SUBNAM7= <"">
##$SUBNAM8= <"">
##$SUBNAM9= <"">
##$SW= 18.0517283424941
##$SWIBOX= (0..15)
0 0 2 0 0 0 0 0 0 0 0 0 0 0 0 0 
##$SW_h= 3612.71676300578
##$TD= 16384
##$TD0= 1
##$TE= 0
##$TE2= 300
##$TE3= 300
##$TEG= 300
##$TL= (0..7)
0 120 120 120 120 120 120 120 
##$TP= (0..7)
150 150 150 150 150 150 150 150 
##$TP07= 0
##$TPNAME0= <>
##$TPNAME1= <>
##$TPNAME2= <>
##$TPNAME3= <>
##$TPNAME4= <>
##$TPNAME5= <>
##$TPNAME6= <>
##$TPNAME7= <>
##$TPOAL= (0..7)
0.5 0.5 0.5 0.5 0.5 0.5 0.5 0.5 
##$TPOFFS= (0..7)
0 0 0 0 0 0 0 0 
##$TUNHIN= 0
##$TUNHOUT= 0
##$TUNXOUT= 0
##$USERA1= <user>
##$USERA2= <user>
##$USERA3= <user>
##$USERA4= <user>
##$USERA5= <user>
##$V9= 5
##$VALIST= <valist>
##$VCLIST= <CCCCCCCCCCCCCCC>
##$VD= 0
##$VDLIST= <DDDDDDDDDDDDDDD>
##$VPLIST= <PPPPPPPPPPPPPPP>
##$VTLIST= <TTTTTTTTTTTTTTT>
##$WBST= 1024
##$WBSW= 4
##$XGAIN= (0..3)
0 0 0 0 
##$XL= 0
##$YL= 0
##$YMAX_a= 527422
##$YMIN_a= -569008
##$ZGOPTNS= <>
##$ZL1= 120
##$ZL2= 120
##$ZL3= 120
##$ZL4= 120
##$ABSF1= 10
##$ABSF2= 0
##$ABSG= 5
##$ABSL= 3
##$ALPHA= 0
##$AQORDER= 0
##$ASSFAC= 0
##$ASSFACI= 0
##$ASSFACX= 0
##$ASSWID= 0
##$AUNMP= <proc_1d>
##$AZFE= 0.1
##$AZFW= 0.1
##$BCFW= 1
##$BC_mod= 2
##$BYTORDP= 1
##$COROFFS= 0
##$CY= 11.3945322036743
##$DATMOD= 1
##$DC= 2
##$DFILT= <>
##$DTYPP= 0
##$F1P= 2.36226072786647
##$F2P= -0.459571619588291
##$FCOR= 0.5
##$FTSIZE= 0
##$FT_mod= 4
##$GAMMA= 1
##$GB= 0.15
##$INTBC= 1
##$INTSCL= 1
##$ISEN= 128
##$LB= 0.24
##$LEV0= 0
##$LPBIN= 0
##$MAXI= 10000
##$MC2= 0
##$MEAN= 0
##$ME_mod= 0
##$MI= 1.114404
##$NCOEF= 0
##$NC_proc= 0
##$NLEV= 6
##$NOISF1= 3.799351
##$NOISF2= 2.8
##$NSP= 1
##$NTH_PI= 0
##$NZP= 0
##$OFFSET= 15.70392
##$PC= 1
##$PHC0= -18398.55
##$PHC1= 9.6007
##$PH_mod= 1
##$PKNL= yes
##$PPARMOD= 0
##$PSCAL= 0
##$PSIGN= 0
##$REVERSE= no
##$SF= 200.130013532006
##$SI= 16384
##$SIGF1= 3
##$SIGF2= 2
##$SINO= 400
##$SIOLD= 16384
##$SREGLST= <1H.CDCl3>
##$SSB= 0
##$STSI= 0
##$STSR= 0
##$SW_p= 3612.71676300578
##$SYMM= 0
##$S_DEV= 0
##$TDeff= 0
##$TDoff= 0
##$TI= <>
##$TILT= no
##$TM1= 0
##$TM2= 0
##$TOPLEV= 0
##$USERP1= <user>
##$USERP2= <user>
##$USERP3= <user>
##$USERP4= <user>
##$USERP5= <user>
##$WDW= 1
##$XDIM= 8192
##$YMAX_p= 0
##$YMIN_p= 0
$$ End of Bruker specific parameters
$$ ---------------------------------
##NTUPLES= NMR FID
##VAR_NAME=  TIME,          FID/REAL,        FID/IMAG
##SYMBOL=    X,             R,               I
##VAR_TYPE=  INDEPENDENT,   DEPENDENT,       DEPENDENT
##VAR_FORM=  AFFN,          ASDF,            ASDF
##VAR_DIM=   8192,          8192,            8192
##UNITS=     SECONDS,       ARBITRARY UNITS, ARBITRARY UNITS
##FACTOR=    0.0002768,     1,               1
##FIRST=     0,             0,               0
##LAST=      2.2672688,     0,               0
##MIN=       0,             -569008,         0
##MAX=       2.2672688,     527422,          0
$$ Real data points
##PAGE= N=1
##DATA TABLE= (X++(R..R)), XYDATA
0@%%%%%%%%%Qj6J6j6J6k4L2m0N6o4P2q8J04j28J52j76K08k40K80l24L72m27M85
32B58n54O30p10Q01r01J010j131J262j408J566j737J925k131K359k604K871l167
49a661L488l842M235m666N145n680O283o969P750q651R709j0969J2498j4402J6852
64I120k0136K4800l1999M4704p3845K68901M9482m53374j74082p5080J61778K75954
76F223L49866J71333m4676k85437l49635k67835l5116J47729K79009K86600J84388
87D42449n3004k59309l33738k30239m9679J55268K77990K83922J57434l7488k26178
98A27428k98218k20248l3153J51411K69290K67272J49304m0482k09853k78220
108a15469k04977l5266J43110K43486K43351J37854m4582k15498k67262j86879
$$ y = [0, 0, 0, 0, 0, 0, 0, 0, 0, 0, 8, -8, 8, -8, 8, -16, 16, -24, 32, -32, 40, -48, 56, -72, 80, -96, 112, -128, 152, -172, 200, -227, 258, -296, 334, -376, 425, -476, 534, -597, 665, -743, 823, -914, 1011, -1120, 1239, -1365, 1506, -1661, 1827, -2015, 2220, -2446, 2699, -2981, 3302, -3667, 4083, -4568, 5141, -5828, 6670, -7732, 9120, -11016, 13784, -18215, 26489, -47356, 221545, 271027, -182347, -356429, -431509, -269731, 6223, 356089, 527422, 482746, 197309, -152326, -420161, -455277, -307548, -28539, 258061, 442449, 389445, 130136, -203602, -433841, -483520, -328252, -50262, 233660, 391094, 353606, 127428, -170790, -391038, -424191, -272780, -3490, 263782, 413086, 372604, 162751, -115469, -320446, -355712, -212602, 30884, 274235, 412089, 367507, 152009, -115253, -302132]
118c02132l6580J16959K26181K34947J20060n5812j98682k44999j79709l5960
128c55727J20030K17295K15529J15855m5584j84424k27618j61373k7058J16733
138b16342K11441K09294J06220m3517j67615k11327j54332k4698J14768J99595
148B3487J91269R6679m3182j62652k02576j46294k3818J06164J84371J77736Q7057
159B88241m7001j57546j91871j36818k2574R9085J75845J69365Q0595m6624j48918
170F1779j78165j25566j8060R7555J68643J61712P6718m4727j39667j66723j15480
181b21981j2933R4679J60984J52203P0650m3576j34902j59089j09104j1380R1450
192a22999J51276J41097O4112m4372j29468j52430j04301r923Q6899J43047J32052
$$ y = [-302132, -338712, -221753, 4428, 239375, 359435, 303623, 104941, -140058, -319767, -355727, -235697, -18402, 197127, 312982, 267398, 82974, -144644, -306017, -333075, -216342, -4901, 204393, 310613, 267096, 99481, -111846, -266178, -290876, -176108, 23487, 214756, 311435, 268253, 105601, -96975, -243269, -267087, -160923, 23448, 201184, 288241, 241240, 83694, -108177, -244995, -267569, -168484, 7361, 176726, 257321, 210697, 61779, -116386, -241952, -260012, -162457, 6186, 167898, 244616, 199889, 60222, -106501, -221981, -234914, -140235, 20749, 172952, 243602, 200026, 65124, -93965, -203069, -214449, -122999, 28277, 169374, 233486, 189114, 59646, -92784, -197085, -207008, -120109, 22938, 154990]
203A54990N7808m3470j23588j44883r7567p463Q4791J37275J25610N4393m1394
214A56502j17167j35913r1337m665Q3163J31667J19828N1556m0097j11590j28744
225h6797q5715l636P9599J26168J12526M7603l9721j07497j24056q2544k910P6811
237i0169J19140J06639M3398m0335j03745j18751p8440k689P4486J14649J00896
248A25079M0417l8758r9661j12809p3227n82P2368J11061R7722L7943l9236r4517
260B5800j06657o8812J564P0395J06877R3498L5433l8289r3350j01695o4442J624
272a38054O8126J02636Q7742L1547l8798q9706r9120o1623M102O5490R6911Q3131
284A12384L0142l8479q7626r4446n7723M286O4534R4276P8712K7546l5630q3075
$$ y = [154990, 212798, 169328, 45740, -99143, -196710, -204173, -119382, 17893, 143503, 197896, 156502, 39335, -96578, -187915, -192580, -109417, 22250, 142078, 193634, 153537, 41947, -86797, -172512, -176148, -96549, 29619, 142145, 189748, 150027, 42530, -81526, -164070, -166980, -90169, 28971, 135610, 179008, 138673, 34928, -83823, -162263, -164952, -90466, 24183, 125079, 165496, 126738, 27077, -85732, -158959, -159541, -87173, 23888, 121610, 159553, 120317, 25800, -80857, -149669, -148105, -77710, 29167, 122665, 158098, 119809, 26459, -75236, -139678, -138054, -69928, 32708, 120450, 151997, 113199, 23493, -75627, -137250, -133148, -67658, 29253, 112384, 142526, 104047, 16421, -78025, -135748, -131462, -66928, 27348, 106060, 133606, 97976, 14901]
296A4901r1617n4425P558O3069Q9696P5977K6822l6006q0687q6224n1466O719
308a15683O1660Q7192P1456K3855l5233p7964q3451m9382O911N9001Q3699O8080
320A00141K0949l5351p4460q0172m7376P566N7378P9848O5257K0318l4354p2559
332G185p5543m3865P361N5762P7921O2871J8560l3197o9144p2479m1615Q780N4114
345d3289P4189N9785J7821l2731o7592o9513l9019Q604N1645P1318N7101J5395
357A03714l2571o5032o6987l8003R431N0649O7751N3681J4574l1735o2840o4526
369f1894l4789R833M9813O5138N1442J3469l1125o0405o0853l3075J0693M8047
381c3706O3387M9369J1918l0806n7982n8308l1084J0828M6633O0705M6638J0492
$$ y = [14901, -76716, -131141, -123583, -60514, 29182, 105159, 131981, 95975, 15288, -70936, -122402, -115683, -54023, 33169, 104625, 128480, 93247, 15283, -68168, -117550, -110639, -51638, 32061, 100141, 121090, 85739, 11279, -68893, -116269, -108703, -51325, 28523, 93780, 114098, 79744, 7185, -68358, -112223, -104862, -49100, 28821, 91692, 110252, 77055, 7911, -64568, -106183, -97403, -43289, 30900, 90685, 108506, 75775, 8183, -61330, -100349, -91745, -40100, 31218, 88319, 103714, 71143, 6111, -60876, -98879, -89448, -38799, 28952, 82633, 97207, 65472, 2632, -61894, -96683, -86850, -37037, 28101, 79543, 93012, 61887, 1482, -59371, -92446, -81753, -33706, 29681, 79050, 90968, 60162, 2180, -56128, -87212, -76384, -29751, 30954, 77592, 88084]
393H8084l0384n6672n5900k9312J0469M5029N8403M3990R326k9679n4906n3743
405e5295k7393J0933M3650N6010M2237Q671k9001n2737n1292k5299J1301M2355
417b5860N3733M0589Q316k8503n0661m9052k3985J1691M0782N1640L9199P307
429G5196k8288m9083m6963k2832J1025L9712M9612L6703O368k7544m7565m5350
441d9009k1594J1400L8131M7898L5286N172k6664m6355m3311j9983J1568L7734
453a9727M6122L3397M837k5779m4360m1916j8792J2356L6943M4542L1802L750
465F3175k5508m2933l9849j7919J2481L5956M2922K9874K879k5209m1875l8239
477d4245j6921J2076L5335M1187K8018K194k4901m0144l7017j5935J2293L4286
$$ y = [88084, 57700, 1028, -54872, -84184, -73715, -28686, 29717, 73707, 83033, 53354, -1552, -55295, -82688, -71755, -28105, 27905, 70142, 78813, 49812, -2925, -54217, -79516, -68215, -25860, 27873, 68462, 76778, 48275, -2386, -51438, -75423, -63732, -22950, 28690, 67889, 75196, 46908, -2175, -49138, -71970, -60945, -21233, 28379, 65082, 71450, 43906, -3659, -49009, -70603, -59203, -21072, 26826, 62112, 67284, 40620, -5735, -49046, -69029, -57461, -19727, 26395, 59792, 64629, 38850, -5510, -47426, -66218, -53862, -16919, 27623, 59425, 63175, 37667, -5266, -45115, -63034, -50553, -14597, 28325, 58199, 61078, 35869, -6006, -44245, -61166, -49090, -13755, 27432, 55450, 57644, 32743, -7401, -44418, -60353, -48060, -13774]
489a3774L9884K6974J425k4195l9136l4717j4824J2103L3579L8689K6131J333
501E3472k3783l7460l3469j3806J2449L2153L7468K4990Q57k3978l5630l2323
513c9060j3209J1410L1439L5941K3701K77k3125l5417l0739j3028J1592L0055
525a0163L4713K2546l56k2244l3982l0224j1542J1653K9476L3291K2123K33k2324
538B3200l2569k8332j0791J1580K8869L2458K1129m97k0968l1882k7597j0060
550d5460J1896K7461L1211J9794p75k1256l1168k6226r719J1204K7129K9682J8404
563D2177j299k0626l0590k5675q429J1258K5863K9010J8129j989k0085k8428k3956
576c4640q448J1391K6169K7789J7013j649j9502k7223k3070p407J0973K5089K7460
$$ y = [-13774, 26110, 53084, 54509, 30314, -8822, -43539, -58363, -46260, -12681, 26008, 52139, 53472, 29689, -7771, -41240, -55046, -42597, -10444, 27024, 52014, 52871, 28893, -6737, -39060, -52269, -40859, -9420, 26521, 50222, 50499, 27374, -8043, -38782, -51810, -40218, -10163, 24550, 47096, 46740, 24496, -9486, -39710, -51252, -39599, -10123, 23168, 45291, 45524, 23200, -9369, -37701, -48492, -36912, -8043, 24415, 45544, 45047, 24079, -7803, -35400, -45460, -33564, -6103, 25108, 44902, 44127, 22871, -8297, -34523, -44242, -33038, -5909, 23773, 42177, 40878, 20252, -10338, -36013, -44442, -33184, -7321, 21689, 39818, 37829, 17744, -10684, -34640, -43088, -31697, -5528, 22261, 39274, 37625, 18123, -9100, -32170, -39577, -28604, -3515, 23945]
589B3945J5820k023j9257k6563k2329p471J1067K4033K5226J5137k061j8890k6282
602i648k1376p074J0815K2945K4937J4443k785j8079k5218k0262o165J0680K2563
615d224K3944J4300k558j7560k4069j8849n935J0053K2518K3424J3285k559j6880
628A4890k2994j8990n592J0241K1262K2180J2441k948j6315k2947j8282n418J0172
641b2300K0467K1108J1811k940j6298k2103j7401m868J0126K0066K0417J1594
653B9679k776j6032k0961j6692l927R972J9847J9677J1071k876j5814k0499j5586
666b4917l677J0115J8636J9174J0160l311j5357j9799j5269l468R695J8018J8330
679A8330R306l320j4770j9341j4773l302R640J7815J7435R239l495j4272j8542
$$ y = [23945, 39765, 37742, 18485, -8078, -30407, -37878, -26811, -2778, 22448, 37585, 35524, 16634, -9648, -31024, -38098, -27283, -4338, 20599, 35042, 32257, 14178, -11040, -31302, -37467, -26787, -4224, 19720, 34020, 31462, 13902, -10167, -29016, -34951, -24898, -2380, 21044, 34329, 31770, 14890, -8104, -27094, -32686, -22445, -1183, 20997, 33438, 30490, 14175, -8772, -27054, -32472, -22300, -1833, 19275, 31086, 28146, 11848, -10255, -27656, -32524, -22398, -2332, 18085, 29679, 26903, 10871, -10090, -26782, -30709, -20737, -890, 18787, 29858, 26982, 11168, -9331, -24917, -28594, -18479, 157, 19331, 29491, 26180, 10823, -8976, -24245, -27713, -18018, 0, 18330, 27636, 24316, 9546, -9795, -24568, -27870, -18230, -415, 17020, 26259, 22764, 8492, -10050]
692a0050j3900k983R634J7236J6991Q647l287j3623j7952j3296k783R698J6634
705I66J6421Q156l647j3503j7085j2842k516Q933J6147J5578P963l466j3360j6845
719i100j2214k382Q622J5818J4882P767l925j2553j6179j1909k066Q679J5344
732G84J4723O978l517j2247j5774j1289j668Q464J4824J4300O618l337j2587j4916
746h644j0571j809Q565J4441J3556O094l726j2030j4553j0328j576Q570J4179
759B168J2374O073l655j2108j3980r839q74Q034J3452J2667N422l893j1306j3312
773h777r500r11Q169J3234J1820N438l782j1131j2859r039m32P780J2195J1629
787A3834N196l896j0867j2331r021o24P719J2403J1054M537l706j0445j2387q172
$$ y = [-10050, -23950, -26933, -17299, -63, 16928, 25575, 22288, 8665, -9287, -22583, -25366, -15668, 966, 17387, 25543, 21896, 8393, -8692, -21534, -24050, -15117, 1030, 16608, 24571, 21105, 7745, -9100, -21314, -23696, -15074, 744, 15626, 23393, 19468, 6915, -9264, -21173, -23239, -14560, 784, 15507, 22485, 18968, 6721, -9053, -20342, -22010, -13546, 1278, 15578, 22196, 18859, 6272, -8644, -19215, -21024, -12459, 1982, 15538, 21632, 17906, 5876, -8677, -19005, -20581, -12011, 2168, 14542, 20615, 16960, 4852, -9128, -18967, -19841, -11807, 1645, 14312, 19734, 15841, 4535, -8777, -18277, -19188, -11019, 2215, 14035, 19473, 15691, 4560, -8299, -17338, -17770, -9990, 2205, 13834, 19030, 15134, 4267, -8064, -17085, -17709, -9990, 2413, 13467, 18004, 14298, 3853, -8534, -16706]
801a6706j54P273J1838J0686M325l652r896j1810q109l70P592J1274J0491M262
815A7044l868r916j1048p632j23P097J1051R847M292m004r397j1025p257J6O797
830h126J0704R353L619l751r178j0755o602K25O766J0509R102L300l392r425r872
845g523o598o5P036R947Q630L359l763r046r413o343M25O779R709Q176L106l945
861A0471q433r468n882L69O266R450Q290K648l515q473q836n767M98O148Q988
876B754P833K712l610q120r095n099Q00O241Q706P226K590l914p851q201n074
891a2102P58N873Q521P139K162l277p907p840n009N08N985Q160O726K406l842
906H261p092p929m740Q00N499Q198O383K043l445p191p537m566J116N508P389
$$ y = [-16706, -16860, -9587, 2251, 12937, 17262, 13610, 3714, -8096, -16205, -16575, -8983, 2291, 12782, 17044, 13176, 3260, -7788, -15420, -15543, -8446, 2605, 12452, 16744, 12740, 3343, -7682, -14939, -14923, -8126, 2578, 11931, 15550, 11799, 2621, -8134, -14736, -14511, -7745, 2764, 11866, 15166, 11774, 2349, -7523, -14121, -14186, -7150, 2797, 11427, 14786, 11023, 1977, -7436, -13779, -13354, -6575, 3134, 11310, 14416, 10471, 2038, -7430, -13312, -12943, -6677, 2773, 11063, 13711, 10196, 1723, -7113, -12880, -12382, -6234, 2754, 10587, 13299, 9689, 1569, -7526, -12625, -11825, -5584, 3122, 10348, 12938, 9024, 1173, -7028, -12102, -11344, -5471, 3050, 10189, 12351, 9074, 1167, -6673, -11682, -11174, -5189, 2971, 9697, 12103, 8261, 1169, -6760, -11500, -10700, -5201, 2997, 9380, 11423, 7978, 787, -6750, -11316, -10200, -4692, 2697]
921B697O704J697l453p042p279m080J279N101P540N955J388l092o881o816l901
936a0183R58N327O970N660J397l028o771o451l991J225N172P098M947J603k900
951G033o682o575l728J498M861O733N206J147l024o320o245l223R76M952O360
966B969N113J168l149o013o077l151J160M783O327M642R06k717n981n750k874
981h644R49M724O060M454J035k940n704n539k851J039M522O005M339Q76l065n107
997A53n680k727J116M566N765L986P73k912n326n013k427R34M191N745L952N58
1013G654k648n263m935k430J413L958N179L844M95k476n096m786k406J440M068
1028a989M848L901M25k906m599m390k556J515L905M765L656K79k742m854l984
$$ y = [2697, 9401, 11098, 7645, 603, -6676, -10756, -9477, -4376, 3164, 9119, 10507, 7415, 534, -6282, -10183, -9225, -3898, 3072, 8732, 10129, 7101, 330, -6121, -10112, -8887, -3715, 3383, 8330, 9933, 7033, 351, -6224, -9952, -8454, -3593, 3140, 8346, 9493, 6469, 149, -6096, -9319, -8343, -3391, 2969, 8082, 9250, 6101, 88, -5989, -9140, -7980, -3197, 3130, 7772, 8678, 5961, -20, -5770, -8644, -7695, -2971, 3089, 7543, 8578, 5638, -66, -5605, -8456, -7417, -2895, 3110, 7449, 8325, 5260, 153, -5527, -8254, -7138, -2572, 3193, 7179, 7952, 5040, -286, -5299, -7726, -6792, -2601, 3144, 7096, 7654, 5006, -257, -5192, -7622, -6209, -2251, 2928, 6772, 7267, 4791, -305, -5091, -7497, -6057, -1989, 2859, 6760, 7185, 4279, -320, -4710, -7266, -5751, -1846, 2919, 6575, 6854, 4112, -742, -4726]
1043d726k183J372L560M883L139M54k760m480m060k097J296L990M403L329L52
1058F472l007m128m166j743J534L627M219K956N14k479m667l621j675J267L769
1073a128M218K576K35k422m568l336j497J274L419L962K805J24k638l959l585
1088d520j561J360L650L564K723J99k348m176l216j260J133L335M058K463k81
1103E123k318l828l248j284J529L162L712K402k47k475l464l367q29J192K704
1118a236M116K233k43k218l688k830j389J451L015L417K233l04k177l774k693
1133d087j012J462L142L425J576j2k323l812k127j041J447K773L341J769q0k506
1149A935l174k371j061J629K476L171J755J0k343l155k736k62R44K795L025J384
$$ y = [-4726, -6909, -5537, -1977, 2906, 6045, 6499, 3739, -741, -4801, -6898, -5602, -1612, 2791, 6120, 6472, 3465, -663, -4829, -6572, -5038, -1411, 2808, 5764, 6278, 3799, -868, -4489, -6164, -4897, -1128, 3090, 5666, 5901, 3479, -1089, -4425, -5922, -4648, -1229, 2733, 5538, 5662, 3024, -935, -4520, -6081, -4721, -1071, 2493, 5216, 5415, 3067, -1109, -4325, -5585, -4452, -1117, 2941, 5404, 5123, 2805, -1023, -4271, -5555, -4026, -864, 2848, 5250, 5003, 2528, -936, -4303, -5132, -3940, -1236, 2880, 5113, 4870, 2652, -1036, -3866, -5255, -3804, -789, 2628, 4861, 4557, 2380, -1394, -4087, -5099, -3637, -495, 2930, 4506, 4494, 2171, -1641, -3768, -4809, -3362, -589, 2752, 4521, 4441, 1935, -1239, -3610, -4671, -3042, -566, 2605, 4360, 4370, 2027, -1128, -3864, -4126, -3182, -387, 2638, 4022]
1165D022Nk220l186k113p91J243K809K840J492j52k452k596k361q76J703K394
1181b39K627J913o63k015k630k400n19J286K674K537J519n40k334k332k228m51
1197c795J195K450K551J557n64j921k828j949n12J386K514K332J067j29j789k867
1213a302k061n02J552K334K432J167n62j996k220j970n93J416K247K351J459q30
1229B922k064k119j820j33J216K421J915J118k65j918k455j616l16Q87K399K045
1245B217J153n55j946k059j877K9R50K150K141R46m14j822k027j666k16J339J945
1262B88J942Q38m16j776k195j327l43R97K103K169N52n36j514k029j349n9J080
1279a575J825J909P89n86j472k152j455o0J252J790J713P59n53j592k027j172
$$ y = [4022, 4027, 1807, -1379, -3492, -4283, -3040, -231, 2609, 4101, 3949, 1497, -1099, -3460, -4336, -2633, -239, 2388, 4301, 3638, 1623, -1007, -3407, -3926, -2640, 34, 2571, 4090, 3550, 1216, -1116, -3344, -3795, -2600, -150, 2401, 3958, 3394, 1473, -1355, -3304, -3816, -2430, 84, 2416, 3483, 3354, 1565, -1302, -3363, -3865, -2313, 21, 2453, 3620, 3058, 1062, -1158, -3128, -3721, -2305, -58, 2293, 3752, 2922, 858, -1261, -3081, -3214, -1998, 423, 2338, 3456, 3191, 1273, -1182, -2798, -3114, -2227, 172, 2217, 3370, 2815, 869, -1190, -3067, -3038, -2088, 62, 2203, 3149, 2735, 913, -1114, -2780, -2996, -1657, 288, 2230, 3068, 2652, 876, -1319, -2646, -2989, -1992, 111, 2280, 2832, 2296, 782, -1247, -2596, -2655, -1575, 250, 2159, 2948, 2362, 890, -1262, -2717, -2777, -1525, 265, 1978, 2737, 2184, 592, -1435, -2607]
1295b607r0R85K047J794P60q03j334j929q71o01J082J841J796R09j008j337j974
1312a340j141k51J250J966J603O14n06j793j613j221n7J119J582J752N79o57j472
1329D14j812r18Q7J021J634J364N34l15j677j333j236J25P21J981J325N05p53
1346A667j096j951q03L03P18J578J260L48j30j512j797p86P5J030J526J424L86
1363B240m72j486j610q50L27P81J518J356L98o13j328j306q55J09R53J258J490
1380A910K45p01j267j400o73R1J209J030J467J61o15j340j358j064P21P91J344
1397E51N73P93l81j348j478l47j28J158J207R56L18q22j057j133n63K74Q59J234
1415F66R14K25o53r17j201j135L56J017J385O70N65p02j226j132n80J51R13J244
$$ y = [-2607, -2697, -1712, 335, 2129, 2889, 2086, 752, -1177, -2048, -2649, -1567, 274, 2070, 2979, 1971, 634, -1340, -2481, -2732, -1482, 484, 2087, 2701, 2195, 402, -1211, -2432, -2489, -1370, 212, 1964, 2543, 1886, 414, -1398, -2316, -2229, -1208, 426, 1790, 2324, 2009, 332, -1001, -2237, -2112, -1391, 590, 1915, 2420, 1667, 571, -1380, -2183, -1880, -1162, 416, 1676, 2024, 1894, 382, -1415, -2201, -2126, -1096, 430, 1854, 2240, 1768, 282, -1328, -2178, -1851, -1070, 448, 1804, 2202, 1589, 261, -1045, -1900, -1791, -838, 420, 1910, 2155, 1454, 187, -1213, -1886, -1795, -586, 444, 1911, 2072, 1457, 117, -1241, -2305, -1584, -793, 551, 1124, 1917, 1536, 188, -1290, -1637, -1765, -607, 600, 1556, 1874, 1052, -5, -1138, -1701, -1427, -568, 666, 1580, 1805, 1152, 235, -966, -2101, -1745, -728, 657, 1327, 1892, 1190, -36, -1168, -1748, -1597, -684, 560]
1433E60J039J75p15j121r61k96j57P21J035R64L67q19r18r89o33L18N98J346P90
1452A304L27o20r98j097m07L40O47J062P40J08n58r08j021j97R1R33R44N91K68
1471A549o75j150q52m57L16P06J177P79j01o43q99n28o64L70O49J140P16j99m63
1490G71r87p29k18m9Q21J014P99Op28r12r02j36K19Q15P12Q98j28n94o71r85m06
1511a390N0J119O90O00N7m54p92o86k60J80Q84O73K47K64m37q18q24k92J64N08
1531e17J126M66L6n08o37r50l72L94O13J047M32kl78r41m55n03PR51M89O65N1
1552A014l10o63o35m54K45O06P33M66Jm89p91m96J38k45Q29O89J32Q2k91q09n42
1573g90j59J30R43M03K30K11m56o80o45j55K9O35N99O63P1m49o91o75j05K16M47
$$ y = [560, 1599, 1774, 1059, -62, -1023, -1319, -1476, -755, 280, 1244, 1611, 792, -126, -1115, -1748, -1430, -832, 514, 1304, 1631, 1011, 13, -1084, -1491, -1151, -504, 558, 1298, 1406, 848, -60, -1081, -1278, -1187, -254, 690, 1281, 1549, 874, -276, -1128, -1585, -1269, -563, 614, 1393, 1292, 649, -250, -778, -1442, -1072, -423, 717, 1433, 1234, 771, -216, -945, -1163, -1212, -391, 623, 1422, 1428, 700, -212, -1114, -1250, -1031, -216, 496, 1394, 1266, 672, 1, -984, -1390, -1340, -221, 469, 1069, 1126, 672, -120, -806, -1066, -886, -2, 671, 918, 1182, 745, -73, -897, -1189, -1025, -517, 609, 1075, 1111, 603, -34, -984, -1356, -962, -349, 698, 1130, 1128, 750, -191, -646, -1149, -1142, -191, 298, 963, 1014, 704, 41, -594, -1048, -803, -197, 536, 1002, 1003, 514, -277, -773, -635, -880, -51, 638, 770, 852, 561, -248, -790, -949, -819, 124, 527, 757, 968, 512, -168, -813, -968, -939, -304, 295, 958, 1029, 580, -111, -786, -891, -675, -228]
1594b28O87M61r8m96o36l89k41L99M25N60N51m10j79m69o91m5K22P72L32L77k53
1615F51m44j47o72m29N55M61Q14kk33l25j44p26j17K64M77L51N39j00n39m05l59
1636e30k62K46M53N37J89mk09n83m68n0K7O88M19L14p2m98n53j03l47L37K17O64
1658D12L08l95j58m63m48K37O8M23K28L92K28p31m17l30l3P0O44N08J54ln69p13
1680e88J59kR1L86K61M27o1k25n02n75j74L28L72L84L62N9l56n69m27J52R5N42
1702A39L58k1N6k52l17n18j5J87L93K76L83l66j35l85ql12K1O95L17J9m2l14l33
1725a74m86J07M89J3K36M92k77k66k54k34k69M00L00J93J25O1m94l97P4m2l58
1746g61P35K77M4J88n60k46j40K6n5Q30K11J14j29n31m42K21k15m1P44J34R9p0
$$ y = [-228, 459, 920, 822, 326, -310, -699, -940, -541, -116, 444, 995, 585, 406, -63, -754, -799, -577, 195, 527, 904, 651, 207, 60, -612, -1041, -486, -25, 789, 787, 554, 229, 85, -641, -758, -494, -17, 334, 873, 773, 234, -171, -530, -792, -546, -93, 444, 633, 629, 420, -163, -631, -681, -654, 34, 453, 767, 695, 197, -356, -459, -806, -469, -252, 412, 720, 325, 167, -296, -744, -507, -439, -16, 212, 604, 832, 101, -316, -646, -679, -609, 35, 543, 697, 694, 125, -588, -429, -431, -340, 46, 307, 734, 673, 448, -54, -629, -803, -475, -103, 281, 643, 702, 346, -223, -650, -498, -403, 139, 497, 476, 532, 280, -37, -555, -570, -383, 10, 286, 669, 303, 168, -217, -225, -537, -516, 179, 496, 515, 473, 159, -174, -660, -553, -64, -51, 185, 677, 400, 134, -120, -354, -623, -223, 77, 270, 395, 456, -38, -435, -361, -403, -761, -26, 251, 295, 483, -77, -323, -463, -437, -492, 338, 549, 663, 534, 3, -439, -218, -433, -474, 270, 404, 503, 433]
1768D33n81k2m33j2M47j5L36M33j42k39l62m36J91K24O6N85k6r2m38q6j51n5P1
1791c04O37j1Q1j55p7l27j04j33J41K26K21M60n55l4j35n2l37L63K61K43K29k25
1813D13l90k05m02K78J52K94K25l3n8k82k49j87J79J54J14K87J15q0j30k83l37
1834d25L08M34j2K5O6nj48l56j90j29J92K42N41o9o1l74n38M6J43J30M40k58J22
1857A24J4l2k50r0l5rM23n1M60k46k26m20J87r8j06N64j60L77r2k60j90l29J16
1880c29J36K40K40M8k30k14k69K87j62R6J77K89J08j44m92jj90J0L03K00J97J38
1902D38n8m12%j39K5P9K45J67p8l73L28k93m27L11L30j26L97k09j28N8n4l16j38
1925c73J15L49O4J32l36J2l79L77k63N02R7k36M27m20j54r9l26J69J50j1N53r8
$$ y = [433, -148, -170, -603, -615, -168, -183, 153, 586, 444, 205, -157, -593, -402, -178, -112, 473, 447, 355, -83, -169, -320, -375, -304, 333, 322, 403, 248, 171, -156, -260, -393, -252, -26, 195, 655, 100, 66, -69, -121, -458, -95, 166, 409, 638, 413, 23, -182, -584, -306, -154, 140, 365, 332, 274, -8, -257, -444, -265, -111, 3, 290, 405, 325, 195, -88, -425, -117, 317, 305, 330, 396, 391, 243, -113, -303, -432, -240, 2, 543, 474, 413, 39, -499, -453, -310, -180, 260, 2, 124, 138, 106, -144, -234, -269, -278, 145, 94, 554, 308, 82, -338, -151, -249, -355, 209, 49, 426, 334, 74, -116, -445, -329, -193, 47, 287, 335, 105, -109, -378, -91, -253, -157, 20, 309, 417, 273, -219, -220, -410, -400, -97, 103, 300, 438, 380, -32, -32, -171, -146, -67, 178, 345, 267, -106, 222, -71, -498, -187, 143, 17, 414, 205, 77, 135, 81, -235, -373, -258, 91, 155, 287, -49, -37, -416, -39, -302, 200, 297, 61, 488, 68, -86, -185, -511, -342, -192, -203, 350, 252]
1947B52l59J58j69P9q8J30P9K34p1j03n55O8L7L8M61m06L74j34K72l79m7j80K85
1970b4q1L58j29K27k8l72m7O2l19K63K12N9p7k8j71j9n2J29j1j26L99K22m14j53
1994a20j66k9Q6J53K19j97K69o8J13k90l31J89K76K28k59p1J63l09r8K49k82K00
2016g5K84p0J01p5k83n9P8m2J03K74K20l71Nn7k43m3J64jK98K33j83l36O6j0k44
2041b66L5K16J04M1j32r3K09l42O5j23L63K5J19J37m02J28l97J26K22q7K76J37
2063C61k23r3k48K5M5q9J44R7J78l36K30l9l36m6r1K01N6L13j97K24l47J10J0
2086e1J28k65K90k6n0j11j87J71j33J44l6L42j07j59J63k69j32M55l18M20Kj46
2108A25K26l70jp6m6J22N2L19L3j77j99k78K54j76J00K27l6J14j63J10k98n3r0
$$ y = [252, -107, 51, -118, -39, -127, 3, 82, 316, 245, 142, -413, -345, -308, -270, 191, -215, 159, 25, 297, -82, -129, -309, -24, -105, 253, 124, 351, 323, -49, -96, -34, -353, -90, 122, 181, 104, 76, -95, -114, -166, -37, -48, -174, 225, 447, 33, -120, -286, -315, -229, -76, 143, -54, 215, 147, 260, -30, -361, -172, 104, 332, 73, 2, 165, -144, -242, 7, -275, -75, 209, 139, 240, 165, -118, -177, -99, -141, -38, 236, 456, 85, 90, 33, -210, -253, -89, -90, 208, 441, 258, -78, -12, -22, -266, -231, -15, 89, 130, -2, -95, 114, -228, -163, -286, 77, 102, 221, 358, -44, 84, -313, -187, 35, -52, 224, 361, 138, 45, -203, -178, -133, -222, -78, 19, 197, -139, 91, 52, -284, -330, -421, -220, -164, 149, -48, 176, -171, -61, -51, 77, -188, 102, 76, 26, -85, -272, -101, -234, -90, -126, 216, 109, -50, 113, -156, -288, 167, -151, 269, 271, 125, 351, -19, -20, -96, -142, -20, 32, 351, 384, 207, 8, -270, -16, -192, -92, 135, 99, 213, 50, 160, -138, -191, -281]
2131b81L94p8J20j19K31k27J01k42O2J63o7P7K20l65k2K2pk69m5L18p8L00Pj61
2155E4l55K76k21L34J06j11Q8Jk25J7k5j20m5J30J84K00k94j17J6K25l92K71r8
2178a01K94k22P5p4o1j48L11l9q9K10q2P3j27J95j97q9K6R2j12K34j62l8M0l9
2202c0j07m0M13J05m05O2j19j41K16J00k04L16r1m1J22Ll24O5J11j89M13k47J01
2225H9k5j79J14m8J25j43J9K3R1q4r5O8j03q6K35j0M4J71P3j53k15j06l3K40J8
2250C0M5L2m9K8Kp6l1R2O8r3K21l29k38O26l99Q3j2p0j26M39j47j41J83r7j06
2275f5K16q4K12j26j27j23l6J25o3L42k29k24R8K59p8l10J6P0Q1M6R2Q9q6P1j50
2300A6j98K17K3P7j57K01j3n7Ok17K1Q6L74l31j62J41j70K49j40j44L55k18L86
$$ y = [-281, 113, 35, 155, 36, 267, 40, 141, -101, -39, 124, 57, 134, 354, -11, -33, -11, -18, -287, -332, -14, -92, 208, 215, 54, -301, -25, -246, 88, 194, 83, 171, 172, -53, -36, -61, -181, -226, -96, 88, 288, -6, -123, -107, 118, -274, -3, -101, 193, -29, 46, -28, -89, -237, 74, 35, -54, 156, 74, 147, 20, 215, 18, -71, -45, 47, -65, 169, 7, -31, 9, -30, -137, -177, 236, 341, -64, -2, -121, -262, -46, 54, -150, 166, 75, 34, 156, 159, -165, -100, 11, -178, 235, -12, 89, 64, -115, -1, -49, 76, -67, -48, -25, 66, -18, -113, -45, -148, -234, 1, -9, 35, 206, 279, 126, -89, -195, -228, 12, 30, 75, 107, 58, 86, 88, 12, -19, 73, 141, 48, 269, -60, -298, 328, -71, 12, 0, -70, -196, 243, 96, -45, 138, 41, -65, 151, 67, 279, 153, 26, -97, -133, -8, -71, 271, 42, -182, -84, 175, 97, -213, -197, -127, -46, 0, 92, 181, 95, 166, 16, -182, 35, 58, 135, -22, 179, 166, 109, 115, -102, -81, 5, 379, 48, -114, 27, -143, 106, -34, -178, 177, -41, 345]
2323C45k47r7q1mJ08l5K53j5K0L7l16n3K58l34%o3N4K91Jr9K5l4j07J47k07J3
2349a40K33K2J20r7k08Q6o1o4J43K7o8J0L9J19k72r6R3L04j21n0k4J24k72J16
2373c7o9J13K48k74l0p4L30l00R0m40O11k42p7K53k02K53k94J75RJ37k08J05N5
2396A32q4k50J99L5k18J96JJ2M2R7k31J34k16j8K80J25J07l59K6J22j09o5J23
2419H1k0m6Q0mK45l63J5K2j75K45j04r1J54j06O5J55k90j0J77r5J50j06J82o5
2443I6j34l2Rj24Q5q7K3K24k31J13R5J59j71j5Oj93L22K10j97q8k18J65L8rK72
2468C18l44j00k65K37l0O7J42q9J26j56L6k39J55m6J79J04J13k53J81k30O3K03
2490A72j77J22p2O1O6j08j67j12J81L8L47l45J40j3j8k61J65j64J56k65K82J54
$$ y = [345, 98, 1, -80, -84, 24, -11, 242, 227, 247, 284, -32, -85, 173, -161, -161, -224, -170, 121, 122, 23, 48, 14, -93, 54, -153, -140, 93, 115, 235, 138, -70, 16, -45, -109, 34, 61, -7, 3, 42, 161, -111, -207, -114, 190, 69, 19, -5, 119, -153, -37, -106, 7, 255, -19, -49, -123, 207, -93, -3, -443, 168, -74, -151, 102, -100, 153, -141, 34, 43, 180, -28, 77, 132, 48, -202, -3, 32, -186, 10, 11, 23, 65, 162, -69, 65, -151, -169, 111, 236, 343, -16, 10, 132, 23, -42, 81, 61, 15, 95, 91, 336, -27, -12, 10, -165, 80, -24, -115, 39, -67, -2, 153, -137, -147, 30, -65, 85, -21, 161, 96, -38, -70, -61, -185, -100, -187, -164, 60, -171, -58, 37, 196, 25, 10, 16, -177, 145, 355, 158, 70, -148, 17, 55, 46, 318, -26, -126, -391, -154, -184, -117, 25, -64, 62, -94, -58, -297, -142, -188, -9, 95, 208, -45, 136, -94, -31, 172, -5, 117, 45, 106, 172, 64, -103, -215, -34, 4, 351, 6, 146, 133, 115, -146, 19, -145, 11, -254, 28, 182]
2512A82j55PK01o4j10J00o0r7M5L5J3j97J57k64J38k47L53o1P1J28k97O1J17k54
2536a98K74j77J1J10J30k68L80m06l4J21Q2K53l08K14k95o0J41M5k47J16J08j02
2558a10R1l8J49j19j56O6L41rl25K2J9J23j28QJ02J11k48L38n6j25Op7o5J67K6
2583A13J10j66j46m6J43j52L85k17K00l01J07J27j58lJ04k20K29k7l88L56k52
2604b02O7J96J00j32q3J43j02Q8q7k75K93J9Q1l64L37oL6k07K1K44k35O5n2J06
2628E1J5M6l5p0m9m7Q3J2J69j75j49K22j78k0Q1k46L88j35K65j06j95J7P8J50
2652A72j32K0k63K38K02l79N0K14j16j73J51O6R7J1J14n26K25J17k17P1J9R4J31
2675A86k92J36r3J01k0lK08K8o0m69L71M9k93M6K19Pr6J37j31J53l05j21J07j16
$$ y = [182, 27, 34, 235, 171, 61, 161, 101, 4, 49, 84, 97, -100, 57, -207, -69, -316, 37, -24, 47, 175, -122, -61, 56, -198, 76, -101, -90, 20, 150, -118, 262, -144, -178, -57, 25, 278, -30, 184, -111, -171, -30, 15, -232, -116, -8, -110, -19, -57, 92, -27, -183, -117, 224, 215, -110, -88, -69, 54, -74, -66, 36, 147, -101, 237, 181, 56, 62, -15, -80, 87, 113, 223, 57, -89, -135, 8, -144, 241, 24, 224, -77, 30, 157, -1, -4, 100, -120, 109, 82, -306, 50, -202, -135, 61, 161, 29, -54, 89, -13, 75, -12, -287, 6, 25, 106, -258, 79, 73, 109, -98, -77, 167, -68, -3, -55, 51, 66, 112, 77, 7, -42, -89, -6, 6, 175, 0, -149, 73, -105, -125, -44, -290, 98, -37, 228, 122, -73, -56, 22, 172, 40, 60, -203, 35, 237, -142, -92, 122, 6, -167, -16, 50, 147, 158, 272, -254, -29, 88, -129, -58, -39, 55, 186, -106, 30, -63, 38, 18, 15, 223, 251, 191, -278, 93, 142, -151, -105, 114, 121, 25, 162, 31, 184, -121, -242, -135, -251]
2699b51L22N1m7j43o9l9J07R2J97j24j89K20N9l36lJ63j46j06K17j12o6J67P9
2722D3j93j50K87n0N9j46L13j41j77r5K66L9l05K59K7j36L65k79k22K37J27j10
2744A8lj20Q7o3R7j17J16Q4j20J60k70K98k86J96k55K13k30p7L17j09L86k28m10
2767c16J11J44O4RJ1K8j28J11J30l9j30k2K42k19Q3R9k1k49lJ31PR4l29K37Q4
2792A29k79J03m4k3K85j34L7j02q3K6j8K52q0n1P0J55j97L23j35k85J86l46M14
2815B03j23j96O0pj19L38l44K39o9K01k1j61n0p1J33j98J12J08j72J44J83l2j96
2838c8M0j14m1L05m2K04k31J98j64J3L7l73M87k93L3k02p2J86J28k69L45O6k96
2861i3K86j07j73Q2k8K6%Kj4Oj33K64K07k23J22k20j9k90L19p5j84L98j80k52
$$ y = [-251, 71, 122, 75, -68, -137, -176, -69, 23, 220, 96, -93, 127, 186, -150, -153, 10, -136, -242, -25, -137, -203, -36, 43, -150, -300, -13, -63, -4, -150, 163, 22, -155, -250, 16, 55, -250, 9, 36, -100, 265, -14, -236, 1, 128, 18, 15, -105, -18, -81, 16, -101, 15, 99, -21, 139, -131, 167, -119, 77, -178, 35, -195, -272, 45, -64, 322, 94, -316, -205, -61, 3, 12, 23, 51, -77, 34, 164, 125, -5, -27, 215, -4, 79, 178, 157, -92, -95, 36, 43, 137, -192, 45, 129, -150, -47, -91, -114, 171, 37, 74, -28, -111, -85, -103, 149, 69, 18, 88, 243, 46, 369, 234, -51, 135, -211, 203, 80, -116, -56, -63, -182, 156, -188, 51, -18, 183, 162, 1, -49, -120, 13, -185, -73, 35, -137, 7, 190, 158, -38, 2, -112, -153, 152, 110, 314, 83, 281, 117, 130, 167, -206, 281, -12, 21, -181, -253, -67, 61, -208, 137, 203, -93, 193, 86, -87, -5, -33, -7, -7, -5, -19, -13, -146, 118, 325, 102, 224, 4, -15, -305, 14, -61, -245, 153, -27, -279]
2885b79L39k45J21L8k1j15P0k05K51O5Q1k07j07J03K35k43j54K09K8K02o6j40
2907d0%J91q5J14m97N64k07k3j0j24K19K1N8m35M04k77J12j27L22k25mn4J70q0
2931a3l4j46J38K17lL1j40k3k19K41K27j1l06n8N7K88j82l67K05o2K07K22k61
2954HJ56l08K00O3k87M85k11k69K17P8j32l5j49L52l83M60k05op7K69l32M9N6
2977aj07K62j46j99%J49J56j53j30K11j48K77k69K0L6O7k4j69J04m1J74j58n8
3000a47J61J55k6j23q3R8pJ02j76N7M6jk17j3o0P3K55m8K81l63J69j56Q9k25K37
3025G8k8p2o7K2J45k31J28J26j20M7M2M7q5p2N8j92L83k47L04m81L6Q8P3l1n5
3050a04LK26k82r7L36j98J72m7k22L09j07m3K1R2j0J47q0l15K96k67J03J03q5
$$ y = [-279, 60, -185, -64, -26, -47, -162, -92, -297, -46, 19, 100, -107, -214, -111, 124, -119, -273, -64, -36, 166, 100, -40, -40, 151, 66, 180, -317, 247, 40, 17, 7, -117, 102, 123, 181, -254, 150, -127, -15, -142, 180, -45, -49, -103, 67, -13, -47, -193, -55, 162, 159, 190, 50, 27, -192, 49, 276, 265, -41, -99, -42, 246, 64, -303, -98, -160, 47, 269, 8, 164, -144, 56, 119, -168, 317, 106, -163, 54, 132, 0, -35, -184, 168, -215, 245, 40, 34, -43, 226, -106, -57, -1, -108, 154, 8, -191, -191, -42, 114, -39, -169, 42, -106, 171, -98, -78, -42, 25, 1, -168, -64, -105, 69, -89, -147, 14, 169, 143, 20, -63, 35, 28, 130, -46, 11, 57, 56, -161, -174, -234, -161, 94, 46, 327, -36, 133, -23, 66, -159, 78, 50, -22, -89, -67, 78, -153, -25, 101, -19, 28, 70, 117, 32, -40, 18, -174, 209, -38, 266, -215, -179, -91, -18, -49, -104, -101, 125, -157, -254, 82, -116, 56, 9, -213, 96, -11, -54, -33, 59, 49, 196, 116, -199, 97, -170, -67, 36, -49]
3073d9J74K12k18j59J56k3N5N6l69K50k88Q9K36k46J71l3j08K3k7L6M8k80L64
3096G0j56J27J4k3k01j4L45l54K07Rj29J14j95P0M3O0p1j01K97j28K82k07j74
3119a15K20l57N8K14r0P8j10J76j68R5J38j51J77k68M0j7K0p3J61n7J7L3k07j48
3143c34L20J09m0r2p0J27L8l4L3J6k49K22m82K61J13Pk33L81j01J6k00J58J67
3166A33m1J45n4j49j14J44j48J18J33j41J57k81J24N1J19j87j93K64N4k31j12
3187b09K35j79K90j26J63j35l26K21J51j6Q9k85QJ78k59K56P1k45J89p4J65J3
3209A75n7l25K55j06l3R0r1J82l18NL01J66j28j32NQ7k42Q5j02M42j91J5l00J89
3233b8k87K54N1K01l0j10j00J50J42l96jJ12J7p2K90k64j9j89K60J2J67l32K27
$$ y = [-49, 125, 337, 119, -40, 116, 93, 148, 204, -165, 85, -203, -114, 122, -124, 47, 14, -94, -71, -98, -62, -14, -294, 70, -86, 41, 55, 32, -169, -183, 162, -192, 15, 24, -105, 9, -186, -116, -73, -13, -84, -185, 112, -16, 266, 59, -115, 105, -252, -194, 20, -70, 8, -102, 74, -94, 1, 139, -12, 165, -103, -63, -80, -60, -133, 28, -29, -12, 21, -186, -334, -14, 95, 55, -37, -107, 20, 58, 24, 57, 73, -176, 46, -436, -175, -62, -55, -288, 93, -8, 8, -192, -34, 133, 92, 237, 183, 34, -80, 64, -84, 34, 167, 26, 183, -98, 26, 77, 196, 9, -184, 80, 134, -97, -209, 26, -153, 137, 11, 174, 39, -287, -66, 85, 69, 158, -127, -119, 59, -200, 56, 127, -118, 71, -3, 162, 175, 118, -207, 48, -58, -91, -1, -92, 90, -228, -223, 78, 244, 116, -16, -11, 76, -166, -81, -183, 259, 68, 83, -217, -28, -315, -61, -10, 191, 161, 51, -49, 101, 243, -153, -154, -42, -25, -97, 193, -71, -90, -279, -19, -7, 160, -172, 55]
3256E5O2l61K21r2L01J5l13J99k21m3J44l85L13J54n1J62l38J96rO6p9J45m9j19
3280b7j26r7J46J4J18J43j25m9M4j05L5Lm7K20n10L86L45p05K69N3N4m3q0J09
3304B5j09j54K04k1q9q5M19k13J35j6k80K60l4Q1p5k58J39M3Q4n3K8J40k43J82
3328A10j35J20j27k6J11l09J83l0k6J59j96L4K77k61J2K31J5j53R6j15j5KP5K
3352C4l2J58J32k05l3k10o1J55j3J7L38k83M8k49J69r4J36J0N8j2J4k09n6M14
3376B26j69r1L93k79j02L14k97M9RN7j98Q8O9j17L01j76k09L26l01l1P6J43m0
3399D1M7J54j74k56K90K8k67L74k39j63L03j01R7k6j88M3j27K69r2n9J97j81p9
3422a09J59j54K06n7p0O5j91J29j16J45j22J47L5OM6k76J76n0J51n3Qj06J03k59
$$ y = [55, 117, -244, -23, -115, 186, 201, -112, 87, -134, -177, -33, -418, -105, 49, -2, 160, -178, 18, 9, 75, -4, 141, 92, -27, -153, -250, -104, -90, 28, 171, 46, -3, 41, -64, -29, -26, -73, 147, -363, 23, 368, -337, -68, -15, 39, -4, -84, 25, -84, -238, -34, -55, -144, -229, 190, -23, 112, 96, -184, 76, 42, 123, 48, -210, -71, -28, 56, 3, 31, 171, -72, 110, -25, 95, -32, -58, 53, -256, -73, -103, -129, 30, -166, -132, 145, -116, -104, 127, 142, -11, 85, -30, -45, -43, 32, 34, 2, 160, 292, 87, 54, -156, -217, -62, -75, -58, 280, -3, 45, -204, -35, -129, 7, 17, 75, 63, 77, -132, -188, 226, 57, -34, 359, 80, -22, 292, -5, 44, 53, 110, -88, 0, 69, -48, 253, 77, -132, 194, -107, -138, -62, 81, 41, 88, 242, 68, -188, 102, 130, -137, 237, -2, -165, 138, 37, 134, 108, -80, -37, -164, 105, 13, -46, 151, -30, -109, 50, -104, 102, 45, -25, 40, -151, -22, -138, 7, -115, 32, 67, 73, 119, -157, 19, -31, 120, 67, 75, -31, 72, -187]
3446a87J17j77K46j70J58J42n33L79NP3j29L5J2P2j79J70k9o5J33j23l3Q0K7j50
3470a26K80j57LN5K8J52k79o1l1j6P9J9R2L3k10J00L9K6m06L84J03k64M1J75k60
3495b01J18J76P3l06M56m98K96r9k86M63r9o7j07j9N4k0m9J67L8p7k47L14R7j82
3519ej5j78K36k20K83K6n31J80J08K05k7l3n3om6n5J18L64n43K91l27K71k01K60
3543A02j2l71L65j00p6Q9K41k7k92J19J8k6j38K0J32N1l69L58j12j53L24k44J22
3566B1j89k8J7K49j99K84j8l58L5J61K09p5J09j05k88K94n3J24q6k26J60K06k03
3589D1r2k1J42k3j58L75k65J6j65R7o6NP2J23p1n7k38K55J23J5j65J59l7j06j3
3614e4J26R9j87r3n9J34q2P9J26%K0k78K53K16k49O7p0k7n4q7L31m1j10j05K14
$$ y = [-187, -70, -247, -1, -171, -13, 129, -404, -25, -20, 53, -76, -41, -29, 43, -136, 34, 5, -60, 73, -50, -83, -3, 24, -126, 154, -3, 0, 55, 83, 235, -44, -105, -136, -152, -73, -54, 38, 71, -139, -39, 0, 26, -380, 4, 107, -157, -116, 59, -201, -83, 93, 166, -140, 316, -182, 114, 15, -271, 192, 93, 26, -81, -100, -46, -66, -115, 52, 90, 13, -234, 80, 177, -5, -20, -198, 38, -182, 101, 127, -404, -224, -116, 89, 62, 29, -24, -30, -76, -131, -13, 351, -192, 99, -228, 43, -158, 102, 90, -281, 84, -16, -92, -3, 238, 211, -81, 38, 56, 30, -108, -88, 44, 95, -274, 84, -28, -181, 143, -101, 21, -168, -196, -179, 70, -129, 155, 137, -221, -186, -25, 184, 109, 218, 113, -175, 119, 66, 190, 104, -122, 38, 244, 41, -51, -72, 70, 47, -111, 264, -1, 15, -150, -53, -119, -114, -42, 81, 10, -47, -285, -30, 93, 108, -57, 102, 65, -41, -54, 72, 171, -16, -109, -168, -34, -116, -37, 89, 89, 109, -169, 84, 300, 51, 118, 48, 21, -33, -120, 211, 170, 60, -45, 169]
3639A69R5k24o2K1O1L1k56K75P4r1j03m05K50jLj00J0K53j28%O4k2P7n7J46k55
3665a75O2j2Q3M3r4J10j29J01j93K69o6K4J4j65K63r6j80J90O4o8j00J08J30l40
3689a57L0n2K92j34r7J18J90j76%k5j53q6M20l05n5L38k30J77p4J59l03K75o8
3712H4n5q0r8N4R7K3l0J70j08j03K7Q4J91l23L28j47l4p5J03r8j54J82k06K25
3736E7l6j80L08r9J23j4j72K06l47K08m7j55L09l8j39k51N70m27K84p6j22N8l8
3759a8o8PJ43k7k27K98l08P5m3K81q4o2q3J57L0Q8kk40K36n23N12j51p3Mj00J69
3785iJ14k7J06j32j27Q5O0j02K0K13k95J11J23k95J40J56j3k23J29l5L1j59J11
3808a8Q6j64K68r6R9q6k87K46J64j39o4j71K96j55K28j79j86j02k6L11k9q1m0
$$ y = [169, 264, 40, -22, -1, 60, 91, -165, 110, 184, 93, -10, -415, -165, -166, -163, -263, -253, 0, -128, -128, -64, -86, -9, -66, 80, -175, -113, -125, -42, 1, -93, 17, -112, -11, -204, 65, -1, 23, 37, -128, 135, 39, -141, 49, 113, 45, -55, 53, 183, -157, -127, -179, 113, -21, -118, 0, 190, 14, 14, -11, -164, -250, 170, -135, -190, 148, -82, 95, 21, 180, -123, 152, 84, 29, -51, -149, -95, 2, 25, -5, 165, 57, -46, -19, 65, 256, -67, 261, 114, 80, 5, 108, 10, -144, 38, -168, 57, 21, -159, 149, 50, 173, 159, -13, 193, -154, 54, 7, -148, 161, 123, -16, -267, 303, -124, 160, 84, -38, 20, -18, -86, -79, 64, 37, -190, 108, -200, -125, -168, 113, 29, -33, -116, 41, 71, 159, 157, -83, 153, -370, 142, -9, -82, -78, -178, -9, 105, 78, 184, 52, -75, 10, 70, -32, -12, 201, -94, 17, 140, -155, -15, 141, 128, -95, 34, -1, 30, -129, -18, 68, -96, 172, 76, 175, 89, -198, 48, 212, 73, 9, -162, 134, -21, 207, 28, -158, -260, -286, 25, -4, -85, -125]
3831a25J84j54J24K8Koj26Q6j50J8q4Q8L30o30M45j02j8J34j3J61j2j08q2j00
3855a10P3n1J1M5K46j51k7j84J08J73l37J45N4J48r6j32k7K7L28k89P3n7N7L26
3879C53k38K7j90m5j25L10k0m2k34K9K45j53jJ14j56L60r8j14l3J02j48k36J86
3902a07J26Q5LJ3n9j25Q8Oj84R2J23m6%Q8j59%j48L62j00J78j54n5j65J66J68
3927A96k06K02l17k2M11Kl39K01l2j41k6O2k4o0L5k9J66j54J73p7J00p9m1J30
3951A31j77R8k08K56j6j88J18j52J71J96j00k79K07K9l29K25n0J39j76J59J56
3972B10j91J69r0L1k23N8J36R3j30j54Q1L1j49O6kk4J69j27p8J06l3j5K56L7j7
3997B10r3Qk61O4K3Q9k8jQ6j08N8K02k68J49N0j05r7Q7j39mR5K1k9r9J80j04k3
$$ y = [-125, 59, -95, 29, 57, 59, 53, -73, 13, -137, -119, -203, -115, 215, -415, 30, -72, -90, 44, 31, 192, 180, 72, -10, -110, -37, -88, -77, -32, 214, 63, 36, -148, -40, 133, -204, -59, -5, 143, 47, -85, -112, -85, 243, -46, 27, -30, 27, 353, 115, 142, -48, -93, -218, 92, 72, 30, -204, -175, 70, -83, -84, 30, -126, 234, 136, 22, -11, 91, -57, -293, -107, 19, 104, 107, 120, 61, -64, 24, 30, -154, -62, 61, 15, 15, 103, -56, -56, -204, 158, 58, 236, 82, 27, -138, 28, 196, -10, 192, -125, -147, 264, 266, -73, 128, 96, -45, -71, -9, -33, -93, -58, -87, 79, -75, 98, 21, 121, 42, 1, 131, -46, 52, -156, 100, 84, -104, 14, -138, 33, 229, 129, -150, 57, 86, -243, -18, -68, 71, -105, 54, 210, 19, 188, 98, 129, -94, -36, 100, 193, 63, -91, -10, 21, -128, -62, -64, -88, 81, -46, -124, -18, -51, -66, 190, 227, 210, 117, 125, -136, -72, -49, 40, 12, 11, 97, -11, 47, 249, -19, 130, 180, 75, -22, 65, -74, -78, 17, 38, 9, -90, 90, -14, -37]
4024c7K31l49J00l9R3k4q4M9r0K06rk42l0K10J9J34j62K56M0j62j54m3P4l6P0
4049B1J26j88K23k02J02p0k03M77l90J32P9j65j67K60K30k38K43m23k8K41r9J11
4071G2o3J6j70K77j71k43L39R2L7qk29J8J16J63m08L5K35k19K8J44j10L59m0l94
4095a24qJ09K2J74mk31O8O0o8K8q3J60j96M6p0J72j48K10m0k23M58l01J0j41K56
4120A36j44L5m0Q3o1k01L53m3l79J77J65k25K21k9J20l04K42J39l74K5J72j30
4142f2K08j58o6M9J84j98J67j96J43P0k08O6q2L79k30k64J10J8K1K2j78N6J83
4165C4q7J0O0J33q8J09r4k44J50j19N5K39k18m2j4K88p1p1o0j17j62M76j84o4
4189h1J52j47q9J23K14k48L7J6n7l8L12j53N8j99K59k68J97K3m2P3p2m1j29J16
$$ y = [-37, 194, -155, -55, -94, -1, -25, -109, -60, -150, 56, 47, -195, -225, -15, 4, 138, -24, 232, 272, 110, -44, -87, -13, -49, 21, 147, -41, 182, -20, 82, 12, -191, 286, -104, 28, 107, -58, -225, 35, 265, 27, 270, -153, -181, 60, -39, 72, 9, 25, -145, 132, -39, -282, 57, 149, 186, 178, -51, -33, 83, 246, -162, -127, 108, -111, -83, 61, -49, 310, 270, -124, -132, -23, -1, 173, 169, -62, 6, 66, -2, 26, -57, 103, -93, -47, -117, 55, -93, 117, 77, -146, 312, 11, 21, -120, 136, -8, 27, -13, 70, 9, -192, 161, 118, -261, -84, 81, -144, 77, 48, 168, -136, 106, 245, -129, -104, 68, -62, 146, -12, -78, -29, 155, -43, 124, -72, 71, 141, -67, -1, -83, 296, 66, -198, -88, -70, -49, -27, -205, -149, 34, -53, -43, 17, 150, 62, 171, 77, -167, -17, -136, -81, 158, -60, -102, -116, 172, 101, 30, -30, -147, -309, 167, -17, -81, 71, -76, -165, -42, 172, -76, -39, -23, -80, -118, 194, 41, 99, -100, 159, -109, 88, 111, 69, 142, 70, 29, -100, 16]
4213A6J50j59j41L41m0k66K80k09J67L6j77K99l27j26J68l9R5n6m4J97l3k9p6
4236B7K95l83K5K28m1j7k11j79L86j94L08j25j57J33o5P3k72J79l4l2j56K53%
4259D1r4K20j23jJ86j84m3n5K36k29J16j26k6J10l1K50j9k66J02n5J30l09J08
4282f2K27l04J04l4k62K9R7K97j52k9J1j19J56j76L55n0k27N9J83j85j00P8J45
4305D1k27K49J06j32M4Q5j78ML5P2r7p5J64o0m5N7k28L31j29J51j53n1Q3O0j32
4330b5r2O9r3L52r0P6k48O3K17k47K85k82k8J35rJ22n5j07k28kl6K57P4j40J3
4355a9r8m1K57k28K82j64k49K71J27oN2k11L3r2J62j73J02M6j17J10K9L4p0J65
4379B02l20K5J5N4j06J29p0j1O8m0J18pN7k01K80l87K74J20n29M29k77K90j19
$$ y = [16, 166, 7, -134, 207, 167, -99, 181, -28, 139, 175, -2, 297, -30, -156, 12, -27, 68, 12, -32, 165, 132, 103, 27, 322, -61, -36, 192, 151, 134, -77, -256, 130, -64, 244, 119, -38, 95, 30, 103, -169, 10, -24, -56, -212, 41, 41, -53, 167, 44, 43, 229, 45, 2, -53, 183, -46, 70, -56, -82, 28, -3, 247, 228, -38, 64, 9, 139, -170, -62, 165, -139, -35, -69, -331, -302, -205, 92, -60, -89, -78, -197, -41, -217, 138, 88, -139, -80, 103, -82, -182, -104, 41, -186, 63, 169, 37, 81, 166, -12, -8, 27, 99, 2, -73, 91, 31, -14, 43, -185, 146, 17, 168, 15, -36, 47, 107, -25, -117, -48, -141, 211, 121, 197, -51, 12, 229, -18, 267, -15, -43, 92, 83, 205, 150, 43, -185, -187, -223, 34, 108, -32, -19, -117, -158, 99, -129, 153, -11, -260, 11, 138, 132, 184, -27, 6, -86, 76, -97, 5, 51, -66, 44, 73, 107, 37, 202, -118, -93, -78, -24, -130, -1, -71, -82, -14, -54, 64, 57, 114, -87, 193, -194, 80, 200, -329, 100, -177, 113, -6]
4402fk52L6M32j38R8k40K02P6k09j81J19J04K20m27K8M6Qk4M8J96L2k19K8P0j95
4427a48K56j66J3J69k14qK85k95J03QN0n7m8J45m3O2k74P2J59k33L24p5J0L7k40
4452a08L32j64k18J5K56R0k36m1J39J7k36P3K66j10J12j60K3p9J9k64K26R4P5
4475A21r7l8J96j18M0j16N5R1k95n5L75n7j99J71j73Q3P6n4J30M7j52J9J04l38
4499a84M45l52O6P6Jj13K40k58N4j02J50k51J74p6R4K33j11L6k32K58k34K58j55
4522A7K20k25P7r4J30j30K14%r7q3L3K05l60O6n0J59j02M7O0K0j89K41j90J54
4546A23j55K7J0Mq2J22P6j45L2j5j32J86J3j31j0j44J30J88R3j24k34J36j48M
4570a76K04k27J95k02L52p2J39j56j19o1Q3o9Q0r0P5n6n3K21M9K4r2P8j16j47
$$ y = [-6, -258, -222, 210, 72, 170, -70, 132, 208, -1, -182, -63, 41, 261, -166, -138, -92, -84, -108, -60, 136, 168, -51, -23, 47, -148, 108, -58, -45, 124, -90, -98, 187, -108, -5, 3, 53, -4, -52, 93, 50, 112, -162, -90, 69, -164, 160, 85, 95, 132, -108, 224, 60, -158, -143, 113, 203, -33, -74, 65, 82, -154, -81, 185, 75, 187, 27, 50, -29, -10, -274, -48, 46, 121, 24, -14, 182, 64, 104, -12, 43, 134, -161, -216, 159, 102, -97, 74, -99, -16, 60, 6, 136, 183, 31, 50, 154, -184, 261, -91, -25, 51, 52, -61, 179, -79, -25, -127, 23, -228, -54, -130, -36, 197, 86, 122, -110, 148, -86, 172, 17, 237, 12, 89, -5, 125, -5, 209, 209, 112, 29, 62, 267, -93, -27, -77, 82, -20, 27, 87, 107, -82, 159, -31, 123, -32, -5, 5, 9, -73, 49, 125, -20, 12, -3, -135, 51, 64, -67, -77, -221, -91, 97, 190, 66, -168, -32, -180, -176, 28, -199, -4, -206, 146, 74, 213, 57, -62, -123, -40, -109, -29, -119, -44, -100, -153, 68, 117, 141, 49, 127, 11, -136]
4594a36l8J63N5JJ21j7l39K57k06K29j65j32Q1J81j13j77Q3K15j25K51mj86j27
4617a28R9oJ76j93P6k95K31R9n4m3K9l29K65R6L56m13P7k48K45M5l9k07M64j02
4641B01r5j48j28L08j26L3O5l57L12J6j99O9j6M5K62k95R6p6k2J67l01Q7K12l49
4665b39K18J40k07m9J03J34n1j32K38j36M2K32l54K44j41J16k47J2j76K39j88
4686b02K71Jk00M76j55j50k76J07j33J13J55nJ41Kl02Q4K15j9o4L1rj94O0J59
4710A06l17J04K26j87M2L08l00L0n7p3J80l1j4J4j13j2K03J06o0l8Mj15m0J43
4734A09o9K15j4m8q1k10J32N8J57l52J32k16M22k63J32R5k23Q1o4J26m78K44j63
4757b78K15o5K25m4k11Q3l0J93J01m3j69J19j56K81jk40J4Q9l20J33O5j7M5j02
$$ y = [-136, -174, -11, 44, 45, 166, 149, -190, 67, -139, 90, -75, -207, -126, 55, -58, -235, -152, 63, -62, 189, 185, -1, -128, -29, -35, 141, -52, 24, -271, -40, 59, 5, -38, -9, -338, -73, 23, 379, -34, 43, -205, 40, 85, 46, -161, 303, 201, 106, -42, -170, 138, 12, 45, 110, -247, 65, 81, -118, -49, -65, -20, 242, -53, 43, -33, -55, 112, -189, -102, 110, -239, -21, 119, -88, -137, -34, 100, 49, -83, 155, 19, 61, 293, -61, 183, 42, 158, -89, -77, -253, -14, -202, 69, 70, -130, 346, 191, 41, -235, -128, -261, -148, 7, 2, 143, 145, -157, -73, 142, 123, 59, 90, 81, -113, -53, 106, -211, -107, 119, -68, -26, 282, -18, 12, -45, -118, 62, 31, 17, 31, -82, -94, 109, 215, 155, 117, 121, 6, -34, 109, 40, 255, 241, 193, 112, -98, 34, 92, 249, -103, 29, -187, 235, -28, 104, 199, -24, 57, -7, 119, -359, -115, -278, -63, -128, 97, 53, -158, -75, -105, 88, 189, 146, -23, 96, -60, 221, 220, -20, -6, 83, -237, -104, -39, -56, -11, -113]
4781a13L90k59k31K31m3M9O0j36q8J21J1K42j84j71L46j39nL9qr8j4j06r0R2q6
4806a90j8J88J88j4j84j4N0j8r4J43k50J97o5Q1K3m4L7P3k39J14K27j26n3J75
4830A87m21K99kj15M3j25K12j20j39o2J38j55L46R4J44l88n2L9J28j73K6j0L6
4853g0M9j37K14J90m46J79J10kj79R6J07n4J30j01k1j08J83k03j38M18q5r9N9
4876I2k50K26m7m8K67k00R4l80J38KO7OJ48k48j89N17j82l4q2j20J61J22Qn3r4
4901g9J10L5k22L66j40k73L77j69L2j03j6J77n9P4J14j18m62L27j28K38k22p3
4923b14R9M55m43J69j57j52M00k06p2o0M03p4j27J6o7j8P0O4j36j3J19j55M2J08
4947E1j84Q2J88m3j33l6K3J3J35P3j70m1J00r9J34j2j27N3j56Q8J5r8Q8N3o5J66
$$ y = [-113, 277, 18, -213, 18, -25, 24, 84, -52, -140, -19, -8, 234, 50, -121, 225, 86, 81, 120, 112, 14, 0, -106, -196, -104, -190, -208, -20, 168, 154, -30, -44, 6, -12, -106, 37, -213, -16, -81, 0, 23, -21, 16, 89, -150, -36, 191, 65, 12, 187, -234, 65, 63, -52, -9, -134, 78, -42, -181, -243, -105, -260, 86, 180, 324, -64, -116, -77, 51, -122, -96, -106, -70, -21, -158, 56, 246, -200, -21, 89, 87, -92, 4, 111, 57, 187, 86, 65, -43, 140, -63, -201, 217, 132, 33, 92, -158, 68, 21, -27, 240, 40, 134, -246, -108, -106, -39, -33, 115, -133, -322, 195, 13, -21, -103, -223, -62, 60, 68, 15, -79, 31, 66, -156, 210, 70, -203, 174, 5, 37, -66, -82, 95, 36, 110, 224, 106, -356, -29, -157, 81, -141, -214, -115, 340, -103, 66, -91, -243, 157, -49, -121, -181, 222, 148, 21, 37, -30, -48, 22, 86, -50, -63, 56, -99, -57, 51, -133, -51, 137, 94, -39, -75, -52, -39, 96, 169, -1, -42, 58, -41, 93, 81, -46, 7, -149, -61, -46, -144, -56, -3, -68, 98]
4973I8k18J46n2L7Q3j31J0J68k13o1J41Q3k31J43L0P7r1j42K00J68l66J27m4M7
4997IQ6j34J9O2q4J71r1P7j34J75l33K41mKJ5j14n6P0J1N9nj92J75k44L22K24
5023C27j88j99J00k28K76r9M5J30k78J73j21J86Qo3L7J7j28J34k10J17k15J04
5045g5J13J31j21r8N5M1q5N0p5R1j41j47L06k76K52n5o6J64J82j90R9k78o2Q2
5069a03j1L82l22J02P7j83Q6j00M4j28L69l22J97J6j08J26j39j12K8K3J0J75j85
5092g8O5R3L1k14Q1L30j49k25J91o3J02j79k14L10l2j64K8Q1j65J99RQ6j4j05
5116DK6l6J09kr6pO5j53j6j1J19lr4N0q6J76K8j06K36p2l3r3Q2k2j45j60K12J01
5144G3j75K84l08L65l58K69l94J01L8J06j80J85J67r1q2k13L01k3k5k89L31j28
$$ y = [98, -120, 26, -26, 11, 94, -37, -27, 141, -72, -133, 8, 91, -140, 3, 33, 110, 19, -123, 77, 245, -121, 6, -38, 9, 95, -39, -20, 42, -42, 129, 38, 115, -19, 156, -177, 64, 60, 62, 77, -37, -93, -23, -12, 47, 42, -150, 25, -219, 103, 327, 139, -60, 40, -188, 88, -11, 34, 164, -114, 59, -62, 124, 132, 69, 106, 123, -5, 129, -81, 36, -179, -75, 38, 169, 48, -50, 5, 46, -39, 11, -64, 27, -114, -261, 45, -231, 21, -34, -100, 64, 246, 56, 155, -123, -185, -103, -114, 268, -54, 48, 125, -58, 28, -72, -28, -156, 213, -109, 88, 104, -4, 122, -17, -129, -101, -78, -68, 107, -78, -13, 80, 111, -103, -22, 308, 159, -66, 125, 62, 164, -15, -229, 81, 49, -115, -87, -6, -171, 28, 37, 123, 109, 4, 30, -6, 103, 101, 5, -2, 63, -90, -106, -117, 2, -1, -95, -45, -131, 45, 73, -33, 203, 131, 98, 5, 87, 65, -80, -240, -28, 73, -102, 182, -126, 239, -119, 150, -244, -143, -105, 1, -179, 6, 173, 82, 0, -213, 88, 65, 40, -249, 82, -46]
5166d6J12p5j6j23K38k77M20l19j15J12J53j50K49j67P4n1J6L0k88M16k80o4k16
5189c67K45R5K50m10J92j6Q7j86O3K24j47m8L9o8L8o5j38K81k1J46j68K0k16K03
5213C3j81J24J35n47N48L0k19k2J21Pn0J29j23J7O9m5k70M31n07K67J7j51K74
5236H7l8j30o8K52m00N84k81j70J9mR3K78j77K6j20K0J69k60J18J54o7J16j78
5259B3p5o9QL8Q5m6k19K44L5j08k36L49l23K94k1j92J73J90j06k61L64j92J19
5282G4Nq0l9q0J76J7l7J45l46J4N4R8K0m8r6K26k36J35n2J36j21PP2k86L6M6J22
5309c8L9J68j22p1O6k69K98K12j04L8j88P2j62J70j44j1K03l58j13M12j31J6J55
5332A38k0j06j2j53J59j90L68j30j0J29k39K46l01J04k1RJ23Ml12J09R8K50k73
$$ y = [-46, 66, -9, -25, -148, 90, -187, 233, -86, -201, -89, 64, -86, 163, -4, 70, 19, 35, 65, -223, 193, -87, -151, -367, -122, -27, 223, -187, 5, -11, 76, -110, -47, 177, 30, -18, 21, -47, -9, -74, -212, 69, 48, 194, 26, 46, -170, 33, -148, -24, 111, -436, 112, 142, -77, -99, 22, 29, -21, 108, -15, 2, 71, 26, -244, 187, -320, -53, -36, -187, 87, 49, -81, -149, 103, -297, 287, 6, -164, -145, -149, -56, 222, 45, 71, -49, -29, 140, -120, -2, 152, 85, 201, 23, -52, -121, -113, -75, 10, -36, -255, -11, 24, -84, -320, 29, -294, 0, -21, -213, -40, 150, 44, -217, 147, -45, 74, 79, -1, -40, -120, 56, 73, 36, 181, -165, -151, -97, 1, 21, -27, -123, 103, -133, 2, -50, 86, -35, -28, 44, -242, -206, -160, -38, 1, 169, 47, -24, 42, -227, 71, 283, 179, 217, 29, 101, -61, 109, -35, -46, 157, -201, -314, 98, -33, -17, 138, 118, 12, 0, -153, 6, -184, 184, 54, 44, 173, -66, 180, -121, -17, -38, -29, 94, 98, -214, -105, -7, 243, -30]
5355c0J50k32K42j68k6J90l11N29n84K86j27M2J18j19J47j35P6l11K20Oq1P9J41
5378A02k02Q2j69P0L3J63o6k90L28k39m3L41l46J22J69p8k8l3N5J5k7N6j69J97
5402D3P4k52q1o7L47K4j20k32L19n4O5j33o5J85j19R0j62JQ4P0J1k0J50j25o7
5427c4J06k34L12j93J27l04M57q0p0O3k71P1J46n8k7n5K62k17l25J67K43J40m31
5450b05J67j80O9K91j37q5L0J13k8Q4O4k12K12l46MJ74K4L5j70J99Mj18N5k45
5474b01R8K25j59q6J98k61P0l4J51J11j75J66j53k9N6j9K09r9L9j43P4j84J25
5497b1o3J57j01J24j84Q6j95K26M3j85J91l87M25r0P1j92J62k5O1j72m1O6O8M9
5521G3N2r2q0j09L48k73j40M52k94n1K35j37M5q3j1J65j27K09nj42J7q2PK87k44
$$ y = [-30, 120, -112, 130, -38, -64, 126, -185, 344, -240, 46, -81, -39, 79, -40, 107, -28, 48, -263, -43, -37, -118, -39, 102, -100, -18, -187, -117, -84, 79, 13, -277, 51, -188, -231, 110, -236, -114, 55, -23, -51, -84, -29, -14, -41, 15, -154, 43, 117, -135, -216, -283, 64, 88, -32, -264, 55, 1, 66, -67, -132, 53, -66, 24, -138, -137, -53, 17, 28, 8, 158, 33, -34, 72, -162, 150, -43, 84, -220, 237, 157, 87, 150, -121, -50, 96, 38, 11, -44, 218, 1, -324, -157, 86, 226, -205, -38, -218, -149, 142, 5, -80, -50, 63, 35, 119, 183, -29, 183, -163, -159, 15, 39, 74, -96, 103, 107, -11, 44, -201, -103, 122, -37, -123, 75, -186, -116, -150, 1, 112, -63, 103, -50, -79, -23, -42, 167, 68, 107, -36, 38, -146, -21, -84, 73, -28, 96, -88, -2, -197, 29, 72, -113, 78, -309, 116, 26, 97, -95, 67, 42, 103, -69, -110, -44, 24, 73, 125, 33, -47, -156, 192, -81, -221, 231, -63, -114, 121, -16, 29, -54, -65, 100, -27, 182, 177, 35, 52, -30, -23, 264, 20]
5546B0%p2N9P7N3q2R7k45J77q2J04j04j27N1L8m4j03K68j30R3K28n76K91O2j04
5571e1PK61j09j04L1o3J15j08J71n9r4q6J07n8M2j02O9O0j5l7J49j32K9J58q1
5596A00l7o4M2o1j04O9j6o3K34j73L74l69J62J64l08J10k89L71j57O0l21K79L
5619Fj36K08j64J12O3o9M2j94M0K72j97j14J42n0p7J29j17o1K01q4R4P9j49l06
5643c30L47m5J57j76%q7K03j28q1L37l9j88K2J62m09L01K47k07M0j45j95M83j52
5666A17J14l12J83k24P6J5N5R3M4r7k01r2K16m8j90K06O4j17K7pJ87q7j88K62
5690I6j4J1M2l10L9J65K91j74j76j20L07k96K95j81L3R5k40O0rK31k1n3R3o1o2
5715D1n9n3K17q5k98P8L84k25J22j11n0l5N2J47m5L8N0k41J36L2l4pK4m2J00J49
$$ y = [20, 20, -52, 7, 84, 137, 55, 152, -93, 84, 2, 106, 2, -125, -74, -36, -80, -183, 85, -45, 48, 276, -300, -9, 53, -51, -44, 217, 108, 4, 35, -28, 87, -21, 150, 91, -3, -89, 18, -40, 2, -100, -31, 29, 14, -23, 126, -6, 23, 181, 100, 63, -1, 41, -20, -124, -55, -71, -134, 100, -73, 301, -68, 94, 258, -50, 60, -229, 142, -15, 45, -276, 3, 6, -130, 78, -86, 26, 89, 20, 62, -132, -92, 180, -17, -131, 11, -39, -116, 13, -104, -165, 36, -48, 46, 125, -24, -330, 17, -28, 129, -47, -47, -134, 69, -59, -140, 197, 158, -30, -8, 154, -255, 46, 293, 86, 126, -19, -214, 269, 117, 231, -81, 102, -122, -46, -31, 24, 117, 161, 64, -137, -229, -13, -61, -251, -45, 19, -98, -71, -78, 109, 22, -166, 96, 82, 93, 135, -175, -136, 29, 320, 146, -30, -150, 157, -139, 156, -25, 8, 103, -137, -77, -86, 145, 124, 71, 164, 103, 41, -18, -71, 146, 61, -237, -159, 225, 0, 122, 11, -39, -74, -22, 125, 80, 118, 168, -73, 63, 95, 61, 54, 78, 36, 136, 285]
5741B85k38k22O1R9k3P0J71m68K49K52j48j99j21J29Q3q9L90m94p2L12l4q8P1
5764b4J10m1k52K35k5k0K23j55j02J62l57K57O7k22P6m3J91L2m19M94p2o8j73
5787a26j27K87j09K55l9j42K4L3o7L3n3k01L34j33q9L39j72k3m8O2J11k10P3J18
5811A30N8l32J72l37L39Qq7L5J4R0J72j91J63k73q8J25N76p08l1K45p6n4K53l1
5835A72p1p2K5o9j00P3K6J60l05j45M70j36O4L3r4J59k90j4K17R8j62O3j21J08
5859H9j28o8J11n3N5k35J20J39l2j58J52K93k89P4j35Q8J2l5J57k02K0L7j12O3
5883c7J13l86N34Ml76q4J29N2J21j12O7J76l59M26m25K34j25O2j52L80m74K78
5905D6mn2M2P3r2J57j20j69o0P4J18M9j80P5L6k8M5O7o6p4K88n07N23j38r4j44
$$ y = [285, 47, -175, -114, -15, -38, 32, 203, -265, -16, 236, 88, -111, -232, -103, -20, -109, 281, -213, -285, 27, -7, -95, -24, 86, 45, -207, 28, 3, -17, 206, 51, -51, 111, -246, 11, 78, -144, -68, -111, 80, 112, -307, 187, 115, 47, -126, -253, 34, -75, 180, 141, -1, 23, 56, -11, 22, -31, -232, 102, -31, -120, 219, 47, 24, -24, 38, 149, -61, 12, 130, 188, -144, 28, -309, 30, 38, -49, -14, 0, 90, 262, 71, 234, -39, -127, -2, 574, -134, -165, 80, 4, -50, 203, 172, 101, 29, 54, -15, -115, -42, -16, 144, -161, -306, 164, 28, 92, 125, 31, 190, -100, -114, 103, 201, 39, 102, -19, 89, -39, -107, 4, -49, 6, -229, -109, 30, -2, -160, -8, 285, -4, 70, -65, 23, 35, 0, 157, -45, -25, 12, -100, -37, 76, -310, 224, 228, -148, -232, -103, -51, 70, -42, 25, 201, -158, 268, -157, 77, -48, 14, -138, 242, -232, 46, 42, -10, 32, 105, 13, 170, 50, -119, -179, -105, 13, 62, -118, -43, -7, -35, 10, 77, 11, -63, 225, -282, 241, 103, 9, -135]
5931a35O6lK38k00J27j13j88K44j24J57k5K15q0p6k86K9M9M8L0J4O9O5k20mL4
5956f9J96k57J17j68O6J58j00N1k16J01J6j2L43l50K36l8j70J86m8m1J52m2k09
5979i8j03L16j97J10j20K50k09K6J47m8j80K40p6L4Ql7l04M16o3k82J75J05k19
6002a09j21n5K20j42K5J70P5j18p4J67j70J8J42j10K1J60Lj73pR8J04j62L7J4
6026A3l43K53j10K37m3M9k23n3J61R1K4k34L6q5J03J61j71K62o0O7j06K04j07
6049A26N5J4p0L8k19K07j42K6k1K0J24o3k49K43%l01K02p3J93j13l0J47j61l40
6073c87L96n2P4Nj88j22L71o0j81J03j26L40rQ1l72K4J52L0j03J3J57k4L2j87
6097c3J57k80J61r2K19j03j35K61j95p1K7m7J45N1L0J02j36m0nm4l2K46M2j71
$$ y = [-135, -69, -72, 166, -34, 93, -20, -208, 36, -88, 69, 44, 259, 179, 103, -183, -154, -105, -57, -27, -13, 56, 121, -99, -103, -69, 127, -130, -13, -181, -115, 43, -57, -6, -222, -121, -105, -117, 226, -124, 112, 74, -96, 90, 42, 1, 153, 111, -98, -201, 115, -82, 28, -92, 158, -51, -25, 122, 74, -106, 134, 58, 92, 100, 63, -241, 175, 112, -170, 5, 110, -109, -230, -285, -65, -207, -182, -12, 63, -55, -129, 38, -132, -114, 28, -82, -61, 99, 102, -71, -78, 20, 124, -38, -1, 13, -330, -77, -187, 50, 7, 56, -167, -220, -59, 32, 56, -178, -142, -227, -124, 37, -134, 128, 68, 135, 29, 233, 126, 181, 195, 125, 163, -56, 151, 9, 35, 14, 34, 158, 95, -154, 89, 89, -212, -10, -83, 110, -3, -33, 114, -47, -387, 9, -43, 31, 36, -152, -274, 97, 37, -144, -41, -167, 173, 164, 245, -127, -103, 49, 79, -24, -11, 146, 122, 154, -33, 124, -156, 5, -87, 132, 29, -106, 155, -40, -111, -84, -131, 14, 65, 95, 197, 61, 21, 16, -28, -60, 186, 228, 57]
6121E7m5j27l4K96k66J27q9j50L06J1m0r5K06l67J70n0j34J40K44j78j91K77J2
6144H0j27r4K48k27K75q5j34m6K48k11j04N9p6J37J88j59l2k4l3J81L4k46J88
6167D0m9j27K1J42J22j70N3K9J6j40J18j56k3O1J31J69l56l2J67Q4o4j16J43P3
6191A36j29k4p5P4n9l2J32J04k63k54M07J99j94K1r4j17J98L6m9Q0l46N24k37
6214C8N2nj55N6J95j72J72K26m46K8N1J64l02OrK62j39K08j28J55l91R6J76j48
6238a0J37k3J32k66r2K7J98Q9n3k40L51l54J29j57K93j54R2j00J4P8j74j1q2K26
6262E0r5O1r0J27j49K67j93L11o9k37j1Q0l8J10k27K05m9Lj30J35nK0j49K05j85
6287e3r2K48j36J7q8K4J30m6Q0j37Q0j08J41P2j50j45L71k50J98j38K6J86l36
$$ y = [57, 12, -115, -149, 147, -119, 8, -81, -231, 75, 86, 46, -49, 157, -210, -40, -90, -224, -84, 160, -18, -209, 68, 80, -47, -141, 107, -120, 155, 70, -64, -110, 138, -73, -177, -118, -194, -57, 131, -28, -60, -84, -117, 64, 98, -148, 40, -9, -136, -115, 27, 149, -21, 32, 61, 77, -63, 55, -101, -124, -63, 68, 237, -119, -151, 16, 100, 36, -80, 63, 136, 7, -17, -92, -18, -77, -109, 23, 127, -136, -390, 17, 216, 22, 43, -51, -168, 30, 66, 17, 97, -249, 275, 38, 90, 85, -70, -14, 181, 9, 181, 407, -39, -11, 40, 204, -98, -92, -101, 161, 22, 230, 102, 257, -134, -38, 138, -10, 127, 104, 236, -30, -122, -95, 103, 192, 139, -101, 250, -104, 25, -132, 161, 7, 99, -1, 13, 91, -83, -94, -176, 50, -45, 16, -74, 53, -96, 171, -22, 289, 220, -17, -28, 52, 14, 124, -103, 102, 53, 56, -74, 61, 56, 76, -73, 132, -53, -145, 103, -33, -16, -104, -80, 50, 4, 84, -53, 27, -81, 60, 132, -18, -163, 208, -42, 156, 18, 44, 230, -106]
6310a06J11J75k48L1K76k70j4K53k81J24l7Q6k20P0K6K04j60l6P5j6j91K77R0
6333B19k24j79J91q9J59j55O6k16J66o0K71j49j7j15P4Q8k9R4j91N4J41o1k40
6356b02K91K2j22N0O5j10N9L2j48J02K4o1k1J89m39J65P8O4M7j06%J79j95K0P0
6381E3r5p8J87m0J2m6J08M0j38m8k63L66j58j52M98k66J35k11K00l13K72j33l
6404g3L7o3Q8j79K52p0J67k14p4L35j21Q6j94R2N0k36K05P5j43r2J07lr2J78k83
6429a65m5L34M1k67R0j36K98m2N6m3j31Q4L0L4N9l67K30j04O5j83K42j57j2Q2
6453gk0MKj59%L31k01K73k58j2P6N6N8m4m6j32L1K17k42J21j18K65l13O5O3M1
6479E1j28KN5K73k69j05Q3J25o5Ok23j66M70k59L56k66M5p1J08j54J80J43l48
$$ y = [-106, 5, 180, -68, -37, 239, -31, -45, 208, -73, 51, 14, 100, -120, -50, -24, 180, 20, -16, 59, 43, -148, 129, 219, -5, -184, 7, -82, 77, -78, -12, -228, -62, -122, 149, 0, -17, -132, -58, 30, 1, 95, -96, -42, 99, 38, -202, 89, 111, -11, 39, 104, -6, 53, 85, -63, 39, 63, 2, -19, 170, -269, -104, -26, 38, 85, -21, -21, 158, -37, -17, 53, -42, -120, 67, 27, 39, -7, 101, 141, 3, -45, -308, 58, -100, -252, 246, -20, 115, -96, 104, -209, 63, -70, -73, -36, -99, -11, -190, 62, -8, 159, -55, -129, 206, 85, 171, -23, 69, 119, -117, 88, 163, 20, -72, 35, 32, -60, 118, -165, -210, 124, 165, -102, -12, -148, 150, 108, 164, 121, -10, 74, 104, 138, 197, -170, 60, -44, 21, -162, 80, -77, -89, -7, -27, -23, -21, -180, -180, 151, -50, 223, -35, -47, 29, 85, 143, 99, 53, -79, -48, 169, -73, 48, -70, 195, -118, -53, 10, 51, -77, -75, -20, 253, -16, -121, -38, 87, 22, 28, -195, -361, 109, -150, 206, -60, -15, -86, 22, -132, 48, 191, -157]
6502a57J6L48p4k98J23k3K38j29K1J43l27R5J20%j98K1K01J37j09j19k28K03r3
6525h9j18M56k24L0q8K6k9j48R5L4K10r1J3l99K98qm1J17N5l24K49k45L68l69
6549b22R9KJ81J22k06j87K06o0k09J78m8L04r4j39J46j15q8J77k1p6p7n3J30j21
6573a71O8p0K80j70P3r4j27K22l4q6K36j6K1l58J93l02L07J91k40K58m22K26J95
6596A80k78K19m91L75R7k72J38k2P9j50K03J00j24J3J2Q0k01O7%r0j24L52k32
6619f9J6J13k93J03J5K26J39m76K65J37p1l8j56Or4J18J27M0j97J34o6nP3J5L
6644F5q2n2J38Q2l45K63k48K49J20l28K72K07n86K05J60J57k06j40oK2j28J11
6666g0Q7j9L9j99MK05j62K8K44L1l76K19n1j73J05K65Jp6J5j21J45j78J43j78
$$ y = [-157, -141, 207, 133, -165, -42, -65, 173, 44, 65, 208, -119, -24, 96, 96, -102, -81, 120, 257, 148, 29, -199, 4, -89, -207, 249, 25, 55, -33, -7, -36, -184, -89, -55, 155, 64, 77, -322, -24, -32, -73, 44, 99, -225, 24, -221, 147, -222, -123, -121, 60, 182, -24, -211, -5, -65, -274, -96, -144, 160, 66, -73, 73, -42, -130, 47, 26, -50, -127, -180, -50, -171, -103, -173, 107, -63, 10, -84, -211, 11, -23, -109, 127, 111, 132, -226, -33, -335, -28, 163, -77, 181, -241, -15, 180, -98, 121, -370, 5, 102, -170, -32, -54, 25, -125, 78, 178, 54, 67, 79, 159, -42, 25, 25, -65, -189, 163, -69, -53, 60, -233, -130, -115, 111, 250, -226, 39, 176, 105, 67, -89, -83, -177, -59, 68, 108, -89, 45, -21, -26, 47, 62, 65, -17, -69, 69, 151, -194, 69, -179, 70, 190, -138, 134, 341, -245, -40, 120, 277, 71, -69, -75, -53, -181, -70, 17, -2, 37, -162, -158, 47, -115, -87, 157, 188, -188, 31, -20, -193, -88, 177, 178, 102, 117, -4, 141, -37, 106, -72]
6690g2L04k90O0j80R3Q0j67J56J19O5o5N8k35j7Q6J13l15K69k11L11j18k9j50
6713a35J16K28l26K43j02q8j3P5k17j3J70j80J33M2J59pj76R2r8K4K08P2k41P2
6737C8j06J40k23k4L09j15k53K66j36J58Q9q5j97l9J23m5K41r8Q3q3J15j42k01
6760a85P4J62j32J75p3p7k5r5K43m3J11O9j11j23r0K37%o4M1j4kJ6l06M93l06
6785b5N0N3P4k12K10j42j67K14j48p4Q0K92k73J27j67J43k06j03K36n9L59l67
6807a05m1K81j50J96j99j52J62pJ71k1j69k4k0J05Q3N6j83n7m7J62j58L71l49
6830i5n2MJ56J2j54k15N4L28j71L26l07PL37k98J30k6j78J74JL7J61l64r0P7J40
6855fo4Q2k4j46P2J40L2M0J11j27J3M5j07M7l5k08J09%Ln1l9j33K18J11j37n3
$$ y = [-72, 232, -58, 2, -178, -85, -5, -172, -16, 103, 168, 103, 161, -74, -91, -5, 108, -207, 62, -149, 162, 44, 15, -135, -19, 209, -117, 126, 24, -64, -77, -2, -219, -232, -62, -242, -109, -67, 92, 85, -91, 1, -97, -73, 135, 207, -34, 38, -68, 72, -151, -175, 134, 19, -234, 32, -104, 54, 143, 58, -139, -178, -55, -100, 141, 43, 126, 43, 158, 16, -185, -111, 51, -81, 94, 21, -56, -81, -176, 67, 24, 135, 204, 93, -30, -120, 117, 117, 53, 94, 80, 78, 94, -212, 281, -25, 25, 78, 152, -60, 150, 8, -159, 55, -93, -167, -87, 205, -68, 59, -108, 35, -171, -274, -38, -97, 262, -105, -146, 135, -15, 181, -18, -170, -8, -15, 156, 135, -34, -58, -78, 27, 110, 166, -17, -74, -121, 41, -117, 254, -95, -147, -143, 13, 25, -129, -344, -290, 38, -133, 193, -114, -107, 230, -68, 62, 36, -142, 32, 33, 70, 231, -133, -223, -146, -6, -70, 12, -12, -158, -86, 54, 86, 126, 237, 110, 123, 168, 61, 108, 73, -135, -26, -26, -23, -74, -113, -246, -28, 83, -54, -107]
6881a07J33J77k84Q0K08p7k24J53o7J17Pn6J80l01J62k31K54j94J05o7j71K52
6903D9J7j55p5J58K27k60J22l13K03n6J55o1n7N9N7P7j19K28j65j61L1J6K51p9
6927A49k07K76j35l0j2q0M2k32J80M1p6j26M47l79J11L43q1m9k56N0O9J0l2j76
6951a53q9K97k20K14k8j2J75J8l91M0K00K04m71K1L57j57q1J85j13O1Jj79K42
6974A21r0Mo4j94L91k18J61l63J21J34n6M7m5J72j64j95K79L69m02j70K31J07
6996A76j06k50O9J57o9j56K32j50J63J11k20M7M5j26J8J47k25Q3oj02L21r9k05
7019a45R7N8J33j69m5N6J13j1J41k33l1j05J9L01o9O2l00J66N7lj48k77M81k94
7043a46J33j17N46l27K6k21K44O7j70l09L23k92L46q9j19N3K35k00J2pK54k1l63
$$ y = [-107, 26, 203, -81, -1, 207, 130, -94, 59, -8, 109, 116, 60, 240, -61, 101, -130, 124, -70, 35, -32, -203, 49, 66, -89, -164, -6, 221, -39, 83, -230, -27, -83, 72, 11, -46, 13, 70, 147, 28, 256, 91, -70, -39, -23, 228, 149, -58, 218, 83, 53, 41, -39, 3, -229, -49, -8, -84, -210, 237, -142, -31, 312, 231, 182, -74, -24, 45, 55, 23, -153, -242, 55, -165, 49, 21, 9, 184, 202, -189, -149, 51, 255, -216, -195, 162, 5, -76, 109, -4, 57, 58, -121, 121, 31, 35, -29, -223, 168, -50, 111, -252, -131, 3, -53, -6, -51, 121, -43, -238, 41, 410, 8, -162, 69, 176, 70, -180, -111, 46, -23, -179, 53, -97, 66, 177, -43, 4, 49, -77, -59, 88, -137, -54, -60, -162, 159, 60, -145, -48, 10, 143, -26, -71, -15, 98, 87, 228, -5, -36, -141, -122, 179, 110, 172, -128, 38, 95, 92, -56, -333, 148, -146, -13, -130, 416, 89, 115, -106, 138, 205, 35, -274, 49, -243, 103, 14, -105, -52, 183, -17, -5, -12, 242, 221, -142]
7066a42M06k24p3n2L21j85m0J0j68J08lk7n7kl03L44K57k12J14n2p0j10L68l80
7090a72L21k31R5L13q2p4l48R2r3o9L01k27pJ02NL47q8p2l20rL43m27J56Q1J64
7115A01r8N7q3n7n0L80k61m06M33ln0OR5J8K28l96J68j86K00l1j67J43L8j47O5
7140cj56J97K11n19K61q8M8J95j46p1R1k21J54J43j62J74j46jm9P9j76KJ81Jm4
7165d5J93k86r6K42N2l20L54k75k1L22j47J58J23r8k0j25L6J52j81j02Q2Q8p0
7188A6M4k79K83p1K83l87Q8J40m53J68K50N6k78K66k25J77r0j01L73m25J0M62
7210C07m83o2N55m15l0K73j98J96J10k37M8K9p6J81L5j60oj90J05J22K54k38j33
7233a3l8k36K13J35r5O4Q2j36Pj7J30J4j31j82Q7J73j42mj28o1N59l86J51k29
$$ y = [-142, 264, 40, -33, -85, 236, 51, 11, 21, -147, -39, -42, -69, -126, -128, -431, -87, 170, -42, 72, 20, -50, -160, 208, -172, 149, -82, 13, 326, 244, 170, -178, -86, -179, -248, 53, -174, -181, -79, -74, 273, 185, 113, -207, -216, 127, -300, -144, -63, 101, 3, 60, -23, -80, -130, 250, -11, -417, 16, 13, -37, -31, 64, 82, 310, -86, 82, -104, 96, 65, -102, 41, 79, -68, -3, -159, 38, 249, -270, -9, -97, -49, 146, 0, -71, 20, -201, -47, 96, -66, 108, -38, -39, -88, -9, -185, -183, -2, -1, -45, 148, -138, -234, 8, 60, -260, 94, -181, -202, 120, -27, 131, 254, 156, 136, 11, 47, 199, 18, -84, -2, 86, 16, 60, -219, 64, -7, 276, -111, -23, 117, -336, -168, 82, 138, -140, 126, -99, 78, -12, -113, 260, -165, -155, 307, -176, -238, 317, -98, -128, 145, -53, 143, 253, 16, 64, 93, 17, 198, 233, 73, 67, -123, -18, 104, 358, 120, -13, -51, -287, -74, 61, -34, 30, 112, -24, -17, -34, 96, 110, -21, -203, -116, 57, -85, -89, -217, -278, 281, -105, 46, -183]
7257a83J2J09R7k10L82o9k08K16j83Q5mj03j22K68j02J2R7j43R1k52L11Q3l70
7280a86K54j61q0P6k5n5L06j38l38K4J44J73J08K8k67J46lK46k62L5j49K52k47
7303a19J19m1o1l6K40J03m05J52R5L0j99k2L63k29J8q0J11m17M73m6j63K62k55
7326a07o1L54m24M00q5l0j25J91k7j58qJ50O0k34J52J09k30Q3J79m5l19J80Qo3
7350e0J56O2k08L0J66k57j33K86o1N2Jr9J57J1j40Q8O7j27K15l10L14j66J89j63
7374H0p7J84j25j41j8O1J13q2r5k6K1K8L6p2P0K3OJ8j70K04M4k00K25Jj48Q1K22
7401B63n07L06l36K13pmp5J18l5J23J20j80j96J60Nj52J61P6j96K5J5K29J04l76
7425a46J34P6R0k00K20l50RK63k74P5J41r9K12l69L54K5k26K8m9K55j31L2j92
$$ y = [-183, -171, -62, 35, -175, 207, 138, -70, 146, -37, 48, 44, -59, -181, 87, -15, -3, 94, -49, 42, -210, 101, 184, -186, 68, -93, -173, -97, -122, -177, 129, -9, -347, -323, -179, -6, 102, 130, -137, 9, 6, 252, -10, 25, -124, 128, -119, 0, -41, -102, -138, 102, 205, -200, -48, 47, 77, -122, -144, 219, -10, 8, -72, 39, -378, 95, 49, -114, 148, -107, -168, 186, -238, 162, 77, 47, -78, 113, 86, -72, -80, 70, 130, -104, 48, 157, -73, 10, 189, 144, -175, 5, 13, -50, 106, 168, -40, -10, 156, -101, -234, 52, -9, 43, 44, -55, 102, 113, -27, 61, 128, 1, 216, -94, 220, 54, 243, 80, 3, 187, 62, -79, -97, -36, 77, -5, -100, -126, -105, -77, -41, -113, -43, -20, -14, 4, -166, 38, 82, -118, 107, 108, -40, 41, 263, -244, 62, -274, -61, -68, -72, -147, -29, -64, 59, 179, -1, -197, -37, -32, -184, -23, 53, -143, -118, -103, 126, 230, -146, -12, 64, 154, -46, 174, -176, -167, 96, -178, -103, 38, -61, 151, -218, 136, 161, -65, -37, -86, 169, 38, 70, -122]
7448a22k8O1J21j34J60l04J08J56m4l12M66o2j79L5M47j78j14k78J34R0j32J07
7470bP7j53j54M14l36K63j61j11J42k9K3lp7MJ96o1O1m4P4j76J39J15m35L81j12
7495C5r6P3J54k16m7k6J65Q6l20K36n3r8k25K76L7Q7j36K17m0k37M6Q2K76k46
7519C0K18l21K4K09n4j53R3L5J02q3q0L1J41k03R8j32N1j42K23k26J72N0j31J39
7543I1r7K45l66l3L16j48J66j49k05pJ34J34j30O5l31K57L4J49o0k00K44k27J16
7566bL12k10L0m59M03q9P8N1j35K52O7n38K45j59j6k27O11j27k1k87M35o0r9P5
7590A30m41K59O2k1K30P6j78k44L63l54j73J24J05J06n9q4K78P3j31k06J97j78
7612f6O6J59k84K90j81j13J36QnQ8k08M2j65L33j17k1P6k17K23j17J26j4J07p8
$$ y = [-122, -150, -89, 32, -102, 58, -246, -138, 18, -26, -338, 128, 66, -113, -78, 369, 191, 77, -201, -67, 23, -109, -2, 75, -78, -232, 182, -154, 109, -52, -163, -21, -50, -27, -30, -107, -103, 93, 32, 93, 49, 123, -53, 86, 201, -234, 147, 35, -61, 12, 166, -50, -97, -123, 42, 128, -192, 44, -9, -107, -332, -56, -19, 68, -68, 149, 109, -128, -82, 0, 276, 30, 248, -73, -49, 160, 106, -47, 46, 81, 183, 100, 20, 51, 192, -11, 87, -45, 6, -136, 87, -139, 33, 83, -48, 91, -6, 239, -127, -160, 156, 8, 174, 25, -180, -187, -53, 81, -49, 16, -315, -58, -24, 125, 65, -135, 109, -118, -2, 310, 100, 130, -329, 74, -15, 63, 114, -21, 231, 298, -240, 5, -154, -170, -397, 214, 87, 66, -221, 214, 154, 55, 130, -311, -52, 10, -11, 219, 295, 117, -127, 236, -118, -291, -167, -62, 44, -15, -99, 179, 252, 121, -85, 112, -66, 0, 159, -125, 165, -16, -129, 7, 15, 10, 98, -110, -68, -233, 100, -17, -38, 38, -179, 44, -73, 53, 39, 146, 68]
7636F8j18J2O0J00k18O9q6n3L68q7j47j97m7K94q2o7J95l07J23J34N0j11J00J45
7660A98k83r9O8L2P8k17J38J23k06J22K3J6O9k93J48j06J69%rj62J66J41kl7k83
7685b06K16n2o6J36O8j12l57L74j45J8j69K08P5J11%L6q7K18k4j30j99OM4O3j19
7710i3J73J18k82K9m9K55j10o0q0J33J8Rj17K13l6jj25J13Kj88J87K5j87n9l0
7735a42J59j64M2M10k65n6J76j10j34P1J38j61J52j64N8p7l8Q7J09m6q0%J75j75
7759c5J8j0K9K25m89J50L69j37j73N8o6P4J10j66R2M6q0j98j16L66j4q4J3m3N0
7784a1K11l16j1J45j85J55j62K89l22J97n1k25M46p7qk8j35L24l02rJ26n6Jn8
7808f2J10j06r6K05j12J32M1k26K76j58j05l4N8K65r0r4L1j41j69L74l2O4j56
$$ y = [68, -50, -38, 22, 122, -96, -27, -113, -166, 202, 115, -32, -229, -276, 18, -64, -131, 64, -243, -120, 14, 64, -47, 53, 198, -85, -184, -116, -84, -6, -223, -85, 38, -168, -46, -23, -7, 62, -231, -83, -189, -20, -20, -29, -191, -25, 116, 114, 77, -206, 10, -42, -108, 28, 96, -16, -373, 1, -144, -126, -295, -87, -12, 99, 99, 135, 48, 266, 242, 112, -87, -81, -37, 26, -93, 80, 198, -84, -55, -104, 151, 41, -19, -99, 34, 52, 61, -56, 157, 121, 120, -5, 108, 110, -78, 109, 134, -53, -112, -142, 17, -147, -105, 305, 40, -16, 160, 50, -84, -13, 125, -36, 116, -48, 10, -67, -105, -18, 91, 45, -35, -35, 140, -35, -17, -27, 2, 227, -262, -112, 257, 120, -53, 5, -61, 13, 123, -43, 49, 95, 15, -183, -299, 67, 53, -31, -18, -61, -11, 200, -116, -127, 18, -167, -12, -174, 115, -207, -10, -61, -286, 160, 83, 75, 47, -88, 236, -66, -75, 51, -5, -4, -62, 48, -58, -154, 51, -61, 71, 112, -114, 162, 4, -101, -135, -77, 188, 98, 4, 35, -106, -275, 99, 67, 131, -25]
7831b5q6J79l3J10k44N3O0m8j53J50n6L9m3J19j20n8K99J20l00J66k88P7K84q4
7855A18j83J73k22K35l4KMk06K24K1l2pR9k30J61k12K28j00m6KK5K1m0K0P9j70
7881g0Q7K6m6j16J17M7Q1j50J32oj04J34j76o7p7J51J16o1R7k8k9k09M52l43J33
7906I1l7k0J13j45O2j7j87J12P8J38l6j38o6J72p6J53k40J23j01P6l23L21j14
7929f1J73k56L23k17k4j31J66j16K10j25k5m4p5L22o1P8l61K93p8q0K08R5k47
7952c3O1L4j57K45j62j68K21J23M6j07j72M40m27j8J28j88Q8J30j6L7Jj53n3j76
7976b76M81l38r6L78j76J9J42j08M6K7k43L00j09k9N1j68J5j07R2M9Nq3K58J17
8000B47m21J13k21L19m3j62J17j9k6L0j2p5K07J09r4j31J03N4j05J48j84j20L74
$$ y = [-25, -111, 68, 35, 145, -99, -46, 14, -34, -187, -37, -93, -54, -97, 22, -98, -156, 143, 263, -37, 129, -159, -82, 202, 118, -65, 108, -114, 121, 87, 89, 93, -113, 111, 132, 100, 93, 192, -38, 123, -89, 139, 39, -7, -5, 20, 41, 1, 21, 100, -70, 17, 43, -3, -119, -2, 45, 126, -24, 108, 102, -2, 132, -44, -111, -188, -37, 79, 18, 115, 87, 58, -151, 301, -42, 91, 54, 34, 147, 2, 64, 47, -140, -28, 50, 188, 152, 14, -52, 120, 44, 197, -43, 80, -21, 55, -268, 53, -61, 112, -144, 179, -38, -62, -193, -27, -143, 67, -58, -83, -127, -202, 120, 59, 137, -224, 69, -9, -89, 119, 214, -33, 28, 62, -95, 150, -12, -180, 41, 164, 210, 103, -69, 371, -56, -74, 54, -134, -46, 84, 68, 105, 106, -47, -100, -276, 205, -133, -229, 149, -27, -8, 134, 26, 72, 99, -144, 156, 47, 18, 69, -99, -84, -191, -99, -50, -45, -128, 130, 247, -174, -61, -282, 37, -6, -168, -51, -70, -96, -66, -78, -153, 54, 163, 69, -62, 41, 95, -10, 138, -46, -166, 208]
8023B08p6j34l0K8K39k91J96k2j53P0l0r1k4P3l1K01k55J47R6k13O4kNj37NK12
8049E5j00l0K82k52J03j97J00j21RJ17k9p5J05n4k2K73l50L53k57J31o6K55K0
8072B50k40n5J50j6K2l9M8k4k64N3j5J42P0K35l37L9O7j41j39K20j57J96o5j0
8096a0O4k64K68Q4Kj68j35O8m7J69n0J72l40K85j26j01J74p0j1J20j20J90l79
8119b25K29M4o4K3pL52l46j29J70p5J99j47M2k07J16q6O6L9j83K96m5M8j06M5
8143D9r5P1j11J6M35k33o5P6k03PO3m9NJ27j57J19k44J17J72rk11L00l24J48j40
8168a36J91n6j74K26j27j62K55J2j10l4L28j97Q1o5k8n7J0N4m0R9m1k0N8
$$ y = [208, 132, -2, -32, -4, 235, -56, 140, 118, -35, 35, 5, -86, -110, -37, -68, 133, -122, 25, 121, -92, -28, -30, -25, -162, -157, 55, -45, -75, 207, -45, 58, -139, -39, -160, -151, -34, -63, -138, -33, -87, -109, 164, -186, 167, -90, 41, -25, 230, 250, 10, -45, 105, 89, 111, 72, 120, 96, -168, -115, -130, 12, 82, 317, -20, 19, 86, -55, -194, 26, -131, 65, 0, -10, 54, -210, 58, 142, 144, -24, -159, -91, -138, 31, -19, 153, -187, 98, -28, -129, 45, -25, -36, 84, -36, 154, -225, 4, 48, -16, 7, 0, 352, 6, -123, 47, -28, 171, 24, 66, -141, -25, -111, -45, -6, -189, 107, 62, 110, 4, 49, -46, 25, -86, -70, 365, 132, 67, 143, -60, -53, 10, -39, -34, 93, -64, 55, -189, -72, 100, 91, -120, 180, -144, 4, -136, 55, -1, -175, 51, -76, -238, 17, 29, -81, -115, 213, 16, 97, 32, 4, -53, -43, 11, -29, 70, 29, 9, 67]
8191F7
$$ Imaginary data points
##PAGE= N=2
##DATA TABLE= (X++(I..I)), XYDATA
0@%%%%%%%%%%%qJ5j5J6j6K4l2L7m5N3o6P7q8J05j21J43j68J92k22K54k90L31l73
34a97M23m78N35o00O68p47Q35r26J027j136J257j389J532j691J863k052K261k489
52a304K746l030L344l703M109m575N118n755O519p452Q628j0161J2244j5266K0066
67A1528k8916N0701k08166l94155R8516K30072L28067K73375J63150r5381k83900
78A44891l51258k20417K456K39466L19014K62771J04867q3589k75777l37777k24111
89d19464P424K02301K95664K49682R7457j04333k57866l04269k04203m399J96319
100b45687K85056K40076R3279r1634k38804k73940j80031O533J88772K75207K28702
111B87529Q9669p9009k19409k63325j65691J8507J78373K44204K10812R0444q3464
$$ y = [0, 0, 0, 0, 0, 0, 0, 0, 0, 0, 0, 0, -8, 7, -8, 8, -8, 16, -16, 21, -24, 29, -37, 40, -48, 57, -64, 79, -89, 103, -119, 135, -155, 176, -197, 226, -252, 283, -317, 351, -396, 439, -487, 540, -596, 661, -728, 804, -887, 976, -1076, 1185, -1304, 1442, -1588, 1756, -1947, 2162, -2413, 2705, -3050, 3469, -3983, 4645, -5516, 6728, -8538, 11528, -17388, 33313, -174853, -569008, -470492, -240420, 87647, 361022, 524172, 428791, 144891, -206367, -426784, -424328, -184862, 134152, 396923, 501790, 418201, 142424, -195353, -419464, -412040, -209739, 85925, 335607, 433064, 328731, 70865, -233404, -437607, -442006, -245687, 39369, 279445, 372724, 281090, 42286, -231654, -411685, -405152, -216380, 58827, 287529, 377198, 298189, 78780, -184545, -350236, -331729, -153356, 90848, 301660, 392104, 308640]
122C08640k22535k46575j51681P781J57491K30167J95366P1525q4546k07048k35426
133a76841j46709R608J49356K15096J84262O9889q1888j95201k12967j31416R410
144c07401J45329K10425J77991O4157p6400j78585j98022j21286J3738J39862
154a30192J99326J65648N9282p3425j72633j88052j13314J3245J29747J83679
164G3311J54199N2954p4649j67864j79406j06587J2944J22186J72076J43947M7799
175B50910p2804j59728j68926r7420J6032J18546J64596J36239M5274o9096j49579
186A4044j57749q9856J9111J15346J57639J29083M0431o6272j41731j48570q3536
197b12060J8667J10547J49378J19818L6120o6080j35936j41588q0028J8025J04694
$$ y = [308640, 86105, -160470, -312151, -304370, -146879, 83288, 278654, 350179, 265633, 58585, -176841, -323550, -313942, -164586, 50510, 234772, 304661, 222773, 27572, -185395, -316811, -307401, -162072, 48353, 226344, 290501, 214101, 35516, -162506, -283792, -270054, -130192, 69134, 234782, 294064, 220639, 48006, -140046, -253360, -240115, -110368, 73311, 227510, 280464, 205815, 37951, -141455, -248042, -235098, -112912, 59164, 203111, 250910, 178106, 18378, -150548, -247968, -231936, -113390, 51206, 187445, 232719, 163623, 14044, -143705, -233561, -214450, -99104, 58535, 187618, 228049, 161777, 20046, -128524, -212060, -193393, -82846, 66532, 186350, 222470, 156390, 20454, -121134, -201162, -183137, -78443]
208g8443J40917J12419L1323o4918j30591j34498p4775J7623J00340J35141J05865
219A60403K9156o2328j23771j26573o9561J9353R7463J29347J01654K7243n9596
230A22790j17160j19946o5043J9467R4233J24771R6167K4599n8040j13190j13936
241a05288o1989J8952Q9880J17949R1138K1174n7835j09128j09420n8644J8589
252a44622Q6372J12328Q6285J9414n6842j05916j03949n3776J9093Q3912J08177
263E0476Q2166J8319n4616j01080r9354m9457K2053Q0997J03611P9258J6175n3908
275I4640r7115r3911m7118K1346P9971R9817P2332J3923n1549r4371r1566m4757
287a38358K2219P6065R4160P0043J0808n1890q9740q6726m3565K1325P5476R1306
$$ y = [-78443, 62474, 174893, 206216, 141298, 10707, -123791, -198566, -180943, -80603, 54538, 160403, 189559, 127231, 3460, -123113, -192674, -173321, -75858, 53489, 155143, 182386, 122790, 5630, -114316, -179359, -159892, -65659, 59112, 155279, 179878, 121838, 8648, -105288, -167277, -148325, -58445, 59504, 150642, 171816, 113981, 4853, -104567, -163211, -144622, -58250, 54078, 140363, 159777, 102935, -2981, -106930, -160706, -141613, -57701, 50476, 132642, 150961, 96345, -4735, -104089, -153546, -131493, -50496, 53115, 132373, 148548, 94640, -2475, -96386, -143504, -122158, -42187, 57630, 129962, 143885, 92336, -2035, -93601, -138358, -116139, -40074, 54086, 124129, 134937, 83047, -6693, -93419, -136984, -115659, -40183, 51123]
299E1123O4532J0120m8679q7184q2961l9407K2199P2278Q8189O3730Q841m8747
311G4034q2499p8516l7269K2361O9565Q4716O0300Q009m8234q0054p4567l5186
323a17340K0743O7501Q1260N6469O071m6466p7666p2909l2626K1049O4081P7480
335D7647N4610N249m5587p4673o8812l0734K0777O3004P4628N1364N099m3605
347E8967p1317o6321k8423K1852O0928P1410M8973M739m2562o9176o2591k7010
359a00531K0637N9133O8787M5954K583m1387o6407o0661k5852K1093N6940O5494
371D5783M3319J472m0728o4233n7452k3737K0968N5079O2762M1468J301l9851
383D6151o1924n4373k1563K1028N3470O0482L9516M27l8343n9230n2235j9773
$$ y = [51123, 115655, 125775, 77096, -10088, -93049, -132456, -110257, -37979, 50210, 113940, 122781, 74034, -8465, -86981, -124250, -101889, -32324, 52392, 112692, 120701, 72467, -7587, -82154, -117340, -96597, -29096, 52164, 108633, 114704, 68238, -9428, -82337, -114963, -93914, -29833, 47647, 102257, 107506, 61919, -12754, -81566, -112300, -91523, -28519, 46109, 97473, 102572, 58967, -12350, -78671, -107094, -85242, -24314, 47096, 96069, 100808, 58246, -10930, -73521, -100531, -79894, -20761, 48026, 93980, 96563, 55176, -11231, -71892, -97744, -76651, -19711, 45783, 89102, 90574, 49846, -14387, -71839, -95576, -74608, -19529, 43233, 84701, 86002, 46151, -15773, -70146, -91709, -70681, -17211, 43271, 82787, 83214, 44871, -14359, -66594, -86367]
395h6367K1124N1459N8254L7229l71l8211n7308m9739j8828K0504N0069N5086
407D2901L5088r65l6906n5397m7837j7730K0095M8485N2678L3182j225l5638n3380
420a6649m5991j6176K0584M6796N0752L1875j395l4629n0894m3931j4934K0159
432e4433M5014M9433L0295k047l3710m9670m1766j3920J9671M3730M6972K8810
444F8379l027l3034m8217l9902j3148J9306M2559M4836K7307l622l2478m6176
456a7217l8133j2637J9713M1611M3316K5465l790l1514m4410l6281j1322K0019
468d5180M0192M1876K4360m359l0654m2758l4732j0035J9123L9186M0532K2825
480F0376m967l0231m1503l3238r219J8734L7861L8616K1661n957k9667l9855l1647
$$ y = [-86367, -65243, -13784, 44470, 81699, 81328, 43117, -14191, -63930, -82758, -62254, -12185, 42901, 77989, 77024, 40118, -15279, -63116, -80846, -60751, -12266, 40412, 73594, 72369, 36731, -16649, -62640, -78816, -58232, -11436, 39316, 71191, 69796, 35167, -15727, -59658, -74592, -54433, -9419, 40014, 70309, 68262, 34552, -15118, -56884, -70804, -51133, -7403, 39569, 68379, 65352, 32318, -15899, -55801, -68949, -49643, -7084, 37752, 65059, 61437, 28959, -17217, -55350, -67987, -48274, -6663, 36653, 62118, 58328, 26814, -17596, -53877, -65199, -45180, -4988, 36888, 61248, 56889, 26235, -16523, -51255, -61290, -42167, -2981, 37551, 60376, 55409, 25178, -16325, -49563, -58782, -40048, -2187, 36429, 58090, 52133, 22466, -17389, -49036]
493d9036q890J8520L6285L7160K1009n765k9281l8630l0127p894J8254L5919L5532
506C3056J9837n379k8314l6776k9051o480J7698L4433L4920J9164n752k7307l6177
519a6128k7651o299J7390L3022L3178J8327n881k7277l5100k6367o504J7008L1975
532c07L2199J6703o164k6219l4015k5562n506J6691L0605L1120J6403o080k5319
545A4549l2440k4503m985J7143L0641K9656J5456n876k4349l1797k3309l669J6634
558b6849K9315K8745J4465o266k3884l0728k2566l977J6463K8041K6993J3402
570D3154o479k3872k9718k1292l542J5889K6883K6536J2693o846k2995k8348k0183
583c8120l135J5708K7005K5192J2626o611k2185k7009j8944k538J5244K6264K4770
$$ y = [-49036, -57926, -39406, -3121, 34039, 55048, 49283, 20002, -18628, -48755, -56649, -38395, -2476, 33056, 52893, 47514, 19200, -17576, -46627, -53107, -35409, -976, 33944, 53108, 47356, 20049, -16128, -43779, -50078, -32688, 334, 33512, 51839, 45958, 18681, -16419, -42786, -49290, -32282, -307, 31892, 48595, 42431, 16212, -17803, -43365, -48871, -32180, -1575, 29545, 45948, 39868, 14549, -17891, -42394, -47379, -30236, 405, 30061, 45517, 39641, 15292, -16505, -39814, -43483, -26849, 2466, 31211, 45676, 39410, 15526, -15202, -37768, -41745, -25282, 2759, 29752, 43154, 36675, 12803, -16915, -38207, -41749, -25860, 1023, 27559, 40252, 33406, 10411, -17937, -38120, -41255, -25547, 1458, 26650, 39276, 32665, 10480, -16529, -35473, -38011, -22767, 3497, 28267]
596B8267J1284o442k1428k6281j8313k688J5006K4678K3595J0822o600k1238k5608
609a4946j8047k452J4697K3651K2155J0586o745k0631k5018j7128j311J4060K2968
622A839K1877J0298o657j9975k3546j5653j629J4223K2717K0945R526o386j8978
635H601k3051j4992j610J4050K2109J9883Q861p085j8631k1899j5228r69J3025
648a6936K1430J9076P596o585j8344k1553j4158o53J3181K0682J7976P752o581
661B2883j7564k0764j3337k31J2987K0186J7642P551o627j7124j9709j2615j97
674b6919J2943J9401J6946O801o644j6863j9108j1860n18J2486J8995J5978O407
687B8045p024j6263j8307j2058K66J1938J7887J5883N560o336j5974j7644j1290
$$ y = [28267, 39551, 33109, 11681, -14600, -32913, -35601, -20595, 4083, 27678, 38500, 31900, 10662, -14946, -32993, -35445, -20748, 2903, 25058, 35644, 28899, 8268, -16750, -33878, -35189, -21129, 1839, 23716, 34014, 27357, 7382, -16164, -31817, -33446, -19223, 3494, 24439, 33965, 27579, 8601, -14450, -29442, -31052, -17002, 5107, 24990, 33851, 26766, 8135, -13764, -28992, -29961, -16936, 4494, 23570, 31166, 24581, 6237, -15316, -29474, -30127, -16946, 3736, 21712, 29464, 22883, 5319, -15445, -28782, -29013, -16026, 4160, 21802, 29353, 22726, 5602, -14107, -26722, -26919, -13976, 5425, 22371, 29172, 22528, 5665, -13443, -25303, -25821, -13335, 5660, 21638, 28045, 21021, 4758, -13549, -25607, -25341, -13403, 4484, 20367, 25927, 19591, 3617, -14027, -25317]
700b5317K97J1860J7534J5353N502o397j5062j7035j0659M21J1442J7261J4372
713A9572N437o116j4882j6345j0524Q60J0793J6482J3900N350o352j4889j5733
726a2447r811O48J0735J5837J3555M525o369j4173j5094r558R91J0626J5274J2969
740A7708M386o291j3760j4552r021J207J0783J4765J2325M068o145j3137j4169
753a1833q513J004J0447J4759J1790L281o120j2999j3608p964J544R767J4051
766E606J1094L243n795j2900j2810p943J396R859J3479J0815L215n926j2392j2583
780a1642p269J723R384J3070J0356L167n905j1846j2362o815J964R323J2355R949
794A5452K998n899j1477j1753o829J770Q948J2058R549K418n179j1400j1267o378
$$ y = [-25317, -25020, -13160, 4374, 19727, 25229, 18832, 3770, -13265, -23924, -23503, -12061, 5200, 19572, 25009, 18893, 4011, -12334, -22858, -21998, -11205, 5277, 19177, 24527, 18175, 3286, -12447, -22258, -21610, -10875, 4962, 18517, 23042, 16673, 2500, -12594, -22152, -21161, -10535, 4739, 17708, 22094, 15803, 2043, -12509, -21530, -20323, -9540, 5225, 17550, 21618, 15473, 2336, -11833, -20346, -19342, -8895, 5864, 17654, 20935, 14815, 1816, -11792, -19756, -18212, -8445, 5606, 16700, 19943, 14148, 1248, -11562, -19505, -18109, -8250, 5229, 16044, 19259, 13333, 941, -11642, -18911, -17188, -7804, 5266, 15622, 18789, 12884, 1038, -11324, -18139, -16175, -6852, 5503, 15452, 18450, 12551, 1074, -10679, -17508, -15738, -6790, 5268, 14817, 17235, 12056, 656, -10611, -16989]
808a6989J600Q994J1667R213K092n352j0737j1048o329K267Q451J1436Q958K068
822A6291n667j0483j0411n637J791Q434J1001Q447J789n133j0482r938n341K084
836a3255Q206J0242Q075J885n368r812r972n034K214P885R989P834J785n302r752
851c80r291m992K307P539J0085P605J201n425r256q874m675K285P749R579O925
866A2382J307n185r206q591m054J890P676R175O308J374n049q746q421m054K069
881a1125P412Q762O462P78m793q356p828m077K266O939Q617O238P64m693q509
896a143p483l680K166O799Q582N977O04m813q031p327l469K171O770P828N654
911A0605N98m589p751p042l238K140O343P791N541K93m538p291p104k754K083
$$ y = [-16989, -15389, -6395, 5272, 14485, 16577, 11225, 488, -10560, -16889, -14622, -6171, 5265, 14223, 16291, 10624, 141, -10270, -15907, -14116, -5682, 5319, 13766, 15555, 10422, -60, -9998, -15339, -13255, -5049, 5193, 13268, 15153, 9785, -27, -9999, -15033, -12819, -4934, 5055, 12889, 14674, 9372, -380, -9671, -14663, -12356, -4817, 5268, 12873, 14074, 8649, -607, -9481, -14156, -11871, -4122, 5457, 12382, 13689, 8504, -702, -9293, -13347, -11457, -3781, 5394, 11702, 13076, 8027, -719, -9140, -13194, -11125, -3713, 5049, 11511, 12289, 7496, -860, -8688, -12765, -10499, -3560, 5057, 11295, 12059, 7366, -1143, -8626, -12306, -10140, -3341, 5241, 11218, 11822, 7009, -1022, -8349, -11818, -9647, -2877, 4951, 10605, 11203, 6614, -1137, -8179, -11417, -9277, -2934, 4857, 10398, 10691, 6153, -1138, -8242, -10996, -8913]
926h913O350P256N193M84m584o971o543l021K165O354O974M982N25m598p055o045
942g447k830K157N801P092M791l2m172o531o179k645K105N969O587M614l94l923
958D963o223n883k411K180N533O564M056J24m164o122n721k097J919N528O177
973D423M425k10m221n812n714j742K005N171O086L897j10l744o088m964j995K020
989f573N143N645L936j24l930n550m930k022K030N079N538L695m08l736n285m914
1005f406j441J765M671N562L512k93l504n401m607j656J992M872N152L215l56
1020G077l438n366m172j457J799M620M841L237l60l315n117m135j316J904M500
1035f98M788K952p04l090n004m178j095K218M140M657K901o34l309m640l912j038
$$ y = [-8913, -2563, 4693, 9886, 10370, 5786, -1185, -7728, -10749, -8584, -2230, 4744, 9726, 10251, 5653, -1402, -7447, -10277, -8120, -2319, 4773, 9564, 9532, 5360, -1171, -7350, -9995, -7890, -1921, 4666, 9280, 8886, 4963, -1260, -7143, -9554, -7374, -1841, 4723, 8779, 8903, 4739, -1383, -7104, -9201, -7282, -1754, 4423, 8848, 8638, 4417, -1395, -7109, -8851, -6846, -1675, 4411, 8308, 8198, 4454, -1634, -6598, -8593, -6573, -1430, 4215, 8151, 8027, 4097, -1453, -6383, -8405, -6375, -1296, 4242, 7937, 7529, 3793, -1492, -6406, -7847, -6082, -1411, 4151, 7663, 7370, 3866, -1535, -6142, -7798, -5806, -934, 4218, 7433, 7077, 3639, -1727, -5899, -7356, -5557, -937, 3904, 7141, 6781, 3466, -1651, -5786, -7102, -5198, -698, 4090, 7042, 6338, 3248, -1756, -5934, -7029, -4811, -671, 3986, 6887, 6253, 2944, -1696, -5608, -6646]
1051f646K167L919M315K429k74l414m460l268j230K025L972M310K279k69l447
1066B408m264l572q89K147L620M381K204m35l015m451l313r59K125L725M209J873
1082E794n04k990m316l056o92J874L710L746K039n88k932m140k852o82K020L528
1098d1L524K037p64l081l648k790n95J645L772L485J702n40l058l571k572j005
1114e500K106L500L393J837p57k836l597k749j12J399L779L190J505q94k811l181
1130a728k838m01J959L210L348J302r86k341l476k504n0J678L135L086J253o71
1146C976k679l219k372m10J966L067K904J555j069k485l109k136l79J747L019
1161C76L008R57o78k633k816k292o5J561L308K323J314o10k612l154j870m08J863
$$ y = [-6646, -4479, -560, 3755, 6184, 5910, 2496, -1964, -5232, -6462, -4437, -465, 3845, 6124, 5855, 2408, -1856, -5428, -6317, -4170, -550, 3831, 6035, 5600, 2585, -1866, -5179, -6138, -4013, -288, 3921, 5794, 5290, 2300, -2016, -5072, -5764, -3890, -180, 3566, 5605, 5017, 2085, -2055, -4907, -5589, -3569, -41, 3483, 5520, 4756, 1675, -1973, -4763, -5358, -3713, 59, 3544, 5246, 4706, 1648, -1923, -4495, -5500, -3394, 106, 3499, 5336, 4579, 1743, -1854, -4603, -4715, -3316, 463, 3653, 5158, 4264, 1453, -1728, -4566, -4967, -3008, 202, 3550, 4852, 3866, 1525, -1951, -4455, -4505, -2827, 308, 3394, 4647, 3976, 1297, -1922, -4294, -4704, -2738, 329, 3233, 4788, 3719, 1234, -1875, -4011, -4390, -2643, 376, 3384, 4341, 3663, 1030, -1786, -4078, -4143, -2582, 726, 3049, 4363, 3753, 1141, -2013, -3883, -4291, -2428]
1178b428K679K865J066j012k233k910j907j27J498L024K484J147p88k441k810
1193a893j756r8J679K768K415R74q36k378k447k059p9J636K717K450P83j207k011
1210F58k463j931K55J565K671K009P45n35k439k400j557J16J755K167K086Q24
1226C526q67k071k259j692nJ701K496J940O34p00k045k534j284l4J640K097K128
1243B671N99p80k099k111j336j18J599K288J684P34r59j838j991j213q0J766K137
1260I53J532N75r96j817j946j240O7J417K135J739O74q72j847k131j242K49J561
1277a189K006J481P07q96j871j801j321J42J660J765J812K9n37j896j868r46K74
1294b449J229J759J692M25p83j846j962n72J85J440J739J648J92j026j830j353
$$ y = [-2428, 251, 3116, 4182, 3170, 937, -1973, -3880, -4007, -2509, 515, 2999, 4146, 3358, 917, -1893, -3649, -3747, -2068, 700, 3115, 4089, 3253, 875, -1572, -3631, -3710, -2074, 643, 3093, 3876, 2669, 658, -1805, -3736, -3481, -1916, 755, 2764, 3509, 2974, 535, -1865, -3422, -3306, -1551, 616, 2702, 3526, 2659, 588, -1671, -3363, -3368, -1667, 829, 2769, 3403, 2703, 658, -1876, -3160, -3194, -1554, 543, 2671, 3270, 2490, 391, -1720, -3056, -3174, -1575, 713, 2397, 3131, 2172, 334, -1657, -2870, -2950, -1184, 953, 2485, 3060, 2064, 247, -1699, -2939, -2872, -1455, 680, 2419, 3093, 2221, 374, -1757, -2999, -2750, -1189, 817, 2298, 3005, 2109, 238, -1563, -2884, -2742, -1082, 683, 2495, 2524, 1987, 91, -1777, -2723, -2449, -1220, 539, 2231, 2656, 1873, 27, -1935, -2507, -2322, -882, 857, 2505, 2697, 1671, -159, -1512]
1310a512j255N31R08K076J676K4m91j938j740p88L43J249J830J230K14q20j369
1327A68j696p47P9J526J380J458J68p30j633j756n59K30J341J516J374M09o66
1344A862j791j531q63L92J082J429J344M33r31j546j358p87K65J212J536J007
1360A755M53r40j416j384n83K94J302R82J393K83q55j652r66n73K45R26J362J542
1378B168o2r46j407j366o06P51R40J086J473j61q05j331j042p04L43J183J373
1395H87R42J30q25j562j167m36M08J225J184P05M41n61j706j106n24K44J315J146
1413G40R97J31p67j236j164m75L45Q30J540O89j93p76j082q73j90J19J008J161
1431H04Q25p4o82j030j067m04K21J284R41O72L19r56j178q92k76K53Q59R24Q46
$$ y = [-1512, -2767, -2236, -1328, 748, 2424, 2448, 1957, 19, -1721, -2509, -2166, -917, 913, 2143, 2357, 1537, 168, -1528, -2275, -2196, -670, 710, 2168, 2336, 1606, -27, -1783, -2342, -2112, -771, 745, 2119, 2528, 1862, 71, -1460, -2323, -1931, -849, 580, 1924, 2357, 1426, -120, -1478, -2265, -2000, -788, 748, 1755, 2208, 1268, -148, -1532, -2115, -1821, -519, 463, 1856, 2139, 1284, -368, -1334, -1907, -1662, -736, 626, 2168, 2106, 1160, -247, -1613, -2219, -1468, -528, 558, 2031, 1870, 1065, -266, -1308, -2012, -1669, -486, 887, 1829, 1959, 1134, -428, -1595, -2031, -1623, -398, 786, 1491, 1932, 1371, -335, -1441, -1965, -1721, -406, 740, 1737, 1868, 1101, -135, -1299, -1774, -1429, -599, 941, 1630, 1437, 661, -421, -1294, -1484, -1365, -357, 804, 1629, 1555, 873, -157, -1224, -1628, -1407, -123, 818, 1490, 1809, 853, -325, -1217, -1493, -1240, -381, 543, 1389]
1450A389J49q51r66j085j99K34J213R86N88Qm02j494r15k24K78J185J000O29P1
1469A594r20j112q25k76M12Q84J086M42L0r47p59p90l04L00R71P89J022k03o88
1488G06j079q28k66L90Q43J061M05R4p18r97p12r5L47O84P78L66K50r38l79j233
1508a321J53M38L70J069L65j1n48q55q73J7O8J056R44J16Q5o95p40o21l51M61
1528h73P75R79K39J4q48n89p46r1K87R66P28J25r9l76q79o75j12L22O31J030K11
1549A019K31o06q88q23N8K54P27P76J11K45o74p32l72m29L96O98P39K64r7m53
1569D44q11m64o8K69O71N76O29m08l35p66n18k07M36O04L09P01l07o01n77k70
1589f93l5K95P83L48M19m72o91l93k50q4J99O10N44L12j37o76m08l27J16J91N00
$$ y = [1389, 1538, 687, -279, -1364, -1563, -1329, -116, 870, 1458, 1466, 1064, -430, -1345, -1569, -1291, -106, 894, 1523, 1594, 674, -438, -1263, -1539, -1127, -243, 843, 1285, 1315, 368, -391, -1181, -1485, -1185, -214, 575, 1597, 1394, 706, -373, -1201, -1467, -1077, -234, 827, 1232, 1326, 608, -389, -1101, -1196, -849, -165, 613, 979, 1229, 291, -88, -1321, -1168, -730, -360, 709, 1074, 1063, 515, -340, -1213, -1196, -1128, -72, 872, 988, 1073, 378, -362, -983, -1334, -873, -98, 881, 1120, 1134, 286, -303, -1049, -1140, -853, 113, 841, 966, 867, 491, -388, -1063, -1175, -853, -222, 808, 1019, 1250, 644, -244, -1067, -1009, -755, -28, 748, 859, 1104, 430, -302, -674, -1103, -707, -9, 730, 994, 897, 444, -367, -831, -899, -630, 41, 617, 1246, 838, 503, -263, -781, -988, -552, 52, 361, 1062, 755, 154, -423, -693, -728, -433, 350, 698, 1117, 645, -46, -439, -689, -773, -574, 36, 580, 892, 755, 79, -329, -656, -540, -349, 151]
1610A51N09J50k33j34p48k33j79L45P08QP92l63n00o59j95k59M57M09O83l8r7
1631E74o05m37k64p7K23N76N62J43O0o11n72l31J28L23O27M28L9J37q83j62m79
1652f01K6K45M48N79j03j28l69n45j31Q5K36J77O11K3k4m03n45m26K31K51M51
1673H8N33K6j24l94p38r0J32M57L15K05J88k42k98m29m88J34L01O68M21o4m9n47
1695El03k24k5K96L57L38P7L3o85j31l38J17J45M74N27j45k4o05k02m45J90L36
1717b32N14M31q7k38m12l23j20J18j52L07M93J37R5k36m73p15J72M95L74L80j06
1738D22j7k57j34n40m8N04K91L08j84j6j23o13o1q8L46J43L04L43k60n44j47k26
1760e97K69K73K10J81K10k04l01l27k27J89J53K75K87J59l83k54k03J32l89L88
$$ y = [151, 660, 810, 577, 443, -305, -538, -717, -372, 336, 344, 1136, 773, 273, -386, -581, -840, -383, 26, 709, 671, 574, -31, -468, -732, -809, -586, -10, 552, 695, 755, 144, -428, -759, -631, -308, 319, 747, 786, 923, 40, -122, -601, -575, -330, 118, 697, 594, 466, 97, -448, -579, -494, -258, -81, 530, 553, 529, 126, -419, -845, -614, -363, 88, 621, 647, 523, 129, -609, -699, -567, -110, 205, 410, 598, 356, 58, -371, -859, -725, -424, 244, 665, 601, 552, 5, -298, -522, -547, -251, 106, 444, 521, 554, -131, -262, -600, -483, -338, 136, 663, 518, 494, -111, -313, -758, -568, -232, 282, 713, 626, 388, -24, -347, -467, -349, -501, -194, 299, 436, 531, 295, -178, -893, -721, -226, 148, 528, 422, 405, 148, 14, -526, -574, -70, 221, 529, 345, 329, 206, -407, -468, -556, -210, -67, 237, 580, 320, -224, -371, -597, -328, -55, 155, 336, 546, 342, 41, -286, -513, -324, -171, 104, 391, 550, 167, -87, -290, -158, -547, -159]
1780a59L83j02N21l89k96j13j09m7K26J28L76J2l84M0l13j86Q8M7M98J58O8l45
1802A02k52l57j1Q9K46L09L43p1l23k84j06J18j02J27J73O58k02j24k01n52l0
1823d50Q3L25K32K75j51J7m03k35j81O5N30r5N66k37jj78n42R0J8K45L38j9Lk41
1847E4j67j33j79J63K2L97k6P3L2k46l50p4J36K29%N31r7k68j17l15J16J30j04
1870a93L38K08k58M8j59l18k5L8K13M09p8J31n5l42j35l9k10L34M13k14L26k16
1892B16l04j53K4rL10Q5M0J65p3m10r5J96k09K86J19J44j35L3k56k9n17J93M13
1915C4J84L60l90k05j27O7k65J04L46K6J97l3k48k1l36j56K92m7M38Qq0J27m1
1938B34o00JK92j7K76K61k59n3j33k97K2K4M42j43R9J67K6m88o5j56L39n4R9L91
$$ y = [-159, 224, 122, 643, 254, -42, -155, -264, -311, -85, 43, 419, 431, 47, 87, -226, -412, -324, -277, 221, 379, 447, 102, -150, -507, -518, -429, -183, 126, 469, 398, 75, -209, -315, -197, -299, -172, 1, 659, 457, 333, 132, -420, -450, -367, -42, 190, 465, 314, 331, -72, -307, -488, -423, 107, 12, 578, 341, 340, 162, -380, -290, -272, -27, 311, 292, 295, 54, -113, -246, -425, -262, -240, 157, 131, 204, 236, -10, -360, -434, -298, -69, -69, 462, 365, 97, -20, -335, -219, -89, -193, 145, 353, 95, 143, -16, -334, -359, -321, -108, 301, 223, 354, 299, -43, -178, -217, -427, -93, 320, 106, 432, 216, -88, -241, -217, -226, 84, 169, 209, 374, 301, -109, -204, -8, -217, 69, 188, 332, 197, 230, -26, -55, -572, -379, 34, 218, 578, 188, -17, -144, -77, -342, -238, 108, 134, 331, 298, 50, 29, -307, -463, -171, -218, 220, 228, 148, 275, 234, -366, -365, -73, -90, 186, 447, 188, 135, 2, -295, -273, -249, 193, 50, 149, 316, 342, -146, -211, -367, -28, -82, 17, 408]
1962D08K7l00K6m56J61j8M6M68j24l07J99k34j50j0R3L42P3K89l09j28j7j83j07
1985b11P1o1L52P8Pj18j37n1j29R0K39M8m7K82k93m06r2R5o0O17m7r9J65j8j67
2010A08n80J14K91O8K06Kj03q5k57M2k03N03l62M75k6p1l2l01j03J2J52pK00n9
2034a6J01j20j16J17O3k37L58rJ81j97j63Rj57M3J83j02P1L52k89j48J36k04n1
2057a95J97M7l2J18Oq3m6k47J81q2L93j75J04k1j41k11J21k51J53J40J25L79l33
2080A47k60K46r5j37k8K25J00O0L5k40o1j91K7m7K38J18j06J40j36k32J45j15
2102a67j06O67k80Q9o2q8j96R5q1j5m7L50L5N7r4j37K2l00J22M15l1N6J40m08
2126C6j36k27L36Q6kj07Q9j51R4k34O7k23K50L7J42no8J01k79J38k63L59L1L75
$$ y = [408, 435, 135, 161, -295, -134, -152, -106, 362, 238, -69, 130, -104, -254, -264, -171, 171, 244, 533, 224, 96, 79, -104, -211, -140, -201, 151, 229, 236, 118, -19, -70, -199, -109, 130, 178, 131, 413, 120, -286, -378, -283, -343, 274, 227, 128, 293, 275, 108, -472, -358, -67, 1, 207, 209, 106, 21, -236, -194, -397, 106, -256, 219, 193, 122, 90, -211, -314, -302, -150, -157, 43, -16, 85, -35, -151, -34, 29, -208, 150, 141, 322, 125, -38, -29, -186, -143, 40, -62, 9, 361, 72, -76, 60, -144, -195, 2, 49, 17, 135, 141, 58, 12, -235, -54, -136, 257, 82, 186, 165, 24, -187, -66, -317, -164, -24, 101, 480, 147, -113, 133, 38, -99, -127, 98, 198, 258, 293, 53, -8, -199, -172, -219, 19, 137, 31, 171, 35, -197, -52, -167, -273, 394, 114, 203, 141, 53, -143, -48, -129, -144, -191, 159, 194, 251, 157, 20, 42, -258, -136, 279, 248, 304, 444, 36, -100, -327, 9, 95, 93, -14, 75, -76, 18, -216, -149, -372, -122, -85, 57, 52, -16, 85, -194, -56, -319, 40, 71, 446]
2150D46m38J53r8p1j79P6m2J79q1m0J39j17L8l63L60J08q7rJ59k96J74k4j10l0
2174a53J58J28l5K06j22j83J94k30n3K13j50J59q9O2k08J06l1l57N67l32K89o6
2196G3N4q5l1noj64P8J78q5J40k73q1M4K69J34j32k8Q5Q4o3k57Oj0M3J57p2K82
2223C35m49J52jl0k39l1M05p4N2PJ0l60K34M1j50K91j02J07j59l0J57j48k9p7
2247h8M77q4m19L99k14k53r6J93L05k07K80k85k41L54j90m5j46J62N5K8M43m40
2269a2JOk04R4l2K10J41j03Q0p7r7l34L26L3j02J18J31J43j82j12n0K06k47K25
2293A62k00J15L61o53O7R8k89N27p2l1J9j7M4m55K85Q9k61K74K51k33J29j17k01
2316a08O7k1K69q7jk20J18n5l92N0L07l6L00j55O0k67oK41k99K63j17J0P0rM1
$$ y = [446, 8, 161, 63, -8, -187, -111, -153, 26, -55, -95, 44, -73, -35, -398, -38, 70, -17, -26, 133, -163, 11, -13, -123, -153, 5, 133, 98, 304, 182, -1, 193, -37, -90, 123, -27, 132, 43, 105, -103, 3, -28, -385, 182, -150, 139, 73, 127, 42, 11, 6, 0, -164, -86, 92, 7, 147, -126, -207, -163, 106, 240, 108, 80, 165, 249, 186, -71, -65, -75, -32, 125, 53, 335, -114, 38, 37, 7, -232, -263, 142, 68, 120, 127, 137, -223, 11, 52, -98, 193, 91, 198, 39, 9, 166, 18, -11, -88, 389, 305, -114, 285, 71, -182, -278, -85, 220, 13, 293, 8, -233, 121, -69, -114, -260, -98, -43, -15, 428, -12, -11, -5, -209, -115, -147, 63, 204, 101, 181, 104, 7, -327, -1, 32, -70, 48, 179, 322, 140, 28, -22, 184, -63, 162, -38, 77, 438, -215, -148, -50, -339, 188, 116, 85, 104, 87, 131, -324, -39, 50, -211, 63, 314, 81, 210, 93, -108, -41, -62, 207, 120, 119, -101, 17, -38, -430, -380, -73, -109, 191, 36, 96, -171, -177, 64, -235, 28, -89, -79, -9, -18, 23]
2341B3p1J16k7L1J2n0K13J0n7k62M1o8P2M9q7o4K64k19K53k10mP0K43k52P8j16
2367a2j3K6k61J67K1j53K80K81kj52k83L8J49r5O3J51k27J24J25l15K3J0J9R8
2391F2o1K45j70Jj49j07J09J3J4K34M3l45M40j30Lj75n9n5K31j33o0R4L5j27K72
2416B25l02k6J88J84l72K13Ql86K68qL1j12K53p0J09k18r6R8J03k05O7j7K8R7
2440F0k69M1K40j57Q3l2J58q1K38l68J48o3l1pL17j39M1k19K03k9j82P1o6J14
2464G1Q8r2j16L8k9q6J10m7K8l6J30J96N5l01k5J12o5J03qO4R5l06j37j36K0K46
2490b8J7Kk0L81l95K25n5j31J48Jj17J71lm70J37N8J40J24l43R7QK40j60j11P4
2515a0J15k5J95m41M10k49Lj78J32L5j67q0L95l8k95K11j02J43n1M3J51j77k86
$$ y = [23, -48, 68, 41, 72, 84, 34, 247, 257, 200, -62, -21, -89, -17, 32, -55, -119, 145, -74, 179, -31, -35, 35, 278, 26, 104, -12, -25, 1, -260, -93, -72, -225, 55, 336, 334, 182, -101, -63, 86, -9, 54, 205, -22, 102, 227, -88, -65, -55, -36, 62, 1, 246, 76, 77, -72, -179, -70, -57, -43, 191, 234, -111, 329, 199, 202, 27, -32, -87, 144, 11, -49, 45, 80, -47, 225, -77, -103, 85, 269, -103, 110, 118, -268, 0, -8, 23, -89, 164, 94, 203, -15, -111, -13, 90, -115, -48, -65, -37, 60, -209, -168, 72, -85, -2, -34, 124, 43, 281, -87, 61, -2, -33, -40, 277, 138, 179, -40, 163, 134, -48, 23, -43, 71, 159, 67, -49, -11, -40, -126, -16, -63, -35, -71, 59, 255, 310, 9, -16, 96, 31, 134, 126, 190, 285, -21, -158, -294, -274, -28, -11, -9, -29, 352, -43, 182, 127, -4, 144, 145, 28, 199, 196, -274, -137, -79, 61, 185, -158, -61, -53, 187, 27, -84, -10, 105, 80, 275, -166, 244, -5, -2, -180, -48, -13, -180, -260, 135, 97, -198, 13, -89, 54, 3, 46, 197, 20, -266]
2538b66M41j74K2J3j15J38M7J35q5k15K28l04m7j25J69J67LR6k14rR5L02o33N87
2562B56j90L06j91k64J07k61J14k2J75J66p3m6o2l7N0j50J65j62L09j87Jj59n0
2585b05M37k99j36K36j86L57k82K60j33r5P6J37l71J07L2J34j42J46j53J98k34
2606a16K1J11p1K26k80k21J48L63k29J63j81L87l61j24K35l17K55J64J61j30k38
2627c4N8J16l15J40j56L18l52Q8N4q7L50k36k9R7J78n28L21R8k79J62R0m7j22
2650a15K09j43J51q2j7k76K83K17m45L60j72N1m6J50j18K32j95p5J60o1j12J41
2672I7j25l0R2q1J37j29J69j33O1m4q9Q8r9qN8J03j30O9m4J36j29P1j01J81oo0
2698E4J0N7j21k8j22L61l58K6K09L6M3l4j30j35Q6pQ8K6j34j01J88Nj92J63Q4
$$ y = [-266, 175, 1, 23, 36, -79, 59, 106, 241, 156, -59, 169, -135, -182, -307, -138, 29, 32, 128, -86, -95, 0, 302, -331, 256, 66, 372, 181, -83, 24, -237, -123, -145, 30, 196, 123, 77, 15, -22, 28, -122, 43, -119, 190, 3, 4, -155, -205, 232, -67, -203, 33, -153, 204, -78, 182, 49, -46, 30, 167, -204, -97, -65, 69, -73, 73, -80, 118, -116, -95, 16, -55, 171, -109, -330, -182, 181, -48, 115, -66, 321, -40, -164, 71, -246, 9, 173, 334, 204, -34, 24, 140, -175, -35, -191, 127, -225, -137, -83, -170, 180, -56, -85, 12, 190, -338, -17, 81, -198, -36, 54, 7, -115, 94, -49, 102, 20, 3, -273, 10, 227, -218, 142, -30, 21, -25, 125, 7, 239, 44, -31, 129, 68, -44, 97, -28, -58, 34, -47, 90, -39, 130, -3, 58, 14, -75, 13, -86, -94, -36, 67, -63, 6, -38, 98, -31, 40, -61, 120, 114, 54, 64, 121, 0, -28, -150, 211, -147, -121, 88, 124, 167, 133, 3, -132, -46, -53, 35, 61, -73, -174, 14, 19, -173, -10, 74]
2723G4j73j6j7K16q7KJ34r2j4M8L8j78l1R7j55O7j04K57q5j07N6j80K51P4n7j34
2749a16J35NJ3k66J02J11Q4j17k0M8J9J55j98O0J17j38j0j9m2K07k27J44o7J60
2773A40m95K41J25n2J42M2j68K0O0k03j7j90L67R3JN6k89J39l0J52k47K48j4j42
2797b1J65J06k45J4O0k55K23j21K57j05J8P5j12r6l5o3K09J0N5k05j95K76Q5q2
2821A8L0K8k12K00j91j5K96j91%P3j70R2K69j64l5j7l6J05J75k0k01P6l17J66
2845d1P5q7j24K98oj43N8L2j11o6K53j66J30j26J07K39l10l8Ol82M24j37J02o9
2869h2K01j84Kj19n5L80k00j2O3l3K08k45K7n3J42l45P3L58j38q4j19J85p6K48
2893A42k13J4L5K88k17q9k4j1R1l1j53j8K77j50K25k65K35k39q4R3P5l6K00j37
$$ y = [74, -99, -115, -132, 84, -3, -1, 133, 41, 27, 75, 113, -65, -96, 1, -154, -87, -191, 66, -19, -126, -70, -250, 1, 75, 18, -116, 19, 24, 37, -229, -127, -16, 68, -49, -69, -21, -2, 153, -45, 15, 132, -6, -16, -35, -77, 130, -97, 47, -20, 140, -355, -114, 11, -41, 101, 143, -25, -5, 55, -148, -165, -355, 12, 105, 106, 162, -127, 12, -18, 134, -113, 135, 121, -21, 144, 250, 5, 19, 79, -176, 47, -74, 183, 78, 96, 171, 59, -37, -72, -135, 74, 84, 139, -66, -261, 15, 100, 18, 48, 76, -136, 64, -127, -142, 154, -37, -37, 36, -134, -42, 227, 63, 28, 11, -25, 80, 255, 235, 34, 110, -207, -41, 34, -53, -177, 121, 115, -28, 30, 62, -49, -115, 138, -28, 102, -24, 83, 322, 12, -26, -20, -402, 22, -115, -13, -82, 119, -65, -63, -182, -237, 143, -57, -69, -6, -39, 169, -76, -49, -102, 40, -305, -232, 126, -12, -96, -215, -30, -106, 142, -71, -57, -22, 266, 49, -40, -64, -75, 16, -15, -168, -186, 91, -59, 166, -99, 136, -103, -187, -94, -19, -55, 145, 8]
2917Hj7O3J55k58L2k8M8K34j96o2k04L57j39j05R0K82l45N2j36K14l9J88j64j21
2941i1J17r2K21j44k15K67k15Np2M77j64L4j65m6J40Q8j19j96J53L8K08j44o3
2964B2J32L3j57J73j73n4Q0r6N7J6P8j23Q7L7j88m4n0J51l4j22P4K6j25L08k3
2989H5k43K18o3j40Q3J31o2k85P6q9J5J53n6K92q6j32J88j45q4L34j37n4J21k87
$$ y = [8, -9, 54, 209, -49, -17, -45, 3, 237, 41, -21, -225, 132, -7, -112, -22, 260, -85, -33, -169, 45, 6, 194, 30, -91, 26, -66, 155, 11, -204, 63, -152, -147, -219, 258, 94, 128, -37, -83, 57, 145, 26, -170, -17, 21, 229, 85, 22, 154, 187, 30, 203, 30, -24, 56, -40, 17, 33, 111, -12, 75, 112, -76, -120, -170, -19, -53, -175, -101, -75, -200, 108, 85, -158, 60, -3, -143, -60, 71, 9, -276, -200, -289, -274, -121, -177, 115, 29, -103, 85, -60, -144, 190, 53, -1, 120, -167]
$$ [...]
8191H4
##END NTUPLES=NMR FID
##END=
