##TITLE=1H_SR147_TFA
 DMSO-d6
 8 sc, 
 21.2.2023
##JCAMPDX= 6.0         $$ Bruker NMR JCAMP-DX V2.0
##DATA TYPE= NMR FID
##DATA CLASS= NTUPLES
##ORIGIN= UXNMR, Bruker Analytische Messtechnik GmbH
##OWNER= root
$$ XWIN-NMR		Version 3.5
$$ Tue Feb 21 13:44:53 2023 Russian Standard Time (UT+4h)  she@DPX200
##.OBSERVE FREQUENCY= 200.13135
##.OBSERVE NUCLEUS= ^1H
##.DELAY= (6, 6)
##.ACQUISITION MODE= SIMULTANEOUS
##.ACQUISITION SCHEME= undefined
##.AVERAGES= 8
##.DIGITISER RES= 18
##SPECTROMETER/DATA SYSTEM= spect
##.PULSE SEQUENCE= zg30
##.SOLVENT NAME= DMSO
##.SHIFT REFERENCE= (INTERNAL, DMSO, 0, 15.7039)
##AUDIT TRAIL= $$ (NUMBER, WHEN, WHO, WHERE, WHAT)
$$ ##TITLE= Audit trail, XWIN-NMR		Version 3.5
$$ ##JCAMPDX= 5.01
$$ ##ORIGIN= Bruker BioSpin GmbH
$$ ##OWNER= she
$$ F:/spectra/data/she/nmr/H-F/1/audita.txt
$$ ##AUDIT TRAIL=  $$ (NUMBER, WHEN, WHO, WHERE, WHAT)
(   1,<2023-02-21 13:43:36.53 +0400>,<she>,<DPX200>,
      <created by zg, POWCHK disabled, PULCHK disabled
       configuration hash MD5:
       00 E9 B6 7A A2 85 ED C7 34 08 36 98 17 FE 4E 26
       data hash MD5: 16K
       F5 E1 AE 46 22 98 6C 10 F5 97 9A ED F1 2F 62 F7>)
$$ ##END=
$$ 
$$ hash MD5
$$ AF C7 20 6D 1C 25 1E 05 58 EE A9 5C BE 95 A4 BB
##$RELAX= 
##$RELAX= 
##$RELAX= 
##$RELAX= 
##$RELAX= 
##$RELAX= 
$$ Bruker specific parameters
$$ --------------------------
##$DU= <F:/spectra>
##$EXPNO= 1
##$NAME= <H-F>
##$PROCNO= 1
##$TYPE= <nmr>
##$USER= <she>
##$AMP= (0..31)
100 100 100 100 100 100 100 100 100 100 100 100 100 100 100 100 100 100 
100 100 100 100 100 100 100 100 100 100 100 100 100 100 
##$AQSEQ= 0
##$AQ_mod= 1
##$AUNM= <au_zg>
##$AUTOPOS= <>
##$BF1= 200.13
##$BF2= 200.13
##$BF3= 200.13
##$BF4= 200.13
##$BF5= 200.13
##$BF6= 200.13
##$BF7= 200.13
##$BF8= 200.13
##$BYTORDA= 1
##$CFDGTYP= 0
##$CFRGTYP= 5
##$CHEMSTR= <none>
##$CNST= (0..31)
1 1 145 1 1 1 1 1 1 1 1 1 1 1 1 1 1 1 1 1 1 1 1 1 1 1 1 1 1 1 1 1 
##$CPDPRG= <>
##$CPDPRG1= <>
##$CPDPRG2= <>
##$CPDPRG3= <>
##$CPDPRG4= <mlev>
##$CPDPRG5= <mlev>
##$CPDPRG6= <mlev>
##$CPDPRG7= <mlev>
##$CPDPRG8= <mlev>
##$CPDPRGB= <>
##$CPDPRGT= <>
##$D= (0..31)
0 1.2 0 0 0 0 0 0 0 0.06 0 0.03 0 0 0 0 0.0002 0 0 0 0 0 0 0 0 0 0 0 0 
0 0 0 
##$DATE= 1676972616
##$DBL= (0..7)
120 120 120 120 120 120 120 120 
##$DBP= (0..7)
150 150 150 150 150 150 150 150 
##$DBP07= 0
##$DBPNAM0= <>
##$DBPNAM1= <>
##$DBPNAM2= <>
##$DBPNAM3= <>
##$DBPNAM4= <>
##$DBPNAM5= <>
##$DBPNAM6= <>
##$DBPNAM7= <>
##$DBPOAL= (0..7)
0.5 0.5 0.5 0.5 0.5 0.5 0.5 0.5 
##$DBPOFFS= (0..7)
0 0 0 0 0 0 0 0 
##$DE= 6
##$DECBNUC= <off>
##$DECIM= 32
##$DECNUC= <off>
##$DECSTAT= 4
##$DIGMOD= 1
##$DIGTYP= 9
##$DL= (0..7)
0 120 120 120 120 120 120 120 
##$DP= (0..7)
150 150 150 150 150 150 150 150 
##$DP07= 0
##$DPNAME0= <>
##$DPNAME1= <>
##$DPNAME2= <>
##$DPNAME3= <>
##$DPNAME4= <>
##$DPNAME5= <>
##$DPNAME6= <>
##$DPNAME7= <>
##$DPOAL= (0..7)
0.5 0.5 0.5 0.5 0.5 0.5 0.5 0.5 
##$DPOFFS= (0..7)
0 0 0 0 0 0 0 0 
##$DQDMODE= 0
##$DR= 18
##$DS= 0
##$DSLIST= <SSSSSSSSSSSSSSS>
$$ [...]
##$SUBNAM2= <"">
##$SUBNAM3= <"">
##$SUBNAM4= <"">
##$SUBNAM5= <"">
##$SUBNAM6= <"">
##$SUBNAM7= <"">
##$SUBNAM8= <"">
##$SUBNAM9= <"">
##$SW= 18.05172834244
##$SWIBOX= (0..15)
0 0 2 0 0 0 0 0 0 0 0 0 0 0 0 0 
##$SW_h= 3612.71676300578
##$TD= 16384
##$TD0= 1
##$TE= 0
##$TE2= 300
##$TE3= 300
##$TEG= 300
##$TL= (0..7)
0 120 120 120 120 120 120 120 
##$TP= (0..7)
150 150 150 150 150 150 150 150 
##$TP07= 0
##$TPNAME0= <>
##$TPNAME1= <>
##$TPNAME2= <>
##$TPNAME3= <>
##$TPNAME4= <>
##$TPNAME5= <>
##$TPNAME6= <>
##$TPNAME7= <>
##$TPOAL= (0..7)
0.5 0.5 0.5 0.5 0.5 0.5 0.5 0.5 
##$TPOFFS= (0..7)
0 0 0 0 0 0 0 0 
##$TUNHIN= 0
##$TUNHOUT= 0
##$TUNXOUT= 0
##$USERA1= <user>
##$USERA2= <user>
##$USERA3= <user>
##$USERA4= <user>
##$USERA5= <user>
##$V9= 5
##$VALIST= <valist>
##$VCLIST= <CCCCCCCCCCCCCCC>
##$VD= 0
##$VDLIST= <DDDDDDDDDDDDDDD>
##$VPLIST= <PPPPPPPPPPPPPPP>
##$VTLIST= <TTTTTTTTTTTTTTT>
##$WBST= 1024
##$WBSW= 4
##$XGAIN= (0..3)
0 0 0 0 
##$XL= 0
##$YL= 0
##$YMAX_a= 533096
##$YMIN_a= -400159
##$ZGOPTNS= <>
##$ZL1= 120
##$ZL2= 120
##$ZL3= 120
##$ZL4= 120
##$ABSF1= 10
##$ABSF2= 0
##$ABSG= 5
##$ABSL= 3
##$ALPHA= 0
##$AQORDER= 0
##$ASSFAC= 0
##$ASSFACI= 0
##$ASSFACX= 0
##$ASSWID= 0
##$AUNMP= <proc_1d>
##$AZFE= 0.1
##$AZFW= 0.1
##$BCFW= 1
##$BC_mod= 2
##$BYTORDP= 1
##$COROFFS= 0
##$CY= 11.3945322036743
##$DATMOD= 1
##$DC= 2
##$DFILT= <>
##$DTYPP= 0
##$F1P= 2.36226072786647
##$F2P= -0.459571619588291
##$FCOR= 0.5
##$FTSIZE= 0
##$FT_mod= 4
##$GAMMA= 1
##$GB= 0.15
##$INTBC= 1
##$INTSCL= 1
##$ISEN= 128
##$LB= 0.24
##$LEV0= 0
##$LPBIN= 0
##$MAXI= 10000
##$MC2= 0
##$MEAN= 0
##$ME_mod= 0
##$MI= 1.114404
##$NCOEF= 0
##$NC_proc= 0
##$NLEV= 6
##$NOISF1= 3.799351
##$NOISF2= 2.8
##$NSP= 1
##$NTH_PI= 0
##$NZP= 0
##$OFFSET= 15.70392
##$PC= 1
##$PHC0= -19104.95
##$PHC1= 7.400779
##$PH_mod= 1
##$PKNL= yes
##$PPARMOD= 0
##$PSCAL= 0
##$PSIGN= 0
##$REVERSE= no
##$SF= 200.130013532006
##$SI= 16384
##$SIGF1= 3
##$SIGF2= 2
##$SINO= 400
##$SIOLD= 16384
##$SREGLST= <1H.CDCl3>
##$SSB= 0
##$STSI= 0
##$STSR= 0
##$SW_p= 3612.71676300578
##$SYMM= 0
##$S_DEV= 0
##$TDeff= 0
##$TDoff= 0
##$TI= <>
##$TILT= no
##$TM1= 0
##$TM2= 0
##$TOPLEV= 0
##$USERP1= <user>
##$USERP2= <user>
##$USERP3= <user>
##$USERP4= <user>
##$USERP5= <user>
##$WDW= 1
##$XDIM= 8192
##$YMAX_p= 0
##$YMIN_p= 0
$$ End of Bruker specific parameters
$$ ---------------------------------
##NTUPLES= NMR FID
##VAR_NAME=  TIME,          FID/REAL,        FID/IMAG
##SYMBOL=    X,             R,               I
##VAR_TYPE=  INDEPENDENT,   DEPENDENT,       DEPENDENT
##VAR_FORM=  AFFN,          ASDF,            ASDF
##VAR_DIM=   8192,          8192,            8192
##UNITS=     SECONDS,       ARBITRARY UNITS, ARBITRARY UNITS
##FACTOR=    0.0002768,     1,               1
##FIRST=     0,             0,               0
##LAST=      2.2672688,     0,               0
##MIN=       0,             -400159,         0
##MAX=       2.2672688,     533096,          0
$$ Real data points
##PAGE= N=1
##DATA TABLE= (X++(R..R)), XYDATA
0@%%%%%%%%qJ6j6J6k4L2m0N1n9P2q8J12j36J60j92K28k68L12l64M23m89N64o45
31c43P34q35R47j071J206j356J521j702J901k116K355k618K899l204L542l913
47b053M316m755N239n772O359p009P729q535R445j0476J1653j3015J4614j6521
61h781J8839k1732K5464l0478L7612m8639O8085j12320L92724K1586o37775N12860
73B17445L15651m91745k82128M85312m373m40788J16004L73302l25316k87746
83c24382L63316J40822m95013m5775M65670p0943m33854K13961L75429k46130
93e6899k19434L47468R7422l61716M2077L85620j44184l29239K52746K93994k77435
104C0420j70586L09777O5469l16924K6774K60804j44594k16702K13141J20871
$$ plain form
0 0 0 0 0 0 0 0 0 0 -8 8 -8 8 -16 16 -24 27 -32 40 -48 64 -72 88 -104 124 -144 168 -196 227 -262 302 -343
31 -343 391 -444 503 -568 638 -718 803 -899 1002 -1114 1241 -1377 1522 -1682 1860 -2053
47 -2053 2263 -2492 2747 -3025 3334 -3675 4054 -4481 4964 -5512 6141 -6874 7740 -8781
61 -8781 10058 -11674 13790 -16688 20924 -27715 40370 -71950 320774 342360 -295415 217445
73 217445 533096 41351 -240777 244535 240162 -200626 -84622 288680 -36636 -324382
83 -324382 38934 179756 -315257 -361032 104638 33695 -400159 -186198 189231 -56899
93 -56899 -276333 71135 168557 -193159 -151082 234538 90354 -238885 13861 307855 30420
104 30420 -140166 169611 235080 -81844 -55070 205734 61140 -155562 57579 178450
114A78450k77919l5449L02026o8422l30304J13447K78666j92288k36458K18696
124d9555J54395k23644m5048K42149k2921k00912J17881J72109j70985j03070
134a29601K30278N7198k31037K4354K40760p1104k04768J18931J41204j79585
144c370r6261J88462J2428k14933L2972J96811q5802j71255J18942J19997j48117
155e0126o5762J57391P810j47744N6077J37885r3056r3212J43255N5376j69723
166f1829j3330J74338l5261j70403O5484J39306r7941j06209J14700N8192j25768
177e8721j5379J16586l1876r9892P1597P7665r8846l9301J27625J1174j30776
188g0144K6263J26244n5490j05290Q2901P8366r8223l9882J12818Q416j08135
$$ plain form
114 178450 -99469 -134918 167108 98686 -231618 -118171 160495 -31793 -268251 -49555
124 -49555 104840 -118804 -163852 78297 55376 -145536 -27655 144454 -26531 -129601
134 -129601 100677 157875 -73162 -48808 191952 120848 -83920 35011 176215 -3370
144 -3370 -99631 88831 101259 -113674 -80702 116109 30307 -140948 -22006 97991 -50126
155 -50126 -115888 41503 49313 -98431 -42354 95531 2475 -90737 52518 107894 -61829
166 -61829 -75159 99179 63918 -106485 -41001 98305 364 -105845 8855 67047 -58721
177 -58721 -74100 42486 10610 -89282 -17685 59980 -38866 -78167 49458 60632 -70144
188 -70144 -43881 82363 26873 -78417 4484 82850 -15373 -55255 57563 65979 -42156
199d2156K6303R5971n4107p6729P1443M8575q5092j9961Q5695j4841q0884M2020
211c763O1530p3412m7789Q7958K0269j02773n94J01759k0247q9046M1452P3750
223D9094n1073m6471O2228K2784o0249R944N8857l3707m7895N4630L3741p1087
235a9204j9895P3283l953p8040J7596O4999l8646n3222N0279L5396n7857j4713
247d3977O2394q98n5001K2331M9474l0461l1929M4655J7912m6457J807M6262k1236
260A4876m3639L5117L2638n0275k4363N5591J0412n9012J156N4668j2472m5355
272c0658K3137L4082k8394j5859L4895K544l2339J5611L1266k8186k6360L7364
284A7103J5994m5469p858M4401m995m3815J3759L5434k4665k7740L0204J5158
$$ plain form
199 -42156 -15853 80118 26011 -50718 20725 69300 -15792 -35753 49942 35101 -45783 -3763
211 -3763 57767 -15645 -63434 24524 44793 -57980 -58574 43185 22938 -66108 -24656 49094
223 49094 -1979 -48450 13778 36562 -23687 -13743 45114 11407 -36488 18142 51883 -19204
235 -19204 -39099 34184 30231 -47809 -30213 34786 -3860 -57082 -6803 28593 -29264 -43977
247 -43977 18417 17519 -37482 -15151 34323 3862 -28067 16588 34500 -11957 -10150 36112 14876
260 14876 -28763 6354 38992 -11283 -35646 19945 30357 -28655 -27499 27169 14697 -30658
272 -30658 -7521 26561 -1833 -17692 17203 19747 -12592 3019 34285 6099 -20261 17103
284 17103 33097 -12372 -20230 24171 19176 -24639 -10880 24554 -111 -27851 2353 17511
296A7511l4596n180L2818o092k9313J4600K2149k2147j3477K5504K238k7055Q983
309a4057K6674j7423k1896K8427K0536l0325j1466L5363P731l1462J617K8030
321B1749o096k0808J2294J1031j7822l530J8188q931k2506J2592J7007k2473j5604
334b4909K4392R409k5481j841K6695l029k0578J3116J9720j4346j0935K0882Q204
347B1299j8811j16J8074n741j5290Q673O724j6382m322J5160n902j9603R120J5819
361H702j5822j5773J7368J1553j9223p904J8858M080j4765K657J3262m755o460
374h222R851L027j1632K987J3769o541j2111J0928J1768j2664p605J5043M382
387A2980j5742k36J3589m413j3022P134R451j0611o869J0369J847j0801J86P816
$$ plain form
296 17511 -17085 -22265 10553 4461 -24852 -10252 11897 -10250 -23727 1777 4015 -23040 -14057
309 -14057 12617 -4806 -26702 1725 22261 -8064 -19530 15833 23564 -7898 -6281 21749
321 21749 15653 -5155 7139 18170 348 -3182 15006 6075 -16431 -3839 13168 -9305 -24909
334 -24909 -517 8892 -16589 -18430 8265 5236 -15342 -2226 17494 3148 -7787 13095 21299
347 21299 2488 2372 20446 14705 -585 8088 14812 -1570 -5892 9268 3366 -16237 -7117 8702
361 8702 -7120 -22893 -5525 6028 -13195 -21099 -2241 1839 -12926 -10269 2993 -1762 -8222
374 -8222 1629 4656 -6976 -3989 9780 3239 -8872 2056 13824 1160 -6445 8598 12980
387 12980 -2762 -2998 10591 6178 -6844 290 9741 -870 -7739 2630 4477 -6324 -6138 1678
401A678m977n584P853L406q767J816J2839k477j0889P370J1782p821r171J0232
415G290P429j0069m938Q579J48q783rL116o001m146M937j604p959K845P918n067
431f314p244P662P166p413l754J0155L525p515J649R191j288n918M568M303n363
446C410l169M742m92n750R94L486m033l158N383J72p486L71P395k947q109M361
462d830P502m564n511N717M515m371j593M616j12j840K751J896k912J186N593
477H043m89m587K703N252m082n610M281L526o287l822M695n3o858j355L067l112
493d688m191J881Q32l590M09L749l33k107L174L477k095o61N338J799l807J574
509G61O512p45m993K837M329l131m191K065O32l342r22J116j796q19K129j37l919
$$ plain form
401 1678 -3299 -8883 -1030 2376 -6391 -4575 8264 5787 -5102 2268 14050 6229 -2942 7290
415 7290 14719 4650 -288 8291 8439 -344 -353 2763 -3238 -7384 -2447 -4051 -12010 -9165 -1247 -6314
431 -6314 -13558 -5896 1270 -6143 -9897 258 3783 -3732 -2083 7108 5820 -98 4470 8773 3410
446 3410 241 4983 4491 -1259 -265 3221 -812 -3970 1413 1585 -5901 -5530 1865 -1082 -9191 -4830
462 -4830 2672 -1892 -7403 -1686 2829 -1542 -3135 1481 1369 -471 2280 4176 1264 2450 8043
477 8043 7554 2967 5670 10922 6840 1230 5511 9037 2750 -1072 3623 3570 -3288 -4643 -1576 -4688
493 -4688 -8879 -6998 -6166 -9756 -9347 -5598 -5931 -8038 -4864 -1387 -3482 -4143 1195 2994 -813 761
509 761 7273 6528 1535 4372 8701 5570 1379 3444 4076 734 -188 928 -868 -1687 442 305 -3614
526c614L52M066j448m249J320M145j423l170K603L342k233j208L159N22k464J059
542G59K055q45m04J821l13j282J434J235k042j796J861Q05k834j852K366j00l821
559b953K64J808j387l417J579J619j651o75K118P53k72K133J006j313Q14K710
575C136r6l043N31L451n76l334Q35K261j276k614K40L97j716o68P72o96j097J376
593b117R08p71M57J174L75l52O71J062k30k2J372J094j171j017K101O27j908o57
611A596J312j078j106O59k50j066j76M55j071j057M06l43j092p9J093k10j510
628c517O59J264L95j667J62J570J3r04J395N61O0J212R56p35J49J230k26j142
646A435j31R62q76j125j25P07l45j230l48L49n37j196Q57l81o21O00J213k0O9
$$ plain form
526 -3614 -3262 804 -644 -4893 -3573 572 -851 -4021 -1418 1924 -309 -1517 1642 2164 -300 759
542 759 2814 1969 1565 3386 3073 1791 3225 4460 2418 622 2483 3288 454 -1398 968 868 -2953
559 -2953 -2689 -881 -2268 -5685 -4106 -2487 -4138 -4813 -2695 -1942 -2214 -81 925 -388 426 3136
575 3136 3040 -3 528 3979 3403 69 904 3165 1889 -725 -485 -88 -1804 -2472 -1700 -2396 -3493 -2117
593 -2117 -1209 -1980 -1523 -349 26 -326 345 1407 1177 1155 2527 3621 2450 1433 3534 4161 2253 1596
611 1596 2908 1830 724 1383 1133 67 -109 346 -725 -1782 -1376 -1719 -2811 -2890 -1797 -2007 -3517
628 -3517 -2858 -1594 -1199 -2866 -2704 -1134 -1121 -2025 -630 -69 -9 1203 2159 1424 1573 2803 2577 1435
646 1435 1304 2266 1390 265 140 847 502 -728 -1076 -727 -1264 -2460 -1603 -1984 -2605 -2005 -792 -812 -743
665g43J044K93l59N17R89o61j88Q97K93o01K9K70J28j331k86L95m34j095K70O27
685E4m94k02O31j91p77P82K54o96o08J099L19r01J96O45L43p10m00N72m64o36
705a184R1J28K54J8M54l36p1O12L14p52l69Q78K13o14o9N76L20j62K78J22J60
726H61n06L00n4jj47N91K43l11K08J93n68k48K49r10n14L07J38l35n78J97K23
747f62o74M7mM1K33k62M92M77N44M02M09q3M36O68n87m10n1P51o30o70M04j80
769F91p44l71k71l19n82m07om97J45M82J99j69P88N50k72L80M02M97j96L47O93
790A340L56o7L29J08o1m16K75l46l62k89j21N2n6k74l66n59L1n1n42o68N2L27
812a308Po46Q90J85K23k34J88N86J48L43l65O60O37J97J4j0R7K33l64m58k84k70
$$ plain form
665 -743 301 594 235 752 1741 1080 892 1789 2082 1481 1510 1780 1908 577 291 686 252 -843 -573 54
685 54 -440 -642 -11 -202 -979 -197 57 -639 -1247 -148 171 -730 -534 111 454 -256 -656 -84 -548 -1184
705 -1184 -1093 -965 -711 -693 -239 -575 -646 -34 280 -472 -841 37 250 -364 -433 143 463 301 579 701 861
726 861 355 655 601 600 453 1044 1287 976 1184 1377 809 561 810 -100 -614 -307 -169 -504 -1082 -885 -662
747 -662 -1336 -1289 -1293 -1252 -1019 -1281 -789 -312 232 634 1043 960 1396 2064 1477 1067 1016 1767 1137 467 871 691
769 691 -53 -424 -695 -1014 -1596 -2003 -2009 -2506 -2361 -1879 -1680 -1849 -1061 -511 -783 -403 -1 496 300 647 1340
790 1340 1696 1629 1958 2066 2005 1589 1864 1518 1156 867 746 798 742 468 102 -457 -426 -477 -1019 -1687 -1635 -1308
812 -1308 -1301 -1947 -1057 -872 -649 -883 -695 -109 39 382 17 677 1314 1511 1525 1515 1612 1845 1481 1023 739 469
834D69m09m73m14Q4l01k72j27j74j95o3J07k51J65N84L26L43N09L51K34M38J02
855A033K0J71J09N61k95j00J3J51m76p37o8l7l52m05n16K85j5j45l7k15JJ60R6
878g98k25k9M49M43p6J59L89L28K07Q1l28L33J94k51r3o7k9K08k01k31k32j19
900A12l50m17j32l60l98M69j0O8l03L60K90k81J98l6K56L85J32M70L21N23l2m4
922A221q2J07L69n66l84K59l32m17j45j07K23l22n70k72K26k84NN8n8L65K68N7
944c81J57L59J84J35m53J62L40K20k4k26K70J29nr2m30k69J35l24j46o3j32n5
966e09K85k3m55j63K80m0k40q6M89Ml1J11K59K91J77J03l00L28P4N5r3q5L34P7
990H42l00k51J82K40m58m89K72j87N8m19j9L91k76k80J70L93j24j27N8O7K55L72
$$ plain form
834 469 60 -413 -827 -743 -1044 -1316 -1443 -1617 -1812 -1875 -1768 -2019 -1854 -1270 -944 -601 -92 259 493 931 1033
855 1033 1053 1224 1333 1894 1599 1499 1512 1663 1187 450 382 345 -7 -412 -928 -643 -658 -803 -840 -1055 -1054 -894 -798
878 -798 -1023 -1052 -603 -160 -236 -77 312 640 847 928 600 933 1127 876 783 716 687 895 694 463 231 112
900 112 -238 -655 -787 -1147 -1545 -1076 -1086 -1018 -1321 -961 -671 -952 -754 -790 -534 -149 -17 453 774 1297 1265 1221
922 1221 1139 1246 1615 1049 665 924 592 175 30 -77 146 -176 -746 -1018 -792 -1076 -1071 -1013 -1071 -706 -438 -381
944 -381 -224 135 319 454 1 163 503 723 699 473 743 872 867 775 345 76 211 -113 -259 -322 -454 -509
966 -509 -224 -247 -702 -865 -585 -625 -865 -951 -462 -458 -489 -378 -119 172 349 452 152 480 554 609 516 431 765 842
990 842 542 291 473 713 255 -234 38 -149 -91 -510 -529 -138 -414 -694 -524 -131 -255 -382 -324 -257 -2 370
1012C70J09N0J39J21j93p5j02K5n08L38k93O1k80n5J42L74m77o43J64K9J25j75
1034g54J32J94K76o2J83PK24O6l21K27J52L48m37j84K74M20k27m69Q5J0j11nl82
1057c54J73L24q1k17J45l0l89j4K54J12j34j13L21J58J00j42j01K76N7P2j31J60
1079D46r2J13k79K80J52l44n8p0r3k7n48p1K41J72K3l46R9L39l05l53K11K89j10
1102c31k13M58J94M47o8k07J73L25l32k65j49M57l14L05l48r4J00j02J40k95j06
1123b25j80n2j7L04J5R5m6j1j28J41o3L64q5l1k1K64j26l9K26j81K89j49O9m20
1147gj85K80k10J13J6J27j11k16J18JJ2k71o3K7P0j7J70O8J16J89J68l09O8PL03
1172D64m50K5L82j20J09m57N23j06l41k85L89k57j18j11J08J27M9m6o6J26k02
$$ plain form
1012 370 479 529 668 789 596 521 419 444 -64 274 -19 42 -238 -293 -151 223 -254 -897 -733 -704 -579 -754
1034 -754 -622 -428 -152 -214 -31 -24 200 266 -55 172 324 672 235 51 325 745 518 49 134 144 33 28 -354
1057 -354 -181 143 62 -155 -10 -40 -429 -443 -189 -77 -211 -324 -3 155 255 113 12 288 345 417 286 446
1079 446 354 467 188 468 620 276 218 148 55 28 -520 -591 -350 -178 -155 -501 -402 -63 -368 -721 -510 -221 -331
1102 -331 -544 -86 108 555 487 280 453 778 446 181 32 489 175 480 132 38 138 36 176 -119 -225
1123 -225 -405 -457 -474 -170 -155 -60 -106 -117 -245 -104 -167 197 112 81 60 324 198 159 385 204 493 344 413 -7
1147 -7 -192 88 -122 -9 7 134 23 -193 -75 -74 -62 -333 -396 -369 -299 -316 -146 -78 38 227 395 86 154 161 464
1172 464 14 39 421 301 410 -47 476 370 29 -256 133 -124 -242 -353 -245 -118 -69 -115 -181 -55 -257
1193b57p9K4N09l81K57J14J62K29jj67j19K25p4k31j37J59k28p2L9P1k5k67l6
1216b85O9j7m05J9m9O25k24J53R3M7j85J22j13j03L13l8j47N99n0j37R6Q5r3m7
1240C28k29j79Q5j98Q5J1k3K0P0l77l30K17J32j54J98N4m3L12q2P1j57K01j28
1263a16Q6M15j93RR3P7K52j09Q0q0l70J16j03J3q9j76P1j89K02N4n2k87n5l5j88
1288e74j77M61j65J13K64J01K35k2j29J77n8J69j40j44J33J35J2k42q6K24m1k21
1310B5l67N4J25j44l2K50J61m7j91m4O1j95L4J1J71L34k2J36k25J5J88L9k04J26
1334B59Q1k04M2o2K00k52Q2J2r4l22L24k48O8j01k8r7K63K2q4K07n0p8m5O9K55
1359B19k25O9Op2J94J18J44k41j53Mk5k70J69M2N8j67oJ39O2k56n1J74j46K6K02
$$ plain form
1193 -257 -336 -312 197 -184 73 187 349 578 577 410 291 516 442 211 74 233 5 -67 -28 43 18 -249 -285
1216 -285 -216 -233 -638 -619 -668 -43 -267 -114 -21 26 -159 -37 -150 -253 60 22 -125 474 424 287 383 468 375 328
1240 328 99 -80 5 -193 -108 -97 -120 -100 -30 -407 -737 -520 -388 -542 -344 -290 -333 -21 -103 -32 -189 12 -116
1263 -116 -30 385 192 201 294 371 623 514 594 514 144 260 157 170 81 -95 -24 -213 -11 43 -9 -296 -351 -386 -574
1288 -574 -751 -290 -455 -342 -78 23 258 236 107 284 226 395 255 111 244 379 391 149 63 287 246 25
1310 25 -342 -288 -163 -307 -339 -89 72 25 -166 -210 -149 -344 -310 -299 -128 206 184 320 95 110 298 337 133 259
1334 259 340 136 178 116 316 64 146 158 64 -258 66 -182 -114 -215 -243 -340 -77 -55 -139 68 18 -60 -105 -36 219
1359 219 -6 63 69 -3 191 309 453 212 59 63 38 -232 -63 -21 37 -130 -136 3 65 -191 -242 -68 -214 -188 14
1384A4l67J96L06j06K06j05j2K10j19j24N7j61L53k67r4K57q9Pj6k0k08k6j30
1407b38L35j84k60J07J52K0k6j69L96j56J26k63M4J23n7J58K70l00M1J25r4j82
1429c2J94j5p3K53j51k79K01l5m5o3m1J9n8j37J34K10k64P9P5O7j88J03k79M20
1453I5J35j08p5P2m1J97j38K3j09j07l5p4J59r3j90M49l5l32J01j9J45k80J05
1476a55K78O7n20M05k03M53j86P4k04J41r6o1J60J48k30P0N3J56l00K8q1k4j07
1499a34J32k74j21M33j85L64m18l8K11l3k8K39k7j87L35l21J90m8j17L10j32J48
1521B99k75k6R1j30O4j7pN1k32J28j28lM2j82L29k52j71K67j63L84J92k24j56
1544a19K72k47k6K13J90m40N05k33kK03k57kNl1L43l49n1r5J24j57J30j98K90
$$ plain form
1384 14 -353 -157 149 43 249 144 132 342 223 99 156 -5 348 81 -13 244 155 162 146 126 -82 -108 -238
1407 -238 97 -87 -347 -240 -88 -68 -94 -263 133 -23 103 -160 -116 7 -50 108 378 78 119 244 150 -32
1429 -32 162 147 74 327 176 -103 98 63 18 -45 -86 -67 -125 -262 -128 82 -182 -103 -28 39 -149 -46 -325 95
1453 95 230 122 47 119 78 275 137 160 51 -56 -91 -165 -6 -99 -289 160 125 -207 -106 -125 20 -260 -155
1476 -155 123 190 -330 75 -128 325 139 213 9 150 54 -7 153 301 71 141 194 350 50 78 -3 -27 -134
1499 -134 -2 -276 -397 36 -149 215 -203 -241 -30 -63 -91 148 121 -66 269 -52 138 90 -27 283 151 299
1521 299 24 -2 89 -41 23 6 -1 50 -182 -54 -182 -185 -143 -325 4 -248 -419 -152 -315 69 261 37 -119
1544 -119 153 -94 -120 93 283 -157 348 115 113 316 59 57 62 31 374 25 -26 -121 3 -154 -24 -222 68
1567F8k54l06K71L9k05L91j40jK91P5Kj17j17J0J51K2k53L90l46k6K41J94l30
1590E0k04k3K26K6l68L21n8k65R6J09o2l5K60k66K3R5K46j28k8K87j27j16j80
1613a21L06r1J25j53OP5r8l6j45K10j33j16M1J41j78k15j05N35M8k52J48k38K17
1636b9K66l21J04n3O2J12K0q0K38j66j25R7p9j09k3O6p6J87J09q1J7j96L8p8P3
1661b7jl08L17L3L8J59j74j63J40Q3J40l51J58m5M63l92nj19M1j04L5J59P4j96
1685d5K7rk14J93p2Q8O5j89M70m84m9J90K1j61Q8K07p4p5LJ31J48k43j25J09J53
1710A53j6L6J4j33J13m3m29J48J45l31J83K61P1l33j08L70J2N3k92J7L06j63q6
1733e2K30N0j80k5N5K25l83K24L4r8L4j16J56M7n17K34Q9l17L22J7l2j68K03k69
$$ plain form
1567 68 -186 -492 -221 -182 -387 4 -136 -137 154 229 231 114 -3 7 158 180 -73 317 -29 -55 186 380 50
1590 50 -154 -177 49 75 -293 28 -30 -295 -199 -90 -152 -187 73 -193 -170 -75 171 43 15 302 175 59 -121
1613 -121 185 94 219 66 72 147 49 13 -132 78 -55 -171 -130 11 -167 -382 -487 48 96 -156 -8 -246 -29
1636 -29 237 -84 20 -33 29 141 161 81 319 153 28 125 46 -63 -86 -20 -96 91 200 119 136 -60 -22 -100 -27
1661 -27 -28 -336 -19 14 52 211 37 -126 14 97 237 -114 44 -1 462 70 65 -54 -13 -117 -82 77 151 -45
1685 -45 -18 -27 -241 -48 -120 -32 33 -156 314 -170 -219 -29 -8 -169 -81 126 52 -23 -20 111 259 16 -109 0 153
1710 153 137 173 187 54 167 124 -305 -157 -12 -343 -160 101 172 -161 -269 101 113 166 -126 -109 197 34 -52
1733 -52 178 228 48 23 78 303 -80 144 178 80 114 -2 154 201 -316 -82 7 -310 12 29 -3 -171 32 -237
1757b37kN4N08j69j37j68o8K58j93L7J51Q7r2QR8j85R5o3K01m0j11R3o8J8Qj50
1783f7N5O2lm9j68M07m48J96J45m9Q5l35K43j10P1p3P7K5n8j49L47k01J49j87
1807c5k02K89j3L5J8k83J89k4J62M7k19R3K25l13k9j68M23j44L6j89K46K7J61
1830C32j00l48J94P8j89J44J88l18J33r1j20K89K0j92M7n13N82j45j84M0j07J7
1852b43L17J0ojK38j63k95L6K10n6j1m26J87M94j50p4k28J10j3J73k32L93l13
1875d3p4L86l75K03j09p5k5K04j16n0L9k11M86j03l40J99J61n02L51O1o5j33j23
1898b54R8K69j20L29j54k78J12j21k65K66L30n9k79J6J29Q7j58J74j18K5lj8j41
1921a33J19j28J56k02K45Q8j57J91k37l9O8%q2J09q7M8r9p0K76j47l09J43K70
$$ plain form
1757 -237 -239 -185 323 154 17 -151 -219 39 -154 -117 34 121 29 37 135 -50 45 -18 183 143 32 125 57 75 83 -67
1783 -67 -12 50 47 -2 -170 237 -211 -15 130 81 166 -169 74 -36 35 -38 39 64 6 -143 204 3 152 -35
1807 -35 -237 52 39 74 92 -191 -2 -26 136 183 -36 57 282 -31 -60 -228 195 51 87 -102 144 171 332
1830 332 232 -116 78 156 -33 111 299 -19 114 23 -97 192 212 20 67 -446 136 -9 -193 -153 -260 -243
1852 -243 74 84 78 77 315 152 -143 -107 103 47 36 -390 -203 291 141 67 -161 -51 -64 109 -123 270 -43
1875 -43 -117 269 -106 97 -12 -87 -112 92 -24 -74 -35 -246 240 137 -203 -4 157 -345 6 67 2 -131 -254
1898 -254 -156 113 -7 322 168 -110 2 -119 -384 -118 212 153 -126 -110 19 106 -52 122 4 29 26 8 -133
1921 -133 -14 -142 14 -188 57 145 -12 179 -58 -97 -29 -29 -111 -2 -89 -41 -140 -210 66 -81 -390 -247 23
1944B3m5k6n7K28j10j1R6n4R8l43L25j93J90J10j36Q1j65K97m97K76R6j99K6O4
1968G4k31j09K61k08Q9L31m88M5L63l45J62k74L24q1K04j38m7j6r7R6l64M06j53
1991a96K10k1j01L29m4l42J39M5j19O3r0J08J0Q5k28n4J21L64n26J48o9K10k14
2014a72R5J84n9l9j37pJ00j8m1pK06m6JJ32l74N2r0q5K58K08k50M7K4q9P6r7J30
2041BMm6j85P9L00k64J21n4p5J09J23j20p9J56l3p1R1R2k77K1K36m1o1Jk2K87
2067B94k13lk36o8N7J41J14l2r7Q0k03J37n4J89k0l40J62K00R9r6o8j88Q6J38
2091G9o0M3J15j50m2P9mk8K4k13N6m5J59L1K7m5O6l08O5J25Q2l0J8L2o5k77K68
2118BJ47j64K2P0J2J7j31l04K12J97P8n64M72k08K30j32o0M37l40K21j55j93J22
$$ plain form
1944 23 -22 -48 -105 123 13 2 98 44 142 -201 124 -69 121 231 95 176 11 308 -189 87 183 -16 10 74
1968 74 -157 -266 -5 -213 -124 207 -281 -236 127 -218 -56 -330 -6 -87 117 -21 -68 -84 -181 -85 -449 -43 -196
1991 -196 14 -7 -108 221 177 -165 -26 19 -100 -37 -127 -19 -9 76 -152 -206 -85 279 -247 -99 -168 42 -172
2014 -172 -77 107 48 9 -128 -135 -35 -53 -94 -101 105 59 60 192 -182 -130 -220 -305 -47 161 -89 -42 -18 -107 -31 -128 2
2041 2 6 -40 -225 -146 154 -110 11 -43 -118 -9 114 -6 -85 71 38 -33 58 150 -127 -106 130 89 28 29 7 294
2067 294 81 78 -158 -226 -169 -28 86 54 -43 37 -166 -29 -83 106 86 -254 -92 108 207 111 43 -145 -59 79
2091 79 19 62 177 27 -15 64 60 32 56 -157 -101 -146 13 44 71 26 92 -216 -151 -26 56 26 44 76 11 -266 2
2118 2 149 -15 7 77 89 106 -25 -329 -117 80 158 -406 66 -142 88 -44 -104 333 -7 214 59 -134 -12
2141a2j54N1Q4J51j11n5k16J00L26k75J89K80l48P2j47J61o5n9J66l34J0K9L01
2164A44l5O2k68N4R7J03j25k15J63l05L09P2J9j36J66k93R0J50j67K31J4j9J08
2187B19j02q2k79K88k5k34K61J5p2q5P1l8J29J63J01o18N03j47j80M60j45l98
2209a95M01p9j91J75r8M7j21K08l96L65j66J7K18j40k4j34K23J19k06j04K30k87
2231a38J65q2J3J18l6Pk4J4j5Pj32m1J00K39j37r4K5M7j1o5k16M52k63j10K07
2256C0k23L5j66K86Oj64K27l48J86j43J50K9J26j67q3Q9JK52k53K2J68J08j76
2279hj49K60j8j43j45K63l41L49K37m16M38m64J07J29k33O3r8R9q0q6K18j52L06
2302A36Qj97J17j39J30Q6l08j18J27J30O6j42k42O83k64j66Rl4K77J68m00J79
$$ plain form
2141 -12 -166 -115 -31 120 9 -46 -262 -162 164 -111 78 358 10 82 -65 96 31 -28 138 -196 -186 -157 144
2164 144 109 171 -97 -43 54 157 32 -183 -20 -325 -16 56 75 -61 105 -188 -98 52 -115 116 130 111 219
2187 219 117 35 -244 44 19 -215 46 61 -11 -96 -25 -63 66 229 330 -288 215 68 -112 348 203 -195
2209 -195 206 127 -64 111 13 60 -61 147 -249 116 -50 -33 185 45 21 -113 110 229 23 -81 149 -138
2231 -138 27 -55 -42 76 40 47 23 37 22 29 -103 -144 -44 195 58 -36 -11 36 25 -40 -256 196 -67 -177 30
2256 30 -193 -158 -324 -38 -32 -196 31 -317 -131 -274 -124 -95 31 -136 -219 -130 -129 123 -130 -108 60 168 -8
2279 -8 -157 103 85 -58 -203 60 -281 68 305 -111 327 -137 -30 99 -134 -71 -169 -70 -150 -236 -18 -170 136
2302 136 144 -53 64 -75 55 141 -167 -285 -158 -28 38 -104 -346 337 73 -93 -84 -118 159 327 -73 106
2324A06l48K01j1L0j96O3K98k64N8k0K18j45J17K2l71K90K09m3k15k61J11L18
2346A67k91M9Q3J25l87J09j1K6J17J88J0k02j11j7R1j98L32k10K37j21P4J12l74
2369b02n3J40OpP0J70j65n8q6K57j45j44K41j54P7m0l4K3k1J08p9J80l5K02n54
2394c03K61K41J0k01r4K94l50L7J58P7l11L58j56M3k51K29j8J68k00J08J07k65
2416e8Q7j09J49j32O9Q4j68L30l07j49K22m4M6m6O3J03j97p9K87l08J07K90r0
2439A50n21K00J29K38j23J12k17j98J52l3k4K30J01l90K25n2J9L0j68L3Q1K60
2461B34k22J72J53n71K85J37N7n53J38J72p0L0K97l11J10L9r9k5j20L21j87P4
2483F1l0j10O0k31K13J87r7k6K01r9j2j78J67j19r9K41k32l1J49K3o6O7j6j35
$$ plain form
2324 106 -242 -41 -52 -22 -218 -155 143 -121 -63 -83 135 -10 107 129 -242 48 257 214 -1 -262 -151 167
2346 167 -124 -75 8 133 -254 -145 -156 -130 -13 175 185 -17 -128 -145 -54 -252 80 -130 107 -14 60 172 -202
2369 -202 -255 -115 -109 -116 -46 124 -41 -99 -185 72 -73 -217 24 -130 -53 -93 -127 -104 -125 -17 -96 84 49 251 -303
2394 -303 -42 199 209 8 -86 208 -142 -105 53 130 -181 177 21 64 -187 42 24 192 -8 100 207 -58
2416 -58 29 -80 69 -63 6 90 -78 252 -55 -204 18 -26 20 -26 37 140 -57 -136 151 -157 -50 240 150
2439 150 -371 -171 -42 196 73 185 -32 -230 -78 -111 -135 95 196 -194 31 -21 -2 28 -140 -107 -26 234
2461 234 12 184 337 -234 51 188 245 -308 -170 2 -68 -38 259 -52 58 97 -2 -27 -147 174 -13 61
2483 61 31 -79 -19 -250 -37 150 53 27 228 129 117 -61 106 -13 -112 129 -103 -134 15 38 -28 39 23 -112
2507a12K24j16j50K5O7K65m3k24j17L41j00J9p8q1J39Q4q0J29m45L05j19m4J71
2530F0J29k84J63j8k59J57J96k40kJ75k35J65L73l83J39l44n5K09j08m0K83J17
2552A98l03M9l6K02l1l06J53J09J1n5J29l11J50L1%rJ14q7j50J22K32j72j79K63
2576A24n5j09j8L27l6k56NR7M0R1l40J07j66J99k20J34K67Ok72l29L72r0K28j12
2600fM3J75m43R4m8K48K5L6j21J51k42J1Nm3J51O9k19O8J02k05m8R2J09k25J40
2625h1m6o9M09k39j43K03p8J27k07J92j7Q5l6p5j32j34K14J66r3L3jk32PJ09j26
2650a64K46r6K71r3r7N7L6k18J44J9M2j51J63l14L20j29J77k49k1q3L22k9k9j57
2674c3j15K39k68J50j97K27Nk8k5j49K87J01l7q0l03J74l7J29L5j50j83M05j92
$$ plain form
2507 -112 112 -4 -154 -129 -62 203 160 -64 -181 160 60 79 1 -80 59 143 63 192 -253 52 -67 -111 60
2530 60 189 -95 68 50 -209 -52 144 -96 -98 77 -158 7 380 -3 136 -208 -263 -54 -162 -202 81 198
2552 198 -105 -56 -92 110 79 -227 -74 35 46 -9 120 -191 -41 -10 -10 -19 95 8 -142 -20 212 40 -139 124
2576 124 69 -40 -58 269 233 -23 -18 79 119 210 -130 -23 -189 10 -210 -76 191 197 -75 -404 -32 -122 106 -6
2600 -6 37 212 -231 -137 -185 63 88 124 3 154 -88 -77 -72 -115 36 105 -114 -46 56 -149 -197 -105 4 -221 -81
2625 -81 -127 -196 213 -26 -169 34 -44 83 -124 68 51 136 100 25 -107 -241 -27 139 46 79 78 -154 -147 -38 -164
2650 -164 82 -14 257 164 67 124 160 -58 86 105 147 -4 159 -155 165 36 213 -36 -57 -140 182 153 124 -33
2674 -33 -148 91 -177 -27 -224 3 8 -20 -45 -194 93 194 157 77 -226 -52 -89 40 75 -75 -258 147 -45
2697d5j12J42j56J94r0J14O2k91k09M50j25K16K3k59K05l01Q1K23m1L4j27R6j99
2720a15L5K30j33n2Q9k19J69j62q9O2L46p8k8j27R1lo3Po9K08j30l7J91j27K27
2745B23l88L03m4M3j23j38K18k3N9j28j4o3KN5PR7j20J41m8j0k3p7M9J28j92j12
2771a78J80J9R8j30N9k24L51l35K87r4J4N8j43p9N9J02q1j77M27l1j64K42l61
2794a01J90j85J40K7j87N9J19J53k29o1J26K64m54J73PJ43j51j15K94l66P5k00
2816b79M45k69M27l54J21k6Q5j45k26K95j92J54l70J90N2J19l1N0J22m05K15N7
2838C5k29R4L40k72P0K76m13J60k12j39L19p3q9K76j47j48J36J18r5R8m4l3J07
2861A35l53L32j20j44J3RK08k08J24L20j76l66K02r2p3L28j04M1j35J86n0m3n1
$$ plain form
2697 -45 -157 -15 -171 23 -67 47 109 -182 -391 59 -66 150 173 -86 119 -182 -101 122 81 115 -12 84 -115
2720 -115 -80 150 17 -35 54 -165 4 -158 -247 -185 161 83 55 -72 19 16 -47 -40 -109 99 -31 -68 123 -4 223
2745 223 -165 138 94 137 14 -124 94 71 130 2 -12 -75 -73 -18 -11 86 -34 107 59 49 26 -51 -2 126 -66 -178
2771 -178 2 21 119 -11 48 -176 175 -160 127 33 47 105 -38 -117 -58 44 -37 -214 213 182 18 260 -101
2794 -101 89 -96 44 71 -116 -57 62 215 -14 -75 51 315 -139 34 41 184 33 -82 212 -154 -79 -279
2816 -279 166 -103 324 -30 91 65 150 5 -221 74 -118 36 -334 -144 -92 27 -4 46 168 -237 -22 35
2838 35 -194 -100 240 -32 38 314 -99 61 -151 -290 29 -44 -133 143 -4 -152 -16 102 7 105 61 28 135
2861 135 -218 114 -6 -150 -137 -128 80 -128 -4 316 140 -226 -24 -116 -189 139 35 76 -59 127 77 34 -17
2884a7L5J75k33J01j38K23k63j49J71J82j52L8K67j28j00l9k75N30k14P9k00O5
2906d2k7n8J24k30K37J47j58k05L14j21J88J5j09j39n0j0q4K0L32j51k16J34M4
2929d5N4K47o9p2j88l5O8J42K56l08J25j97j69K65j41L50n10L55j10j0k8J36l52
2952b36J98J31k39J50J31R9n12N28k36K6J9n0m4L70j52j33j6Mm9J8J34l09J50
2975a8m1J38j7j85k10K87J74j8m7k45K14P3k41R8p5R7p9J95j74K29j40l2l0j69
2999b16J82j47N7J99q6N4J04k64K81k74k0L1K93k04J34k11m3K35l08Q1J29J98
3021B05l68J39L9l9J13O4l21K5K8K86k50P6j55N5J75l4J15rk84K58j53N0J04j89
3045g0q6K13J02j23l43K74K02k0K8k66K3k47L83j00J6m4p6R1K94l94J68J2K0k27
$$ plain form
2884 -17 18 193 -40 61 -77 146 -117 -266 -95 87 -65 -27 240 112 12 -27 -302 228 14 93 -107 -42
2906 -42 -69 -127 -3 -233 4 151 -7 -212 102 -19 169 184 75 -64 -114 -124 -208 -188 144 -7 -223 -89 -45
2929 -45 9 256 187 115 -73 -108 -40 102 358 50 175 -22 -191 74 -67 283 -227 128 18 8 -20 116 -236
2952 -236 -38 93 -146 4 135 234 -278 250 14 40 59 9 -35 335 183 50 34 38 -11 7 141 -168 -18
2975 -18 -59 79 62 -123 -333 -46 128 110 63 -182 32 105 -136 -38 -113 -16 -95 100 -74 155 15 -17 -47 -216
2999 -216 -34 -181 -124 75 -11 43 147 -117 164 -110 -130 -99 194 -10 124 -87 -130 105 -203 -122 7 205
3021 205 -163 -24 15 -24 89 153 -168 -143 -115 171 -79 -3 -158 -103 72 38 153 144 -140 118 -35 15 119 -70
3045 -70 -156 57 159 36 -307 -33 169 149 177 -89 -66 -313 70 -30 -14 -58 -134 -43 251 -143 25 37 57 -170
3069a70Q9K44l88J84n0k6K68j97J6K89k12j47J87l38M48k62j01j1K49j31K3J23
3091H7j3k33n5L97q6j21k01K18j04J07j24L75l92K6o5K20j27J66K15l29j13J24
3113b8Qj32O8K03k12J11o2K72k07q0K92n1j69R8m8n4j01K88k62J07P8j31N1N4
3137I3j93J17o5J3J52o7l60L42j7N7j17P7k00R1N8K34m9m5n8J20n8o0j34j1j12
3162a92K09j70J06J34J92l49M4K76k48NL3J95l99N07k86P8k62L08k76Q3m5j04
3184a61L34j47r7M7K02k59J1L0J82k99J15O2J01j11p9q6L02k10J24J13j46K34
3206B62l32J38p9Q2q4O6k10K31j85R0j5L46j94j63q2oL59k54J74j1O2k2p7k41
3230a45J20J92k10P8k48K30l5Q0j19o8Q5q4J30j63L34k02N8l4J3N8j00j8J21J29
$$ plain form
3069 -170 -81 163 -225 -41 -91 -117 151 -46 -30 259 47 -100 87 -251 197 -65 -166 -177 72 -59 -36 87
3091 87 74 -159 -214 183 97 -24 -225 -7 -111 -4 -128 247 -145 -119 -184 36 -91 75 290 -39 -152 -28
3113 -28 -20 -152 -84 119 -93 18 -44 228 21 -59 233 182 13 111 63 9 -92 196 -66 41 119 -12 39 93
3137 93 -100 17 -48 -35 117 50 -310 32 15 72 -45 32 -168 -77 -19 215 166 121 63 183 125 65 -69 -80 -192
3162 -192 17 -153 -47 87 279 -70 -26 250 2 7 40 235 -164 343 57 135 -127 181 -95 -12 -57 -161
3184 -161 173 26 -71 -24 178 -81 -70 -40 142 -157 -42 20 121 10 -69 -155 147 -63 61 174 28 262
3206 262 -70 68 -11 71 -13 53 -157 74 -111 -21 -36 310 116 -47 -129 -135 224 -30 144 133 195 173 96 -145
3230 -145 -25 167 -43 35 -213 17 -18 62 -57 -125 -40 -124 6 -157 177 -25 33 -1 12 70 -30 -48 73 202
3254B02j17J4j28j5O6J0J11j70L5j62M9J31j7M6K16j79n0k7J05J37j53k56N9Q7
3278fK39k95K7q3K06k47J71l9j11lJ68P4Qp5j5q4J06j06K50j79k9M30l99lq7j50
3304b32L81L0k07L04n14K20J13m9L0q4L76l18n1r0j53L86J00l19N5K38k85O3J91
3327A85l7j48M5K5lk14K38K3K4r4o7j43J20kL1j6L1M3R5K98n11N2K70j77j92q4
3353b08K47j71o7J24o1J00J58q8K93k85p4j5j45K67j00LJ41P6p2K9k81K14n7K12
3377B40l13k79M61j59J60j49O9o4%p2J20O2M5j74l06M31k46J61p2N6K97k37q2
3400e1R3J1j2k1k1Q6J79k70L63o42K35o2N5K21l19K66J51k15mk7p9K70k2m52k4
3425b91J49kL04k34J17j78J92r8j3J29k30M38m51J40J4j61Q3p0K44M0j56j22M60
$$ plain form
3254 202 85 99 -29 -44 22 32 143 -27 8 -154 -105 26 9 55 271 92 42 15 120 257 104 -152 -93 -6
3278 -6 233 -62 -35 -118 88 -159 12 -27 -138 -141 27 101 109 34 19 -65 41 -65 185 6 -23 407 8 5 -82 -232
3304 -232 149 179 -28 276 -238 -18 95 46 76 -8 368 50 -1 -91 -244 142 242 -77 -22 216 -69 -6 185
3327 185 148 0 45 70 67 -147 91 114 138 44 -23 -166 -46 -48 -17 -33 -2 41 136 434 -77 -25 245 68 -124 -208
3353 -208 39 -132 -199 -75 -136 -36 122 34 327 42 -32 -47 -192 75 -25 -22 119 195 123 152 -129 85 28 240
3377 240 -73 -352 109 -50 110 -39 30 -34 -34 -106 14 76 121 -53 -359 72 -174 -13 -85 -29 268 31 -51
3400 -51 42 53 41 20 -1 85 264 -6 357 -285 -50 -112 -57 164 -155 111 262 47 43 16 -63 207 185 -267 -291
3425 -291 -142 -144 160 -74 43 -135 57 -41 -54 75 -155 283 -168 -28 -14 -175 -92 -162 82 122 -34 -156 304
3448C04m45K25j40l69M92k6j53M8lJ01K69k11j25K8qL73k82j72Q2R1P8j65k95
3471c03L95J05j09Q4k04r7M63m95j71J91o1J7J35K5P3r3J8k3J17m1K98l92J74
3494A06j45N7j50L1R3p0Ok1J90o2J13j34l92N17M9K6M6k87j10K99l92K59k5J43
3518A47k77J0J72J23k33Q0K48l80J35k74K17J77J75n12L4J87P5l59R9M74j77j74
3540c3l9J75k83J61K06k55j30J91j01N6J07Pk10L17j74k66K36j74K29L7j67kK81
3563A69l45k2m1J97J28m9o7L5J84l98K59j42J59j5o9k2n2j04K04K10l85K62j31
3586c5L5J96j60Pn0L5J00k96J62J44J38j18m41K90r7J73J5q6l9q9J98l2k24K25
3610E1K02k68J0M3k57J24R4K50j84j64J36k35o4K03k13L78K12j75j83R2N3l57
$$ plain form
3448 304 -141 84 -56 -425 67 41 -112 -64 -67 34 303 92 -33 -5 -13 360 78 -94 -12 79 157 -8 -303
3471 -303 92 197 88 172 -32 -129 334 -161 -332 -141 -202 -185 -50 -25 48 -45 -27 -50 67 26 324 -68 106
3494 106 -39 18 -132 -101 -8 -78 -72 -93 97 35 148 14 -378 139 188 214 260 -27 -137 162 -230 29 4 147
3518 147 -130 -120 52 175 -58 22 270 -110 25 -249 -32 145 320 -192 -158 29 104 -255 -156 318 141 -33
3540 -33 -72 103 -180 -19 187 -68 -198 -7 -108 -52 55 62 -148 169 -5 -271 -35 -209 20 57 -110 -112 169
3563 169 -176 -198 -239 -42 86 37 -30 5 189 -209 50 -92 67 52 -17 -39 -91 -195 9 219 -166 96 -35
3586 -35 0 196 36 43 -7 28 128 -168 -6 138 276 158 -283 7 -90 83 98 12 -27 -116 82 50 -174 51
3610 51 253 -15 -5 38 -219 -95 -1 249 65 -99 37 -198 -262 -59 -272 106 318 143 -40 52 105 -252
3632b52L55k41L40nl47J05k46K60j7O6J02j12j77K01l85K69j69L80q0J87k12l60
3654c38M57J03j7l18K18k84K08n7j18L68k78J64j19J0n6K35R7m50M7K33k60J19
3676c6L66l73J74%j90R7j69l5J24k1K37l39J07J74m3m6j55K71j9j43J89J57Nk08
3700A24q4PJ37j70p2R5m2Pj02O1n0k91M42Q3l14J53J21j99K96k09J21k75P0J54
3724F3J34l18q5L51k00J04O6lk22J68K0j47K62k5k53j68K36J1J55k74J22m8n3
3747a04K23q2K3j71J80j03m2J58r4J2j50l5K49o9J24k58J34j6k33Q0N78l37P7
3770A44j74Rm1ol4l9L38k17Q6J04Q4l65O4m8M5J30o9J42k75j67L92k32N6N6N2
3795C5j27J20j3J48l1M2m09L06k22L05j8Q4j48k17L11J59j87J18l41J7J55k40
$$ plain form
3632 -252 103 -138 202 197 -150 -45 -291 -31 -48 18 120 8 -169 32 -353 -84 -253 127 47 234 22 -338
3654 -338 119 222 205 -113 105 -179 29 -28 -146 222 -56 108 -11 -1 -57 178 275 -175 -128 105 -155 -36
3676 -36 330 -43 131 131 -59 38 -131 -166 -42 -63 174 -165 -58 116 73 27 -128 143 124 -19 170 327 332 124
3700 124 40 47 184 14 -58 37 -5 2 -100 -39 -89 -380 62 145 -169 -16 105 -94 202 -7 114 -161 -91 63
3724 63 197 -121 -206 145 -55 49 115 112 -110 58 78 -69 193 168 -85 -253 -17 -6 149 -125 -3 -51 -104
3747 -104 119 37 60 -111 69 -34 -76 82 -12 0 -150 -185 64 -5 119 -139 -5 -21 -254 -174 404 67 144
3770 144 -30 -21 -62 -68 -102 -141 197 -20 66 170 254 -111 -47 -95 -50 80 11 153 -122 -289 103 -129 -73 -17 35
3795 35 -92 28 15 163 132 174 -235 71 -151 154 136 220 72 -145 166 325 138 256 -85 -68 87 -153
3817a53J00J30J52m08M07l29M87p16O19l09o6J36j62J69j61N0K7N7q0J33o8K00
3839B15j49M9k6R1k04j34K40j67j08J03r5K53j57L01o9M1k3k36J38J33jk41J34
3862H8m4k1j11K49J9j59j42K32l59K74k06K50k5n0R9k27J39r9M74k10j61O8l1
3885D7k23K81R9m19K38M9M0p8k56M79r1k00J01J43Q7q1r9j58J82q1k24J81J50
3908A67n8L2j32j63o9J31j84K49K10k10qM2l1K65k56L0j01k8J39k6o1O3m1M2J84
3933A86j53K27k21j05R5J32j30k09Q5K33o3k11Q0J08j69o2M20j56J32j54r5K39
3955B09j61j78K09J36j53J72l4L1l94m1L52j9j42p7L23l46J68j7K2j42J40r7j77
3978b16K51q6M3j02M1J28O8j32N9p3J79o1l67M38r3j53M8n1j23M3Q8J52J2J46
$$ plain form
3817 -153 -53 77 229 -179 228 -101 386 -330 289 -20 -86 50 -112 57 -104 -54 -27 30 -50 83 15 215
3839 215 66 115 89 180 -24 -158 82 -85 -193 -90 -185 68 -89 212 143 184 161 -75 63 196 195 -46 88
3862 88 44 23 -88 161 180 21 -121 111 -248 26 -180 70 45 -5 94 -133 6 -93 381 171 10 78 47
3885 47 -176 105 204 -215 23 72 112 34 -222 257 166 -34 67 210 297 216 117 -41 141 60 -164 17 167
3908 167 109 141 9 -154 -223 -92 -276 -27 183 -27 -35 7 -24 241 -15 15 -86 -114 25 -1 -62 1 -40 2 186
3933 186 33 260 39 -66 29 161 31 -178 -93 140 77 -134 -54 54 -115 -177 243 87 219 65 -30 209
3955 209 48 -130 79 215 62 234 200 231 -163 -204 148 129 -13 -90 233 -113 55 38 60 -82 58 -39 -216
3978 -216 35 -51 -8 -110 -69 59 127 -5 54 -19 160 99 -268 170 77 -76 -28 -79 -202 -159 -71 81 93 239
4002B39m47Q1Q7oJ73k30K02j75J96k03Np0K46Mj64J20M7j03J4q2K90l43K45P6
4026B02j05j91Q8J35n9k11k03N76j60k40K11j58J89k56K9Q4O5k62K92J73m50J87
4048f4K19n2K9j92L7J16j13k7R1M5j15J1n6N2M0j29J09l1JK18k24r4j02L50j62
4073d3R2Oj8j33J18j95K46l8Mj84K18R7l86J71j6J12p8q9K58j54O1J7J22j85N6
4098E9r5r8l6L82j16l03p0K71J65l43J23J47k96L77J5k80o7Q3m2N05k00l24K48
4121A05l32N07l82P6j70J94r1K85m7l13L19k83J80J08j30j28K16J4r9J0P8k43
4143a26O3o4J49J43m5j4j33J97l56M85l83J24M3j73Q2Q7M6k71L26j67K4j40K11
4166A08q0l62N69j56J53K4m56o9K48K24l93J51L24m51K39k54n4q6K08o5K60j35
$$ plain form
4002 239 -208 -127 -40 -46 127 -103 99 -76 120 -83 -78 -148 98 102 -62 58 105 2 16 -66 224 -119 126 202
4026 202 97 -94 -6 129 70 -141 -344 232 72 -168 43 -115 74 -182 -153 -69 -4 -266 26 199 -251 -64
4048 -64 155 103 132 -60 -23 93 -20 -47 44 89 -26 -15 -71 -19 21 -108 1 -30 -29 189 -35 -129 -231 119 -43
4073 -43 49 55 37 -96 22 -173 73 35 39 -145 73 170 -216 -45 -61 51 -27 -116 142 -12 49 66 188 3 59
4098 59 -36 -134 -170 212 96 -207 -277 -6 159 -184 -61 86 -210 167 182 -98 -165 -82 -124 381 181 -143 105
4121 105 -227 280 -102 -26 -196 -2 -93 192 145 -168 151 -132 48 156 26 -102 114 128 29 39 117 -126
4143 -126 -63 -127 22 165 120 106 -27 170 -186 299 -84 40 83 -90 -8 79 125 -146 180 13 37 -103 108
4166 108 28 -334 235 79 232 256 -200 -269 -21 203 -190 -39 285 -166 73 -181 -235 -321 -113 -178 82 -53
4188e3r1L09Kj80J22j98J69j87J02j16L13k71K07p6j37J97L3j67j06rR8k15m8
4211c02L16m4j08K21J73j35j77K98l7R8k57n1L59k76l1k61K66j96K1K78Jn57M53
4234E2M7m5J11k06J05j10j61J99J67j27pJ04Q4j12k99M4N4p2L55j17j11k8Q0k02
4258a95P8L30j15j43q9K67k28O2k0J22j60K8MJ39k65J99l80K53K76j41O3K2K4
4281A31k72m2J13J15%m3J64j23J3r0L05k50J18k30J07K16j55l18M01l9L3j61P9
4304G2k6o7J06k40J32J79k28J27Q2j35L2q0K37o1k92R7j20J87j40J22K41j99J24
4327A50m63K15q1l7J98kJ95k86K24J4k00K33j4k96K44p2r0P2J96p2j28l11j9N19
4351A89m23j6K52j36q0K16p8n8P5J16N0j15j22L20k41J37o1J67k70K27j01j51
$$ plain form
4188 -53 -144 165 167 -13 109 -89 80 -107 -5 -121 192 -79 128 52 -85 112 145 -22 -128 -137 -39 -254 -302
4211 -302 14 -30 -138 83 256 121 -56 242 205 303 46 -5 354 78 47 -214 52 -144 -123 155 156 -401 52
4234 52 99 54 165 -41 64 -46 -207 -8 159 32 25 129 213 101 -198 -154 -100 -172 183 66 -45 -73 7 -195
4258 -195 -117 213 98 -45 -134 133 -95 -33 -53 69 -91 -63 -59 80 -185 14 -366 -113 163 22 85 107 131
4281 131 -141 -183 -70 45 45 2 166 43 56 -34 271 21 139 -91 16 232 77 -241 160 121 154 -7 72
4304 72 46 -21 85 -155 -23 156 -72 55 137 2 34 -46 191 130 -162 -65 -185 2 -138 -16 225 26 150
4327 150 -313 -98 -179 -216 -18 -20 175 -111 113 127 -73 160 146 -150 94 22 -68 4 200 128 0 -311 -330 189
4351 189 -234 -250 2 -134 -214 2 -76 -134 -59 57 107 -8 -130 190 -51 86 25 192 -78 149 48 -103
4373a03J10J22J31l78L17j81j3m8N8Q6k36k98M63j45N8j65J70k24R7K53o4o5n0
4396a05J35k6k55K79j4K02j26l12J93Q8lp7K4j14K4J21n5N0J53M2j08o5k0q7R9
4421D3j80L39j27j01J6j44K28j3J5Nj78n4J11JO2J3j72J79J45k02jm5k2J27J90
4446B35k98J0Q1j71NJ85k50j1l3K56K29j30j2l83L77j14R7k10L57r3j0o5N4j74
4470f8jl6p3J67J37Q4R3j47l87J67K08l47O0K4J41J42k65K21m6k92J25L46j65
4493H8l04J87L87m94K59p8j0L5k16L45l38J35m9J08J42k62J13J24k96J66j4Nm6
4516a3j83J37L53k86L1J51j08j7R1mj63k20L20o9R4J58k62l7K14j57n8L16l55
4539f7L0J13j43j4J7M1j8Q5j38R4q1R4j22K1K31j54nJ72l01L51n2m56M08p1J59
$$ plain form
4373 -103 7 129 260 -118 199 18 5 -43 15 101 -135 -433 30 -115 -57 -222 -52 -276 -179 74 10 -55 -105
4396 -105 30 4 -251 28 14 216 90 -222 -29 59 56 -21 3 -111 -87 34 -21 29 182 224 116 51 31 -56 43
4421 43 -137 202 75 -26 -10 -154 74 61 76 81 -97 -151 -40 -39 23 36 -136 43 188 -14 -15 -60 -82 45 235
4446 235 -63 -53 28 -143 -138 47 -203 -214 -247 9 238 108 96 -287 90 -24 73 -137 220 127 117 52 106 -68
4470 -68 -69 -105 -178 -11 126 210 303 156 -231 -64 144 -203 -143 -119 22 164 -101 120 74 -218 -93 253 88
4493 88 -216 -29 358 -136 123 45 35 70 -146 199 -139 -4 -53 55 197 -65 48 172 -124 42 28 33 -13
4516 -13 -196 -59 294 8 39 190 82 65 156 152 -11 -231 89 20 114 272 10 -27 187 30 -28 288 -67
4539 -67 -37 76 -67 -81 -64 -23 -41 44 -94 0 -81 13 -109 -88 143 -11 -16 156 -145 206 154 -302 106 35 194
4564A94l82K54j9k1L2j47K84L3m69L19J59m07M01r2l02K40K03m36K86l4j31J79
4586A44k91K89j86j2L70m75J51j94L33j99j53L60O2k65j65J49L21p9Po5j80L16
4608B38r8j01Q6j7jM5Jj35p2Q8l8j54J53Mj4jJ17j51r1L7J95k13K32k24k9J68
4634B5m6J2k61M01o8L4j37J22N2J27l70j10L36J4j30p9J05l19J82N2oko4OL10
4659A86k31k22J83O3r9K74j78K1P1p6K42k39J85j6m4n3K2j50L5j37o6J80K59j69
4683D1K03k24o3K08j2k22J8K94j51p6mQ1l5n3J38M9j19J36l4j66k33P3j06L09
4707E2j09j97K62L11j93o6J10k21j20L28j06k53J22Q9j65m1L01r2P4Nj67J22j4
4730C2o1p9J74j35M9o8K49j12N6p3N5j72OP3M1l61K23J25j09J71k64K18l41L80
$$ plain form
4564 194 -188 66 47 26 58 -89 195 228 -241 78 237 -170 231 139 -163 77 280 -156 130 96 -35 144
4586 144 -147 142 -44 -56 314 -161 -10 -204 129 -70 -223 137 199 -66 -231 -82 239 160 167 102 -78 238
4608 238 140 39 125 108 107 152 153 18 -54 34 -4 -158 -5 -1 -15 -16 101 -50 -141 -104 91 -122 110 -114 -143 25
4634 25 -21 -9 -270 131 63 97 -40 82 134 261 -109 -219 117 131 1 -78 27 -292 -110 -58 -64 -66 -130 -124 186
4659 186 -45 -267 -84 -21 -120 154 -24 -3 68 -8 234 -5 180 164 120 67 89 -61 -26 -163 -229 -49 210 41
4683 41 244 20 -43 165 153 -69 -51 243 92 16 12 93 58 5 143 192 73 209 175 9 -224 -151 -257 52
4707 52 -57 -254 8 319 126 60 170 -51 -171 157 51 -202 -80 9 -156 -197 104 12 86 91 -76 46 32
4730 32 -29 -108 66 -69 -20 -88 161 49 105 32 87 -85 -79 -6 35 -326 -103 22 -87 84 -180 38 -303 77
4754G7j41J04k39K24K33m15Q5N3O4K81m40Q5K15l89j0J70KN6k40J44J74k73J94
4777A4j75M7M30k42J45P3k93j82L6K73k77K30j68P1%pq6K21p7j81J25j85j3O2
4801a59L97l74L00k25j10L57k59J58k7j05J79k03K00k56J53L9l03L30K7j12J23
4822A30l49J80J47O0r9j4N8Mk30J57j08o2K27j85K6J81n3j88J87j28J36k9l0K3
4846D1Rj0j17j16J65k1j53L66l0l11L4N8P1k44J93O3q3P7N7j66N6K65l5q8k10
4871a29M64l70J05j03O4qm1K10m60M0J42J3j27J98n3l6R5Q9j32J22J4k93Q2p7
4895a91K24L6j4oJ71L5k95mp8J87L1j19M1J61R4l35K5mJ81j06qn9j07Q7j28M56
4921B75k68r6J21K6j27O0J87k46K68k28R5K21p6k28l17L01j8r1K00k03K04N2O
$$ plain form
4754 77 -64 40 -199 25 258 -157 -72 -19 45 326 -114 -29 186 -203 -213 -43 -41 15 -225 -81 93 -180 14
4777 14 -161 -114 316 74 219 292 -1 -183 -147 126 -151 79 -89 -18 -18 -25 -111 110 33 -148 -23 -208 -221 -159
4801 -159 238 -136 164 -61 -171 186 -73 85 58 -47 132 -71 129 -127 26 65 -238 92 119 7 130
4822 130 -219 -39 108 168 69 55 113 117 -113 44 -64 -126 101 -84 -58 123 70 -118 69 -59 77 48 18 41
4846 41 50 40 -77 -193 -28 -49 -202 164 134 -177 -143 -85 -14 -258 -65 -2 -85 -8 49 -117 -61 204 169 81 -129
4871 -129 335 -35 70 -33 31 23 -18 192 -268 -228 -86 -73 -200 -2 -55 -91 4 93 -39 83 97 -196 -114 -191
4895 -191 33 69 55 49 220 255 -40 -44 -122 65 96 -23 18 179 273 -62 -37 -41 140 34 26 -33 -140 -53 -181 275
4921 275 7 -89 32 58 -69 -9 178 -68 200 -28 67 288 212 -16 -333 -32 -50 -141 59 -144 60 112 118
4944A18j12R1L3k06K64j45j35K50p2Nk36m9J38J23Q5JR1m06L50k77j40L24k4m44
4968c73L67j15R6j0M0k6k61M02k38L71m09J8K84m2j44M3j94J14J04L16k00k08
4990f5j2l5K07k72L30n7R6J6k20J48l08K37j30J82j32j39M03l18J24p1kl2j2q2
5014a44J20J57j67J05p8j7j68J98l3J45k80J36J0O9q8j06K11m4m3L9R5M6n6j79
5038g2J3lj21K83J56j07k28Q2k23k00M57K6L5K5O9m66L52p5K6k51K74P3j32pj57
5063a71J32J66m0k29K70L6j20J03J02k69j9Jok69M44K2k13j54K44r1J12m8K49
5086B52j65l21K59j0k8l6j81R2J54j60K22J20oj21J18l48M16l18k0R1j27L35J02
5109C20l47j20L40k33P8j28L59m21K60J7j39J97j55K2p5N6m7o8R8J26r2j07K13
$$ plain form
4944 118 6 97 130 -76 188 43 -92 158 86 91 -145 -194 -56 67 152 153 244 -162 188 -89 -229 95 71 -373
4968 -373 -6 -121 -25 -35 5 -21 -282 120 -118 253 -156 -138 146 104 -40 3 -191 -77 27 343 143 -65
4990 -65 -77 -112 95 -177 153 96 192 208 -12 136 -172 65 -65 117 -15 -154 249 -69 55 -16 -18 -50 -62 -144
5014 -144 -24 133 -34 71 -7 -24 -192 6 -27 118 -162 -26 -16 53 -35 -141 70 26 -17 22 117 163 107 -72
5038 -72 -59 -62 -183 100 256 149 -79 3 -220 -420 37 63 98 123 192 -274 78 3 29 -222 52 125 -7 -14 -171
5063 -171 -39 127 87 -142 128 164 44 147 249 -20 -39 -38 -44 -313 131 153 -60 -214 30 -61 51 3 252
5086 252 87 -234 25 15 -13 -49 -230 -138 16 -144 78 198 192 71 189 -159 257 -61 -81 10 -117 218 320
5109 320 -27 -147 193 -40 38 -90 269 -152 108 125 -14 183 28 50 -25 31 -16 -84 14 140 48 -59 154
5132A54k14J1L36m45K68P8k26k1m9Q1j18Q4j15J97J16p0j5r0j83N15n19K09l6
5155e2J32O8p1j16K5J97l12m0N3l8J65j32J65o6K49k14Q2J06j21M9l30L50r8r3
5179d2J34r2j21k4L4Q7K12k37j82P7KJ67j07L29l24K4k6j92J40K1J09P1j51P3
5203a8J24K8m02M04j44p8q1J47J26q4O6n5j92Q5j36K4K07J88j63J12n7N2j70J01
5227H4j86K1J60j83P7J01R7O8l11JJ81k50M10l34K29l2K0k93Q6p2J85l98M90j65
5251a4%qJ15k76J08L20j41n5O3k47oPj08N4K88j30J54j26q7L22l46oL34k64k4
5276g3L2J73n7r9J67p5l30L11j07OL47j00k31j78N8M2J65kk42L04qkj69N7J21
5301A10j18M9J54o1k65K19k20K11j6j72J76K40k67JP8j71M09m32J19Qj20J10K04
$$ plain form
5132 154 -60 -49 287 -158 110 188 -38 -59 -108 -27 -145 -61 -176 21 137 67 52 -38 -221 294 -225 -16 -52
5155 -52 80 148 77 -39 -14 183 -129 -169 -116 -154 11 -121 44 -22 227 13 95 201 80 129 -201 149 51 -42
5179 -42 92 0 -121 -145 -111 -24 188 -49 -231 -154 -152 15 -92 237 -87 -63 -89 -281 -141 -120 -11 60 -91 -18
5203 -18 106 134 -268 136 -8 -86 -167 -20 106 22 88 33 -159 -74 -210 -186 21 209 46 158 101 153 -17 84
5227 84 -102 -81 79 -104 -27 74 171 239 -72 -71 110 -140 270 -64 165 133 153 -140 -54 -126 59 -339 151 -14
5251 -14 -14 -22 93 -183 -75 245 104 49 112 -135 -141 -134 -242 -188 100 -30 124 -2 -89 233 -113 -119 215 -49 -73
5276 -73 -41 132 75 -24 143 68 -262 49 -58 -52 295 195 -36 -214 -156 -114 51 49 -193 111 103 101 -68 -11 110
5301 110 -8 41 195 134 -131 88 -132 79 63 -109 67 307 40 41 119 -52 357 -75 44 52 -68 42 246
5324B46k09q5L61k84J04N5j69Q0l18L31l2j71J19Q4j28k25J99N9l1k15K51K08
5346B30j22p5R5j44O0q4J49k09LJ11K2M6K58l86J84j95K79l05J09l8KL44m09l2
5370a07J36j26J60J79k76j13J10J16o1j42J0J67N5k73P5K41k68J9O1m1m5J15o
5393a4j85J04j15M03l08K64K2j94m2l2R9J06j82J29N8j32J00J7j72R2k96N09j46
5416H5J27j98K2k11J69m3Q5j29J43J5q5P7k08J01K69j36J9q2k08L23p5j09o9J29
5440A1M9J34l65j7J04K23O9k17K83j95n5j97J05N1j96J20J36N2k57QQ4j59M01
5463A72j84k17M13j93k19L28J12o8l62J94n6J25J03l58K87L6k70J63J25j64j70
5484b03M6q7K94k89K94m6K42m09J65n5p2K1J6J7M9J17k12l4M0J77J02k11J55q
$$ plain form
5324 246 37 -48 313 29 133 188 19 99 -219 112 80 -91 28 112 -16 -241 -42 17 -14 -229 22 230
5346 230 108 33 128 -16 44 -40 109 -100 -97 14 36 82 340 -46 138 -57 222 -83 26 -12 -10 334 -75 -107
5370 -107 29 -97 63 242 -34 -147 -37 79 18 -124 -114 53 108 -165 -90 151 -117 -98 -37 -78 -123 -8 -14
5393 -14 -199 -95 -210 193 -115 149 171 -23 -65 -97 2 108 -74 55 113 -19 81 98 -74 18 -278 231 85
5416 85 212 14 36 -175 -6 -49 36 -93 50 65 -20 57 -151 -50 219 83 102 20 -188 135 60 -49 -118 11
5440 11 60 194 -171 -188 -84 139 208 -9 274 79 24 -173 -68 -17 -213 -93 43 95 -162 -154 -70 -229 172
5463 172 -12 -229 184 -9 -228 100 212 144 -218 -24 -80 45 148 -210 77 113 -157 6 131 -33 -203
5484 -203 -157 -244 50 -239 55 9 251 -158 7 -48 -120 -99 -83 -66 -17 100 -112 -146 -106 71 173 -38 117 109
5508A09j23l3J53p1n6O1M7m3l09K18M0K65k50k5J52k27j31J91J90j90J71r5K12
5531B56j48j3k6J82l01J13j0J52k27K37k56K2R5Jk89M98l76n8J64Nj22K06j71
5554f6K15k47J04k9J78k23J39j34k25L83o6l24K70k61K33OnK02l6j10k18K70J85
5577B41j73j98K94j08l4o8L6N8j14Rpm6J68O7N6j26K9j80Q0J31j13n3j6l1m3R7
5603d4N6J55p6J33j52k18J32j15J92j12k8j02K56l35M28j0j73j96K36K8l98M15
5625G2J6j37J87l07L32k68N4k11K04J38j35K42m50K75Q0m6k20L4p7J15O4N2n6
5648d2O7j76P4Q5K06q6kK27l05j23J09M4K41k88J37K7j96O8M0j1O9k94J58j85
5672a56K78m6j27L25j46k12l4K13k04K99k62L36N6m34K23j6n6k00J08Q8j35J33
$$ plain form
5508 109 -14 -47 106 35 -21 40 87 44 -265 -47 -7 258 8 -17 135 -92 -223 -32 158 -32 139 44 256
5531 256 108 95 69 251 -50 63 53 205 -22 215 -41 -19 76 77 -212 286 -90 -148 16 21 -101 105 -66
5554 -66 149 -98 6 -23 155 -68 71 -63 -288 95 29 -295 -25 -286 -53 -47 -52 150 114 4 -214 56 241
5577 241 68 -130 164 56 22 -46 -10 48 -66 -57 -64 -110 58 125 181 55 84 -96 -16 115 2 -51 -67 -98 -141 -44
5603 -44 12 167 91 224 72 -146 -14 -129 63 -49 -77 -179 77 -258 170 160 -13 -209 27 55 -343 72
5625 72 88 -49 138 -169 163 -105 -51 -262 -58 80 -55 187 -263 12 92 46 -174 -140 -217 -102 -38 14 -42
5648 -42 25 -151 -77 8 214 128 126 353 48 -75 34 78 319 31 168 195 -1 67 107 96 165 -129 29 -156
5672 -156 122 76 -51 274 128 -84 -118 95 -109 190 -72 264 320 -114 109 93 37 -163 -55 33 -102 31
5694C1J7k63K70n0J06j47J76r7o2K31n3l27Q8L98l75J77j44J10K11k91n1j00J48
5717Ck04n6J32J42l95M03M5k06J51p8O8j02J48k20K60o1oK9j68K15j53J5J11j5
5741E8p6K31m59k6J12Q7K75m21K43j48L48p11M35Q1p0q8Q6K0L54k13k3p1J30r1
5765F3K68m47J44mJ2j2RQ0k72k09N34j04J43k15m7O1P7j53J10lj60J83j69J20
5789Ir8K06Q3p3l11J75Q5j10j44L12j74J43o3k42J40N5j6L2j12j12K36K45k64
5812BK40J66l48k53J90J02l31J57M6j25L39k49J59J5l04L94j67J50k26J32l59
5833b70J68K40J8l65p5K45k07L41j65k53L25P0l9J74l82N8K93l83K94k17N6J27
5855E3k20L99P1k56j2J49k87L33L0j65k06R5J94J28k58j18Q4k56M81m28K75M9
$$ plain form
5694 31 48 -215 55 5 111 -36 140 43 -19 212 159 -168 -80 318 -57 120 -24 86 297 6 -45 -145 3
5717 3 -201 -257 -125 17 -378 25 70 -136 15 -63 5 -97 51 -169 91 30 24 53 -115 100 -53 -38 73 58
5741 58 -18 213 -246 -272 -160 -73 202 -219 24 -124 224 -487 -52 29 -41 -129 -43 -23 331 118 95 24 154 63
5765 63 331 -116 28 24 36 24 33 113 -159 -368 166 62 205 -10 -57 4 81 -72 38 35 -125 58 -111 9
5789 9 -89 117 200 127 -184 -9 76 -34 -178 134 -40 103 40 -202 -62 -7 -23 9 -103 -215 21 266 2
5812 2 242 408 60 -193 -3 99 -232 -75 -29 -154 185 -64 95 110 -194 200 33 183 -43 89 -270
5833 -270 -102 138 156 -209 -284 -39 -246 95 -70 -323 2 72 33 207 -175 -117 176 -207 87 -130 -74 53
5855 53 -167 232 303 47 35 184 -103 230 260 95 -111 -16 178 306 48 -70 14 -242 239 -189 86 135
5877A35l53O9J48j43K3K2K28m7j5q8J41q9m7ko3J18J26K2l77L7l6K25J39m35K14
5902d8k7J88l18M2J66j46J02J04m9k36L85r6Q7q4p1L8p1J2J41n18N88j3k50K21
5926A47J7k35J62j57L49m22r2N5J18L1o4mL09p1n6NQ1p4M3j44M0K9j00J45q2J4
5952D4j05K20j07O9L9J76j90m19L64r3J10N0M1j52J30k55O4o8J64k20%j96L32
5975bj2J27J03j71p7J4N6k66K96N4j84J16l0nJ27J5j17l5j25J47Mn1l4J0m2J1
6001g1J38k55J27o6J33J00j14k59Q5k4K93L6p6j60J36j0j5J66k17J6K73k74K15
6024A77j92J94k23m1N7K30L6l42K37k99J3L3r0M10k63L09l62R6j38K39j12J08
6046G7n04L49N5J9L3N3j09R1n7O9j37Q3mk40P0L34j55k00K85K2r2k66L79q1j42
$$ plain form
5877 135 -218 -149 -1 -144 -121 -99 129 82 67 -21 120 31 -16 -18 -81 37 163 185 -192 -155 -191 34 173 -262 -48
5902 -48 -75 113 -205 -163 3 -143 -41 63 14 -222 163 67 154 70 -1 37 -34 -22 119 -399 189 176 -74 147
5926 147 164 -71 91 -66 283 -139 -231 -176 -58 -27 -91 -95 214 143 87 92 173 99 142 -2 38 67 -33 112 30 44
5952 44 -61 159 52 121 160 336 146 -273 91 -2 108 158 199 47 177 -78 -14 -82 82 -138 -138 -334 -2
5975 -2 -14 113 216 45 -32 -18 38 -228 68 122 -62 54 24 19 146 161 44 9 -116 31 35 -16 -50 -40 -82 -71
6001 -71 67 -188 -61 -127 6 106 -8 -267 -182 -206 87 123 47 -113 23 13 -2 164 -53 -37 236 -38 177
6024 177 -15 179 -44 -85 -28 202 238 -104 133 -166 -153 -120 -210 200 -63 246 -116 -20 -158 81 -31 77
6046 77 -427 -78 -23 -4 29 82 -27 64 7 76 -61 22 18 -222 -152 182 27 -173 112 134 42 -224 155 74 -68
6071f8J21K7j67J24j89k0M14q0j02J76m21L28Rk57J9L2K35M3j72m63L60J44j59
6094f6j37K09Q9O8K9j96P4j5J9K07m16J07J41J55k53L4K16k68j47J98K2q7Q3O5
6118A31k33l5J68j10K47l47J48J85j53j36J52J42r3J56k33K61k69r1J50K22m16
6139a54J23N4p5K25l7l25L39J57j50j39j30n6K16R8j88R8R4q9k39J77J44j59K01
6162A85k98rK23j5j45J7q2L98k01k19M0O5p9l6J83j36j38J01J32J51j69o5n5K79
6186A27k54R2J29k38P1J0J72k57J78m2j3j39m7L33P4r8l0j06N5j05j34P0J15j
6210c8J00P4n7J87l20R4J30j27O1o7N6q9j09J25l3j37O4n3J77J20l19J56O0q0
6234b5J61k48n3K24q8j19J06R9j91M5N7J99j34Kl66M98j50J53l07K60m4L4j34
$$ plain form
6071 -68 53 80 -87 37 -152 -172 242 162 60 236 -185 143 152 -105 -86 -54 181 224 52 -411 -51 93 -66
6094 -66 -203 6 95 163 192 -4 70 55 74 281 -135 -28 113 268 15 49 265 -3 -150 48 70 -17 66 131
6118 131 -102 -137 31 -79 168 -179 -31 154 1 -135 17 159 66 222 -11 250 -19 -110 40 262 -154
6139 -154 -31 23 -52 173 136 -189 150 307 157 18 -112 -168 48 146 -42 56 150 61 -178 -1 143 -16 185
6162 185 -113 -122 101 86 -59 -42 -124 274 73 -146 -106 -41 -120 -156 27 -109 -247 -146 -14 137 -32 -97 -152 127
6186 127 -127 -35 94 -144 -73 -63 109 -148 30 -12 -25 -164 -211 122 196 98 68 -38 17 -88 -222 -152 -37 -38
6210 -38 62 136 79 266 -54 40 170 43 104 37 93 4 -105 20 -13 -150 -86 -139 38 158 -161 -5 55 -25
6234 -25 136 -112 -165 59 -29 -148 -42 57 -134 -89 -32 167 33 35 -331 167 17 170 -137 123 79 113 -21
6257b1k47J42K82l7k56J13J1O6K2J83l64K63l28J62j88%K77l0J69J7m38O6P1J37
6281G2r7K10j65p2Q8m1L3J78rN9k39j87K33r4O9k8m5M6K00k88R6r5J62nq1J56
6307A56k53K7K11o1K5j77j8J27k35J16R4Pl0j06J19K8k5j55Q8J46p7j47J5K03
6331G8km9q5J90p0k84J75j7j33K72r0k66L36J81l41K30j24k22J48l6K17k40L18
6354A86k09p2L9j2L1J23q8L5j14j8J58j75K44ql52L52N6j31mj80J09K37n25L13
6378eL14j51k54K83j73Q0l8j56L39k45J05J38j08j36K85q2k69R0l3O8Lj05J28
6401G8P8j85p2K80k33%J8Q4O7M2k55J99k84K76k7K14l01Q7r2J59J58l29Q1m8J26
6426A21p4J70k92J78r1M2J5j69J09n3n7J09N4o9J31j08j24K75k2k30K0Q1l7J87
$$ plain form
6257 -21 -268 -126 156 119 -137 -24 -13 53 75 258 -106 157 -171 -9 -197 -197 80 50 219 236 -202 -136 -65 72
6281 72 -25 185 20 -52 36 -5 28 206 197 256 17 -170 63 -31 38 10 -35 11 211 -77 19 -76 86 81 0 156
6307 156 -97 -70 141 80 105 -72 -90 37 -198 -82 12 19 -11 -117 2 30 5 -150 -62 84 7 -140 -125 78
6331 78 76 27 -58 132 62 -222 -47 -64 -197 75 -15 -281 55 236 -105 125 1 -221 -73 -109 108 -132 186
6354 186 -23 -95 -56 -68 -37 86 -2 33 -81 -99 59 -116 128 120 -232 120 176 45 41 -139 -30 207 -318 -5
6378 -5 309 158 -96 187 14 94 56 -100 239 -6 99 237 129 -7 278 196 -73 17 -16 52 55 -50 78
6401 78 156 -29 -101 179 -54 -54 -36 48 115 157 -98 101 -183 93 66 280 -21 66 -26 133 291 -38 43 -5 121
6426 121 47 217 -75 103 12 54 69 -100 9 -44 -101 8 62 -7 124 16 -108 167 145 -85 -65 16 -21 166
6450A66k43mk59K47K48r9J93k94K6r0K85l25O3K77k05n0R8l96L48j39Q1j38K35
6473B5r8K6K13p8j94q8J36k71K50J32j48J81J87m55L18l56J43j40K97q4j02O8
6495c8J65j38J09j95j8K43J02K1k70K1j48l4k15L93p1k6M0Q3O6J0j33J60j62J30
6519I5k80K22N4J18r4r9K20m50O0L57k47r5L95j61J5R2p4n0K2J94j25p5j86J01
6543IJ74k66L1q3L91J3j58R5j71j80O6K58m66K34J74k4j07o7k6J46J5j72J34j15
6567i5j33L28K2j18J9l6J61j9J18q5j14o2K2j32O0j42R5j75K33Km6K63k63j23
6591b20J12J25k48L10r8n8J3J91o7J85m06j10J73j15P4L16j05N5j43L9Ql44N51
6614B38m16L16l53J47J32P9Q2m17K51n3L2q6j0k1k56M61k03kj36L11K53m33J95
$$ plain form
6450 166 -77 -81 -340 -93 155 56 249 -45 -19 -109 176 -149 -86 191 -14 -64 34 -362 -14 -153 -72 -210 25
6473 25 -73 -47 166 88 -106 -194 -58 -329 -79 53 -95 86 273 -182 136 -220 -77 -217 80 -4 -106 -38
6495 -38 127 -11 98 -97 -115 128 230 251 -19 2 -146 -180 -395 -2 -73 -99 -59 24 90 100 -33 127 -35 95
6519 95 -185 37 91 209 115 16 236 -214 -154 203 -44 -139 256 95 110 202 128 78 100 294 169 94 -92 9
6543 9 183 -83 -52 -135 256 269 111 206 35 -145 -79 179 -287 -53 121 97 -10 -77 -103 43 58 -114 20 -95
6567 -95 -228 100 122 4 23 -13 148 129 247 162 48 -14 8 -124 -64 -206 -111 -286 -53 -51 -97 166 -97 -220
6591 -220 -108 17 -231 79 -19 -77 -64 127 60 245 -161 -271 -98 -213 -139 177 72 127 -16 23 31 -313 238
6614 238 -178 138 -215 -68 64 143 225 -192 59 6 38 -48 -58 -79 -335 126 -77 -79 -215 96 349 -84 111
6637A11j12Rj32K1K61k26Q9k25J46K6J01j59M33m06J22k13L12m9k01k18L01o9
6659g8j05J19J00K7j16N6j36J10J01m0n3o5J01m8j5k01L29k28L4M02k99K9n6L7
6683EJ98j81J61%j90j40J24k9P9j17L80l09k54NM53P4j88J57k8k51J35j15l2J46
6707H3j33J74l0O7r3J67m52L45R2j63j10K0j98R4p4L75rj67J6K2J97k39j53L92
6731B23l30J35J06l27L33k12J80j26k6K27l45J4L92n41K90Q3j41j15J65K19j00
6752A04m2p9j62K09j84K2L05k45J40l00L93q0j68k17M46l90K39J17%K6j24j79
6774a69J81q9J23J7j00j60J60J68j19o2k80M40p6K55Pj70k42j9O3J02o3K14j65
6797A6j38n6K28k29L17k78K66L1J9J26k75o6j00K48Jj50q4J22j96L82k16q1j72
$$ plain form
6637 111 -1 8 -124 -103 158 -68 21 -204 -58 -32 69 -90 343 -63 59 -154 158 109 -92 -310 -9 -78
6659 -78 -183 -64 36 63 -53 3 -133 -23 78 38 -15 -80 21 -27 -42 -243 86 -142 -108 294 -5 24 -32 5
6683 5 203 22 183 183 -7 -147 -23 -52 27 -90 290 -19 -273 -268 185 259 71 228 200 -51 84 -31 -63 83
6707 83 -50 124 94 161 68 235 -217 128 220 57 -53 -33 -231 -137 -211 164 155 -12 4 26 223 -16 -169 223
6731 223 -107 28 134 -193 140 -72 108 -18 -44 183 -162 -148 244 -297 -7 76 -65 -180 -15 204 104
6752 104 62 -17 -179 30 -154 -132 173 -72 68 -232 161 81 -87 -304 142 -248 -9 108 108 134 10 -169
6774 -169 12 -77 46 63 -37 -197 -37 131 12 -50 -330 110 34 289 296 126 -116 -135 -72 30 -33 181 16
6797 16 -122 -178 50 -179 138 -140 126 157 176 302 27 -39 -139 109 110 -40 -124 -2 -198 184 -32 -113 -285
6820b85K42p5J98J97k66L3L53l31j3j50p0L01l19K01K00k31o7K5K50k34l0r2K08
6843D5K16m65M82k64J40J08n12P7K34k20K22P5j30OM5l24L85k21K6l25N10K3m28
6866b95K10J16O7l4j69Q5k03K9J77k76M81m82M58k62j31K62K4K8N5k75j37K91
6888A9r1j97L22j82K13j91K0o7K35j27l6J08L08l22m0J33k22K19l1j74j45J70
6910g8M7q0J68L0j74j37J57J40R4j24K8k1N9k47m1K28j53L31k02p1K66j20j47
6933d7M6J83l04K72n6k45NP2R1N7J33k7k37k21L21J02j94N1o9j77L70n6j16Q3
6957C7k20O9K07k02J22o5j41J23K69L9k79k49K95O4j41K32P4j80l10M04o6m9j30
6980i7R3L58l44pK2r8k28Q7K94k01L68k12l10M05q3j66Q8P1m94N57j30j04K2J63
$$ plain form
6820 -285 -43 -118 80 277 11 44 397 66 53 -97 -167 134 -185 16 216 -15 -82 -57 193 -41 -71 -163 45
6843 45 261 -204 278 14 154 262 -250 -173 61 -159 63 138 8 14 59 -265 120 -101 -75 -400 110 133 -295
6866 -295 -85 31 98 64 -105 -20 -223 -194 -17 -293 188 -294 164 -98 -229 33 57 85 140 -135 -272 19
6888 19 -72 -269 53 -129 84 -107 -87 -154 81 -46 -82 26 334 12 -28 105 -117 102 71 -103 -248 -78
6910 -78 -31 -111 57 87 -87 -224 -67 73 167 43 71 50 109 -138 -179 49 -104 227 25 -46 220 100 -47
6933 -47 -1 182 -122 150 94 -151 -146 -74 17 74 207 180 -57 -278 43 145 -49 2 -67 -244 126 70 -46 37
6957 37 -183 -114 93 -109 13 -52 -193 -70 199 238 -41 -290 5 69 -72 160 234 54 -256 148 82 33 -97
6980 -97 -4 354 10 3 25 -73 -301 -214 80 -121 247 35 -275 130 47 -119 -31 40 -454 103 -27 -131 -109 54
7004E4M5j25j17J54j6J85o0L9j03J09k47K62k27L1o0K09k6M1k27J4J32J5J47m77
7028b48J69O4j1M2q5K38j82m2K1M5M7j5o7oN7Q3j94j17K74m6M9J47j51pl7k23
7054a95M32j69k23K80l45K60R8j27j35K33J03k78K33q3K7nj91j56L40j1k85J41
7076e6J35l22L35k45J13M9j0j36J58Q9k87K10l7Pj29q2N4K88j11J4j0j25K8J81
7100A11j61J56Qj46j13K48j45j9j0J57k3j75J68Q5nj90J37k1p8K78n15L86n5k
7124G6j89k33K87O7n4j4j4j71M12j68J43l09J96j3j33M57m55J09J84k87K34l22
7146a97O6K58p7j19j37K24j52L93k18R5J0j67K65k92J83Kl24K84k17J69j70J42
7168B1L7p9Oq3R5O5M2l16J62J90k29J57l2j32o4P3K65k28R9j91O4Q8Q5Q3j88Q0
$$ plain form
7004 54 99 -26 -143 11 -5 180 120 159 56 165 -82 180 -47 -16 -76 133 107 148 -79 -65 67 82 229 -248
7028 -248 -79 -15 -26 16 -69 169 -13 -55 -34 11 58 43 -24 -30 27 110 -84 -201 73 27 76 223 72 65 28 -195
7054 -195 237 68 -155 125 -220 40 138 11 -124 109 212 -66 167 84 111 106 -85 -241 99 88 -197 -56
7076 -56 79 -243 92 -153 -40 9 -1 -137 21 110 -177 33 -4 3 -126 -208 -154 134 23 37 27 -98 -70 111
7100 111 -50 106 114 -32 -145 103 -42 -61 -71 86 63 -112 56 141 136 -54 83 62 -16 262 -253 133 78 76
7124 76 -113 -346 -59 8 -46 -60 -74 -245 167 -1 142 -167 29 16 -117 340 -115 -6 178 -109 125 -197
7146 -197 -131 127 50 -69 -206 18 -134 259 41 136 146 -21 244 -48 135 137 -187 97 -120 49 -121 21
7168 21 58 -21 -15 -98 -3 62 104 -212 -50 140 -89 68 36 -96 -160 -87 178 -50 49 -142 -78 10 95 178 -10 70
7194G0k44M11k28J38k02L84l02J61j45k36K72k44M0j4K41o8p1J73l94L28J12j48
7216C4N7J0q4l5j7lJ25j71P9J45r3pj88K11j2m3K2R9N8l52L67j95n7j32L44k26
7242f4J60J22m12K56l57K70j55p2K24J23k25M5O4n4R8KJ48m00K60j4q7K6L46l28
7266b4L4j93K77N3l08K72k86L50l60K8J17O5q2K97j95j1O8n1M3p7N3k6l0j3J08
7291A09Pj3j69R8j03J1j65L37j22K18k54L9p4J61O5J42k23k13O1j2n7L30j46M9
7315G6l2j9oj40K02J4j69J58N4k82K63O0k76P8J1J56j86J41o7q6J35k98O05n26
7339a34J80L8l01L38j41n6K59l27K69k23J94L0j33k54L06k67K86J2k42L02l32
7360a96k2M38j79M0qm0K00n46L21ok06K75R6j15J28o6j3q9R3m5M5j73K23j64p9
$$ plain form
7194 70 -174 237 9 147 -55 329 27 188 43 -193 79 -165 -125 -139 102 34 -37 136 -258 70 182 34
7216 34 91 101 17 -18 -35 -38 87 -84 -5 140 47 40 -148 63 51 8 30 129 187 -165 202 7 -50 -182 162 -64
7242 -64 96 218 -194 62 -295 -25 -180 -252 -28 95 -130 -85 -21 -75 23 25 173 -227 33 19 -68 -42 304 -24
7266 -24 10 -183 94 147 -161 111 -175 175 -185 -157 -40 25 -57 240 45 34 102 51 94 17 70 44 14 1 109
7291 109 116 103 -66 32 -71 -60 -225 112 -10 208 -46 -7 -81 80 145 287 64 -149 -88 -100 -157 173 27 76
7315 76 44 25 19 -121 81 95 -74 84 138 -144 119 179 -97 -19 -8 148 -38 103 36 -50 85 -213 392 -134
7339 -134 46 84 -217 121 -20 -76 183 -144 125 -98 96 126 -7 -261 45 -222 64 76 -166 136 -196
7360 -196 -218 220 41 81 73 33 233 -313 8 2 -204 71 167 52 180 114 101 12 105 60 105 -68 155 -9 -88
7385h8M7k0J49n0LJ26L6m91K76K55m93K96R6j44j08K06j61J40r1Rp1lK66l05K36
7410A16j89J76P5l44K88L4k28J27r6Q3j23J98l41K38J42l01O5K07N9M7k82R0j66
7433a25J30o3J48k54J60k50L39k61R9J15p9M0J2J47k33po1K36p9k08P9L09l72
7456a78K44j22J30l8J13M5j24o0k06J44J43j22J76J72o15L11L9J27j95J40k86
7477a62K27q8l1r9L27k43K02o3j71J25j74N7P8R2J4plj97K48q3o6P3o8Q6j72o7
7503a65m9P9J1L2K77j05k20L88k58R0j27M4J66j76K12l29K23j77m4J81o9J62L
7526A49j64J88j34J23k54J36r0q1J05j8J87j28N6j10l8q5M25l71l6k3Q5P1j6j33
7550a56K02K23k15j20j00R6R1k92K84M9J5j09J15k45J68K16l6l10J63O9j10m2
$$ plain form
7385 -88 -41 -61 88 38 41 167 203 -288 -12 243 -250 46 142 -2 -110 96 -65 75 -16 -7 -78 -81 185 -120 116
7410 116 -73 103 178 -166 122 156 -72 55 -41 42 -81 117 -224 14 156 -145 -80 127 186 233 -49 41 -125
7433 -125 5 -58 90 -164 -4 -254 85 -176 -77 38 -41 -1 11 158 -75 -82 -143 93 14 -194 -115 194 -178
7456 -178 66 -56 74 36 149 194 70 10 -196 -52 91 -31 145 317 -298 13 52 179 -16 124 -162
7477 -162 65 -23 -54 -153 174 -69 133 70 -101 24 -150 -93 -15 77 91 84 81 -116 132 49 -17 56 -12 74 -98 -165
7503 -165 -214 -135 -124 -92 185 80 -140 248 -10 80 -47 -3 163 -13 199 -130 93 -84 -128 53 -16 146 149
7526 149 -15 173 39 162 -92 44 -46 -127 -22 -40 147 19 75 -35 -73 -158 267 -104 -140 -163 -78 -7 -23 -156
7550 -156 46 269 54 -66 -166 -70 21 -271 13 62 77 -32 83 -162 6 222 186 -124 39 108 -2 -44
7572d4J9Q5k7O4j68P4l9m8J00N7K8jjj72K9J78k22j99M18k05J17K0j92OJ06K11
7598A94l17J66j4j84L99k97M4l6l01M45j22r4N5O0l1j93R3J03J20J47k71M5l6
7621b5K92k00k5J58q8k24J13K00p0j79l7L3J92k83R0J17Kk37M06L9k29j06p0J86
7645E5k1J51j23l6J41R8m87K65L0k14J27o7K19J8j25j2k02K2L8lK76l82j00R3
7669b39L79m3Q5J9l54K37L1j35l23K75P1n6j41K5K97O6k57m6J43J36j38j51q5
7692b04K82r9J89m15K98%j25J24k13J77j15K14N2l32J83JR6k1m6m4L4J57j47J13
7716A59j32J24l17j21L86qn2j16J26K7j1P3J8j39LM3lm7Q0J62l58J95k35RQ9j23
7742a68J88j07l09J51K71k68n8J50J39n5J0L1m2K6L6N2p5n0K09j61j81L48j21
$$ plain form
7572 -44 -25 60 33 97 -71 3 -36 -84 16 73 101 100 99 -73 -44 134 -88 -287 131 -74 43 63 -129 -123 -17 194
7598 194 -123 43 29 -155 244 -53 -9 -45 -346 99 -23 -117 -62 -2 -33 -226 -133 -30 90 237 -34 11 -25
7621 -25 267 67 42 200 112 -112 1 201 131 -48 -85 -52 140 -143 -53 64 66 -171 235 274 45 -61 -131 55
7645 55 34 185 62 26 167 265 -222 43 73 -141 -14 -81 138 156 31 19 -183 -161 -123 -126 150 -232 -332 -239
7669 -239 140 97 182 201 -153 84 115 -20 -343 -68 3 -53 -194 -169 128 194 -63 -109 34 170 32 -119 -204
7692 -204 78 -21 168 -247 51 51 -74 50 -163 14 -101 113 165 -167 16 17 113 92 46 2 36 193 46 159
7716 159 27 151 -166 -287 99 91 39 -77 49 76 65 138 156 17 20 63 60 13 93 255 -103 92 -143 -134 -45 -168
7742 -168 20 -87 -396 -245 26 -242 -300 -150 -11 -66 -56 -25 -67 -41 -5 47 -28 -78 131 -30 -211 137 16
7765A6J61k61k8j3p8L24k68J46J33qM3k08m0K6NJ10q8L04l88p8K8K00KJ40j35
7790D5J6J27l90K02j2J35%o9J00m7P2j55k98J03J29j70M2Q6J20j23R4K88j38k7
7814A30k20K27n4m2j67J69j56R8k70K39L53l32J96l60K12ql29J55J12RN9N3j84
7837a10K32k9N2k86j38J25K26lj59J76M1P8qk33J40O3j53N3j45J99k88M0J12k50
7861b65K68L5p0K5k9J06o5P7OJ22n9m61L53L3k24j20L54Kj34j30N4q5K34m6N2
7886C3q2J71j7j74J8K90l44j07L26%n2q2K28j24M7j12j24J57Q6r3J32l56O6M6
7910f7L6O1j9q1n5O9l34L31l8j19K92j08o1OO0J64J08j73j87P6k99K40J60l3K0
7935D9l31K70j08L1J12%N1l41M67l8l69L70m70K64L5L4J90k22q8M67k1p35M10
$$ plain form
7765 16 177 -84 -112 -125 -203 121 -147 -1 132 124 167 -41 -81 -55 -50 60 -28 276 -112 -190 -162 38 40 180 45
7790 45 61 188 -202 0 -12 123 123 54 154 107 179 24 -274 -171 -42 -212 -170 -84 36 -87 7 295 157 130
7814 130 -90 137 83 41 -126 43 -113 -15 -285 -46 307 -25 171 -189 23 15 -314 -159 -47 -38 21 74 -110
7837 -110 122 93 145 -141 -279 -154 72 69 -90 86 127 205 197 -36 104 167 14 67 -78 121 -167 -127 -15 -265
7861 -265 3 38 -32 -7 -36 70 5 82 88 210 151 -310 43 76 -148 -268 86 88 -46 -176 -122 -207 27 -19 33
7886 33 -49 122 105 -69 -51 239 -105 -212 114 114 62 -20 208 84 131 19 -105 52 138 45 177 -179 -113 -67
7910 -67 -31 30 11 -70 -125 -56 -390 -59 -97 -216 76 -32 -93 -87 -27 137 245 72 -115 -39 -338 -98 62 29 49
7935 49 -282 -12 -120 -89 23 23 74 -267 200 162 -207 163 -307 -43 -8 26 216 -6 -94 373 352 -383 27
7958B7k6l7R2j20Q0l9K9l5J05J97k51P0r1qm1J6J88m14J23K82j77N8j51L6J28
7983D1Q1O9j05k10J92p1J1M2K37m04k21K75J00R7j09l6j84K19k5j72K62j82J63
8006G0j61M9P0r3M1p0L6J80j73jL07m20N10J0m65J91Jj29J22j16m3K24k66J58
8030C2k1j4J08R6j17l5l3P5j21o6J03p3m2j05J22K42j94N6k12K18J72j35j22N6
8054a0j78K02K54k40J53j69L3k01OR8J21n1p5N8N3q4j0j44J52N0O9k51K24k22
8078a62K98l37K21K69k89m5r9J66J84j91k07l7L34j7j08m4J00J4j11p5j13N98
8100C49j88k62K8J10j20N0K9o3n2j35K50L5j68K98k75M85n11J6M5K7j20J21K19
8123A68r4O7j12j49J85o8j43P0L10j83q0q8rK47j81K13j35r9j9J64K14k30M9j2
$$ plain form
7958 27 1 -36 56 -64 16 -23 6 -29 76 273 22 92 1 -7 -48 -32 156 -258 -135 147 -30 28 -123 -87 41
7983 41 122 191 86 -124 68 -3 8 50 287 -117 -338 -63 37 134 25 -11 -195 24 -1 -173 89 -93 70
8006 70 -91 -42 28 -65 -24 -94 -58 122 -51 -52 255 -165 345 355 -110 81 82 -47 75 -41 -84 140 -126 32
8030 32 11 -3 105 201 84 49 16 91 -30 -96 7 -66 -108 -213 -91 151 -43 13 -199 19 191 56 -66 -10
8054 -10 -188 14 268 28 181 12 45 -156 -150 -52 69 18 -57 1 54 -30 -40 -184 -32 18 87 -164 60 -162
8078 -162 136 -201 20 289 0 -45 -144 22 206 15 -192 -229 105 88 -20 -64 36 50 -61 -136 -249 349
8100 349 161 -101 -73 37 -83 -33 -4 -67 -119 -254 -4 31 -137 161 -114 371 -140 -124 -79 -52 -172 -51 168
8123 168 74 141 29 -120 65 -3 -146 -76 234 51 -29 -117 -126 121 -60 153 18 -81 -100 64 278 48 97 85
8147H5k03J73j65R7n1M7P6r3P1p3K58k73j7r5J1J6Q2j57j1L4p9J85J64r9k3n5
8173i5L3J63l8n8P1L9o4J29k43N9j01m2K94j01l2N4K6l0
$$ plain form
8147 85 -118 55 -110 -13 -64 -17 59 -34 37 -36 222 -51 -68 -163 -152 -136 -54 -211 -222 -188 -267 -82 82 -17 -40 -95
8173 -95 -62 101 63 5 76 115 51 180 -63 -4 -105 -147 147 46 14 68 94 64
8191F4
$$ Imaginary data points
##PAGE= N=2
##DATA TABLE= (X++(I..I)), XYDATA
0@%%%%%%%%%%%%Qj6J6j6J6k4L2l2M0n2O0p1Q3r7J16j34J52j74K01k32K64k98L38
35A80l83M31m85N45o08O79p56Q39r34J034j140J260j392J537j694J864k055K265
53A187k496K754l042L367l737M161m651N229n923O770p834R217j1098J3823j8171
68a0444K6528p0150K11702r5299k28399M01692J20966m45360p293N11619j26287
79B89275m76167K22991M18744l15067k98129L50749J34072m22051l6868L31830
89A99379j66794l46047K53304K56134l44999j74504L93454P8130l79588K8298
99b03233L26316j45369k51728K51428J82945k99075n1434L71052j3413l40850
109a73361J26554L16623k00927k62531K53728J92341k68753r2575K66125m013
$$ plain form
0 0 0 0 0 0 0 0 0 0 0 0 0 0 8 -8 8 -8 8 -16 16 -16 24 -28 32 -39 44 -53 63 -71 81 -93 108 -124 140 -158 180
35 180 -203 228 -257 288 -320 359 -397 442 -492 542 -598 662 -730 807 -887 977 -1078 1187
53 1187 -1309 1445 -1597 1770 -1967 2194 -2457 2772 -3151 3619 -4215 5002 -6096 7727 -10444
68 -10444 16084 -54066 157636 62337 -166062 235630 356596 -88764 -96057 415562 289275
79 289275 -186892 36099 454843 139776 -158353 192396 326468 -95583 -132451 199379
89 199379 32585 -313462 -60158 195976 -149023 -323527 69927 148057 -231531 -203233
99 -203233 123083 -22286 -274014 -22586 160359 -138716 -190150 180902 167489 -173361
109 -173361 -46807 269816 68889 -193642 60086 252427 -16326 -108901 157224 153211
119A53211k33384R1586J61770k03741j35750K32482M2803k83936J3013K74108
129A12162q4027k45704J42291J95268j83665j30013K07375N8765j99292L8280
139h8560K08810q4547j53323J61901J31960j79942p3878J87587M790j84668N4709
150a5161J51240j20899j19388J58836O7238j92818k7537J88982l3617j85034P5767
161e2391J58053j06690j11408J34684P3049j31070j2600J29391m0230j13079Q6957
172A4666Q3883j23918n0660J44298R924j54674K5888J42204o9384j30439Q9105
183a9107R2641j08809n5870J13791J5057j07171K7777R5802o2341p4656Q8889
194F003M7247j02099j3963J07746j4723r5912N2225Q5501p5511n8749R6907L2319
$$ plain form
119 153211 -80173 11413 173183 -30558 -166308 66174 108977 -174959 -161946 112162
129 112162 28135 -217569 -75278 119990 -63675 -193688 13687 72452 -126840 -88560
139 -88560 120250 35703 -117620 44281 176241 -3701 -77579 110008 114798 -69870 -15161
150 -15161 136079 15180 -104208 54628 121866 -70952 -98489 90493 56876 -128158 -52391
161 -52391 105662 -1028 -112436 22248 95297 -35773 -48373 81018 40788 -72291 14666
172 14666 98549 -25369 -76029 68269 78193 -76481 -50593 91611 22227 -108212 -19107
183 -19107 73534 -35275 -91145 22646 37703 -69468 -41691 54111 -8230 -82886 6003
194 6003 53250 -48849 -62812 44934 30211 -65701 -13476 72025 -3486 -62235 34672 66991
206F6991j03671q49J06902k2712r4917M6344P7754o1606n3431O5346J7950p1963
218b7862O920O1514m1198n4694O3285L6998q1471j8719R1008M31q8670K0863Q2543
231E0948l4037o1979N1651M4338n5621j7442O0116o232n8204K4231M5989m5397
243a639l6782N2275J5371o2664k89N8256k2060n4409L7277M4389m8984k8958O1402
256A3185J6583n8924L209N9487j3658m8359K6217L4719l4702j8709L7519j301
268A5266l9672J6822L4371l3653k9839M4130J9285n1695q575N4468p57m8514J4524
281a3839M2924k0283k8534K9047J7312l1138k339L2515j0642k9263K1145K3286
293C0191k9803j5171L3374M171l6832N301L4162j7576l0654K4737K3153l3080
$$ plain form
206 66991 -36680 -37529 69373 46661 -48256 -1912 75842 14236 -39195 26151 44101 -27862
218 -27862 -20942 40572 -626 -55320 7965 44963 -36508 -55227 35781 36212 -52458 -31595 50948
231 50948 16911 -45068 6583 50921 -4700 -22142 37974 31742 -26462 -2231 43758 -1639
243 -1639 -38421 13854 29225 -33439 -33728 24528 2468 -51941 -14664 29725 -19259 -48217 13185
256 13185 29768 -29156 -25947 33540 19882 -28477 -2260 32459 -2243 -20952 16567 15266
268 15266 -24406 -7584 26787 -6866 -36705 7425 26710 -24985 -33560 20908 20151 -28363 -13839
281 -13839 29085 8802 -19732 9315 26627 -4511 -6850 25665 15023 -14240 6905 30191
293 30191 388 -14783 18591 22762 -14070 -8769 25393 7817 -22837 1900 25053 -8027
305h027j6070L4296N721l6245N38K9665j0680k4254J5372J3797k0038j862K3428
318E641p172k1468J9846K2757k4461j5120L1704J3709l0357m586L0153j231k6330
331f915O958J7493j5767j3720J5503K669k1010J724J8072r644j7112J4718J2179
344E148j6927m645K1284J171j8802R437K2369j0392j5975J8108J4792j8461j0012
357b905J8864L633j7739l50J2267p143r997Q680J274j4419J356J3514r378j5626
371a7969J2415J3932j5438j0461J6712P135j6126k483J4791j864j1579N751R095
384C911p958l441J1365J520j0431L945J0188o697p655R716M975j1724j203J2839
398I350l005j3715M929J1365r348j1591Q716O899j0464m341R410J293o631L380
$$ plain form
305 -8027 -24097 10199 15920 -20325 -19787 9878 -802 -25056 -9684 4113 -15925 -17787 5641
318 5641 -1531 -22999 -3153 19604 -4857 -19977 11727 25436 -4921 -9507 20646 19415 -6915
331 -6915 43 17536 1769 -11951 3552 6221 -14789 -13065 5007 -4637 -21749 -7031 5148
344 5148 -11779 -16424 4860 6031 -12771 -3334 19035 8643 -7332 10776 25568 7107 -2905
357 -2905 15959 19592 1853 1503 13770 6627 -3370 5310 6584 -7835 -6479 7035 -2343 -17969
371 -17969 -5554 8378 -7060 -17521 -809 6326 -9800 -12283 2508 644 -10935 -5184 3911
384 3911 -4047 -7488 3877 5397 -5034 -1089 9099 2402 -5253 4463 9438 -2286 -3489 9350
398 9350 6345 -7370 -2441 8924 -424 -12015 -3299 3600 -6864 -11205 -1795 -502 -7133 -3753
412c753N640m495q30Q876L72p798N372J1223n561q817Q595Q070j0106p636Q612
427G764J988j0996k323O438k962o586K981K196o148o31N886j867o037M305O895
442I03m434l253Q814L183p013M38Q731j634q343L573P352n095n958N470L410n761
458C83j427L374j684l850J833J183n118k39N779j659o918L002O670m273o611M808
474d747N229m522l077O211K582l451J513M679o36p88L245J505k495J370L717j995
490H340l508K719K193n281l918L357k05o751j485L470k118m826J760K878k904
505f279k276K885J073j534Q57K336j8O83L266J308k042J455L997r77m707J477
521A504M167k211m667K297K816k488k414J856m55k017Q45K44k608m33K788j64
$$ plain form
412 -3753 1887 -2608 -3438 5438 5810 -1988 3384 14607 9046 229 8824 16894 6788 -848 7764
427 7764 9752 -1244 -3567 2871 -91 -6677 -3696 -1500 -7648 -8279 -2393 -4260 -10297 -5992 903
442 903 -3531 -6784 2030 5213 -1800 -1362 7369 5735 -2608 965 8317 3222 -2736 2734 6144 383
458 383 -1044 2330 646 -3204 -1371 -188 -5306 -5545 234 -1425 -8343 -5341 1329 -2944 -9555 -4747
474 -4747 482 -4040 -7117 -906 1676 -1775 -262 4417 3781 2993 6238 7743 5248 6618 10335 8340
490 8340 4832 7551 9744 4463 545 3902 3697 -3054 -4539 -1069 -3187 -8013 -6253 -3375 -6279
505 -6279 -8555 -5670 -4597 -6131 -5274 -2938 -2956 -2273 993 2301 259 1714 5711 4734 27 1504
521 1504 5671 3460 -1207 1090 3906 1418 -996 860 405 -1612 -767 -523 -3131 -3564 -776 -940
537i40k351O55K558j428k013J794K850k957j492L820K143k930p8L697L25k033
553A620R99J751j378l17J420o9j407j8L77j320j611M24l79l105o64K006k55l304
571e230Q32L224j1k174R72J817j12P0R60l07N59J582P61j659K91J837l43k672
589C97o00J666j308k493O33J115j755j444K152P4k136O15J714n83o94J422O44
606e81p06J184J680n34p33J401J235q18r72J305J199j290m05J582p3j728l84J416
624B778j162j412J76L7j025K35o2j054k71O26k62j848k6J309O8j256J35K027L67
643f20p76R31J462j59l40R24J36r33Q95Q42q18m29P84l58j425k93q1o46r96l3
663a933O59n57o84Q76P40o39l06J160P9j83M62J013n74N68O71R3jK51M35j029
$$ plain form
537 -940 -3291 -2636 -78 -1506 -3519 -1725 1125 -1832 -3324 496 2639 -291 -369 3328 3653 1620
553 1620 2619 4370 2992 2675 4095 4026 2619 2601 2978 1658 47 471 92 -3013 -3677 -1671 -1926 -5230
571 -5230 -4398 -1174 -1185 -3359 -2387 -570 -682 -612 348 41 600 2182 2943 1284 1575 3412 3069 397
589 397 -203 1463 155 -2338 -1705 -590 -2345 -3789 -1637 -1563 -3699 -3084 -1370 -1953 -2647 -1225 -581
606 -581 -1287 -103 1577 1043 310 1711 2946 2128 1156 2461 3660 2370 1965 3547 3474 1746 1362 2778
624 2778 1616 204 380 417 -608 -373 -435 -1489 -1760 -1134 -1396 -3244 -3270 -1961 -1893 -3149 -3014 -987 -620
643 -620 -1396 -465 997 838 498 1422 1558 625 1520 2362 1544 1115 1899 1541 116 -177 -258 -904 -1900 -1933
663 -1933 -1274 -1831 -2515 -1639 -899 -1538 -1844 -684 -605 -788 -326 687 113 681 1352 1445 1444 1695 2130 1101
683A101p87N74M10j029l22L55O68p54m88N66K49m42l75K39J62K35M13m28l78P77
703G46K24r77m04O32l81m13j16L85r7j9l3J27j82k43K8q0m26J8Q03l51n78R29
725d08L56k26k83N66j88n75L66N70k05L42K46O57j47n8O28j47j13o41J24l25K19
746G58Jk72p55L13J23j462j68J25O0o81N6P36N52O9K64J81P60K6J74K13J26M22
768A621L23N9k60Q7J23n05p97j63j12j084l45P9j65k54l95J64j81k66q0J96kM13
790a544j37O96J13L93N47K02K31O80L39n02M3N31q2l41M55J90J11p27L6P2q39
811D67n51k39k43q5p9l50l45L03M98j28j042M5O41N17k62L32L38N08K94M33J66
832A218M85j96J68j74j18J14k50j09m52J54m02n51k84k78m93l99j1m65j73K38
$$ plain form
683 1101 314 888 1298 269 -53 302 970 216 -272 294 543 101 -274 -35 127 362 775 347 -31 746
703 746 970 -7 -411 221 -160 -573 -689 -304 -401 -420 -453 -326 -508 -751 -723 -803 -1229 -1211 -408 -759 -1337 -408
725 -408 -52 -278 -561 5 -183 -758 -392 178 -27 315 561 1218 1071 1013 1641 1494 1381 740 864 539 758
746 758 759 487 -268 45 168 -1294 -1462 -1337 -1277 -1958 -1902 -1166 -614 -545 -281 -100 660 686 860 1073 1199 1621
768 1621 1944 2003 1743 1830 1953 1448 651 488 376 -708 -1053 -974 -1139 -1393 -1788 -1624 -1805 -2071 -2151 -1955 -1957 -1544
790 -1544 -1681 -985 -872 -479 68 270 501 1181 1520 1018 1061 1592 1510 1169 1624 1814 1925 1198 1234 1306 467
811 467 -84 -323 -566 -651 -730 -1080 -1425 -1122 -624 -752 -1794 -1749 -1108 -591 -853 -521 -183 325 619 1052 1218
832 1218 1703 1507 1675 1501 1383 1497 1247 1138 686 840 438 -113 -397 -675 -1168 -1567 -1578 -2043 -2216 -1978
852a978K55K60K9K58N74k7K36K97R9Q06J05J09N4O77J89k68p94J6K19k11o51j54
874A00J35Q1l99l19j56K56j27p34J5j8M13j4J29j92O81L24k83J73L12J71Q3j43
896D88K28J00J54L35K5k90K02k61l21n53j82m18L91j96l58l71nK3j30n34J92J20
918a361K33K40k29N04N06L87j31K47O84k40J5r5j4M95K15l23k67k01J15m75l34
939b9j11M8p05k2l20K80o4J47J72j12J45L6%p0N54L36N1J24K48K98j87j45J26
962H00n2k45J2N3P4o48M15M6k98j93n2j29k11j0l29pK60j2l76J62N26n4j21j1
986d00j66N84K65m68O2O08N03n77J43O0K13n4p48L8Q4K1k73k47L65n2k99P3k64
1009e29m6k01r8K92K43K93l0L05J49K36k61J70k04k1M74n09J21K56N3k11j44K53
$$ plain form
852 -1978 -1723 -1463 -1434 -1176 -602 -629 -393 -96 3 809 914 1023 1077 1754 1943 1675 881 897 1116 905 254 100
874 100 235 316 -83 -402 -558 -302 -429 -1163 -1148 -1166 -753 -767 -638 -830 -149 175 -108 65 377 548 631 488
896 488 716 816 970 1305 1330 1040 1242 981 660 107 -75 -493 -102 -298 -656 -1027 -1032 -1009 -1139 -1673 -1481 -1361
918 -1361 -1128 -888 -1117 -613 -107 280 149 396 1080 840 855 760 746 1241 1456 1133 866 665 780 305 -29
939 -29 -140 -92 -797 -819 -1139 -859 -923 -776 -604 -716 -571 -535 -535 -605 -51 285 336 460 708 1006 819 674 800
962 800 748 503 515 568 642 -6 409 455 157 -36 -88 -217 -428 -438 -767 -774 -514 -526 -902 -740 -214 -268 -389 -400
986 -400 -566 18 283 -185 -123 485 988 411 554 614 827 773 25 63 147 168 -105 -352 13 -39 -338 -265 -529
1009 -529 -575 -776 -874 -582 -339 -46 -76 229 378 614 353 523 319 298 772 263 384 640 693 482 338 591
1031E91n50k73k32K63j46k17j01K03L13l96N0L08j16N9j23l73N85K49q3k01L28
1052A38M81l42j25J19j13j23J53j61N7J38k05O0L1l32N7j66q7K73k14j10j23P00
1074A06r0k8l49M15p1K29ml04L48O6K39l85M16j99J38l72K45O3o26L7oJ76qm35
1098c99J50K19k13m12K85PJ46k51q0j39M47J32n7J90K60o6m3J52j63j23K49j24
1120A67Q4J40k81o5M08k21l06l90L29q0lj57N2L5J49k31K45J76k22l6J54l45M84
1143H6N2KK19j19K08k79o8Q9k50L58j88k03Q4K70j17p3l2k5m03r2K94r4k6j64
1167d71J55M19Q2m03J22k54J18K10Q4k29M52J27k94L16O2m05M0n2M54l56l73M8
1189a48J4j04J55%k25Q5J31k48l60M92k8K55o3k73N75j13k15M41K5l12J20J15
$$ plain form
1031 591 41 -232 -464 -201 -347 -564 -665 -462 -149 -545 -495 -187 -303 -244 -367 -740 -155 94 11 -190 138
1052 138 619 277 152 271 158 35 188 27 84 222 17 77 108 -224 -167 -333 -420 -147 -361 -471 -594 106
1074 106 16 -12 -361 54 -17 212 208 -96 252 318 557 172 588 389 527 155 400 463 -163 -126 -132 44 36 -399
1098 -399 -249 -30 -243 -655 -370 -363 -217 -468 -548 -687 -240 -108 -165 25 285 219 176 328 165 42 291 167
1120 167 251 391 110 45 453 232 -74 -464 -135 -215 -218 -375 -323 -288 -139 -370 -125 51 -171 -207 -53 -398 86
1143 86 138 140 359 240 448 169 101 190 -60 298 110 -93 -9 261 144 71 39 14 -389 -481 -187 -281 -307 -471
1167 -471 -316 103 185 -218 -96 -350 -232 -22 62 -167 285 412 118 434 496 91 131 79 533 177 -196 -148
1189 -148 -134 -238 -83 -83 -308 -223 -92 -340 -700 -208 -236 19 -44 -317 258 145 -70 371 396 84 204 319
1211C19J30N8j46k98Q4K72j94L9k77l5k67k19L4K42k1N2J73j08k65J64q7N2RJ96
1235i3R0K9R3J63J61jj61j7k15M04j26M3j69N8J29j16r3m3k74k62M13k07k03j98
1259e95L7K01J91k43L69l97J21n4L7P4n2M19J25mJ80J45J95r5j46k42M62n07m3
1282A78K57j13l45p1J76l70J43l30J41j97R0L39j18j32o1N71j45j69J30P2M4j33
1304d3K62k1L44o8j96r6R7k79l2r5J58J72k22j61J69J38k09m9j90J62k40PM5J88
1328a59k01J55L69j82J34O7k02oj33M01k13P1l5J74J41q0p1N5K4k49p8L7J66o43
1352d58L47r0J15Nj19o7J82k36j3K47q7j21K41l86O45J93j80O3q3l21J47K5M7
1375I6r3RJ64j90J28k19J20k7m11jO9Q6O4J46J7J14j13j59K40p1J05o0J67m7j9
$$ plain form
1211 319 449 507 361 63 147 419 225 264 -13 -48 -315 -534 -500 -258 -279 -227 -54 -162 -427 -263 -350 -298 -289 -93
1235 -93 -3 26 119 282 443 442 281 264 49 453 327 370 201 259 388 272 179 136 -138 -400 13 -194 -397 -595
1259 -595 -558 -357 -166 -409 -40 -437 -316 -370 -333 -259 -311 108 233 229 409 554 749 654 508 266 728 221 178
1282 178 435 322 -23 -94 82 -288 -145 -475 -334 -531 -441 -102 -220 -352 -413 158 13 -156 -26 46 90 -43
1304 -43 219 198 542 474 278 182 279 0 -32 -127 31 203 -19 -180 -11 127 -82 -131 -321 -159 -399 -392 -347 -159
1328 -159 -360 -205 164 -18 116 183 -19 -25 -158 243 30 101 66 240 381 301 230 285 309 60 -18 19 185 -458
1352 -458 -111 -201 -86 -81 -200 -267 -85 -321 -334 -87 -174 -295 -54 -440 205 398 218 281 198 -123 24 49 96
1375 96 3 12 176 -14 114 -105 15 -12 -423 -424 -355 -269 -205 -59 -42 72 -41 -200 40 -31 74 14 181 134 115
1400A15J28J67j48n9K14j37k0j89oJ00k31J95LJ08j82j18k44K53l7j54o1n2K10
1423a45K95j21R0l41J74J44j32j11J59J38k0o8k34M63P9l96J83P0l64j72J01j3
1445b21O7L21Nl91J27Pl2j23k7J78r8K64j20J80j99J14J36K94l89p9Jn3J25p7
1469A0P2k2J17l6q9m0o6q6r9n2K93K10k92j69J14L96j30k10P8J41M0k05J71q6
1493F0K49l31lJ84jk10J06j86L19l93J73r4L19n6k15L9N2j99J38k73l9K55k3K37
1517A08j09K75K8l64j42K76l6R9j02O4N7m5j78M10k32J42L01l90k61J80k56j27
1539c02L04n5J83j93O8k22R8R9l32K35O8k07L35R3k62J66m10K76L31k09O6j16
1561A4K94k04L6l40L48j5l5J39j43r0j79j52mL55R4l18J22P4n4N6k7J50k96L02
$$ plain form
1400 115 243 410 262 203 417 280 260 71 65 165 -66 129 132 240 58 -60 -304 -51 -88 -242 -303 -355 -145
1423 -145 150 29 119 -222 -48 96 -36 -147 12 150 130 62 -172 291 370 -26 157 227 -137 -309 -208 -221
1445 -221 -154 167 172 -219 -92 -85 -117 -240 -267 -89 -187 77 -43 137 -62 52 188 482 93 14 15 -38 87 10
1469 10 82 60 177 141 52 12 -54 -140 -239 -291 2 212 -80 -249 -135 261 131 -79 -1 140 180 -25 146 60
1493 60 309 -22 -25 159 158 -52 54 -132 187 -206 -33 -127 192 136 -79 -40 12 -187 -49 -322 -361 -106 -129 108
1517 108 -1 274 302 -62 -204 72 36 135 33 97 154 109 -69 341 109 251 552 162 -99 81 -175 -302
1539 -302 2 -53 130 -63 5 -217 -119 -20 -352 -117 -49 -256 79 172 -90 76 -334 -58 273 64 130 14
1561 14 308 104 140 -200 148 133 98 237 94 4 -175 -327 -331 24 118 -200 -78 -4 -58 -2 -29 121 -175 127
1585A27j2k70J94J44l67M42j28K40j30j11j79m6j36J53r8M16l39R2N1j98O7j26
1607b14J14M6K2L5k28K56R1j04J16k08M7K59j67mj42qm7K22Q0j2j19k00K47Q5
1631A67J9j42j49J43J54k64j23L96l97R6j56O5J44J8J83O9k57K17j17r5ML3l6
1654b8l80N82j57N0j52QOJ28k44p7L65k75M0Q8p4N7J19J79l13K81j29j84J69k67
1678b08O1r7K35K12r9j42J17P9J37l39o4K16j95PJ29K13q2m3k32J1j97J90K6j42
1702b07J37j15J82J34r1J94k65M0k81L81p0J07j11J0N6J9K51k75Qj29k31J96j20
1725a80J96J66j32L4j24K1k64K87k56J73k16J99R1J88n5p1j0K01J24m95K12n5
1747C4j41L14k39K98p5R8m06L67m2m54J67R4r7M6J3J7Ok42K18J1L04l83M3M5N9
$$ plain form
1585 127 115 -155 39 183 -184 258 130 370 240 129 -50 -96 -232 -79 -177 239 -100 -8 43 -155 -88 -214
1607 -214 -100 -54 -32 3 -225 31 122 18 134 -74 -27 232 65 61 -81 -89 -136 86 166 154 35 -165 82 167
1631 167 186 44 -105 38 192 -72 -195 201 -196 -100 -256 -191 -47 -29 154 223 -34 183 66 -29 -25 8 -28
1654 -28 -408 174 17 67 -85 -77 -71 57 -187 -264 101 -174 -134 -46 -120 -63 56 235 -78 203 74 -110 59 -208
1678 -208 -147 -244 -9 203 104 -38 79 158 295 -44 -108 108 -87 -80 49 262 180 137 -95 -84 -281 -91 -65 -207
1702 -207 -70 -185 -3 131 40 234 -31 9 -272 109 39 146 35 45 101 120 371 96 104 -25 -256 -60 -180
1725 -180 16 182 50 84 -40 -19 -283 4 -252 -79 -295 -96 -5 183 128 57 47 248 372 -123 89 34
1747 34 -107 207 -32 266 191 289 -117 250 208 -246 -79 15 -82 -36 -23 -6 0 -242 -24 -13 291 -92 -49 -4 55
1772E5j93j06L90m2l1k14K9L28k00j90Q5J64K62m57K01j67J97J08n3P6K6l72l
1795a07oJ70j97Q0k15K76O3j40j51J41l2J52m33M37L29l01N0J29m31M46l34P9
1817EO9l64N44j18J86l07J42L8j67J10k15J99p2kN9j37K45j99n3J01p2L08l96
1840i6K04j67J34M8r8m5l8j29J01j09J87M0j57J06j87J87j71J32j12P0J23J03
1862A26k58K96o7j4o7N7j09L83j32l2j52J61j11j01J77rK9L6k97l2R2p1J72Q1
1886A58k69J50k8j46K15j61j6K50J10j63p1N6m5R8o8r6R5j06J3M9j9p8J36l53
1910b89K27l3K43k79L17o0l14O7j00L65l82K10K9M3k08J99p2n0L9J69J16k72j73
1933b08K23j84J65j1k8QJ11j53Q6J05j62j78QM48k59k9N8N8O5j07j3k09J14P5
$$ plain form
1772 55 -138 -244 146 104 73 -141 -112 216 16 -174 -89 75 337 -120 81 -86 111 219 166 242 268 -104 -107
1795 -107 -113 57 -140 -60 -275 1 64 -76 -227 -86 -118 34 -399 38 367 66 116 245 -186 260 -74 5
1817 5 74 -290 254 136 322 15 157 195 28 138 -77 122 50 48 107 -30 215 16 -37 64 -8 300 -96
1840 -96 108 -59 75 123 25 -20 -58 -187 -86 -195 -8 32 -125 -19 -206 -19 -190 -58 -170 -100 23 126
1862 126 -132 164 97 83 16 73 -36 347 215 183 31 192 81 -20 157 148 177 213 -84 -116 -24 -95 77 158
1886 158 -111 39 11 -135 80 -81 -97 153 263 100 29 85 40 138 70 -26 69 -37 -24 25 6 -72 64 -289
1910 -289 -62 -95 148 -131 186 126 -188 -121 -221 144 -238 -28 1 44 -164 35 -37 -87 -48 121 237 -35 -208
1933 -208 15 -169 -4 -15 -43 -35 76 -77 9 114 -48 -226 -218 230 -29 -58 0 58 123 16 3 -206 -92 -17
1957a7R0r5k3J91L7R0l06m6K28n7j78O1J12J14mj82M3O6j58K6L15k97P2m70M07
1982A9m1j39J22O3p2j75K27J6Nj45K3J10J4L2k5p2N8P3O7K25k90j80m7L56k04
2007B0J32p4j93J79j14j8r5J16J02j37K14j72P3J53n18L93m4J22m59K73j7N7q6
2030i3r2L10j33J52o6j24l0J7R3k40J95r9j1N1J40N2L9l99J40P1l36K70j21L89
2054A75j53kj3j1j16k5K49p4n1L52l69j4L54m5k15q3P1j71L0jJ19L45l58L0k2
2079BK69m61L09l70L81k94K99k54R6J37o3rQ5k86q1j55N07P3p2j14q6P6kNk71
2104b79K05PJ73j58l7KJ83j2k18K07R3k29J31J0k16Q4J64O3q5K5Kj31l8Q1J18
2129A45j24Q5P2P2k81J15J4o2k45K07M8k63K42Q3j83M8j4K83r7k34m0J64K17k97
$$ plain form
1957 -17 73 -22 -45 146 183 273 -33 -79 149 92 -86 -25 87 201 197 15 58 124 -34 -8 307 10 82 -388 19
1982 19 -22 -161 -39 24 -48 -223 4 20 25 -120 -97 13 27 59 34 -38 20 93 160 385 95 -85 -132 224 20
2007 20 152 78 -115 64 -50 -68 -163 -47 55 -82 132 -40 33 186 -332 61 17 139 -320 -47 -64 -7 -93
2030 -93 -185 125 -8 144 78 -46 -76 -59 34 -206 -11 -110 -121 -70 70 122 161 -238 -98 -27 -363 -93 -214 175
2054 175 22 20 7 -4 -120 -145 104 30 -21 331 -38 -52 302 257 42 -41 30 -141 -111 -112 7 352 -6 24 2
2079 2 271 -190 119 -251 130 -164 135 -119 -23 114 51 42 127 -159 -240 -395 112 185 113 -1 -87 -11 -13 -8 -279
2104 -279 -74 -67 106 -52 -89 -87 96 84 -134 73 166 -63 68 78 -138 -54 110 173 88 113 115 -16 -54 27 145
2129 145 21 106 178 250 -31 84 98 36 -209 -2 46 -217 25 108 -75 -27 -41 242 145 -89 -129 35 252 -45
2153d5j12K28l4L7j30j9l8J76l1j47P9r3J91j73J25j38L3J98j12L6m6k08J99J85
2177A61k15O1J65j17j67K43M9q6q3K9j69J93j70O7l00j5M13l38J64J77J00k94
2199a32J21j39L7J54j84M6Q3o7P6M6k08K35j4kj03J4K69j99R1k7j86p7j9K76q2
2224IL36n65K11K20l54J53K10m72J56r4K85k45J63q4o5K74j99j22J47JR7Oj52
2247h4j41K51L23m57J97j33J26J09r6o4P4o6mk13M20k72Q3Q0k75J17N8O2k25k5
2271a55J80j66L42j78K7J17n9j61J92k97R5K80j05J54k89J13L35k59K3q4j09L24
2293C20k35Q0k82j26K82j36K05l70K13J05p9O9K60n23J07M9J71o8R5k62K83Rj5
2316A52l13J78j70k2K48K8Rm7l1o0N0K24k39J68j71j3K1K59l67l1j85L38k30O3
$$ plain form
2153 -45 -157 71 37 74 -56 -75 -113 63 32 -115 -36 -129 62 -111 14 -124 -91 107 -5 31 -15 -223 -24 161
2177 161 -54 7 172 55 -112 131 180 94 11 40 -129 64 -106 -39 -339 -354 59 -279 -115 62 162 -132
2199 -132 -11 -150 -113 41 -143 -97 -14 -81 -5 41 -167 68 54 52 -51 -37 232 33 124 97 -89 -166 -185 91 9
2224 9 345 -220 -9 211 -143 10 220 -252 -96 -190 95 -150 13 -71 -136 138 -61 -183 -36 -35 62 68 -84
2247 -84 -225 26 349 -108 89 -44 82 191 95 31 105 39 35 -178 242 -30 53 133 -142 -25 33 95 -130 -155
2271 -155 25 -141 201 23 50 167 108 -53 139 -158 -63 217 112 266 -23 90 425 166 189 105 -4 320
2293 320 85 165 -117 -243 39 -97 108 -262 -49 56 -23 46 306 -217 -110 -61 110 42 137 -125 158 167 152
2316 152 -161 17 -153 -175 73 101 110 63 32 -28 22 246 7 175 4 -9 12 271 -96 -127 -312 26 -204 -141
2340a41k8J42Q4J2J84l58L02j82k6K5Kl7o8L55k13r9P0nJ59j04l4j67K59j78L7
2365iP9j60K6L9j91J95J6K23j80j92J07J93l37L29j30j6j75J68J15j53K71l85
2387a67N8J18J73l9j09k47M75k54j70L45j10k46K14k23N3K26j69J11J05j71j87
2408b14L18k94M38k88J87p0j54j21R1J80K3k56J96P4J18j63K2o4O6k16J4%o7R9
2432h1P0J05L6ok51L84l16j40J82O8j89J04Q9j75J95o8q4r5L46k29J08j57L8P5
2456Ik49K19J02K04l02q6mN7L24r9k12nO3l1p1j10K59M8j36j79L52l00L49l06
2480a04o4M03k1l09J07N2k37N4j1L41l58K85k86L36k92n0K43l01KK57J58k98p9
2503a72J85mj06K70k11J40j03q2K09j00Nl0K28k75l4j1p1N45l76M5j80O4K05j79
$$ plain form
2340 -141 -169 -27 57 69 253 -105 197 15 -11 14 16 -21 -89 266 53 -46 24 19 178 74 40 -127 132 -46 -9
2365 -9 70 -90 -64 -25 -216 -21 -5 218 38 -154 -47 146 -191 138 8 -8 -183 -15 100 -53 218 -167
2387 -167 -109 9 182 143 34 -213 262 8 -162 183 73 -173 41 -182 -129 97 -72 39 144 -27 -214
2408 -214 104 -190 248 -40 147 77 -77 -198 -107 73 96 -160 36 110 228 65 87 23 89 -127 -113 -113 -180 -81
2432 -81 -11 94 130 124 -127 257 -59 -199 -17 51 -138 -34 55 -120 75 7 -77 -172 174 -55 53 -104 -66 9
2456 9 -240 -21 81 285 -17 -103 -107 -50 274 175 -37 -42 21 -10 -81 -191 68 116 -20 -199 153 -147 202 -104
2480 -104 -168 235 214 -95 12 64 -173 -119 -130 211 -147 138 -148 188 -104 -154 89 -212 -210 47 205 -93 -172
2503 -172 13 9 -97 173 -38 102 -1 -83 126 26 31 1 229 -46 -80 -91 -162 383 7 52 -128 -64 141 -38
2527c8K97k44k52K90j27k6J04j8K44k48nk88L9K62O4j3P2r4j38M0L6qR1l30J71
2552a19J11J43p5J53k57J2J28k64L57j00K3j44J18k06L71l73J64j69P4Q8J19m49
2574b95j3K43L09l60j4o3J41k3j79J68O7L01k10J73l65J22J69k6q6j34O5L9j8
2597A1R9j17Q3J06l06K64K06l16K30l77J35K65k85P0r2r0o6L30l34L99J9m71K59
2620B2n7m5Q1J25l00L36j83q6K45k87oN8J42k5j20r8M0J87k56R9J33R2k02j35
2644b40j5M44P6l32K79j37R9k34J99m7l45P1J46J03j4Nn9K83l89K68o8m7k77K09
2668b2J35j45n3O8j8j10J92j06k05R2J56J51l41K21j58K2K13k27J44nk5K41j68
2691E2J93k89J24lK4Q9j52j8rk31K05j08R9J14p8o3K9j13K91j96k46j03L39N7
$$ plain form
2527 -38 259 15 -237 53 -74 -100 4 -14 230 -18 -23 -311 -272 -10 54 41 113 19 -119 -79 -43 -51 40 -290 -119
2552 -119 -8 135 60 213 -44 -32 96 -168 189 89 112 -32 86 -120 251 -122 42 -127 -53 35 154 -295
2574 -295 -308 -65 244 -116 -130 -193 -52 -75 -254 -86 -19 282 72 245 -120 2 171 145 59 -75 -10 29 11
2597 11 110 -7 76 182 -124 140 346 30 260 -117 18 283 -2 68 -24 -114 -180 150 -184 215 234 -237 22
2620 22 -35 -80 1 126 -174 162 -21 -107 138 -149 -155 -97 45 20 -100 -198 -158 29 -227 -128 5 97 -105 -240
2644 -240 -255 189 265 -67 212 75 174 -60 139 92 -253 -182 -36 67 53 58 -1 282 -107 161 93 46 -231 -22
2668 -22 113 -32 -85 -17 -35 -145 47 -59 -264 -172 -16 135 -206 15 -143 -121 92 -135 9 4 -21 220 52
2691 52 245 -44 80 77 101 190 38 20 11 -220 -15 -123 -24 90 12 -51 -22 -135 156 -40 -286 -389 -50 7
2715Gq0k94M42J36j22m18O1K29J68M7k90K40l50K26j4K05r4K15l65J78k57J26
2737dk6q7K51n4K1J15l96J73J30j79J03Pk49J90p9n8J49Nj04K14M3l54K83j6p9
2762aq4J32j53J00k5jq6J02m9R2o1q8M0K43l61J98L2J61j20l7Q5q2j63J62K13
2787B49q9k07K42%j65J9j25p0p4L4K55n0J02j37j97J99K71m22J78L18k82q6m0
2810g7Q4L8L1l2P2k05J8J55j0r9jR1Q8l33M10k62j17J26J04L2j54j48J35k68K92
2835c0j22J0j26M10j89K04j44l6j42J54K51q3j90J34m6p0J01J36j53l6J7J67p5
2858A42k91J30j72J43n3K06N0o2m0P8p8nj94K7L03k4r9k53%K48k1k31K15J43l85
2883b23J61L92o00O5J55K1k17N0P5J8J61J3k43J80nj59M12k00j54K28J8q4K04
$$ plain form
2715 7 -73 -367 75 211 89 -329 -268 -39 129 176 -114 126 -224 2 -12 193 99 314 -51 127 -130 -4
2737 -4 -30 -117 134 80 101 216 -180 -7 123 -56 47 54 -195 -5 -84 -142 7 12 -92 122 165 -189 94 78 -1
2762 -1 -85 47 -106 -6 -31 -32 -118 -16 -65 27 -34 -122 -82 161 -200 -2 30 191 71 34 119 37 -126 36 249
2787 249 160 -47 195 195 30 49 -76 -146 -220 -186 69 19 121 -16 -213 -14 257 -165 13 331 49 -37 -77
2810 -77 7 45 76 44 116 -89 -71 84 74 -25 -26 65 153 -180 230 -32 -149 -23 81 113 -41 -189 -54 -322 -30
2835 -30 -152 -142 -268 142 -47 157 13 -23 -165 -11 240 157 -33 101 55 -15 86 222 69 33 50 217 142
2858 142 -149 -19 -191 -48 -101 105 155 93 53 131 53 48 -146 -119 184 160 61 -192 -192 56 35 -196 19 162 -223
2883 -223 -62 330 -270 -205 -50 -29 -246 -196 -121 -103 58 71 -172 8 3 -156 256 56 -98 130 148 64 268
2906B68k59K20k47l2K12l11N7Q0Q7j83L0J25J13j38P1k16o4J4K9m4J54j39K07
2929C4J30k38n1J57p7J3p9k40J20J36K92n8k45nK23j93j20K1K82j40P9k05K47
2952H3j78J82p9M2M4j47n8l73N23j54L1J85j12l2k38L75p6l39K09K86j52Q4j07
2975aO9r6J19j81J30k64J57M2j06K10o8K71k28l1p2p4J36O1L0N8J3l67J90J78
2999A76q5l7j90J93k17j3M53p41O37o3j89R1j53L33l6k00M0o3K23j91K36l87J10
3022g3O3j52J45L22k04j45J76K9o9j49j62K51k08L51j30K47k13r8k68K90J41j13
3044C1J05n5J92l38Q2n2N6RQ2J91l79L6rJ30lj24J39k79J48n1L18j12j73J8L37
3069B99l80M5J11k9J02k58J00PL1j7R6k15K04l76J84O8L9j19K19l2K1j89J06k25
$$ plain form
2906 268 9 229 -18 -50 162 -149 -92 -12 75 -108 -78 47 160 22 93 -123 -187 -173 -144 -188 -34 -173 34
2929 34 164 -74 -125 32 -45 -32 -111 -351 -231 -95 197 139 -106 -111 112 -81 -201 -180 102 -38 41 -164 83
2952 83 -95 87 8 50 94 -53 -111 -484 39 -115 -84 101 -11 -43 -281 94 18 -321 -112 174 22 106 -1
2975 -1 68 -28 91 -90 40 -224 -67 -25 -131 79 11 282 54 23 -49 -123 13 74 104 162 175 -192 -2 176
2999 176 91 54 -136 57 -160 -173 280 -461 176 113 -76 15 -138 195 159 -41 -1 -64 159 -32 204 -183 -73
3022 -73 -10 -162 -17 305 101 -44 132 161 92 -57 -219 32 -176 175 45 292 79 -19 -287 3 144 31
3044 31 136 81 273 -65 17 -35 21 30 112 303 -76 -40 -49 81 78 -46 93 -186 -38 -89 229 117 -56 -38 299
3069 299 -81 -36 75 46 148 -110 -10 -3 28 11 107 -108 96 -280 -96 -28 11 -108 111 79 100 -89 17 -208
3093b08L24M9j23r2L32o8l29L4O9k85L40j82O7j8K92p4j75r7L24Q7n0k24q7NJ16
3118B7J39k44L8N3O7j59JR2m3J22j99M2j70L19k87O8R7O1r9LJ14l17J27K49J38
3143B39o8k93J79k59L27K1o8j30j87K27J10l2o4k68K17Q3l2P7n6k8K32j78j80
3166a31L1J05j02J06j27O1J99K24l88P0K4Q0j81J6m8j62J79R1l35L37j85p3K45
3189C6L9R3j36p6J24k22j4J27k18K66k51K73JL26l48J20J32K5m47L36p1j21K2
3212A6R6p2O2j30K5J2k92L36P4k34j03J51l7qJ6Q9p2L17k78K3K6k21K17j53K07
3237F7J82n32K94k43J18M8K5r4J66K85j39j91r5j12K72j32J46J38k85j01J29j59
3259b13L02M0k0m3k17J13L4L14l09k54N80k07j51N1Pq6K0NL4j08j7J96j63K26
$$ plain form
3093 -208 116 165 42 -50 282 214 -115 -81 -12 -297 43 -139 -72 -90 202 128 -47 -144 180 267 217 -7 -94 -89 27
3118 27 166 -78 -40 13 80 -79 -78 14 -29 93 -106 -64 -234 85 -202 -134 -37 24 -75 -72 42 -275 -148 101 239
3143 239 171 -122 57 -202 125 146 78 -52 -239 -12 98 66 2 -266 -49 34 2 79 23 -5 227 49 -131
3166 -131 -100 5 -97 9 -118 -57 142 366 -22 48 72 152 -29 -13 -61 -223 -44 47 -288 49 -136 -209 36
3189 36 75 168 32 -44 80 -142 -156 -29 -247 19 -232 41 42 368 20 140 272 297 -150 186 115 -6 16
3212 16 112 40 102 -28 -3 9 -283 53 127 -107 -210 -59 -96 -104 -88 1 -71 246 -32 -9 17 -204 13 -140 67
3237 67 249 -283 11 -232 -114 -66 -41 -135 31 316 177 -14 -109 -221 51 -81 65 203 -82 -183 -54 -213
3259 -213 89 129 109 66 -151 -38 -4 310 1 -253 327 120 -31 20 27 -59 -39 -34 0 -108 -125 71 -92 134
3283A34j02p3Q3N9K40k78j9q7J07j44mJ23J7k14K09J63m86J88K97j02q5o3j61
3306a98J37M5R8k51J00J81O1j9j15j80J84n7p6J69n7l8J28nN5k01J6M6j20j58
3330b55Q9K28p4R3j26j9R0j5m0j23M3J75j16J39l84J37O4j16pM7K62j44KO2K49
3355B61l10O7j05K48j43j29R5l9J5rL75k61k40M41k1l45L1r3K68r0q7R5N6l1Q
3380E7k8K5P4m29N2J20K31Qqj2q9K24k20j30J06J97m24K76kj82O3k6K72k12J93
3405A36l02J90n4J71M6q8l6o7O5n5k05L63l68j20J56K27j67jJ7J18r4K3p4P1j79
3430b27L31l6j77N1L20m3l43%o1K31J3rRm4j10K80O3l06k20M24r3L2l04K36L3
3455E0o1o3j2j2K43j55k9M0j71J50J75N3j37j44j16M65m66J41N3j05L9K08j88
$$ plain form
3283 134 32 -41 42 101 341 63 44 -43 64 -80 -84 39 56 -158 51 214 -272 -84 213 111 26 -37 -198
3306 -198 -61 -16 82 -169 -69 112 173 154 39 -141 43 -14 -90 79 22 -16 112 107 162 -39 -23 23 -97 -255
3330 -255 -166 62 -12 81 -45 -64 26 11 -29 -152 -109 66 -50 89 -295 -158 -94 -210 -217 -170 92 -52 -50 12 261
3355 261 -49 18 -87 161 18 -111 -16 -55 -40 -49 326 65 -175 266 245 -100 -69 -162 106 16 -71 24 80 49 57
3380 57 29 54 128 -301 -249 -129 102 110 102 90 1 225 5 -125 -19 178 -246 30 28 -154 -91 -117 155 -57 136
3405 136 -166 24 -30 141 187 99 63 -4 61 6 -199 164 -204 -324 -168 59 -108 -109 -92 26 -68 -45 -119 -48 -227
3430 -227 104 68 -109 -58 262 219 -124 -124 -185 46 59 50 59 15 -95 185 248 -58 -278 146 53 85 -219 17 50
3455 50 -11 -74 -86 -98 145 -10 -39 1 -170 -20 155 208 71 -73 -189 276 -190 -49 4 -101 -62 146 -42
3478d2K47k33j9J24O0r3j56K15m76L16j14K08j87J66k5j77K48p2J39l1q0j00R3
3501A1Q3j87k3P4J9L16m31P0J30pk68J75L2Q8k26K69j80Lj10K39q2J57j21J6n6
3526iJ50L4k53K96N6l02n1J08lJ20l00K72l97L09k76L03m75M35p9R3J58p3j59
3549d3Mq6m9L70k30k57K39j81J63nL4J27j00Q1j79R9P0J0q1J33J32n09K75k80
3573b63L28N4j06J51j38L2K6j36J23k37N7k2K24n1r3J03j72K76j73j33N58k83
3595A25n7o1J83J1k35O3O6j68J98j56lp7RJ71j32Kj95L36j72J40M%k5Kj60L09
3621A78l61J94K27m23L2J85q3j09L59m21L63k34k4N5o4J57p7J52j58K0R1r3j08
3644a42J20J00Jl0p4J42n5p4J29p0J57k87J35k47J02J97Pj69J90j31K97l50O0
$$ plain form
3478 -42 205 -28 -47 77 137 44 -112 103 -373 -57 -171 37 -150 16 -9 -186 62 -10 129 98 18 -82 11
3501 11 94 -93 -116 -42 -23 293 -138 -68 62 55 -213 -38 -6 82 -144 125 -55 -52 -162 77 -5 152 31 47 -9
3526 -9 141 175 -78 218 274 -28 -79 29 26 146 -154 118 -279 30 -246 57 -418 17 -62 31 189 116 -43
3549 -43 -39 -125 -174 196 -34 -291 -52 -233 -70 -75 -41 86 -14 67 -112 -13 57 67 -14 119 251 -258 17 -263
3573 -263 65 119 13 164 26 58 84 -52 71 -166 -109 -131 93 42 -51 52 -120 156 -17 -150 408 125
3595 125 68 7 190 201 -34 29 95 -73 125 -31 -34 -111 -102 69 -63 -61 -256 80 -92 48 52 52 27 29 -131 178
3621 178 -183 11 238 -185 -153 32 -51 -160 199 -222 141 -93 -117 -62 -126 31 -46 106 -52 -32 59 -34 -142
3644 -142 -22 78 79 49 -25 117 62 -12 117 47 204 -83 52 -195 -93 104 111 -58 132 1 298 -52 8
3667Hj19r8O5j66M76q6J05k33o6K78j69p4P7p9M43m77K43k93K70p8k09K30j03
3690e5N1m5K98k76NK42k14K4j33J42K5q2R9p3j46L70l30R6J33J5k41J94Pj68Q1
3715A9K84j75N6p0M7P0l91O2N3K65k12j61k0J8L06j91L3p6K30k25l1j52L65k39
3739a35L62l72J89J4j61j45N8L35l22L12j38n9j03K2K01pr5k15Q1K89o8J03j12
3762C4p2J07j1N0k38O3k0o4J77k28j7J99LJ3L2l22J78J14J46l73L29k94L93m35
3786b36J33J11QM5jO6j85K72j11M3j80l15L82j25P1J21M3j40j85K42p6o4L68j52
3810A35k63J42p5m7K7J49j36mR6l08N51l02j90J68l7J13K17j51j00j68J71R1k45
3833a66J90J54j84r9R7J26k95j38M24j02K33k10J20K4k51L44k76J07j20k15J29
$$ plain form
3667 8 -111 -209 -144 -310 166 80 185 -48 -114 164 -5 -79 -2 -81 362 -115 128 -165 105 27 -182 48 -55
3690 -55 -4 -49 249 -27 -22 220 6 30 -103 39 64 -18 81 8 -138 232 -98 -2 131 146 -95 99 106 -62 19
3715 19 303 128 184 114 161 231 -160 -98 -45 220 8 -153 -173 -155 151 -40 -7 -83 147 -78 -109 -261 104 -135
3739 -135 227 -145 44 58 -103 -248 -190 145 -177 135 -3 -62 -165 -143 58 51 -44 -259 -178 111 43 146 34
3762 34 -38 69 58 108 -130 -67 -87 -151 26 -202 -219 -20 -17 -4 28 -294 -116 -2 144 -229 100 -194 199 -236
3786 -236 -103 8 16 61 60 126 -59 213 102 145 -35 -350 32 -93 -22 99 142 2 -183 59 -17 -81 287 135
3810 135 -128 14 -61 -108 -81 68 -68 -72 24 -284 267 -35 -225 -57 -94 19 236 85 -15 -183 -12 79 -166
3833 -166 24 178 -6 -105 -8 118 -177 -315 109 7 240 30 150 174 -77 267 -9 98 -22 -237 -108
3854a08K63l08K4J41k61L50k13r2L62m07M75k19k86K44K11k66M2J14Q4j54j77
3875a81J82J20N5l7m07J58J26k47Q8J72J08j14q1J0J97rJ52m61mK60J35m1j28
3898E3k13J46j58J54M6%K8Rlk98J37K48j67K3r9J5m2J98j63k36J88K27m2P6k84
3923a57MK48m03J49j28L12N8q2P9j00j31J84O6j98P2N6k33K03QJ64k02J95j39
3946B5J58k37Q9O9M8n0Pj51J00L0j27J12j86q8j4N5j60O2L50m2mj11p1K3J87O9
3972A43J41n26K54j59K17pK1j15J51j07rO2j3R7r1j6J20k60L3q9K72j79J79j10
$$ plain form
3854 -108 155 -153 -129 12 -249 101 -112 -204 158 -249 226 7 -279 -35 176 -90 -48 66 150 -4 -181
3875 -181 1 121 176 139 -268 -110 16 -231 -143 29 137 23 -58 -48 149 140 292 -169 -173 87 222 181 53
3898 53 -160 -14 -172 -18 28 28 56 65 62 -236 -99 149 -18 5 -94 -79 -121 77 -86 -322 -134 93 51 127 -157
3923 -157 -153 95 -308 -159 -287 25 83 1 80 -20 -151 33 99 -99 -27 29 -204 -1 7 171 -31 164 25
3946 25 183 -54 35 104 152 102 109 -42 58 88 -39 73 -113 -201 -215 -160 -320 -258 92 50 46 -65 -136 -113 74 143
3972 143 284 -242 12 -147 70 63 84 -31 120 13 4 66 53 150 59 43 163 -97 -64 -153 119 -60 119 9
$$ [...]
8191e
##END NTUPLES=NMR FID
##END=
