##TITLE=1H_SR146_oil
 DMSO-d6
 8 sc, 
 20.10.2022
##JCAMPDX= 6.0         $$ Bruker NMR JCAMP-DX V2.0
##DATA TYPE= NMR FID
##DATA CLASS= NTUPLES
##ORIGIN= UXNMR, Bruker Analytische Messtechnik GmbH
##OWNER= root
$$ XWIN-NMR		Version 3.5
$$ Thu Oct 20 15:36:23 2022 Russian Standard Time (UT+4h)  she@DPX200
##.OBSERVE FREQUENCY= 200.1313499994
##.OBSERVE NUCLEUS= ^1H
##.DELAY= (6, 6)
##.ACQUISITION MODE= SIMULTANEOUS
##.ACQUISITION SCHEME= undefined
##.AVERAGES= 8
##.DIGITISER RES= 18
##SPECTROMETER/DATA SYSTEM= spect
##.PULSE SEQUENCE= zg30
##.SOLVENT NAME= CDCl3
##.SHIFT REFERENCE= (INTERNAL, CDCl3, 0, 15.7039)
##AUDIT TRAIL= $$ (NUMBER, WHEN, WHO, WHERE, WHAT)
$$ ##TITLE= Audit trail, XWIN-NMR		Version 3.5
$$ ##JCAMPDX= 5.01
$$ ##ORIGIN= Bruker BioSpin GmbH
$$ ##OWNER= she
$$ F:/spectra/data/she/nmr/H-F/1/audita.txt
$$ ##AUDIT TRAIL=  $$ (NUMBER, WHEN, WHO, WHERE, WHAT)
(   1,<2022-10-20 15:34:15.54 +0400>,<she>,<DPX200>,
      <created by zg, POWCHK disabled, PULCHK disabled
       configuration hash MD5:
       00 E9 B6 7A A2 85 ED C7 34 08 36 98 17 FE 4E 26
       data hash MD5: 16K
       7F FE 15 24 7C F6 AD 47 C1 84 44 7A FE FD A8 29>)
$$ ##END=
$$ 
$$ hash MD5
$$ B9 BD 34 65 39 D8 1A 01 0B 94 2B 96 CF A1 5C 80
##$RELAX= 
##$RELAX= 
##$RELAX= 
##$RELAX= 
##$RELAX= 
##$RELAX= 
$$ Bruker specific parameters
$$ --------------------------
##$DU= <F:/spectra>
##$EXPNO= 1
##$NAME= <H-F>
##$PROCNO= 1
##$TYPE= <nmr>
##$USER= <she>
##$AMP= (0..31)
100 100 100 100 100 100 100 100 100 100 100 100 100 100 100 100 100 100 
100 100 100 100 100 100 100 100 100 100 100 100 100 100 
##$AQSEQ= 0
##$AQ_mod= 1
##$AUNM= <au_zg>
##$AUTOPOS= <>
##$BF1= 200.13
##$BF2= 200.13
##$BF3= 200.13
##$BF4= 200.13
##$BF5= 200.13
##$BF6= 200.13
##$BF7= 200.13
##$BF8= 200.13
##$BYTORDA= 1
##$CFDGTYP= 0
##$CFRGTYP= 5
##$CHEMSTR= <none>
##$CNST= (0..31)
1 1 145 1 1 1 1 1 1 1 1 1 1 1 1 1 1 1 1 1 1 1 1 1 1 1 1 1 1 1 1 1 
##$CPDPRG= <>
##$CPDPRG1= <>
##$CPDPRG2= <>
##$CPDPRG3= <>
##$CPDPRG4= <mlev>
##$CPDPRG5= <mlev>
##$CPDPRG6= <mlev>
##$CPDPRG7= <mlev>
##$CPDPRG8= <mlev>
##$CPDPRGB= <>
##$CPDPRGT= <>
##$D= (0..31)
0 1.2 0 0 0 0 0 0 0 0.06 0 0.03 0 0 0 0 0.0002 0 0 0 0 0 0 0 0 0 0 0 0 
0 0 0 
##$DATE= 1666265654
##$DBL= (0..7)
120 120 120 120 120 120 120 120 
##$DBP= (0..7)
150 150 150 150 150 150 150 150 
##$DBP07= 0
##$DBPNAM0= <>
##$DBPNAM1= <>
##$DBPNAM2= <>
##$DBPNAM3= <>
##$DBPNAM4= <>
##$DBPNAM5= <>
##$DBPNAM6= <>
##$DBPNAM7= <>
##$DBPOAL= (0..7)
0.5 0.5 0.5 0.5 0.5 0.5 0.5 0.5 
##$DBPOFFS= (0..7)
0 0 0 0 0 0 0 0 
##$DE= 6
##$DECBNUC= <off>
##$DECIM= 32
##$DECNUC= <off>
##$DECSTAT= 4
##$DIGMOD= 1
##$DIGTYP= 9
##$DL= (0..7)
0 120 120 120 120 120 120 120 
##$DP= (0..7)
150 150 150 150 150 150 150 150 
##$DP07= 0
##$DPNAME0= <>
##$DPNAME1= <>
##$DPNAME2= <>
##$DPNAME3= <>
##$DPNAME4= <>
##$DPNAME5= <>
##$DPNAME6= <>
##$DPNAME7= <>
##$DPOAL= (0..7)
0.5 0.5 0.5 0.5 0.5 0.5 0.5 0.5 
##$DPOFFS= (0..7)
0 0 0 0 0 0 0 0 
##$DQDMODE= 0
##$DR= 18
##$DS= 0
##$DSLIST= <SSSSSSSSSSSSSSS>
$$ [...]
##$SUBNAM2= <"">
##$SUBNAM3= <"">
##$SUBNAM4= <"">
##$SUBNAM5= <"">
##$SUBNAM6= <"">
##$SUBNAM7= <"">
##$SUBNAM8= <"">
##$SUBNAM9= <"">
##$SW= 18.0517283424941
##$SWIBOX= (0..15)
0 0 2 0 0 0 0 0 0 0 0 0 0 0 0 0 
##$SW_h= 3612.71676300578
##$TD= 16384
##$TD0= 1
##$TE= 0
##$TE2= 300
##$TE3= 300
##$TEG= 300
##$TL= (0..7)
0 120 120 120 120 120 120 120 
##$TP= (0..7)
150 150 150 150 150 150 150 150 
##$TP07= 0
##$TPNAME0= <>
##$TPNAME1= <>
##$TPNAME2= <>
##$TPNAME3= <>
##$TPNAME4= <>
##$TPNAME5= <>
##$TPNAME6= <>
##$TPNAME7= <>
##$TPOAL= (0..7)
0.5 0.5 0.5 0.5 0.5 0.5 0.5 0.5 
##$TPOFFS= (0..7)
0 0 0 0 0 0 0 0 
##$TUNHIN= 0
##$TUNHOUT= 0
##$TUNXOUT= 0
##$USERA1= <user>
##$USERA2= <user>
##$USERA3= <user>
##$USERA4= <user>
##$USERA5= <user>
##$V9= 5
##$VALIST= <valist>
##$VCLIST= <CCCCCCCCCCCCCCC>
##$VD= 0
##$VDLIST= <DDDDDDDDDDDDDDD>
##$VPLIST= <PPPPPPPPPPPPPPP>
##$VTLIST= <TTTTTTTTTTTTTTT>
##$WBST= 1024
##$WBSW= 4
##$XGAIN= (0..3)
0 0 0 0 
##$XL= 0
##$YL= 0
##$YMAX_a= 334610
##$YMIN_a= -278944
##$ZGOPTNS= <>
##$ZL1= 120
##$ZL2= 120
##$ZL3= 120
##$ZL4= 120
##$ABSF1= 10
##$ABSF2= 0
##$ABSG= 5
##$ABSL= 3
##$ALPHA= 0
##$AQORDER= 0
##$ASSFAC= 0
##$ASSFACI= 0
##$ASSFACX= 0
##$ASSWID= 0
##$AUNMP= <proc_1d>
##$AZFE= 0.1
##$AZFW= 0.1
##$BCFW= 1
##$BC_mod= 2
##$BYTORDP= 1
##$COROFFS= 0
##$CY= 11.3945322036743
##$DATMOD= 1
##$DC= 2
##$DFILT= <>
##$DTYPP= 0
##$F1P= 2.36226072786647
##$F2P= -0.459571619588291
##$FCOR= 0.5
##$FTSIZE= 0
##$FT_mod= 4
##$GAMMA= 1
##$GB= 0.15
##$INTBC= 1
##$INTSCL= 1
##$ISEN= 128
##$LB= 0.24
##$LEV0= 0
##$LPBIN= 0
##$MAXI= 10000
##$MC2= 0
##$MEAN= 0
##$ME_mod= 0
##$MI= 1.114404
##$NCOEF= 0
##$NC_proc= 0
##$NLEV= 6
##$NOISF1= 3.799351
##$NOISF2= 2.8
##$NSP= 1
##$NTH_PI= 0
##$NZP= 0
##$OFFSET= 15.70392
##$PC= 1
##$PHC0= -18034.29
##$PHC1= 9.2007
##$PH_mod= 1
##$PKNL= yes
##$PPARMOD= 0
##$PSCAL= 0
##$PSIGN= 0
##$REVERSE= no
##$SF= 200.130013532006
##$SI= 16384
##$SIGF1= 3
##$SIGF2= 2
##$SINO= 400
##$SIOLD= 16384
##$SREGLST= <1H.CDCl3>
##$SSB= 0
##$STSI= 0
##$STSR= 0
##$SW_p= 3612.71676300578
##$SYMM= 0
##$S_DEV= 0
##$TDeff= 0
##$TDoff= 0
##$TI= <>
##$TILT= no
##$TM1= 0
##$TM2= 0
##$TOPLEV= 0
##$USERP1= <user>
##$USERP2= <user>
##$USERP3= <user>
##$USERP4= <user>
##$USERP5= <user>
##$WDW= 1
##$XDIM= 8192
##$YMAX_p= 0
##$YMIN_p= 0
$$ End of Bruker specific parameters
$$ ---------------------------------
##NTUPLES= NMR FID
##VAR_NAME=  TIME,          FID/REAL,        FID/IMAG
##SYMBOL=    X,             R,               I
##VAR_TYPE=  INDEPENDENT,   DEPENDENT,       DEPENDENT
##VAR_FORM=  AFFN,          ASDF,            ASDF
##VAR_DIM=   8192,          8192,            8192
##UNITS=     SECONDS,       ARBITRARY UNITS, ARBITRARY UNITS
##FACTOR=    0.0002768,     1,               1
##FIRST=     0,             0,               0
##LAST=      2.2672688,     0,               0
##MIN=       0,             -278944,         0
##MAX=       2.2672688,     334610,          0
$$ Real data points
##PAGE= N=1
##DATA TABLE= (X++(R..R)), XYDATA
$$ [...]
$$ plain form
1876 -769 -724 -516 -327 67 43 561 929 607 625 464 3 -471 -625 275 167 -399 -64 381 115 -431 -433 -409
1898 -409 -703 -924 -696 -225 97 394 367 551 377 -192 -57 75 -348 -355 111 137 257 789 691 271 310 289
1920 289 192 -439 -438 266 -66 215 -201 -287 110 -48 -1016 -676 -219 -775 -339 163 194 -3 263 223 -353 39
1942 39 -99 -330 104 359 -397 -524 566 431 159 637 781 -163 -25 265 -227 -34 508 139 -247 206
1962 206 -502 -789 -7 -472 -1128 -252 6 -427 346 1249 284 114 418 182 -394 294 183 -251 406 215
1982 215 -377 276 723 -162 -596 189 -308 -805 521 648 -223 46 272 -647 -607 215 -662 -1008 11 -319
2002 -319 -818 428 615 -75 465 793 -90 62 1219 471 49 653 394 -408 227 460 -278 301 329 -950
2022 -950 -364 762 -112 -634 701 -39 -1331 -175 417 -748 -723 16 -786 -586 158 -508 -463 799 469
$$ packed form
1876g69M5K08J89L94k4N18L68l22J8j61m61m74j54R00j08n66L35M45k66n46kK4
1898d09k94k21K28M71L22K97k7J84j74n69J35J32m23pM66K6J20N32r8m20L9k1
1920B89r7o31JP04l32K81m16q6L97j58r68L40M57n56M36N02L1j97K66m0n76L92
1942C9j38k31M34K55p56j27J090j35k72M78J44r44J38K90m92J93N42l69l86M53
1962B06p08k87P82m65o56Q76K58m33P73R03r65j70L04k36n76O88j11m34O57j91
1982B15n92O53M47q85m34P85m97m97J326J27q71K69K26r19M0Q22q77l46J019l30
2002c19m99J246J87o90N40L28q83J52J157p48m22O04k59q02O35K33p38N79K8j279
2022i50N86J126q74n22J335p40j292J156N92j165K5P39q02K00P44o66M5J262l30
$$ plain form
2041 469 -294 696 937 -196 153 1160 179 -88 1004 200 -568 503 523 -999 -193 369 -1002 -545
2059 -545 491 -480 -325 652 -161 -1043 84 275 -1114 -434 321 -753 -466 912 121 76 1028 613 -715
2078 -715 705 826 -692 370 1288 -177 -400 960 87 -681 382 119 -944 -352 -62 -833 -246 622
2096 622 -392 -309 361 -479 -1041 361 116 -876 243 734 -1054 161 1168 219 -201 965 259 -222
2114 -222 1028 576 -14 509 504 -944 -244 608 -441 -748 192 -536 -1409 -136 447 -34 116 241 -661
2133 -661 -568 398 0 -390 324 -42 -841 227 1003 -9 370 504 -412 -273 200 334 216 873 488 -434
2153 -434 166 445 -463 -124 75 -979 -1120 -15 -193 -512 392 259 -569 -500 463 -175 -277 469 -89 -152
2173 -152 294 242 170 430 377 -425 -422 331 268 -65 940 542 -67 24 292 -578 395 127 -590 -524 -64 -432
$$ packed form
2041D69p63R90K41j133L49J007r81k67J092q04p68J071K0j522Q06N62j371M57
2059e45J036r71J55R77q13q82J127J91j389O80P55j074K87J378p91m5R52m15j328
2078g15J420J21j518J062R18j465k23J360q73p68J063k63j063N92K90p71N87Q68
2096F22j014Q3O70q40n62J402k45r92J119M91j788J215J007r49m20J166p06m81
2114b22J250m52n90N23nj448P00Q52j049l07R40p28q73J273N83m81J50J25r02
2133f61R3R66l98l90P14l66p99J068P76j012L79J34r16J39M73J34j18O57l85r22
2153d34O00K79r08L39J99j054j41J105j78l19R04j33q28O9R63o38j02P46n58o3
2173a52M46n2p2K60n3q02LP53o3l33J005l98o09R1K68q70R73k68p17O6M60l68
$$ plain form
2195 -432 -527 315 84 -508 -190 -13 -392 -37 752 169 -293 145 83 -152 243 372 -135 342 -182 -475 -67
2216 -67 721 17 -48 447 -11 -264 342 316 -347 -286 -189 -647 -111 -45 -31 -234 37 -258 -302 99 181 188 173 289
2240 289 -296 -24 347 122 -123 113 -349 -468 -105 4 -87 422 94 -131 -6 415 58 -23 36 -85 -427
2261 -427 -159 251 -121 53 -350 65 -170 -240 -289 69 306 59 -16 18 529 -117 95 142 -77 -359 -98 5
2283 5 -352 103 58 320 143 169 68 -133 36 -317 -156 -93 75 425 175 -133 -42 -174 -80 -186 -229 -130 197
2306 197 354 40 184 252 114 50 -84 -127 -304 -438 -245 -324 -72 193 42 217 307 275 36 22 67 48 -44
2329 -44 169 166 -47 7 203 2 -279 -453 -48 -27 -222 40 128 149 84 593 524 -27 -137 34 204 -253 -88
2352 -88 271 -81 -42 -25 23 -5 -293 -130 112 -4 235 159 85 120 228 -90 95 -26 -459 -234 -149 -158 42 62
$$ packed form
2195d32r5Q42k31n92L18J77l79L55P89n83m62M38o2k35L95J29n07M77n24k93M08
2216f7P88p04o5M95m58k53O06k6o63O1R7m58N36O6J4k03K71k95m4M01Q2Pj5J16
2240B89n85K72L71k25k45K36m62j19L63J09r1N09l28k25J25M21l57q1N9j21l42
2261d27K68M10l72J74m03M15k35p0m9L58K37k47p5L4N11o46K12M7k19k82K61J03
2283El57M55m5K62j77K6j01k01J69l53J61O3J68L50k50l08R1j32R4j06m3R9L27
2306A97J57l14J44O8j38o4j34m3j77j34J93p9K52K65j51J75R0l2k39j4M5j9r2
2329d4K13lk13N4J96k01k81j74M05K1j95K62Q8K1o5N09o9n51j10J71J70m57J65
2352h8L59l52L9J7M8k8k88J63K42j16K39p6p4L5J08l18J85j21m33K25Q5rK00K0
$$ plain form
2376 62 -13 -81 74 -252 -217 -108 -328 -318 193 336 -51 50 -100 343 -32 48 122 131 40 183 347 239 75
2399 75 79 -12 162 -115 -368 -204 -69 -269 162 356 192 -72 291 70 -329 -270 26 -292 -185 13 167 79
2421 79 60 57 -12 -198 -33 -33 19 -120 312 529 413 250 -57 330 14 -151 -291 -68 -323 154 -13 -160 -384
2444 -384 22 -77 -105 -150 -11 -276 -157 412 189 33 91 131 123 182 -167 53 81 136 259 139 176 -37 178 285
2468 285 -38 -250 -60 -78 -315 -49 31 54 -47 -45 -43 -231 -409 -258 -270 275 118 -114 319 381 29 -126 376
2491 376 -15 -104 -114 102 54 304 406 199 265 340 127 -384 119 -14 -513 254 55 -117 -229 68 -14 -168
2513 -168 -371 -141 -324 -38 -41 -229 276 208 15 184 212 36 6 118 314 -204 39 177 87 184 315 -119
2535 -119 -50 -146 -159 -66 -21 -6 -9 -68 -61 -70 -82 220 -321 -616 -298 21 -140 50 132 -40 -69 52 3 4 149 188 -260
$$ packed form
2376F2p5o8J55l26L5J09k20J0N11J43l87J01j50M43l75Q0P4Rr1J43J64j08j64
2399G5Mr1J74k77k53J64J35k00M31J94j64k64L63k21l99N9K96l18J07J98J54q8
2421G9j9lo9j86J65%N2j39M32K17j16j63l07L87l16j65j40K23k55M77j67j47k24
2444c84M06r9k8m5J39k65J19N69k23j56N8M0qN9l49K20K8N5J23j20L7k13K15J07
2468B85l23k12J90j8k37K66Q0K3j01KKj88j78J51j2N45j57k32M33O2l52j55N02
2491C76l91q9j0K16m8K50J02k07O6P5k13n11N03j33m99P67j99j72j12K97q2j54
2513a68k03K30j83K86lj88N05o8j93J69K8j76l0J12J96n18K43J38r0R7J31m34
2535a19O9r6j3R3M5J5ln9Prj2L02n41k95L18L19j61J90Q2j72k9J21m9JJ45L9m48
$$ plain form
2562 -260 -262 248 -141 361 437 33 -125 -141 52 -292 228 180 -150 146 142 -111 256 328 44 -214 109 -299 -111
2585 -111 152 311 -375 -135 231 -101 119 525 259 -301 -167 -84 12 274 269 130 24 42 -217 -73 332 -22
2607 -22 10 226 -327 -223 14 483 174 -147 -129 -328 -213 222 173 303 624 43 86 333 190 -5 -179 98
2629 98 -355 -239 111 98 165 240 -155 -403 -312 101 -37 174 234 -278 -266 387 299 3 249 19 -638 -545 -33
2652 -33 -144 -14 -13 172 -210 -59 266 -122 408 137 -125 -44 59 -120 231 317 239 -516 -139 -183 -173 4 -72
2675 -72 -223 -106 -386 -254 120 54 12 7 -85 -160 -120 400 426 -70 -147 -122 101 -129 267 213 6 -73 16 -108 -89
2700 -89 29 -54 -142 -148 -179 -294 115 315 -64 -200 -69 -144 -98 82 -33 296 243 -7 -37 17 35 -160 224 -95
2724 -95 -244 -242 280 124 3 19 -174 -208 -263 74 -10 -38 -183 -18 -152 107 -169 -49 10 96 -89 101 11 265
$$ packed form
2562b60kN10l89N02P6m04j58j6J93l44N20m8l30K96mk53L67P2k84k58L23m08J88
2585a11K63J59o86K40L66l32K20M06k66n60J34Q3R6K62nj39j06J8k59J44M05l54
2607b2L2K16n53J04K37M69l09l21J8j99J15M35m9J30L21n81M3K47j43j95j74K77
2629I8m53J16L50j3O7P5l95k48R1M13j38K11O0n12J2O53q8k96K46k30o57R3N12
2652c3j11J30JJ85l82J51L25l88N30k71k62Q1J03j79L51Q6p8p55L77m4J0J77p6
2675g2j51J17k80J32L74o6m2nr2p5M0N20K6m96p7K5K23k30L96n4k07p9Q9j24J9
2700h9J18q3q8ol1j15M09K00l79j36J31p5M6J80j15L29n3k50l0N4J8j95L84l19
2724i5j49KN22j56j21J6j93l4n5L37q4k8j45J65j34K59k76J20N9Q6j85J90r0K54
$$ plain form
2748 265 56 163 210 -139 0 38 -134 -20 99 -244 168 -179 -232 -237 -198 -112 -276 -64 -107 -5 -158 90 232
2771 232 -54 -51 -70 32 -89 99 118 72 99 155 176 148 -41 -85 70 -86 -238 68 51 310 21 113 -94 -207
2795 -207 -103 -282 -116 -28 22 -34 88 -193 -183 56 -12 8 -113 104 8 -238 87 57 173 240 -52 149 22
2818 22 64 29 361 93 -50 197 -104 221 90 -94 -39 -219 -296 -236 -141 146 86 187 -82 298 51 -121 48
2841 48 -129 -285 -202 80 194 -75 177 195 1 51 14 -2 -154 -340 -68 236 -34 -306 216 86 -15 -402
2863 -402 -187 8 -109 56 214 110 -22 20 85 211 200 -78 75 -87 -156 96 3 -177 -24 -216 -115 -131
2885 -131 -183 179 -18 168 -117 -24 -157 21 205 -93 34 -179 -184 -45 -40 61 -2 119 125 63 7 -165 60 -170
2909 -170 -199 -95 21 57 36 196 206 12 -135 -170 25 71 -273 30 7 66 93 28 -107 -122 -187 -127 -155 -17 -191
$$ packed form
2748B65k09J07M7l49J39L8j72J14J19l43M12l47n3nL9Q6j64K12m3J02j53K48J42
2771B32k86Lj9J02j21J88J9m6K7N6K1k8j89m4J55j56j52L06j7K59k89R2k07j13
2795b07J04j79J66Q8N0n6J22k81J0K39o8K0j21K17r6k46L25l0J16O7k92K01j27
2818B2M2l5L32k68j43K47l01L25j31j84N5j80p7O0R5K87o0J01k69L80k47j72J69
2841D8j77j56Q3K82J14k69K52J8j94N0l7j6j52j86K72L04k70k72N22j30j01l87
2863d02K15J95j17J65J58j04j32M2O5J26j1k78J53j62o9K52r3j80J53j92J01j6
2885a31n2L62j97J86k85R3j33J78J84k98J27k13nJ39NJ01o3J21Oo2n6j72K25k30
2909a70k9J04J16L6k1J60J0j94j47l5J95M6l44L03k3N9K7o5j35j5o5O0k8J38j74
$$ plain form
2934 -191 -39 164 281 72 58 73 -234 192 -87 -224 2 165 -55 199 174 -41 -41 33 -100 -268 -91 -171
2956 -171 -303 -159 42 -42 -6 11 -147 -175 -40 -103 -107 -4 -29 -144 166 82 -15 44 -165 -139 22 2 143 26
2980 26 256 409 -294 -154 -98 -96 -102 -41 19 81 -82 18 55 -177 -73 -369 -1 73 57 -309 375 196 -24 279
3004 279 6 -154 -82 163 -224 74 236 186 -423 51 149 -113 -22 121 -280 -42 143 83 12 2 -59 -257 -243
3027 -243 -5 -95 -116 188 -322 4 263 -180 -113 488 209 75 -87 50 5 198 151 -282 -3 -15 64 -7 287
3050 287 -11 -364 58 1 -184 42 178 -226 -98 153 -31 -361 -146 315 -254 24 248 -300 136 134 231
3071 231 118 287 29 -295 162 17 -109 22 112 -39 -313 224 -46 -160 93 -220 -247 -143 205 -165 -22
3092 -22 218 -16 -160 -28 39 -367 185 108 -144 -5 316 90 126 59 -53 -153 192 -37 -262 191 179 -319
$$ packed form
2934a91J52K03J17k09j4J5l07M26k79j37K26J63k20K54k5k15%P4j33j68J77q0
2956a71j32J44K01q4L6J7j58k8J35o3mJ03k5j15L10q4r7N9k09K6J61k0J41j17
2980B6K30J53p03J40N6KoO1O0O2j63J00L7k32J04k96L68P4j6l66O84j79k20L03
3004B79k73j60P2K45l87K98J62n0o09M74R8k62R1J43m01K38J85o0p1j0o1j98J4
3027b43K38r0k1L04n10L26K59m43O7O01k79j34j62J37m5J93m7m33K79j2P9p1K94
3050B87k98l53M22n7j85K26J36m04J28K51j84l30K15M61n69K78K24n48M36kR7
3071B31j13J69k58l24M57j45j26J31R0j51k74N37k70j14K53l13k7J04L48l70J43
3092b2K40k34j44J32O7m06N52p7k52J39L21k26L6o7j12j00L45k29k25M53j2m98
$$ plain form
3114 -319 -232 -27 -172 67 114 -56 -255 7 -130 -83 339 96 -59 293 131 -102 248 81 -121 -148 54
3135 54 -174 234 305 260 -103 -10 -118 -250 -10 201 103 -210 54 161 -377 366 113 -202 -120 150 -270 7
3157 7 267 99 -43 62 -88 -291 108 51 -49 206 93 -443 -59 257 177 -254 -28 -92 -219 93 241 -68
3179 -68 14 107 -89 3 -23 -42 -123 -73 -289 -530 -122 152 -50 -97 -144 -91 -248 7 208 -233 454 -51 -257 -2
3203 -2 342 20 -314 109 -5 -202 55 3 -249 -12 34 -370 197 122 -76 228 293 85 -73 -73 -6 21 76 158
3227 158 16 42 -125 43 -97 127 228 -42 139 -98 -37 39 287 -274 56 -158 -37 136 16 -94 -114
3248 -114 134 72 -126 36 199 -188 -2 56 -165 -101 30 75 126 -108 -45 -48 -39 159 -57 -73 38 -181 53 42
3272 42 -104 168 -150 -4 -327 -104 -98 138 -150 -43 -261 -18 -52 -10 39 17 -149 -99 -148 333 53 -142 -2
$$ packed form
3114c19Q7K05j45K39M7j70j99K62j37M7M22k43j55L52j62k33L50j67k02k7K02
3135E4k28M08P1m5l63R3j08j32K40K11r8l13K64J07n38P43k53l15Q2K70m20K77
3157GK60j68j42J05j50k03L99n7j00K55j13n36L84L16q0m31K26o4j27L12J48l09
3179f8Q2R3j96R2k6j9q1N0k16k41M08K74k02m7m7N3j57K55K01m41O87n05k06K55
3203bL44l22l34M23j14j97K57n2k52K37M6m04N67p5j98L04O5k08j58%O7K7N5Q2
3227A58j42K6j67J68j40K24J01k70J81k37O1P6K48n61L30k14J21J73j20j10k0
3248a14K48o2j98J62J63l87J86N8k21O4J31M5N1k34O3lRJ98k16j6J11k19K34j1
3272D2j46K72l18J46l23K23OK36k88J07k18K43l4M2M9k2j66N0m9M81k80j95J40
$$ plain form
3295 -2 6 98 108 -20 37 55 80 9 -14 384 197 -41 91 -41 20 168 -19 45 -74 166 30 -84 29 -134
3319 -134 86 128 98 -142 73 -32 15 -82 -71 -278 -132 -27 -335 153 12 27 126 198 56 6 -54 -92 276 -8
3343 -8 -36 49 -170 20 76 -141 -87 -244 -233 160 -208 38 260 88 -25 88 57 226 -45 33 177 -37 -277
3366 -277 -115 52 -143 21 52 290 156 71 20 16 -161 103 -26 16 -208 -122 33 -70 -32 -136 -133 -104 -117 -9
3390 -9 -172 76 -227 176 123 -90 96 -94 -91 37 -117 -50 28 -141 247 -75 198 3 -193 -105 -250 -376 170
3413 170 -143 120 183 -186 -135 17 -233 295 -60 -154 -69 -24 24 156 -105 -93 -37 76 -4 69 197 -109 -77 -172
3437 -172 87 12 -24 293 261 -216 -121 174 -20 -106 59 36 -50 165 -250 -103 -183 193 -33 -176 -252 55 -84
3460 -84 -34 68 -105 95 72 10 27 22 -212 -31 202 46 48 105 -91 -81 -149 78 -132 41 57 250 -78 54
$$ packed form
3295bQR2J0j28N7J8K5p1k3L98j87k38J32j32O1J48j87O4j19K40j36j14J13j63
3319a34K20M2l0k40K15j05M7r7J1k07J46J05l08M88j41J5R9P2j42n0o0l8L68k84
3343hk8Q5k19J90N6k17N4j57J1L93l68K46K22j72j13J13l1J69k71P8J44k14k40
3366b77J62J67j95J64L1K38j34q5n1mj77K64j29M2k24Q6J55j03L8j04LK9j3J08
3390ij63K48l03M03n3k13J86j90LJ28j54O7P8j69L88l22K73j95j96Q8j45j26N46
3413A70l13K63O3l69N1J52k50N28l55r4Q5M5M8J32k61J2N6J13q0P3J28l06L2r5
3437a72K59p5l6L17l2m77R5K95j94q6J65k3q6K15m15J47q0L76k26j43p6L07j39
3460h4N0J02j73K00k3o2J7nk34J81K33j56KN7j96J0o8K27k10J73J6J93l28J32
$$ plain form
3484 54 -4 -118 3 -168 -275 89 -80 74 -3 14 315 -8 38 -157 -44 -74 90 -10 -1 6 363 -131 244
3507 244 188 20 -235 167 -270 3 143 -53 71 105 -181 -124 166 -36 175 -366 -112 -251 -110 -138 0
3528 0 -119 144 -32 -39 168 151 -213 151 -13 -10 230 -70 18 42 102 40 -102 -42 -133 36 231 -53 -238 -299 216
3553 216 26 183 7 -29 77 -76 -96 -230 189 381 2 26 -3 232 54 187 171 -86 -40 122 110 31 77
3576 77 -6 -29 240 29 -1 41 -40 -13 -108 116 53 121 154 56 -23 -298 -59 -140 -135 201 7 -287 -284 -239 -113 -45 175
3603 175 -120 88 255 -37 147 72 75 -209 -148 -132 -217 35 40 -47 39 87 -316 -146 220 58 69 -133 119 5
3627 5 -266 200 -297 62 -72 -279 282 85 178 -80 13 -67 48 10 76 -170 6 -58 -241 -168 -126 -163 10 291
3651 291 188 -171 150 68 353 -135 -291 -194 -168 -145 -100 -42 50 120 -144 6 121 3 159 -31 -128 -87 40
$$ packed form
3484E4n8j14J21j71j07L64j69J54p7J7L01l23M6j95J13l0J64j00RPL57m94L75
3507B44n6j68k55M02m37K73J40j96J24L4k86N7K90k02K11n41K54j39J41k8J38
3528@j19K63j76pK07j7l64L64j64LK40l00Q8K4O0o2j42O0r1J69J95k84j85o1N15
3553B16j90J57j76l6J06j53k0j34M19J92l79K4k9K35j78J33j6k57M6J62j2p9M6
3576G7q3k3K69k11l0M2q1K7r5K24o3O8L3r8p9k75K39q1NL36j94k94LM5J26O8K20
3603A75k95K08J67k92J84p5Lk84O1J6q5K52Nq7Q6M8m03J70L66j62J1k02K52j14
3627Ek71M66m97L59j34k07N61j97R3k58R3q0J15l8O6k46J76o4j83P3M2l7J73K81
3651B91j03l59L21q2K85m88j56R7K6K3M5N8R2P0k64J50J15j18J56j90r7M1J27
$$ plain form
3674 40 61 176 235 84 78 -217 -188 116 -38 -172 177 -130 -42 -213 128 192 172 54 22 -51 83 258 406 89
3698 89 -213 3 307 -100 -28 -64 -60 138 72 20 -138 -137 164 -130 104 69 -138 63 59 252 -109 -104 32 116 -93
3723 -93 204 -279 116 163 171 94 -5 137 6 174 -1 27 -87 11 60 -59 158 15 98 -54 126 -263 -68
3746 -68 56 -102 -49 251 -20 -261 89 -155 -146 60 84 -138 59 -26 -80 -53 -163 36 257 89 44 -83 123
3769 123 -115 -121 -47 -88 -288 11 12 -195 -7 -150 133 113 -32 151 23 169 -29 172 -3 -10 -86 -28 -203 -85
3793 -85 158 -9 125 -47 -4 33 194 47 -8 -75 349 -105 -34 42 9 268 50 -173 -152 -83 -169 12 15 -3 237
3818 237 -122 42 61 139 -78 -66 115 -278 -78 275 65 49 99 155 184 -45 24 -136 216 29 -287 -69 -161
3841 -161 209 -77 -271 -164 -10 51 27 41 -209 301 -110 -124 182 112 89 42 -52 -164 60 91 121 -78 85
$$ packed form
3674D0K1J15N9j51ok95K9L04j54j34L49l07Q8j71L41O4k0j18l2p3J34J75J48l17
3698H9l02K16L04m07P2l6MJ98o6n2j58JL01k94K34l5k07K01mJ93l61NJ36Q4k09
3723i3K97m83L95M7Qp7r9J42j31J68j75K8j14R8M9j19K17j43Q3j52J80l89J95
3746f8J24j58N3L00k71k41L50k44RK06K4k22J97q5n4K7j10J99K21j68m5j27K06
3769A23k38oP4m1k00K99Jk07J88j43K83k0j45J83j28J46j98K01j75pp6N8j75J18
3793h5K43j67J34j72M3L7J61j47n5o7M24m54P1P6l3K59k18k23K1O9q6J81Lj8K40
3818B37l59J64J9P8k17J2J81l93K00L53k10j6N0N6K9k29O9j60L52j87l16K18r2
3841a61L70k86j94J07J54O1k4J4k50N10m11j4L06p0k3m7r4j12K24L1L0j99J63
$$ plain form
3864 85 48 92 -33 78 178 15 191 82 -75 -98 -39 -85 -78 -55 -63 -30 1 -242 27 -139 11 -94 -65 -83 -7
3889 -7 -8 30 -97 265 -3 -175 41 -123 99 -29 4 0 97 126 -68 -49 -116 57 33 84 -135 -463 1 -69 -229
3914 -229 35 -93 -111 163 21 -64 -33 53 81 147 -110 -185 -36 -189 35 -103 64 -159 4 -87 -88 113 133 153
3938 153 6 -70 98 -33 1 -1 -179 -94 11 283 132 233 -283 -57 30 -72 -124 -49 90 211 308 128 107
3961 107 -3 -13 -112 -36 -47 -413 13 103 -25 -39 116 -167 184 -142 132 -271 53 283 30 164 -38 2
3983 2 114 -16 28 22 -85 -38 159 60 168 188 94 -44 -81 129 -107 175 -122 103 -228 -263 -331 -128 -153 -44
4007 -44 -19 -86 151 -19 -15 -72 43 -194 -58 -132 -52 90 -157 -58 117 73 88 103 51 114 46 -220 -63 57 -77
4032 -77 198 -83 105 -205 -25 62 -263 325 -235 -267 61 220 114 -121 7 -177 -18 254 197 -314 -126
$$ packed form
3864H5l7M4j25J11J00j63J76j09j57k3N9m6PK3qL3L1k43K69j66J50j05K9j8P6
3889gjL8j27L62k68j72K16j64K22j28L3mR7K9j94J9o7J73k4N1k19l28M64p0j60
3914b29K64j28j8K74j42q5L1Q6K8O6k57p5J49j53K24j38J67k23J63r1jK01K0K0
3938A53j47p6J68j31L4kj78Q5J05K72j51J01n16K26Q7j02n2P5J39J21R7j80k1
3961A07j10j0r9P6j1l66M26R0j28j4J55k83L51l26K74m03L24K30k53J34k02M0
3983BJ12j30M4oj07M7J97r9J08K0r4j38l7K10k36K82k97K25l31l5o8K03k5J09
4007d4K5o7K37j70Mn7J15k37J36p4Q0J42k47R9J75m4J5J5n2O3o8k66J57J20j34
4032g7K75k81J88l10J80Q7l25N88n60l2L28J59j06k35J28j84J59K72n7n11J88
$$ plain form
4053 -126 -96 -232 -97 47 -8 -114 -1 -89 60 299 -41 -10 158 275 76 -39 65 -177 -110 -97 -117 -69 -230
4076 -230 5 5 34 7 37 132 76 -189 30 -264 51 -28 -179 -49 -23 32 151 -123 -12 140 42 -37 101 144
4100 144 -125 -5 105 -211 42 97 -169 70 52 -181 -101 -43 -269 48 -24 64 -221 -53 336 191 -197 123
4122 123 -188 117 124 -137 118 -4 110 57 -5 90 110 -65 46 33 -255 -194 138 -255 -181 -7 -36 -46 -23 33
4146 33 -94 -49 329 4 161 162 128 8 34 -29 196 -17 47 -415 -237 26 47 80 12 -12 -93 57 123 -15 -21
4171 -21 -52 208 2 -89 -126 -38 -47 -247 229 58 189 -15 -112 -132 -44 2 6 57 54 176 -133 103 65 -198 -369 -143
4197 -143 109 -45 133 91 24 -51 79 218 113 -6 70 -39 44 144 83 15 89 -327 -7 71 -111 196 125
4220 125 -16 78 189 -61 94 -5 -28 -70 -84 -180 -143 -80 196 157 -153 -119 -7 80 -151 252 -18 -106 86 87 -166
$$ packed form
4053a26L0j36J35J44n5j06J13q8J49K39l40L1J68J17j99j15J04k42O7J3k0M8j61
4076b30K35%K9k7L0R5n6k65K19k94L15p9j51J30K6N5J19k74J11J52r8p9J38M3
4100A44k69J20J10l16K53N5k66K39j8k33Q0N8k26L17p2Q8k85J68L89j45l88L20
4122A23l11L05Pk61K55j22J14n3o2R5K0j75J11j3k88O1L32l93P4J74k9j0K3N6
4146C3j27M5L78l25J57Jl4j20K6o3K25k13O4m62J78K63K1L3o8k4q1J50O6j38o
4171b1l1K60k06r1l7Q8rk00M76j71J31k04r7k0Q8M6MN1lJ22l09K36l8k63j71K26
4197a43K52j54J78m2o7p5J30J39j05j19P6j09Q3J00o1o8P4m16L20P8j82L07p1
4220A25j41R4J11k50J55r9k3m2j4r6L7O3K76l9l10L4J12Q7k31M03k70q8J92Jk53
$$ plain form
4245 -166 -82 73 -169 -164 -49 -226 175 84 -54 151 -46 202 156 85 -41 72 -26 89 104 -129 156 -92 75
4268 75 130 -78 -130 143 -3 44 -52 -38 16 106 32 -73 58 -307 -33 -161 -244 -15 112 183 83 218 -21 54
4292 54 46 -96 49 52 45 261 35 -108 -34 65 81 57 136 -92 -127 -88 107 44 226 23 72 -122 -53 195 -208 -117
4318 -117 -101 95 -133 -157 -118 334 295 -23 -14 7 -68 -30 71 -64 72 -162 -148 -139 166 -95 -172 40 -23 -34 110
4343 110 106 148 149 308 264 108 -59 6 35 23 24 -112 101 203 129 -153 8 176 -108 58 -154 72 -19 -93 -37
4368 -37 36 -192 -65 -63 238 -20 -167 -177 -214 -37 192 111 -35 100 -204 -56 -66 -39 -26 62 -27 -159 1 -62
4392 -62 -23 37 -167 -4 48 -62 -88 145 -40 23 -4 -19 40 -25 20 -65 174 -113 97 172 -115 163 171 -68 328
4417 328 77 202 -144 -37 -102 93 -110 -92 23 -16 173 51 -47 -84 40 363 151 -2 51 28 65 -275 -197
$$ packed form
4245a66Q4J55k42NJ15j77M01r1j38K05j97K48m6p1j26J13r8J15J5k33K85k48J67
4268G5N5k08n2K73j46M7r6J4N4R0p4j05J31l65K74j28q3K29J27P1j00J35k39P5
4292E4qj42J45LpK16k26j43P4R9J6k4P9k28l5L9J95o3J82k03M9j94O9K48m03R1
4318a17J6J96k28k4L9M52l9l18RK1p5L8J01j35J36k34J4RL05k61p7K12o3j1J44
4343A10mM2JJ59m4j56j67O5K9j2Jj36K13J02p4k82J61J68k84J66k12K26r1p4N6
4368c7P3k28J27KL01k58j47j0l7J77K29q1j46J35l04J48j0K7J3Q8q9j32J60o3
4392f2L9O0k04J63N2j10k6K33j85O3k7j5N9o5M5q5K39k87K10P5k87K78Qk39L96
4417C28k51J25l46J07o5J95k03J8J15l9J89j22r8l7J24L23k12j53N3k3L7l40P8
$$ plain form
4440 -197 -65 59 56 -51 -61 29 34 26 145 -177 236 143 -32 109 185 42 -65 282 253 -158 -15 -50 144 -145
4464 -145 2 -82 -202 -150 79 138 41 -16 -17 77 -26 5 -50 55 -101 -79 139 49 76 252 -133 196 -146 99
4488 99 59 -45 -10 -90 -161 -86 -20 3 -77 -164 191 27 -167 150 98 215 41 -64 -110 28 60 193 108 -75 -6
4513 -6 152 -140 120 75 232 132 -82 -105 119 -63 -38 87 -181 119 -85 4 142 -203 -53 4 -114 -68 88
4536 88 -133 87 170 131 -236 -256 -63 11 -36 33 78 -53 -151 -193 -172 -197 -248 13 19 318 203 47 180 53 -205
4561 -205 -246 3 107 -8 -304 -99 35 173 -143 103 29 77 119 1 129 128 74 175 83 12 96 49 -137 97
4585 97 183 169 131 -48 -48 93 -125 46 189 -98 -54 36 92 104 -54 17 -165 61 -163 -113 72 -191 -117 201
4609 201 329 -170 146 -99 -12 -170 -77 -156 48 -49 -264 260 112 103 105 116 -30 40 55 -84 -66 -162 8 104 -85
$$ packed form
4440a97J32J24lj07j0R0NqJ19l22M13r3j75J41P6j43j07L47k9m11J43l5J94k89
4464a45J47q4j20N2K29N9r7n7jR4j03L1n5J05j56K2K18r0K7J76l85L29l42K45
4488I9m0j04L5q0p1P5O6K3q0q7L55j64j94L17n2J17j74j05m6J38L2J33q5j83O9
4513fJ58k92K60m5J57j00k14k3K24j82K5J25k68L00k04Q9J38l45J50N7j18M6J56
4536H8k21K20Q3l9l67k0J93P4m7O9M5j31r8m2K1k5n1K61OK99j15j56J33j27k58
4561b05m1K49J04j15k96K05J34J38l16K46p4M8M2j18J28jn4J01r2p1Q4m7j86K34
4585I7Q6j4l8j79%J41k18J71J43k87M4R0N6J2j58P1j82K26k24N0J85k63P4L18
4609B01J28m99L16k45Q7j58R3p9K04r7k15N24j48rKJ1j46P0J5j39J8r6J70R6j89
$$ plain form
4634 -85 -114 29 137 -29 -36 73 197 139 10 129 337 -1 172 82 39 218 92 -3 -23 -200 -207 -158 21 -24
4658 -24 -33 74 203 -54 138 251 -104 83 52 -149 102 -53 30 142 -222 -24 -19 39 -43 68 221 161 -28
4681 -28 9 109 156 -11 -96 11 -117 113 -233 195 -44 51 158 148 33 205 27 210 -182 -311 16 100
4703 100 -85 32 -44 -159 31 -347 172 9 -254 168 60 90 -73 -209 80 -246 217 -151 158 -71 -71
4724 -71 -203 -96 18 63 -66 19 -178 38 191 -11 131 88 -202 -222 12 -173 -130 3 71 37 183 129 43
4747 43 173 170 91 105 85 -23 54 -222 56 107 -35 -82 41 60 79 152 -71 225 199 225 193 -118 133 -110 100
4772 100 -7 -213 -27 98 190 -81 -9 -122 29 -171 128 96 -73 82 40 170 215 81 -198 5 -8 97
4794 97 24 143 -22 175 126 -153 -142 -175 250 80 237 -20 -76 -91 143 3 162 -153 232 -150 201 83
$$ packed form
4634h5k9J43J08j66pJ09J24n8j29J19K08l38J73r0m3J79j26r5k0j77pM9J79m5
4658b4rJ07J29k57J92J13l55J87l1k01K51j55Q3J12l64J98NN8q2J11J53o0j89
4681b8L7J00M7j67q5J07j28K30l46M28k39R5J07j0j15J72j78J83l92j29L27Q4
4703A00j85J17p6j15J90l78N19j63k63M22j08L0j63j36K89l26M63l68L09k29%
4724g1j32J07J14M5j29Q5j97K16J53k02J42m3k90k0K34j85M3J33O8l4J46n4q6
4747D3J30lp9J4k0j08P7k76K78N1j42m7J23J9J9P3k23K96k6K6l2l11K51k43K10
4772A00j07k06J86J25R2k71P2j13J51k00K99l2j69J55m2J30M5j34k79K03j3J05
4794I7p3J19j65J97m9k79J1l3M25j70J57k57n6j5K34j40J59l15L85l82L51j18
$$ plain form
4816 83 24 50 -43 255 8 -48 101 -166 -178 40 -114 -76 0 -255 2 11 -37 131 -170 208 -36 -94 126 14
4840 14 -10 -93 139 -188 -14 -44 5 94 27 108 166 -57 -228 152 310 -27 57 261 -181 24 116 105 -20 -92
4864 -92 212 -191 116 -54 21 174 -33 190 63 21 -10 -73 14 -86 -30 98 -80 -78 33 106 -104 -55 -62 130
4888 130 -148 -132 102 -112 -28 110 -181 85 -150 166 -245 118 122 86 164 101 -184 72 -199 144 -17 131
4910 131 -4 -63 141 230 -146 -11 -196 -364 4 -16 -133 -186 135 -26 -269 -113 -43 120 104 -32 -154 154
4932 154 51 -54 -58 -4 -213 -177 65 -43 -185 87 131 -112 -30 66 -164 76 7 -38 -197 183 228 -60 116
4955 116 39 -132 -85 105 -50 379 68 -102 -34 124 228 -8 -210 -73 -192 -407 -95 -111 -282 -26 188
4976 188 -9 -88 -44 -16 -114 -113 36 -125 117 -65 48 -34 41 85 -135 -122 -343 56 187 -12 228 -19 198
$$ packed form
4816H3n9K6r3K98k47n6J49k67j2K18j54L8P6k55K57Rm8J68l01L78k44n8K20j12
4840A4k4q3K32l27J74l0M9Q9o7Q1N8k23j71L80J58l37Q4K04m42K05R2j1j25p2
4864i2L04m03L07j70P5J53k07K23j27m2l1o3Q7j00N6J28j78KJ11P3k10M9pJ92
4888A30k78J6K34k14Q4J38k91K66k35L16m11L63Ml6P8o3k85K56k71L43j61J48
4910A31j35n9K04Q9l76J35j85j68L68k0j17n3L21j61k43J56P0J63j6j36j22L08
4932A54j03j05mN4k09L6K42j08j42K72M4k43Q2R6k30K40o9m5j59L80M5k88J76
4955A16p7j71M7J90j55M29l11j70O8J58J04k36k02J37j19k15L12j6j71K56K14
4976A88j97p9M4K8r8JJ49j61K42j82J13q2P5M4k20J3k21L99J31j99K40k47K17
$$ plain form
4999 198 74 50 92 -69 -289 -51 -8 -261 -25 93 37 -109 82 -79 -401 103 42 165 -206 22 -144 -73
5021 -73 -163 -33 72 55 198 17 -60 -54 190 53 -26 196 82 20 46 -29 -4 -117 167 32 25 57 4 -11 -58 78
5047 78 -145 -15 -119 123 -88 72 -215 -104 -66 -1 -105 7 -89 -99 268 79 -221 -10 117 52 185 -99
5069 -99 -181 33 57 -68 48 -49 -173 -98 -50 1 -1 53 336 -80 103 23 86 -114 0 -41 38 -91 280 284 118
5094 118 -35 61 -107 329 -192 45 -30 102 35 81 -51 -66 -204 -177 71 -177 19 -101 -29 -235 6 -173
5116 -173 72 -30 280 -42 193 243 -268 53 51 29 30 17 -100 -45 139 25 -51 -64 314 60 228 140 162 -86
5140 -86 177 31 -42 152 -87 -12 126 70 -156 -110 32 259 50 -170 -60 -104 -95 -75 -13 -26 -103 -190 -157 -370 260
5165 260 -59 106 39 0 241 -56 -18 172 83 -135 94 68 50 23 -95 -132 -146 -142 10 -63 127 208 -65 -14 -194
$$ packed form
4999A98j24k4M2j61k20K38M3k53K36J18n6j46J91j61l22N04o1J23l71K28j66P1
5021g3r0J30J05j7J43j81p7OK44j37p9K22j14o2K6p5K5j13K84j35pL2n3j5m7J36
5047G8k23J30j04K42k11J60k87J11L8O5j04J12r6j0L67j89l00K11J27o5J33k84
5069i9q2K14K4j25J16r7j24P5M8N1kN4K83m16J83q0O3k00J14m1P9j29L71Mj66
5094A18j53R6j68M36n21K37p5J32o7M6j32j5j38K7K48k48J96j20P2k06K41j79
5116a73K45j02L10l22K35N0n11L21kk2Jj3j17N5J84j14p6j3L78k54J68q8K2k48
5140h6K63j46p3J94k39P5J38n6k26M6J42K27k09k20J10m4RK0O2j3p7q7L3k13O30
5165B60l19J65o7l9K41k97L8J90q9k18K29k6j8k7j18l7j4MJ52p3J90Q1k73N1j80
$$ plain form
5190 -194 -7 -118 -9 -66 -111 -197 -151 48 19 -67 -331 -85 26 36 103 -3 -52 21 -166 -22 -205 -118 -336 241
5214 241 259 -50 32 -156 -139 37 -2 -157 -2 125 238 82 188 -52 85 -104 28 -109 67 18 238 -86
5236 -86 -10 -91 82 253 298 125 128 171 -68 -2 94 12 -256 -228 -224 25 -135 134 131 67 -90 -26 65 -127 249 -17
5262 -17 -120 -26 91 -37 -97 44 71 -60 -133 37 141 36 24 108 205 -94 217 50 153 -28 18 -56 -251
5285 -251 5 56 -112 -1 91 82 236 39 -199 -127 193 43 -10 24 57 -16 164 64 159 12 8 24 208 153 -85
5310 -85 -128 16 21 193 80 -37 102 101 46 -108 134 -15 -111 -68 31 113 -267 202 64 -63 92 -270 255 221
5334 221 233 -123 205 -138 -77 245 -221 183 -106 45 -142 -131 1 252 -1 -45 149 94 3 56 19 -34 -71
5357 -71 -39 88 220 93 105 -38 41 141 -68 24 198 270 -81 -85 -197 72 -86 -185 111 170 -54 19 -143 -148
$$ packed form
5190a94J87j11J09n7m5q6M6J99k9q6k64K46J11J0O7j06m9P3j87J44j83Q7k18N77
5214B41J8l09Q2j88J7J76l9j55J55J27J13j56J06k40J37j89J32j37J76m9K20l24
5236h6P6q1J73J71M5j73LM3k39O6R6q2k68K8MK49j60K69lo4j57O4R1j92L76k66
5262a7j03R4J17j28o0J41K7j31p3J70J04j05j2Q4R7k99L11j67J03j81M6p4j95
5285b51K56N1j68J11R2rJ54j97k38P2L20j50n3L4L3p3J80j00R5j47mJ6J84n5k38
5310h5m3J44NJ72j13j17J39jn5j54K42j49r6M3R9Q2l80M69j38j27J55l62N25l4
5334B21J2l56L28l43O1L22m66M04k89J51j87J1J32K51k53m4J94n5r1N3l7n3l7
5357g1L2J27J32j27J2j43P9J00k09R2J74P2l51mj12K69j58r9K96N9k24P3j62n
$$ plain form
5381 -148 -23 108 27 202 -186 -13 -10 -149 -65 -85 17 124 -8 -136 -18 -44 -58 93 52 48 126 0 206 -3
5405 -3 213 -321 -255 -139 59 170 184 173 123 250 199 -29 92 -159 -3 -96 412 -304 -102 -124 -237 -82 -150
5428 -150 9 -8 75 -202 58 -44 29 59 43 -212 38 -97 138 213 -6 75 -115 98 61 252 -265 -98 -108
5451 -108 -106 83 -93 277 -88 -73 -202 124 195 -162 -88 -82 -70 -102 11 125 -235 113 -68 145 66 228 23
5474 23 64 6 -205 15 112 -167 155 -111 -196 200 84 -71 234 1 101 128 168 124 89 -105 55 129 52 6
5498 6 -118 113 50 166 -148 58 -147 9 -143 211 -147 169 154 -216 96 -62 -98 -21 -212 -9 -109 78
5520 78 -95 129 -91 -189 92 52 17 -74 -129 -4 -91 5 141 -223 -45 17 113 152 -15 -41 125 144 -38 26 96
5545 96 80 -92 -48 -25 -116 7 -136 -12 -166 -235 57 -10 137 -211 33 -19 -175 -54 40 107 110 196 126 155 138
$$ packed form
5381a48J25J31q1J75l88J73Lj39Q4k0J02J07j32j28J18k6j4J51m1mP8j26K06k09
5405cK16n34O6J16J98J11J4j1n0J27n1k28J21k51J56r3N08p16K02k2j13J55o8
5428a50J59j7Q3k77K60j02P3L0j6k55K50j35K35P5k19Q1j90K13l7J91n17J67j0
5451a08KJ89j76L70l65J5j29L26P1l57P4OJ2l2J13J14l60L48j81K13p9J62k05
5474B3M1n8k11K20R7k79L22k66q5L96j16j55L05k33J00K7M0m4l5j94J60P4p7m6
5498Fj24K31o3J16l14K06k05J56j52L54l58L16j5l70L12j58l6P7j91K03j00J87
5520G8j73K24k20r8K81m0l5r1n5J25q7R6J36l64J78O2R6L9j67k6J66J9j82O4P0
5545I6j6j72M4K3r1J23j43J24j54o9K92o7J47l48K44n2j56J21R4O7LQ6p0K9j7
$$ plain form
5570 138 -36 -55 162 104 28 29 -125 -111 49 65 40 -148 -146 -96 -30 28 -14 4 -125 112 121 -11 -40 69 102 -90
5596 -90 34 75 -98 -26 -1 -59 -74 101 235 220 11 2 130 109 16 17 127 -93 295 -97 -23 -63 12 112 -86
5621 -86 -79 41 65 177 -232 94 -38 180 -84 318 -133 45 49 123 181 -177 17 -72 -182 -220 154 202 32 -160
5645 -160 281 89 214 36 79 -72 92 -93 59 21 84 236 129 -2 -50 -96 167 20 105 165 157 478 -9
5668 -9 -229 -181 -49 -185 138 182 102 114 -4 127 -104 97 36 202 76 -127 137 -59 -4 34 139 41 156
5691 156 12 -145 -67 148 228 -7 135 9 123 -102 17 54 279 -189 86 -310 95 49 -148 -69 -43 -14
5713 -14 -24 -79 271 97 -101 -89 -85 -246 -17 -1 -142 -28 -175 -56 -188 38 179 -67 -34 138 250 104 25
5736 25 -166 78 85 -10 54 -164 -96 -339 35 -255 94 -17 102 -35 207 -42 209 151 84 -73 58 57 -56
$$ packed form
5570A38j74j9K17n8p6Jj54J4J60J6k5j88KN0O6N8m2J8j29K37Rj32k9J09L3j92
5596i0J24M1j73P2K5n8j5J75J34j5k09rJ28k1r3JJ10k20L88l92P4m0P5J00j98
5621h6PJ20K4J12m09L26j32K18k64M02m51J78MP4N8l58J94q9j10l8L74M8j70j92
5645a60M41j92J25j78M3j51J64j85J52l8O3J52j07j31m8m6K63j47Q5O0qL21m87
5668ik20M8J32j36L23M4q0J2j18J31k31K01o1J66j26k03K64j96N5L8J05r8J15
5691A56j44j57P8K15Q0k35J42j26J14k25J19L7K25m68K75l96M05m6j97P9K6K9
5713a4j0n5L50j74j98J2Mj61K29J6j41J14j47J19j32K26J41k46L3J72J12j46p9
5736B5j91K44Pr5O4k18O8k43L74k90L49j11J19j37K42k49K51n8o7j57J31jj13
$$ plain form
5759 -56 55 11 59 -241 160 -177 42 -55 -171 -23 202 134 72 -51 -7 -80 179 33 -42 50 116 118 170 -75 41
5784 41 -5 165 -293 -3 173 48 -217 51 -238 -203 41 -193 25 60 -33 -71 25 -132 191 62 -26 149 95
5807 95 -71 47 -42 -6 -53 -74 241 64 -15 66 15 9 -121 -145 -70 -133 38 13 175 85 -165 32 -41 -131 97 83
5833 83 -8 239 -141 -75 138 139 -57 174 338 110 253 -85 -8 -36 -143 -260 79 -35 29 95 -331 23 -50
5856 -50 196 -69 -6 217 -16 133 232 -138 36 -275 -14 166 -109 -71 208 -31 -20 223 8 -181 -98 112
5878 112 148 11 -182 -67 -139 -146 -160 171 25 -166 -54 63 137 278 81 -16 -5 -156 7 48 80 179 -98 -80
5902 -80 -192 91 155 127 -151 -252 -49 110 -52 20 113 -155 -125 -40 -115 -16 -83 -213 -169 -278 -144 193 76 55
5926 55 24 35 255 -30 -101 206 139 -96 45 16 43 116 -37 -154 -69 99 -23 44 -206 -336 303 -107 177
$$ packed form
5759e6J11m4M8l00M01l37K19r7j16J48K25o8o2j23M4p3K59j46p5R2O6KN2k45J16
5784D1m6J70m58K90J76j25k65K68k89L5K44k34K18L5r3l8R6j57L23j29q8J75n4
5807I5j66J18q9L6m7k1L15j77p9Q1n1oj30k4P5o3J71k5J62r0k50J97p3r0K28j4
5833H3r1K47l80O6K13Jj96K31J64k28J43l38P7k8j07j17L39j14O4O6m26L54p3
5856e0K46k65O3K23k33J49R9l70J74l11K61J80k75L8K79k39J1K43k15j89Q3K10
5878A12L6j37j93J15p2pj4L31j46j91J12J17P4J41j97r7J1j51J63M1L2R9k77J8
5902h0j12K83O4k8k78j01K03J59j62P2R3k68L0Q5p5R9o7j30M4j09J34L37j17k1
5926E5l1J1K20k85p1L07o7k35J41k9K7P3j53j17Q5J68j22O7k50j30O39m10K84
$$ plain form
5949 177 -48 85 -13 83 193 99 81 -73 126 -112 45 24 -9 15 38 -238 70 160 106 41 4 -256 0 -114
5973 -114 -114 -36 -116 -137 176 40 124 -91 -69 95 190 -40 2 -67 -117 22 -22 -49 -23 -54 143 39 47 105 -8 -102
5999 -102 -16 -17 221 -113 242 48 14 -26 -274 -70 -44 61 -49 -13 183 -83 -64 165 193 -38 91 121 34 11
6023 11 98 -439 -36 113 -113 34 -25 -66 -53 -54 14 2 30 -31 -12 -40 -74 -22 122 65 -95 17 -28 102 -186 174
6049 174 -296 63 -10 39 191 -382 98 -72 -116 269 74 -40 -39 167 203 144 -76 -75 -101 169 161 -156 59 -166
6073 -166 -186 -103 231 -25 -63 -117 49 11 -240 -35 173 26 33 -106 -227 18 133 144 -25 -140 -229 6 97
6096 97 -71 -214 -49 22 64 25 -62 -36 101 133 75 30 15 -97 62 43 -169 11 459 58 -201 -93 59 -91
6120 -91 -94 125 116 -168 15 -127 -103 -296 -255 -28 76 -59 -32 230 -94 78 135 -18 -23 61 241 27 51 -241
$$ packed form
5949A77k25J33r8R6J10r4j8j54J99k38J57k1l3K4K3k76L08R0n4o5l7k60K56j14
5973a14%P8q0k1L13j36Q4k15K2J64R5k30M2o9n0J39m4k7K6l1J97j04QN8j13r4
5999a02Q6jK38l34L55j94l4m0k48K04K6J05j10L6J96k66J9K29K8k31J29L0q7k3
6023A1Q7n37M03J49k26J47n9m1J3jO8j2K8o1J9k8l4N2J44n7j60J12m5J30k88L60
6049A74m70L59p3M9J52n73M80j70m4L85j95j14JK06L6n9k20Jk6K70ql17K15k25
6073a66k0Q3L34k56l8n4J66l8k51K05K08j47Pj39j21K45J15J1j69j15q9K35R1
6096I7j68j43J65P1M2l9q7K6J37L2n8m5j5j12J59j9k12J80M48m01k59J08J52j50
6120i1lK19rk84J83j42K4j93M1K27J04j35K7K62l24J72N7j53nQ4J80k14K4k92
$$ plain form
6144 -241 123 -301 -53 -276 -141 77 -206 -19 93 20 187 181 -19 4 152 180 30 205 165 -46 -96 -117 -76
6167 -76 -331 -11 98 235 -35 4 0 117 121 160 -319 124 141 -94 111 -70 -163 17 129 84 120 46 123 -13
6191 -13 38 20 159 -143 10 22 112 -62 16 -178 -135 112 253 -10 -229 -63 -223 114 29 70 22 23 258 58
6215 58 -153 -287 -125 3 73 -60 -13 24 331 94 -161 -36 -132 -21 -132 -11 1 -142 -10 -128 -33 -26 64
6238 64 167 -44 38 47 367 -22 70 -47 -172 116 -165 -74 -92 -8 -203 -188 -30 -83 -214 34 -148 50 -136
6261 -136 267 -40 219 209 3 99 -109 29 -354 -256 -81 -25 201 -4 -65 -8 39 269 68 60 177 -67 85
6284 85 -101 105 -4 170 -38 -159 -19 68 -83 168 318 -95 194 -272 34 97 -62 45 -16 23 6 -4
6306 -4 -167 -76 -71 150 -101 -195 103 -175 -21 232 41 146 215 60 74 7 -114 -75 -66 -106 23 -22 -252 14 195
$$ packed form
6144b41L64m24K48k23J35K18k83J87J12p3J67ok00K3J48K8j50J75m0k11n0k1M1
6167g6k55L20J09J37k70L9mJ17ML9m79M43J7k35K05j81r3J80J12m5L6p4P7j36
6191a3N1j8J39l02J53J2R0j74P8j94M3K47J41k63k19J66j60L37q5M1m8JK35k00
6215E8k11j34J62J28P0j33M7L7L07k37k55J25r6J11j11J21J2j43J32j18R5PR0
6238F4J03k11Q2RL20l89R2j17j25K88k81R1j8Q4j95J5J58n3j31K48j82J98j86
6261a36M03l07K59j0k06R6k08J38l83R8J75N6K26k05o1N7M7K30k01qJ17k44J52
6284H5j86K06j09J74k08j21J40Q7j51K51J50m13K89m66L06O3j59J07o1L9j7j0
6306dj63R1NK21k51r4K98k78J54K53j91J05O9j55J4o7j21L9Rm0J29m5k30K66J81
$$ plain form
6331 195 -92 206 168 27 -68 -370 103 -160 -55 -9 -293 -207 56 33 157 -89 26 84 25 106 -179 173 182
6354 182 -79 -40 -10 9 95 -101 -153 -205 59 -47 -78 -242 19 -18 59 72 38 -130 -171 76 -5 -24 118 -152 -149
6379 -149 -45 -28 -3 3 29 203 -132 -51 69 266 102 303 -74 -136 67 -117 132 61 -5 -102 66 333 -86
6402 -86 88 12 41 -118 -57 -33 201 -31 4 150 193 1 -27 246 -59 156 -186 33 -36 161 -94 50 -36
6425 -36 12 -93 72 -21 181 -125 -7 77 -249 135 3 112 -218 193 167 -30 56 292 -11 251 -11 -339
6447 -339 104 -10 83 -202 -23 147 284 -8 101 59 8 241 199 -225 150 -12 4 -180 -61 25 -141 -171
6469 -171 123 93 7 183 -152 45 212 22 65 110 -121 -119 -250 -230 50 -167 35 -60 118 181 -226 -48 -98
6492 -98 263 -33 256 -43 -183 -84 11 5 185 -64 -53 11 45 -54 32 140 -104 137 -100 82 -16 23 41 -128
$$ packed form
6331A95k87K98l8j41r5l02M73k63J05M6k84Q6K63k3J24k46J15N8n9Q1k85L52R
6354A82k61L9L0J9Q6j96n2n2K64j06l1j64K61l7P7J3l4j68m1K47q1j9J42k70L
6379a49J04J7K5OK6J74l35Q1J20J97j64K01l77o2K03j84K49p1o6r7J68K67m19
6402h6J74p6K9j59O1K4K34k32L5J46M3j92k8K73l05K15l42K19o9J97k55J44q6
6425c6M8j05J65r3K02l06J18Q4l26L84j32J09l30M11k6j97Q6K36l03K62k62l28
6447c39M43j14R3k85J79J70J37k92J09m2n1K33m2m24L75j62J6j84J19Q6j66l0
6469a71K94l0q6J76l35J97J67j90M3M5k31Kj31K0K80k17K02r5J78O3m07J78n0
6492i8L61k96K89k99j40R9R5oJ80k49J1O4L4r9Q6J08k44K41k37J82r8L9J8j69
$$ plain form
6516 -128 20 -290 -4 -258 3 -135 63 -235 -4 373 98 -87 44 349 108 -150 -72 -24 -136 89 -184
6537 -184 -67 -110 15 -142 85 -76 93 290 200 95 -103 192 64 147 -182 -115 352 -18 204 11 10 -24
6559 -24 -54 53 105 84 -3 28 -91 147 80 -45 134 142 50 96 -159 68 -6 342 162 109 99 26 44 90 120 -37
6585 -37 -105 -33 100 -16 107 242 -129 -164 146 -55 -49 -40 74 -55 -85 -76 140 171 42 123 -124 8 166 -60
6609 -60 224 -57 -110 -26 -2 -244 24 10 -82 133 -151 -46 134 -198 -86 38 -76 -3 268 44 218 24
6631 24 104 -25 86 119 94 -267 138 -84 -176 110 -143 -68 -128 50 -82 86 132 19 80 97 99 119 15 -210
6655 -210 179 107 47 -251 -111 -46 -343 -63 121 -277 -25 246 -11 -243 126 -1 167 -8 -173 -169 115 -32
6677 -32 -155 193 78 20 -43 13 56 -74 -135 61 87 126 -59 114 -42 -14 9 -155 -46 -108 136 191 -344 -46
$$ packed form
6516a28J48l10K86k54K61j38J98k98K31L77k75j85J31L05k41k58P8M8j12K25k73
6537a84J17m3J25j57K27j61J69J97r0j05j98K95j28Q3l29O7M67l70K22j93jl4
6559b4l0J07N2k1q7L1j19K38o7j25J79Qr2M6k55K27p4L48j80n3j0p3J8M6L0j57
6585c7o8P2J33j16J23J35l71l5L10k01ORJ14j29l0RK16L1j29Q1k47J32J58k26
6609f0K84k81n3Q4K4k42K68j4r2K15k84J05J80l32J12J24j14P3K71k24J74j94
6631B4Q0j29J11L3k5l61M05k22r2K86k53P5o0J78j32J68M6j13O1J7KK0j04k25
6655b10L89p2o0k98J40O5k97K80J84l98K52K71k57k32L69j27J68j75j65MK84j47
6677c2j23L48j15n8o3N6M3j30o1J96K6L9j85J73j56K8K3j64J09o2K44N5n35K98
$$ plain form
6701 -46 44 -32 116 192 -131 -90 -109 96 -12 -107 -80 -63 248 -113 64 -166 8 44 88 -33 82 160 -170 199
6725 199 -171 23 81 -80 44 -353 16 -64 61 -137 140 182 137 156 -66 207 35 59 150 44 -207 117
6747 117 14 -98 -167 140 20 -282 -127 83 30 62 -10 -11 180 251 58 -24 116 151 -146 -70 167 91 -257 49
6771 49 -160 143 73 18 -88 -59 -1 24 67 -233 14 -84 -70 16 -236 -90 280 -50 16 123 109 -19 177 -151
6795 -151 27 168 156 -58 -49 -177 -68 -109 -56 169 -87 123 -123 241 279 -44 -3 -4 135 -103 -139 62 -41
6818 -41 0 -151 239 166 -63 -121 -113 257 190 -123 -51 -173 -115 22 9 265 -309 -185 132 61 34 48 99 18 -66
6843 -66 118 29 78 -117 -30 12 139 17 -46 7 -30 14 -44 57 79 -184 123 -90 -48 17 -229 41 43 -120 46
6868 46 103 115 -160 -170 178 77 -71 -203 2 68 -96 141 -104 261 -141 -36 -93 -82 107 -36 104 22 -37
$$ packed form
6701d6R0p6J48P6l23M1j9K05j08r5K7J7L11l61J77k30J74L6M4j21J15P8l30L69
6725A99l70J94N8j61J24l97L69q0J25j98K77M2m5J9k22K73j72K4R1j06k51L24
6747A17j03j12o9L07j20l02J55K10n3L2p2jJ91P1j93q2J40L5k97P6K37p6l48L06
6771D9k09L03p0n5j06K9N8K5M3l00K47r8J4Q6k52J46L70l30O6J07j4j28J96l28
6795a51J78J41j2k14Rj28J09m1N3K25k56K10k46L64L8l23M1jJ39k38l6K01j03
6818d1M1j51L90p3k29n8QL70o7l13P2j22N8J37j3K56n74J24L17p1k7J4N1q1q4
6843f6J84q9M9j95Q7M2J27j22o3N3l7M4n8J01K2k63L07k13M2O5k46K70Kj63J66
6868D6N7J2k75j0L48j01j48j32K05O6j64K37k45L65m02J05n7J1J89j43J40q2n9
$$ plain form
6891 -37 269 89 -173 -65 -120 200 113 200 67 79 84 -19 36 61 55 -6 178 183 116 -47 -189 51 -47 274 69
6916 69 155 14 159 -58 175 -6 40 50 76 -137 76 -37 -164 1 135 138 7 282 42 91 -172 -25 96
6939 96 141 126 -34 -68 -52 -21 -11 -69 -11 290 -80 98 -49 81 -3 157 -83 -167 -299 -26 90 -38 13 -167
6963 -167 -146 -83 102 -75 198 -30 -88 74 -124 -66 -64 61 -81 123 -119 -152 69 -7 147 96 133 126 292 -52
6987 -52 61 7 -139 45 128 -94 0 77 -40 -16 -138 -15 -57 -29 -134 129 254 72 -123 25 86 -77 6
7010 6 -18 171 32 4 105 0 -294 -43 -57 130 158 -28 279 -19 -80 -294 212 -148 -161 -16 -79 -34 87
7033 87 168 -223 -107 48 -105 -44 134 -171 -43 -142 21 130 16 286 -108 73 -174 84 31 85 -59 245
7055 245 152 126 194 33 -14 114 54 23 -28 36 -131 203 16 222 308 -235 84 122 56 -112 32 74 222 -42
$$ packed form
6891c7L06j80k62J08n5L20q7Q7j33J2Nj03N5K5oo1J84No7j63j42K40r8L21k05
6916F9Q6j41J45k17K33j81M6J0K6k13K13j13j27J65J34Lj31K75k40M9k63J47J21
6939I6M5j5j60l4J6L1J0n8N8L01l70J78j47J30q4J60k40q4j32K73J16j28N1j80
6963a67K1O3J85j77K73k28n8J62j98N8KJ25j42K04k42l3K21p6J54n1L7pJ66l44
6987e2J13n4j46J84Q3k22R4P7j17K4j22J23m2K8j05K63J25j82j95J48O1j63Q3
7010Fk4J89j39k8J01j05k94K51j4J87K8j86L07k98o1k14N06l60j3J45o3M5J21
7033H7Q1l91J16J55j53O1J78l05J28r9J63J09j14K70l94J81k47K58n3N4j44L04
7055B45r3k6O8j61m7J28o0l1n1O4j67L34j87K06Q6n43L19L8o6j68J44M2J48k64
$$ plain form
7079 -42 -46 -218 -3 108 -34 -261 25 8 -179 52 48 87 183 -86 -123 47 95 -56 -64 -6 93 105 -130 155 -102
7104 -102 -12 190 83 -57 -79 -3 -97 142 70 77 -122 -13 18 -36 232 -67 -107 -268 -4 -42 -42 18 -128 -253 -101
7129 -101 -88 -21 147 179 83 67 122 201 4 -14 121 257 -102 -26 214 -15 86 -101 -55 61 347 -38 -8 -381
7153 -381 -148 -147 52 -156 64 -99 95 -49 -66 283 -57 74 -94 -5 -71 65 -135 99 44 -157 112 156
7175 156 48 48 -53 -14 -7 168 130 -118 71 -77 0 2 -204 -7 -3 135 303 48 -127 220 135 -46 -5 -126
7199 -126 -1 150 -34 69 10 335 -81 20 162 -192 -94 267 -69 53 -67 143 -25 -94 106 -207 18
7220 18 97 171 17 164 86 -43 -117 -51 249 -35 -76 -41 151 171 52 65 -191 -53 86 -17 -66 -42 -2 -188
7244 -188 -164 -67 147 70 90 -204 -44 -10 60 -127 56 96 52 -74 46 5 -268 -29 82 81 43 49 -17 -179 -161
$$ packed form
7079d2mj72K15J11j42k27K86j7j87K31mL9R6k69l7J70M8j51qN8R9J2k35K85k57
7104a02R0K02j07j40k2P6r4K39p2Pj99J09L1n4K68k99m0j61K64l8%O0j46j25J52
7129a01J3O7J68L2r6j6N5P9j97j8J35J36l59P6K40k29J01j87M6J16K86l85L0l73
7153c81K33JJ99k08K20j63J94j44j7L49l40J31j68Q9o6J36k00K34n5k01K69M4
7175A56j08%j01L9PJ75l8k48J89j48P7Kk06J97MJ38J68k55j75L47q5j81M1j21
7199a26J25J51j84J03n9L25m16J01J42l54R8L61l36J22j20K10j68o9K00l13K25
7220A8P9P4j54J47p8j29p4O6L00k84m1L5J92K0j19J3k56J38J39j03m9K4M0j86
7244a88K4R7K14p7K0k94J60L4P0j87J83M0m4j26J20m1k73K39J11jl8Oo6j62J8
$$ plain form
7269 -161 -187 235 32 -116 41 113 42 24 100 13 -14 -161 163 50 -336 28 22 175 -254 -157 75 -246 -91
7292 -91 -179 83 19 -219 60 31 -143 -111 -119 105 116 63 56 -151 108 -63 -106 206 -45 170 -194 -81 410 -139
7316 -139 123 103 -105 19 -78 -108 35 -13 91 -219 -111 71 159 7 38 50 -131 -142 259 65 -181 92 43
7339 43 316 -54 26 97 -79 242 63 96 -39 37 -61 156 -173 -73 156 204 47 -157 -66 135 -47 44 155
7362 155 -74 -65 159 -76 71 67 61 4 -12 68 -91 128 -271 45 141 -39 -96 -101 301 65 43 -60 -12 335 112
7387 112 -35 59 208 -29 41 146 321 23 -9 -26 -5 -141 -46 2 48 -128 8 88 98 -22 8 410 78 -50
7411 -50 52 172 -199 14 25 -193 213 -159 -142 17 157 292 -17 9 95 6 170 -32 136 -111 -173 116
7433 116 51 220 -147 -108 -115 32 -40 -248 -125 -25 -150 -136 111 -62 119 159 39 36 29 -132 -271 268 -139 -27
$$ packed form
7269a61k6M22k03j48J57P2p1j8P6q7k7j47L24j13l86L64oJ53m29R7K32l21J55
7292i1q8K62o4k38K79k9j74L2qK24J1n3pk07K59j71m3L12k51K15l64J13M91n49
7316a39K62k0k08J24r7l0J43m8J04l10J08J82Q8j52L1J2j81j1M01j94k46K73m9
7339D3K73l70Q0P1j76L21j79L3j35P6r8K17l29J00K29M8j57k04R1K01j82R1J11
7362A55k29RK24k35J47mon7j6Q0j59K19l99L16R6j80n7nM02k36k2j03M8L47k23
7387A12j47R4J49k37P0J05J75k98l2j7K1j36R5M8M6j76J36Q0J0j20L0M02l32j28
7411e0J02J20l71K13J1k18M06l72J7J59J40J35l09K6Q6q9J64k02J68k47o2K89
7433A16o5J69l67L9pJ47p2k08J23J00j25J4K47j73J81M0j20lpj61j39N39m07J12
$$ plain form
7457 -27 17 38 89 77 -69 -5 -166 105 10 -342 27 -80 433 23 173 -71 190 -23 -114 -89 120 265 -55
7480 -55 -86 107 -54 -200 119 22 -172 71 0 114 66 -167 114 -86 -84 114 -116 48 255 -174 -42 49 -12
7503 -12 -2 -43 -51 -157 272 -345 -74 -187 148 4 68 83 147 -5 -294 36 116 -129 -16 -3 50 -69 -126 121
7527 121 52 147 -6 -124 -38 108 -13 -117 12 -24 18 118 -12 -98 95 126 -117 268 -179 4 126 42 140
7550 140 185 319 113 -228 32 47 141 171 213 73 -103 -148 65 -4 177 128 99 155 66 86 -137 -268 -224 98
7574 98 155 -73 78 55 -132 -40 -149 -44 173 -53 245 67 -13 201 0 102 147 26 135 -49 58 -118
7596 -118 -99 201 -7 -60 -71 258 -25 27 52 -215 91 233 -160 -21 22 -127 -68 60 31 146 -45 -154 66
7619 66 61 76 7 73 66 30 -163 125 90 -33 0 205 -218 1 -202 -40 7 -145 127 18 143 -49 45 -11 118
$$ packed form
7457b7M4K1N1j2j46O4j61K71r5l52L69j07N13m10J50k44K61k13r1K5K09J45l20
7480e5l1J93j61j46L19r7j94K43p1J14m8k33K81k00KJ98k30J64K07m29J32R1o1
7503a2J0m1qj06M29o17K71j13L35j44O4J5O4j52k89L30Q0k45J13J3N3j19n7K47
7527A21o9R5j53j18Q6J46j21j04J29l6M2J00j30q6J93L1k43L85m47J83J22q4R8
7550A40M5J34k06l41K60J5R4L0M2j40j76m5K13o9J81m9k9N6q9K0k23j31M4L22
7574I8N7k28J51k3j87R2j09J05K17k26K98j78q0K14k01J02M5j21J09j84J07j76
7596a18J9L00k08n3j1L29k83N2K5k67L06J42l93J39M3j49N9J28k9J15j91j09K20
7619F6nJ5o9O6pl6j93K88l5j23L3K05m23K19k03J62M7j52K72j09J25j92R4n6J29
$$ plain form
7644 118 -34 -114 -63 62 132 -12 -88 57 -36 -101 97 -273 28 94 27 69 26 134 -169 48 20 -238 8 -52
7668 -52 59 356 164 87 -15 132 -26 -103 141 49 134 236 -11 -11 20 -275 -46 -100 -89 32 149 13 -2 106
7692 106 78 163 -116 -7 233 -1 122 59 127 -163 48 -98 -70 -19 -66 16 -32 135 -30 -78 86 53 133 -97
7716 -97 55 -107 53 -120 -56 -90 122 -192 -207 10 -3 218 169 -152 -12 -74 -36 80 57 90 76 128 0 23
7740 23 187 -68 147 146 -207 -63 -54 -86 -182 -103 -48 342 -22 166 202 -155 172 -80 10 111 -72 117 -87 213
7764 213 160 -25 -176 45 33 -157 18 271 5 36 241 -37 150 -180 -41 61 -30 -200 44 144 109 78
7786 78 -12 193 -258 -142 -29 -209 -78 61 89 43 49 212 4 31 65 236 93 -74 110 -172 -70 88 46
7809 46 -164 67 165 62 -53 -101 -145 78 222 28 -57 167 -201 111 25 -45 144 -99 -59 25 12 158 -32
$$ packed form
7644A18j52q0N1J25P0j44p6J45r3o5J98l70L01O6o7M2m3J08l03K17k8k58K46o0
7668e2J11K97j92p7j02J47j58p7K44r2Q5J02k47%L1k95K29n4J1J21J17j36j5J08
7692A06k8Q5k79J09K40k34J23o3O8k90K11j46K8N1m7Q2m8J67j65m8J64l3Q0k30
7716i7J52j62J60j73O4l4K12l14j5K17j3K21m9l21J40o2L8J16k3L3j4N2j28K3
7740B3J64k55K15jl53J44Rl2r6P9N5L90l64J88L6l57L27k52R0J01j83J89k04L00
7764B13n3j85j51K21j2j90J75K53k66L1K05k78J87l30J39J02r1j70K44J00l5l1
7786G8r0K05m51J16J13j80J31J39K8m6OJ63k08K7L4J71j43j67J84k82J02J58m2
7809D6k10K31R8j03j15m8m4K23J44j94q5K24l68L12q6p0J89k43M0Q4j3J46j90
$$ plain form
7832 -32 -56 161 -92 135 -38 -80 206 -218 73 96 -18 -45 -186 -103 391 156 -204 -28 -244 73 66 -87 -37
7855 -37 -33 -158 -205 106 56 111 -142 -59 -34 -67 -5 -200 -71 206 -47 -99 -151 237 2 67 289 180 -11 109
7879 109 -103 67 211 -201 269 93 117 117 292 43 94 59 -118 19 191 229 24 34 -115 -131 87 -86 1
7902 1 115 146 31 -225 207 97 96 -231 23 -197 -249 164 241 -62 -24 -42 -40 25 7 55 3 129 64 60 159 160 -178
7929 -178 137 -4 -138 156 103 99 31 -74 -25 256 127 -70 -29 18 -11 56 238 -139 -107 133 148 74 217 -120
7953 -120 -151 -92 -60 226 181 86 -95 65 -53 5 15 -110 175 -6 -37 22 140 -29 -82 18 -135 -57 113 -131
7977 -131 -290 -229 -46 34 109 45 -231 -68 300 79 27 196 149 6 129 -75 -4 -89 -66 -144 -150 4 -83 277
8001 277 -64 -56 -64 -21 -143 8 114 216 25 -204 -87 162 -161 -113 -15 32 175 -67 -42 -199 91 -14 -155
$$ packed form
7832c2k4K17k53K27j73m2K86m24K91K3j14k7j41Q3M94k35l60J76k16L17pj53N0
7855c7Mj25m7L11n0N5k53Q3K5l3O2j95J29K77k53n2n2L88k35O5K22j09j91J20
7879A09k12J70J44m12M70j76K4%J75k49N1l5j77J37J72L8k05J0j49j6K18j73Q7
7902AJ14L1j15k56M32j10jl27K54k20n2M13P7l03L8j8KO5j8M8n2J26o5mR9Jl38
7929a78L15j41j34K94n3mo8j05M9K81j29j97M1M7k9O7J82l77L2K40J5p4J43l37
7953a20l1N9L2K86m5r5j81J60j18N8J0j25K85j81l1N9J18j69n3J00j53P8J70k44
7977a31j59O1J83Q0P5o4k76J63L68k21n2J69m7j43J23k04P1q5K3p8oJ54q7L60
8001B77l41QqM3j22J51J06J02j91k29J17K49l23M8R8M7J43k42K5j57K90j05j41
$$ plain form
8024 -155 125 22 -91 93 171 75 133 94 -123 -17 -173 -28 -98 -228 97 -161 60 83 123 -24 -199 101
8046 101 169 -67 156 23 63 -240 7 96 56 228 75 -83 128 13 155 12 239 -150 283 -18 -14 42
8068 42 -75 -155 -130 80 -23 41 -147 -89 51 -53 -82 109 248 298 -41 164 -127 -174 -80 1 -64 17 21 -126 172
8093 172 124 6 -186 -27 83 -73 -2 -63 -323 158 113 6 -7 -289 163 -28 -27 26 -325 15 233 -98 -13
8116 -13 -105 156 111 102 148 91 55 94 -91 -2 4 130 27 -117 -22 128 -16 -25 76 92 72 116 87 -104 315 -258
8142 -258 66 -58 -25 112 32 20 -155 67 44 150 -35 -88 266 254 54 215 54 -70 97 -50 108 -101
8164 -101 -6 70 -56 35 145 52 85 104 -158 -25 -36 21 -368 17 57 -140 -20 286 179 -51 -138 -49 -69 -38
8188 -38 130 88 -9
$$ packed form
8024a55K80j03j13J84P8r6N8l9k17J06j56J45p0j30L25k58K21K3M0j47j75L00
8046A01O8k36K23j33M0l03K47Q9m0J72j53j58K11j15J42j43K27l89M33l01MN6
8068D2j17q0K5K10j03O4j88N8J40j04k9J91J39N0l39K05k91m7R4Q1o5Q1Mj47K98
8093A72m8j18j92J59J10j56P1o1k60M81m5j07j3k82M52j91JN3l51L40K18l31Q5
8116a3r2K61m5rM6n7l6L9j85Q9OJ26j03j44R5J50j44rJ01J6k0M4k9j91M19n73
8142b58L24j24L3J37q0j2j75K22k3J06j85n3L54j2k00J61j61j24J67j47J58k09
8164a01R5P6j26R1J10r3L3J9k62J33j1N7l89L85M0j97J20L06j07k30q7Q9k0L1
8188c8J68m2r7
8191i
$$ Imaginary data points
##PAGE= N=2
##DATA TABLE= (X++(I..I)), XYDATA
$$ plain form
0 0 0 0 0 0 0 0 0 0 0 0 0 -8 8 -8 8 -8 16 -16 17 -24 32 -33 40 -48 56 -66 77 -89 105 -119 136 -154 175 -198
34 -198 224 -254 285 -320 357 -397 441 -492 545 -604 667 -737 813 -897 989 -1090 1201 -1322
52 -1322 1456 -1607 1777 -1967 2184 -2431 2722 -3063 3473 -3975 4607 -5434 6561 -8199 10796
67 10796 -15571 27186 -115570 -60764 120798 -174660 -85985 310582 160988 -198580 113189
78 113189 334610 -43729 -113694 278885 164925 -208484 -66756 211407 93595 -53997
88 -53997 23704 105285 -8869 -189002 -129841 107387 23806 -240130 -91894 139665 -111012
99 -111012 -241968 111163 137003 -243804 -166480 150831 2642 -166625 91026 218482
109 218482 -9822 -84739 90353 148516 30137 -34230 69425 142006 -15420 -104187 122931
$$ packed form
0@%%%%%%%%%%%qJ6j6J6j6K4l2L3m1N6o5P3q8J04j22J43j66J94k24K55k90L29l73
34a98M22m78N39o05O77p54Q38r33J037j149J271j404J550j710J886k079K291k523
52a322K778l063L384l744M151m615N153n785O536p448Q582j0041J1995j4760J8995
67A0796k6367M2757j42756N4806J81562k95458Q8675L96567j49594l59568L11769
78A13189K21421l78339o9965L92579j13960l73409J41728K78163j17812j47592
88e3997P7701Q1581j14154j80133N9161K37228q3581k63936J48236K31559k50677
99a11012j30956L53131K5840l80807P7324L17311j48189j69267K57651J27456
109B18482k28304p4917J75092N8163j18379o4367J03655P2581j57426q8767K27118
$$ plain form
120 122931 189355 -101239 -129050 132274 26656 -227719 -38993 160975 -71622 -196940
130 -196940 27170 71599 -120074 -110180 50608 33070 -103537 -97143 49158 78414 -48678
141 -48678 -32289 137155 85465 -102552 5396 191523 36287 -107163 79794 141682 -76722
152 -76722 -83153 123151 82899 -101994 -56351 71276 2463 -107546 -42649 57577 -12506
163 -12506 -122039 -42884 75857 -16160 -112913 18120 86748 -75124 -103099 76309 70928
174 70928 -82580 -18096 123210 37073 -64614 42959 119851 7959 -59675 33791 78613
185 78613 -23475 -64922 42964 71445 -55395 -77441 48362 33700 -103284 -62521 65671
196 65671 -4157 -106486 -4939 79196 -24980 -74428 32540 53621 -53606 -57764 50395
$$ packed form
120A22931O6424k90594k7811K61324j05618k54375J88726J99968k32597j25318
130a96940K24110M4429j91673R894J60788j7538j36607O394J46301K9256j27092
141d8678J6389J69444n1690j88017J07948J86127j55236j43450J86957O1888k18404
152g6722o431K06304m0252j84893M5643J27627o8813j10009O4897J00226p0083
163a2506j09533P9155J18741r2017r6753J31033O8628j61872k7975J79408n381
174G0928j53508O4484J41306q6137j01687J07573P6892j11892o7634R3466M4822
185G8613j02088m1447J07886K8481j26840k2046J25803j4662j36984M0763J28192
196F5671o9828j02329J01547Q4135j04176m9448J06968K1081j07227m158J08159
$$ plain form
207 50395 50926 -43031 -22081 81094 54045 -46596 -1964 91156 18298 -74024 12081 83327
219 83327 -19738 -68873 41025 63431 -54264 -64196 37141 20024 -78215 -48575 43586
230 43586 9658 -66035 -11259 65746 4035 -63904 8382 61482 -24118 -61197 36111 59990
242 59990 -35359 -32674 66447 46057 -47543 -13231 66743 15503 -58155 947 63277 -2651
254 -2651 -54735 14256 49683 -32487 -63117 17063 29174 -54422 -47979 41028 26573 -49630
266 -49630 -14850 54791 7677 -50795 5701 51324 -10922 -40733 29566 50179 -20516 -30905
278 -30905 37089 31211 -40379 -26165 41992 16794 -44495 -3820 54860 5250 -46244 7163
290 7163 40076 -25938 -51501 13644 26134 -36861 -32514 33273 21595 -37174 -13315 40986
$$ packed form
207E0395N31r3957K0950J03175k7049j00641M4632R3120p2858r2322Q6105P1246
219H3327j03065m9135J09898K2406j17695r932J01337j7117r8239K9640R2161
230D3586l3928p5693N4776P7005o1711o7939P2286N3100q5600l7079R7308K3879
242E9990r5349K685R9121k0390r3600L4312P9974n1240p3658N9102O2330o5928
254b651n2084O8991L5427q2170l0630Q0180J2111q3596O443Q9007j4455p6203
266d9630L4780O9641m7114n8472N6496M5623o2246k9811P0299K0613p0695j0389
278c0905O7994n878p1590J4214O8157k5198o1289M0675N8680m9610n1494N3407
290G163L2913o6014k5563O5145J2490o2995M347O5787j1678n8769K3859N4301
$$ plain form
302 40986 7880 -38930 4060 45919 -2367 -33735 20847 42144 -18635 -31664 28847 28641
314 28641 -34406 -24234 35377 14290 -41325 -11725 37261 -191 -41003 3933 37834 -11414
326 -11414 -36037 15275 29048 -25053 -30748 22018 18658 -30535 -13389 38595 17727 -26656
338 -26656 2127 38881 -552 -35001 5550 28559 -17361 -30726 19600 27191 -22731 -23572 23178
351 23178 14575 -30935 -16668 26346 7764 -28363 92 33852 26 -29902 5396 24650
363 24650 -15702 -27727 14515 19960 -18055 -11139 28332 16099 -19197 -2421 27290 5687
375 5687 -21023 4649 27190 -2067 -23223 5693 17066 -20992 -30400 6902 8882 -27089 -17169
388 -17169 21950 10652 -20441 -2013 22753 -369 -19354 5629 20584 -4509 -13957 13241
$$ packed form
302D0986l3106m6810M2990M1859m8286l1368N4582K1297o0779j3029O0511k06
314B8641o3047J0172N9611k1087n5615K9600M8986l7452m0812M4936L3901m9248
326a1414k4623N1312J3773n4101n695N2766l360m9193J7146N1984k0868m4383
338b6656K8783L6754l9433l4449M0551K3009m5920j3365N0326P591m9922q41M6750
351B3178q603m5510J4267M3014j8582l6127K8455L3760l3826k9928L5298J9254
363B4650m0352j2025M2242N445l8015O916L9471j2233l5296J6776K9711k1603
375E687k6710K5672K2541k9257k1156K8916J1373l8058r408L7302J980l5971R920
388a7169L9119j1298l1093J8428K4766k3122j8985K4983J4955k5093r448K7198
$$ plain form
400 13241 21040 -7144 -11126 17574 14436 -17298 -8231 23050 7254 -19910 4215 26129 -4593
413 -4593 -23391 5157 13514 -16725 -20835 5525 5042 -20084 -16387 11370 8526 -16522 -8929 18614
427 18614 7525 -16932 3302 26206 -1341 -19350 10627 19213 -11732 -10295 20638 14041 -13074
440 -13074 -4174 17319 6625 -12675 -3103 14799 2008 -19060 -4213 17248 -2881 -23220
452 -23220 368 11389 -20612 -23856 11192 9864 -16754 -4082 18509 3764 -9942 6993
464 6993 16888 901 -10232 1095 11696 2041 -6050 9999 17969 -7696 -16694 9452 10567
477 10567 -15861 -6712 16338 -1652 -18797 4166 16167 -4972 -12574 -1498 -4867 -16437 -11264
490 -11264 3272 7462 -1320 -3973 8593 11474 -2244 858 16149 3290 -15603 1007 17422
$$ packed form
400A3241P799k8184l982K8700l138l1734R067L1281j5796k7164K4125K1914l0722
413d593j8798K8548Q357l0239m110K6360m83k5126L697K7757k844k5048P593K7543
427A8614j1089k4457K0234K2904k7547j8009K9977Q586l0945J437L0933o597k7115
440a3074Q900K1493j0694j9300R572J7902j2791k1068J4847K1461k0129k0339
452b3220K3588J1021l2001l244L5048j328k6618J2672K2591j4745j3706J6935
464F993R895j5987j1133J1327J0601r655q091J6049P970k5665q998K6146J115
477A0567k6428R149K3050j7990j7145K2963J2001k1139p602J1076l369j1570N173
490a1264J4536M190q782k653J2566K881j3718L102J5291j2859j8893J6610J6415
$$ plain form
503 17422 2229 -2363 16132 9891 -14962 -11539 5306 125 -10080 -3835 3745 -2500 -7614 1170
517 1170 11299 1835 -14476 -11664 -3105 -11067 -12560 7309 13717 -4804 -6463 11228 8469 -4789
531 -4789 4838 15252 303 -8981 7752 18092 7393 3054 8280 849 -14350 -14149 -983 3415
545 3415 -4202 -6187 1757 3023 -6450 -3212 9154 -533 -20699 -14763 924 -4619 -5174 13189
559 13189 13216 -6464 -6476 6306 2709 -2523 4257 7191 2109 1968 8115 16514 16046 3043 -5263 -1459
575 -1459 -7808 -17096 -2693 9930 -5911 -12793 3921 3495 -8592 646 7084 -9556 -15550 -3621
589 -3621 -818 -1612 5508 6059 870 -204 -2679 -1930 7129 4369 -4427 4095 10924 -338 3197 19751
605 19751 9097 -7669 1216 4816 -10508 -7249 6479 -2531 -11577 -3157 -777 -5966 -2888 -2297
$$ packed form
503A7422j5193m592J8495o241k4853L423J6845n181j0205O245P580o245n114Q784
517A170J0129r464j6311K812Q559p962j493J9869O408j8521j659J7691k759j3258
531d789R627J0414j4949r284J6733J0340j0699m339N226p431j5199K01J3166M398
545C415p617j985P944J266r473L238J2366r687k0166N936J5687n543n55J8363
559A3189K7j9680j2J2782l597n232O780K934n082j41O147Q399m68j3003q306L804
575a459o349r288J4403J2623j5841o882J6714m26j2087R238O438j6640n994J1929
589c621K803p94P120N51n189j074k475P49R059k760q796Q522O829j1262L535J6554
605A9751j0654j6766Q885L600j5324L259J3728r010r046Q420K380n189L078N91
$$ plain form
619 -2297 -5267 -3511 -4750 -6621 4363 7525 -3998 -86 11527 -874 -9378 7203 8410 -7292
633 -7292 272 14287 3091 -1745 11431 9863 -946 341 469 -4715 -3253 -3525 -5921 212 576
648 576 -9185 -3244 5706 -7127 -12452 2030 -497 -12770 -1529 9624 -532 -1522 9309 4109
662 4109 -4304 408 958 -2300 1578 2511 1186 7936 9107 2364 6498 10071 -1996 -6163 3071
677 3071 -1573 -10072 -1248 3193 -6519 -4852 1558 -4765 -8722 -3414 -4436 -6489 -559 931 162
692 162 5806 6078 952 3509 4359 -2924 -2658 3777 -24 -1993 6016 6183 496 3989 6524 -341
708 -341 -2443 1309 -1616 -4283 -608 174 -1323 -583 -1396 -4323 -3787 -4667 -7158 -3993 -248 -1917 -135
725 -135 5790 5244 1741 4383 4264 -1018 -2611 674 626 -991 1192 2901 2929 1643 706 1066 1319 -1840
$$ packed form
619b297k970J756j239j871J0984L162j1523L912J1613j2401q504J6581J207j5702
633g292P564J4015j1196m836J3176j568j0809J287J28n184J462k72k396O133L64
648E76r761N941Q950j2833n325J4482k527j2273J1241J1153j0156r90J0831n200
662D109q413M712N50l258L878R33j325O750J171o743M134L573j2067m167R234
677C071m644q499Q824M441r712J667O410o323l957N308j022k053N930J490p69
692A62N644K72n126K557Q50p283K66O435l801j969Q009J67n687L493K535o865
708c41k102L752k925k667L675P82j497P40q13k927N36q80k491L165L745j669J782
725a35N925n46l503K642j19n282j593L285m8j617K183J709K8j286r37L60K53l159
$$ plain form
743 -1840 -3041 701 1634 -1547 -111 3312 -263 -4521 -2941 -2146 -5697 -6446 -1875 -85 -811 717
759 717 3725 3862 1695 1416 2985 2358 -53 221 3161 2532 -290 1159 2729 -122 -2808 -1028 -189
776 -189 -1789 -1999 456 1115 -215 11 463 -280 -2167 -3357 -2640 -2922 -3244 -1793 572 986 422 1938
794 1938 2496 1457 1025 1598 1117 75 277 1004 795 845 1478 998 292 -38 -219 -1509 -1729 -624 21
813 21 -176 473 1738 2116 259 -838 -789 -2181 -4478 -4101 -2320 -2101 -2243 571 2670 2330 1851 2641
831 2641 2600 411 -481 557 1134 -73 417 2103 1999 -1 -673 -598 -1861 -3096 -2033 46 831 674
849 674 2203 2842 1187 -116 -471 -1361 -2365 -2789 -1749 -485 -57 -57 396 1290 256 -936 -48 879
867 879 449 655 2642 3061 1866 683 459 -1070 -2623 -3351 -2842 -1210 -502 219 1848 3252 1084
$$ packed form
743a840j201L742R33l181J436L423l575m258J580P95l551p49M571J790p26J528
759G17L008J37k167k79J569o27k411K74K940o29k822J449J570k851k686J780Q39
776a89j600k10K455O59j330K26M52p43j887j190P17k82l22J451K365M14n64J516
794A938N58j039m32N73m81j042K02P27k09N0O33m80p06l30j81j290k20J105O45
813B1j97O49J265L78j857j097M9j392k297L77J781K19j42K814K099l40m79P90
831B641m1k189q92J038N77j207M90J686j04k000o72P5j263j235J063K079P85j57
849F74J529O39j655j303l55q90j004m24J040J264M28%M53Q94j034j192Q88R27
867H79m30K06J987M19j195j183k24j529j553p28N09J632P08P21J629J404k168
$$ plain form
884 1084 -55 417 -310 -2434 -1657 179 -207 -472 993 1034 -182 -785 -1424 -1403 -936 -1112 -188 2467 3101
903 3101 1520 2631 3340 486 -1224 -457 -1563 -3185 -1344 -102 -835 118 1024 -825 -698 614 -494
920 -494 -476 1509 584 -721 852 1083 -1455 -553 90 -1750 -1973 -194 -1228 -288 2364 1001 -276
937 -276 2088 1574 -1316 940 3041 -555 -944 1981 -280 -1688 664 -192 -1864 -195 -182 -1449 1488
954 1488 2906 -325 1004 2286 -2070 -3123 1195 -303 -3468 -79 817 -3387 -1610 2085 -758
969 -758 -1070 1722 -765 -1682 3009 2573 322 3746 2362 -3454 -873 1844 -2409 -2092 2217 -839
985 -839 -2951 2335 2494 -438 2635 2057 -3823 -1545 1757 -1700 -480 4389 -743 -4790 530 535 -3460
1002 -3460 -127 1512 -3809 -2237 2618 30 1001 5028 349 -3287 1023 -264 -4075 1705 3191
$$ packed form
884A084j139M72p27k124P77J836l86k65J465M1j216o03o39K1M67j76R24K655O34
903C101j581J111P09k854j710P67j106j622J841J242p33R53R06j849J27J312j108
920d94J8J985r25j305J573K31k538R02O43j840k23J779j034R40K652j363j277
937b76K364n14k890K256K101l596l89K925k261j408K352q56j672J669J3j267K937
954A488J418l231J329J282m356j053M318j498l165L389Q96m204J777L695k843
969g58l12K792k487r17M691m36k251L424j384n816K581K717m253L17M309l056
985h39k112N286J59k932L073n78n880K278L302l457J220M869n132m047N320Nl995
1002c460L333J639n321J572M855k588R71M027m679l636M310j287l811N780J486
$$ plain form
1017 3191 -4094 -2049 3820 -573 -1398 6085 3021 -3844 646 2251 -1951 1735 5109 -1641 -2592
1032 -2592 1243 -3765 -4544 2558 150 -5726 -109 1454 -4003 1202 6623 -408 -2240 2888 -1709
1047 -1709 -4591 3459 2587 -4050 772 2293 -4592 -910 5562 -810 -3249 2997 -726 -4011 5016
1062 5016 6352 -1101 1920 3487 -4179 -2355 3665 -2506 -5316 1344 -2475 -6857 2450 5138 -2994
1077 -2994 410 4017 -4478 -4268 3884 388 -2642 3787 1281 -3771 2668 4420 -2110 142 3217
1092 3217 -4816 -3814 4996 1519 -2195 5111 3209 -4703 287 3526 -3930 -3025 1624 -3983 -4483
1107 -4483 2512 611 -2850 3321 2612 -4501 -582 3139 -2819 -1332 5065 201 -2987 2827 1842
1122 1842 -3084 1315 2241 -3540 -422 3149 -883 229 5883 1519 -2380 2750 737 -4986 -1103
$$ packed form
1017C191p285K045N869m393q25P483l064o865M490J605m202L686L374o750r51
1032b592L835n008p79P102k408n876N617J563n457N205N421p031j832N128m597
1047a709k882Q050q72o637M822J521o885L682O472o372k439O246l723l285R027
1062E016J336p453L021J567p666J824O020o171k810O660l819m382R307K688q132
1077b994L404L607q495K10Q152l496l030O429k506n052O439J752o530K252L075
1092C217q033J002Q810l477l714P306j902p912M990L239p456R05M649n607n00
1107d483O995j901l461O171p09p113L919L721n958J487O397m864l188N814r85
1122A842m926M399R26n781L118L571m032J112N654m364l899N130k013n723L883
$$ plain form
1137 -1103 1724 -3631 -2739 2007 -1453 -2432 2249 515 -3229 -32 32 -3112 810 4398 297 909
1153 909 4230 215 -1899 2213 433 -4064 -492 1500 -1790 617 4611 1298 172 2841 54
1168 54 -3240 164 131 -3159 -907 1034 -1965 -1296 1863 -991 -2636 -229 -1629 -3162 460 1957
1184 1957 -121 2156 3650 251 100 2746 -614 -2512 820 479 -2019 537 2483 -251 258 1810
1200 1810 -122 -1258 13 -1130 -1610 544 -406 -1360 651 221 -2531 -1172 132 -2243 -2468 660
1216 660 751 -409 2253 2628 1323 1472 1599 122 -50 435 -592 -317 746 -371 -508 1001 534 -530
1234 -530 48 275 -1440 -999 38 -452 -578 63 66 -675 -440 -1198 -1495 -859 -1318 -1135 -97 1246 1322 1551
1254 1551 2397 1941 1342 1066 578 115 132 -120 -344 522 579 -196 -7 493 -797 -1681 -1012 -925 -521 -217
$$ packed form
1137a103K827n355Q92M746l460r79M681j734l744L197O4l144L922L588m101O12
1153I09L321m015k114M112j780m497L572J992l290K407L994l313j126K669k787
1168E4l294L404l3l290K252J941k999O69L159k854j645K407j400j533L622J497
1184A957k078K277J494l399j51K646l360j898L332l41k498K556J946k734N09J552
1200A810j932j136J271j143m80K154r50r54K011m30k752J359J304k375k25L128
1216F60R1j160K662L75j305J49J27j477j72M85j027K75J063j117j37J509m67j064
1234e30N78K27j715M41J037m90j26O41Lp41K35p58k97O36m59J83J038J343P6K29
1254A551Q46m56n99k76m88m63J7k52k24Q66N7p75J89N00j290q84O69Q7M04L04
$$ plain form
1274 -217 591 675 196 -60 -461 -1325 -2266 -2161 -1555 -874 -537 348 1423 1685 1327 1249 838 7 -260 197
1294 197 663 862 1338 1541 1838 903 170 -931 -1151 -956 -1137 -948 547 945 671 803 437 -444 -1710
1313 -1710 -2084 -1514 -1621 -1503 -818 325 966 485 756 1438 603 -573 -139 245 39 265 1147 1411 758
1332 758 226 93 -9 -856 -1389 -505 -6 -155 630 1832 1600 663 211 388 -452 -1532 -1286 -1210 -1345 -1407
1352 -1407 -776 -340 -226 -410 -97 98 -31 118 495 1056 1264 1356 1533 1114 352 -258 -395 -1100 -1188 -1097 -330
1373 -330 97 451 631 605 555 110 -186 -866 -269 -554 -943 65 775 177 21 -139 -498 -690 -1145 -890
1393 -890 -460 -45 617 1589 2014 1074 694 486 245 -1288 -1258 -570 -73 -126 183 850 524 165 678 -258
1413 -258 -649 -894 -796 -212 106 -111 -151 543 -289 -792 -530 -253 -397 -341 391 787 1230 1396 1265 1443 1018
$$ packed form
1274b17Q08Q4m79k56m01q64r41J05O06O81L37Q85J075K62l58p8m11q31k67M57
1294A97M66J99M76K03K97r35p33j101k20J95j81J89J495L98k74J32l66q81j266
1313a710l74N70j07J18O85J143O41m81K71O82q35j176M34L84k06K26Q82K64o53
1332G58n32j33j02q47n33Q84M99j49P85J202k32r37m52J77q40j080K46P6j35o2
1352a407O31M36J14j84L13J95j29J49L77N61K08R2J77m19p62o10j37p05q8R1P67
1373c30M27L54J80k6n0m45k96o80N97k85l89J008P10n98j56j60l59j92m55K55
1393h90M30M15O62R72M25r40l80k08k41j533L0O88M97n3L09O67l26l59N13r36
1413b58l91k45R8N84L18k17m0O94q32n03K62K77j44N6P32L96M43J66j31J78m25
$$ plain form
1434 1018 160 -484 -284 -110 -783 -200 268 -485 -1114 -141 92 -740 -456 -91 -216 -427 -17 288 121 119
1454 119 -504 -929 -317 -918 -1041 547 798 -237 368 1411 1241 761 1848 1601 239 -27 206 -44
1472 -44 -33 427 -777 -742 -654 -1291 -597 160 -507 -1241 -460 -134 -743 492 1152 -111 -634 -20 -648 -731 691
1493 691 273 -528 -76 315 -69 773 1833 1300 388 461 2 -33 643 819 -301 -675 -1138 -1554 -297 -106
1513 -106 -1003 -766 -267 -1384 -1145 687 1095 289 -155 326 -237 -504 348 826 314 -137 -189 26 391 869
1533 869 969 1071 465 -429 54 998 582 -5 -149 -316 -1481 -1438 -165 -161 -817 -828 -1184 -1144 -556 331 645
1554 645 762 690 -94 -66 794 860 101 379 -139 -1167 -799 721 862 883 978 473 -382 152 550 296 107
1575 107 -47 -819 -637 569 45 -575 229 -790 -2183 -1344 -234 -602 -97 882 385 -48 669 1201 299
$$ packed form
1434A018q58o44K00J74o73N83M68p53o29R73K33q32K84L65j25k11M10L05j67k
1454A19o23m25O12o01j23J588K51j035O05J043j70m80J087k47j362k66K33k50
1472d4J1M60j204L5Q8o37O94P57o67p34P81L26o09J235O60j263n23O14o28q3J422
1493F91m18q01M52L91l84Q42J060n33r12P3m59l5O76J76j120l74m63m16J257J91
1513a06q97K37M99j117K39J832M08q06m44M81n63k67Q52M78n12m51n2K15L65M78
1533H69J00J02o06q94M83R44m16n87j44j67j165M3J273Mo56j1l56M0N88Q87L14
1554F45J17p2p84K8Q60O6p59K78n18j028L68J520J41K1R5n05q55N34L98k54j89
1575A07j54p72J82J206n24o20Q04j019j393Q39J110l68N05R79m97m33P17N32r02
$$ plain form
1594 299 961 168 -808 -12 655 -733 307 1150 59 -769 261 234 -692 139 174 -936 -557 583 -430
1613 -430 -487 779 -386 -1377 -26 -31 -1058 17 1300 191 89 1052 527 -198 919 442 -1015 -67
1631 -67 -63 -766 313 727 -654 -409 824 -504 -1217 653 484 -1227 168 1250 -259 -436 765 -382
1649 -382 -1179 -222 -1121 -1373 39 436 -396 1298 2294 -81 306 2035 357 -999 971 563 -914
1666 -914 87 1198 -1040 -508 558 -1424 -1676 -311 -850 -1653 622 778 -346 891 1310 -516 -436
1683 -436 543 -1030 -1107 451 -47 -759 830 978 -171 874 1061 -742 -187 1288 -40 -243 1425
1700 1425 723 -859 187 686 -726 -568 -104 -1008 -705 169 -336 -85 1161 380 -889 423 403 -896
1718 -896 -175 518 -988 -830 658 202 -458 675 688 -202 235 371 -163 380 719 -107 164 887 48
$$ packed form
1594B99O62p93r76P96O67j388J040Q43j091q28J030k7r26Q31L5j110L79J140j013
1613d30n7J266j165r91J351nj027J075J283j109j02R63n25p25J117m77j457R48
1631f7Mp03J079M14j381K45J233j328p13J870j69j711J395J082j509j77J201j147
1649c82p97R57q99k52J412L97q32J694R96k375L87J729j678j356J970m08j477
1666i14J001J111k238N32J066j982k52J365n39q03K275J56j124J237M19j826Q0
1683d36R79j573p7J558m98p12J589J48j149J045J87j803N55J475j328k03J668
1700A425p02j582J046M99j412J58M64r04L03Q74n05K51J246p81j269J312k0j299
1718h96P21O93j506J58J488m56o60J133J3q90M37J36n34N43L39q26K71P23q39
$$ plain form
1737 48 -855 225 -312 -1193 -802 -389 -324 -252 497 238 495 365 387 69 181 145 -712 -470 238 -238 -34
1758 -34 745 648 -143 -218 -176 -379 -491 200 333 385 614 644 518 99 -554 -812 -713 -497 -1130 88 581 144
1780 144 28 750 599 -286 -182 152 54 -281 116 507 461 510 167 -139 -56 -669 -564 -278 442 166 578
1801 578 698 745 404 -17 -348 -735 -661 -824 -830 -339 266 422 498 528 270 -79 -123 -41 -189 -142 366 281 336 531
1825 531 670 57 -414 -534 -323 -142 -682 -152 537 834 144 577 520 198 -432 -390 -148 -572 -837 -141 259
1846 259 -359 -65 121 185 -147 -268 -245 112 149 235 922 494 115 432 -18 -332 -640 -653 -357 -281 280 467
1868 467 491 351 251 -36 -62 -276 -562 -169 -60 -107 -79 197 79 102 -507 -259 -378 -328 -411 -2 752 932
1890 932 589 802 633 142 -204 -375 -266 -401 -549 -308 207 174 -121 112 -464 -265 -351 -717 -255 -227 -166
$$ packed form
1737D8r03J080n37q81L91M13O5P2P49k59K57j30K2l18J12l6q57K42P08m76K04
1758c4P79r7p91p5M2k03j12O91J33N2K29L0j26m19o53k58R9K16o33J218M93m37
1780A44j16P22j51q85J04L34r8l35L97L91m6M9l43l06Q3o13J05K86P20k76M12
1801E78J20M7l41m21l31l87P4j63oM91O05J56P6L0k58l49m4Q2j48M7N08q5N5J95
1825E31J39o13m71j20K11J81n40N30O89K97o90M33n7l22o30M2K42m24k65O96M00
1846B59o18K94J86O4l32j21K3L57L7Q6O87m28l79L17m50l14l08j3K96P6N61J87
1868D67K4j40j00k87k6k14k86L93J09m7K8K76j18K3o09K48j19N0q3M09P54J80
1890I32l43K13j69m91l46j71J09j35j48K41N15l3k95K33n76J99q6l66M62K8O1
$$ plain form
1911 -166 106 202 -5 135 338 -3 -380 -152 -226 -285 312 583 908 924 509 303 345 111 -308 -231 108 -554
1933 -554 -262 122 27 -24 31 -319 -413 -228 -337 -585 -141 537 -366 -418 241 -80 -631 -237 -172 -726 -410 410
1955 410 401 684 972 465 85 617 23 -294 159 -129 -404 8 351 -666 -101 656 -354 -994 -460 4
1975 4 -580 119 816 302 333 766 196 130 553 -140 -701 169 259 -346 605 963 -23 36 706 -420 -342 632
1997 632 -119 -783 262 -20 -619 -14 437 -843 -559 -81 -982 -1154 654 265 -547 200 468 -284 381
2016 381 787 -279 72 494 -492 -432 1209 112 -825 654 601 -768 -92 1080 -134 -564 346 -155
2034 -155 -710 172 -321 -869 -19 -260 -1263 -394 147 -707 -555 825 17 -309 1131 683 -96 761 944
2053 944 -248 -274 846 -139 -150 808 251 -392 626 288 -650 -71 282 -954 -586 639 -386 -857 383
$$ packed form
1911a66K72R6k07J40K03l41l77K28p4n9N97K71L25J6m15k06M2k34m19P7L39o62
1933e54K92L84r5n1N5l50r4J85j09k48M44O78r03n2O59l21n51L94O5n54L16Q20
1955D10rK83K88n07l80N32n94l17M53k88k75M12L43j017N65P57j010o40N34M64
1975Dn84O99O97n14L1M33n70o6M23o93n61Q70R0o05R51L58r86N9O70j126P8R74
1997F32p51o64J045k82n99O05M51j280K84M78r01j72J808l89q12P47K68p52O65
2016C81M06j066L51M22r86O0J641j097r37J479n3j369O76J172j214m30R10n01
2034a55n55Q82m93n48Q50k41j003Q69N41q54J52J380q08l26J440m48p79Q57J83
2053I44j192k6J120r85j1R58n57o43J018l38r38N79L53j236L68J225j025m71J240
$$ plain form
2072 383 -22 -679 -277 -282 -1278 -2 360 -662 164 1389 -54 -377 955 797 -623 569 724 -652
2090 -652 23 615 -305 -37 925 -333 -623 510 -10 -806 359 578 -773 -251 450 -1099 -818 704
2108 704 -284 -1407 18 24 -839 225 900 11 365 702 -279 -292 1326 545 -94 360 310 -679 154 731
2128 731 -466 -207 -35 -900 -547 807 180 -450 246 94 -895 -34 683 -484 -533 26 -506 -980 407
2147 407 660 1 665 491 -327 224 785 -9 471 583 -230 -378 932 666 -589 43 50 -1072 -972 313
2167 313 -44 -554 85 -289 -410 295 289 -338 44 46 -968 -724 404 56 -91 653 306 -283 237 469 1
2188 1 367 700 81 -245 345 251 -113 397 294 -860 -499 78 -283 -270 43 -210 -648 -15 240 -208 59
2209 59 153 -167 -408 6 -488 236 365 97 -471 -3 220 -164 404 639 -199 -477 60 155 -5 525 199
$$ packed form
2072C83m05o57M02nr96J276L62j022Q26J225j443l23J332j58j420J192J55j376
2090f52O75N92r20K68R62j258k90J133n20p96J165K19j351N22P01j549K81J522
2108G04r88j123J425Oq63J064O75q89L54L37r81j3J618p81o39M54n0r89Q33N77
2128G31j197K59J72q65L53J354o27o30O96j52r89Q61P17j167m9N59n32m74J387
2147D07K53o59O64j74q18N51N61p94M80J12q13j48J310k66j255O32Pj122J00J285
2167C13l57n10O39l74j21P05oo27L82Kj014K44J128l48j47P44l47n89N20K32m68
2188AL66L33o19l26N90r4l64N10j03j154L61N77l61J3L13k53m38O33K55m48K67
2209E9R4l20k41M14m94P24J29k68n68M68K23l84N68K35q38k78N37R5j60N30l26
$$ plain form
2230 199 -394 -305 -205 -472 -15 27 -96 -131 43 -273 237 363 8 -130 84 24 -168 -98 166 -200 -88 237
2252 237 -137 -66 202 -253 -205 -45 69 171 -127 432 396 115 -142 -96 -290 -192 -241 -109 100 3 -43 149 325
2275 325 -48 -163 -59 215 -219 -150 156 -16 29 183 78 -53 -265 -110 -101 -336 -337 202 289 33 77 77 230
2298 230 -249 -167 -33 -292 -274 -149 138 237 81 383 220 251 45 99 -209 -80 5 195 -20 146 216 -256
2320 -256 95 -146 -158 -289 -168 -124 131 132 430 337 332 118 255 1 -25 -102 -37 -17 -135 -25 90 -107 -3 -164
2344 -164 14 -24 -176 83 283 149 -45 594 294 51 -293 94 -347 -273 -138 -217 -85 125 -55 127 -16
2365 -16 -115 -50 71 88 160 -7 188 380 -34 18 -46 -159 14 -193 -270 -13 36 -25 333 3 268 -92 -293
2388 -293 -260 -175 -488 -44 162 161 264 180 -22 252 294 74 146 -257 -118 158 76 164 158 542 375 -74 -15 9
$$ packed form
2230A99n93Q9J00k67M57M2j23l5J74l16N10J26l55j38K14o0j92P0K64l66J12L25
2252B37l74P1K68m55M8J60J14J02k98N59l6k81k57M6j94R8m9J32K09r7m6J92J76
2275C25l73j15J04K74m34O9L06j72M5J54j05j31k12J55Rk35jN39Q7k56M4%J53
2298B30m79Q2J34k59J8J25K87R9j56L02j63L1k06N4l08J29Q5J90k15J66P0m72
2320b56L51k41j2j31J21M4K55JK98r3nk14J37k54k6p7O5K0j18J10J15j97J04j61
2344a64J78l8j52K59K00j34j94O39l00k43l44L87m41P4J35p9J32K10j80J82j43
2365a6r9O5J21J7P2j67J95J92m14N2o4j13J73k07p7K57M9o1L58l30K65l60k01
2388b93L3Q5l13M44K06jJ03q4k02K74M2k20P2m03J39K76q2Q8oL84j67m49N9K4
$$ plain form
2412 9 -104 -158 -72 294 148 70 395 41 -162 -41 -237 -278 -275 -61 -113 128 -12 -71 386 142 -39 -28 2 -149
2436 -149 124 339 32 245 287 180 -55 -91 -40 -488 -216 -34 -191 -70 136 151 64 -162 11 -122 19 -352
2458 -352 -262 -156 53 -93 61 216 -189 141 229 296 -353 94 488 115 30 381 304 95 -188 -174 -238 -543
2480 -543 -292 -193 75 18 -167 -26 -92 -250 -171 30 16 -396 36 141 137 -101 21 -29 -87 83 8 140 177 187
2504 187 -8 157 358 20 -117 295 126 -227 -166 4 97 -28 -49 -79 -67 -127 -75 -59 -152 -10 -236 297 4
2527 4 -92 -248 127 -103 -349 321 70 -242 -115 -39 -19 -35 128 237 86 228 223 245 157 -172 -239 -214 -24 -23 -35
2552 -35 27 -129 -395 -130 -153 -308 -212 84 -175 16 85 -106 354 235 147 -483 -26 247 -271 -193 251 -133
2574 -133 -250 55 -15 464 263 -175 -356 15 29 -146 63 279 -437 105 271 -86 -262 212 150 -254 87
$$ packed form
2412Ij13n4Q6L66j46p8L25l54k03J21j96m1LK14n2K41j40n9M57k44j81J1L0j51
2436a49K73K15l07K13M2j07k35l6N1m48K72J82j57J21K06J5q7k26J73j33J41l71
2458c52R0J06K09j46J54J55m05L30Q8O7o49M47L94l73q5L51p7k09k83J4o4l05
2480e43K51R9K68n7j85J41o6j58P9K01j4m12M32J05mk38J22n0n8J70p5J32L7J0
2504A87j95J65K01l38j37M12j69l53O1J70R3j25k1l0J2o0N2J6r3J42k26N33k93
2527Dr6j56L75k30k46O70k51l12J27P6K0j6J63J09j51J42nK2q8l29o7K5J90Jj2
2552c5O2j56k66K65k3j55R6K96k59J91O9j91M60j19q8o30M57K73n18P8M44l84
2574a33j17L05p0M79k01m38j81L71J4j75K09K16p16N42J66l57j76M74o2m04L41
$$ plain form
2595 87 118 81 241 379 3 -203 -9 -267 -319 341 -127 -85 174 140 -282 112 223 121 -93 -249 -331 -207
2617 -207 215 133 -97 -375 -259 -431 103 30 -135 100 96 123 151 293 370 105 397 -179 -537 -47 82 289
2639 289 248 114 -104 -216 219 81 -158 170 -185 -113 -344 283 123 94 175 89 -178 -171 -308 -288 107 -170 -250
2662 -250 -29 10 5 62 433 72 -210 198 272 153 293 292 -99 -56 87 -213 48 204 23 -296 -237 123 80
2685 80 71 369 -35 -173 -194 -181 228 20 123 -128 -197 200 2 68 223 -138 -341 -19 -19 -41 295 -17 -128
2708 -128 -206 57 -139 -101 151 42 -4 -144 -25 -29 351 107 -184 116 96 -386 -180 152 117 -410 50 -146
2730 -146 -364 56 335 53 -190 111 -169 192 -28 -170 -20 127 174 -1 -41 143 -199 -182 53 -118 -158
2751 -158 28 222 -117 267 120 43 6 54 48 160 64 -28 -430 -86 58 34 -31 -174 -22 -167 -33 118 113 -95
$$ packed form
2595H7L1l7J60J38l76k06J94k58n2O60m68M2K59l4m22L94J11j02k14j56q2J24
2617b07M22q2k30k78J16j72N34p3j65K35mK7K8J42P7k65K92n76l58M90J29K07
2639B89m1j34k18j12M35j38k39L28l55P2k31O27j60k9Q1q6k67Pj37K0L95k77q0
2662b50K21L9nN7L71l61k82M08P4j19J40jl91M3J43l00K61J56j81l19N9L60m3
2685H0rK98m04j38k1J3M09k08J03k51o9L97j98O6J55l61k03L22%k2L36l12j11
2708a28p8K63j96L8K52j09m6j40J19mL80k44k91L00k0m82K06L32l5n27M60j96
2730a46k18M20K79k82k43L01k80L61k20j42J50J47M7j75m0J84l42J7K35j71m0
2751a58J86J94l39L84j47p7l7M8oJ12r6r2m02L44J44k4o5j43J52j45J34J51nk08
$$ plain form
2775 -95 -64 -80 -149 98 177 72 211 -241 55 -159 46 -46 169 325 9 57 33 -4 258 -204 -223 106 -17
2798 -17 144 -412 114 147 -241 -208 -187 -77 -204 -22 -257 -78 -18 138 8 -3 -141 -196 35 -256 27 -243
2820 -243 19 242 122 139 282 77 107 212 134 87 89 151 36 55 -41 120 70 -11 -151 -335 5 -255 8 448
2844 448 -114 61 51 99 -164 -205 -61 122 16 -70 98 150 125 -31 171 -61 92 -44 234 -8 -331 -436
2866 -436 -15 -47 -87 -21 -80 -221 -158 -329 23 -40 -2 -36 -74 -71 33 -22 136 -149 -269 139 147 256 152 -111 11
2891 11 -38 -176 -312 -386 -58 -131 120 1 45 -104 74 252 170 -265 227 11 34 8 236 165 209 -32 -195
2914 -195 81 -221 -157 61 112 -196 46 354 79 325 -106 71 161 -185 69 112 245 -79 -18 -235 -45 -111
2936 -111 -179 -127 -176 -294 133 298 -169 118 128 -30 -133 168 -112 -93 23 10 88 132 80 -95 146 -35 -63
$$ packed form
2775i5L1j6o9K47P9j05J39m52K96k14K05r2K15J56l16M8k4l7K62m62j9L29j23
2798a7J61n56N26L3l88L3K1J10j27J82k35J79O0J56j30j1j38n5K31k91K83k70
2820b43K62K23j20J7J43k05L0J05p8m7KO2j15J9r6J61n0q1j40j84L40k60K63M40
2844D48n62J75j0M8k63m1J44J83j06q6J68N2k5j56K02k32J53j36K78k42l23j05
2866d36M21l2m0O6n9j41O3j71L52o3L8l4l8LJ04n5J58k85j20M08QJ09j04k63J22
2891A1m9j38j36p4L28p3K51j19M4j49J78J78q2m35M92k16K3k6K28p1M4k41j63
2914a95K76l02O4K18N1l08K42L08k75K46m31J77R0l46K54M3J33l24O1k17J90o6
2936a11o8N2m9j18M27J65m67K87J0j58j03L01k80J9J16j3P8M4n2j75K41j81k8
$$ plain form
2959 -63 -98 -181 29 -83 104 167 99 37 -197 -287 -198 -180 -111 -119 118 183 -129 270 231 -130 57 45 1 -120 41
2984 41 -165 -22 308 -72 -58 158 104 -241 201 268 -287 -98 -111 -133 -362 -26 19 -339 -52 300 -313 -79
3006 -79 -139 -45 -183 410 -98 -120 60 -17 59 -13 8 13 -108 -29 -48 -86 276 61 -123 -46 69 -260 69 -71 -174
3031 -174 -16 111 47 -281 68 -8 -105 -130 55 108 51 300 -26 -144 175 -134 -112 194 -40 -201 66 297
3053 297 69 -376 129 160 -309 -230 -47 -83 259 375 -77 -174 121 -187 -190 123 72 -40 -42 -5 -280 136 135 -160
3077 -160 -95 -185 -173 113 389 30 -22 99 33 -321 -47 270 60 -56 126 -188 -8 310 -246 -204 11 129
3099 129 -308 -58 30 -107 73 68 -261 -94 207 295 -244 273 181 -291 -133 190 236 -145 299 -59 -274 313
3121 313 251 -147 163 133 -51 -161 100 -376 -54 81 181 5 191 89 -97 101 51 -278 -115 -20 -22 -25 329
$$ packed form
2959f3l5q3K10j12J87O3o8o2k34r0Q9J8O9qK37O5l12L99l9l61J87j2m4j21J61
2984D1k06J43L30l80J4K16n4l45M42O7n55J89j3k2k29L36M5l58K87L52o13K34
3006g9o0R4j38N93n08k2J80p7P6p2K1Nj21P9j9l8L62k15j84P7J15l29L29j40j03
3031a74J58J27o4l28L49p6r7k5J85N3n7K49l26j18L19l09K2L06k34j61K67K31
3053B97k28m45N05L1m69P9J83l6L42J16m52r7K95l08lL13n1j12kL7k75M16jk95
3077a60O5r0J2K86K76l59n2J21o6l54K74L17k10j16J82l14J80L18n56M2K15J18
3099A29m37K50Q8j37J80nl29J67L01Q8n39N17r2m72J58L23M6l81M44l58k15N87
3121C13o2l98L10l0j84j10K61m76L22J35J00j76J86j02j86J98n0l29J63R5klL54
$$ plain form
3144 329 26 62 250 -105 -36 117 96 -100 -140 140 -144 -182 41 -145 54 -47 -51 -127 -132 113 -210 -311 75
3167 75 -12 -104 117 127 -140 -9 -151 -240 259 120 -86 392 204 257 40 249 52 14 30 -10 -13 -192 308 -131
3191 -131 -55 8 -352 -217 148 -63 70 -47 -45 -388 231 326 66 -10 188 99 -282 176 95 77 -126 94 -166
3214 -166 -239 71 231 -100 -40 -198 -54 180 284 53 392 169 -91 -77 -137 78 -71 -81 63 -187 97 -8
3236 -8 81 -109 201 -117 -151 210 30 137 113 59 28 139 -39 -37 102 -9 67 33 61 -169 -17 -56 298 155
3260 155 112 117 -98 -55 243 -136 -130 2 36 113 220 174 -13 31 -90 -50 -107 -97 -112 -192 115 -59 -202 26 -15
3285 -15 5 -307 290 268 140 91 128 -127 -139 -169 258 -51 26 -59 -51 90 112 206 245 -51 -4 198 -79 -153 88
3310 88 89 84 -2 5 -26 -132 115 -53 -415 225 -95 243 62 115 137 15 207 -237 -122 112 35 6 -170 142
$$ packed form
3144C29l03L6J88l55O9J53k1j96m0K80k84l8K23j86J99j01mp6nK45l23j01L86
3167G5q7r2K21J0k67J31j42q9M99j39k06M78j88N3k17K09j97l8J6m0lj79N00m39
3191a31P6O3l60J35L65k11J33j17Kl43O19R5k60p6J98q9l81M58q1j8k03K20k60
3214a66p3L10J60l31O0j58J44K34J04k31L39k23k60J4o0K15j49j0J44k50K84j05
3236hQ9j90L10l18l4L61j80J07k4n4l1J11j78KJ39j11P6l4K8k30J52l9L54j43
3260A55m3Nk15M3K98l79OJ32L4P7J07m6j87M4j21M0n7J0j5q0L07j74j43K28m1
3285a5K0l12N97k2j28m9L7k55j2l0M27l09P7q5QJ41K2R4L9k96M7K02k77p4K41
3310H8Jnq6Pl1j06K47j68l62O40l20L38j81N3K2j22J92m44J15K34p7k9j76L12
$$ plain form
3334 142 160 -97 154 -150 -115 185 79 -49 -1 30 -31 17 -11 103 147 140 184 189 -78 35 -71 -285 -32 45 -1
3359 -1 106 -130 220 188 -29 -110 -231 18 61 -103 -100 -57 -99 56 -24 198 26 -1 84 116 232 189 -174 -260 -136
3384 -136 145 -34 -198 -353 79 -66 -259 -236 -303 89 -2 80 178 40 -110 -44 7 98 -9 -202 87 -141 190
3407 190 228 -170 -250 79 196 -22 270 195 62 103 93 57 -122 -179 61 116 -87 116 -176 -90 -37 -123 73 -376
3431 -376 -144 174 206 99 89 -3 216 81 54 -1 201 -55 -206 288 -67 108 78 60 285 -13 -24 -226 -82
3454 -82 -91 -160 -217 131 20 30 88 16 -27 -154 -133 -165 -116 -13 -222 111 136 41 54 66 -73 -5 29 17 14 266 256
3481 256 -20 150 73 139 -51 -129 -15 143 51 -146 -21 49 -88 -109 -55 9 -268 -241 -200 -41 -15 324 119 126
3505 126 -19 137 117 -28 -101 -158 -153 185 -10 7 136 56 48 1 82 -73 110 -32 -116 -10 45 -278 54 218
$$ packed form
3334A42J8k57K51l04L5L00j06j28M8L1o1M8k8J14M4pM4Nk67J13j06k14K53P7m6
3359aJ07k36L50l2k17q1j21K49M3j64LM3m2J55q0K22j72k7Q5L2J16m3l63q6J24
3384a36K81j79j64j55M32j45j93K3o7L92r1Q2R8j38j50O6N1R1j07j93K89k28L31
3407A90L8l98q0L29J17k18K92p5j33M1j0l6j79n7K40N5k03K03k92Q6N3q6J96m49
3431c76K32L18L2j07j0r2K19j35k7n5K02k56j51M94l55J75l0j8K25k98j1k02J44
3454h2ro9n7L48j11J0N8p2m3j27K1l2M9J03k09L33K5r5J3J2j39O8L4j2lK52j0
3481B56k76J70p7O6j90p8J14J58r2j97J25P0j37k1N4O4k77K7M1J59K6L39k05P
3505A26j45J56k0j45p3n7NL38j95J7J29q0qm7Q1j55J83j42q4J06N5l23L32J64
$$ plain form
3529 218 -23 -267 72 269 115 -161 127 128 134 67 260 5 94 125 46 248 75 -97 167 224 -23 8 119
3552 119 163 -11 -58 115 127 -107 38 4 -65 -105 98 -397 -66 150 -133 116 216 -17 60 251 182 70 -28
3575 -28 96 -73 71 88 18 -221 -92 38 18 -106 110 39 108 129 -137 136 -105 41 -46 126 -6 75 79 -93
3599 -93 172 -16 148 -120 199 -90 -1 222 -65 -31 -92 -24 186 182 79 -42 175 27 -124 -51 -135 178 185 -284
3623 -284 -58 -124 -138 170 219 -2 -219 -159 -343 -150 -131 70 -19 171 86 -62 -84 215 20 -199 -57 30 7
3646 7 -11 -63 -79 160 -247 -48 -121 46 -94 140 -93 -48 67 66 228 0 60 -126 6 -93 17 -171 -375 372
3670 372 -95 -209 -119 -45 150 -166 101 -68 98 18 157 73 17 -97 -7 -200 122 -326 -244 -18 -310 -30
3692 -30 -41 177 -234 -15 -298 -29 51 255 -91 -49 -107 26 -42 174 79 -49 -116 117 18 -251 303 -65 -5
$$ packed form
3529B18k41k44L39J97j54k76K88JOo7J93k55Q9L1p9K02j73j72K64N7k47L1J11
3552A19M4j74m7J73J2k34J45l4o9m0K03m95L31K16k83K49J00k33P7J91o9j12r8
3575b8J24j69J44J7p0k39J29J30k0j24K16p1O9K1k66K73k41J46q7J72j32Q1Mj72
3599i3K65j88J64k68L19k89Q9K23k87L4o1O8K10mj03j21K17j48j51P3q4L13Pm69
3623b84K26o6j4L08M9k21k17O0j84J93J9K01q9J90q5j48k2K99j95k19J42Q7k3
3646Gj8n2j6K39m07J99p3J67j40K34k33M5J15jJ62k28O0j86J32r9J10j88k04P47
3670C72m67j14R0P4J95l16K67j69J66q0J39q4n6j14R0j93L22m48Q2K26k92K80
3692c0j1K18m11K19k83K69Q0K04l46M2n8J33o8K16r5j28o7K33r9k69N54l68O0
$$ plain form
3715 -5 0 16 -145 -73 -19 -65 4 88 -138 11 -61 38 64 99 -118 -93 -266 -64 20 -33 262 -69 -333 5 60 100
3741 100 -76 41 -16 -97 -8 109 29 74 111 71 -28 -240 -144 100 140 -104 14 -2 152 -79 83 39 -99 -62
3765 -62 18 79 166 243 122 39 -237 -119 -218 150 -261 -132 -282 -50 -111 -58 177 19 19 -109 -6 17 -113 -206
3789 -206 -361 245 117 -72 -124 107 -95 -8 61 264 24 133 -48 -3 91 -211 -8 4 39 -24 49 -134 321
3812 321 -62 -156 6 307 203 97 7 0 -129 -32 -363 48 8 161 -27 -130 -4 -13 -129 78 -82 44 -29
3835 -29 97 165 115 41 -180 -50 -44 254 -73 -270 -59 -88 -90 -95 -40 -18 -60 -51 3 -329 112 101 195 121 45 117 -33
3862 -33 -213 -226 118 -22 -111 57 -59 340 0 1 -112 50 99 -93 100 -80 293 53 -18 58 76 108 21 78
3886 78 59 -32 -163 -203 -11 132 60 -88 85 -9 -13 32 88 -301 -7 -28 110 118 -172 -122 3 159 284 24 106
$$ packed form
3715eNJ6j61P2N4m6O9Q4k26J49p2R9K6L5k17K5j73K02Q4n3K95l31k64L38N5M0
3741A00j76J17n7q1Q9J17q0M5L7m0r9k12R6K44M0k44J18j6J54k31J62m4j38L7
3765f2Q0O1Q7P7j21q3k76J18r9L68m11J29j50K32o1N3K35j58%j28J03K3j30r3
3789b06j55O06j28j89n2K31k02Q7O9K03k40J09j81M5R4l02K03J2L5o3P3j83M55
3812C21l83r4J62L01j04j06r0pj29R7l31M11m0J53j88j03J26rj16K07j60J26p3
3835b9J26O8n0p4k21J30OK98l27j97K11k9knN5K2m2RN4l32M41j1R4p4p6P2j50
3862c3j80j3L44j40q9J68j16L99l40Jj13J62M9j92J93j80L73k40p1P6J8L2q7N7
3886G8j9r1j31m0J92J43p2j48J73r4mM5N6l89K94k1J38Qk90N0J25J56J25k60Q2
$$ plain form
3911 106 -243 22 -6 -16 -90 25 -32 55 125 266 -109 -128 -169 -35 153 14 329 -27 -264 91 37 87 57 6
3935 6 -167 -210 92 65 43 45 123 122 32 66 27 -134 -109 177 -97 11 -97 -62 41 111 15 -27 255 25 26 140 41
3962 41 -140 40 129 41 -100 78 -84 -81 -330 -102 -318 -87 113 104 222 -71 163 50 167 -11 -77 65 13
3985 13 -95 -185 -141 -84 -48 78 158 69 -221 137 -167 289 69 105 -67 -211 180 67 96 -203 5 -105 71
4008 71 203 -92 -12 -32 114 159 -54 -73 -111 -42 -170 46 -52 -52 94 -112 -186 -206 -108 -90 -35 83 89 88 -43 47 -360
4035 -360 138 39 -139 -59 -194 -95 -76 92 107 112 74 -18 -86 -46 264 -64 127 -151 14 -230 -98 -98 -187 -11 -131
4060 -131 -230 216 -141 -313 -18 256 -97 -270 250 -167 -197 72 -113 -25 -255 -3 147 135 -24 -45 -260 -78
4082 -78 -90 -227 91 -39 -6 -60 -163 -8 -272 98 13 -135 -72 -6 -123 304 -131 -215 -51 -8 -120 -127 101 -217
$$ packed form
3911A06l49K65k8j0p4J15n7Q7P0J41l75j9m1J34J88j39L15l56k37L55n4N0l0n1
3935Fj73m3L02k7k2KP8jr0L4l9j61K5K86k74J08j08L5J03P0r6m2K82k30JJ14r9
3962D1j81J80Q9q8j41J78j62Lk49K28k16K31K00rJ18k93K34j13J17j78o6J42n2
3985A3j08r0M4N7L6J26Q0q9k90L58l04M56k20L6j72j44L91j13K9k99K08j10J76
4008G1J32k95Q0k0J46M5k13j9l8O9j28K16r8%J46k06p4k0R8J8N5J18Ojj31R0m07
4035c60M98r9j78Q0j35R9J9J68J5Nl8r2o8M0L10l28J91k78J65k44J32%q9J76j20
4060a31r9M46l57j72K95K74l53j73N20m17l0K69j85Q8k30K52J50j2j59k1k15J82
4082g8j2j37L18j30L3n4j03J55k64L70q5j48O3O6j17M27m35q4J64M3j12pK28l18
$$ plain form
4106 -217 -150 -7 -314 -153 1 115 -121 -83 -157 -206 -8 14 36 -41 254 148 -18 -176 -49 -70 -79 -207 -167 -100
4130 -100 -68 -60 -67 274 29 41 109 110 -292 -256 -30 145 -18 82 -3 -50 83 46 -136 23 11 265 -130 -12 145
4155 145 124 50 -311 -287 -76 -10 -183 127 44 74 142 -84 -190 -93 90 1 198 102 138 -31 173 93 -99 -90 126
4180 126 -58 -39 -66 117 25 -109 -15 28 215 106 29 323 -69 131 33 99 -249 94 -159 171 78 -60 137
4203 137 113 -264 -80 -86 -7 36 -262 129 -303 -62 -36 -35 -195 -109 -171 -107 2 130 -7 -63 -118 28 -152 96
4227 96 -11 -82 -230 -66 0 -74 -185 -95 -30 -25 79 107 112 10 129 -61 220 123 -68 180 -23 -284 -80 292
4251 292 32 -228 -204 175 -367 39 -25 -67 -126 266 236 64 208 133 -222 -209 134 -122 -119 -42 66 144 -88 82
4275 82 212 121 32 20 224 -168 -66 35 128 -192 -170 -24 -39 -147 -13 162 -12 -364 89 159 -31 158 -48
$$ packed form
4106b17O7J43l07J61J54J14k36L8p4m9J98K2K2p7K95j06j66j58J27k1rj28M0O7
4130a00L2QpL41k45J2O8Jm02L6K26J75j63J00q5m7J33l7j82J59j2K54l95J18J57
4155A45k1p4l61K4K11O6j73L10q3L0O8k26j06R7J83q9J97r6L6j69K04q0j92RK16
4180A26j84J9k7J83r2j34R4M3J87j09p7K94l92K00r8O6l48L43k53L30r3j38J97
4203A37k4l77J84oP9M3k98L91m32K41K6Jj60Q6o2O4J09J28j37n6n5J46j80K48
4227I6j07p1j48J64O6p4j11R0O5NJ04K8Nj02J19j90K81r7j91K48k03k61K04L72
4251B92k60k60K4L79n42M06o4m2n9L92l0j72J44p5l55J3L43k56LP7J08P8k32J70
4275H2J30r1q9j2K04l92J02J01R3l20K2J46j5j08J34J75j74l52M53P0j90J89k06
$$ plain form
4298 -48 -57 36 108 -173 210 91 -214 6 -121 -69 -214 134 205 -12 -103 81 -101 138 -161 -50 -123 150 -150
4321 -150 -53 11 -254 139 -10 98 -64 -250 104 117 115 -107 340 -26 -38 -273 11 -26 -53 -180 -36 -245 72
4344 72 -54 -86 4 -90 125 -13 -32 52 -79 -174 1 -50 -101 -290 -235 -115 34 -168 -226 237 -57 -138 -31 1
4368 1 136 -83 -24 -227 116 230 218 30 -24 -119 44 -59 -18 -102 124 269 66 -22 118 181 214 -172 -81 -145
4392 -145 -39 38 83 -21 -94 89 54 47 -52 199 18 138 -41 -325 -115 -17 11 -59 43 30 105 -221 -249 -46
4416 -46 -225 -11 40 115 -17 19 -130 -107 116 -340 -59 77 -41 -283 16 205 -38 108 -5 237 125 -32
4438 -32 -177 -116 -177 -52 -18 23 -17 -132 -18 -7 -5 -21 -135 53 -112 -33 -18 -168 54 -162 -152 -210 217 -14 -232
4463 -232 -127 153 -68 -29 -5 28 -198 -43 -109 -207 22 -6 181 -129 -14 54 -188 -43 133 -129 -60 29 -140
$$ packed form
4298d8rR3P2k81L83j19l05K20j27N2j45L48P1k17r1J84j82K39k99J11p3K73l00
4321a50R7O4k65L93j49J08j62j86L54J3kk22M47l66j2k35K84l7k7j27J44k09L17
4344G2j26l2R0r4K15j38j9Q4j31r5J75n1n1j89N5J20J49k02n8M63k94q1J07L2
4368AJ35k19N9k03L43J14j2j88n4r5J63j03M1q4K26J45k03q8J40O3L3l86R1o4
4392a45J06P7M5j04p3J83l5pr9K51j81J20j79k84K10R8K8p0J02j3P5l26k8K03
4416d6j79K14N1P5j32L6j49K3K23m56K81J36j18k42K99J89k43J46j13K42j12j57
4438c2j45O1o1J25L4M1m0j15J14J1Kj6j14J88j65P9J5j50K22k16J0n8M27k31k18
4463b32J05K80k21L9K4L3k26J55o6r8K29k8J87l10J15O8k42J45J76k62O9Q9j69
$$ plain form
4486 -140 94 -28 -78 -42 -79 316 240 265 62 -48 -41 -100 -63 40 -17 79 189 -134 54 -56 -5 108 -6 108
4510 108 0 -61 97 -105 -25 70 137 -201 -230 -130 -67 -13 -8 309 176 154 219 78 -65 124 -35 26 -82 34
4534 34 197 224 122 171 -113 -56 188 245 -62 69 -175 63 171 -63 -202 104 103 62 -47 97 -91 -245 33
4557 33 -88 -105 64 -36 219 51 133 -156 10 82 -236 -48 -92 -117 133 210 -93 -175 153 128 -95 -48 175
4580 175 -10 204 -13 -182 209 4 -200 -96 -34 141 92 126 75 189 -219 -2 197 198 221 117 39 -264 -47
4603 -47 27 -14 -151 85 -164 117 -72 17 56 125 -81 47 257 163 -105 65 -53 -24 -7 101 -124 48 88
4626 88 94 60 -64 255 94 -212 49 57 74 226 -323 -58 105 -176 -235 108 120 238 322 83 184 100 27 130
4650 130 -23 177 90 204 -5 -241 -53 18 -171 -109 -144 -210 -118 80 247 19 -62 14 -56 -108 81 -15 -236 -29
$$ packed form
4486a40K34j22n0L6l7L95p6K5k03j10Pn9L7J03n7R6J10l23J88j10N1J13j14J14
4510A08j08o1J58k02Q0R5O7l38k9J00O3N4NL17j33k2O5j41j43J89j59O1j08J16
4534C4J63K7j02M9k84N7K44N7l07J31k44K38J08k34j39L06jm1j09J44j88j54K78
4557C3j21j7J69j00K55j68Q2k89J66P2l18J88m4k5K50P7l03q2L28k5k23M7K23
4580A75j85K14k17j69L91k05k04J04O2J75m9L4n1J14m08K17J99JK3j04p8l03K17
4603d7P4m1j37K36k49K81j89Q9L9O9k06J28K10r4k68J70j18K9J7J08k25J72M0
4626H8Ol4j24L19j61l06K61QJ7J52n49K65J63k81n9L43J2J18Q4k39J01q4p3J03
4650A30j53K00q7J14k09k36J88P1j89O2l5o6R2J98J67k28q1P6p0n2J89r6k21K07
$$ plain form
4674 -29 -71 165 183 -84 188 -86 -14 -12 27 66 195 -97 -324 -17 -54 -18 -40 88 170 -35 -204 76 219 176
4698 176 -98 -3 -52 202 133 220 84 136 176 162 -60 -115 -41 120 18 179 -195 29 -167 46 71 176 -144
4721 -144 230 12 127 -2 194 -88 163 52 176 -57 170 322 157 63 114 -181 194 -167 2 -1 -148
4742 -148 -102 -92 -71 -23 -27 -69 66 82 -159 -46 98 193 -40 44 44 -194 116 -189 25 -117 179 -207 -43 -226
4766 -226 7 59 -7 110 -157 -61 62 221 143 130 -110 -39 -20 -206 108 115 68 30 129 60 48 304 -6 -187 40
4791 40 -60 121 -150 85 4 -80 -122 -201 -290 -216 -51 94 -117 163 212 12 16 51 -31 196 130 -148 -70 157 50
4816 50 -44 -85 52 133 -117 76 -35 -31 -65 120 7 -51 -104 274 -2 -9 41 -23 -243 93 52 113 -27 101 -139
4841 -139 -156 -42 2 70 112 288 -53 147 -276 -154 160 167 40 -178 32 -43 -127 -8 -41 86 102 153 93 110
$$ packed form
4674b9m2K36J8k67K72k74P2KL9L9J29k92k27L07l7L6k2J28Q2k05j69K80J43m3
4698A76k74R5m9K54o9Q7j36N2M0j4k22n5P4J61j02J61l74K24j96K13K5J05l20
4721a44L74k18J15j29J96k82K51j11J24k33K27J52j65r4N1k95L75l61J69lj47
4742a48M6J0K1M8mm2J35J6k41J13J44R5k33Q4%k38L10l05K14j42K96l86J64j83
4766b26K33N2o6J17k67R6J23J59p8j3k40P1J9j86L14Pm7l8R9o9j2K56l10j81K27
4791D0j00J81k71K35q1q4m2p9q9P4J65J45k11K80M9k00ML5q2K27o6k78P8K27j07
4816E0r4m1J37Q1k50J93j11Ml4J85j13n8n3L78k76pN0o4k20L36m1O1j40J28k40
4841a39j7J14M4O8M2J76l41K00m23J22L14Pj27k18K10p5q4J19l3J27J6N1o0J7
$$ plain form
4865 110 78 90 10 -1 -164 97 101 -33 97 -9 -159 94 36 71 76 78 -87 -71 -167 -279 89 102 86 299 108
4890 108 -39 -9 11 91 117 -105 137 -172 52 49 9 -107 41 -237 31 -125 -20 225 4 77 211 103 185
4913 185 172 -49 -56 -127 -31 -96 -118 258 -21 -158 -182 150 90 81 202 -42 19 46 125 -157 143 71 -53 87 39
4938 39 -247 -119 -300 -81 -132 239 77 -232 -77 145 -169 -46 11 9 -10 59 -37 -68 -1 -159 100 40 54 -267
4962 -267 -225 79 -14 -51 -279 31 -130 150 29 -168 127 -24 -5 120 71 -152 -15 143 301 46 110 -25
4984 -25 31 -186 279 -12 112 -103 -188 -227 -208 160 -194 19 135 -67 -44 -88 -49 -82 4 -108 -44 -61 47 -171
5008 -171 187 35 -302 83 -114 177 -20 -108 -174 237 -25 119 -55 -68 18 -76 206 -12 -125 66 61 -147
5030 -147 -212 -192 12 -85 -6 52 44 181 -105 29 201 -44 43 3 -55 21 119 139 3 70 19 160 61 5 -53 -31
$$ packed form
4865A10l2J2q0j1j63K61Mj34J30j06j50K53n8L5NKj65J6r6j12L68J3j6K13j91
4890A08j47L0K0Q0K6k22K42l09K24lm0j16J48k78K68j56J05K45k21P3J34j08Q2
4913A85j3k21pp1R6o5k2L76k79j37k4L32o0rJ21k44O1K7P9k82L00p2j24J40m8
4938C9k86J28j81K19n1L71j62l09J55K22l14J23N7kj9O9r6l1O7j58K59o0J4l21
4962b67M2L04r3l7k28L10j61K80j21j97K95j51J9J25m9k23J37J58J58k55O4j35
4984b5N6k17M65k91J24k15q5l9J9L68l54K13J16k02K3m4L9l3Q6j12O4j7J08k18
5008a71L58j52l37L85j97K91j97q8o6M11k62J44j74j3Q6r4K82k18j13J91nk08
5030a47o5K0K04r7P9N8qJ37k86J34J72k45Q7m0n8P6R8K0j36O7n1J41r9n6n8K2
$$ plain form
5056 -31 -68 65 47 -176 -23 -253 114 25 -67 139 -95 -14 62 108 -7 20 -76 -46 -95 -30 -264 -2 37 73 -123
5081 -123 209 -200 -95 62 -149 16 -22 39 75 149 -142 229 117 -55 -56 -87 143 25 9 113 -252 152 -4
5104 -4 270 65 -122 216 101 144 4 -42 145 21 17 -199 -163 -49 -125 -25 241 140 84 277 291 -103 -235
5127 -235 31 -75 -56 -100 76 -82 44 71 50 -155 -227 161 93 90 115 -84 264 19 -110 -163 -29 -34 85 192
5151 192 -86 -117 -155 -62 -99 226 105 -118 157 -184 -13 177 54 147 95 85 -177 -21 8 -91 -66 -19 -36 -33 -72
5176 -72 101 131 11 -75 -140 84 -125 39 -51 -15 -222 -86 -120 125 -82 2 62 -66 -56 80 -116 27 101 -140
5200 -140 -112 -94 48 -62 -229 -32 181 56 -15 17 -134 -116 211 -149 -211 132 130 -272 52 151 -62 -82 -90 -193
5224 -193 183 -73 51 11 48 -40 -93 -80 -37 83 -287 166 -239 -107 17 200 -99 -187 120 -168 -77 -41 -46 215
$$ packed form
5056c1l7J33j8k23J53k30L67q9r2K06k34Q1P6M6j15K7r6L0m9O5k34K62L9L6j96
5081a23L32m09J05J57k11J65l8O1L6P4k91L71j12j72jl1K30j18j6J04l65M04j56
5104dK74k05j87L38j15M3j40m6J87j24mk16L6J14p6J00K66j01n6J93J4l94j32
5127b35K66j06J9m4J76j58J26K7k1k05p2L88o8lK5j99L48k45j29n3J34nJ19J07
5151A92k78l1l8R3l7L25j21k23K75l41J71J90j23R3n2j0k62J56K9r9K5M7j7Ll9
5176g2J73L0j20q6o5K24k09J64r0L6k07J36l4K45k07Q4O0j28J0J36j96J43P4k41
5200a40K8J8J42j10j67J97K13j25p1L2j51J8L27l60o2L43km02L24R9k13k0qj03
5224a93L76k56J24m0L7q8n3J3M3J20l70M53m05J32J24J83k99q8L07k88R1L6nK61
$$ plain form
5248 215 -51 51 229 -40 99 -21 -278 -70 -92 -74 -33 16 11 247 -56 -54 -77 -108 -54 -25 -188 -57 -164 -20
5272 -20 -187 -126 -51 -222 172 -153 -139 52 214 146 -67 -116 102 133 -159 48 62 -80 -112 19 -127 78 -75
5295 -75 -33 121 129 139 -199 73 -101 221 104 135 210 -13 182 -1 -305 -105 107 -251 210 70 97 36 -145
5318 -145 249 37 222 137 -33 -69 44 145 -151 115 -132 140 9 -354 -36 272 160 104 64 -74 8 -52
5340 -52 216 -112 -156 31 -119 155 13 142 160 47 58 -71 360 151 2 -91 -106 28 95 134 -160 106 85
5363 85 78 97 -69 58 20 -93 -110 68 33 15 148 1 -49 137 148 11 137 138 16 102 155 117 38 65 120 94
5389 94 -55 198 41 -310 -220 -60 145 278 -41 114 -31 40 -138 110 -19 -41 -61 -66 140 16 -199 82
5411 82 120 17 -50 -15 95 -229 -38 -331 184 171 -13 -155 -289 192 89 -81 82 -339 -17 -162 201 108
$$ packed form
5248B15k66J02J78k69J39j20k57K08k2J8M1M9nK36l03Kk3l1N4K9j63J31j07J44
5272b0j67O1P5j71L94l25J4J91J62o8k13m9K18L1k92K07J4j42l2J31j46K05j53
5295g5M2J54QJ0l38K72j74L22j17L1P5k23J95j83l04K00K12l58M61j40K7o1j81
5318a45L94k12J85q5j70l6J13J01k96K66k47K72j31l63L18L08j12n6m0j38Q2o0
5340e2K68l28m4J87j50K74j42J29J8j13J1j29M31k09j49r3j5J34O7L9k94K66k1
5363H5pJ9j66J27l8j13j7J78l5j8J33j47n0J86J1j37J26Jj22Q6N3l8p9K7N5k6
5389I4j49K53j57l51R0J60K05J33l19J55j45P1j78K48j29k2k0nK06j24k15K81
5411H2L8j03o7L5J10l24J91k93N15j3j84j42j34M81j03j70J63m21L22j45L63r3
$$ plain form
5433 108 -145 -36 33 -142 -114 161 34 146 -165 119 106 34 -19 -179 -13 -168 126 -151 -132 220 -391 109
5455 109 105 -10 279 218 124 196 -29 42 -86 11 -230 128 -288 -61 -35 0 -141 -7 38 98 66 -193 -87 -50
5479 -50 -12 -11 48 -100 90 -93 -71 87 69 -211 27 305 140 -28 -36 -141 -132 -37 -75 89 177 -191 -104 209 -174
5504 -174 -15 29 88 30 -60 14 -77 99 16 -25 100 59 27 -25 -112 -74 119 -44 -347 -203 56 -263 68 -63
5528 -63 -35 232 364 131 20 -64 -172 -209 -191 58 -3 -55 -162 -54 37 215 -70 122 -59 145 -156 -18 56
5551 56 -150 64 1 92 61 -212 199 96 -166 269 -95 -113 99 186 16 189 -31 168 59 -90 -132 30
5573 30 79 -166 -417 91 -161 -210 -227 28 -84 -14 115 -150 256 -22 -116 5 -3 -92 -258 -198 27 -4 -94 81
5597 81 153 -12 -1 -139 -146 -13 93 -59 -19 -31 69 47 -115 22 173 -97 66 141 -49 112 -46 -103 -104 77
$$ packed form
5433A08k53J09O9j75K8K75j27J12l11K84j3p2n3j60J66j55K94k77J9L52o11N00
5455A09mj15K89o1r4P2k25P1j28R7k41L58m16K27K6L5j41J34M5O0l2k59J06L7
5479e0L8JN9j48J90j83K2J58j8k80K38K78j65j68qj05RR5l8J64Q8l68Q7L13l83
5504a74J59M4N9n8r0P4r1J76q3m1J25m1l2n2q7L8J93j63l03J44K59l19L31j31
5528f3K8K67J32k33j11q4j08l7J8K49o1n2j07J08R1J78k85J92j81K04l01J38P4
5551E6k06K14o3R1l1k73M11j03k62M35l64j8K12Q7j70J73k20J99j09j49m2J62
5573C0M9k45k51N08k52m9j7K55j12P0J29k65M06k78r4J21qq9j66O0K25l1r0J75
5597H1P2j65J1j38pJ33J06j52M0j2J00k2j62J37J51k70J63P5j90J61j58n7jJ81
$$ plain form
5621 77 90 -159 -119 -26 -272 -95 -209 215 -10 -274 20 82 60 -15 183 195 -47 -72 182 -110 -106 141 -162 71
5645 71 111 -21 58 168 194 -144 82 12 -53 -223 -41 14 164 31 -69 -171 -176 63 55 -42 -243 -215 165 -52
5669 -52 -96 86 32 160 158 272 193 -32 0 68 75 128 248 -268 -23 -71 -179 -38 164 -108 -157 99 16 -101 29
5694 29 -41 -99 97 212 -29 295 36 137 89 -121 74 74 76 0 178 100 333 -213 -180 -251 187 -8 59 88 -85
5719 -85 74 -230 395 -180 -73 -34 -8 132 -79 184 -71 78 -96 95 -124 163 279 -48 -53 -162 -94 29
5741 29 80 -68 66 174 -113 -112 -109 -136 -55 -64 -133 -112 88 -65 113 162 -20 -78 46 -2 141 19 -297 -92 10
5766 10 -163 -7 -66 147 120 58 -146 -127 -226 -17 148 93 32 33 208 -248 20 -103 129 -101 95 -225 7
5789 7 -242 82 -72 178 150 -101 286 -12 42 106 -165 -28 -53 18 -90 32 -57 -50 -23 336 -4 133 57 -64
$$ packed form
5621G7J3k49M0R3k46J77j14M24k25k64K94O2k2p5J98J2k42k5K54k92MK47l03K33
5645G1M0j32P9J10K6l38K26p0o5j70J82N5J50j33j00j02nK39qr7k01K8L80k17
5669e2m4J82n4J28kJ14p9k25L2O8PN3J20n16K45m8j08J41K02k72m9K56q3j17J30
5694B9p0n8J96J15k41L24k59J01m8k10J95%Kp6J78p8K33n46L3p1M38j95O7K9j73
5719h5J59l04O25n75J07L9K6J40k11K63k55J49j74J91k19K87J16l27nj09O8J23
5741B9N1j48J34J08k87JLk7Q1ro9K1K00j53J78M9j82n8J24m8J43j22l16K05J02
5766A0j73J56n9K13k7o2k04J9r9K09J65n5o1JJ75m56K68j23K32k30J96l20K32
5789Gk49L24j54K50k8k51L87k98N4O4k71J37k5P1j08J22q9PK7L59l40J37p6j21
$$ plain form
5813 -64 158 -191 -164 112 60 -136 101 -17 -79 162 83 -13 81 40 66 193 -17 -43 21 -196 -133 113 -73 133
5837 133 147 -88 72 71 18 61 41 -97 70 60 151 -18 10 -32 -173 -187 66 197 -49 209 -146 53 257 2
5861 2 46 -163 -225 -125 -87 307 -64 146 108 -339 -291 -39 -6 139 103 98 -74 80 -72 215 -108 380 -251 -288
$$ packed form
5813f4K22l49K7K76n2j96K37j18o2K41p9r6R4m1K6J27k10k6O4k17O3K46j86K06
5837A33J4k35J60jn3M3k0j38J67j0R1j69K8m2j41j4K53J31k46K58l55J99K04k55
5861BM4k09o2J00L8L94l71K10l8m47M8K52L3J45l6nj72J54j52K87l23M88o31l7
$$ [...]
8191B87
##END NTUPLES=NMR FID
##END=
