##TITLE=1H_SR146_k3
 CDCl3
 8 sc, 
 27.10.2022
##JCAMPDX= 6.0         $$ Bruker NMR JCAMP-DX V2.0
##DATA TYPE= NMR FID
##DATA CLASS= NTUPLES
##ORIGIN= UXNMR, Bruker Analytische Messtechnik GmbH
##OWNER= root
$$ XWIN-NMR		Version 3.5
$$ Thu Oct 27 13:48:26 2022 Russian Standard Time (UT+4h)  she@DPX200
##.OBSERVE FREQUENCY= 200.1313499994
##.OBSERVE NUCLEUS= ^1H
##.DELAY= (6, 6)
##.ACQUISITION MODE= SIMULTANEOUS
##.ACQUISITION SCHEME= undefined
##.AVERAGES= 8
##.DIGITISER RES= 18
##SPECTROMETER/DATA SYSTEM= spect
##.PULSE SEQUENCE= zg30
##.SOLVENT NAME= CDCl3
##.SHIFT REFERENCE= (INTERNAL, CDCl3, 0, 15.7039)
##AUDIT TRAIL= $$ (NUMBER, WHEN, WHO, WHERE, WHAT)
$$ ##TITLE= Audit trail, XWIN-NMR		Version 3.5
$$ ##JCAMPDX= 5.01
$$ ##ORIGIN= Bruker BioSpin GmbH
$$ ##OWNER= she
$$ F:/spectra/data/she/nmr/H-F/1/audita.txt
$$ ##AUDIT TRAIL=  $$ (NUMBER, WHEN, WHO, WHERE, WHAT)
(   1,<2022-10-27 13:47:26.64 +0400>,<she>,<DPX200>,
      <created by zg, POWCHK disabled, PULCHK disabled
       configuration hash MD5:
       00 E9 B6 7A A2 85 ED C7 34 08 36 98 17 FE 4E 26
       data hash MD5: 16K
       AF 61 96 0E 71 47 E1 B2 29 5C DA 41 DD ED 68 64>)
$$ ##END=
$$ 
$$ hash MD5
$$ 14 03 4D 08 F5 A9 6D DE E7 5F 35 B8 A4 12 76 1B
##$RELAX= 
##$RELAX= 
##$RELAX= 
##$RELAX= 
##$RELAX= 
##$RELAX= 
$$ Bruker specific parameters
$$ --------------------------
##$DU= <F:/spectra>
##$EXPNO= 1
##$NAME= <H-F>
##$PROCNO= 1
##$TYPE= <nmr>
##$USER= <she>
##$AMP= (0..31)
100 100 100 100 100 100 100 100 100 100 100 100 100 100 100 100 100 100 
100 100 100 100 100 100 100 100 100 100 100 100 100 100 
##$AQSEQ= 0
##$AQ_mod= 1
##$AUNM= <au_zg>
##$AUTOPOS= <>
##$BF1= 200.13
##$BF2= 200.13
##$BF3= 200.13
##$BF4= 200.13
##$BF5= 200.13
##$BF6= 200.13
##$BF7= 200.13
##$BF8= 200.13
##$BYTORDA= 1
##$CFDGTYP= 0
##$CFRGTYP= 5
##$CHEMSTR= <none>
##$CNST= (0..31)
1 1 145 1 1 1 1 1 1 1 1 1 1 1 1 1 1 1 1 1 1 1 1 1 1 1 1 1 1 1 1 1 
##$CPDPRG= <>
##$CPDPRG1= <>
##$CPDPRG2= <>
##$CPDPRG3= <>
##$CPDPRG4= <mlev>
##$CPDPRG5= <mlev>
##$CPDPRG6= <mlev>
##$CPDPRG7= <mlev>
##$CPDPRG8= <mlev>
##$CPDPRGB= <>
##$CPDPRGT= <>
##$D= (0..31)
0 1.2 0 0 0 0 0 0 0 0.06 0 0.03 0 0 0 0 0.0002 0 0 0 0 0 0 0 0 0 0 0 0 
0 0 0 
##$DATE= 1666864046
##$DBL= (0..7)
120 120 120 120 120 120 120 120 
##$DBP= (0..7)
150 150 150 150 150 150 150 150 
##$DBP07= 0
##$DBPNAM0= <>
##$DBPNAM1= <>
##$DBPNAM2= <>
##$DBPNAM3= <>
##$DBPNAM4= <>
##$DBPNAM5= <>
##$DBPNAM6= <>
##$DBPNAM7= <>
##$DBPOAL= (0..7)
0.5 0.5 0.5 0.5 0.5 0.5 0.5 0.5 
##$DBPOFFS= (0..7)
0 0 0 0 0 0 0 0 
##$DE= 6
##$DECBNUC= <off>
##$DECIM= 32
##$DECNUC= <off>
##$DECSTAT= 4
##$DIGMOD= 1
##$DIGTYP= 9
##$DL= (0..7)
0 120 120 120 120 120 120 120 
##$DP= (0..7)
150 150 150 150 150 150 150 150 
##$DP07= 0
##$DPNAME0= <>
##$DPNAME1= <>
##$DPNAME2= <>
##$DPNAME3= <>
##$DPNAME4= <>
##$DPNAME5= <>
##$DPNAME6= <>
##$DPNAME7= <>
##$DPOAL= (0..7)
0.5 0.5 0.5 0.5 0.5 0.5 0.5 0.5 
##$DPOFFS= (0..7)
0 0 0 0 0 0 0 0 
##$DQDMODE= 0
##$DR= 18
##$DS= 0
##$DSLIST= <SSSSSSSSSSSSSSS>
$$ [...]
##$SUBNAM2= <"">
##$SUBNAM3= <"">
##$SUBNAM4= <"">
##$SUBNAM5= <"">
##$SUBNAM6= <"">
##$SUBNAM7= <"">
##$SUBNAM8= <"">
##$SUBNAM9= <"">
##$SW= 18.0517283424941
##$SWIBOX= (0..15)
0 0 2 0 0 0 0 0 0 0 0 0 0 0 0 0 
##$SW_h= 3612.71676300578
##$TD= 16384
##$TD0= 1
##$TE= 0
##$TE2= 300
##$TE3= 300
##$TEG= 300
##$TL= (0..7)
0 120 120 120 120 120 120 120 
##$TP= (0..7)
150 150 150 150 150 150 150 150 
##$TP07= 0
##$TPNAME0= <>
##$TPNAME1= <>
##$TPNAME2= <>
##$TPNAME3= <>
##$TPNAME4= <>
##$TPNAME5= <>
##$TPNAME6= <>
##$TPNAME7= <>
##$TPOAL= (0..7)
0.5 0.5 0.5 0.5 0.5 0.5 0.5 0.5 
##$TPOFFS= (0..7)
0 0 0 0 0 0 0 0 
##$TUNHIN= 0
##$TUNHOUT= 0
##$TUNXOUT= 0
##$USERA1= <user>
##$USERA2= <user>
##$USERA3= <user>
##$USERA4= <user>
##$USERA5= <user>
##$V9= 5
##$VALIST= <valist>
##$VCLIST= <CCCCCCCCCCCCCCC>
##$VD= 0
##$VDLIST= <DDDDDDDDDDDDDDD>
##$VPLIST= <PPPPPPPPPPPPPPP>
##$VTLIST= <TTTTTTTTTTTTTTT>
##$WBST= 1024
##$WBSW= 4
##$XGAIN= (0..3)
0 0 0 0 
##$XL= 0
##$YL= 0
##$YMAX_a= 310902
##$YMIN_a= -234860
##$ZGOPTNS= <>
##$ZL1= 120
##$ZL2= 120
##$ZL3= 120
##$ZL4= 120
##$ABSF1= 10
##$ABSF2= 0
##$ABSG= 5
##$ABSL= 3
##$ALPHA= 0
##$AQORDER= 0
##$ASSFAC= 0
##$ASSFACI= 0
##$ASSFACX= 0
##$ASSWID= 0
##$AUNMP= <proc_1d>
##$AZFE= 0.1
##$AZFW= 0.1
##$BCFW= 1
##$BC_mod= 2
##$BYTORDP= 1
##$COROFFS= 0
##$CY= 11.3945322036743
##$DATMOD= 1
##$DC= 2
##$DFILT= <>
##$DTYPP= 0
##$F1P= 2.36226072786647
##$F2P= -0.459571619588291
##$FCOR= 0.5
##$FTSIZE= 0
##$FT_mod= 4
##$GAMMA= 1
##$GB= 0.15
##$INTBC= 1
##$INTSCL= 1
##$ISEN= 128
##$LB= 0.24
##$LEV0= 0
##$LPBIN= 0
##$MAXI= 10000
##$MC2= 0
##$MEAN= 0
##$ME_mod= 0
##$MI= 1.114404
##$NCOEF= 0
##$NC_proc= 0
##$NLEV= 6
##$NOISF1= 3.799351
##$NOISF2= 2.8
##$NSP= 1
##$NTH_PI= 0
##$NZP= 0
##$OFFSET= 15.70392
##$PC= 1
##$PHC0= -18387.33
##$PHC1= 5.8007
##$PH_mod= 1
##$PKNL= yes
##$PPARMOD= 0
##$PSCAL= 0
##$PSIGN= 0
##$REVERSE= no
##$SF= 200.130013532006
##$SI= 16384
##$SIGF1= 3
##$SIGF2= 2
##$SINO= 400
##$SIOLD= 16384
##$SREGLST= <1H.CDCl3>
##$SSB= 0
##$STSI= 0
##$STSR= 0
##$SW_p= 3612.71676300578
##$SYMM= 0
##$S_DEV= 0
##$TDeff= 0
##$TDoff= 0
##$TI= <>
##$TILT= no
##$TM1= 0
##$TM2= 0
##$TOPLEV= 0
##$USERP1= <user>
##$USERP2= <user>
##$USERP3= <user>
##$USERP4= <user>
##$USERP5= <user>
##$WDW= 1
##$XDIM= 8192
##$YMAX_p= 0
##$YMIN_p= 0
$$ End of Bruker specific parameters
$$ ---------------------------------
##NTUPLES= NMR FID
##VAR_NAME=  TIME,          FID/REAL,        FID/IMAG
##SYMBOL=    X,             R,               I
##VAR_TYPE=  INDEPENDENT,   DEPENDENT,       DEPENDENT
##VAR_FORM=  AFFN,          ASDF,            ASDF
##VAR_DIM=   8192,          8192,            8192
##UNITS=     SECONDS,       ARBITRARY UNITS, ARBITRARY UNITS
##FACTOR=    0.0002768,     1,               1
##FIRST=     0,             0,               0
##LAST=      2.2672688,     0,               0
##MIN=       0,             -234860,         0
##MAX=       2.2672688,     310902,          0
$$ Real data points
##PAGE= N=1
##DATA TABLE= (X++(R..R)), XYDATA
$$ [...]
1755f2J64Q4j37J4j19L27k00l0k14K34p6r2J73k07P3l9J82K4Q4K7k00J39k41Q0
$$ -62 102 186 49 63 -56 271 71 41 -173 61 -15 -107 66 -141 -68 -107 75 99 183 210 10 149 -92 -12
1779a2r7K46k0j4Ml96M63j28q4k59J34K59k83J54K32o4k93R9J22J28k23J79r4
$$ -12 -109 137 117 103 107 -289 174 46 -38 -297 -163 96 -187 -33 199 135 -158 -59 63 191 -32 147 53
1802E3j40N0J87k69M8K64l58J96q9J32J79m71K39L9j17j9J4R6L8l22J99Q5J47
$$ 53 -87 -37 150 -119 -71 193 -165 31 -58 74 253 -218 21 60 -57 -76 -62 34 72 -250 -51 34 181
1825A81k02j86Q2J62k57K49j04K07n3K33k95J9rk3j02j8J18K49k74k76J37l3K95
$$ 181 -21 -207 -125 37 -220 29 -75 132 79 312 17 36 27 4 -98 -116 2 251 -23 -299 -162 -195 100
1848A00j55P4J18O8k49J95j58l2Oj84J87J41j8j75J09Q0k66L7j38j4K66J2J56
$$ 100 -55 19 137 205 -44 151 -7 -39 -33 -217 -30 111 93 -82 27 107 -159 -122 -260 -274 -8 4 160
1871A60j83Q4J17k6j0l30M02k48J67r2o5J34j0K2j90l8o0K36k42J51O2j23J34
$$ 160 -23 61 178 152 142 -188 214 -34 133 41 -24 110 100 122 -68 -106 -166 70 -172 -21 41 -82 52
1894E2j04J75j42oJ73j17j50K35l00O34p11K17O8k99J64K09M3o6j31K82l22J64
$$ 52 -52 123 -19 -25 148 31 -119 116 -184 450 -261 -44 24 -275 -111 98 141 75 -56 226 -96 68
1916F8KM8J15l06j25K04Ol3j22K40r2Q2nl24R5o8J25J44j57K96M1j19o6Q3j82
$$ 68 70 118 233 -73 -198 6 12 -21 -143 97 5 87 82 -242 -147 -215 -90 54 -103 193 234 115 49 132 -50
1941e0O8j35J54p4l5R3Q3Mj23J1m2J21l9J7l2o2k38J20J80L00k24j71n2J32K34
$$ -50 18 -117 37 -37 -72 21 104 108 -15 -4 -46 75 36 53 21 -41 -279 -159 21 321 97 -74 -126 6 240
1966B40k03K1q6o1J81j30Q4l0j33J19k36J31J60o6k0k4k2L09j82ql74M17j31J41
$$ 240 37 58 -28 -89 92 -38 46 16 -117 2 -234 -103 57 -9 -29 -53 -75 234 52 44 -330 87 -44 97
1990I7q0r8L8O6r6L2O7J5j3k68Q4L52k51Q2j80Lp8J64p2L8K0K23j75J62j59J67
$$ 97 17 -81 -43 23 -73 -41 26 41 28 -240 -156 196 -55 27 -153 -150 -228 -64 -136 -98 -78 145 -30 132 -27 140
2016A40M7J38l94M7J80j46j38J89l32L29M8l69J79J29j16L7J29r5L36m21K66O
$$ 140 187 325 -69 -22 158 12 -126 63 -269 60 108 -261 -82 47 -69 -32 97 2 338 -83 183 189
2038A89k26K10l95N5K35K2k65jK71k53P1o0K38j48J52j14J61J13k68omJ19j30
$$ 189 -37 173 -222 -167 68 90 -175 -176 95 -158 -87 -147 91 -57 95 -19 142 255 -13 -19 -23 96 -34
2061c4J06O0j57K17q9j20m5j66K88k2j41J2M0j01K72M9j25j4N3k37L45k77M5J53
$$ -34 72 132 -25 192 103 -17 -62 -228 60 38 -103 -91 -51 -152 120 169 44 30 83 -154 191 -86 -41 112
2085A12o7j72M88k79J43k18p4J2j52K60p9q2J29m4J93j44K5k1R1k56M8M2j18O5
$$ 112 45 -127 361 82 225 7 -67 -55 -207 53 -26 -108 21 -23 170 26 51 30 121 -135 -87 -45 -163 -98
2109i8r2M57m32k6Q3J37n6J18K9j03M3n2k1J55K4k05R6O1O1r9j55p8J86r0L64
$$ -98 -190 267 -165 -191 -108 29 -27 91 120 17 60 8 -13 142 166 -39 57 118 179 80 -75 -153 33 -57 307
2134C07l07N0p8J02K21m10J31o5r8J37k99NN21k16K8j46n6J37NK3p7O7J84n5j08
$$ 307 0 50 -28 74 295 -115 16 -49 -147 -10 -309 -304 217 1 29 -117 -173 -36 -31 -8 -85 -18 166 111 3
2159CK97n04K46K0N4j18k2J73k45J14J53k21J48j42mN3K15n6n11N57j25j30k12
$$ 3 300 -204 42 62 116 -2 -24 149 -96 18 171 -50 98 -44 -48 5 220 164 -347 210 85 -45 -257
2182b57R1k66M73j2o4q9n4L53k03j19K11J5l98L21M7j8j34K08j73q0O6K65m0Q0
$$ -257 -166 -432 41 29 -35 -124 -178 175 -28 -147 64 79 -319 2 49 31 -103 105 -68 -148 -82 183 143 223
2206B23q3l16K98q9J04l59J8L25l58K29j55M6J11l9J03j31P0J57q4j25J45j9p2
$$ 223 140 -176 122 33 137 -222 -204 121 -237 -8 -163 -117 -6 -45 58 -73 -3 154 70 -55 90 71 -1
2229aJK59j4k13m0k60M09L5l81M28j31j23K45m39J67j71K17J17j17k54L10O5m1
$$ -1 0 259 245 32 -8 -268 141 176 -205 223 92 -31 214 -225 -58 -229 -12 105 -12 -266 44 109 68
2252F8j17N3k30M10l49K07o9n2K66l52L10k83j0K34q8K95k50j40N3J91rk57O1
$$ 68 -49 4 -226 184 -165 42 -27 -79 187 -165 145 -138 -148 86 -2 293 43 -97 -44 147 138 -119 -58
2275e8L56j36k68N2nk5J29j15p4L4p9K10p5O4K8L51j85p0k13K01p0j40R0j36L05
$$ -58 298 162 -106 -54 -59 -84 45 -70 -144 -110 -189 21 -54 10 38 389 204 134 -79 122 52 -88 2 -134 171
2300A71K5j73Lk04L47j14K95m38P4K47k06Q9k95J42n4K89k1j29j41PJ24p2J32
$$ 171 196 23 26 -178 169 55 350 -88 -14 233 27 116 -179 -37 -91 198 177 48 -93 -86 38 -34 98
2323I8M0k31n9K73j86Q7j3p0L8j40J31j4j5m3J03K39k55M8m9M1k2r0M8J36l0k17
$$ 98 138 -93 -152 121 -65 22 9 -61 -23 -163 -32 -46 -61 -104 -1 238 -17 31 -18 23 1 -89 -41 95 65 -152
2349a52K56k7l7r1p9L05k53J71Q5nj07j04j30PJ42j04m5M40k90m5J26r7J36j69
$$ -152 104 77 40 -51 -130 175 -78 93 178 173 66 -38 -168 -161 -19 -123 -168 272 -18 -63 63 -34 102 -67
2373f7j48K94j98K98j64J56k28K7j73K79o7j8K1J95l5l77J74k04J99o8k1p1J24
$$ -67 -215 79 -119 179 15 171 -57 -30 -203 76 9 -9 12 207 172 -205 -31 -235 -36 -104 -125 -196 -72
2396g2ML5m0j71K76m5j2j55K76K7j30P2k06J55n0P4k69L27Q3k25O5N3p9j28K52
$$ -72 -68 -33 -73 -244 32 -13 -25 -180 96 123 -7 65 -141 14 -36 38 -231 96 179 -46 19 72 -7 -135 117
2421A17k78J42L78k47k11PN4p8L80l33P6NL5k0j75K37J0k0k78J51J07p2l4k37
$$ 117 -161 -19 359 112 -99 -92 -38 -116 264 -69 7 12 47 27 -148 89 99 79 -199 -48 59 -13 -47 -284
2445b84M01j97P7j50Qo9K79q1J59j33J99l49L08k12j7J57o8R1j44Kj68J94m7J54
$$ -284 117 -80 -3 -153 -145 -214 65 -16 143 10 209 -140 168 -44 -61 96 28 119 -25 -23 -191 3 -44 110
2469A10m8L5k20J67jR5j11j33J11O9J61k04J18q5j08Q8P8l80M68mj34p6k21J84
$$ 110 62 97 -123 44 43 138 27 -106 5 74 235 31 149 64 -44 44 122 -258 210 206 72 -4 -225 -41
2493d1k6J22j29l4M3M6J31J27k73J17j15J61j96J52j49j29M5N7K16o2j78J75q5
$$ -41 -67 55 -74 -108 -65 -19 112 239 -34 83 -32 129 -67 85 -64 -193 -148 -91 125 63 -115 60 -25
2516b5Nk6N7o2R5K5J25j63k70K25J03Q1j65J95j69O0Lj48J37J27K7k29L1p3j0
$$ -25 -20 -46 11 -51 44 69 194 31 -239 -14 89 170 5 200 31 91 94 -54 83 210 237 8 39 -34 -44
2541d4R2k82L18K4j57j28N55j70k55J66q5J39r8l1l2l3Q3N9n7R0m22L91J6k00
$$ -44 48 -234 84 108 -49 -177 378 208 -47 119 34 173 75 44 12 -21 62 121 64 154 -268 123 139 -61
2565f1n3J89j33n7N6J03j56OQ0K00p4j95J07K0r1J7L2M3J92k38k3l7K8o6K08k68
$$ -61 -114 75 -58 -115 -59 44 -112 -106 -26 174 100 -95 12 32 -59 -42 -10 33 225 -13 -36 -73 -45 -111 97 -171
2591a71J20K62j99K57p2j04k73L66j33K4L0p1j06q1L87l58O8J85j63j78J99QJ66
$$ -171 -51 211 12 269 197 93 -180 186 53 77 107 36 -70 -151 236 -122 -54 131 -32 -210 -11 -3 163
2614A63j83J9L02n36L68j29J76j87J42j22o6J4K35o3j69j5J46j94l0L07j01j36
$$ 163 -20 -1 301 -235 133 4 180 -7 135 13 -53 -39 196 133 -36 -51 95 -99 -129 178 77 -59
2636e9r2K71j44J7k6r6L72k27j66J58k24K52R5k93J88K56l09p1k5J46k07Q4J82
$$ -59 -151 120 -24 -7 -33 -129 243 16 -150 8 -216 36 131 -162 26 282 -27 -98 -123 23 -184 -100 82
2659H2k32p4J24N9J87j30J8jn4n5j31L96l08j1K10j43K33o4j33o4J5J7L14l43
$$ 82 -150 -224 -100 -41 146 16 34 33 -21 -76 -207 189 -119 -130 80 -63 170 106 -27 -91 -76 -59 255 -88
2683h8Q2J83j72K06k01J87n6k20n9J47k05K24k52K64n2J27n0l28J08Q7j86M19
$$ -88 -6 177 5 211 10 197 141 -79 -138 9 -196 28 -224 40 -12 115 65 -263 -155 -68 -254 165
2705A65k72N9K65m7k78J98M6K1l2j73L16m94K98O4k17j48P3K0lJ15l8R4r9O7l30
$$ 165 -107 -48 217 170 -108 90 136 157 125 -48 268 -226 72 136 -81 -229 -156 -136 -139 -24 -62 32 -67 0 -330
2730c30K43M0Q7l0J49k1k30J29j35J48J2J28r2k41M9M9L65l90L8j22L38l06M6
$$ -330 -87 -47 40 10 159 138 -92 37 -98 50 62 190 98 -143 -94 -45 320 -70 -32 -154 184 -122 -76
2753g6K34k28R5J66k11o6K41O4l37K60n8L8k60J82J5J1J10l07J67j09J53p1R1
$$ -76 158 -70 25 191 -20 -86 155 219 -118 142 84 122 -138 44 59 70 180 -127 40 -69 84 13 104
2776A04j31K8j58M71m28j04P6K1K24j95K20j68q3j6K08l4K07m4j05j32L5J18j9
$$ 104 -27 1 -157 314 -114 -218 -142 -121 103 -92 128 -40 -123 -139 69 35 242 198 93 -39 -4 114 95
2799I5k42K27q2q3J34j05j84M32k19N8R5j06j59K48J91m94J95l1k5J8J6j13J64
$$ 95 -147 80 -2 -85 49 -56 -240 192 -27 31 126 20 -139 109 300 -194 1 -30 -55 -37 -21 -134 30
2822C0j44J41q0P0j39j4L8J94J12n5j58j45l3L6J74o6j5m3m2R3k6R3R1K2l2k58
$$ 30 -114 27 -53 17 -122 -136 -98 96 208 153 -5 -150 -183 -147 27 -39 -54 -97 -139 -46 -72 21 112 134 102 -156
2848a56M8R7K00j41rN4j10q1j8K24j41K2J6K59j31k07R6J95m67L35j60K52k64
$$ -156 -108 -11 189 48 39 93 -17 -98 -116 108 -33 -11 5 264 133 -74 22 217 -250 85 -75 177 -87
2871h7J01J96l07R6j33M8P8j77J98K36l6j65K54l30j83M45l50r8J82K27k23Q1
$$ -87 14 210 -97 -1 -134 -86 -8 -185 13 249 213 48 302 -28 -211 234 -116 -214 -32 195 -28 53
2893E3J75l81K6J3m1K76n7l31O6L15k8l58L86j41Q0k05K81k03J42p3N1j27J75
$$ 53 228 -153 -127 -114 -155 121 64 -267 -201 114 86 -272 114 -27 53 -152 129 -74 68 -5 46 -81 94
2916I4k94K37l22K32n9P6J47k82K54Q2m6j63LR8mj76J28j94J63j74K61m7j79K49
$$ 94 -200 37 -285 -53 -112 -36 111 -171 83 165 119 -44 -41 57 53 -123 5 -189 -26 -200 61 14 -165 84
2940H4p3j45J06l4J60l10M69l21j68K64K90l76J47l06P6J35NL3j79oK67J00l51
$$ 84 11 -134 -28 -62 98 -212 257 -64 -232 32 322 -54 93 -213 -137 -2 3 36 -143 -149 118 218 -133
2963a33L02N2k07o2J57J7k16K57j14o4J98J4m33J71L07r8j72j1P4j27oj37L07
$$ -133 169 221 14 -48 109 126 -90 167 53 -11 187 201 -232 -61 246 148 -24 -35 39 -88 -94 -231 76
2986G6Q5k44k9K82l16J22j30O2N6j39j75L15N6K3Jj5p5M3Rl0n8J63K14m85L14
$$ 76 161 -83 -112 170 -146 -24 -154 -92 -36 -175 -350 -35 21 44 45 30 -45 -2 7 -23 -81 82 296 -189 125
3011A25o9J84m63O0M67k84r3J14l4n6o8K62p30N55J46O4j56j27M01m41J27K55
$$ 125 56 240 -223 -163 304 20 -73 41 7 -49 -117 145 -585 -30 116 180 24 -103 298 -143 -16 239
3033B39m62L64k68K45j32N3o6j5L6J44m0n6nq0m3K29M2j94R1j57K04k08K40k40
$$ 239 -223 141 -127 118 -14 39 -27 -42 -6 138 98 42 37 -43 -86 143 185 -9 82 -75 129 -79 161 -79
3057g9r5L59j73j06Qk8R8J48j05j20J74k32K99j29j43P3q7K97j70o5L26j24j14
$$ -79 -174 185 12 -94 -86 -114 -16 132 27 -93 81 -151 148 19 -124 -51 -138 159 -11 -76 250 126 12
3080A2q1Q8Q1k12K40k51M2l1J40l7j13Q0rL7j58L30l74J26J4k44K65L5O5Ko3J
$$ 12 -69 19 100 -112 128 -123 -81 -112 28 -9 -122 -42 -51 -14 -172 158 -216 -90 -76 -320 -55 -20 45 47 -16 -15
3106a5qK42l93jJ31Q0J39j13p4J25n59O48j97M6L8K3j85J49j4l81M15j22q1q1
$$ -15 -23 219 -174 -175 -44 36 175 62 -12 113 -446 202 5 51 89 112 -73 76 62 -319 96 -26 -107 -188
3130a88R3K75k02n6J78p1j28Q1j59M60j21r4k25k27L64J83j74K3j03j00M1l6J43
$$ -188 -95 180 -22 -78 100 29 -99 -18 -177 283 162 68 -157 -384 -20 163 -11 12 -91 -191 -150 -186 -43
3153d3N5J13j53J01j55J96l8k46K10J13k67Q6k5J08Kq0Roq2J01Q6p6n6Q6o7j09
$$ -43 12 125 -28 73 -82 114 76 -170 40 153 -114 -28 -53 55 57 -23 -14 -20 -102 -1 85 9 -47 39 -28 -137
3179a37J28J06kk42K60j16k50QJ00K62J91k02Nj13K18l87J88j41L03j13L7k28
$$ -137 -9 97 95 -147 113 -3 -253 -245 -145 117 308 106 111 -2 216 -171 17 -124 179 66 103 -125
3201a25L83k91j13j56J37K51j61j97J60J47r0J36j7j15qK64j86j5j08nK11j38
$$ -125 258 -33 -146 -302 -165 86 -75 -272 -112 35 -55 81 64 -51 -59 205 19 4 -104 -109 102 -36
3223c6J67R5j46M6K8l14J74n7M3m6J36j80R6J77j93N7j70j6J42qP2k6l51K15P4
$$ -36 131 226 80 126 154 -160 14 -43 0 -46 90 -90 6 183 -10 47 -123 -139 3 -5 67 41 -310 -95 -21
3248b1M8L51m91K26o3k84K94R6r6l25L45K21m19N1J87k37P7N5K8j87J59j01K08
$$ -21 27 378 -113 113 50 -234 60 156 60 -265 80 301 -118 -67 120 -117 -40 15 43 -144 15 -86 122
3271A22j29Q3K3J4j6r9j26k0L33k23l12K64L58j45j26j3J47l86L26l16L20R2k
$$ 122 -7 76 99 113 97 -2 -128 -148 185 -38 -350 -86 272 127 1 -12 135 -251 75 -241 79 171 169
3294A69j44l8j00J58j23j67K90k37J08K22k84J63J64k03l7K09L4m8p2J49n13J62
$$ 169 25 -13 -113 45 -78 -245 45 -192 -84 138 -146 17 181 -22 -59 150 184 136 64 213 -300 -138
3316a38j23L03pk32K00J34j48rJj8j19L22j21l4J34j17Q7j59M3j9J54k12J76K2
$$ -138 -261 42 35 -197 3 137 -11 -20 -19 -37 -156 166 45 11 145 28 115 -44 -1 -20 134 -78 98 120
3340A20q8J00k28j0K70m6j41l0K83k18J88k13R7j41J91k21R1k09L08N3l78K82
$$ 120 32 132 -96 -106 164 118 -23 -53 230 12 200 -13 84 -57 134 -87 4 -205 103 156 -222 60
3362F0K96m82J53k5N9r3O3k65K52j06j32K66j31K4K0N5J29k44J61n2q2Kr6K52
$$ 60 356 -126 27 2 61 -32 31 -234 18 -88 -220 46 -85 -61 -41 14 143 -101 60 8 -74 -72 -168 84
3386H4r9J02j78j9K68k50o6J92j93J68l35L97M7j61o9Q0O6n8P1p0J58J62r3k72
$$ 84 -15 87 -91 -110 158 -92 -158 34 -159 9 -326 71 118 -43 -112 -32 34 -24 47 -23 135 297 204 -68
3410f8P7RK11p5j17J5o9MP6N7j05J6k9k60M19R1j70o5o1N3n4J85k13R7K8l3j22
$$ -68 9 18 229 154 37 52 -17 -13 63 120 15 31 2 -258 161 252 82 17 -44 9 -45 140 -73 24 52 19 -103
3437a03k3ML15l5j2j43N2q8k5p9Ll8K78j89J44j38J30O8M0j65m14K96K24j1p2
$$ -103 -126 -122 193 158 146 3 55 -33 -58 -137 -134 -172 106 -83 61 -77 53 121 161 -4 -418 -122 102 91 19
3462A9k08J58K4J97k61K41l0j04j2Q5k40J30l6J85n7j61r6O8j9n6J48q6j28l2
$$ 19 -189 -31 -7 190 -71 170 140 36 24 109 -131 -1 -37 148 91 -70 -166 -98 -117 -173 -25 -111 -239 -271
3486b71J48K7J96KJ59m00J22QK6q6j14L00l1k62J56J72o3j71J52R9m9J78n12J65
$$ -271 -123 -96 100 102 261 -139 -17 -9 17 -69 -183 117 86 -176 -20 152 89 -82 70 169 120 298 -214 -49
3510d9n7J93o1M3q4j12J42k29J90J65j36j82K86l40L95j30n2P0j51k2J75L4J9
$$ -49 -106 87 26 69 -15 -127 15 -214 -24 141 5 -177 109 -231 164 34 -18 52 -99 -121 54 88 107
3533A07k04J32n0q3K82j04j12N8j7J89m4Jk11P8r5J45J58r9k38N5o7J62m9m3l0
$$ 107 -97 35 -15 -98 184 80 -32 26 9 198 154 155 -56 22 -73 72 230 131 -107 -52 -119 43 -6 -49 -79
3558g9K46j33P2p4l9k2J8k41P2J90l15N66k55Kj26J96l27J84j5j7J45j35j60M64
$$ -79 167 34 106 32 -7 -29 -11 -252 -180 10 -305 261 6 8 -118 78 -249 -65 -80 -97 48 -87 -247 217
3582B17m65K42Q0n4P6j08Q9j66K15j60J08k30M36m72K64j85K58j12K13k82J03
$$ 217 -248 -6 74 20 96 -12 77 -89 126 -34 74 -156 280 -192 72 -113 145 33 246 -36 67
3603F7k59Q2K31P5o1J50k85P2J18k08o0j50K81m0J25p9p1K17k68J71M3j81m3k7
$$ 67 -192 -110 121 196 135 285 0 72 190 -18 -78 -228 53 13 138 59 -12 205 -63 108 151 -30 -73 -100
3627a00j21J86j47K80j70j91M00j4j16j81J81j29J58M5k91J55j13K41q2R0N0M8
$$ -100 -221 -35 -182 98 -72 -263 137 123 7 -174 7 -122 36 81 -210 -55 -168 73 -9 81 131 179
3649A79j74q1l4K44j3l31K39J10j45j33J95L3k3j47J10K46m57J25O0k44M21j74
$$ 179 5 -76 -110 134 121 -210 29 139 -6 -139 56 89 66 -81 29 275 -182 -57 3 -241 180 6
3671FJ15j04J70j4j40K25j85k3j31R5J67k32M0o4K95k59N2J57j77j37J56j13J65
$$ 6 121 17 187 173 33 258 73 50 -81 14 181 -51 -11 -75 220 -39 13 170 -7 -144 12 -101 64
3694F4n2J12o0k63O2J64j63L40j04mJ7m0J26j01p9j54K62p7O2k33J51j33J37j24
$$ 64 12 124 64 -199 -137 27 -136 204 100 96 113 73 199 98 19 -135 127 50 112 -121 30 -103 34 -90
3718i0L01j65L85l35j98J30k43K9%Q2j63J56p5K1j46M20m25K45J47k9p5J59l07
$$ -90 211 46 431 96 -102 28 -215 -186 -186 -104 -267 -111 -186 -165 -311 109 -316 -71 76 47 -28 131 -176
3741a76N97l15j19J65k11L15k86j19J49K49k27Q6j14kQ9K4Q4k16J5j64J47J06
$$ -176 421 106 -13 152 -59 256 -30 -149 0 249 22 108 -6 -8 81 105 189 -27 -12 -176 -29 77
3763G7mm5j46J65j13r5K2K19rk6r8k35L55O3k64N5j05K42k76J81J25j49K56j63
$$ 77 73 28 -118 47 -66 -161 -139 80 71 45 -53 -288 67 130 -134 -79 -184 58 -218 -37 88 -61 195 32
3787C2j39q5J57J43j05N3J59k61J73k49J46q8J07k89K43j79J68K05r9k76ML5L32
$$ 32 -107 -192 -35 108 3 56 215 -46 127 -122 24 -64 43 -246 -3 -182 -14 191 92 -184 -180 -145 187
3810A87l25J56kJ15J64l59J52L2p5qN0k25M28m23m2K22k63K32p1J1O0n7L54k48
$$ 187 -138 18 16 131 295 -64 88 120 45 37 87 -138 290 -133 -175 47 -216 16 -55 -44 16 -41 313 65
3834F5J28l60m5J21%J67j39j6J11kk3J43J00l40j14M87l83J26QP7R9k24Q9Ok37
$$ 65 193 -167 -212 -91 -91 76 -63 -79 32 30 7 150 250 -90 -204 283 -100 26 34 111 210 -14 75 81 -156
3859a56J9L72k09j3l2R4l2k15K56j24K57j07j26K1l4J33r3j12J01P5l5O4m7q9
$$ -156 -137 235 26 13 -19 75 43 -172 84 -40 217 110 -16 5 -29 104 11 -101 0 75 40 104 57 -32
3883c2j23L15j30r0K52k56j05L06j19qL7j10K7M9M4J78j44k21J6m5L88l22J46
$$ -32 -155 160 30 -60 192 -64 -169 137 18 10 47 -63 -36 13 57 235 91 -130 -114 -159 229 -93 53
3906E3k49p6J83R9R6j29J28l26J98J1p4J07j30Pj29R0L70k25L2M4Jj52K25m9j97
$$ 53 -196 -272 -89 10 106 -23 105 -221 -23 -12 -86 21 -109 -102 -231 -141 229 4 36 80 81 -71 154 105 -92
3931i2J40l30L50k19M6J39j35MQ7j57M64l49J57j87K26j25N7l0j33J3o1L6M1O9
$$ -92 48 -282 68 -151 -105 34 -101 -97 -10 -167 297 -52 105 -82 144 19 76 46 -87 -74 -135 -99 -58 11
3955A1m1p5K53J9j85Q1J11k24KR0K18k57j02J04r6jO5k3J07J74l38J23p4k2J46
$$ 11 -30 -105 148 167 -18 63 174 -50 -48 42 260 3 -99 5 -91 -92 -27 -50 57 231 -107 16 -58 -80 66
3980F6j5j88j67Q4K88j31j16M70k79k32J73K06j81m7O4J55n0j65M5L2Q9j85P4
$$ 66 51 -137 -304 -220 68 -63 -179 291 12 -220 -47 159 -22 -69 -5 150 100 -65 -20 12 101 -84 -10
4003a0jK40l34j76L26R6J16pk86q3J44N7l05J37j42M61j48j4j89O1l8J30j38J89
$$ -10 -11 229 -105 -281 45 141 257 250 -36 -119 25 82 -223 -86 -228 233 85 71 -118 -57 -95 35 -103 86
4027H6l85L80k42L06j53m8J67k28J84k90J99K46m6n3j88q7J61R4k81J70L6j4J40
$$ 86 -299 81 -161 145 -8 -56 111 -117 67 -223 -24 222 176 123 -65 -152 9 103 -178 -8 28 14 154
4050A54k72O4N6K05j23j67J54l51M30q6k61O5k1K05j41J6p4L70k87K37j94L0K41
$$ 154 -118 -54 2 207 84 -83 71 -280 150 64 -197 -132 -153 52 -89 -73 -147 223 -64 173 -21 9 250
4073B50k00J60k14n3J91j20J99j8m08K07N8oN5l0r1o7J54l07Q7K0R3j02K52j06
$$ 250 50 210 -4 -57 134 14 213 195 -213 -6 52 46 101 71 -20 -87 67 -240 -153 -133 -40 -142 110 4
4097Dj37J50k51J22P7j38K69k92K42j42j54M88j12l52R8L41l12K43k18M3K51n9
$$ 4 -133 17 -234 -112 -35 -173 96 -196 46 -96 -250 238 126 -226 -128 213 -99 144 -74 -31 220 161
4119A61Q5r8n9o6L19n29M00j11j10L01m64J75L4q9p2r2K12O9Q6n4M0k64L06j82
$$ 161 246 148 89 23 342 -187 213 102 -8 293 -171 4 38 -51 -123 -215 -3 66 152 98 138 -126 180 -2
4143bJ73n9l02J5n4K17L7j31J01J04j39L6o4J65j12j70N1R4M2m2J24j71R8j22
$$ -2 171 112 -190 -175 -229 -12 25 -106 -5 99 -40 -4 -68 97 -15 -185 -134 -40 2 -40 84 -87 11 -111
4167a11J5nJ29j74J72q2M15l39j03J11J80l30K49jj04q8M0K52l12K09j79J5J81
$$ -111 -96 -101 28 -146 26 -56 359 20 -83 28 208 -122 127 126 22 -66 -26 226 -86 123 -56 -41 140
4190A40J30m05K61j32J0j00L47j31O1j12j23J69j26J02j51J44Q1j59J30j59q8
$$ 140 270 -135 126 -6 4 -96 251 120 181 69 -54 115 -11 91 -60 84 165 6 136 -23 -111
4211a11P2K68k0l34M1n0K15Q8m47K58K0P2j80P0J51j60J41J01j12j64J38n6j89
$$ -111 -39 229 209 -125 -84 -134 81 169 -278 -20 0 72 -108 -38 113 -47 94 195 83 -81 57 1 -188
4234a88l3M25q5k06L3J93l46Q6K78j52q1J57P1l9r3o3J28j1l1M0o0N8j82J60J
$$ -188 -221 204 119 -87 -54 139 -207 -121 157 5 -76 81 152 113 20 -43 85 74 43 83 23 81 -101 59 60
4259F0J91N1k90p7J9j04J84k18K6K84k22P7R1L8J46M7l75K63o4k6m6j51l0R4J3
$$ 60 251 302 12 -65 -46 -150 34 -184 -158 126 -96 -19 72 110 256 303 -72 191 127 101 55 -96 -126 -32 -19
4284a9j42L73l46N9J41j30j22J51J63l01R2L88k07Q5k98N7r4J22J03K5j20O7k9
$$ -19 -161 212 -134 -75 66 -64 -186 -35 128 -173 -81 307 100 185 -113 -56 -150 -28 75 100 -20 47 18
4307A8J61m50N03l75K56l15M4J70L6j02j88K79L1M7j72J54J17k83J43l09J86J73
$$ 18 179 -271 232 -143 113 -202 -158 12 48 -54 -242 37 68 115 -57 97 214 -69 74 -235 -49 124
4329A24nk3r9R6j84K5K59k96L72j80PQ1k60k7L39l59K78n8k89J39N7j13J05P8
$$ 124 119 96 -3 93 -91 -66 193 -103 269 89 96 177 -83 -110 229 -130 148 90 -199 -60 -3 -116 -11 67
4353F7P3q5j75p1L92m70L43J4Q5n6J7k09Q1k03J55r1J2K40j87L72l63r4K91l79
$$ 67 140 55 -120 -191 201 -269 74 88 173 117 134 -75 6 -197 -42 -133 -121 119 -68 304 -59 -153 138 -241
4377b41L28m9j7j27K19J14l23P1K1J42J24k26oj47J64OL5N3q2N6j7j79J4o6j81
$$ -241 87 38 21 -106 113 227 -96 -25 -4 138 262 36 30 -117 47 53 88 141 59 115 98 -81 -67 -133 -314
4402c14K74om8K14k85J96r2O5N6j69l8j3K37k1J91l37l4J21M1p1K97l07L61k20
$$ -314 -40 -46 -94 120 -165 31 -61 4 60 -109 -147 -160 77 56 247 -90 -124 -3 38 -33 264 -43 318 98
4426I8l73J62j12L49Ok38K07j11J83l9j1K00j61r4j64J06k63J96k61J66J40J43
$$ 98 -275 -113 -225 124 130 -108 99 -12 171 132 121 321 160 66 -98 8 -255 -59 -320 -154 -14 129
4448A29k63J15J59r2k26J58q8q0K57L76n69J52J73k18Q0j79Q3k7k8JK84k11Q4
$$ 129 -134 -19 140 48 -178 -20 -108 -188 69 445 -124 28 201 -17 63 -116 -33 -60 -88 -87 197 -14 70
4471G0j06J26j27p4K71k65J42p9r1J49L3k94L54P9k38P5R3k13J64K1J14j14j66
$$ 70 -36 90 -37 -111 160 -105 37 -42 -133 16 49 -245 109 188 -50 25 118 -95 69 90 204 90 -76
4494g6n9J17NL7j4j95K34P3o0J06l35N8K39n7j62j07O9M17l14J61j98J30jj24
$$ -76 -135 -18 -13 24 10 -185 49 122 62 168 -167 -109 130 73 -89 -196 -127 290 -24 137 -61 69 68 -56
4518e6j50L29J78l22j7k7K16l02j78K62J29J1j04K4Q4k16K35o3p9J54J06j64j12
$$ -56 -206 123 301 -21 -38 -65 151 -151 -329 -67 62 73 -31 -7 77 -139 96 33 -46 108 214 50 -62
4541f2K84j28Mj59K41l89J39P8P7R6r6j5j30L1J1J49j74j92M10q2J23k33J12j31
$$ -62 222 94 98 -61 180 -209 -70 8 85 181 85 70 -60 -29 -18 131 -43 -235 175 93 216 -17 95 -36
4565c6j44K32j23k14L49m8J81m24J40J50k06j6M31k14l75J96K53j44Q6l11J31
$$ -36 -180 52 -71 -285 64 16 197 -227 -87 63 -143 -159 272 58 -317 -121 132 -12 74 -237 -106
4586a06l1L2K26j00j33J14J97l4O2k83K9J43P2k87J92Q1m90K88m7J51m49M49P0
$$ -106 -137 -105 121 21 -112 2 199 165 227 -56 -27 116 188 -99 93 174 -316 -28 -75 76 -373 76 146
4609A46k5q0O2l07K12K65o9k4m53K62Q3L17m14m7n3K68k0j27j97J61J17j4k57
$$ 146 121 41 103 -204 8 273 204 180 -273 -11 72 389 -25 -72 -125 143 123 -4 -201 -40 77 63 -194
4632a94Q9J53j32p3J60m2J29p7j64J42k6K06l14P2J41J47l78N4J99n7m3N9j06
$$ -194 -105 48 -84 -157 3 -39 90 13 -151 -9 -35 171 -143 -71 70 217 -161 -107 92 35 -8 51 -55
4655e5N8J66k91L32l97L7K99k42j63kK85q8K74l6l58J75N4O2J19j54Nk87J78M2
$$ -55 3 169 -122 210 -187 -150 149 -93 -256 -258 27 -61 213 177 -181 -6 48 110 229 75 80 -207 -29 13
4679A3k31J36J51l81KL55M9J40l29R8K19L4k37JL24k29p7j93J0K03R7k55J86j5
$$ 13 -218 -82 69 -312 -310 45 94 234 -95 3 222 256 19 20 344 115 38 -155 -145 58 155 -100 86 71
4703G1j43j51K89j64mK55Lk39J6k08K41N9p2M9j80K41r9J38l1k10K3j40O6K03
$$ 71 -72 -223 66 -98 -102 153 156 -83 -67 -275 -34 25 -47 2 -178 63 -36 102 71 -139 -116 -256 -190 13
4727A3j84l6M69l14Rj02K55k29m7K63K18l62R0J86m65L54k27J12j25P2j03L6J06
$$ 13 -171 -207 262 -52 -43 -145 110 -119 -166 97 315 -47 43 229 -236 118 -109 3 -122 -50 -153 -117 -11
4750a1r7J64J86m52J05j26J48q2K10k40O7K50r3k6j22J67j81K45r3m9N7j35K23
$$ -11 -108 56 242 -210 -105 -231 -83 -165 45 -195 -128 122 29 3 -119 48 -133 112 19 -30 27 -108 115
4773A15k41LJ40L5m6k3r2NJ25n2k20L00J69mk24q7J48l7q1K3k0M0J88l95K61j2
$$ 115 -126 -123 17 52 6 -17 -109 -104 21 -31 -251 49 218 214 -10 -97 51 14 -67 -44 -64 -24 164 -231 30 18
4799A8j01jJ78Q0j35j7P6j47O9K19j40r4M2ro5o2J07P7m6p0j43L11j59L04m11
$$ 18 -83 -84 94 174 39 22 98 -49 20 239 99 5 47 38 -27 -89 18 95 49 -21 -164 147 -12 292 -119
4824a19K79l91M38Rj77l4j21Q2K0J10L1m10K73J08k95J28K91m42m2K47k84K40
$$ -119 160 -231 207 216 39 5 -116 -34 -14 96 127 -283 -10 98 -197 -69 222 -220 -262 -15 -299 -59
4846e9R8J37j40j08M2K47J13k94K6J0J02j78k5J79q6j98K36j78M03l14k0k30L35
$$ -59 39 176 36 -72 -30 217 330 36 62 72 174 -4 -29 150 64 -134 102 -76 327 13 -7 -237 98
4869I8J78l80J98j48J0Q5o3K00L9l27J49k68Q8P0j9kK27j90K45k54M3j3n9k55
$$ 98 276 -104 94 -54 -44 41 -22 178 217 -110 39 -229 -141 -71 -90 -92 135 -55 190 -64 -21 -34 -93 -348
4893c48K53l3J34K3Mk18O8J3J76J20o1j88j35Q1R8J57k47K6J69j40P0k54J01P6
$$ -348 -95 -128 6 29 33 -185 -117 -104 72 192 131 -57 -192 -111 -13 144 -103 -77 92 -48 22 -232 -131 -55
4917e5J06j4k1j26j2jl8Q3r5L03l20K23N1o4K8l24J93J77k15J0q2P5j54K46K55
$$ -55 51 37 16 -110 -122 -123 -161 -78 -173 130 -190 33 84 20 48 -276 -83 94 -121 -111 -193 -118 -272 -26 229
4942B29l38L44l38k53N34m04R9J67M1j90K56p7k29J91j16J04n9K20m3r4j3p1K99
$$ 229 -109 235 -103 -356 178 -226 -127 40 81 -109 147 70 -159 32 -84 20 -39 181 138 44 31 -40 259
4965B59j82k24Q0p4L04j92o9j6j66N01O2p8l53N0K25j96k1K95k93P0p3J66O8r1
$$ 259 77 -147 -67 -141 163 -29 -98 -114 -280 221 283 205 -148 -98 127 -69 -90 205 -88 -18 -91 75 143 52
4989E2K21j53J5j86J38j15K7Q6J29k88J03l68l3N13q1O8k62o7L80K8l7j04q0Q0
$$ 52 273 120 135 -51 87 -28 -1 85 214 -74 29 -339 -372 141 60 128 -134 -201 179 207 170 66 -14 66
5013F6K8l0j86K09K7k35J40j30j6k5K55j90J71j53OJ36N5l10J71m6L33k14M5n9
$$ 66 94 64 -122 87 114 -121 19 -111 -127 -152 103 -87 84 -69 -63 73 128 -182 -11 -57 276 62 107 48
5037D8n9K41k02nK6k5J40Ol93J28J66j48J15r9K01l8j44n3j6Q9k1m4M3jR4m6r2
$$ 48 -11 230 28 23 49 24 164 170 -223 -95 71 -77 38 -61 140 102 -42 -95 -111 -22 -43 -87 -44 -45 49 3 -89
5064h9LJ01k1L8j6l9J5L69m04k3L8jj12K32Kk08J06k57K23K06m7K7k68k1j96L06
$$ -89 -86 15 -6 32 16 -23 -8 361 -43 -66 -28 -29 -141 91 93 -115 -9 -266 -43 163 116 143 -125 -146 -342 -36
5090c6K35r0k90J15K80l08M42o10J61k0J04L41m19J67pj52p8P9k5J86R8NR1k70
$$ -36 199 109 -181 -66 214 -94 348 -262 -101 -121 -17 324 -95 72 65 -87 -165 -86 -111 75 173 178 269 -1
5114am4Q5j12J0J56k06K61K1k77K61k87J11O4p7K85L5k33r1K01k84J83k41P6l9
$$ -1 -45 40 -72 -62 94 -112 149 170 -107 154 -133 -22 42 -35 250 285 52 -39 162 -122 61 -180 -104 -143
5138a43J60J04k18K9J66j09Rj66J59J66rj39P2q9p4J68j9k44o5N06l45K50o7O1
$$ -143 17 121 -97 -68 98 -11 -2 -168 -9 157 148 9 81 -8 -82 86 67 -177 -242 264 -81 169 102 163
5162A63j70M1o7N9J02k41J19R0Nk40j22L62l4l5Ok37J71K85j00j98o3j19M47j54
$$ 163 -7 34 -33 26 128 -113 6 96 101 -139 -261 101 67 32 38 -199 -28 257 157 -41 -104 -223 224 70
5186G0k87L49k45j31P1J65K89l88J04o5j38K44N6o7L5K00k85M7J9K5J35j38j91
$$ 70 -217 132 -113 -244 -173 -8 281 -107 -3 -68 -206 38 94 27 62 262 -23 24 43 68 203 65 -126
5209a26Q2Q4p7p6pKO8J90l31r4L73k78K82J10l6j60R7l33J33J74K1q6P1j51K21
$$ -126 -44 40 -37 -113 -120 -118 -50 140 -191 -285 88 -190 92 202 166 6 103 -230 -97 77 98 12 83 -68 153
5234A53j53J37l05j40L62L8k69L65K01m29J10j5l25M07o8P7k07J37O7Q7J44m40
$$ 153 0 137 -168 -308 54 92 -177 188 389 -40 70 55 -270 137 69 146 -61 76 143 230 374 -66
5256f6K90k16ml70M44k5M3l1j25M15k13j62k8l3O4L8J6n0J65j47m3k12K41n7p0
$$ -66 224 8 4 -366 78 53 96 65 -60 355 142 -20 -48 -81 -17 21 37 -13 152 5 -38 -250 -9 -66 -136
5281a36KK27%pk86K3L50m10K41J35j00R9j77NJ17o1M8j33M4P1l23L79Lj9k18L22
$$ -136 -134 93 93 86 -200 -177 173 -237 4 139 39 138 -39 -34 83 22 70 -63 -19 52 -271 108 111 92 -126 196
5307A96j98j77K67Pj63R2j09L13j99M1O7k18J0J52M4J8L1k42M55m20J16n3JM9
$$ 196 -2 -179 88 95 -68 24 -85 228 29 70 137 -81 -71 81 125 143 174 -68 387 -33 83 30 31 80
5331H0N2k70K1n6J59L02k77mL4O9l26J03m7J61M1k00J7K34R6k33N3q1Q1J75j13
$$ 80 132 -138 -117 -173 -14 288 11 7 41 110 -216 -113 -160 1 42 -158 -141 93 189 -44 9 -72 9 184 71
5356G1m5J08Pj37j62K40K05l94J14o4P0j48k0K33m8j31j7P3L10j39n7j74k5K14
$$ 71 26 134 141 4 -158 82 287 -107 7 -57 13 -135 -155 78 30 -101 -118 -45 265 126 69 -105 -130 84
5380H4RK01k78m6L52k97K61k00K10l63N3J50k25J77o8K49n26J46J4J61k45L29
$$ 84 93 294 16 -30 322 25 286 86 296 -67 -14 136 -89 88 20 269 -257 -111 -97 64 -181 148
5402A48k06j32K23J7L0n0j5q7K01j87k9L64l54K38k9J57k76r7Q2r3K39l15Q0J42
$$ 148 -58 -190 33 50 80 30 15 -72 129 -58 -87 277 -77 161 132 289 13 -84 -2 -95 144 -171 -91 51
5426E1r9L8J04p3k1J29n8l6O2j09p0J77l40K28R6R5j09j77J28j37J32j06Rk3J76
$$ 51 -48 -10 94 21 0 129 71 35 97 -12 -82 95 -245 -17 79 174 65 -112 16 -121 11 -95 -86 -109 67
5451F7j10K27k30N4j57J17R8j59J1j25K13j98K10K28j88M5J36l89J03M39l10P
$$ 67 -43 184 -46 8 -149 -32 66 -93 -82 -207 6 -192 18 246 58 103 239 -150 -47 392 82 89
5473H9j62M9j28J01k3J05M3j20P9lk05J39R5Q4n0J9l1j98O9j91M04m29K85J26
$$ 89 -73 -24 -152 -51 -74 31 74 -46 33 30 -175 -36 59 143 93 112 81 -117 -48 -239 165 -264 21 147
5497A47k70l0Q8J56q1K19l74K27q4K39k77R1k57P9J83k67J31O9r4L36k0j98k6
$$ 147 -123 -153 -65 91 10 229 -145 82 -2 237 -40 51 -206 -127 56 -211 -80 -11 -105 231 211 13 -13
5520a3Nk23L66l51K58p1l6J33j76K77R5m06N01j28m75M48k51O2Q5j75JP9J3j3
$$ -13 -8 -231 135 -216 42 -29 -65 68 -108 169 264 -142 359 231 -244 204 -47 15 100 -75 -74 5 18 5
5544EJ23Rk01Jj33K25J62k15J36J89m82R1Q9j9m0N2op7m6P4k4R5k24J60j7N5j7
$$ 5 128 137 -64 -63 -196 29 191 -24 112 301 -181 -90 -1 -20 -60 -8 -14 -91 -137 -63 -87 8 -216 -56 -73 -18 -35
5571c5j56K58o6p2m1K70k05j49K85l01N9Q0Pj4K81J16k29k87K38m7J27j24M6j71
$$ -35 -191 67 1 -71 -112 158 -47 -196 89 -212 -153 -73 -66 -80 201 317 88 -199 39 -8 119 -5 41 -130
5595a30J04J20k33j28K89r8J24r1j14K48l43N60l26r1J65l07L61L6p8j61J2l3
$$ -130 -26 94 -139 -267 22 -76 48 -43 -157 91 -252 308 -18 -109 56 -251 110 146 68 -93 -81 -114
5617a14K02k11K55l38J06J92Rk7j17K14k27P3P6l45K46k22J01K22p1O3R2o9j78
$$ -114 88 -123 132 -206 -100 92 101 74 -43 171 -56 17 93 -252 -6 -228 -127 95 24 87 179 110 -68
5640f8P2j27K15j90j8M1j83K12Q0N6k67J45J9j9n6P3K49k34k28l7K90r0J54L1
$$ -68 4 -123 92 -98 -116 -75 -258 -46 34 90 -177 -32 -13 -32 -88 -15 234 0 -228 -265 25 -65 89 120
5664A20J5K1n3j09j79J64K13k63K1J73k53J08j44K15J47j48J7j41R2L6j1j22J21
$$ 120 135 156 103 -6 -185 -21 192 -71 -50 123 -130 -22 -166 49 196 48 65 -76 16 52 41 -81 40
5687D0r4J75k95Q4K46m26M4M01J20l45J22k39K94j15K24k01l1Rj86L15M4j51J09
$$ 40 -54 121 -174 -90 156 -270 -226 175 295 -50 72 -167 127 12 236 35 4 13 -173 142 186 35 144
5710A44j92P4j07J37k0q1J83n4k2k31l4J51J83j90m0K34j19LM3N8q0j44J34k16
$$ 144 -48 26 -81 56 36 -45 138 84 62 -169 -203 -52 131 -59 -99 135 16 19 62 120 40 -104 30 -186
5734a86N4Q5J48k77l1K03o8J11Ko3M3R7r1K82l56J59K6Qk24K14k07K11l16K19
$$ -186 -132 -47 101 -176 -207 -4 -72 39 41 -22 21 118 27 309 -47 112 138 146 -78 136 -71 140 -176 43
5758D3Q9O0j0k89K23k86J77j2o6R1j48K65r0o1q9K08j16J18J55j58j33J23N3p7
$$ 43 132 192 182 -107 116 -170 7 -5 -71 20 -128 137 47 -14 -103 105 -11 107 262 104 -29 94 147 70
5782G0j25k1N8j26N5J73j34P1jJ51l49K24j38L33m33K95L6l06L98m67J98j93N5
$$ 70 -55 -76 -18 -144 -89 84 -50 21 20 171 -178 46 -92 241 -192 103 139 -167 231 -236 -38 -231 -176
5805a76L1K14p1J50k36p0J63k8p5N0j24O6K29Q3m87J01Q5O2j7q6K88j60O7p8q7
$$ -176 -145 69 -2 148 -88 -158 5 -23 -98 -48 -172 -106 123 206 -281 -180 -95 -33 -50 -136 152 -8 59 -19 -106
5830a06K18J03m10K22PR2K30m88K46j11%l14K41J79q9L0l6n2J65Pj96J31O5o5
$$ -106 112 215 -195 27 34 126 356 -132 114 3 3 -311 -70 109 20 50 14 -38 127 134 -62 69 134 69
5854F9J93k01J12l37J18N8j53K39q6l6j44N15k51j72l5j72o6L11L12p4L3j97o8
$$ 69 262 61 173 -164 -46 12 -141 98 12 -24 -168 347 96 -76 -111 -283 -349 -38 274 200 233 36 -32
5877c2K7L0nK0J0j09J76K5L5j92j27J81j74K02j0k9j9J3q1R4P7jr3J2j5l5j70
$$ -32 -5 25 20 40 50 -59 117 142 177 -15 -142 39 -135 67 57 28 9 22 -59 35 112 111 18 30 15 -20 -190
5904a90K08QJJ07j64j14J35j06J08J21j6p9q6J07J33j6n5l46L85k94j0M3L25n3
$$ -190 18 26 27 134 -30 -144 -9 -115 -7 114 98 19 -67 40 173 157 102 -244 141 -153 -163 -120 205 152
5928A52j32p4K23j48Q3k40J33m7K13k05j18L73j90j52O0J77j85J20j16k43M83
$$ 152 20 -54 169 21 104 -136 -3 -50 163 -42 -160 213 23 -129 -69 108 -77 43 -73 -316 167
5949A67k83O5J66q5K05l18K03j32r7K98p0k42L56k42k46m8N73k97n5m5m5J52j32
$$ 167 -116 -51 115 30 235 -83 120 -12 -109 189 119 -123 233 -9 -255 -303 270 -27 -82 -127 -172 -20 -152
5972a52L04j07k32Q2M8n9L07r2r1n9R1j99K98l50K47N5k10K49m7l21M3K00M6j
$$ -152 152 45 -187 -105 -57 -116 191 99 8 -51 40 -159 139 -211 36 91 -119 130 83 -238 -195 5 51 50
5996E0J93j48n0Q4j77J11oj90L26j26J01k29K15k98Q8J24p3J19N6k30J44j15k24
$$ 50 243 95 45 129 -48 63 57 -133 193 67 168 -61 154 -144 -56 68 -5 114 170 -60 84 -31 -255
6019b55M14j95J41l9o8K8j04j12K79Qp6Ok6LJ24j66M4l8j71L09j6j3l34K65k26
$$ -255 159 -36 105 66 -2 26 -78 -190 89 97 21 27 1 4 128 -38 6 -32 -203 106 90 77 -257 8 -218
6044b18J29R4R0n4m1KK2j49R7j0o8L12l35J49J19R8k38Kq4J03j95P4K06k86J24
$$ -218 -89 5 95 41 0 2 24 -125 -28 -38 -106 206 -129 20 139 237 -1 1 -83 20 -175 -101 105 -181 -57
6069e7J03r1mN6J19J78l62L12k95j16K66R5j87J68p5k8k42R3%L21k90j02K26m5
$$ -57 46 -45 -49 7 126 304 -58 254 -41 -157 109 204 17 185 110 82 -160 -67 -67 254 -36 -138 88 43
6093D3R7o9o7J49q4j47J19j1R6j62r7J72k52L74k44j9Q4j63LL95k10m9K1j10J84
$$ 43 140 71 4 153 69 -78 41 30 126 -36 -133 39 -213 161 -83 -102 -18 -181 -178 217 7 -42 -21 -131 53
6118E3r7J22NL5L1l58J39K13k29k2J81j00Q1j99J32Q0p5K68k05j35r4J02j61J65
$$ 53 -44 78 83 118 149 -209 -70 143 -86 -108 73 -27 54 -145 -13 67 -8 260 55 -80 -174 -72 -233 -68
6142f8L21k34j04k8J89m6J5j00J50j99N3k5J71j65lL32j46K5j18n9l8O5k09N5
$$ -68 253 19 -85 -113 76 30 45 -55 95 -104 -51 -76 95 -70 -73 259 113 138 20 -39 -77 -12 -221 -166
6166a66K80o5j47n8J84M6jk14PJ13j35M3J85r2j53L25l5k29J43k0R6j34J30J8
$$ -166 114 49 -98 -156 28 74 73 -141 -134 -21 -156 -113 72 -20 -173 152 117 -112 31 11 107 -27 103 121
6190A21n1K31k74k35K91p7J56k85J17O2P1J03k17l8l5J79k11J02P1l2J85r1j12
$$ 121 70 301 27 -208 83 6 162 -123 -6 56 127 230 13 -25 -60 119 -92 10 81 49 234 143 31
6213C1j97K55j07K90l09p6K18J93j00j60L28j47j33k45M8N3P8J24k33J97j53M1
$$ 31 -166 89 -18 272 -37 -113 105 298 198 38 366 219 86 -159 -111 -58 20 144 -89 108 -45 -4
6235dn2K37r9j52J35K9j17K15l09n2o4L41ml2j2OK9j27K68l94q2L76j70J43L3
$$ -4 -56 181 82 -70 65 94 -23 192 -117 -169 -233 108 104 72 60 66 95 -32 236 -158 -240 136 -34 109 142
6260A42k70K95j41R9k77L11k58K13l20qK51k9Rl78J61R8K20j1q2m3j6j04K30j25
$$ 142 -128 167 26 125 -152 159 -99 114 -206 -214 37 8 17 -361 -200 -102 118 107 25 -18 -34 -138 92 -33
6284c3k5j63J78Jn7L8J22j88K53l0k35L95k21P1j35J01N1l47K21l02Q8J87p5L3
$$ -33 -58 -221 -43 -42 -99 -61 61 -127 126 96 -139 256 35 106 -29 72 123 -224 -3 -305 -217 -30 -105 -72
6308g2J86j29J08m5%J61j65N5k0j96J90k37J82J43l52nK41l8l5kK8J05k01J65
$$ -72 114 -15 93 48 48 209 44 99 79 -117 73 -164 18 161 -191 -196 45 7 -28 -30 -2 103 -98 67
6332F7j34J58j14J41l79K36nn2J8K06j36M5L2J40m54J34J88J48k13j50J14j24
$$ 67 -67 91 -23 118 -261 -25 -30 -82 -64 142 6 51 83 223 -231 -97 91 239 26 -124 -10 -134
6354a34kJ50L9j21J20j25k4qJ52P6j1j33o4L9K31k74OK14J11l99L36j54kM4k32
$$ -134 -136 14 53 -68 52 -73 -97 -105 47 123 112 -21 -85 -46 185 -89 -83 131 242 -157 179 25 23 67 -165
6379a65p1M09j92J55O3k97K96l31Q0n0K28j73o0K51k72Q3O4k16K86q3n8P2k2j42
$$ -165 -236 173 -19 136 199 -98 198 -133 -53 -103 125 -48 -108 143 -129 -46 18 -198 88 5 -53 19 -3 -145
6403a45K53k07K17l91K1M47l85L47on8j2j5NQ0j36j05J9n1J21j14L06k02O5J11
$$ -145 108 -99 118 -273 -252 195 -190 157 151 93 81 66 71 151 15 -90 -71 -122 -1 -115 191 -11 54 165
6427A65o1l22K80l5l5l6O4O3j19J49j60J11Kj71j32K53R9N8j14K04m01L5n6P9
$$ 165 104 -218 62 27 -8 -44 20 83 -36 113 -47 64 66 -105 -237 16 115 173 59 263 -138 -103 -159 -80
6451h0j48p3M64J9q5j19o4J78o0J72k73J64j03n9L40q4j04N4l96L22l3n2m8L22
$$ -80 -228 -301 163 182 97 -22 -86 92 32 204 -69 95 -8 -67 273 189 85 139 -257 65 32 -20 -68 254
6475B54k37J24r4R1j68J0n6qL89j71k22O6K5l9J0m0Q6N3J72j38o6K09o6q8q5j34
$$ 254 17 141 47 138 -30 -20 -76 -84 305 134 -88 -22 3 -36 -26 -66 20 73 245 107 41 250 184 96 11 -123
6501a23L73j00j39k6Q9j1j30m6J29j91L32j70Q1p9P6K57k72j13q0K22m5q2J59
$$ -123 250 150 11 -15 74 63 -67 -113 16 -175 157 -13 68 -11 65 322 50 -63 -143 79 34 -48 111
6524A11j96R6j48Q9OQ1j19J53L33k62l57K93k39K04q7o7O3J40o5K19l60N6r2J73
$$ 111 -85 11 -137 -48 -42 39 -80 73 406 144 -213 80 -159 45 -42 -109 -46 94 29 248 -112 -56 -148 25
6548B5k06j67M16n8J05r0J46l31L27l58K22m3M5Jk32M59m14J66l02K71K32m95
$$ 25 -181 -348 68 10 115 25 171 -160 167 -191 31 -12 33 34 -198 261 -153 13 -289 -18 214 -281
6570b81M73l1r9J73l98J88k16J81Oj18J17j20M44k23k23J97m0J23m7j72o6P9K37
$$ -281 192 161 62 235 -163 25 -191 -10 -4 -122 -5 -125 319 96 -127 70 30 153 106 -66 -132 -53 184
6593A84k04j48N0L58l78OK35j35J17K34k77j89J83J71p3K53l60L39m63K8K05p9
$$ 184 -20 -168 -118 240 -138 -132 103 -32 85 319 42 -147 36 207 134 387 27 366 -97 -69 136 57
6615E7j1p8J50Q8j71k14K16k67j3L49l05K09M5K5j4k43k9J00OJ1J84j18J94k17
$$ 57 46 -32 118 206 35 -179 37 -230 -243 106 -199 10 55 80 66 -177 -206 -106 -100 -89 95 -23 171 -46
6639d6J06m5J36n0j18J24M5l56L63l18J37R3l74M32j87m4J18J97k44K39p4j40
$$ -46 60 15 151 101 -17 107 152 -204 159 -159 -22 71 -303 129 -58 -102 16 213 -31 208 134 -6
6661fo7N3J46n2j90K97l19O6L12l58K80k72p1L74m00L06j13QMj64L99l04M4P9
$$ -6 -73 -20 126 74 -116 181 -138 -72 240 -118 162 -110 -181 193 -207 99 -14 -6 -2 -166 233 -71 -27 52
6685E2nj52J37j74r2J21Q0j1q9J51J02j79L56m60k4J71n7J1K3J46Kn4k13oK26
$$ 52 47 -105 32 -142 -234 -113 -33 -44 -133 18 120 -59 297 -163 -187 -16 -73 -62 -39 107 109 55 -158 -164 62
6710F2Oj7K54k80j67K6Q8J27j05j17L97j95j85o4K79J19k63J93k3l44L08l04J89
$$ 62 68 51 305 25 -142 -116 -28 99 -6 -123 274 79 -106 -170 109 228 -35 158 135 -209 99 -205 -16
6733a6o4J3J69P7p0L3p9j89J78j47J16L9R7j15k45K34o9M8J5r9n6K17j96K74k92
$$ -16 -80 -67 102 179 109 142 63 -126 52 -95 21 60 157 42 -203 31 -38 10 25 -74 -130 87 -109 165 -127
6758a27j2K62k64J80j13R2n1K9J26j3j93j02K30p3k44K64J7Q0j70l3k9K13k31
$$ -127 -139 123 -141 39 -74 18 -33 -4 122 109 -84 -186 44 -29 -273 -9 8 88 -82 -115 -144 69 -162
6781a62Q5Q8l85M21o8j91L46J57n31L46lk23J62J51l70K48Lk33K00J10j0j7j33
$$ -162 -77 11 -374 47 -21 -212 134 291 -240 106 103 -120 42 193 -177 71 74 -159 41 151 141 124 -9
6804ij29K26K8r0J1j05j2j95K84q9J64j51R6l0m0K25k87jq4l9O3P4O6J11n2o4
$$ -9 -138 88 116 26 37 -68 -80 -275 9 -80 84 -67 29 -1 -41 184 -103 -104 -188 -227 -164 -90 -24 87 35 -29
6830b9P9j89K59k73J70N7l65K43J11J51l9r2K2J0k50m5J88r6N5M6j50K91m6m5
$$ -29 50 -139 120 -153 17 74 -291 -48 63 214 175 83 105 115 -135 -180 8 -88 -33 13 -137 154 108 63
6854F3p4J01j26o8j18J98K59%l12K9k5J55o1j18L24k33j9n1K3p3O1j80J90p8P0
$$ 63 -11 90 -36 -104 -222 -24 235 235 -77 -48 -73 82 21 -97 227 -6 -25 -76 -53 -126 -65 -245 -55 -133 -63
6879f3L1K17k90m8Q7K14J44k20o2m5l1J06rQ8mj56Q3L8j03J25p4R9p6l57K25l8
$$ -63 -32 185 -105 -153 -66 148 292 72 10 -35 -66 40 31 119 115 -41 42 80 -23 102 28 127 51 -306 -81 -119
6905a19K94k98O2J53j23O6k6j50Q2j13K20k6J29k03j08M52l73K45Or4j6k57O9
$$ -119 175 -123 -61 92 -31 35 9 -141 -59 -172 48 22 151 -52 -160 292 -81 164 170 76 60 -197 -128
6928a28J05J42q4n4J4m6J00P5o3n5P8j30l9J30o4J97j41o5L2k29L46r3K99k70
$$ -128 -23 119 35 -19 -5 -51 49 124 61 6 84 -46 -85 45 -19 178 37 -28 4 -225 121 28 327 57
6952E7O7k74K02j03j65K10J13j6k15m5L17k77J59J14j04k9k31L33j96J43j88J16
$$ 57 124 -150 52 -51 -216 -6 107 91 -124 -169 148 -129 30 144 40 11 -220 113 -83 60 -128 -12
6974a2J11R4r8n3L3j56J17n3nn3K81j13n3p4K56o3k29j51L18NJ7n5j17O9kn4%
$$ -12 99 193 95 42 75 -81 36 -17 -22 -75 206 93 40 -34 222 159 -70 -221 97 102 119 64 -53 16 14 -40 -40
7001d0K13n3j11k6j01L4J87J19k90L3r1J31Q5p0Q7o1m08M02k23P3q5L47j33K06
$$ -40 173 120 9 -17 -118 -84 103 222 -68 -35 -126 5 90 20 107 46 -362 40 -183 -110 -195 152 19 225
7025B25m03M1N52k59k16N1k09L84k33k1L2L66l07K32j73l68L98j77K87j77j27
$$ 225 -178 -137 415 156 -60 -9 -218 166 -67 -88 -56 310 3 235 62 -306 92 -85 202 25 -102
7046a02O3N2l06Q9K01k23J02K0R9p0K23j78k21R3L34n7O9k54o5J37N2m1k5p2j29
$$ -102 -39 13 -293 -204 -3 -226 -124 -104 -5 -75 148 -30 -251 -158 176 119 188 -66 -131 6 58 17 -8 -80 -209
7071b09J93J20p0k06J33K3Jp6Q8nO0j31P9r2J47nj83K45k09p6M09j84o5j95M38
$$ -209 -16 104 34 -172 -39 -16 -15 -91 -3 -8 52 -79 0 -92 55 50 -133 112 -97 -173 236 52 -13 -208 230
7096B30j66l27L71j14j3J07l63M07j41P2kj16P8o1J42o6%j23o9J02L1J61j27O4
$$ 230 64 -263 108 -6 -19 88 -275 132 -9 63 61 -55 23 -38 104 38 38 -85 -154 -52 -21 140 13 77
7120G7k11J14K11k96OK15j15j25J24J95k31Lm90N35K13k51J45r9N7N0j37q7J02
$$ 77 -134 -20 191 -105 -99 116 1 -124 0 195 -36 -33 -523 12 225 -26 119 20 77 127 -10 -97 5
7143Em6J49j11R1j18R8J7J07j57M1r0j56J40K4r1K60j21r2J23O5j47J02j13O1
$$ 5 -41 108 -3 88 -30 68 85 192 35 76 -14 -170 -30 -6 -97 163 42 -50 73 138 -9 93 -20 41
7167D1l20L70j11j63K70j00N4j34J74R9j72j11K25J5l66M24j96J95%m71L16k07
$$ 41 -279 91 -20 -183 87 -13 41 -93 81 180 8 -103 122 137 -229 195 -1 194 194 -277 39 -168
7189a68J41L24k91O7j36m0J65j9O7Q8m8j10q6J65o7m2J10j53l3k6m1K83j74p8
$$ -168 -27 297 6 73 -63 -103 62 43 110 198 150 40 -46 119 52 10 120 -33 -66 -92 -133 150 -24 -102
7213a02J04l4J61j20k17J1K97j47k07L95m3j73J39K23l59K04k31O3r2j50M55j44
$$ -102 2 -32 129 9 -208 -197 100 -47 -254 141 98 -75 64 287 -72 132 -99 -36 -128 -278 177 33
7235C3p6p3l6K00Q5j1o8o4o2j11J97k19K73n4k15K56j82K17j51p6J34j04J05j9
$$ 33 -43 -116 -152 48 133 122 54 -10 -72 -183 14 -205 68 14 -201 55 -127 90 -61 -137 -3 -107 -2 -21
7259b1r0J66j07K62l30J86nL3k58K04j33K29k49K98j00N0l0k70J91k41R2J67j89
$$ -21 -111 55 -52 210 -120 66 61 94 -164 40 -93 136 -113 185 85 135 105 -165 26 -215 -123 44 -145
7282a45M0L48R2l45k79K82k44K03K1l60N96r7m0J0o4k8p4J64Q3m8K01l12q1J47
$$ -145 -105 243 335 -10 -289 -7 -251 -48 -27 -387 209 112 72 82 18 -10 -84 80 163 115 316 4 -77 70
7306G0K62j53r4j71O3K62l29k17L25j96J84J67k47r3L43j96K7j78J18K19j71J48
$$ 70 332 179 85 -86 -23 239 -90 -307 18 -178 6 173 -74 -167 176 -20 7 -171 -53 166 -5 143
7328A43j80l1K55K74m99J2oj42J93pJ68N5o2k77J89k37j07L67Oj20K4j54K63j30
$$ 143 -37 -68 187 461 -38 -26 -32 -174 19 12 180 235 173 -104 85 -152 -259 108 114 -6 18 -136 127 -3
7352ck03L45l58K05QK0j05l8R5K35p3j64j61K35q2p1M88k30l2jj32J44k63K86
$$ -3 -206 139 -219 -14 -6 14 -91 -129 -34 201 128 -36 -197 38 -44 -115 373 143 111 110 -22 122 -141 145
7376A45k94L76Q2k1j38k7k36J44k58M06j48o6j66J63K4M5j4j24k03L46m6k9j53
$$ 145 -149 227 309 288 150 123 -113 31 -227 179 31 -35 -201 -38 -14 31 17 -107 -310 36 -10 -39 -192
7399a92J9J68n5J86j54J61l41J19O4J27R5Q1n54J75L12k55P8J0j8k48L04j58j
$$ -192 -173 -5 -60 126 -28 133 -208 -89 -25 102 197 278 -276 -101 211 -44 34 44 26 -222 82 -76 -77
7422g7P3PJ0Q9Rj84Q5l08K97n4J27J32o3k46m7J7K51K22j90k76J75k37K57qj1
$$ -77 -4 3 13 102 111 -73 12 -296 1 -53 74 206 143 -103 -150 -133 118 340 150 -126 49 -188 69 61 50
7447E0j78P4k8L4K57j54k31L3K52r7k7J40r3j05jK32j2k25j4j00L76j01j27j23
$$ 50 -128 -54 -82 -48 209 55 -176 -143 109 12 -15 125 32 -73 -74 158 146 -79 -93 -193 183 82 -45 -168
7471a68Q0L12j13p4k12K34J88k40k01L0j7K4K49r5M8k26J43J71K2j07k00J93j84
$$ -168 -88 224 111 37 -175 59 247 7 -194 -164 -181 -157 92 -3 45 -181 -38 133 155 48 -152 41 -143
7494a43j05L30j36J14p0K00k31r4J42j80j4r7K34K00k24j11L67K0j19j21j16J04
$$ -143 -248 82 -54 60 -10 190 -41 -135 7 -173 -187 -284 -50 150 -74 -185 182 202 83 -38 -154 -50
7516e0j17K91k8j66O7K77j59K3j08K5J36R4m28MK46j50p3Q2J45l82K08J99p2k3
$$ -50 -167 124 96 -70 -3 274 115 138 30 55 191 285 -143 -139 107 -43 -116 -34 111 -271 -63 136 64 41
7540D1J10j41j50J81k50K51j81J26J71k20O6J56k29OK16q1k37J49j3K12m7p0k14
$$ 41 151 10 -140 41 -209 42 -139 -13 158 -62 4 160 -69 -63 153 72 -165 -16 -29 183 136 66 -148
7563a48K27j78J77R3m22J20J85j75K63q4j95K03j78K6j4J96k9k45L30l97M13l02
$$ -148 79 -99 78 171 -251 -131 54 -121 142 58 -137 66 -112 -86 -100 96 67 -178 152 -245 168 -134
7585a34J70J16j23j85J78P0k80L8J29r4r7K66r3N8m0o4l07L17j63K48J4J98k06
$$ -134 36 152 29 -156 22 92 -188 -150 -21 -115 -212 54 -39 19 -21 -85 -392 -75 -238 10 24 222 16
7608A6j99P1K41j07j49J38l0J06pJ02P6k35j95K59j26K48j69j20K51kk03J0O4
$$ 16 -183 -112 129 22 -127 11 -19 87 80 182 258 23 -172 87 -39 209 40 -80 171 169 -34 -24 40
7631D0k04K00n6K11q4j15L1j52K25j4j05J93k44J83j32p9O8K52k06j1N6k7J22
$$ 40 -164 36 -20 191 107 -8 23 -129 96 82 -23 170 -74 109 -23 -102 -34 218 12 1 57 30 152
7654A52K3k51j9K04j16p9j46J44K2l1J03J78o7q7R9l4r2p6M1N4k58M59q5l86M62
$$ 152 175 -76 -95 109 -7 -86 -232 -88 -66 -97 6 184 117 30 129 95 3 -73 -32 22 -236 223 138 -248 214
7679B14l26N1M0k37J77J18j19K62j55P1j17r4J50k14K41k6j00P3J03j37K0r0j34
$$ 214 -112 -61 -21 -258 -81 37 -82 180 25 96 -21 -115 35 -179 62 36 -64 9 112 -25 -5 -95 -229
7702b29J69J28k45K76mQ8k00j9N5R0K02k90KJ26j45J40l62K63L5l79J89K50l22
$$ -229 -60 68 -177 99 95 183 -17 -36 19 109 311 21 23 149 4 144 -218 45 80 -299 -110 140 -182
7725a82J27J87R2n3l29N1J86q0j6Q8l31L61j90J15J30l52K18J15j95J60o6j68
$$ -182 -55 132 224 171 -158 -107 79 -1 -17 71 -260 101 -89 26 156 -196 22 137 -58 102 36 -132
7747a32K57k46O8O3m4J15j31j76K37j2J55m2k31j5Q9j49J80K45k42j01J62K5j8
$$ -132 125 -121 -53 10 -34 81 -50 -226 11 -1 154 112 -119 -134 -45 -194 -14 231 -11 -112 50 75 57
7770E7ML5l31K10j12L9N2R9j16N8L6n7L2k36O8M38k18l3K05k31Ok90K11J64j47
$$ 57 61 96 -235 -25 -137 -98 -46 53 -63 -5 31 -26 6 -230 -162 276 58 25 230 -1 5 -285 -74 90 -57
7795e7j88K02J7J28q1j48J64j68j84M60J04k00O5o3n6o9J57j76J53l05N68n40
$$ -57 -245 -43 -26 102 21 -127 37 -131 -315 145 249 49 114 51 -5 -74 83 -93 60 -245 323 -217
7817b17m8N01l09l9J7L6QJ65j89M6P9j22J87k82l0K85j1j51R0P4j74K23K6k18
$$ -217 -265 236 -73 -112 -95 -59 -51 114 -75 -29 50 -72 115 -167 -197 88 77 -74 16 90 -84 139 165 -53
7841e3R2L4k76K60J3N7j46M2m7n5J47l1k59K70Q0m7n7p8K33n0j28j58L08j04k82
$$ -53 39 73 -203 57 70 127 -19 23 -24 -79 68 37 -222 48 128 81 24 -54 179 129 1 -157 151 47 -235
7866b35J34J81Nn2j9p6J04J26p1K88m16k55J77N1L2L49j86m7k39K15j53J84j07
$$ -235 -101 80 85 33 14 -62 42 168 97 385 -31 -286 -109 -58 -26 323 137 90 -149 66 -87 97 -10
7889a0Q4j5k58R0L28l17J83j69k0L6Q9O5j92O6M1j92K81r1lj35r5K12l3R2l19
$$ -10 74 59 -199 -109 219 -98 85 -84 -104 -68 21 86 -106 -40 1 -191 90 -1 -4 -139 -234 -22 -55 37 -282
7914b82L02q0m4M4J48J6l8O5j52J4L04m04Q1L8O2j49l1j00M57l99r8K92n5l1L57
$$ -282 20 -60 -104 -60 88 104 66 131 -21 -7 297 -107 -26 12 74 -75 -106 -206 251 -148 -246 46 -9 -40 317
7939C17l28N1L0q0RN3k0J50j15q6J50l59L92J02j42k75J80J35pN4k90K78n0j55
$$ 317 -11 40 70 -10 -1 52 32 182 67 -19 131 -228 164 266 124 -151 29 164 157 211 -79 199 149 -6
7963fn4j9j35L73k95L20j75K9m1J55k44J20p4Q5J35m04R7L28l78K10J30l08N4
$$ -6 -60 -79 -214 159 -136 184 9 38 -3 152 -92 28 -46 39 174 -230 -133 195 -183 27 157 -151 -97
7986i7N3J30j28K64j27j46j67J04l5J87l05K61K8j03j3j43J60R2J03k51L32l12
$$ -97 -44 86 -42 222 95 -51 -218 -114 -149 38 -267 -6 22 -81 -94 -237 -77 15 118 -133 199 -113
8008a13J52l1k48K97J4k38L00j69j18l4K21M7Q8R4k39j43k2Q7r6J79j54L3J52
$$ -113 39 8 -240 57 71 -167 133 -36 -154 -188 33 80 168 262 23 -120 -142 -55 -151 28 -126 -93 59
8031E9N4l46L8K34pJ69m4l94K36j79Q1J2M2J87L4j90j85O1L59o2j2k21K14j11
$$ 59 113 -233 -195 39 32 201 157 -237 -1 -180 -99 -87 -45 142 176 -14 -199 -138 221 159 147 -74 140 29
8055B9K7mn7J26O1j40K01l22K19j52j67L43k72%P5o4RR3j15k2r0k7K39J7j81M08
$$ 29 56 52 -5 121 182 42 243 -79 140 -12 -179 164 -108 -108 -33 -97 -88 5 -110 -132 -222 -249 -10 7 -174 234
8081B34j71k2n1M3q0j17K62M4k71J75k5K8r1j27K35j47K56k33J32K13m34m4J53
$$ 234 63 41 -10 33 -47 -164 98 142 -129 46 21 49 -42 -169 66 -81 175 -58 74 287 -147 -191 -38
8104c8Q3O1j56J88r6j66J49j47j04L89j05R3N6n0O4k87K08o8k37J97l09J68J43
$$ -38 45 106 -50 138 42 -124 25 -122 -226 163 58 151 207 157 221 -66 142 74 -163 34 -275 -107 36
8127C6j11J01j87J84N6m0J21l97M63j6j47j91Q4J12j59L6O5J70L3l43K79j28N1
$$ 36 -75 26 -161 23 79 39 160 -237 226 210 63 -128 -44 68 -91 -55 10 180 213 -130 149 21 72
8150G2o0j8jQ6q4J6j07Q0J31r9Q3q9K87m66J51r7K68k32q8K19P2k83J50J39k78
$$ 72 12 -6 -7 79 -5 11 -96 -16 115 16 99 10 297 -169 -18 -115 153 -79 -167 52 124 -159 -9 130 -148
8175a48K87k48p1J58J49j25J62k02M1k8pqK4J64r1q9
$$ -148 139 -109 -180 -22 127 2 164 -38 3 -25 -32 -40 -16 148 57 -32
8191c2
$$ Imaginary data points
##PAGE= N=2
##DATA TABLE= (X++(I..I)), XYDATA
0@%%%%%%%%%%%%Qj6J6j6K1k9L2m0M8n6O9p7Q8j04J21j42J65j89K17k48K81l17
$$ 0 0 0 0 0 0 0 0 0 0 0 0 0 8 -8 8 -8 13 -16 16 -24 24 -32 37 -40 48 -56 65 -77 88 -101 116 -132 149 -168
34a68L57m01M51n08N69o33P04p82Q67r60J063j179J303j434J579j739J917k115
$$ -168 189 -212 239 -269 300 -333 371 -411 456 -504 559 -620 683 -751 828 -911 1006 -1109
52a109K329k567K837l141L484l880M340m879N526o315P306q596J0345j2860J6813
$$ -1109 1220 -1347 1490 -1651 1833 -2047 2293 -2586 2940 -3375 3931 -4665 5680 -7180 9633
67I633k3948M0697j49565n4912L92375n2295k91974J8292J85546M0649J25711
$$ 9633 -14315 26382 -123183 -178095 214280 161985 -129989 -111697 73849 114498 240209
78B40209J4904k81411j33448K11774P3755p7183J0304q7968j84086R8598J92516
$$ 240209 255113 -26298 -159746 52028 125783 48600 58904 -29064 -213150 -114552 77964
89G7964n1167n7166N0388j27053j27826J56474J47535o4141k1211M571q9662O2464
$$ 77964 26797 -30369 20019 -107034 -234860 -78386 69149 5008 -16203 -11632 -101294 -38830
101c8830K20784K099j56279j5463J2251n7390N1918Q3691n7044m8017K7312n3601
$$ -38830 181954 184053 27774 12311 24562 -32828 19090 102781 45737 -2280 25032 -28569
113b8569m2211Q6161J5334j02724r360M1062l8146P984P2009k5828m3899P2211
$$ -28569 -70780 15381 30715 -72009 -81369 -40307 -78453 -70469 1540 -24288 -68187 4024
125D024N3346l4968j179J2561l7977K924N5721J61k0518J8971j6473m5280J5408
$$ 4024 57370 22402 21223 33784 -4193 -1269 54452 54613 34095 53066 36593 -8687 6721
138F721K7887k6839k7235j1768l0341k701M2949J4176j9962q80p16j3209J6527
$$ 6721 34608 7769 -19466 -31234 -61575 -64276 -21327 -7151 -27113 -27993 -28709 -41918 -25391
151b5391L1197L538m977J891n055P873K8838J4308n035m980j5525j9430l62P80
$$ -25391 5806 9344 4367 6258 1203 9076 37914 52222 47187 42207 26682 7252 6890 7670
165G670j2258k479L013j0510l933O240q487r244N867l378o525J3342P135q277
$$ 7670 -4588 -7067 -4054 -14564 -18497 -12257 -20744 -29988 -24121 -27499 -34024 -20682 -13547 -21824
179b1824J2925K4171K360L727J1967j1638j5181J2437M582j4248N125O239j8405
$$ -21824 -8899 15272 17632 21359 33326 21688 6507 18944 23526 9278 14403 20642 2237
192B237m012J4990p785j3773M962j2163k5143P733J5743q270M913K1060n132o487
$$ 2237 -1775 13215 5430 -8343 -3381 -15544 -40687 -32954 -17211 -25481 -20568 492 -4640 -11127
206a1127J8812M110j2824R600Q970j6254O08J8867l437n622J4595k655j9812K036
$$ -11127 7685 11795 -1029 8571 17541 1287 1895 20762 17325 11703 26298 23643 3831 5867
220E867J394k1286m891J1470q830p677J5321L387r911R669P763j2778J10J2333
$$ 5867 7261 -14025 -18916 -7446 -16276 -23953 -8632 -5245 -15156 -5487 2276 -10502 -10392 1941
234A941p843n300J6615O813m978J0114P109j2330k318O741j0141j0636N640k140
$$ 1941 -5902 -11202 5413 12226 7248 17362 24471 12141 9823 16564 6423 -4213 1427 -713
248g13j0346N230P195o399K0N530q112p980O371Q96o098N691Q140j419M117R600
$$ -713 -11059 -5829 1366 -5033 -5013 517 -7595 -15575 -9204 -8308 -14406 -8715 -575 -1994 2123 11723
264A1723j540m035M712j200q097K21L470l041p50M577j307l144J943k001p418
$$ 11723 10183 6148 10860 9660 1563 1784 5254 2213 1463 6040 4733 1589 3532 1531 -5887
279e887j591J079l269r98M519J704K19M342K759k466N38J869j917k177K255J551
$$ -5887 -7478 -6399 -9668 -10666 -6147 -4443 -4224 118 2877 411 949 2818 901 -1276 979 2530
295B530q1K968J924k457o29Q20k787m053j164j19j594J300K025R6M19J418p46
$$ 2530 2449 5417 7341 4884 4255 5075 2288 -1765 -2929 -3048 -4642 -3342 -1317 -1221 -802 616 -130
312a30k162k37M96j918n9K494J507J883K157N08j213o53r80j906j517m86m1Q76
$$ -130 -2292 -2529 -2033 -3951 -4010 -1516 -9 1874 4031 4539 3326 2673 1693 -213 -1730 -2216 -2257 -1381
330a381K337J146J31N01L38j741k530j191n35k09N28J115K072J806L81n09p97
$$ -1381 956 2102 2233 2734 3072 1331 -1199 -2390 -2925 -3134 -2606 -1491 581 2387 2768 2259 1462
347A462j220j740j844q56K46J123J597J974J969P78q00n48m53k184j690NQ06R25
$$ 1462 242 -1498 -3342 -4198 -3952 -2829 -1232 742 2711 3489 2689 2141 1688 -496 -2186 -2181 -1375 -450
365d50J404K039N34J51k55k232j790j551j817r81P37J768J151J137J552j09o51
$$ -450 954 2993 3527 3678 3423 1191 -599 -2150 -3967 -4948 -4211 -2443 -1292 -155 1397 1288 637
382F37k12j021j213M5j71P79J797K247J082M36K23j290j622j546j893q32l34P33
$$ 637 425 -596 -1809 -1764 -1935 -1156 641 2888 3970 4406 4629 3339 1717 171 -1722 -2554 -2888 -2155
400b155N50P75N34N27K22j027j232p96o25m20J201J947J466J780J461m42n74K21
$$ -2155 -1605 -830 -296 231 453 -574 -1806 -2602 -3227 -3647 -2446 -499 967 2747 4208 3766 3192 3413
418C413j041k292j49j3j568P21K023l17o43J017j382l422j3L76j728J101L159
$$ 3413 2372 80 -69 -82 -1650 -929 1094 777 134 1151 -231 -3653 -3666 -3290 -5018 -3917 -758
435g58o42J50L787N54j724K351P13l966p29J978j865M9M693j292l201K369q5n618
$$ -758 -1400 -1250 2537 3091 1367 3718 4431 465 -264 1714 -151 -102 4591 3299 98 2467 2382 -3236
453c236L94K423m032j890L405o39k218N557L126m014J486K982m812j405N636k89
$$ -3236 -2842 -419 -4451 -6341 -2936 -3575 -5793 -236 2890 -1124 362 3344 -1468 -2873 2763 2474
469B474k481N280O59n502K462L551m605k414L632m317n178L768J573m677L788
$$ 2474 -7 5273 5932 430 2892 6443 1838 -576 3056 -1261 -6439 -2671 -1098 -5775 -1987
484a987M373o057j874N241k306l147O588J458n265K957M524l846J469O839l023
$$ -1987 2386 -3671 -5545 -304 -2610 -5757 831 2289 -2976 -19 4505 659 2128 8967 5944
499E944n468L138j183n901L484M345n083q94L690m455m000N526N24n401K526K208
$$ 5944 476 3614 2431 -3470 14 4359 -724 -1618 2072 -2383 -6383 -857 -333 -5734 -3208 -1000
515a000n982J717P168j241j259N832j195n659K971K938l914J848M422m395l101
$$ -1000 -6982 -5265 1903 662 -597 5235 4040 -1619 1352 4290 376 2224 6646 2251 -850
530h50M390j231l511L493J01o446n53K548l702P75N796r20l357L092K11l564L173
$$ -850 3540 2309 -1202 2291 2392 -4054 -4607 -2059 -5761 -4986 810 -110 -3467 -375 -164 -3728 -555
547e55L880l212l94L568k086j237M984P14l351J111k82n043m86K961j939j075
$$ -555 3325 113 -281 3287 1201 -36 4948 5662 2311 3422 3140 -1903 -2389 572 -1367 -2442
563b442K976j909k843K493R95k306J896J784l634n56L466k94J30M304L44l262
$$ -2442 534 -1375 -4218 -1725 -730 -3036 -1140 644 -2990 -3546 -80 -374 -244 4060 4404 1142
579A142J064Q25l126J136K087k631j723J990j117j966L043N70l306K08P71l199
$$ 1142 2206 3031 -95 1041 3128 497 -1226 764 -353 -2319 724 1294 -2012 -1804 -1033 -4232
595d232J32L613k73r16L145L1k554K106K217k076j7K189k925j740L037J92j851
$$ -4232 -4100 -487 -760 -1676 1469 1500 -1054 1052 3269 1193 1176 3365 440 -1300 1737 1929 78
612G8J946R01m781j64J778k406n08K889j009k661K754J440k103K018K828l013
$$ 78 2024 2925 -1856 -2020 -242 -2648 -3156 -267 -1276 -3937 -1183 257 -1846 172 3000 -13
628a3o62K367j258j596L341J189k712J603P67l216j7K076k044j852J827p59k580
$$ -13 -675 1692 434 -1162 2179 3368 656 2259 3026 -190 -207 1869 -175 -2027 -200 -959 -3539
645c539K014J686j789M82J829k164j279K656k14j097K190J462k020Q56J751j436
$$ -3539 -1525 161 -1628 -1146 683 -1481 -2760 -104 -318 -1415 775 2237 217 1073 2824 1388
661A388j68J638j122k627J002P88k090P16J419j746q83J525j110j464J766M58
$$ 1388 1220 2858 1736 -891 111 899 -1191 -475 944 -802 -1685 -160 -1270 -2734 -968 -510
677e10j623R85J419j182N02K005l54r52J482m47j443Q00J447j413K96R68j278
$$ -510 -2133 -1148 271 -911 -409 1596 1242 290 1772 1325 -118 682 2129 716 1012 1980 702
694G02j102J158n31j411P3M62j514N79J235o22k6J622o97q03P78N61r93L52J048
$$ 702 -400 758 227 -1184 -1111 -649 -2163 -1584 -349 -971 -997 625 -72 -875 -97 464 -529 -177 871
713H71n43J55R85r3n63P21j79j502m1J7r12n2R75k03p3O26l10n44L68J17j133
$$ 871 328 483 1468 1375 812 1533 1354 -148 -189 -172 -1084 -1136 -161 -364 -437 189 -121 -665 -297 -180 -1313
734a313L75O35l28J81J177J59j88M85o4q56Mk20n35n4P05j54p2L27L15m09m3k54
$$ -1313 -938 -303 -631 -450 727 886 698 1183 1119 263 267 47 -488 -542 163 9 -63 264 579 170 127 -127
756a27o43J73p4O1M6P94k5K12n0M87q54J55J23o50J04q4J19J24N28J70l95L0r3
$$ -127 -770 -597 -671 -610 -564 230 205 417 367 854 0 155 278 -372 -268 -352 -233 -109 419 589 194 224 131
779A31m60k4M7n09L29J80M64q5K78K00l95J27J22p64J04L78K6l3K24J31p6j07
$$ 131 -329 -353 -306 -815 -486 -306 158 73 351 551 156 283 405 -359 -255 123 149 116 340 471 395 288
801B88R0l95k39k0j12j70O9N20m13M54K10o7q2p6p9k6Q1Q9j11j48L42K65l10O3
$$ 288 378 -17 -256 -276 -388 -558 -489 31 -382 72 282 215 133 57 -22 -48 33 122 11 -137 205 470 160 223
825B23o3l19N0k33j46O1L26p4K7O5J13R6l48J53l49K48q3L53l28N59k68j53J74
$$ 223 160 -159 -109 -342 -488 -427 -101 -175 -148 -83 30 126 -222 -69 -418 -170 -253 100 -228 331 63 -90 84
848H4j49J13j60mj0j27M21r2RJ39n9j73L45m69P1J71jl02L22M4j83m0J45j83m22
$$ 84 -65 48 -112 -116 -126 -253 168 76 85 224 165 -8 337 -132 -61 110 109 -193 129 173 -10 -50 95 -88 -510
873e10J40j04k9K96K32m10K42N04m11j03P3p4J00J37J32J9k05L81R2m76N37l00
$$ -510 -370 -474 -503 -207 25 -385 -143 361 -50 -153 -80 -154 -54 83 215 234 29 410 502 26 563 263
895B63m76j40O6k45J09J34J38K81r1q7j81mJ02l09j29O04k25nN78PJ40Q9l4n54
$$ 263 -213 -353 -287 -532 -423 -289 -151 130 39 -48 -229 -233 -131 -440 -569 35 -190 -195 383 390 530 619 585 31
919C1j7L43m30j38N01m78j66N12j09MM1j75o99K14Q8j22K47M91j04J60J46j72
$$ 31 14 357 -73 -211 290 -188 -354 158 49 53 94 -81 -780 -566 -478 -600 -353 138 34 194 340 168
941A68NJ35M11n42O9J64l17j23P48J01n66k48K05o72K00L40l03l69M48o1o26L94
$$ 168 173 308 719 177 246 410 93 -30 718 819 253 5 210 -462 -262 78 -225 -594 -146 -207 -833 -439
963d39P23l76J44L11o43k04N55J78k80O68P5n13r2N52p46L0M26m16l73L52r1j84
$$ -439 284 -92 52 363 -280 -484 71 249 -31 637 712 199 107 659 -87 -57 369 -47 -420 -68 -159 -343
985c43J57L53p90K94K34k20r2L68M67p51O12L21j022J78R62l31n73N76k34n55
$$ -343 -186 167 -623 -329 -95 -315 -407 -39 428 -323 289 610 -412 -234 728 397 -176 400 166 -389
1005c89L14M74n64J29J87m04l54M52pn14O26M26p11J50P27n65l9M55k34n35O76
$$ -389 -75 399 -165 -36 151 -253 -607 -155 -162 -676 -50 376 -335 -185 542 -23 -62 393 159 -376 300
1026C00J55q30N34N50p17j35M72l64p16P80K57q04K44L68o07M31M73n21q2O61
$$ 300 455 -375 159 709 -8 -143 329 -35 -751 29 286 -518 -274 94 -513 -82 391 -130 -212 449
1046D49j51p08L43L90l94K5P15n25k58P30m10l62J18K85o79j07L85l20n8P84m8
$$ 449 298 -410 -67 323 -71 -46 669 144 -114 616 206 -156 -38 247 -432 -539 -154 -474 -532 252 204
1067B04n15J99J69l93J70N16m39L6N20l15j37K67K33j65l65J42n49L03K38q0n09
$$ 204 -311 -112 57 -336 -166 350 -89 -53 467 152 15 282 515 350 -15 127 -422 -119 119 39 -470
1088d70P14m13n06N51J83m53L10L6k63J78L10K20o59O70L44m67j52R7p2K8K64
$$ -470 244 -169 -675 -124 59 -394 -84 -48 -311 -133 177 397 -262 408 752 285 133 230 158 186 450
1109D50k47p0L66l15m63L58J50k95k77L36n00J76J74k2j24M70j09l27J50M05m47
$$ 450 203 133 499 184 -279 79 229 -66 -343 -7 -507 -331 -157 -179 -303 167 58 -269 -119 286 -161
1130a61K72j9j59J65J95m5k76L58J24m20n0Ml1n9P1j26j21J31K69m24K31M36o45
$$ -161 111 92 -67 98 293 248 -28 330 454 34 -16 -12 -43 -102 -31 -157 -278 -147 122 -302 -71 365 -280
1153b80j71O43m69J72J26J22m57L33L6o0j66L33j70j79K41q6k74L82K30o11K08
$$ -280 -451 192 -277 -105 21 143 -314 19 55 -5 -171 162 -8 -187 54 -32 -306 76 306 -305 -97
1174i7L83m44K7J85l43J20K03N2l47K00K69O2j80J41k04j04K27q1n30M28Q6j10
$$ -97 286 -158 -131 54 -289 -169 34 86 -261 -61 208 270 90 231 27 -77 150 69 -461 -33 53 -57
1196e7k30L19k70L47n7J40o10M16J27j90o2M63Nn47K30L16n24J58M52o38J16K55
$$ -57 -287 32 -238 109 52 192 -418 -2 125 -65 -127 336 341 -206 24 340 -184 -26 426 -212 -96 159
1218A59k5p6j51K51n94L13P2m0J10K87k44o7L05l3l71Q2K13l9l42N10k93j03M6
$$ 159 134 58 -93 158 -436 -123 -51 -91 19 306 62 -5 300 267 -104 -22 191 152 -190 320 27 -76 -30
1241c0J04pO5j05k51q4K38K91k34j25j37L75p5nj87m5K19r8k0J11L28k91l4N5
$$ -30 74 67 132 27 -224 -308 -70 221 -13 -138 -275 100 25 20 -167 -212 7 -91 -111 0 328 37 3 58
1265E8J21%p0k02K08N3k60K15j52j76J32K33k7q0kk43j8Q4J1o%J73J48l46J20
$$ 58 179 179 109 -93 115 168 -92 123 -29 -205 -73 160 133 53 51 -192 -210 -126 -115 -121 -121 52 200 -146 -26
1290b6p2R8j40O1m7K15J47k75OrR7jJ06o1j43J13j98R0O0l6J45j92J31k08Q2J42
$$ -26 -98 0 -140 -79 -126 89 236 -39 -33 -42 55 54 160 99 -44 69 -129 -39 21 -15 130 -62 69 -139 -57 85
1316H5J98m88L58j25k64N61n02L3J64j47P5J82l45o9L68j06k8J02N1j98k0N2K69
$$ 85 283 -205 153 28 -236 325 -177 -144 20 -127 -52 130 -215 -284 84 -22 -50 52 103 -95 -115 -63 206
1339B06j68p5m7k04J83Q1n4m2P4j63J72M7m2j10M9K68k43j70J33J72j43k14L90
$$ 206 38 -37 -84 -288 -105 -24 -78 -120 -46 -209 -37 10 -32 -142 -93 175 -68 -238 -105 67 -76 -290 100
1362A00r5j99J75k4K0J58j1n9k7m4J13J9j36J13j62J14j26l36M59k8j21kJ26j90
$$ 100 5 -194 -19 -43 -23 135 124 65 38 -6 107 126 -10 103 -59 55 -71 -407 52 24 -97 -99 27 -163
1386a63J52l16M76p3rQ3J50P6j58o6j54K89l41M9o7l1O9L82k58Jj61q1K22k28
$$ -163 -11 -327 149 76 67 150 300 376 218 152 -2 287 -54 -5 -72 -103 -34 348 90 91 -70 -151 71 -157
1410a57J09K80k95p5Q2K13Qk71N1O4j56J34JO1mP3M0j33j31K16j51N5K21k44K93
$$ -157 -48 232 -63 -138 -56 157 165 -106 -55 9 -147 -13 -12 49 45 118 158 25 -106 110 -41 14 235 -9 284
1435B84k72J89k89L16k08R9l77L10L0j40J44j65J13k7j2j64M18j14p9J09k11j58
$$ 284 12 201 -88 228 20 119 -258 52 82 -58 86 -79 34 7 -5 -169 249 135 56 165 -46 -204
1457b04O5K04J30m51K59P9k89J97K67j36j19L06l82m3J20J20R0j94l7l6P4k18
$$ -204 -139 65 195 -256 3 82 -207 -10 257 121 2 308 -74 -117 3 123 213 19 -18 -54 20 -198
1479a98L21L8j72N6J4o9O2j72j5J1J60j02j21M03l97J63K54l1O6P5j85m05K86
$$ -198 123 161 -11 45 59 -10 52 -120 -135 -124 36 -66 -187 216 -181 -18 236 205 271 346 161 -244 42
1502D2R4j74J69%k16q6R6j04M55j95q3n5m0J40l46K87k9J40j93K02N8k68L06p5
$$ 42 136 -38 131 131 -85 -171 -75 -179 276 81 -2 -57 -97 43 -303 -16 -45 95 -98 104 162 -106 200 125
1526A25K1J36k56j15k7J87j25J89lk46J14l1J4J38j03K4pkq1j63J70J0j1L7K08
$$ 125 146 282 26 -89 -116 71 -54 135 132 -114 0 -31 -17 121 18 42 35 33 -48 -211 -41 -31 -42 -5 203
1551B03k16K00j06K83j03j79J06k58N9M9j25n6j4K98J9o1o6p0k4o2J86j78K38
$$ 203 -13 187 81 364 261 82 188 -70 -11 38 -87 -143 -157 141 160 99 33 -37 -61 -123 63 -115 123
1574A23pm62L80Q3l67L41J17j31jL1k8J44l19m2K55k11K94l73J55L5N0j37K40
$$ 123 116 -346 34 117 -250 91 208 77 76 107 79 223 -96 -138 117 -94 200 -173 -18 17 67 -70 170
1597A70m8k1J20j9j84O2j01J11m9J33k71J54J05k06K05q3K41k94j21k6l5j12L89
$$ 170 122 101 221 202 18 80 -21 90 41 174 -97 57 162 -44 161 78 319 25 -96 -122 -157 -269 120
1620A20l36K23l6LN3k24J30K26k03K53k62J41j92K56k45J14J6P4m1r4o1K31m0
$$ 120 -216 7 -29 -26 27 -197 -67 159 -44 209 -53 88 -104 152 -93 21 37 111 70 -24 -85 146 106
1643A06oJ6k38K18J14j91J0K71m16R5J75Q4j3k30J33j25j95M29j20m57M89j50
$$ 106 100 116 -122 96 210 19 29 300 -116 -21 154 238 225 -5 128 3 -192 237 117 -340 149 -1
1665ak08L58k70K80k22J46J34k35J21m43J76N2J80k49K23k0M1J59j74J1j17P5
$$ -1 -209 149 -121 159 -63 83 217 -18 103 -340 -164 -112 68 -181 42 22 63 222 48 59 -58 17
1687A7k82J94qL2l6j3K12j09P7L0k31L0j55L20j45n9J80J7j05J48q6p1oj08K71
$$ 17 -265 -71 -79 -47 -83 -96 116 7 84 114 -117 -87 -242 78 -67 -126 54 71 -34 114 28 -43 -49 -157 114
1712A14j88J23j23r7J53Lj60r0K37n7K50m5j37j54L4j10K66R4q0mO3O7j93J31
$$ 114 -74 49 -74 -171 -18 -15 -175 -265 -28 -85 165 120 -17 -171 -137 -247 19 113 33 29 92 159 -34 97
1736I7q0N3q9L74k99j80K52l73M41k68N7J99m08L17j69K70j36L8n0M6k15P9P4
$$ 97 17 70 -19 355 56 -124 128 -245 196 -72 -15 184 -224 93 -76 194 58 96 46 92 -123 -44 30
1759C0K20m09J75j96M56k38j71J48%K54j98j37j14K6J08j5N1J05J9l44J09K59
$$ 30 250 -159 16 -180 276 38 -133 15 15 269 71 -66 -180 -154 -46 -61 -10 95 114 -230 -121 138
1781A38j41K90j53o0j92N5J63k85O3K01m9Q6l11K41J68m14N9K89J48m33r8N0K03
$$ 138 -3 287 134 74 -118 -63 100 -185 -122 79 30 116 -195 46 214 -200 -141 148 296 -137 -235 -185 18
1804A8j26J05q7p5N9m6n3J61j66K41k72L88j50j67M6Q6p7K12J28N1l34j41K00
$$ 18 -108 -3 -90 -165 -106 -152 -205 -44 -210 31 -241 147 -3 -170 -124 -38 -115 97 225 276 -58 -199 1
1827Aj92K78k48M6K16j43k23J82K20J1k34j88N7L79j38p2Q3P1k04m2R3j0J54n9
$$ 1 -191 87 -161 -115 101 -42 -265 -83 137 148 -86 -274 -217 162 24 -48 35 106 -98 -140 -47 -57 97 38
1851C8k18K96j34j33j33L45n6NJ02n19L33J70j66l9k04M17l00K03j68N40k19l44
$$ 38 -180 116 -18 -151 -284 61 5 10 112 -407 -74 96 -70 -109 -313 104 -196 7 -161 379 160 -184
1873a84K79p7k26M17n16L33j63K45j35j4J29o4j42J75q9QJ65l48N59m84J18j49
$$ -184 95 18 -208 209 -307 26 -137 108 -27 -41 88 24 -118 57 -32 -24 141 -207 352 -132 -14 -163
1895a63j6J86j62o8L79j28l7o5J67k31J58J19j50j68J16j27R4j11m7K44J49k16
$$ -163 -179 7 -155 -223 156 28 -9 -74 93 -138 20 139 -11 -179 -63 -190 -96 -207 -254 -10 139 -77
1917g7K49k49j13K03k6J21L5j72j15K08k21q2K59P3Q3l48P6J7n2J15N9l4q5J76
$$ -77 172 -77 -190 13 -13 108 143 -29 -144 64 -157 -239 20 93 176 -172 -96 -79 -131 -16 43 9 -76 100
1941A00J31j06k9j80o8L55p7k15m3L79k74J45q1n2n1L77m83L97j86q6J39k65J38
$$ 100 231 125 96 -84 -152 203 126 -89 -132 247 -27 118 37 -15 -66 311 -172 225 39 -47 92 -173 -35
1964c5k15K05q2K17j74J44q4j88J29O2J06j49K5p7K47l36M2N30m24L0j38O6pM27
$$ -35 -250 -45 -127 90 -84 60 -24 -212 -83 -21 85 -64 -39 -116 131 -205 -163 367 -57 -27 -165 -99 -106 321
1988C21m08L1m3p3K87r6J19k09K13j65J7q9L27l67l4K13l24L58l9j77L05k22M1
$$ 321 -87 -56 -99 -172 115 19 138 -71 142 -23 -6 -95 232 -135 -169 44 -280 78 39 -138 167 -55 -14
2011a4K90J9m54K24J17l24P6l1J15J97p5k25k2R2j25K08k53M38k50j6l5K3J23
$$ -14 276 295 -159 65 182 -142 -66 -97 18 215 140 -85 -107 -15 -140 68 -185 253 3 -13 -48 -25 98
2034I8j23o3Q2K37k51J55R8k90Q5K48j07P3n75O55l42k5k5J60q8M9P6k51k9K14
$$ 98 -25 -88 -6 231 -20 135 233 -57 28 276 169 242 -333 322 -20 -45 -70 90 2 51 127 -124 -153 61
2058F1O0k86p6K71k55K94m8o6K74l3n00K13J26Q2k32K10J59l4l80J16j2K2J57
$$ 61 121 -165 -241 30 -225 69 21 -45 229 196 -304 -91 35 117 -115 95 254 220 -160 -44 -56 -34 123
2081A23k59n5J34p8L8J71j56j06J98O5j31P2J1j23K7K44P3P8m33j07J91n9L89
$$ 123 -136 -191 -57 -135 -97 74 -82 -188 10 75 -56 16 27 -96 -69 175 248 326 -107 -214 -23 -82 307
2104C07l97Q4P8j53K22q0k20J32k31M20k6k98K11q9l1P8l8k65J93K79k43k14L89
$$ 307 -90 -6 72 -81 141 61 -159 -27 -258 162 136 -162 49 -40 -71 7 -31 -296 -103 176 -67 -281 108
2127A08l06L02m1j11L28Rj00j95K79l07L5k3N4r1L0m1J86K6l37L39l49J87j40
$$ 108 -198 104 63 -48 280 289 189 -6 273 -34 1 -22 32 -59 -29 -70 116 142 -195 144 -205 -18 -158
2150a58L66q8k01q8L07m2j87M6j7J76k66J58l3l9rj18J41J74K7j38J11k16K57
$$ -158 208 120 -81 -169 138 96 -91 -45 -62 114 -152 6 -27 -66 -75 -193 -52 122 149 11 122 -94 163
2173A63j0j08L5q2N5j17Q9k16K06p9M3O5j04j37J42K26k10k69L21K37m32J24K7
$$ 163 153 45 80 -2 53 -64 25 -191 15 -64 -21 44 -60 -197 -55 171 -39 -308 13 250 -182 -58 -31
2196c1N3K12k53rj06J41N1J16k11j88K46K21k70J70j70o4J65N1k19k20M02j00
$$ -31 22 234 -19 -28 -134 7 58 174 -37 -225 21 242 -28 142 -28 -92 73 124 -95 -315 87 -13
2218a3K50l50j3L70l20MkJ32l1K28l91J20J02k34L23k47m60P20l07J56r0R0rr5
$$ -13 237 -113 -126 244 -76 -72 -74 58 27 255 -136 -16 86 -148 175 -72 -532 188 -119 37 -53 37 28 -67
2242f7P4J98l58K68l3k05o2K03l9j92M63j49J78m01J91j88K8j45L85k67Q7K33
$$ -67 7 205 -153 115 82 -123 -185 18 -21 -213 250 101 279 -122 69 -119 -91 -236 149 -118 -31 202
2264B02k93J42p0n2Q0K64j98j30K02j14o0%J82j33qK8J12k08r5J26J36k52J40
$$ 202 -91 51 -19 -71 9 273 75 -55 147 33 -27 -27 155 22 14 42 154 -54 -149 -23 113 -139 1
2287ArK3R3k44N39l37qj7N3k33K45q5j78K32j1N0j44O1k2J54M5m16K62j22o2j9
$$ 1 -8 15 108 -136 403 66 58 41 94 -139 106 21 -157 75 64 114 -30 31 9 163 208 -208 54 -68 -130 -149
2313a49O9K55p6l21J71K7p9j14K14j06J58j84J19P4J84k20j97j52L03J24m33K71
$$ -149 -80 175 99 -222 -51 -24 -103 -217 -3 -109 49 -135 -16 58 242 22 -175 -327 -24 100 -333 -62
2335f2Q8J76j12k53O6J98m1M7j47R9J08k90J44j58J08k66K48L0M0j08K74j42J2
$$ -62 26 202 90 -163 -97 101 60 107 -40 59 167 -123 21 -137 -29 -295 -47 -17 23 -85 189 47 59
2358E9Q8k22j11K13j64J60n9k59M51j29j36K35o6l43J78J9Q2j2J62l06L38k11
$$ 59 147 -75 -186 27 -137 23 -36 -295 156 27 -109 126 60 -283 -105 -86 -4 -16 146 -160 178 -33
2380c3o6K11l53K54j37J44J65q2l46L17J5o7Q6k13M1K5Qk21M96k67o0P2m7J42
$$ -33 -99 112 -241 13 -124 20 185 103 -243 74 89 22 108 -105 -64 -39 -31 -252 244 -23 -83 -11 -58 84
2404H4k83L69l2Q7l77J0L54k28J35L3j74p5R7L1j17j60M47k15o8P2j16K99j71
$$ 84 -199 170 138 225 -152 -142 212 -16 119 152 -22 -97 0 31 -86 -246 201 -14 -82 -10 -126 173 2
2427Bl5J14Pk82J88P2o8o7K80k8m0k34M30k44k35J03j64l3L99J58m48n0J7J1K57
$$ 2 -33 81 88 -194 -6 66 -2 -69 211 183 143 -91 339 95 -140 -37 -201 -234 165 323 -125 -175 -158 -147 110
2452A10j5K44k85K3l05K07k7kK1j84J02L12n10K85K5J76j84j33k1J20M6j71R8
$$ 110 95 339 54 77 -228 -21 -48 -50 -29 -213 -111 201 -309 -24 1 177 -7 -140 -161 -41 5 -166 -68
2475f8L9J52p1J25p9p9N6J49j70J77m5m0j69J24P9j94p9l9L20l57L41m46Q0J16
$$ -68 -29 123 52 177 98 19 75 224 54 231 186 146 -23 101 180 -14 -93 -132 188 -169 172 -274 -194 -78
2499g8p9j4L05j3L2r9j20J50j48J02kO0r4j39J77j8k1J77j79K20m09K61j89n2
$$ -78 -157 -171 134 121 153 54 -66 84 -64 38 36 96 2 -137 40 22 1 178 -1 219 -190 71 -118 -170
2523a70j20J51J33j75L15k01J37j14L99n25K85n9ll49L97j95J6Q6j29K2J71j28
$$ -170 -290 -139 -6 -181 134 -67 70 -44 355 -170 115 56 53 -296 101 -94 -78 8 -121 -99 72 -56
2545e6K45m0m9j48j61M39r2K7l05Q8K21j94Jq8j2j0K70k56L5J69k18J21k6L5k85
$$ -56 189 149 100 -48 -209 230 138 165 -140 -52 169 -25 -24 -112 -124 -134 136 -120 -85 84 -134 -13 -39 -4 -289
2570b89J39J40j94Q9K9K06m9M8m7j81K64o9j08J13k40J12J95k49J05J49q5l1j8
$$ -289 -150 -10 -204 -115 -86 120 71 119 72 -109 155 86 -22 91 -149 -37 158 -91 14 163 78 47 29
2593B9K51k76L7%K8n7R1l21J08R3J77m7m1K2k44k2R9N4l17P71m93n0J69K7p1K12
$$ 29 280 4 41 41 69 12 103 -218 -110 -17 160 113 72 94 -150 -172 -73 -19 -336 435 -58 -108 61 88 17 229
2619B29j46j78R4N5r4o0j17J09nj41J91q0L34k09K8K9r8r3N8K65j63p7K24j71
$$ 229 83 -95 -1 54 -40 -100 -217 -108 -113 -254 -63 -143 191 -18 10 39 -59 -152 -94 171 8 -69 155 -16
2643a6O5L1p5Q6j60K65j13j31K9J03l64O6K12j52J1L02j20l02K55j0O2j34K21
$$ -16 49 80 5 91 -69 196 83 -48 -19 84 -280 -214 -2 -154 -143 159 39 -263 -8 -18 44 -90 131
2666A31j91L5o3p1J48J16k32J90n7q7j63J59P0J22m3k81J59k8K26j13q5k16K25
$$ 131 -60 -25 -88 -159 -11 105 -127 63 6 -81 -244 -85 -15 107 64 -217 -58 -86 140 27 -58 -274 -49
2689d9M5L6q2p9N2J81J86j25m22M27k95q1L67j95q9K67K1r6k12l1J92l5K4J59
$$ -49 -4 32 -50 -129 -77 104 290 165 -257 170 -125 -206 161 -34 -123 144 165 69 -143 -174 18 -17 7 166
2713A66j87r5m4K29J46n5l75K64k6j39K11J08k55L1j97L62k62J94k99L17n0j8
$$ 166 -21 -116 -160 69 215 160 -215 49 23 -116 95 203 -52 -21 -218 144 -118 76 -223 94 44 26
2735B6k36J69J48lJ48k68J66n3J61j35o2j46mJ13Q3L8j55j30R6j50K11n2r8K65
$$ 26 -210 -41 107 104 252 -16 150 97 258 123 61 -85 -89 24 107 145 -10 -140 -44 -194 17 -35 -133 132
2759A32p8R2p9J28o8j16J64n9k28R8J04j57N0K06Oj96N6k79J08K00m2%K02k59
$$ 132 54 146 67 195 127 11 175 116 -112 -14 90 -67 -17 189 195 -1 55 -224 -116 84 42 42 244 -15
2783a5j21K24k09K82rm32M44k19j02K33K23l00J55j4l72K18P2J50j57j46J00j85
$$ -15 -136 88 -121 161 152 -280 164 -55 -157 76 299 -1 154 140 -232 -14 58 208 51 -95 5 -180
2805a80L9J31O3j30K69j34l7O5r5J92k97kQ5K59l28r4o2L91rM8k5j94J17n4k5
$$ -180 -141 -10 53 -77 192 58 21 86 -9 183 -114 -116 -31 228 -100 -194 -256 135 126 174 149 -45 72 18 -7
2830gk06J81k22L82l47L67l60L30r5J12J70k59Rj19n3k02M04J6m8j16M9J69j48
$$ -7 -213 -32 -254 128 -219 148 -212 118 23 135 305 46 55 -64 -117 -319 85 101 53 -63 -14 155 7
2853GO2KJ9J8N8j67nJ45l00pl3K61k5k61J46Q4j10J61k17N18n40K63j11k01K82
$$ 7 69 71 90 108 166 -1 -6 139 -161 -168 -201 60 35 -226 -80 4 -106 55 -162 356 -184 79 -32 -233 49
2878D9k5p0K53k26J20L9l77M23l89J91j86K91r1j0Ok22K93j29p6L8K96m34K48
$$ 49 24 -46 207 -19 101 140 -237 186 -203 -12 -198 93 2 -8 -2 -224 69 -60 -136 -98 198 -236 12
2901A2j38L30j78j48N7J13q8m1K35k60O1P8j71O3K69k44J84k36r6L61k3l13R2
$$ 12 -126 204 26 -122 -65 48 -40 -81 154 -106 -45 33 -138 -75 194 -50 134 -102 -198 163 140 -173 -81
2924h1J08k31L7N4Q8K5k07L03k60L48j77mK6j05J14j54L83l19j57m0J05K16p5
$$ -81 27 -204 -167 -113 -25 0 -207 96 -164 184 7 3 29 -76 38 -116 267 -52 -209 -249 -144 72 -3
2947ck12L38r5l58K94L85k28m33J16N16l96j04M48j63l57N9M01m1l13K77Lj10
$$ -3 -215 123 28 -330 -36 349 121 -312 -196 320 -76 -180 268 105 -252 -193 208 167 -146 131 134 24
2969B4O4k38L42k36K1n2L3j4Q2m7nK30l87J47N9q9rL10k24j09K00l74J85J82j42
$$ 24 88 -150 192 -44 -23 -75 -42 -56 26 -21 -26 204 -183 -36 23 -66 -75 235 11 -98 102 -272 -87 95 -47
2994d7K82l01K20m44L32J03k06n4K02k43J46K12k32K28l15J0K35k18L4J21l0O5
$$ -47 235 -66 154 -290 42 145 -61 -115 87 -156 -10 202 -30 198 -117 -107 128 -90 -56 65 35 100
3016A00k47J83L6k99q1K10Q9l1k7k7q5L23k94L38K04k31l45j58M60kN3k61j17
$$ 100 -147 36 72 -227 -308 -98 -9 -40 -67 -94 -179 144 -150 188 392 161 -184 -342 118 116 169 -92 -209
3039b09P7J15J95r1k32K49j71K30j67j71KL49k51j00N0J52K97m53K90q7oJ23k5
$$ -209 -132 -17 178 87 -145 104 -67 163 -4 -175 -173 176 -75 -175 -125 27 324 -129 161 74 68 191 166
3062A66k59K70J4j61l78L41J47j61R5j0l6r3J35o9K1J25k64L29j02p4K16l38n0
$$ 166 -93 177 191 30 -348 -7 140 -21 74 64 28 -65 70 1 22 147 -117 212 110 36 252 -86 -136
3085a36K15m3k7K7J65j58j35j34J1M07l3j49lj45J69j36K86j5k84J21J57j98J0
$$ -136 79 36 9 36 201 43 -92 -226 -215 192 159 10 7 -138 31 -105 181 166 -118 3 160 -38 -28
3108b8o7K64j79j12K39J92k20k75J64m1m4R6k70J76O4N6J5k67M25l05J61K2K3
$$ -28 -95 169 -10 -122 117 309 89 -186 -22 -63 -107 -11 -281 -105 -41 15 30 -237 188 -117 44 66 89
3131H9P7l94K77j83K70j9j73K74j97l9M5J12q7k84L14j11M2nPj2n3J68j12J39
$$ 89 166 -228 49 -134 136 117 -56 218 21 -18 27 139 52 -232 82 -29 13 8 15 3 -50 118 6 145
3155A45k11J08l7j75O2J61p9K76l93J64M5j66m6L22k20J9q5J26o8Q9J14k61k68
$$ 145 -66 42 5 -170 -108 53 -26 250 -143 21 66 -100 -146 176 -44 -25 -110 16 -52 37 151 -110 -378
3178c78K65J35n5k29K33k39K49j10J81O9K6q7j14J04r7l7L60k46m22L97n5J60
$$ -378 -113 22 -33 -262 -29 -268 -19 -129 52 121 147 60 -54 50 -47 -84 276 30 -392 5 -50 110
3200A10k90L62j24q6K19l22r3K46N1k32J14L05k72J04K9N3m30L11R4Nl07R7J64
$$ 110 -180 182 58 -28 191 -131 -224 22 73 -159 -45 260 -12 92 121 174 -256 55 149 154 -153 -56 108
3223A08k14J26j23J57J36j90O2O4J03l6K7j24j28J22j55J70l40K56j3N2K9N9k37
$$ 108 -106 20 -103 54 190 0 62 126 229 193 220 96 -32 90 -65 105 -235 21 8 60 89 148 -89
3246h9j50J81k18J69K00o2o6O4M9J75q9r8K40l00k33J97J01k14J54j01L2j25M9
$$ -89 -239 -58 -276 -107 93 31 -35 29 78 253 164 66 306 6 -227 -30 71 -143 11 -90 -58 -183 -134
3269a34J01Q0k49J15n7Q1mP8j39l9M56q0Kk25J65l03L02n9l9M8J7j77J50j30j4
$$ -134 -33 47 -202 -87 -144 -63 -67 11 -128 -167 289 209 211 -14 151 -152 150 91 52 100 117 -60 90 -40 -54
3294e4J88j49J98j61Jj44J68l15K39K8k20J20J0K21l3Q3K2k09L76l49k6j8j2J14
$$ -54 134 -15 183 22 23 -121 47 -268 -29 -1 -221 -101 -91 130 97 180 202 -7 369 20 -6 -24 -36 78
3318G8o1m2M3k58M11j76p1m5R2l4l6J18Np9n3K52r5r7kR0j22j94J99K38m02J56
$$ 78 17 -25 18 -240 171 -5 -76 -121 -29 -63 -99 19 24 -55 -108 144 49 -48 -50 40 -82 -276 -77 161 -241 -85
3344h5K59m1n7m0j55J60J90n18L02l4j33m1J50J76j22j57L34JJ58l90j97K71k0
$$ -85 174 133 76 36 -119 41 231 -287 15 -19 -152 -193 -43 133 11 -146 188 189 347 -43 -240 31 11
3367A1K18k63q9L01P2m60M09k17J40j10J40m57M62J84l38O9k5j21m2P8k09K61
$$ 11 229 -34 -123 178 250 -210 199 -18 122 12 152 -305 157 341 3 72 47 -74 -116 -38 -247 14
3389A4O4l37O9M0KK46l86K42j25J86j06N9P5l80K83J45l0k54Q2L80j39q3n5Q9
$$ 14 78 -259 -190 -150 -148 98 -288 -46 -171 15 -91 -32 43 -337 -54 91 61 -193 -111 269 130 47 -8 81
3413H1l90K78l9P0j3K38j14j53m2M01n51K1M17k96RJ58J74m97K36J65k50Q4J96
$$ 81 -309 -31 -70 0 -13 225 111 -42 -84 317 -234 -213 204 -92 -83 75 249 -248 -12 153 -97 -13 183
3436A83l13p2K82k07J67o3J08j2J73l45K01K02l55j08K11k82M63j50J64l0k81
$$ 183 -130 -202 80 -127 40 -23 85 73 246 -99 102 304 -51 -159 52 -230 233 83 247 217 -64
3457f4L22l41L04L2o3j59J55r1P5l1r0j45j0L99j10j98J10k9P2n7l35K74r3QJ33
$$ -64 258 -83 221 253 190 31 186 95 170 139 49 -96 -106 293 183 -15 95 66 138 81 -254 20 -73 -65 68
3482F8j31J39r7o1J81p6J16l14K27o6Q4OP1J03j44qj37J16mk14J32J55k14K64
$$ 68 -63 76 -21 -82 99 23 139 -175 52 -14 70 76 147 250 106 98 -39 77 73 -141 -9 146 -68 196
3506A96m04K29k8P0j45N5j5J08Jj25o5J54J40k45J86O1m01L02j9r0j8J52K6M1
$$ 196 -208 21 -7 63 -82 -27 -42 66 67 -58 -123 31 171 -74 112 173 -228 74 55 -35 -53 99 125 166
3530A66k27P6j41J49J3j56K30m5r1K38k75O3K5r2J79K60n16J76K2k15M32l20k58
$$ 166 -61 15 -126 23 36 -120 110 65 -26 212 -63 0 25 -67 112 372 -144 32 54 -161 271 -49 -307
3553c07K57NK04Kj06j26k20J09J48m3M9r5J73j96K97j03j68l9J78j39j6J45Pk04
$$ -307 -50 -45 159 161 55 -71 -291 -182 -34 -77 -28 -123 50 -146 151 48 -120 -159 19 -120 -136 9 16 -188
3577a88K78L9l3j77pL53l06J39P1m31L15j6q1J44l19O31l95j90K27J5N9O1l15
$$ -188 90 129 96 -81 -88 265 -41 98 169 -262 53 37 -44 100 -219 412 17 -173 54 69 128 189 -126
3600a26J58L1j70j0P5J97k23Q8k89M3M59j28l5j16m4R0N1n9J88J07j54j55j1P9
$$ -126 32 63 -107 -117 -42 155 -68 20 -269 -226 233 105 70 -46 -90 0 51 -8 180 287 133 -22 -33 46
3624D6j28Q0K2L2N8k91J46J43L4r2l43K80q7K02j01P4j56J15p7J17O7m0m79N05
$$ 46 -82 -2 20 52 110 -181 -35 108 142 50 -293 -13 -100 102 1 75 -81 34 -43 74 141 101 -378 127
3648A27k45J55j75J38Q2r0M5j22J11l2j46J82J7J93l43n6P3J95q6L1%O8k04R0
$$ 127 -118 37 -138 0 82 -8 37 -85 26 -6 -152 30 47 240 -103 -159 -86 109 23 54 54 122 -82 8
3672Hk39K30J14P0N2k46l1M7k19L21J45k01J1J6r0j12M6J51j15lk4j51J69J98
$$ 8 -231 -1 113 183 235 -11 -42 5 -214 107 252 51 62 78 -12 -124 -78 73 -42 -45 -69 -220 -51 147
3696A47r3J26n84M22p8J9K3R4k40J63K5k7K16L4j42l53J74j16L04J6j57J17k79
$$ 147 54 180 -404 18 -60 -41 -18 76 -164 -1 24 -3 213 247 105 -248 -74 -190 114 130 -27 90 -189
3719a89K12j04l9P6j1O1J59L6n7l3r3l7p4j63K84J43k05m5qJ30J27k51J76m3J79
$$ -189 23 -81 -120 -44 -55 6 165 201 144 111 18 -19 -93 -256 28 171 -34 -79 -87 43 170 -81 95 52 231
3744B31j66j16O3k05M14k90J67j12r6oJ1n2K37k07Q3n2oJ33k83K49j79K37j18
$$ 231 65 -51 12 -193 221 -69 98 -14 -110 -116 -105 -157 80 -127 -44 -96 -102 31 -252 -3 -182 55 -63
3767f3J34k10J67j67j09K44K3j39r9K09N1k9J33j35J9j91K43j25Q1k86J84R5j40
$$ -63 71 -139 28 -139 -248 -4 19 -120 -219 -10 41 12 145 10 29 -162 81 -44 37 -249 -65 30 -110
3790a10N4N7l7J73l72L56l81J89N1M9m6J29l0k52J77j88K60k73L43n2n1J47j47
$$ -110 -56 1 -36 137 -235 121 -260 -71 -20 29 -17 112 82 -170 7 -181 79 -194 149 97 46 193 46
3813D6q0J65k28J55q5K2j10O5j27J01J32p0N9K29k56N8j3j05j3K9J49N9q1M1k19
$$ 46 -34 131 -97 58 -27 -5 -115 -50 -177 -76 56 -14 45 274 18 76 63 -42 -55 -26 123 182 101 142 -77
3838g7n4K27J80l45l0m3J04j44J91l7j13J24l9q0J35J36k92r1K43P5j22N8O8J
$$ -77 -131 96 276 -69 -99 -142 -38 -182 9 -28 -141 -17 -56 -136 -1 135 -157 -248 -5 70 -52 6 74 75
3862G5j75J63p9k44P4K22L5k30L52j8k01J15j01q0JK39N0Jl47J03J46J45k08j30
$$ 75 -100 63 -16 -260 -186 36 71 -159 193 175 -26 89 -12 -92 -91 148 198 199 -148 -45 101 246 38 -92
3886i2P9p8J23j08k7N1J53k47l4K50k42J37p5K76n3J8j92J20k04J62p5j33Q5L92
$$ -92 -13 -91 32 -76 -103 -52 101 -146 -180 70 -172 -35 -110 166 113 131 -61 59 -145 17 -58 -191 -106 286
3910B86p1n9j22K06j62l14L72l4N6j89J09j17K20l1q6J35j76o6K7J21q8O8J46
$$ 286 215 156 34 240 78 -236 136 102 158 -31 78 -39 181 150 64 199 23 -43 -16 105 17 85 231
3933B31k55O2J42Jmk60J85L1j98K87j02q6K8N4k99K45Kj20j55L16q0o6N3j18J38
$$ 231 -24 38 180 181 177 -83 102 133 -65 222 120 34 62 116 -183 62 64 -56 -211 105 25 -41 12 -106 32
3958C2j36K50m95K51L19k75j62mK23p0j8J43j98K85P7j32j58L7JK6M9l44P9M08
$$ 32 -104 146 -349 -98 221 -54 -216 -220 3 -67 -85 58 -140 145 222 90 -68 -31 -30 -4 45 -299 -220 188
3982A88j09Q5l10L2j02J54L2K21Pj93o9p7L19j93J19K70j78k68J22j67K68m69
$$ 188 79 164 -146 -114 -216 -62 -30 191 198 5 -64 -141 178 -15 104 374 196 -72 50 -117 151 -318
4004c18N59l17O9O8o5o8r0J25K33j11k15M81m20j15K27L69n22q3K23q5j62K3J34
$$ -318 241 -76 -7 61 -4 -72 -162 -37 196 85 -130 351 -69 -184 43 412 -110 -193 30 -55 -217 -194 -60
4027f0J29n6jj0M8J4l6l16M26k77Jj7P5j64J40m0R8m4K09n4j67J64R8j79M0Q6
$$ -60 69 13 12 2 50 64 28 -288 138 -139 -138 -155 -80 -244 -104 -144 -46 -90 119 65 -102 62 160 -19 21 107
4053A07R7l75J64J68o4p5l8p9m4J52O0j43L2k71Q8L09p9J3P9r4l2L6M4J66k86
$$ 107 204 -171 -7 161 97 22 -16 -95 -139 13 73 -70 -38 -309 -221 88 9 22 101 7 -25 11 55 221 -65
4078f5P2o1P1j3P8k82K94j30j25pk5K68j60J10m8k1P8p5o5K4N0j65J35N3q0O9
$$ -65 7 -54 17 4 82 -200 94 -36 -161 -168 -193 75 -85 25 -23 -44 34 -41 -106 -82 -32 -197 -62 -9 -89 -20
4104b0L48n11n5K29J77N7l80M12m0j7K3k93L6Nq8j5M4j4M6j0J78m07M08J38j28
$$ -20 328 -183 -238 -9 168 225 -155 257 217 200 223 -70 -34 -29 -117 -132 -88 -102 -56 -66 112 -295 113 251 123
4129A23m9j65J07j6K6Q2k35J61K98k69j2k58L54l1j72J44j83jO6j70L88l0l67
$$ 123 74 -91 16 0 26 108 -127 34 332 63 51 -207 147 116 -56 88 -95 -96 -30 -200 188 158 -209
4152b09J29K14k38O4n7n4J40KJ33N6j87j14L3L07k43L22l60L9l35L66o5K75l06
$$ -209 -80 134 -104 -40 -97 -151 -11 -9 124 180 -7 -121 -88 219 -24 298 -62 -23 -358 8 -57 218 -88
4175h8J3k04J37N9J9K6j07K7P7O1j80K23j3K4J08ol31lJ35R2k82J06J15k44L30
$$ -88 -75 -279 -142 -83 -64 -38 -145 -118 -41 20 -160 63 50 74 182 176 -155 -158 -23 69 -213 -107 8 -236 94
4200I4J71l07K36l26J74j8M7j21Q8N7L0j14j0J5K0k6n8J65k08J8P4k8r1r7L07
$$ 94 265 -42 194 -132 42 24 71 -50 38 95 125 11 1 16 36 10 -48 117 -91 -73 1 -27 -118 -215 92
4225I2P7l71K72o3k44L46l11N8K33N7j66M4K70l10Rk9q6J09l10M44o8K19l82J17
$$ 92 169 -202 70 7 -237 109 -202 -144 89 146 -20 24 294 -16 -7 -36 -122 -13 -323 121 53 272 -110 7
4249Gr7L68k80J45k14n2Q2L3L52l91k6J14n7o5M8Q1k73J19K23n20L44K01k8o6
$$ 7 -90 278 -2 143 -71 -123 -41 -8 344 -47 -73 41 -16 -81 -33 48 -225 -106 117 -403 -59 142 114 48
4273D8N9j70LL8J18m4k26KK21o5o8J47k66L57l28K72j60q7L18j00j45K98m33K25
$$ 48 107 -63 -60 -22 96 52 -174 -172 49 -16 -84 63 -203 154 -174 98 -62 -149 169 69 -76 222 -211 14
4297A4l5M6Q0k12P2K14J00mk06j4j37k28M98k29J42k49J51k0J31n5q4J64k98L82
$$ 14 -21 25 105 -107 -35 179 279 275 69 55 -82 -310 188 -41 101 -148 3 -17 114 59 -25 139 -159 223
4321B23O1j84K1j19N8k75L10k11L96l53o2J51j33j30K43L3j08J99k71K60L7L4
$$ 223 284 100 121 2 60 -215 95 -116 280 -73 -135 16 -117 -247 -4 29 -79 120 -151 109 146 180
4343A80k14J75Lj00K1J0j81L56k86k3j90J93J69j62J71k05N8J6j17Q2J73Qo9j04
$$ 180 -34 141 144 44 65 75 -106 250 -36 -59 -249 -56 113 -49 122 -83 -25 -9 -126 -44 129 137 68 -36
4367c6j03O6J61j33J26k03j4P6o0Q7j29K71K11j36rk41l7J81j11K95m25J37p0
$$ -36 -139 -73 88 -45 81 -122 -136 -60 -120 -33 -162 109 320 184 175 -66 -103 78 -33 262 -163 -26 -96
4390i6J50j02K7K2j42J90NN3j2J57n44M86k24k8Q4R2j57k3J5j31L69j16kJ59M9
$$ -96 54 -48 -21 1 -141 49 54 107 95 252 -292 194 -30 -58 26 118 -39 -62 -47 -178 191 75 73 232 281
4415B81k19j49K69k57l9P1L05j97j02m0L2J39k94J6K12J16l0p9jr2j03K27L4K3
$$ 281 62 -87 182 -75 -114 -43 262 65 -37 -77 -45 94 -200 -184 28 144 114 35 34 -58 -161 66 100 123
4439A23r1j69J51j02Q9r5J44J00q2k52L24k21J52l5j07J50k62R1K71k59J05k1
$$ 123 32 -137 14 -88 1 -94 50 150 68 -184 140 -81 71 36 -71 79 -183 -92 179 -80 25 4
4461Dp6J2M4k9K27m08J63J14k1j28P2J54r9q5M5J02k26J03Q9r8N5O7j69Jq9L40
$$ 4 -72 -60 -16 -45 182 -226 -63 51 30 -98 -26 128 29 -56 -11 91 -135 -32 57 -41 14 81 -88 -87 -176 164
4487A64k47K78l59R4j13K01j24J65j14L4O9j12K77r2j95qP8k06L27l25M19j54
$$ 164 -83 195 -164 -70 -183 18 -106 59 -55 -21 48 -64 213 121 -74 -82 -4 -210 117 -208 211 57
4509E7k01O9J93j06m6L3L27j51k40J28r8Lo4K60o9j94J09J04j01nj50K77l62J51
$$ 57 -144 -75 118 12 -34 -1 326 175 -65 63 -35 -32 -96 164 95 -99 10 114 13 8 -142 135 -227 -76
4533g6k3J45R9j16j05J87p7j03J19L6j40l2k52L42R8j76mK23j43J99o07K15K08
$$ -76 -99 46 145 29 -76 111 34 -69 50 86 -54 -86 -338 4 102 -74 -78 145 2 201 -406 -191 17
4556A7K40l19J81k06QR6P8J95l65K33k43J22J26o5k60J09J87k86n0K39%J07k92
$$ 17 257 -62 119 -87 -79 17 95 290 -75 158 -85 37 163 98 -162 -53 134 -152 -202 37 37 144 -148
4579a48K9L9j28L0n0K15R3p9P0J06q7j20j8k65J00R7R1J19k24L29n49K82lK1K13
$$ -148 -119 -80 -208 -178 -228 -13 80 1 71 177 90 -30 -48 -313 -213 -116 -25 94 -130 199 -350 -68 -71 -50 163
4604A63k21J3j2K1K11j97l3j27M12l00o0O8J26J74j56R8l17J36j39L80k82R2j31
$$ 163 -58 -45 -57 -36 175 -22 -55 -182 230 -70 -130 -62 64 238 82 180 -137 -1 -140 240 -42 50 -81
4627h1K13p0j43N8N6lO8l38K4J84Q4J80j55k4k6l62M57R6k05k43L3R7q4K67j66
$$ -81 132 62 -81 -23 33 30 98 -240 -216 -32 52 232 77 53 27 -335 122 218 13 -230 -197 -100 -184 83 -83
4652h3J98J2P6j97j6P0j72N3J2K1MQ9l38K91l13L15j86J04R3j34K5n8P2J46k07
$$ -83 115 127 203 6 -10 60 -112 -59 -47 -26 -22 67 -271 20 -293 22 -164 -60 33 -101 -76 -134 -62 84 -123
4677a23J3J5J02J7J90k57jK2k9L6j03K05j19L6n1j41K3J60O1l3l39L89J08k29
$$ -123 -110 -95 7 24 214 -43 -44 -22 -51 -15 -118 87 -32 4 -47 -188 -165 -5 56 23 -316 73 181 -48
4701d8O5j79K2J73k51L78j06J0m3m6J09nk10K92j19Q4n4j13O4j61P4K35k21MJ85
$$ -48 17 -162 -140 33 -218 160 54 64 21 -25 84 79 -131 161 42 126 72 -41 23 -138 -64 171 -50 -46 139
4726A39j65j52L37n9j07M5k7k36L35j25m9J80q4j1O6j26rM4k87L19k11K50j07
$$ 139 -26 -178 159 100 -7 38 11 -225 110 -15 -64 116 32 21 87 -39 -48 -4 -291 28 -183 67 -40
4749d0j75L09k0l5J4j80K1J26M1M0k04L31k12Q4j10J59Q6j87p6J9q7J35J6j06
$$ -40 -215 94 74 39 53 -127 -106 20 61 101 -103 228 16 100 -10 149 235 48 -28 -9 -96 39 55 -51
4773e1J77q7p8O8Q2j03J42p6l5l07M12o2L50m75R1k18K82J7k02j2j1J60m4O5N
$$ -51 126 39 -39 29 111 8 150 74 39 -268 144 82 432 -43 48 -170 112 129 -73 -85 -96 64 20 85 90
4798I0Ol5j57J38k25K20j20M2J21n5r7k5m7J84j41K31j31K15m7k61J79n7J97j22
$$ 90 96 61 -96 42 -183 37 -83 -41 80 25 -72 -97 -144 40 -101 130 -1 214 167 -94 85 28 225 103
4822A03j74Q5p6J27j33j18K44O5Nj51n1k1J27m2j21J03j73L56o7l0K1j23J90p5
$$ 103 -71 14 -62 65 -68 -186 58 123 128 -23 -74 -95 32 -10 -131 -28 -201 155 88 58 79 -44 146 71
4846G1Q7j62OJ23q9j0k65J47Q7J41J63n9M0j85l6j08M02m09K1J99j94nR7o4J15
$$ 71 158 -4 2 125 36 26 -239 -92 -5 136 299 240 280 95 59 -49 353 -56 -35 164 -30 -35 62 -2 113
4871A13K4l53K59J68l98j9K58j9q8K57k79J38j46K81J6J14l19o9Q2j77K00o4N9
$$ 113 137 -216 43 211 -187 -206 52 33 -55 202 -77 61 -85 196 212 326 7 -62 20 -157 43 -21 38
4894C8MoO9j05NOo8n8rO0K02k54K81k09J06r1J55l2l03K82j88n7J60N4j27n4M
$$ 38 42 36 105 0 5 11 -57 -115 -124 -64 138 -116 165 -44 62 -29 126 94 -209 73 -115 -172 -12 42 -85 -139 -135
4921a35K27j14j08J04j69J34%L26m6q8j31j54O3m1J05p2J66J30p5o0k04J58J52
$$ -135 92 -22 -130 -26 -195 -61 -61 265 219 131 0 -154 -91 -132 -27 -99 67 197 122 62 -142 16 168
4944A68l98L93j41J1jj78kJ71q4N2J91k46o7L57m41K46k4m4J29k16K00k93M01
$$ 168 -230 163 22 33 32 -146 -148 23 -61 -9 182 -64 -131 226 -215 31 7 -37 92 -124 76 -217 184
4967A84q0m3k17l5K42m6j37K35j89n3K18j13j49J84o5K50k57j10M48k77j32J83
$$ 184 104 61 -156 -191 51 5 -132 103 -86 -139 79 -34 -183 1 -64 186 -71 -181 267 -10 -142 41
4989D1j22RRK24k28j58K02J90l14J21L12k74J24N6m49L80j67K62j26l65K94j06
$$ 41 -81 -72 -63 161 -67 -225 -23 167 -147 -26 286 12 136 192 -257 123 -44 218 92 -273 21 -85
5011h5Q6J7J81j65k37K88K2j64J49j46RK2Q%K74m20J15N3j34J11N9p1No1l1R0
$$ -85 1 18 199 34 -203 85 107 -57 92 -54 -45 -23 -15 -15 259 -161 -46 7 -127 -16 43 -28 -23 -84 -115 -25
5037b5L7l62J33L44l25J02K26j05n21N53j5q7j5k1l3K27j52J4L20k77k5j94J34
$$ -25 12 -350 -217 127 -198 -96 130 25 -496 57 42 -45 -60 -81 -114 113 -39 -25 295 18 -7 -201 -67
5060f7j85J38L6Q8J58l25J10J50J6j16J05j79J8n7J18J44p9q2j63L90o1k91J80
$$ -67 -252 -114 -78 10 168 -157 -47 103 119 3 108 -71 -53 -110 8 152 73 -9 -172 218 157 -134 46
5083D6q5j73K82K10m23M7Q1m31N29j39RM1J46qp4J13n6k49J46J54j94K62j00k11
$$ 46 -39 -212 70 280 -143 -96 -15 -446 83 -56 -47 -6 140 132 58 171 115 -134 12 166 -28 234 134 -77
5107g7m1q7L08K1k4M0j91m7M9J3m1k82O89l66k68K64J38poPK1j68M9Q7o1l18K74
$$ -77 -118 -205 103 124 100 140 -51 -98 -49 -36 -77 -359 330 -36 -304 -40 98 91 85 92 113 -55 -6 81 20 -298 -24
5134b4K71k62J39k41Q2q3K58l17Q3p4K72kj08K70n72K86k03K68k51M3J69p0K88
$$ -24 247 -15 124 -117 -35 -118 140 -177 -94 -168 104 102 -6 264 -308 -22 -225 43 -208 -165 4 -66 222
5157B22k18Q2N0j50J35k21Kr9O7J77Qj56P3k62L78k15L3J42q6L8J43N6j69q4K51
$$ 222 4 86 136 -14 121 -100 -98 -197 -130 47 55 -101 -28 -290 88 -127 -94 48 -38 0 143 199 30 -54 197
5182A97k62K27J7j57n8K12j83K00k68l37K98L4K04j50m5M4J13P8k11j78M07l38
$$ 197 -65 162 179 22 -36 176 -7 193 -75 -412 -114 -80 124 -26 -71 -27 86 164 -47 -225 182 -156
5204a56K90J4k42K71k31P7j65K65k77p1J69j09K64QN2r6J14l85J3K80j64J09Q9
$$ -156 134 148 -94 177 -54 23 -142 123 -154 -225 -56 -165 99 107 159 63 177 -208 -195 85 -79 30 119
5227A19J4j79kR5J01j01k18Q4J54j9J07q1l73K80J43k3k58J93j20k8J12L3p7L3
$$ 119 133 -46 -48 47 148 47 -171 -87 67 48 155 74 -299 -19 124 101 -157 36 -84 -112 0 33 -44 -11
5251a1J6J33o7k42Q5J11P3n4j8k57K79k50J71J44j72J76Pl05rL50l60K19R7n8
$$ -11 5 138 71 -171 -86 25 98 44 26 -231 48 -202 -31 113 -59 117 124 -181 -190 160 -200 19 116 58
5275E8J64j68K4N2j29j47J51M0m1J7J90k55N9m3r2K09j02K7l02M46j0L4j55j75
$$ 58 222 54 78 130 1 -146 5 45 4 21 211 -44 15 -28 -120 89 -13 14 -288 158 148 182 27 -148
5299a48m7K89k01P9K12k99J89QP3l41K79k52J18k7K13k8j88j12J46j64N0L33m25
$$ -148 -195 94 -107 -28 184 -115 74 82 155 -186 93 -159 -41 -68 145 117 -71 -183 -37 -201 -151 182 -243
5322b43K79j5M0j5m1l2N1K9j90n0M41j17k61L87k50o5J34J14k30j51L48k62J6
$$ -243 36 21 61 46 5 -27 24 53 -137 -187 254 137 -124 263 13 -52 82 196 -34 -185 163 -99 -83
5345h3qNJ18N3P3j55J59l17J25O3Lj00K2o8J89k34J80J4J68l66P3J10k60J95L8
$$ -83 -91 -86 32 85 158 3 162 -155 -30 33 36 -64 -42 -110 79 -155 25 39 207 -159 -86 24 -236 -41 -3
5370cN4j35J92j34j93K78RM0l15L57J82l40R0k1l4j50J19k4M3J1j79K43n2P3j02
$$ -3 51 -84 108 -26 -219 59 68 108 -207 150 332 -8 82 61 27 -123 -4 -28 15 26 -153 90 38 111 9
5395IL7KK4J8j35J67j80M1j08O0O3m2M9o8p3J69j23K38J51l81j1P5R7K9Oj83q
$$ 9 46 48 72 90 -45 122 -58 -17 -125 -65 -2 -44 5 -63 -136 33 -90 148 299 -82 -93 -18 79 108 114 -69 -77
5422g7p6j18L16K00l01Q3j35o8K59j39J60o0J94l55J59p8L30l53j31J88n2K71
$$ -77 -153 -271 45 245 -56 27 -108 -176 83 -56 104 44 238 -117 42 -36 294 -59 -190 -2 -54 217
5444B17k05k7K13k04j39J67m4j4rJ75j86o6L60k96J69j33L61m88J53j44R4Q6j23
$$ 217 12 -15 198 -6 -145 22 -22 -36 -45 130 -56 -122 238 -58 111 -22 339 -149 4 -140 -46 40 -83
5467h3J54j2k7k51K32n5J11j07j6j4J40n3j16J21M6j76R5PJ21j9q7j57J15m8J91
$$ -83 71 59 32 -219 13 -42 69 -38 -54 -68 72 19 -97 24 70 -106 -11 -4 117 98 11 -146 -31 -79 112
5492A12j71J10j32j8J39o0K40k67K12J8k44o3K04j41K92J6k67JJ82j8k70Q0R6
$$ 112 -59 51 -81 -99 40 -20 220 -47 165 183 -61 -124 80 -61 231 247 -20 -19 163 145 -125 -45 51
5515E1m25L18jj9K64k34l8L9Q5k06K63j19L8p2J45o6j39P1J8o7J74n7k68L65j45
$$ 51 -374 -56 -57 -76 188 -46 -84 -45 40 -166 97 -22 16 -56 89 23 -116 -45 -27 -94 80 23 -245 120 -25
5540b5q7p6K72j78j8m2K17r4M5Ko6J10k38J23l9j04K81O8m9J4o8k24J11M4j30
$$ -25 -112 -188 84 -94 -112 -154 63 -31 14 16 -50 60 -178 -55 -94 -198 83 151 102 116 48 -176 -65 -21 -151
5565a51L34j82j06j8J59J29N2l74L12j19j69L50n13L00J29j73K29l06J44k8j18
$$ -151 183 1 -105 -123 36 165 217 -157 155 36 -133 217 -296 4 133 -40 189 -117 27 -1 -119
5586a19O7K11k64J67Q9k54J52q8J45j24L2J85M4l80L80m04L14j00k5j61P7J00
$$ -119 -52 159 -105 62 151 -103 49 -39 106 -18 14 199 243 -137 243 -161 153 53 28 -133 -56 44
5608D4K22l09m1m8L22j48j26lK05l49K75l1O4j27K5L4J62j28R5j83K40j6l42J05
$$ 44 266 -43 -84 -132 190 42 -84 -87 118 -231 44 13 77 -50 -25 9 171 43 138 -45 195 179 -163 -58
5632e8qK04j09J88k92K23K0k34q4J99k91L68Q1p4l5j48K0K1j14J25K07l53K89
$$ -58 -66 138 29 217 -75 148 168 -66 -150 49 -242 126 207 133 98 -50 -30 -9 -123 2 209 -144 145
5655A45j46k1J52k58O5j65M02k20J67J85j09j96O0j56J15n0P0Q4l01J75J8J97
$$ 145 -1 -22 130 -128 -63 -228 174 -46 121 306 197 1 61 -95 20 -30 40 124 -177 -2 16 213
5677B13q8L9k61QM81m63K73k6l21MQ5R4J53J4k44o2J90o6k1N1ok48J42j67K86
$$ 213 125 164 -97 -89 392 -71 202 176 -145 -141 -56 38 191 205 -39 -101 89 23 2 53 47 -201 -59 -226 60
5702F0j66L9J90l3m4J9O6j70J07PJ55m7k38K8j94J98o2J52n0M2n7O3j01J65j32
$$ 60 -106 -67 123 90 46 65 131 -39 68 75 230 183 -55 -27 -221 -23 -85 67 17 59 2 65 -36 129 -3
5727cj98J96j5q5Q4MJ28j86J31j00K7M7O0M1q0N0q3q5O5K03n38M35J47j03n4k8
$$ -3 -201 -5 -20 -105 -21 -17 111 -75 56 -44 -17 30 90 131 51 101 18 -67 -2 201 -337 98 245 142 88 60
5753F0Kj56J20n2j15J38Jm4O9j24L04l52K83j95Q0n9J30kL3j94O5J76j19l65M50
$$ 60 62 -94 26 -26 -141 -3 -2 -46 23 -101 203 -149 134 -61 19 -40 90 88 121 -73 -8 168 49 -316 134
5778A34j53n6L8J15l08K68J5r2K07j81Q1l35K10J08j11O0M4k7O5m5Jj25m0l23
$$ 134 -19 -75 -37 78 -230 38 53 -39 168 -13 68 -267 -57 51 -60 0 44 17 82 37 38 -87 -127 -450
5802d50N70J27j02k06n6J16O4m4j27K05j9j18J19k21M20l80M7K70l08J24l04J61
$$ -450 120 247 145 -61 -117 -1 63 19 -108 97 78 -40 79 -142 278 -102 -55 215 -93 31 -273 -112
5824a12Nr1Q0K9K56l34K32M1j53Q1j68K48p9K37j76j12moM0rJ45o0K8r1j81OL30
$$ -112 -107 -198 -118 -89 167 -167 65 106 -47 34 -134 114 35 272 96 -16 -20 -26 14 5 150 90 118 27 -154 -148 182
5851A82k48J34k61K05j12l5L34l96K80j67J18K30k51L1K18l08J99j95j7J27p0
$$ 182 -66 68 -193 12 -100 -135 199 -197 83 -84 34 264 13 44 262 -46 153 -42 -59 68 -2
5872bQ4j97J15O4j81K23J1j68k8O6j6J0k28J89K0K43m8o6j32Jn5K1J16ll92J85
$$ -2 82 -115 0 64 -117 106 117 -51 -79 -13 -29 -19 -247 -58 -38 205 157 91 -41 -40 -95 -74 42 39 -353 -168
5898a68N1J45L5j00PRN9N9N6k95K41J23j35K9j04j17J6J47j9K79l69L04j06j51
$$ -168 -117 28 63 -37 -30 -21 38 97 153 -142 99 222 87 116 12 -105 -89 58 39 318 -51 253 147 -4
5922dj85M5J29j80K21k51P7R8J04k86J77J40m3j13k4L7K12K1j35l02M33l17K10
$$ -4 -189 -144 -15 -195 26 -225 -148 -50 54 -232 -55 85 42 -71 -95 -58 154 175 40 -262 171 -146 64
5945F4q5j28J00J02m47J98N3K72o6L5Q6k92M9J89k81K26j16K2n6j05J93l0J20
$$ 64 -21 -149 -49 53 -394 -196 -143 129 63 98 184 -108 -59 130 -151 75 -41 -19 -75 -180 13 -17 103
5968A03k09J10j06K26k42P8K69j06j54R3j47P4k83L42O1qrj58J15N5j07o2M2L9
$$ 103 -106 4 -102 124 -118 -40 229 123 -31 62 -85 -11 -294 48 109 101 92 -66 49 104 -3 -65 -23 16
5992A6J24j15k9n9r8N3J06j4rJ25j79K20k32L11k29l2k18K30K5j2J82j88J06m4
$$ 16 140 25 -4 -63 -161 -108 -2 -16 -25 100 -79 141 -91 220 -9 -41 -259 -29 -4 -16 166 -22 84 40
6016D0k2k50J43J56R7k94L1J16J53J07m60J06J41j0j20J60r2P9j31j28K59N9j52
$$ 40 18 -232 -89 67 164 -130 -99 17 170 277 -183 -77 64 54 -66 94 2 81 -50 -178 81 140 -12
6039a2j6L11j95R7j82q2k5K08J49k17J0k01L62m33J86M6K22j55k54K98j84K04
$$ -12 -28 283 88 185 3 -79 -104 104 253 36 46 -155 207 -226 -40 6 228 73 -181 117 -67 137
6061A37l03L13j60j94J06o3K59O4k39K47p3k27L09j80n0O9J39m42J65K34r9p7
$$ 137 -166 147 -13 -207 -101 -164 95 159 -80 167 94 -133 176 -4 -54 15 154 -288 -123 111 12 -65
6083f5J82q5J91k86q0L14k60K43j81j63L14j2k41L89k44j19J12K26j73k25j41
$$ -65 117 32 223 -63 -143 171 -89 154 -27 -190 124 112 -129 260 16 -103 9 235 62 -163 -304
6104c04K17L34n60K90L8j69k7j65J70J94R0q3o0K5k7mJ67l15K07j18K2R9j11j25
$$ -304 -87 247 -313 -23 15 -154 -181 -346 -176 18 108 25 -35 -10 -37 -41 126 -189 18 -100 -78 21 -90 -215
6128b15L36j48j16m9J17m8K31j47L3j01L26j64K20k08r8J36p8J9j70N36p36L38
$$ -215 121 -27 -143 -192 -75 -123 108 -39 -6 -107 219 55 275 67 -31 105 27 46 -124 412 -324 14
6150A4J6O4j73j4K14M4N6k54J51k88J49J20k4j4j47J41P0p1j65K8MJ02Nr6N4r2
$$ 14 30 94 -79 -93 121 165 221 -33 118 -170 -21 99 75 61 -86 55 125 54 -111 -83 -79 23 28 -68 -14 -106
6176a06J18j71K40k95K52o2j62K97l9m9j39N85l42j24j51J89m0q8J86j71K11j25
$$ -106 12 -159 81 -214 38 -24 -186 111 72 23 -116 469 127 3 -148 41 1 -87 99 -72 139 14
6198A4J09j91j14Q8J62J19q8k21L4J52j6j30J14J3K95m77K49l33M79P8k41k10
$$ 14 123 -68 -182 -94 68 187 99 -122 -88 64 48 -82 32 45 340 -137 112 -221 258 336 95 -115
6220a15J47J6j0K59l55o9J2m0J65J60n6O9j43NL2R0l38k7J29K28l17K17M6j09
$$ -115 32 48 38 297 -58 -127 -115 -155 10 170 114 183 40 45 77 167 -171 -198 -69 159 -158 59 105 -4
6244dP3q3R2j47Q5J34p2n1k78L59jk16J80K0j46M9k65J39K08L8K01n21K37Q3k14
$$ -4 69 -14 78 -69 16 150 78 27 -251 108 107 -109 71 91 -55 -6 -271 -132 76 114 315 -206 31 114 -100
6269a00K62j69j15J86P6j2j45J09j97mj1j3J38k61K18J51j60J61k18K35j43K11
$$ -100 162 -7 -122 64 140 128 -17 92 -105 -109 -120 -133 5 -256 -38 113 -47 114 -104 131 -12 199
6291A99k88P1K7J48k42J28j07P1p4N5J10n7l56M95k4l56J30j03J90L4o0k00J86
$$ 199 -89 -18 9 157 -85 43 -64 7 -67 -12 98 41 -315 180 156 -200 -70 -173 17 51 -9 -209 -23
6314b3q5J00q8J66KL1m9k52Q1K88j68J48l15O7O6M3j04K4J65j06K7j6m8J88k89
$$ -23 -108 -8 -96 70 72 103 54 -198 -117 171 3 151 -164 -97 -31 12 -92 -68 97 -9 18 2 -46 142 -147
6339a47o7J88m9J33J51k47r6kJ40N1m3J01K9j31j80J63J26l5K8j20m8Q5Q5J39
$$ -147 -214 -26 -75 58 209 -38 -134 -136 4 55 12 113 142 11 -169 -6 120 85 113 -7 -55 30 115 254
$$ [...]
8191A35
##END NTUPLES=NMR FID
##END=
