##TITLE=1H_SR146_k2
 CDCl3
 8 sc, 
 26.10.2022
##JCAMPDX= 6.0         $$ Bruker NMR JCAMP-DX V2.0
##DATA TYPE= NMR FID
##DATA CLASS= NTUPLES
##ORIGIN= UXNMR, Bruker Analytische Messtechnik GmbH
##OWNER= root
$$ XWIN-NMR		Version 3.5
$$ Wed Oct 26 16:33:29 2022 Russian Standard Time (UT+4h)  she@DPX200
##.OBSERVE FREQUENCY= 200.1313499994
##.OBSERVE NUCLEUS= ^1H
##.DELAY= (6, 6)
##.ACQUISITION MODE= SIMULTANEOUS
##.ACQUISITION SCHEME= undefined
##.AVERAGES= 8
##.DIGITISER RES= 18
##SPECTROMETER/DATA SYSTEM= spect
##.PULSE SEQUENCE= zg30
##.SOLVENT NAME= CDCl3
##.SHIFT REFERENCE= (INTERNAL, CDCl3, 0, 15.7039)
##AUDIT TRAIL= $$ (NUMBER, WHEN, WHO, WHERE, WHAT)
$$ ##TITLE= Audit trail, XWIN-NMR		Version 3.5
$$ ##JCAMPDX= 5.01
$$ ##ORIGIN= Bruker BioSpin GmbH
$$ ##OWNER= she
$$ F:/spectra/data/she/nmr/H-F/1/audita.txt
$$ ##AUDIT TRAIL=  $$ (NUMBER, WHEN, WHO, WHERE, WHAT)
(   1,<2022-10-26 16:32:47.70 +0400>,<she>,<DPX200>,
      <created by zg, POWCHK disabled, PULCHK disabled
       configuration hash MD5:
       00 E9 B6 7A A2 85 ED C7 34 08 36 98 17 FE 4E 26
       data hash MD5: 16K
       6D CA E4 79 E4 F9 73 C5 67 8D F9 A5 D8 93 14 F0>)
$$ ##END=
$$ 
$$ hash MD5
$$ 40 6C BF C7 92 F6 A4 72 68 AC C3 05 4B F0 E9 73
##$RELAX= 
##$RELAX= 
##$RELAX= 
##$RELAX= 
##$RELAX= 
##$RELAX= 
$$ Bruker specific parameters
$$ --------------------------
##$DU= <F:/spectra>
##$EXPNO= 1
##$NAME= <H-F>
##$PROCNO= 1
##$TYPE= <nmr>
##$USER= <she>
##$AMP= (0..31)
100 100 100 100 100 100 100 100 100 100 100 100 100 100 100 100 100 100 
100 100 100 100 100 100 100 100 100 100 100 100 100 100 
##$AQSEQ= 0
##$AQ_mod= 1
##$AUNM= <au_zg>
##$AUTOPOS= <>
##$BF1= 200.13
##$BF2= 200.13
##$BF3= 200.13
##$BF4= 200.13
##$BF5= 200.13
##$BF6= 200.13
##$BF7= 200.13
##$BF8= 200.13
##$BYTORDA= 1
##$CFDGTYP= 0
##$CFRGTYP= 5
##$CHEMSTR= <none>
##$CNST= (0..31)
1 1 145 1 1 1 1 1 1 1 1 1 1 1 1 1 1 1 1 1 1 1 1 1 1 1 1 1 1 1 1 1 
##$CPDPRG= <>
##$CPDPRG1= <>
##$CPDPRG2= <>
##$CPDPRG3= <>
##$CPDPRG4= <mlev>
##$CPDPRG5= <mlev>
##$CPDPRG6= <mlev>
##$CPDPRG7= <mlev>
##$CPDPRG8= <mlev>
##$CPDPRGB= <>
##$CPDPRGT= <>
##$D= (0..31)
0 1.2 0 0 0 0 0 0 0 0.06 0 0.03 0 0 0 0 0.0002 0 0 0 0 0 0 0 0 0 0 0 0 
0 0 0 
##$DATE= 1666787567
##$DBL= (0..7)
120 120 120 120 120 120 120 120 
##$DBP= (0..7)
150 150 150 150 150 150 150 150 
##$DBP07= 0
##$DBPNAM0= <>
##$DBPNAM1= <>
##$DBPNAM2= <>
##$DBPNAM3= <>
##$DBPNAM4= <>
##$DBPNAM5= <>
##$DBPNAM6= <>
##$DBPNAM7= <>
##$DBPOAL= (0..7)
0.5 0.5 0.5 0.5 0.5 0.5 0.5 0.5 
##$DBPOFFS= (0..7)
0 0 0 0 0 0 0 0 
##$DE= 6
##$DECBNUC= <off>
##$DECIM= 32
##$DECNUC= <off>
##$DECSTAT= 4
##$DIGMOD= 1
##$DIGTYP= 9
##$DL= (0..7)
0 120 120 120 120 120 120 120 
##$DP= (0..7)
150 150 150 150 150 150 150 150 
##$DP07= 0
##$DPNAME0= <>
##$DPNAME1= <>
##$DPNAME2= <>
##$DPNAME3= <>
##$DPNAME4= <>
##$DPNAME5= <>
##$DPNAME6= <>
##$DPNAME7= <>
##$DPOAL= (0..7)
0.5 0.5 0.5 0.5 0.5 0.5 0.5 0.5 
##$DPOFFS= (0..7)
0 0 0 0 0 0 0 0 
##$DQDMODE= 0
##$DR= 18
##$DS= 0
##$DSLIST= <SSSSSSSSSSSSSSS>
$$ [...]
##$SUBNAM2= <"">
##$SUBNAM3= <"">
##$SUBNAM4= <"">
##$SUBNAM5= <"">
##$SUBNAM6= <"">
##$SUBNAM7= <"">
##$SUBNAM8= <"">
##$SUBNAM9= <"">
##$SW= 18.0517283424941
##$SWIBOX= (0..15)
0 0 2 0 0 0 0 0 0 0 0 0 0 0 0 0 
##$SW_h= 3612.71676300578
##$TD= 16384
##$TD0= 1
##$TE= 0
##$TE2= 300
##$TE3= 300
##$TEG= 300
##$TL= (0..7)
0 120 120 120 120 120 120 120 
##$TP= (0..7)
150 150 150 150 150 150 150 150 
##$TP07= 0
##$TPNAME0= <>
##$TPNAME1= <>
##$TPNAME2= <>
##$TPNAME3= <>
##$TPNAME4= <>
##$TPNAME5= <>
##$TPNAME6= <>
##$TPNAME7= <>
##$TPOAL= (0..7)
0.5 0.5 0.5 0.5 0.5 0.5 0.5 0.5 
##$TPOFFS= (0..7)
0 0 0 0 0 0 0 0 
##$TUNHIN= 0
##$TUNHOUT= 0
##$TUNXOUT= 0
##$USERA1= <user>
##$USERA2= <user>
##$USERA3= <user>
##$USERA4= <user>
##$USERA5= <user>
##$V9= 5
##$VALIST= <valist>
##$VCLIST= <CCCCCCCCCCCCCCC>
##$VD= 0
##$VDLIST= <DDDDDDDDDDDDDDD>
##$VPLIST= <PPPPPPPPPPPPPPP>
##$VTLIST= <TTTTTTTTTTTTTTT>
##$WBST= 1024
##$WBSW= 4
##$XGAIN= (0..3)
0 0 0 0 
##$XL= 0
##$YL= 0
##$YMAX_a= 199381
##$YMIN_a= -167785
##$ZGOPTNS= <>
##$ZL1= 120
##$ZL2= 120
##$ZL3= 120
##$ZL4= 120
##$ABSF1= 10
##$ABSF2= 0
##$ABSG= 5
##$ABSL= 3
##$ALPHA= 0
##$AQORDER= 0
##$ASSFAC= 0
##$ASSFACI= 0
##$ASSFACX= 0
##$ASSWID= 0
##$AUNMP= <proc_1d>
##$AZFE= 0.1
##$AZFW= 0.1
##$BCFW= 1
##$BC_mod= 2
##$BYTORDP= 1
##$COROFFS= 0
##$CY= 11.3945322036743
##$DATMOD= 1
##$DC= 2
##$DFILT= <>
##$DTYPP= 0
##$F1P= 2.36226072786647
##$F2P= -0.459571619588291
##$FCOR= 0.5
##$FTSIZE= 0
##$FT_mod= 4
##$GAMMA= 1
##$GB= 0.15
##$INTBC= 1
##$INTSCL= 1
##$ISEN= 128
##$LB= 0.24
##$LEV0= 0
##$LPBIN= 0
##$MAXI= 10000
##$MC2= 0
##$MEAN= 0
##$ME_mod= 0
##$MI= 1.114404
##$NCOEF= 0
##$NC_proc= 0
##$NLEV= 6
##$NOISF1= 3.799351
##$NOISF2= 2.8
##$NSP= 1
##$NTH_PI= 0
##$NZP= 0
##$OFFSET= 15.70392
##$PC= 1
##$PHC0= -18394.77
##$PHC1= 14.2007
##$PH_mod= 1
##$PKNL= yes
##$PPARMOD= 0
##$PSCAL= 0
##$PSIGN= 0
##$REVERSE= no
##$SF= 200.130013532006
##$SI= 16384
##$SIGF1= 3
##$SIGF2= 2
##$SINO= 400
##$SIOLD= 16384
##$SREGLST= <1H.CDCl3>
##$SSB= 0
##$STSI= 0
##$STSR= 0
##$SW_p= 3612.71676300578
##$SYMM= 0
##$S_DEV= 0
##$TDeff= 0
##$TDoff= 0
##$TI= <>
##$TILT= no
##$TM1= 0
##$TM2= 0
##$TOPLEV= 0
##$USERP1= <user>
##$USERP2= <user>
##$USERP3= <user>
##$USERP4= <user>
##$USERP5= <user>
##$WDW= 1
##$XDIM= 8192
##$YMAX_p= 0
##$YMIN_p= 0
$$ End of Bruker specific parameters
$$ ---------------------------------
##NTUPLES= NMR FID
##VAR_NAME=  TIME,          FID/REAL,        FID/IMAG
##SYMBOL=    X,             R,               I
##VAR_TYPE=  INDEPENDENT,   DEPENDENT,       DEPENDENT
##VAR_FORM=  AFFN,          ASDF,            ASDF
##VAR_DIM=   8192,          8192,            8192
##UNITS=     SECONDS,       ARBITRARY UNITS, ARBITRARY UNITS
##FACTOR=    0.0002768,     1,               1
##FIRST=     0,             0,               0
##LAST=      2.2672688,     0,               0
##MIN=       0,             -167785,         0
##MAX=       2.2672688,     199381,          0
$$ Real data points
##PAGE= N=1
##DATA TABLE= (X++(R..R)), XYDATA
0@%%%%%%%%%%%%qJ6j6J6j6K4l2L2m0M9n7P2q8J02j18J36j52J76k02K27k59K94
$$ 0 0 0 0 0 0 0 0 0 0 0 0 0 -8 8 -8 8 -8 16 -16 16 -24 25 -32 40 -48 54 -64 72 -80 96 -106 121 -138 156
34A56l33L77m24M74n32N94o60P34q15R04j001J106j219J343j481J633j798J980
$$ 156 -177 200 -224 250 -282 312 -348 386 -429 475 -526 580 -639 704 -777 856 -942 1038
52A038k182K407k659K943l265L632m056M553n147N871o776P944r512J1754j5243
$$ 1038 -1144 1263 -1396 1547 -1718 1914 -2142 2411 -2736 3135 -3641 4303 -5209 6545 -8698
67h698K1470l6032J37430Q5211j86024j03183p7959P3907J58432J10432n1882
$$ -8698 12772 -23260 114170 199381 13357 -89826 -167785 -93878 64554 174986 123104
78A23104j10890j25624n1586Q0649J60404O3328n2602j11736j05746k5959J10332
$$ 123104 12214 -113410 -164996 -84347 76057 139385 86783 -24953 -130699 -156658 -46326
89d6326J31651L8038n0576q5500q9768o570R9650J05648K2085m7446r4370q4239
$$ -46326 85325 123363 72787 -12713 -102481 -109051 -9401 96247 118332 70886 -23484 -107723
101a07723J5000J06775Q3133L893n6092q8741o3124K7462Q4517O1953Q695m8066
$$ -107723 -92723 14052 97185 101078 44986 -43755 -106879 -79417 5100 67053 75748 27682
113B7682q5576m5275M3362Q0302N1436K388n3512p7067k5480M7270O6220M0362
$$ 27682 -57894 -103169 -59807 20495 71931 74319 20807 -56260 -81740 -34470 31750 72112
125G2112l762n3614o4125j4260M0841N5879L4168j4386o0189n4745j397M2961
$$ 72112 68350 14736 -49389 -63649 -22808 33071 67239 52853 -7336 -62081 -63478 -20517
137b0517N1520K7519k0561n4693m0594M025L9196M7520K2542k4566m9685l0664
$$ -20517 31003 58522 37961 -16732 -57326 -53301 -14105 33415 55957 31391 -18294 -48958
149d8958R712L9764M2965J1402l0482m4575k4734J0245L7241L6526L826l0519
$$ -48958 -39246 518 43483 54885 24403 -20172 -44906 -34661 2580 39106 42932 12413
161A2413l7483j8925J3069L7834L0540l725l0159l2141j3694J8290L7833K4282
$$ 12413 -25070 -43995 -30926 6908 37448 33723 3564 -28577 -42271 -23981 13852 38134
173C8134n499k6760k9515j1011J9877L3860J6695r544k6500k7134n789K3446K9444
$$ 38134 32635 5875 -23640 -34651 -14774 19086 35781 26237 -263 -27397 -33186 -9740 19704
186A9704J1129j0900k5365k4753j796K3551K5230Q805j0201k3656j9843M741K4231
$$ 19704 30833 19933 -5432 -30185 -31981 -8430 16800 25605 15404 -8252 -28095 -23354 877
199H77K0608N673j2128k4304j6527P721K1788J7302M422j2931k3713j2937Q890
$$ 877 21485 27158 15030 -9274 -25801 -18080 3708 21010 25432 12501 -11212 -24149 -15259
212a5259J8838J3930J726j5156k1970p380J1461J7504J3769J333j5552j9056m253
$$ -15259 3579 17509 19235 4079 -17891 -25271 -13810 3694 17463 18796 3244 -15812 -20065
225b0065J0832J6086J1820j188j6033j5504p30J0496J4371R702m391j6948j3661
$$ -20065 -9233 6853 18673 17485 1452 -14052 -14782 -4286 10085 19787 15396 -1552 -15213
238a5213m27R570J3794P961n776j5241j0116J193R800J2771N821p534j3298p609
$$ -15213 -15640 -6070 7724 15685 9909 -5332 -15448 -14255 -4455 8316 14137 6603 -6695 -14304
252a4304K366J0453J2825M341q293j2010o295K312J0275J0046J314q624j0945
$$ -14304 -11938 -1485 11340 15681 7388 -4622 -10917 -8605 1670 11716 13030 4406 -6539
265f539m777L090J0103R027k76r203r627m373M598R788P683j448q020p795k338
$$ -6539 -11316 -8226 1877 10904 10628 1425 -8202 -12575 -7977 1811 9494 8046 26 -7769 -10107
280a0107N242R263N670k362p743p181j802N472Q856M696k737p672o610q39N875
$$ -10107 -4865 4398 10068 7706 -37 -7218 -9020 -3548 5308 10004 7267 -405 -7015 -7854 -1979
295a979O892L275l623p276m999L48N948O923K555l939o658n087Q83O397N478J622
$$ -1979 4913 8188 4565 -2711 -7710 -7362 -1414 5509 8064 4125 -2533 -7620 -6737 -340 5138 6760
311F760l628o344l343J840N781M461J016m325o259k650K183N399M487O43m263
$$ 6760 3132 -3212 -6555 -4715 1066 5527 6543 2218 -4041 -6691 -4508 891 5378 6021 1758
326A758n505j908K395N271L388o38m439m450j152K658M953L412j182m630m301
$$ 1758 -3747 -5655 -3260 2011 5399 4761 322 -4128 -5280 -2622 2331 5743 4561 -69 -4370
341d370p42K822M367K340j522l952l499j17L366M566J475j775m394k921M54L068
$$ -4370 -5112 -2290 2077 4417 2895 -1057 -4556 -4673 -1307 3259 4734 2959 -1435 -4356 -3902 -834
357h34L900J566k311l477k311O90L143K918O33k662l530j933J085L295K903M20
$$ -834 3066 4632 2321 -1156 -3467 -2777 366 3284 3917 1255 -2275 -4208 -3123 172 3075 3495
373C495k539l038j696J024L108K317K00k542k961o85J641K950K366n00k667k674
$$ 3495 956 -2082 -3778 -2754 354 2671 2871 329 -2632 -3317 -1676 1274 3640 3140 473 -2201
389b201q58J656K809J674p76k090k427K8J614K018J315p01k826k200k4K272K053
$$ -2201 -3059 -1403 1406 3080 2304 214 -2213 -2185 -571 1447 2762 2061 -765 -2965 -2989 -717 1336
406A336J199j112k347j130N2J583J950J050j576k486n33L32J884J744J090k170
$$ 1336 2535 1423 -924 -2054 -2002 -419 1531 2581 1005 -1481 -2014 -1682 202 1946 3036 866
422H66j860q46J23J759J795K56j672j549p45P45J788J478m30j904j386l49N40
$$ 866 -994 -1840 -1717 42 1837 2093 421 -1128 -1873 -1128 660 2138 1708 -196 -1582 -1931 -1391
439a391J866J459p29j444r52k63L45J912R86j072j145j003m35J104K333M51j004
$$ -1391 475 1934 1205 -239 -1191 -1454 -1109 803 1789 717 -428 -1431 -1866 -762 1571 2022 1018
456A018p27j270n13J345J742l43p52r75r80k95J816J425n94m49q75j463J72J658
$$ 1018 291 -979 -1492 -147 1595 1252 500 -475 -1455 -1750 66 1491 897 448 -427 -1890 -1718 -60
474f0J036l31o7j201r03N86J416O13j79r5j461o71Q85J022O19P9l71j535m81P83
$$ -60 976 645 578 -623 -1526 -940 476 1089 910 815 -646 -1317 -432 590 1209 1288 917 -618 -1099 -316
494c16O62J93M62j083j158k9O11Q12P38j40r38r68O4P48K40J114k96j122q3J03
$$ -316 346 539 1001 -82 -1240 -1269 -658 154 892 752 -186 -1154 -1090 -342 -102 1012 716 -406 -489 -386
514c86N62M48N29k68r14n13J55K30P85K64l90p85l36K0L57N38K11k75q24j90J7
$$ -386 176 624 1153 885 -29 -542 -387 -157 628 892 502 -283 -619 -599 -242 296 507 232 -592 -782 -765
535g65Q91K58L9k61n44k5j1O12N42n2o22j95m25M72N05L76l15j85o28o02P75M73
$$ -765 126 384 423 162 -382 -407 -418 194 736 684 62 -133 -558 -86 419 795 480 295 -333 -935 -160 313
557C13j09J06j99p95kQ01K24n12N13m36l28M9N84P7J1M1l01l57J72K88l53M40
$$ 313 204 310 111 -684 -686 115 339 -173 340 -96 -424 -375 209 286 297 338 37 -320 -148 140 -213 227
579B27R7o59l21O42M48l06M69n41m65k2O83j98K9N77o38l59k0J21P9L95J56l91
$$ 227 324 -335 -656 -14 434 128 597 56 -409 -431 252 54 83 660 22 -337 -357 -236 -157 238 394 3
601Cp35O37qk8O74r9o57j6O8M1j4P25k54o81J70Q6J9M47M44p00m96J94R0j55O30
$$ 3 -732 -95 -103 -131 543 444 -213 -229 -161 -120 -134 591 337 -344 -174 -88 -69 378 822 122 -374 -180 -90 -245 385
626C85M6m99J2j13l10L48L21j52k27j43k46J67L29M58j71l28L65j89m26M08L15
$$ 385 431 -68 -56 -169 -479 -131 190 38 -189 -332 -578 -411 -82 376 205 -123 242 53 -373 35 350
647C50l27J77j90m55K54M83j2j32N4O5q23M44n1j79M89j61k97l48P38r5J05J3
$$ 350 23 200 10 -445 -191 292 280 148 202 267 -556 -112 -163 -342 147 -14 -311 -659 79 -16 89 102
669A02m4j30Q2Q5Q9j05K63l12q8P5J66Q5K11l31q4k27J37J8J49q0j0j50k28M8
$$ 102 58 -72 10 95 184 79 342 30 -58 17 183 268 479 148 64 -163 -26 -8 141 61 51 -99 -327 -279
693b79N8J90q0J75lj58K75j65L40k57J04l5j34k65J38M13j37j11l5j54J72Q4L7
$$ -279 -221 -31 -111 64 61 -97 178 13 353 96 200 165 31 -234 -96 317 180 69 34 -120 52 136 173
716A73Mk56l4k31L32l8K44q9j10k23J56K5K87l52J24j74m0j9L77k0p1j26J72j71
$$ 173 177 -79 -113 -344 -12 -50 194 105 -5 -228 -72 -47 240 -112 12 -162 -202 -221 156 136 65 -61 111 -60
740f0O5j32N49m00l1k23K33n7R4R8j06l81K57Qj57N05j23q0r0m6q6L64k97J52
$$ -60 5 -127 422 22 -9 -232 1 -56 38 136 30 -351 -94 -86 -243 262 139 59 -31 -77 -163 201 -96 56
764E6J41O0k82k84J14N3K7J17P8k00J57n9j25K20R1r9K0p5rK00k04l7n9j09j0
$$ 56 197 257 -25 -309 -195 -142 -115 2 80 -120 37 -22 -147 73 164 65 85 10 1 201 -3 -40 -99 -208 -218
789b18J38L0J30k1o1j89J26MJ20R4j59q3K1OK21n8N6j09j8J19k01lO9L6j93K20
$$ -218 -80 -50 80 59 -2 -191 -65 -61 59 153 -6 -89 -68 -62 159 101 157 48 30 149 -52 -55 14 50 -143 77
815G7k09K29%K34l10pl61K53j12M4L7N5Q2j3P6mJ18jj44k1q4K6j09K44J46m02
$$ 77 -132 97 97 331 21 14 -347 -94 -206 -162 -125 -70 12 -1 75 71 189 188 44 23 -61 -35 -144 100 246 -156
841a56J58j21n7J84R8J7O1j91R1j18q3j73N73j73j08M1N8j41K67l05k65K41Q7
$$ -156 2 -119 -176 8 106 123 184 -7 84 -34 -117 -290 283 110 2 43 101 -40 227 -78 -343 -102 -15
864a5J51mk88L62Lm72K14J41P6k15J59j05j56J3K76k39L1K5J49k73K5J23J3j0
$$ -15 136 132 -156 206 209 -263 -49 92 168 -47 112 7 -149 -136 140 -99 -68 -43 106 -167 -142 -19 -6 -16
888a6K58l14Q4k7O4O8L5j23k39J4M1R8J03p0L7J9n6K02l71J96j14L99j20j36k72
$$ -16 242 -72 12 -15 49 117 152 29 -210 -196 -155 -57 46 -24 13 32 -24 178 -193 3 -111 288 168 32 -240
913b40N52o4k70o3L3k4J05l1j56J97k28K34l02K08P3j40K04l15J99l6K6J18j15
$$ -240 312 248 -22 -85 -52 -76 29 -2 -158 39 -189 45 -257 -49 24 -116 88 -227 -28 -64 -38 80 -35
936c5J26m2O9k77K03k6J74k36j74K57L9j16L8l0N9k64K75p5L5L1J84j21j21nq0
$$ -35 91 49 118 -159 44 18 192 -44 -218 39 78 -38 0 -30 29 -235 40 -35 0 31 215 94 -27 -32 -112
961a12K13N4M1k26K18L2l01prJ06M1Q0Kj8J62j50k9k51n2J88l6l1L6K4n2M51n32
$$ -112 101 155 196 -30 188 220 -81 -88 -97 9 50 130 132 114 276 126 97 -154 -206 -18 -54 -85 -49 -25 -77 374 -158
988a58J91j05K79j94j08K16m41O28j45l25PK58K2k46nJ06r4K54m16K34O0NJ78
$$ -158 33 -72 207 13 -95 121 -320 308 163 -162 -155 103 125 -121 -126 -20 -114 140 -276 -42 18 23 201
1011B01n1j15J05k83K80J04l87J25k9q2K1J27j05k3l9K31j1rj0l9j02J27J89k47
$$ 201 150 35 140 -143 137 241 -146 -21 -50 -132 -111 16 -89 -112 -151 80 69 60 50 11 -91 36 225 -22
1035b2J72l42J44O4J51kk02k00K03k17K34pJ96j94K9r1K06j67O3k8j94q8O6L82
$$ -22 150 -192 -48 16 167 165 -37 -237 -34 -251 -17 -24 172 -22 7 -84 122 -45 18 -10 -204 -292 -226 156
1059A56j43j3lq4m1J61K7L13l46o6K27m84M37l56L19k54K12J19n0r5m9j05R7J30
$$ 156 13 0 -3 -87 -128 33 60 373 27 -39 188 -296 141 -215 104 -150 62 181 131 36 -13 -118 -21 109
1083A09l00J60J42Qn10K67M09m09J00j07R2KK11k3m30O29m32J1m1J78L9J97j32
$$ 109 -191 -31 111 119 -391 -124 285 -124 -24 -131 -39 -37 174 151 -279 350 -82 -71 -112 66 105 302 170
1106A70l09J50j29K60k08j16K72K0j07J0O5K89k95j37k4j9Nk6L23j30j14J79j28
$$ 170 -139 11 -118 142 -66 -182 90 110 3 13 78 367 72 -65 -89 -108 -103 -129 194 64 -50 129 1
1129AN6k1n6jj47L18qk10n8J26J84j49k84L15R1n7K84k03k63J46j1J5p2mO5k37
$$ 1 57 36 -20 -21 -168 150 142 -68 -126 0 184 35 -249 66 157 100 384 181 -82 64 53 68 -4 -8 57 -180
1155a80O8O4M3K14l47J73J0P8o0k30L29n06M35P0Kj41j54K55k19m3J85Q8k19J74
$$ -180 -112 -48 -5 209 -138 35 45 123 63 -167 162 -344 91 161 163 22 -132 123 -96 -139 46 134 -85 89
1179H9Nk16j61M99l2l48J62J86k94L00k5n16K79m8K13q7M4K90l79j40J26r3J62
$$ 89 94 -122 -283 216 184 -164 -2 184 -110 190 165 -351 -72 -120 93 6 50 340 -39 -179 -53 -146 16
1202A6N8m6J88l04Q4O6o8p2jJ57j0j9k84K16P3j24l3k17M54j15r6J01j51J55k57
$$ 16 74 28 216 -88 -4 62 -6 -78 -79 78 68 49 -235 -19 54 -70 -103 -320 134 19 -77 24 -127 28 -229
1227b29M39j95Ll7k5o1J94O2l26J24l1M8p2j80K4L12j93K40Qr1N1k92L07l56L85
$$ -229 210 15 18 -19 -44 -105 89 151 -175 -51 -82 -34 -106 -286 -262 50 -143 97 105 14 65 -227 80 -276 109
1252A09j08KJ52j87J44j23K0j31J96o7j41L51j49k49N0L17q9p3n8p4J39o9K90
$$ 109 1 3 155 -32 112 -11 9 -122 74 7 -134 217 68 -181 -131 186 97 24 -34 -108 31 -38 252
1275B52l23k3J97J14j65K81n01K9J93j21K99q6k0o8O5J6k87K00q3J22n5j6j95
$$ 252 -71 -94 103 217 52 333 -168 -139 54 -67 232 146 126 58 123 139 -148 52 -31 91 36 20 -175
1298a75K63o8k8K72k68j97M19j63o1m8L75k92mj6r9k7l8K05l0N2L5j76N5J87j82
$$ -175 88 20 -8 264 -4 -201 218 55 -6 -54 321 29 25 9 -90 -117 -155 50 20 72 107 -69 -14 173 -9
1323ij60O7N6M1m3j53M63q7k06N4N3k75J95RJ42k74J50K54k82L6L6m1R2m4p8M9
$$ -9 -169 -102 -46 -5 -48 -201 262 175 -31 23 76 -199 -4 5 147 -127 23 277 -5 31 67 26 118 74 -4 45
1349D5K13j95P9j01j61o6J92J59q0l8P6l27K16P2J8l9k46K67K2p7M0j19J21k61
$$ 45 258 63 142 41 -120 -186 6 165 85 47 123 -204 12 84 102 63 -183 84 106 29 69 -50 71 -190
1373a90J09J80k6r3N4j38J27p9L6O7j31K26k9k17r1R2Q8K78j86n9k03L03j37j26
$$ -190 -81 99 73 -20 34 -104 23 -56 -20 47 -84 142 113 -104 -195 -103 -15 263 77 18 -185 118 -19 -145
1397a45J86Q4j03p4J51k6j30K5J80l38K88k82L89m34J51J28k86J34J12J41j24
$$ -145 41 125 22 -52 99 73 -57 -32 148 -190 98 -184 205 -229 -78 50 -236 -102 10 151 27
1418B7J7n8J76r9j04J03p0K5K86l44J49k7j5j54J53o1m3j46R3K47r4l93M60q0
$$ 27 44 -14 162 63 -41 62 -8 17 303 -41 108 81 66 -88 65 4 -39 -185 -92 155 61 -332 128 48
1442D8k17J36P9N6n9j43J55PK68k86n6l4M6j23L08j13J38l60j01L64l48M54k9
$$ 48 -169 -33 46 102 43 -100 55 62 330 44 -12 -46 0 -123 185 72 210 -150 -251 113 -235 219 190
1465A90m29J28K6J53j89J92n7J21j71L5l2J76m13L34k37J73l1p8M6J03l0J49q8
$$ 190 -239 -111 -85 68 -121 71 14 135 -36 -1 -33 143 -270 64 -173 0 -31 -109 -63 40 10 159 71
1488G1lk5k0J06j72N9rj31l8L38k13j72L01l5l14K66q3l0J8K02J09k47J29l0p2
$$ 71 68 43 23 129 -43 16 7 -124 -162 176 -37 -209 92 57 -257 9 -74 -104 -86 116 225 -22 107 77 5
1513Ej17J01K6P7m3o3r6O1J54P3k1l02p1j7P9J77m4J26k32J36Q9j56jr6L3r9L10
$$ 5 -112 -11 15 92 49 -14 -110 -49 105 178 157 -145 -216 -233 -154 23 -21 105 -127 9 98 -58 -59 -155 -122 -221 89
1540H9j96j59K50j14J77j65Q8J11k29L98j96o8k70K84J41j01Mk6q3J82L4k29K1
$$ 89 -107 -266 -16 -130 47 -118 -30 81 -148 250 54 -14 -284 0 141 40 44 18 -65 117 151 -78 -57
1563e7O0j11l1o7J80j36L00m01J43Q3J84k51J69l3q8R8j16J63q8l9K10j03j19
$$ -57 3 -108 -139 -206 -26 -162 138 -263 -120 -37 147 -104 65 32 -56 42 -74 89 1 -38 172 69 -50
1586e0n8J80j15J1QJ42P5k56P4M7m69L39J23Q6p5J49l06MM5k43K80K81m03N8Q1
$$ -50 -108 72 -43 -32 -24 118 193 -63 11 58 -411 -72 51 137 62 211 -95 -91 -46 -289 -9 272 -131 -73 8
1611Hk28J51k0Q0R7j2j89J73k47J04P1k68K64l49m6O65Mj36Qk37J77k45K70l71
$$ 8 -220 -69 -89 -9 88 76 -113 60 -187 -83 -12 -280 -16 -365 -411 254 258 122 130 -107 70 -175 95 -276
1635b76K74j82J29L90m33K07k54Q2K81r0k20K09j42J26k91J66k52M32j4n9p3k20
$$ -276 -2 -184 -55 335 -98 109 -145 -63 218 128 -92 117 -25 101 -190 -24 -276 156 142 83 10 -210
1657b10L53j05J87k63J36o8p3J33j76j36K28O3o7MMm8KJ23k04J23J93j10k54j3
$$ -210 143 38 225 -38 98 30 -43 90 -86 -222 6 69 2 6 10 -38 -36 87 -117 6 199 89 -165 -178
1681a78J51lJ07k40L20j62j1J20p0k1l18K06j2M0n9J71K8m7j22K14l42M49j31
$$ -178 -27 -30 77 -163 157 -5 -16 104 34 13 -305 -99 -111 -71 -130 41 69 22 -100 114 -228 221 90
1704I0j27O8j29L0K6K7No7J8o6L58j99Oqk1R3l74L74j95N4j56J04J09j21M5L4
$$ 90 -37 31 -98 -68 -42 -15 -10 -77 -59 -125 233 34 40 32 11 104 -270 104 -91 -37 -193 -89 20 -101 -56 -22
1730b2j9K8j69L43k15m9L35j88j63j9K90k36j47J04O8K17p0k39M33l2l16M4P3
$$ -22 -41 -13 -182 161 -54 -103 232 44 -119 -138 152 -84 -231 -127 -59 158 88 -151 282 250 -66 -22 51
1753E1K51o6m18j46N28j47j57K81k38jK29k59OPJ00J55j24j36N9P8J4l44M31l30
$$ 51 302 236 -182 -328 200 53 -104 177 -61 -62 167 -92 -86 -79 21 176 52 -84 -25 53 67 -277 154 -176
1777a76P1j4N2J2L3o2J30J3k01K09J03l4J5k49j08P7J06mk8R2j11k53K77n2J97
$$ -176 -105 -119 -67 -55 -22 -84 46 59 -142 67 170 136 151 -98 -206 -129 -23 -27 -55 37 -74 -327 -50 -102 95
1802I5k73J56L0K10j53j08J23o8M2j2p9L6n6J59l48K73P9k27J92jo2n3J52m8k07
$$ 95 -178 -22 8 218 65 -43 80 12 54 42 -37 -1 -57 102 -246 27 106 -121 71 70 8 -45 107 59 -148
1827a48J32k5J05K38o8k64K5j1j57M4P8R3j92pK61j53K5J7k09Q1j1Q5J53j68L33
$$ -148 -16 -41 64 302 234 -30 -5 -16 -173 -129 -51 42 -150 -157 104 -49 -24 -7 -216 -135 -146 -61 92 -76 257
1852B57k14k60q0L3M53m2j3j28j1j40L22Mp1J9j19j35l0J0J46k22J72J50j69K43
$$ 257 43 -217 -297 -264 189 147 134 6 -5 -145 177 181 110 129 10 -125 -155 -145 1 -221 -49 101 -68 175
1876A75m09K1J71J43r8j16l6K62k70K57j71J10r0j6Q7n6M6kR0k11k9K97k70j00
$$ 175 -234 -213 -42 101 3 -113 -149 113 -157 100 -71 39 -51 -67 20 -36 10 8 98 -113 -142 155 -115 -215
1900b15K34j82K27NJ13r0k5j90j7J20j02J66K8j76p5L61l83K20q2j57K33M5J4
$$ -215 19 -163 64 69 182 92 67 -123 -140 -20 -122 44 72 -104 -179 182 -201 19 -63 -220 13 58 72
1923G2k53K40k0K74m16N7j4K30k90J01p4OJ46j02O2O8qp9J15mj51O8N6l5r4Q3
$$ 72 -181 59 39 313 -103 -46 -60 170 -120 -19 -93 -87 59 -43 19 87 79 0 115 111 -40 28 84 49 -45 38
1949C8q8j28J75j40L51l09J5J03o5%r3K36j43K5P6J22l63L69j53m0J31j11l00
$$ 38 -50 -178 -3 -143 208 -101 -86 17 -48 -48 -141 95 -48 -23 53 175 -188 181 28 -12 119 8 -292
1972b92K97Nj32J76j30j9K50j68Q2l46P6K69qn6l9O1J36p2M7M2k96K87j28K04
$$ -292 5 10 -122 54 -76 -95 155 -13 69 -277 -201 68 60 4 -35 26 162 90 137 179 -117 170 42 246
1996B46r1r6l29N33n18l3L30j98K32j26K7j88K11k0L7m6j9J27p1l9k8L33j31K0
$$ 246 155 59 -270 263 -255 -288 42 -156 76 -50 -23 -211 0 -20 17 -29 -48 79 8 -31 -59 274 143 163
2020A63r9j44r6R3K6J74j13l27N5J05K57n5k37K94j85R8j73M7P8J22p6j34Ol5
$$ 163 64 -80 -176 -83 -57 117 4 -323 -268 -163 94 39 -198 96 -89 9 -164 -117 -39 83 7 -127 -121 -156
2044a56Q6Oj02L9j0J94m15M52l8n4j35K59Q5j61J12m51K71K0j56N7O7J23k31J38
$$ -156 -70 -64 -166 -127 -137 57 -358 94 56 2 -133 126 211 50 162 -289 -18 2 -154 -97 -30 93 -138 0
2068@j38L6J29K67l26N0O6J75l27O5j66K18O8j91R4j2L02n47K1J42J10K07l10
$$ 0 -138 -102 27 294 -32 18 84 259 -68 -3 -169 49 117 -74 20 8 310 -237 -216 -74 36 243 -67
2091f7m1J16j20R0j7J07l0oj87J40q7jJ51p0K2K4L58m39J05L2R7j32j20Q1J60
$$ -67 -108 8 -112 -22 -39 68 38 32 -155 -15 -102 -103 48 -22 0 24 382 -57 48 80 177 45 -75 6 166
2116A66j39k6L40k62M4K3p9K15m97K53N5q4J75k81L0j24J56j28r1K87lk5j23K10
$$ 166 27 1 341 79 123 146 67 282 -215 38 93 9 184 -97 -67 -191 -35 -163 -254 33 30 5 -118 92
2140I2p2J03jj44p7J21O9j20r1Q9J38k13j55M15l21K65pk40K05j28P2J0j03k0
$$ 92 20 123 122 -22 -99 22 91 -29 -120 -31 107 -106 -261 154 -167 98 91 -149 56 -72 0 10 -93 -113
2164a13J25n3n4N4M1k70K19q2L47j03j01J33L38n09p3N8L6M8r0L4m9K01n4O4O2
$$ -113 12 -41 -95 -41 0 -270 -51 -133 214 111 10 143 481 -28 -101 -43 -7 41 -49 -15 -64 137 83 147 209
2189B09k51N0K05n05L77j25K0j71L54j10m05K70PJ38O4k06j9J67p4J08k38L38
$$ 209 -42 8 213 -292 85 -40 -20 -191 163 53 -352 -82 -75 63 127 -79 -98 69 -5 103 -135 203
2211B03k79k5j02J32m7L36j62k7q8J03J39l64L68J49n29K74n6P2l09J03K03o9
$$ 203 -76 -101 -203 -71 -118 218 56 29 -59 44 183 -181 187 336 -193 81 25 97 -212 -109 94 25
2233B5j41J27J90J22j80n08M25j17J69l79N48k03l21L44j40k18R3K1M35l45J18
$$ 25 -116 11 201 323 143 -365 60 -57 112 -267 281 78 -243 101 -39 -257 -164 -143 292 -53 65
2254F5j56J14j84o2k7J63J49r3R7j98j85K87o2L04j39O4Ln78N56P4O1k51J7k62
$$ 65 -91 23 -161 -223 -250 -87 62 -31 66 -132 -317 -30 -92 212 73 137 140 -438 118 192 253 2 19 -243
2278b43M8K63j90j41M47m55K00K20k12J5m8J38M9l46J20rJ43m3J57J9r1k45L05
$$ -243 -195 68 -122 -263 184 -271 -71 149 -63 -48 -96 42 91 -255 -135 -144 -1 -44 113 132 41 -204 101
2301A01j57R9L8l13K94l9j10J07k08J8L06q9Mk3L9q5j58oJ14J68p2k23L9M23k17
$$ 101 -56 43 81 -232 62 23 -87 20 -188 -170 136 47 51 28 67 -18 -176 -182 -68 100 28 -195 -156 267 50
2326E0J53n4j34j74p4M14k63K9J78o9j59P9o7M2l6m3K92j10J2o7J62k54J12K81
$$ 50 203 149 15 -159 -233 181 -82 -53 125 56 -103 -24 -91 -49 -85 -128 164 54 66 -1 161 -93 19 300
2350C00O6j83j08j6Q9J7L3j20k07LK16j52K56j18q6J80q6l1j11P0Q8K08k66pJ16
$$ 300 366 183 75 59 148 165 198 78 -129 -126 90 -62 194 76 -10 170 84 53 -58 12 100 308 42 35 151
2375A51l13L8L6J03O2k12K78k51N4K36J8l7j51K21l69M03j43p9K74k98J76k38
$$ 151 -162 -124 -88 15 77 -135 143 -108 -54 182 200 163 12 233 -136 267 124 45 319 21 197 -41
2397d1k5n2N0J30k81N09m31j9M5J06q1J38j03K51j97k0J36J79k55q0K79k98N2
$$ -41 -66 -118 -68 62 -219 290 -141 -160 -115 -9 -90 48 -55 196 -1 -21 115 294 39 -41 238 -60 -8
2420hj43J86m8J08j05n5P9m2O1m5o3L35l76m4J78q5M17k31kj05m1l4R8l8J4k97
$$ -8 -151 35 -13 95 -10 -65 14 -28 33 -12 -75 260 -116 -160 18 -67 350 119 117 12 -29 -63 35 -3 11 -286
2446b86L48j17j83N52k38j13j00N2P4J58k69J88P4r0j15M5r8J91J10Lj69mQ4k55
$$ -286 62 -55 -238 314 76 -37 -137 -85 -11 147 -122 66 140 50 -65 -20 -118 73 183 186 17 13 97 -158
2470a58J58o8K42k39L8J15l2j37M8k10J17K31M4k16R1j3J50j40K5R3m9J21m10
$$ -158 0 -68 174 -65 -27 88 56 -81 -33 -243 -126 105 149 -67 24 11 161 21 46 139 90 211 -199
2493a99L85k10j45K04m2O5m2l01J54L3J33o3K01l45J94N0j82K12k6p8l5K33k36
$$ -199 186 -24 -169 35 -7 58 16 -285 -131 -98 35 -28 173 -172 22 72 -110 102 76 -2 -37 196 -40
2516d0K14j06k04J63L2o0k18K87Q4k71J21j8o0J86j01P9k5J10K25l06k18q8L41
$$ -40 174 68 -136 27 59 -1 -219 68 152 -119 2 -16 -76 110 9 88 63 173 398 92 -126 -214 127
2539A27j80j1K71k38j11rk9L29p9m9j91R9lJ5J26k84L81j98K12m18L97k50J57
$$ 127 -53 -64 207 -31 -142 -151 -180 149 70 21 -170 -71 -74 -59 67 -217 164 -34 178 -240 157 -93 64
2562F4j69L7J93k09J10N4k61O2j64K05K34k10J41k40J93O7k35K59r1j20nj66L15
$$ 64 -105 -68 125 -84 26 80 -181 -119 -283 -78 156 -54 87 -153 40 107 -128 131 40 -80 -85 -251 64
2585F4O4k38K1l7L48j72KK2kJ67k33j07K13j61J19o7k02J77J2J20J40l60Q2n7
$$ 64 128 -110 -89 -126 222 50 52 74 72 239 6 -101 112 -49 70 3 -199 -22 -10 110 250 -110 -28 -85
2609h5K43k02K09k66K73j27k64J54k23K72j64J86J64j26k75J73N9K3o5J46lp0
$$ -85 158 -44 165 -101 172 45 -219 -65 -288 -16 -180 6 170 44 -231 -58 1 24 -41 105 102 32
2631C2m1kP1m7K41m07L46L9k60R6j71m2L34j52J25n26M20k69O1L34l42J12j73
$$ 32 -9 -11 60 13 254 -153 193 232 -28 68 -103 -145 189 37 162 -364 56 -213 -152 182 -160 -48 -221
2654b21K25j20O4M5j04j17L63l05P4l3K23j80J06MM1q4K80k48K22k16j67K47l0
$$ -221 4 -116 -52 -7 -111 -228 135 -170 -96 -129 94 -86 20 24 65 -19 261 13 235 19 -148 99 69
2677F9k54K96oLo8L2j97J60Pp7J2K47k71k71L63R6j16k7kQ5k49K11K40k18J68
$$ 69 -185 111 105 108 40 72 -125 35 42 -35 -23 224 -47 -318 45 141 25 -2 -4 81 -168 43 283 65 233
2702B33j73k24J8N2P4k1p7K54l31L53j22n5k05M38j48m44K71j1J31r3M3K5K44
$$ 233 60 -164 -146 -94 -20 -41 -118 136 -195 158 36 -19 -224 214 66 -378 -107 -118 13 -80 -37 -12 232
2725B32m49M18j43k1j35K80l38k49M50O8j92J62J43k09J1o6J67k65M00m53N5M4
$$ 232 -217 201 58 37 -98 182 -156 -405 45 113 -79 83 226 17 28 -38 129 -136 264 -189 -134 -90
2747i0J52JL3n3J4M3OM6k42J30j16q1n1K76l60K55J11k7l5n6j0J40j92J56J85
$$ -90 62 63 96 43 57 100 106 152 -90 40 -76 -157 -208 68 -292 -37 74 47 12 -44 -54 86 -106 50 235
2772B35k89k07M75l17K55l36J02J43m2j62K59m24N13j59k53M30o25L53R8R2L3
$$ 235 -54 -261 214 -103 152 -184 -82 61 19 -143 116 -308 205 46 -207 223 -402 -49 49 141 174
2793A74p1k9m8L2j03J20k52J75J6K0j03J77j09K9nj70K27k64J81O5j99P5J63Q3
$$ 174 103 74 26 58 -45 75 -177 -2 14 34 -69 108 -1 28 23 -147 80 -184 -3 62 -137 -62 101 184
2817A84P2m7r0p7l6k84r2L81j40L02k54j23J93J5K05l8k47J06O0k3q2q7K8k1J42
$$ 184 256 209 119 42 6 -278 -370 11 -129 173 -81 -204 -11 4 209 171 -76 30 90 67 -15 -102 -74 -95 47
2842D7LK5M2k99K24qo4J53m78P5O3R9J46k52J17L26k82Q9O8J40k90j70J73l1K42
$$ 47 50 75 117 -182 42 34 -30 123 -355 -280 -217 -118 28 -224 -107 219 -63 26 94 234 -56 -226 -53 -84 158
2867A58k40l7J21Nj11k15J98K00j33j65K33Q4k48M5J30j23n8J90j44N6Q2J11j11
$$ 158 -82 -119 2 7 -104 -319 -121 79 -54 -219 14 98 -150 -105 25 -98 -156 34 -110 -54 28 139 28
2890B8J35o6k72J57j03J85j41J13k38J38M2M8M0k9k81L20j38m0J10l55L46n9R5
$$ 28 163 97 -175 -18 -121 64 -77 36 -202 -64 -22 26 66 37 -244 76 -62 -102 8 -347 -1 -60 35
2913C5j03J67k12J70p5K80k17k5O4j24k82L45N5q2j6j3j1K39l18L4J98q7R6j08
$$ 35 -68 99 -113 57 -18 262 45 20 84 -40 -322 23 78 -4 -20 -33 -44 195 -123 -89 109 22 118 10
2937A0j23M5j59K55j78K65J79l60J60l6L8k56J23K6J54j10l8J33k17K56l2r2P2
$$ 10 -113 -68 -227 28 -150 115 294 -66 94 58 96 -160 -37 -11 143 33 -5 128 -89 167 135 43 115
2960A15J27l20Ol8k18K83m6K66k15lP7k91K63j57J22J93l14j54K02K23k38M7q3
$$ 115 242 -78 -72 -110 -328 -45 -91 175 -40 -43 34 -257 6 -151 -29 164 -150 -304 -102 121 -117 -70 -153
2983a53L4J28J29Ol97K78J4j66m2K38N3j28J09k72L76l75R0L3L8J03k39J46p1
$$ -153 -119 9 138 144 -253 25 39 -127 -169 69 122 -6 103 -169 207 -168 -78 -45 -7 96 -143 3 -68
3006f8o9J59J93j87Kj79J59K8M6L0k21O5O7J32k79n9M99l79j32J84j5j87J34j78
$$ -68 -137 22 215 28 30 -149 10 38 84 114 -107 -42 25 157 -122 -181 318 -61 -193 -9 -24 -211 -77 -255
3030b55K84j28R5N0J55k71l1K52j3k20J83%l70J20L67k49P5J11n0j59j21K49j98
$$ -255 29 -99 -4 46 201 -70 -101 151 138 -82 101 101 -269 -149 218 -31 44 155 105 -54 -175 74 -124
3053a24L22q7k68K38j16n7m5K69J11k78N3l5J30k10J40n1p7pK49k13j14N4L9o4
$$ -124 198 111 -157 81 -35 -92 -137 132 243 -35 18 -17 113 -97 43 -8 -85 -92 157 -56 -170 -116 -77 -141
3077a41L44k06J6j03J08j07k9P5K0J39K0j41k12K20r0J41l5L76j86j87q9j6J15
$$ -141 203 -3 13 -90 18 -89 -118 -43 -23 116 136 -5 -217 3 -87 54 19 395 209 22 -67 -83 32
3100C2j48J40J10J9j78J38l16K22K4jL4k4k2jm8o4J78J08k14Q0j6O1k08r7N7o
$$ 32 -116 24 134 153 -25 113 -203 19 43 42 76 52 30 29 -19 -83 95 203 -11 69 53 114 -94 -191 -134 -140
3126a40K23Qj02j30K18r8k26J13L89j96rk09J78K26j41j3p4k9k20J78L1J9K33
$$ -140 83 91 -11 -141 77 -21 -247 -134 255 59 50 -159 19 245 104 91 17 -12 -232 -54 -23 -4 229
3149B29j91j7O0j97L75m43L2L15k26J29k7m3j55K93n1Kj56K66k1j24k27J52J46
$$ 229 38 21 81 -116 259 -184 -152 163 -63 66 39 -4 -159 134 83 85 -71 195 174 50 -177 -25 121
3172A21j77K04j64m7K08k27J40l3K40k24o7j3p3N7O3O1k7l0j09J9N7J5p1J78k37
$$ 121 -56 148 -16 -63 145 -82 58 25 265 41 -26 -39 -112 -55 8 69 42 12 -97 -78 -21 -6 -77 101 -136
3197a36k6K87j3p9j4J83p6N3l51J30j0j15K71k44K90k53K40l9j50L2m1K18k06
$$ -136 -162 125 112 33 19 202 126 179 -172 -42 -52 -167 104 -140 150 -103 137 98 -52 -20 -61 157 -49
3220d9J81k01K09r3j20n5K78Pp0l71L89k92J74j3k20L29n6n6k6M8q6K64n7K1n4
$$ -49 132 -69 140 47 -73 -128 150 157 87 -284 105 -187 -13 -26 -246 83 27 -29 -55 -7 -93 171 114 135 81
3245H1k41j68M43k43J95l1N0l26M39O9k99r0J20M5m0j73J07Q0o3J82m02m6M31
$$ 81 -160 -328 115 -128 67 36 86 -240 199 268 -31 -121 -1 44 4 -169 -62 18 -45 137 -265 -311 120
3268A20j73k11K28M9l0K76k40k29P8K73r6l4P3j20K7K28p4q4k16N6K47j04J47
$$ 120 -53 -264 -36 13 -17 259 19 -210 -132 141 45 11 84 -36 -9 219 145 61 -155 -99 148 44 191
3291A91k49M7P5N2o8k5j24Q7J54k32j25K13o8k47K42K88k04Q8j1J47J11m00K80
$$ 191 -58 -11 64 116 48 23 -101 -14 140 -92 -217 -4 -72 -319 -77 211 7 95 84 231 342 -58 222
3314B22j84J9k94M14j17j7k86J87K21k87J08R5L3k27M27n16J53M6o4J02j72N65
$$ 222 38 57 -237 177 60 43 -243 -56 165 -122 -14 81 114 -113 314 -202 -49 -3 -67 35 -137 428
3336D28m93k33L04j25P9J1j87M40l21L08j30j47M1L0J2r3K27l08L26j97j15Q1
$$ 428 -65 -298 6 -119 -40 -29 -216 224 -97 211 81 -66 -25 5 17 -76 151 -157 169 -28 -143 -62
3358f2J13j23NK97m21K47N2q8k2N7q9J22K8k4j01j10J21K60k81OP6o0r1o2K43
$$ -62 51 -72 -67 230 -191 56 108 20 -2 55 -34 88 116 92 -9 -119 2 262 -19 -13 63 3 -88 -150 93
3383I3j00J77k83P0J65j8n1N7k15J72mj10J24j53K01k93L4K30R9k77J44r7j14
$$ 93 -7 170 -113 -43 122 104 53 110 -105 67 63 -47 77 -76 125 -168 -134 96 195 -82 62 -35 -149
3406a49P5P9J5N9r8j14N14l32p1mJ37j61J16n1j22J31M8l50K52J03j04j02J42
$$ -149 -74 5 20 79 -19 -133 381 49 -22 -26 111 -50 66 15 -107 24 72 -278 -26 77 -27 -129 13
3429A3j43J69J3k50K72jk23O0o0J94p5J7L8j34R3N7r5K4M5P3l29J26L0J95K2j60
$$ 13 -130 39 52 -198 74 73 -150 -90 -150 44 -31 -14 24 -110 -17 40 -55 -31 14 87 -242 -116 -86 109 131 -29
3455b9J22j88J30K1K5r3PJ37k00r9J39K34k61J49j00QL6J0l08K54k1q5J60j3m5
$$ -29 93 -95 35 56 81 -12 -5 132 -68 -167 -28 206 -55 94 -6 2 38 48 -260 -6 -27 -112 48 35 -10
3480a0K24j89m5l15M53j14r3J5K06j11n4m4l1mJ18l0K16k34R7QJ47j5r8J31r4
$$ -10 214 25 -20 -335 118 4 -89 -74 132 21 -33 -77 -108 -112 6 -24 192 -42 55 63 210 195 97 228 134
3505A34K05l49N1J53j59PQ3j12k0k6j47n5K26l5J49k32J19J03J6k76J89l28K06
$$ 134 339 -10 41 194 35 42 125 13 -7 -33 -180 -235 -9 -44 105 -127 -8 95 111 -165 24 -304 -98
3528i8k2O1pL4n1l32L33J03r4K9M9j50K16k57K51n8l3K16o2R4l15Q1M8J3K7K4
$$ -98 -120 -59 -66 -32 -83 -415 -82 21 -73 -44 5 -145 71 -186 65 7 -26 190 128 222 -93 -12 36 49 76 100
3554A00j54r0J19J64l48M46j00j28O3k03J32m7LQ3J6o8k5J66J38l73J91j10J89
$$ 100 -54 -144 -25 139 -209 237 137 9 72 -131 1 -46 -43 40 56 -12 -37 129 267 -106 85 -25 164
3577A64r3J30l70K3K09r4K0ll1KJ51k38J24NNJ18n1L3k5k42M91l51j17K02K20
$$ 164 71 201 -169 -146 63 -31 -11 -14 -45 -43 108 -130 -6 -1 4 122 71 104 79 -163 328 -23 -140 62 282
3602B82l60J71J19J0k32M9J68k18q4K03q9m6K18l01m4K28j81n0K17l35L48J24
$$ 282 -78 93 212 222 -10 39 207 -11 -95 108 19 -27 191 -110 -154 74 -107 -157 60 -275 73 197
3624A97q8l73M11n7j2r6K5j24K08L3l27J76P1J27l07J61J7j44jj46J83j0j91K82
$$ 197 109 -264 147 90 78 -18 7 -117 91 124 -203 -27 44 171 -136 25 42 -102 -103 -249 -66 -76 -267 15
3648A5j04R8J47k72R1J77k68J96r6j57o8M66k27p2J76m14L75k03K31j07n8K72
$$ 15 -89 9 156 -116 -25 152 -116 80 -16 -173 -241 225 -2 -74 102 -312 63 -140 91 -16 -74 198
3670A98l03o5J10K94j99K3n8Q4J8l03L93k29K13j86J01j03O9P8j41Q0n4k63J22
$$ 198 -105 -170 -60 234 35 58 0 84 102 -201 192 -37 176 -10 91 -12 57 135 -6 74 20 -243 -121
3693a21J55J88j90r1%P5k16n1N24K6l66R4Q3k48K01q8J74k89Q8j7jK43k83L35
$$ -121 34 222 32 -59 -59 16 -200 -251 273 299 -67 27 110 -138 63 -25 149 -140 -52 -69 -70 173 -110 225
3717B25m54LQ6K38L8j36J88k81N5J01j16K62l92P4n2j3K81j47j10L85l69J28J0
$$ 225 -229 -226 -140 98 136 0 188 -93 -38 63 -53 209 -183 -109 -161 -174 107 -40 -150 235 -134 -6 4
3740DR4J9N7m13M52l42R4K70m13M9pj04K95j78r3J98j62J69K6M7j10K05j89o4
$$ 4 98 117 174 -239 213 -129 -35 235 -178 -129 -136 -240 55 -123 -216 -18 -180 -11 15 62 -48 157 -32 -96
3764i6Q1R4n9J43j88j73R5K70j66l4O9J57J39m05J18j1N5q7j56L55p4j31j03K19
$$ -96 -15 79 20 163 -25 -198 -103 167 1 -33 36 193 332 -73 45 34 89 2 -154 201 127 -4 -107 112
3788A12Nk47N07l66P5k53J85j52j30M17k49L13j24j95K34l16K35j50PJ97k11o7
$$ 112 117 -130 377 11 86 -167 18 -134 -264 153 -96 217 93 -102 132 -184 51 -99 -92 105 -106 -173
3810a73K18n0jK5M9o6K7J06k92M3J25n2mK36k52nO6k0o1K01j71J23M2k30J69k57
$$ -173 45 -5 -6 19 68 2 29 135 -157 -114 11 -41 -45 191 -61 -66 0 -20 -81 120 -51 72 114 -116 53 -204
3836b04L20R3o4j97J90j74j41L46J31l48M6qj56n6J40M7q8K19q3j97L86j45P3
$$ -204 116 209 145 -52 138 -36 -177 169 300 -48 -2 -10 -166 -222 -82 -35 -123 96 13 -184 202 57 130
3859A30k37J32P2r9j27J18j23p7L43k69J27N5J24k95M0K4M10l19j20L93l25K9
$$ 130 -107 25 97 -2 -129 -11 -134 -211 132 -137 -10 45 169 -126 -86 -62 348 29 -91 302 -23 6
3881Fp4O2j4j7j8R1L9m9l35M31j10j46J11P1j16L4K39k27K0N0j53J78J2j87j26
$$ 6 -68 -6 -20 -37 -55 36 75 26 -309 122 12 -134 -23 48 -68 -34 205 -22 -2 48 -105 73 85 -102 -228
3906b28K86R9j16N7j58k9j6L19k49J59k60J21q4qJ96OJ82j38N6k43K15n2j63J21
$$ -228 58 157 41 98 -60 -89 -105 214 -35 124 -136 -15 -99 -107 89 95 277 139 195 -48 167 115 -48 73
3930G3j02J51k31K9J56p2O2n2j06J2k04J97J50j58L38j89P1o1p0J0L0R6r0j26
$$ 73 -29 122 -109 -80 76 4 66 14 -92 -80 -284 -87 63 -95 243 54 125 64 -6 4 34 130 40 -86
3954h6N0J08o2J00k79K22j97J04J08j82K55k47j87K19l7K97k27p5J57lj34J04
$$ -86 -36 72 10 110 -169 53 -144 -40 68 -114 141 -106 -293 -74 -111 186 -41 -116 41 38 -96 8
3976HP4Qq2j25K32j85j29K41l0M5J6r9Q3m4Q3k75K9J9J58j21J00j57J08k2K6k3
$$ 8 82 90 8 -117 115 -70 -199 42 12 57 73 -26 57 13 96 -179 -150 -131 27 -94 6 -151 -43 -65 -39 -62
4002f2j2J74k28K4P4J1J0R8L6k38K48m5j51J9J04j33J11J21o1k33K18J03l79K40
$$ -62 -74 100 -128 -104 -30 -19 -9 89 125 -113 135 90 -61 -42 62 -71 40 161 100 -133 85 188 -191 49
4026D9kn2j60K22j65Q9n5K2J72m0j3Q7j24P6J29j61j50J89k43K37o8K20j95k6
$$ 49 47 -5 -165 57 -108 -19 -74 -52 120 80 67 154 30 106 235 74 -76 113 -130 107 39 259 64 38
4050C8K28j98j75J73j86K96j14kj0j04m5K8J78k4J14l01O3m9M3K38k36O6J66N3
$$ 38 266 68 -107 66 -120 176 62 60 50 -54 -99 -71 107 83 197 -104 -41 -90 -47 191 -45 21 187 240
4074B40j09l19J25k2J57J0o9J55M1j19j46p3l4J57m0N6m4R3J78k33O0k89K39J25
$$ 240 131 -188 -63 -85 72 82 13 168 209 90 -56 -129 -163 -6 -46 10 -34 59 237 4 64 -225 14 139
4098A39q0O0k79q0L10m9P0Pm4l2n2l9Q8K26k62J89j68K33j21J2j08K2Pk8l5j02
$$ 139 59 119 -160 -240 70 21 91 98 54 22 -30 -69 19 245 -17 172 4 237 116 128 20 42 49 21 -14 -116
4124a16J46J98j38k94K28k05K83or2j45J87j11O5m1M0L09m34j40J83J64rK2q6
$$ -116 30 228 90 -204 24 -181 102 96 4 -141 46 -65 0 -41 -1 308 -126 -266 -83 81 72 94 8
4147Hl09M48j33l9j38L45j60l9j05J9P1K62m08J07m0J47r0P3o6J56j1n3P0O3k48
$$ 8 -301 147 14 -25 -163 182 22 -17 -122 -103 -32 230 -178 -71 -111 36 -54 19 -47 109 98 45 115 178 -70
4172g0m7J97Q2m19ML46k42J46O5J52J57n07M5J36j66J78J3k60L71l60K19j13Q7
$$ -70 -117 80 162 -257 -253 93 -149 -3 62 214 371 -136 -91 45 -121 57 70 -190 181 -179 40 -73 14
4195A4Q9j97J97l26J11J07J76j73j25q7O7J15J13po3j12R7m6j47L60j45R6n4k67
$$ 14 103 -94 103 -223 -112 -5 171 -2 -127 -214 -147 -32 81 74 11 -101 -4 -50 -197 163 18 114 60 -207
4219b07L77k17n4K37j48j65N27k78j09P4k82M59m2j12j07lJ33l4p7n9J2L25l21
$$ -207 170 -47 -101 136 -12 -177 350 72 -37 37 -245 214 172 60 -47 -50 83 49 -28 -87 -75 250 -71
4242g1O9J36l31J95L3j15K91j18j56O5L2O1j19M9j76Q3k9O7M1l5k61J50j18J30
$$ -71 -2 134 -197 -2 31 -84 207 89 -67 -2 30 91 -28 21 -155 -72 -101 -34 7 -28 -289 -139 -257 -127
4266a27j45K75J60k14k3J30j32k5J45j38R5M1n6K62l47p2K29PJ77n6j40J33J47
$$ -127 -272 3 163 -51 -74 56 -76 -101 44 -94 1 42 -14 248 -99 -171 58 65 242 186 46 179 326
4289C26l98P8k27J12r1K80K60m57J04J22q6j14j07l7K08J1J22l7j94KK22o9j15
$$ 326 -72 6 -221 -109 -200 80 340 -117 -13 109 23 -91 -198 -235 -27 -16 106 69 -125 -123 99 30 -85
4312h5J02M8j09k02L78j61L3j75J40l6J45j03Q2m3o0J07N9j90K32q1j69K40l18
$$ -85 17 65 -44 -246 132 -29 4 -171 -31 -67 78 -25 57 14 -46 61 120 -70 162 81 -88 152 -166
4335a66L11p4k8j23n1M7K03j19j61j19L07j73J46p9m0j95L93j99K56j77m3J88
$$ -166 145 71 43 -80 -131 -84 119 0 -161 -280 27 -146 0 -79 -119 -314 79 -120 136 -41 -84 104
4357A04N7k00Jq3K74m88M55j68kN9k60J18OQ3M0j50J15P6j89M8j65K01K30k00
$$ 104 161 -39 -38 -121 153 -335 120 -48 -50 9 -251 -133 -127 -44 -4 -154 -39 37 -152 -104 -269 -68 162 -38
4381c8J56l6j61l5j19M5o3J85K45j66J08J47l41K54j32K82l70L3j98L62j55O3
$$ -38 118 82 -79 -114 -233 -188 -251 -66 179 13 121 268 -73 181 49 331 -39 -6 -204 158 3 66
4403F6L5J80l29P2N8R7l32p6K83J45q9j76j00L8j1K96Kj62m7J59l45L37k08JR0
$$ 66 101 281 -48 24 82 179 -153 -229 54 199 110 -66 -166 -128 -139 157 159 -3 -50 109 -236 101 -107 -106 -16
4428a6o6J74ml3k79M51Nl65j02L37k48J84j81K14k52M21k44j34K66l92J92Q1O8
$$ -16 -82 92 88 55 -224 227 232 -133 -235 102 -146 38 -143 71 -181 240 -4 -138 128 -264 -72 9 77
4451G7J30k91k80M04RJ86j47k75K47J5j3L6l8k6J30p3k00j8K5L6L2J00MK17j41
$$ 77 207 -84 -364 40 49 235 88 -187 60 75 62 98 60 34 164 91 -109 -127 -102 -66 -34 66 70 287 146
4476A46m9k34K40J8j97N4J7o4k63M60j53R7k8K2j0k15M2R3k42K89p8k4K9O5J13
$$ 146 97 -137 103 121 -76 -22 -5 -69 -332 128 -25 72 44 66 56 -159 -117 -24 -266 23 -55 -79 -50 15 128
4501A28r7J14j90l38L96lp4J12L9n3Pr0r5K89k78L91k15j42l1K58q7J62R1n36
$$ 128 31 145 -45 -383 13 10 -64 48 87 34 41 -49 -144 145 -133 258 43 -99 -130 128 41 203 294 -242
4525b42L42j79K30q3j10PJ20j02P1Q5k10J40q8J71j40o4J09J40j47j8J01j65j02
$$ -242 100 -79 151 68 -42 -35 85 -17 54 139 -71 69 -19 152 12 -52 57 197 50 32 133 -32 -134
4548a34J66q1K7k5M1j31J33k19K70j07MM1l4p2n7M26l34J32k09K55j14K1k8k2
$$ -134 32 -49 -22 -47 -6 -137 -4 -223 47 -60 -56 -15 -49 -121 -178 248 -86 46 -163 92 -22 -1 -29 -51
4572e1k5L84m49M3J15n1M4M0n5j1J86O0j69qJ0j68p6P6K41k62O5j48N6j7K13j1
$$ -51 -76 308 -141 -98 17 -34 10 50 -5 -16 170 230 61 53 63 -105 -181 -105 136 -126 -61 -209 -153 -170 43 32
4598C2j33j18J94j75L12o4N5K28l20j97J48K8l0K6k69M51l03J33J55m7l08L3L41
$$ 32 -101 -219 -25 -200 112 48 103 331 11 -186 -38 -10 -40 -14 -283 168 -135 -2 153 106 -202 -169 172
4621A72j89j17J14J14j22r1K19k00J18J42n4j64J09j95L64l05R5K21j11J39l5
$$ 172 -17 -134 -20 94 -28 -119 100 -100 18 160 106 -58 51 -144 220 -85 10 231 120 259 224
4642B24l16K17k49J36l9L31l45p5R5j33J18J7K15j52m9M8J1J11j44j88l7J70o
$$ 224 -92 125 -124 12 -27 304 -41 -116 -21 -154 -36 -19 196 44 -5 43 54 165 21 -167 -204 -34 -40
4665d0J00j69j3J3L64j86l6l6o7J86J3Q2j72J30R4k83J1r3J32J41m2J48l72J02
$$ -40 60 -109 -122 -109 255 69 33 -3 -70 116 129 211 39 169 263 -20 -9 -102 30 171 129 277 -95 7
4689Gl3N3j20J60N7r8J06j62l73L95Q5k20J19K37k85J07K40M5m21lML14k51j5
$$ 7 -26 27 -93 67 124 26 132 -30 -403 -8 77 -143 -24 213 -72 35 275 320 -101 -104 -100 214 -37 -52
4713e2nj53J77j8p4K91j7J94m03J8R0m2k8J32j80r9R9j36L05O2J48k86J81k74
$$ -52 -57 -210 -33 -51 -125 166 149 343 -60 -42 48 6 -22 110 -70 -169 -70 -206 99 161 309 23 204 -70
4737g0P9J07j34l7K83k56J78K4j72L4j04N9J12k73KJ09p1K83k48J29L2j56J52
$$ -70 9 116 -18 -55 228 -28 150 174 2 36 -68 -9 103 -170 -168 -59 -130 153 -95 34 66 -90 62
4760F2j61j41J37L2K09k49K47k05nJ85m4j19l0J20J30k85j85K93K7k62K50j31
$$ 62 -99 -240 -103 -71 138 -111 136 -69 -74 111 67 -52 -82 38 168 -117 -302 -9 18 -244 6 -125
4782a25L10j30r3R1K60l50kO3j45M9J52j52k4P5R2j91J9J42m9KJ09j01P4k5o4
$$ -125 185 55 -38 53 313 -37 -39 24 -121 -72 80 -72 -96 -21 71 -120 -101 41 -8 -6 103 2 76 51 -13
4807a3r8J16K13j01l93L11R0m39K73L5J4l01L41k35R6k8j30L24l54L42L6j20o
$$ -13 -111 5 218 117 -276 35 125 -314 -41 -6 8 -293 48 -187 -91 -119 -249 75 -279 63 99 -21 -27
4830b7j62K92k17k7J08j45o4K07L7j22J30K18j25K90n75M09j91L7j25N8L88k24
$$ -27 -189 103 -114 -141 -33 -178 -242 -35 2 -120 10 228 103 393 -182 227 36 73 -52 6 394 170
4852A70k53r0J53R4j02m7p6j1J41N8j6P1r5L41k14p3j33J28q5k29K74p1J79j86
$$ 170 -83 -173 -20 74 -28 -75 -151 -162 -21 37 21 92 -3 338 124 51 -82 46 -39 -268 6 -65 114 -72
4876g2o3K13L8q2q6j2oK60k59M9J56l71L65q1l8j22K55j59j66M9J09J41j12J70
$$ -72 -135 78 116 34 -52 -64 -70 190 -69 -20 136 -235 130 49 11 -111 144 -15 -181 -132 -23 118 6 176
4900A76k07J16QN8j21m7n5J21L2q9J40p4j02R9R7l2J8k88m9K26j47J28O3NJ1k8
$$ 176 -31 85 93 151 30 -17 -72 49 81 -8 132 58 -44 55 152 120 138 -150 -199 27 -120 8 71 76 87 59
4926E9J04k94J48o6J16j24k9o3L87j40J5j71R4j87K51r3k21L46q7p0L39m00J9
$$ 59 163 -131 17 -49 67 -57 -86 -149 238 98 113 -58 36 -151 100 7 -214 132 45 -25 314 -86 -67
4949f7J12J34r3n9J22j79L34k12L5m72L59M3j27K61k20J21k44J43r5K88k72nJ2
$$ -67 45 179 86 27 149 -30 304 92 127 -345 14 57 -70 191 -29 92 -152 -9 -104 184 -88 -93 -81
4972h1J12j34j53M30k68o0L67l80Jj00K26K7L6J6j94J74j35L57k39J63j86J99
$$ -81 31 -103 -256 174 -94 -154 213 -167 -166 -266 -40 -13 23 39 -155 19 -116 241 2 165 -21 178
4994A78j88J12j85k1L23j40k39J45o5K16K15m08K69m02J20r2K02j34K1R6j56Q5
$$ 178 -10 102 -83 -104 219 79 -160 -15 -80 136 351 -57 212 -190 -70 -162 40 -94 -73 23 -133 -48
5016d8J18J4n9n2k95N05k59q7J79k77J06M89l04M5j51LK10k66L1L4p6L0O1O3j90
$$ -48 70 84 25 -27 -322 183 -76 -163 16 -261 -155 334 30 75 -76 -73 137 -129 -98 -64 -140 -110 -49 14 -176
5041a76M24j08r0r7Q3J6m4J33pk71J86k10L68m68q5K82R7j13J83k7j35K84l28
$$ -176 248 140 50 -47 36 52 8 141 134 -137 49 -161 207 -261 -346 -64 33 -80 103 76 -59 225 -103
5064a03K9J13n9R5k05K26l08K31K7j34M3J92k66L8J31L21k28k69J10K2j20N50
$$ -103 -74 39 -20 75 -130 96 -212 19 46 -88 -45 147 -119 -81 50 371 143 -126 -16 6 -114 436
5086D36l93j57J04p8J09L0j54M8L2J97j52N2l09J35K73l13K99j93r9L11ON5k41
$$ 436 43 -114 -10 -88 21 51 -103 -55 -23 174 22 74 -235 -100 173 -140 159 -34 -133 178 184 239 -2
5109bR5k31O1M5K13n4q2o8r2K16j51O3j6K6k38K89l6j06j1K0O8J29P7j40Pj92
$$ -2 93 -138 -77 -32 181 127 45 -23 -115 101 -50 13 -3 23 -215 74 38 -68 -79 -59 9 138 215 75 82 -110
5135a10K09k47J49J44j2lk13J08J60k15J06j57l0O5K02j70Q6j34p4p0n8K35M6
$$ -110 99 -148 1 145 133 130 -83 25 185 -30 76 -81 -111 -46 156 -14 72 -62 -136 -206 -264 -29 17
5158A7j50M25m13r4O0O6j56Q6J19M0J45j58K46k76O1k1K3l57R5K02K48j16k19
$$ 17 -133 292 -121 -215 -155 -89 -245 -159 -40 0 145 -13 233 -43 18 -3 20 -337 -242 -40 208 92 -127
5181a27M3J43N8j95K1j72J98Kk0M4L12l55j53K96j20J3j11J77j13p8O6J18j10
$$ -127 -84 59 117 -78 -57 -229 -31 -29 -49 -5 307 -48 -201 95 -25 -12 -123 54 -59 -137 -71 47 -63
5204f3r4K80k19m3K6O2J21m3j70N7j31K05J5J75j21K26k72M8o4m1O0j14J49L0
$$ -63 -157 123 -96 -139 -113 -51 70 27 -143 -86 -217 -12 3 178 57 283 11 59 -5 -46 14 -100 49 79
5228G9o8J89k92l3k6O0K86j83K4J45O6j00k69m5K91j73j38RJ44k67K89J32j11
$$ 79 11 200 -92 -125 -151 -91 195 12 36 181 247 147 -122 -167 124 -49 -187 -178 -34 -301 -12 120 9
5251IP2Mj5j1L3r6j62K92j89J08j02N3j51J97R%j98J36q7K50j72J22k27L1J08
$$ 9 81 85 70 59 92 -4 -166 126 -63 45 -57 -4 -155 42 51 51 -147 -11 -98 152 -20 102 -125 -94 14
5276A4j38K31j44Q7j24j1K15k86O8R0k1j60J41J46N0j86L1k9J41l95M46j68K2
$$ 14 -124 107 -37 50 -74 -85 130 -156 -88 2 -19 -179 -38 108 158 -28 3 -26 115 -280 166 -2 20
5299B0l9j12J30j36J08j76L19j57j31K92R8n2P3j46n6j71n7J11k5Qq5R7l7O9K52
$$ 20 -19 -131 -1 -137 -29 -205 114 -43 -174 118 216 164 237 91 35 -136 -193 -82 -107 -99 -184 -87 -124 -55 197
5324A97j30k06K85l37K96m7k74J34J08J30k13K09j48q2J34P4r1K2k71L8J77J69
$$ 197 67 -139 146 -191 105 58 -216 -82 26 156 -57 152 4 -78 56 130 39 61 -210 -172 5 174
5346A74j67j17J16J54j91J09j84O0o8L3n2J32p8k60OM48q1l4m6k14J69M8J15j55
$$ 174 7 -110 6 160 -31 78 -106 -46 -114 -81 -133 -1 -79 -339 -333 115 34 0 -46 -260 -91 -43 72 -83
5370h3L07o05L38J5o0n0k1L28l82N33k08j28K78k44k0O2p1j25O9j85J28J81j36
$$ -83 224 -381 -43 -28 -88 -138 -159 169 -213 320 112 -16 262 18 -2 60 -11 -136 -67 -252 -124 57 -79
5393g9K36j26J48J54l44J08J13k50m1O6j41K2J85J23k69L0j57L03k44J20k7J43
$$ -79 157 31 179 333 -11 97 210 -40 -81 -15 -156 -134 51 174 -95 -65 -222 81 -163 -43 -70 73
5415G3j1pl5L9N3j44r6J08j60J3R1p3K30n7J63j27o2r7L8J28k47L27ln9j58J18
$$ 73 62 55 20 59 112 -32 -128 -20 -180 -167 -76 -149 81 24 187 60 -2 -99 -61 67 -180 147 144 85 -73 45
5441D5L7j57P6j35J95k80L29O4k99P0K14k17p6Q0O2k78K43j9Q9k67L81J15l32
$$ 45 82 -75 1 -134 61 -219 110 174 -125 -55 159 -58 -134 -54 8 -270 -27 -46 43 -224 157 272 -60
5464f0L7JJ68k6l05J93r0Q9j87J56j8K37Qk27l1m6K90k13J34l60J37J14j04J98
$$ -60 -23 -22 146 120 -185 8 -82 7 -180 -24 -42 195 203 -24 -55 -101 189 -24 110 -250 -113 1 -103 95
5488I5k97J86m3l3Q1q9M1K08j71k7J16j06J62l06L00j33P7m6r2m2P7Mj53J28K18
$$ 95 -202 -16 -59 -92 -11 -100 -59 149 -22 -49 67 -39 123 -183 117 -16 61 15 -77 -119 -42 -38 -191 -63 155
5513A55j21K2K9J27k28k1Q4n5n9P3K3Q3j27J6J77q0k3K9j40m3K57k52R2j66J54
$$ 155 34 56 85 212 -16 -37 47 -8 -67 6 29 112 -15 1 178 98 75 104 -36 -79 178 -74 18 -148 6
5538Fm2K39j70n5K97k79L7O8j27k02mM09p2k33P8j60K65J6l4o2J3M55m93k0j8
$$ 6 -36 203 33 -22 275 -4 33 101 -26 -228 -232 177 105 -128 -50 -210 55 71 37 -25 -12 443 -50 -70 -88
5563h8q0Q9j92L21l9k93L28o2r1o7L59k26K97r7J87k94q4r5J38j01J87L8p9p0
$$ -88 -168 -79 -271 50 11 -282 46 -16 -107 -174 185 -41 256 159 346 52 -32 -127 11 -90 97 135 56 -14
5587a4k49J80J82k23J3qK39j25mJ09o1k3j71K06k2N3q2M1j86L16k26J45q6J55
$$ -14 -263 -83 99 -124 -111 -119 120 -5 -9 100 39 16 -155 51 29 82 0 41 -145 171 -55 90 4 159
5611A59m44K98kj60J21J56j03k14J89j32J16n4j09K20k89J65j21J76M7j94Q3K3
$$ 159 -285 13 11 -149 -28 128 25 -189 0 -132 -16 -70 -179 41 -248 -83 -204 -28 19 -175 -92 -69
5633f9K15j04j74J5K36l59K42j94K06J9P8o0r1j3r2J17J4KM1k6O7l9k31J61O7
$$ -69 146 42 -132 -117 119 -240 2 -192 14 33 111 51 -40 -53 -145 -28 -14 -12 29 3 70 31 -200 -39 28
5658B8%J8L4p2rk82J61K2J31L8q9J54j0l27J55J60jl27L95R4k55j33P9j7M3P3
$$ 28 28 46 80 8 -1 -283 -122 -100 31 69 -20 134 124 -203 -48 112 111 -216 179 273 18 -115 -36 -53 -10 63
5684F3l8J5l5J14Oj49N0j4M6J36j49l12M40j83lj7L08m51J64Q6p6K1q4J35j07
$$ 63 25 40 5 119 125 -24 26 12 58 194 45 -267 173 -10 -13 -30 278 -173 -9 77 1 22 -62 73 -34
5709c4L06l51j76K48k6M5P1p3j34j47K87j66M1M9j7K61k21K6J55n6j0N1j73l7
$$ -34 272 -79 -255 -7 -33 12 83 10 -124 -271 16 -150 -109 -60 -77 184 -37 -11 144 88 78 129 -44 -81
5733h1J89j1J48j87o7R0P0j27j26J51n1q4K86L8j21p9j07K46m40K62k4M7k05q9
$$ -81 108 97 245 58 -9 81 151 24 -102 49 -2 -86 200 238 117 38 -69 177 -263 -1 -25 22 -183 -272
5757b72M7L80N0R3k22l81L41r0J22K7j48L28Q7k48k75L27l07K83j69LJ45m20L59
$$ -272 -225 155 205 298 76 -305 36 -54 68 95 -53 275 362 114 -161 166 -141 142 -27 -24 121 -299 60
5780F0j46K15k16N1J27l63N07L0m01q2K35j21k08K78n7K69j20J99j79R7j65o0
$$ 60 -86 129 -87 -36 91 -272 235 265 -136 -218 17 -104 -312 -34 -91 178 58 257 78 175 10 -50
5802e0J06L05n85M35k53m6N0J76k31J20m4M1O5j33K73k48k63M37m0j51k94M93
$$ -50 56 361 -224 211 -42 -88 -38 138 -93 27 -17 24 89 -44 229 -19 -282 155 115 -36 -330 163
5824A63j82j91K99Mk34K0L2K53k65M6J55J7K6l21K76k73J43oJ11k63J27J0l0J98
$$ 163 -19 -210 89 93 -141 -121 -89 164 -101 -55 100 117 143 -178 98 -175 -32 -38 73 -190 -63 -53 -83 115
5848A15k34O3k48L69m4L4o9J09l79J83M5j97K34J23j31J48j56M18k31j38p6j2
$$ 115 -119 -56 -304 65 21 55 -14 95 -284 -101 -56 -253 -19 104 -27 121 -35 383 152 14 -62 -74
5870g4j1J2mK33k32K90l17K21j97J09k29R1K58l30L41p8m6K08l38K97l41J61K6
$$ -74 -85 -73 -77 156 -76 214 -103 118 -79 30 -199 -108 150 -180 161 83 37 245 -93 204 -137 24 50
5893E0j39K11k91K52j49L08k74J49r0j52K94j26j12Q2k09L04j62K61J1m2l43M8
$$ 50 -89 122 -169 83 -66 242 -32 117 27 -125 169 43 -69 13 -196 108 -54 207 218 176 -167 -119
5915a19M9l0j22N1J34k49K67o2K9J16o5j6J89j14J87j90j29l3M5J65j48R9K05
$$ -119 -70 -100 -222 -171 -37 -286 -19 -81 -52 64 -1 -17 172 58 245 55 -74 -107 -62 103 -45 54 259
5938B59m60J08J50O2k87P1j03L76l01nR0L8L4J75m20L95l28q6J75q5M29j14l06
$$ 259 -201 -93 57 119 -168 -97 -200 176 -125 -130 -40 -2 32 207 -213 182 -146 -232 -57 -142 287 173 -133
5961a33J75j18J37l2j13J06O8J26l33M44k88k76J38K70k38L3j69P1K28j71M1R5
$$ -133 42 -76 61 29 -84 22 90 216 -117 327 39 -237 -99 171 -67 -34 -203 -132 96 -75 -34 61
5983F1j30J83o6r1O8p5R4P3K5l64J92q2K46m4j06L8J88l0k72K08j73K40j09l3
$$ 61 -69 114 48 -43 25 -50 44 117 142 -222 -30 -112 134 90 -16 22 210 180 -92 116 -57 183 74 41
6007D1k67L8kN76m59j42J00J39R5j58N6k24J57j35M16m12L36j88R3l62K56K38
$$ 41 -226 -188 -190 386 -73 -215 -115 24 119 -39 17 -207 -50 -185 231 -181 155 -33 60 -302 -46 192
6029A92l31K6n7J43M05m95K45p8p9K48l43J64n7l4j3K60l01R5R0j47j08J58J72
$$ 192 -139 -113 -170 -27 378 -117 128 50 -29 219 -124 40 -17 -51 -64 196 -105 -10 80 -67 -175 -17 155
6052A55j72J23K12k19j63P5j82M42l61K54r1J40j49j14N9J26k40k7L23m34J33
$$ 155 -17 106 318 99 -64 11 -171 271 -90 164 73 213 64 -50 9 135 -105 -132 191 -243 -110
6073a10J48j28J5K23K48l65l78L68J00l30K01L4j86n8O9J89j31K07k21L6j45M6
$$ -110 38 -90 -75 148 396 31 -347 21 121 -209 -8 26 -160 -218 -149 40 -91 116 -105 -69 -214 -168
6095a68K54k18J46m5k5L09k26p9p6J69j14o1q1J51J60k0j08J24O2k93j60L93j69
$$ -168 86 -132 14 -31 -56 253 27 -52 -128 41 -73 -134 -215 -64 96 76 -32 92 154 -139 -299 94 -75
6118g5j06K91L0j52O3Q7j13j74J91q1k28K49L2J03Npk19J46L1M6j67J61k69M8
$$ -75 -181 110 140 -12 51 138 25 -149 42 -39 -267 -18 14 117 122 115 -104 42 73 119 -48 113 -156 -108
6142a08K37l96K04J56k46J46j51J43J22j5k59L02j02O5K1k36J55l7rl2O8n3J52
$$ -108 129 -267 -63 93 -153 -7 -158 -15 107 92 -167 135 33 98 119 -117 38 1 -8 -40 28 -25 127
6165A27J6R5k60o3K4n6L5J73Kj62J1J52p1K1r2J89j07p1J90j57J82j96J13j71
$$ 127 143 238 -22 -85 -61 -117 -82 91 93 -69 -58 94 23 44 -48 141 34 -37 153 -4 178 -18 95 -76
6189g6l0L43l17n9M0j77J40L60k38j96J84k44L73n5k01L32k60K40o2j79q1j68
$$ -76 -106 237 -80 -139 -99 -276 -136 224 -14 -210 -26 -270 103 48 -153 179 -81 159 97 -82 -163 -331
6211c31P2j22M91N6k58p8L52k02k39O8m7L35k37Q7r2N8Q3m3J62j73J08j51K9m4
$$ -331 -259 -381 110 166 -92 -170 182 -20 -259 -191 -238 97 -140 -53 -145 -87 -4 -47 115 -58 50 -101 -72 -116
6235a16R7n7j35n6K48q0L3J17O9k52J55r5m8K33kk83L31m10K25O7J74n3k00j42
$$ -116 -19 -76 -211 -267 -19 -99 -66 51 120 -132 23 -72 -120 113 111 -172 159 -251 -26 41 215 162 -38 -180
6259a80K29oM0m9J5J74j85J19j9j62j75J45j20J05P0j83J90p8Q7O6j2Q0m9m14
$$ -180 49 43 83 34 49 223 38 157 138 -24 -199 -54 -174 -69 1 -182 8 -70 17 83 71 151 102 -312
6283c12L48j33K75k01Q5J55k48K56l61J2K0K73j01K2k08K49L5n2o5j31O0Lo8K97
$$ -312 36 -97 178 -23 62 217 -31 225 -136 -124 -104 169 68 90 -118 131 166 114 49 -82 -22 -19 -87 210
6307B10j18j4m3J4j54J33K31k86K8P8k32K26k56J7%K57N2l71M03k59Q9jL9K71
$$ 210 92 78 35 49 -105 28 259 -27 1 79 -153 73 -183 -166 -166 91 143 -228 175 -84 5 4 43 314
6331C14j52k65LK61j53j6Jj8k8j92M95k64K07m07K16M9j31K44m27J43K85j27M7
$$ 314 162 -103 -100 161 8 -8 -7 -25 -53 -245 250 -14 193 -214 2 51 -80 164 -263 -120 165 38 85
6354H5L6o2K21k33k81J62j70J89N1j29M18l90k1J69l84M56j87O6k31L79r8j27
$$ 85 121 59 280 47 -234 -72 -242 -53 -2 -131 287 -103 -124 45 -339 117 -70 -4 -235 144 46 -81
6376h1J43M2j11j04L76k68j29L04j05n2l42L13K51m5j84k9J55l2q0r0j59K16M4
$$ -81 62 104 -7 -111 265 -3 -132 172 67 15 -327 -14 237 192 8 -21 134 102 22 -68 -227 -11 33
6399C3p9J4K32l75L02m7o7Nj42J09n8J2K31k0j94Q5o4l03L38K31Jk00j08K21p7
$$ 33 -46 -32 200 -175 127 80 13 18 -124 -15 -73 -61 170 150 -44 41 -23 -326 12 243 244 44 -64 157 80
6424H0j76L3J02K2J82k35k4q8r6K96j69J46j20k56L69p5K73k56o6K7M5q1J23j92
$$ 80 -96 -63 39 61 243 8 -16 -104 -200 96 -73 73 -47 -303 66 -9 264 8 -58 -31 14 -67 56 -136
6448a36K40k16J57J22k26k13J17K3J10j91K07K65k8k40k0J34j25l9L7j5J78k63
$$ -136 104 -112 45 167 -59 -272 -155 -132 -22 -213 -6 259 231 -9 -29 105 -20 -59 -22 -37 141 -122
6470a22L65k98J3M9q2K4R5l44Q0N06m36J93J3J39k31K9J20q9J30k56K66mj88J70
$$ -122 243 -55 -42 7 -75 -51 44 -300 -220 286 -150 43 56 195 -36 -7 113 24 154 -102 164 160 -28 142
6494A42R9l18N6k14K31j6j48M1J43RP4j33k78J57K01PJ55k46PJ17p8N7k95L18
$$ 142 241 -77 -21 -235 -4 -20 -168 -127 16 25 99 -34 -312 -155 46 53 208 -38 -31 86 8 65 -230 88
6518H8L50p71K60k6R2q5J94k33K63R0k74pN6J90m34K55r2k9J71j59J23J79K7o8
$$ 88 438 -333 -73 -99 -7 -92 102 -131 132 222 -52 -59 -3 187 -247 8 -84 -113 58 -101 22 201 228 160
6542A60J9j67pJ95k1k10J16J8j59J68j67L79k37kj03j89J06J51O0n6j77K92m3
$$ 160 179 12 5 200 179 -31 85 103 -56 112 -55 324 87 85 -18 -207 -101 50 110 54 -123 169 126
6565A26j64jL7J8q8k93M57j58J84j03k41L15k04k13L65Q9m8o3j28J19j60K76k
$$ 126 -38 -39 -2 16 -72 -365 92 -66 118 15 -226 89 -115 -328 37 126 78 15 -113 6 -154 122 120
6588A20k6j10j58J09j3p3J69K2O9j37J2j10K95j59q7K19j54nk7oK44j44p8r7Q5
$$ 120 94 -16 -174 -65 -78 -151 18 40 109 -28 -16 -126 169 10 -77 142 -12 -17 -44 -50 194 50 -28 -125 -40
6613d0M40l31l45L78r8O5j42n6J79o4j61K18M1Qp6J17P3k55K45k16J00ok19L2
$$ -40 400 69 -276 102 4 69 -73 -129 50 -14 -175 43 84 92 16 133 206 -49 196 -20 80 74 -145 -113
6637a13n8J23K29k58K17j59r1J87o3J1o9M7j0j64J35K26j71n3rK22p0k13k8J46
$$ -113 -171 -48 181 -77 140 -19 -110 77 14 25 -44 3 -7 -171 -36 190 19 -34 -43 179 109 -104 -132 14
6661A4J35k04m6J41Jj7k70L77j29j27O0J05r9j42K15j10K8J18m3R4Q7l49j67J29
$$ 14 149 -55 -101 40 41 24 -246 131 2 -125 -65 40 -59 -201 14 -96 -68 50 7 101 188 -161 -328 -199
6685a99K21k57J96k09K25K6rJ56p8m3j8j05N9L8O0l2R1Nk44J46K40l78Q9O9N6
$$ -199 22 -235 -39 -248 -23 3 -6 150 72 29 11 -94 -35 3 63 31 122 127 -117 29 269 -109 -20 49 105
6710A05j93N4O2n7j08j12L75k17J61p0J0J33R5k48K99l00J3j27O0L97l17Q3M6
$$ 105 -88 -34 28 -29 -137 -249 126 -91 70 0 10 143 238 -10 289 -11 2 -125 -65 332 15 98 144
6733A44j75j02K9K11M3l99L90l38J28K47L4J3k18K1L1O5j34M0q3j52M07q0k66
$$ 144 -31 -133 -104 107 150 -249 141 -197 -69 178 212 225 7 28 59 124 -10 30 -53 -205 202 122 -144
6756a44Q5o6R2O0j58N9pL1J66k53Q2o7K74J8j37j56Q9q4J13J10q1r5J3r2K77J3
$$ -144 -59 -125 -33 27 -131 -72 -79 -48 118 -135 -53 -120 154 172 35 -121 -32 -116 -3 107 26 -69 -56 -148 129 142
6782A42j26M2n5j42K58j10O6q5J04k65K24N8k27J61OM9j09m5J20R7j83k0j01K80
$$ 142 16 58 3 -139 119 9 75 -10 94 -171 53 111 -116 45 51 100 -9 -54 66 163 -20 -40 -141 139
6806A39j68K34k11k9J02J88j76k95l5L59q8m1o8L0Q7k09J91N0j67J19j45J46Q9
$$ 139 -29 205 -6 -35 67 255 79 -216 -251 108 20 -21 -89 -59 28 -181 10 60 -107 12 -133 13 102
6829A02m1k6Q7N0j62N9k1Pl7k9Q5j58k04N99j39m11M44k48Q4jk72L71j90J16R4
$$ 102 61 35 122 172 10 69 48 55 18 -11 74 -84 -288 311 172 -239 205 -43 41 40 -232 139 -51 65 159
6854A59k56J41L1k5k32K80l63J26J18J00P1q6J46k09j18J24P9J72j84n4q8K5P2
$$ 159 -97 44 75 50 -182 98 -265 -139 -21 79 150 64 210 1 -117 7 86 258 74 20 -68 -43 29
6877B9J70q7k57K88pj5k02O0j07J97p5K81r4k20j73L00j7k65K65j56J52k43K01
$$ 29 199 112 -145 143 136 121 -81 -21 -128 69 -6 275 181 -39 -212 88 71 -194 71 -85 67 -176 25
6900B5j3j4Nj46K34Q3Q4k52j10P7J82j33M1J59%m54L62k01j49J79p5j04J7K56
$$ 25 12 -2 3 -143 91 174 258 6 -104 -27 155 22 63 222 222 -232 130 -71 -220 -41 -116 -220 -203 53
6924E3j63K10q8L4m5p5j49L10k3j60J12j14O5J22j82K5K00n4l8j35K67j44r1K45
$$ 53 -110 100 12 46 1 -74 -223 87 64 -96 16 -98 -33 89 -93 -68 132 78 40 -95 172 28 -63 182
6948A82k22k01J13O8j06P7J17j98K94J68k33k08j14M53j66R2P4j26j10K12J4r4
$$ 182 -40 -241 -128 -60 -166 -89 28 -170 124 292 59 -149 -263 190 24 116 190 64 -46 166 180 86
6970H6j75j69L11j24j05L84j70j90J54k04K32k05K70j08K82l22R5n5o2k4K83l74
$$ 86 -89 -258 53 -71 -176 208 38 -152 2 -202 30 -175 95 -13 269 -53 42 -13 -75 -99 184 -190
6992a90K07j20M2j39J22K42k64J8J42j3j57J37k43P1n8J23k99M35J83l07N1m5
$$ -190 17 -103 -61 -200 -78 164 -100 -82 60 47 -110 27 -216 -145 -203 -80 -379 56 239 -68 -17 -62
7014f2L81j71j35MN6k16J77m05L58n9P3Q3l73L12n5j9R0j34J40q3J31j08k42L06
$$ -62 319 148 13 17 73 -143 34 -371 -13 -72 1 84 -289 23 -32 -51 39 -95 45 -38 93 -15 -257 49
7038D9J01j19O1J35m30L10o0p9K8J77k26L9J49J4j99K77N2j81l0j55O3K13j92
$$ 49 150 31 92 227 -203 107 47 -32 -4 173 -53 -14 135 149 -50 227 279 98 68 -87 -24 189 -3
7061ck11J57K16r2Qj89J39l7J37m28L99k76K8j69K94K27k46K5LR7o5q3mJ55k59
$$ -3 -214 -57 159 67 75 -114 25 -12 125 -303 96 -180 -152 -321 -27 200 -46 -21 -18 79 14 -69 -73 82 -177
7086a77M00k69J21J51j73o0n8K96j50q8J59k96L08j04R0j25rl19L57J3k05J34
$$ -177 223 -46 75 226 53 -7 -65 231 81 -7 152 -144 164 60 150 25 16 -303 54 67 -138 -4
7108dn8J80o4M7k08l3J21q5J87j34J91J4j83O1j68K82j96J06l6N6J35l48K93r6
$$ -4 -62 118 54 101 -107 -140 -19 -104 83 -51 140 154 -29 32 -136 146 -50 56 20 76 211 -137 156 60
7132F0o8R5N0rk07J03r1K1j7P4J13j72KK57mp7k68P5Q1K4j90J75k09J48j72K86
$$ 60 -8 87 137 128 -79 24 -67 -46 -63 11 124 -48 -46 211 207 130 -138 -63 18 42 -148 27 -182 -34 -206 80
7158H0Om4Q2j9r6k2r8K5J3k2J90k32L78l53k5R8R3jN0m1K94l02j07J02O7j07Q0
$$ 80 86 42 124 105 9 -13 -111 -86 -73 -95 95 -137 241 -112 -137 -39 54 53 103 62 356 54 -53 49 116 9 89
7185H9j98K36p2k81K79m0J08Mj24J62O4l40r7K75j02L2j50J67o8j09J14j0L9J33
$$ 89 -109 127 55 -226 53 13 121 125 1 163 227 -113 -210 65 -37 -5 -155 12 -56 -165 -51 -61 -22 111
7209A11j93l8K26pk64L92k51j53J66P5P3j75m4p7J35J09r9Q5N7n15N18q7J81k51
$$ 111 -82 -120 106 99 -165 227 -24 -177 -11 64 137 -38 -82 -159 -24 85 -14 71 128 -387 131 44 225 -26
7233b6J24Jk89J95R6k07lR2l8M2J62j84j11L56j54j22j42J3K91j52J49j73%J19
$$ -26 98 99 -190 5 101 -106 -109 -17 -55 -13 149 -35 -146 210 56 -66 -208 -195 96 -56 93 -80 -80 39
7257C9o3N3n1l44K85J33j2K93l91J98o7j23L0oJ19j64M15m45Q3r2J21L26n56L65
$$ 39 -24 29 -22 -366 -81 52 40 333 -58 140 73 -50 -20 -26 93 -71 344 -101 -18 -110 11 337 -219 146
7281A46k49J5K28j30J10l12J45m2J80j07j48M08k74M7O1o7r9Q4j1o5j5p6R5j2
$$ 146 -103 -88 140 10 120 -192 -47 -89 91 -16 -164 244 -30 17 78 11 -88 -4 -15 -80 -95 -171 -76 -88
7305h8j12K96j09l0R2l0o4k1N7K5J36M5q9k00l0K61l17J45J63l5k20J81l25L97
$$ -88 -200 96 -13 -43 49 19 -45 -66 -9 16 152 197 108 -92 -122 139 -178 -33 130 95 -125 56 -269 128
7329A28k26OJ11q6R1k16J73j02j27K11R2n0O7k53K90j23K42q8k50J14J24l35K80
$$ 128 -98 -92 19 -67 24 -192 -19 -121 -248 -37 55 5 72 -181 109 -14 228 140 -110 4 128 -207 73
7352G3l89M46l33J27J48j85n6Q5L13l18J75j1l6k0q3J11k16K55k42J89J0k05K38
$$ 73 -316 130 -203 -76 72 -113 -169 -84 229 -89 86 75 39 19 -64 47 -169 86 -156 33 43 -162 76
7375G6o8J27j30M0kp4P6K13k45R7k37M4j46L46O0l68L78k42M7j38R9o4M1K36k29
$$ 76 8 135 5 45 43 -31 45 258 13 110 -127 -83 -229 117 177 -191 187 -55 -8 -146 -47 -111 -70 166 -63
7400f3k6L37k85L6L3k13j18J88J19q7J60r1Kk06K49J88l76J67K4m4o4L10j44k42
$$ -63 -89 248 -37 -1 32 -181 -299 -111 8 -79 81 -10 -8 -214 35 223 -153 14 38 -6 -70 240 96 -146
7424a46J41R9p3l10M33l46m1K66P7rk48R2R6Qk30N9R2K81l73N1j01J55N9j40K76
$$ -146 -5 94 21 -289 144 -202 -243 23 100 91 -157 -65 31 39 -191 -132 -40 241 -132 -81 -182 -27 32 -108 168
7449A68M0M3n46L80K52m08j97L94j78p3J61m7l1o3K49r4k75M47j10j11j50J28
$$ 168 208 251 -295 85 337 -71 -268 126 -52 -125 36 -11 -42 -105 144 50 -225 222 112 1 -149 -21
7471b1j13M9P4K04l14J82J1j14J82j36Q0k75J0K49k05J35j79R3J74j11J45j57
$$ -21 -134 -85 -11 193 -121 61 72 -42 140 4 84 -191 -181 68 -137 -2 -181 -88 86 -25 120 -37
7493c7O8o2J55m0K2j74J96j85J59m5M8q6P9k60J6K75K68n60J65k06K15l8J90k90
$$ -37 31 -31 124 84 106 -68 128 -57 102 57 105 19 98 -162 -146 129 397 -163 2 -204 11 -27 163 -127
7517a27Q3N5j53J24k87J92J14J22l19J83k01J49J17j4Q2M5j71R0k01J29oo7j82
$$ -127 -44 11 -142 -18 -305 -113 1 123 -196 -13 -214 -65 52 38 120 165 -6 84 -117 12 6 -61 -243
7540b43J76K7K50O9k82J70j46p3J37k23K90q0Kn6j0j47J15j51K10r4o3K56k65
$$ -243 -67 -40 210 279 -3 167 21 -52 85 -138 152 72 74 18 8 -139 -24 -175 35 -59 -122 134 -131
7563a31k8M8K26k31M7J12J93l35o5K68j41P9J44j58j81L91j24j88L52k77k22Q6
$$ -131 -159 -111 115 -116 -69 43 236 -99 -164 104 -37 42 186 28 -153 238 114 -74 278 1 -221 -135
7585a35L64m58R3J66l09K15N7r2J3j02M67k57o0K17k33J66j83K12q2k9m7L47j89
$$ -135 229 -229 -136 30 -279 -64 -7 -99 -86 -188 279 22 -38 179 -54 112 -71 141 59 30 -17 330 141
7608A41j84J0k4P7j3M5j59L43j29k42j7J21K39Q0l26O1J04l19N1L06k55p2J37
$$ 141 -43 -33 -57 20 7 52 -107 236 107 -135 -152 -31 208 288 -38 23 127 -192 -141 165 -90 -162 -25
7631b5q7J75K6j84L7n4K75k62O2J40j81J88J16l62l0n7P9R2M9j09n5J13p2J95
$$ -25 -112 63 89 -95 -58 -112 163 -99 -37 103 -78 110 226 -136 -166 -223 -144 -52 -3 -112 -167 -54 -126 69
7655F9K0l4M7m2PO2j18j26J37KO8r6j34J43oj47J12p6k23N91j49j89K9J07m3j06
$$ 69 89 55 102 60 67 129 11 -115 22 24 92 -4 -138 5 -1 -148 -36 -112 -335 256 107 -82 -53 54 11 -95
7681i5J72k71K64r3L1j73J1J84j41K94M2l1q8m0j53L0J08k4P9l08M28k05J57k82
$$ -95 77 -194 70 -23 8 -165 -154 30 -111 183 225 194 106 66 -87 -57 51 27 106 -202 226 21 178 -104
7705a04L1M6j2O2J0m2j43M3J3p5K66j81K50rk54J29nr7K51r6k28K18rJ88r9j29
$$ -104 -73 -27 -39 23 33 -9 -152 -109 -96 -171 95 -86 164 155 -99 30 25 -72 179 83 -145 73 64 252 153 24
7731B4R3j69J56l9q1K55K4l15q9K86n2K5Q2j64N6j72p3J46J5Q7n0K5p1J14Kj41
$$ 24 117 -52 104 65 -16 239 263 -52 -141 145 93 118 200 36 92 -80 -153 -7 8 95 45 70 -1 113 115 -26
7757b6j90L32j09R9j56J66Q2k41oJ7J60R8r7j91Q8Q5j0M8k78L50k81K40j65q5
$$ -26 -216 116 7 106 -50 116 198 -43 -49 -32 128 226 129 -62 26 111 101 149 -129 221 -60 180 15 -70
7781g0K39j73J26o8j11k0p8K05J20n2J05k44p7J81k4k2n9J72j94K28j56r2j24
$$ -70 169 -4 122 54 -57 -77 -155 50 170 118 223 -21 -98 83 59 37 -22 150 -44 184 28 -64 -188
7804a88J54Oj85J32j34K50l1l21M65o0j78M8n5L8k1p3J77P4l81L84k57K26K07
$$ -188 -34 -28 -213 -81 -215 35 4 -317 148 88 -90 -42 -97 -59 -80 -153 24 98 -283 101 -156 70 277
7827B77k15J4j44J15L0oj19M4K15m22R7q7J96K0o3J31L9j87J41l0K04m17K15p1
$$ 277 62 76 -68 47 77 71 -48 -4 211 -211 -114 -201 -5 15 -48 83 122 -65 76 46 250 -167 48 -23
7851b3N9P8K9k5o6k3k43J29R1j18R1n6J17o6j40K18l15L01k07K25j27Nk3P2M8
$$ -23 36 114 143 118 52 29 -214 -85 6 -112 -21 -77 40 -26 -166 52 -263 38 -169 56 -71 -66 -89 -17 31
7876C1J58J6k54J62k52O9J13l98M46k46R7N7j27L26r7k4p1O9Nj59n7J44O5J5J8
$$ 31 189 205 -49 113 -139 -70 43 -355 91 -155 -58 -1 -128 198 101 77 6 75 80 -79 -136 8 73 88 106
7901A06j52J19M0j62J05q7L4o8o5N9J26nj27K47k90L68j58j64L58l94J04n4K20
$$ 106 -46 73 113 -49 56 -31 3 -65 -130 -71 55 50 -77 170 -120 248 90 -74 284 -110 -6 -60 160
7924A60j91J15k31J73j85K53l7k21J65K0K19l31K61l4k66J02M8K0j1j16J69J0
$$ 160 -31 84 -147 26 -159 94 57 -164 1 21 240 -91 170 136 -130 -28 20 40 29 -87 82 92
7946I2q7K52m75K57j64k8L25j75p7MJ37J76j80M1o2q3J75K5j98Q4Jk43lNK62j1
$$ 92 5 257 -218 39 -125 -153 172 -3 -80 -76 61 237 57 98 36 -47 128 153 -45 39 40 -203 -206 -201 61 50
7972E0j90K22k49K35K6j87J45j21J23k24L85j93Q9r5j17J6%J16k60K38L5j77J09
$$ 50 -140 82 -167 68 94 -93 52 -69 54 -170 215 22 111 16 -101 -85 -85 31 -229 9 44 -133 -24
7995b4K81j86o1p0J34k46L65l29J23l7j56L55O3r9l80K57K8j5r6N5J61k35m8j
$$ -24 257 71 10 -60 74 -172 193 -136 -13 -50 -206 149 212 113 -267 -10 18 3 -93 -38 123 -112 -160 -161
8019a61J71qk4k86P5Q3Ql4O8O5O2j64Oj7M5J88j22J43N7k5j06j53J52j13R4L16
$$ -161 10 2 -22 -308 -233 -150 -142 -176 -108 -43 19 -145 -139 -156 -111 77 -45 98 155 130 24 -129 23 -90 4 320
8045C20p18N91j42p4J19L1k31K0R8k2j46K07mK8K25k96r6J00k3k0K20k99L53m80
$$ 320 -398 193 51 -23 96 127 -104 -84 14 -8 -154 53 49 77 302 6 -90 10 -13 -33 187 -112 241 -239
8069b39J89R0n1j19P1K31k32j78L31m0l04K27O8P2k82J22L7J78j0l71J52R9QJ02
$$ -239 -50 40 -11 -130 -59 172 -60 -238 93 53 -251 -24 44 116 -166 -44 -7 171 161 -210 -58 41 49 151
8093A51q9p8j20J10M9n7%Q6P3n5j28l6K3j5J8l0J44K7N2k19J00q2R2j06J33k51
$$ 151 62 -16 -136 -26 23 -34 -34 52 125 70 -58 -94 -71 -86 -68 -98 46 73 125 -94 6 -76 16 -90 43 -208
8119b08K11R1k04J22J04K5q7L9l94M39O2l69J83l4J50k33K40j82j21J76q6Q0q6
$$ -208 3 94 -110 12 116 141 54 93 -301 138 200 -169 14 -20 130 -103 137 -45 -166 10 -76 4 -82
8142h2o3K10k43j50M01l29J86J69j6L33n45j60R4L72l0j26J05q6k58K26j13j9
$$ -82 -145 65 -178 -328 73 -256 -70 99 83 416 -129 -289 -195 177 147 21 126 40 -218 8 -105 -124
8164a24R6M3p5K18q5k98L28m05L15P7j36M3R2L06n42J00P1j29J28K3j92M02k19
$$ -124 -28 15 -60 158 73 -225 103 -302 13 90 -46 -3 89 395 -147 -47 24 -105 23 46 -146 256 37
8187C7j87J52O1L3
$$ 37 -150 2 63 96
8191I6
$$ Imaginary data points
##PAGE= N=2
##DATA TABLE= (X++(I..I)), XYDATA
0@%%%%%%%%%%%%%%%qJ6j6J6j6J6k4L2l2M0m8N6o4P2q6R8j09J23j42J60j81K05
$$ 0 0 0 0 0 0 0 0 0 0 0 0 0 0 0 0 -8 8 -8 8 -8 8 -16 16 -16 24 -24 32 -32 40 -46 52 -57 66 -76 84 -97 108
37A08k29K56k85L17l55L94m35M82n32N88o49P15p89Q69r57J056j164J286j424
$$ 108 -121 135 -150 167 -188 206 -229 253 -279 309 -340 375 -414 455 -502 554 -610 676 -748
56g48J578j754J956k195K480k823L248l793M523n552P119r828J5776n2248O6928
$$ -748 830 -924 1032 -1163 1317 -1506 1742 -2051 2472 -3080 4039 -5789 9987 -42261 24667
71B4667J61873m6145j57853j18393L809Q6415J51700P7364p7380j44000p7989
$$ 24667 186540 140395 -17458 -135851 -132042 -45627 106073 183437 106057 -37943 -115932
82a15932j468Q4791J27606M6771q4246j10275o5998L492R3423J23306J8562r1213
$$ -115932 -117400 -32609 94997 141768 57522 -52753 -118751 -115259 -21836 101470 120032 28819
94B8819r9580m7712K2840J02942R7131l670p6640p1394m0386K4022R3495P5626
$$ 28819 -70761 -118473 -95633 7309 104440 100770 24130 -47264 -87650 -63628 29867 105493
106A05493j6599p5041p4628l2302M5244R2673M6955l0088o5063o3946k4236N0431
$$ 105493 88894 13853 -60775 -93077 -47833 44840 91795 61707 -3356 -67302 -91538 -41107
118d1107Q1018L2979k7607n7156n7722j0208N9339P3259K4481l0640o0156n1293
$$ -41107 39911 72890 45283 -11873 -69595 -79803 -20464 52795 77276 46636 -13520 -64813
130f4813L604N7409N6275J5530k8565n6344m3773R813N1802M6546R304l4273n6143
$$ -64813 -61209 -3800 52475 68005 39440 -16904 -60677 -50864 938 47484 56788 22515 -33628
143c3628l2047J9921M9970M0263N244l3903m9312k2197K2112M4870L5552P46l6812
$$ -33628 -65675 -45754 4216 44479 49723 15820 -33492 -55689 -33577 11293 46845 47591 10779
156A0779m3245j3122K3978M1491K9809o992l9489l8013q670K1824L6975K5262
$$ 10779 -32466 -45588 -21610 19881 49690 42698 3209 -34804 -43474 -21650 15325 40587
168D0587j0370l5882k9867m114K3269L6251J8506j5493l2382k3420r75K4864L4413
$$ 40587 30217 -5665 -35532 -39646 -16377 19874 38380 22887 -9495 -32915 -33890 -9026 25387
181B5387J2993j6101k8602k0738J91K4693K9058N848j9231k5895j7491M036K5639
$$ 25387 38380 22279 -6323 -27061 -26870 -2177 26881 32729 13498 -12397 -29888 -25852 -213
194b13K4694J569j7962k3012j5680O433K6082K0280p76j5539k0216j0647J0857
$$ -213 24481 26050 8088 -14924 -30604 -24171 1911 22191 21415 5876 -14340 -24987 -14130
207a4130K4573J4842l822j5780j9562r170J2461K1602J1012m249j5321j8722n812
$$ -14130 10443 25285 21463 5683 -13879 -23049 -10588 11014 22026 17777 2456 -16266 -22078
220b2078J3791J8267P072n335j5334j6429j211J5249J6168O920m814j5296j3951
$$ -22078 -8287 9980 17052 11717 -3617 -20046 -21257 -6008 10160 17080 12266 -3030 -16981
233a6981J359J4545J3417N309o452j5309j0807L854J3156J1270L019q127j5336
$$ -16981 -15622 -1077 12340 17649 11197 -4112 -14919 -11065 2091 13361 16380 8253 -7083
246g083r275M723J1547J0409K476r100j3480n187N741J1217Q592R78r337j1990
$$ -7083 -16358 -11635 -88 10321 12797 3697 -9783 -14970 -9229 1988 10580 11558 2221 -9769
260i769l331O364J0919Q412j45j0037j0528j924N941R594O350k902r621q552r48
$$ -9769 -13100 -6736 4183 12595 12450 2413 -8115 -10039 -4098 5496 11846 8944 -677 -9229 -10177
275a0177O536R059N273l824r531p341j19O542Q760M012l997q311n445J227O779
$$ -10177 -3641 5418 10691 6867 -2664 -10005 -10124 -3582 5178 9190 5193 -3118 -8563 -7336 -557
290e57P517K517m466q119n343J750O610P211J672m956p308m005J765O369N695
$$ -557 6960 9477 5011 -3108 -8451 -6701 -91 7120 8792 3836 -3472 -7477 -5712 657 6352
305F352L66n328o078k805K331O808N091ln371o034k682L149O250L968p02m856
$$ 6352 6718 1390 -4688 -7493 -5162 1646 6737 6734 1363 -4671 -7353 -4204 2046 6014 5312 456
321D56m995j699L894N217L086j258n133m759j192M103N195K707j325m466m371
$$ 456 -4539 -6238 -2344 2873 5959 4701 -432 -5191 -6383 -2280 2915 5622 4297 -169 -4540
336d540P9L681M240J793j989m923l345N63M078L985J597k427m714k766N45L668
$$ -4540 -4461 -780 3460 5253 3264 -1659 -5004 -4441 -363 3622 5219 2792 -1922 -4688 -4143 -475
352d75L509R34k749m018k053K141L511L115J78k736l822j922J728L746K686Q1
$$ -475 3034 3968 1219 -2799 -4852 -2711 800 3915 4093 1357 -2465 -4387 -2659 1087 3773 3854
368C854k757l389q46J574L094K271p51l339k752n87J464L707J717j031k339k585
$$ 3854 1097 -2292 -3138 -1564 1530 3801 3050 -289 -3041 -3628 -2164 1543 3260 2229 -110 -2695
384b695o90J982K893J655j264k827j805o8K493K694J314j541k785j832%K399J961
$$ -2695 -3385 -1403 1490 3145 1881 -946 -2751 -2819 -326 2368 3682 2141 -644 -2476 -2476 -77 1884
401A884P87j217k252j703O17K116J763L51j436k521j630J352K025J616M21j195
$$ 1884 2671 1454 -798 -2501 -1884 232 1995 2346 910 -1611 -3241 -1889 136 1752 2173 978
417I78k586r00J470J546J650j13j628k443Q3R69J855J368p7j878j812k47J032
$$ 978 -1608 -2508 -1038 508 2158 2045 417 -2026 -1943 -974 881 2249 2172 294 -1518 -1765 -733
434g33J134J574n01j948j183L59R37J452J182p23k431p87K17N82J473J203q20
$$ -733 401 1975 1474 -474 -1657 -1298 -361 1091 2273 1550 -881 -1668 -1451 -869 604 1807 987
451I87j710l35q4Q29J434O68j569r45n58j1J329J477L55j406n59m79l50J065J373
$$ 987 -723 -1058 -1142 -313 1121 1789 220 -725 -1283 -1294 35 1512 1867 461 -98 -577 -927 138 1511
470A511m04j103p18k56PJ626N73o56n15p36q86K55J598M39m55l61o57l95O54J321
$$ 1511 1107 4 -714 -970 -963 663 1236 580 65 -671 -1557 -1302 296 735 280 -81 -738 -1133 -479 842
490H42K64o80m66n88l17Q73J239k29q3n77r13k96J017M53j41j39r22o38M94R15
$$ 842 1106 426 -40 -628 -945 -72 1167 938 855 278 -635 -931 86 539 398 259 -663 -1301 -807 108
510A08K64J81r5j095o47N60R79M15L29l85j218J2N65P12J75L31p06q80k41J13
$$ 108 372 553 458 -637 -1284 -724 255 670 999 614 -604 -592 -27 685 860 1191 485 -395 -636 -523
530e23R37J98L29r15q16K33m0N86M82o8r33m38K23O1J092N68m30m59n94M1M37
$$ -523 414 612 941 26 -790 -557 -597 -11 471 403 -530 -968 -745 -684 408 976 546 87 -507 -466 -29
551b9P06K67n70k66m76k34K90J039M3o43k83o61N4M94J018k48j94l96o34o6Q37
$$ -29 677 944 374 108 -368 -602 -312 727 770 127 -156 -817 -763 -269 749 501 307 -89 -723 -789 48
572D8O08k77k11l07j044N28Q96J83j73J62m06p20N70J91K87k59K37r11PK35O17
$$ 48 656 379 168 -139 -1183 -655 241 424 251 413 7 -713 -143 48 335 76 313 -598 -591 -356 261
593B61J21K83j84j014O9N94j17j35P79l29o62K86J58j63M29k13m22k06J73l4M7
$$ 261 382 665 481 -533 -464 130 13 -122 657 328 -334 -48 110 -53 376 163 -259 -465 -292 -326 -279
614b79N39j1m16N8Q7k4K3N39l58k63q1M38j66N6O12o20j55N5k97K12M77l22m50
$$ -279 260 249 -167 -109 -22 -46 -23 516 158 -105 -186 252 86 142 754 134 -21 34 -263 -51 426 104 -346
637c46k11M68k50K64K98j85n21M17P4r3M4J8K12j10k01K27l29N54J76j47l52N5
$$ -346 -557 -89 -339 -75 223 38 -483 -66 8 -85 -41 -23 189 79 -122 105 -224 330 506 359 7 62
659F2l77K29M21k4j28j02j12j46Q6R9q7q9J55k1%l7M43j33j99jj79K26j56M35
$$ 62 -315 -86 335 311 183 81 -31 -177 -91 8 -79 -168 -13 -34 -34 -71 372 239 40 39 -140 86 -70 365
683C65m0j0l06j46K14L47m4k23k1m11K14J30j08J05K04l31K7k89J75o4K44M6p5
$$ 365 325 315 9 -137 77 424 380 157 136 -275 -61 69 -39 66 270 -61 -34 -323 -148 -212 32 78 3
706Cp8M9k14K49K20Q9r0k97J25j39J06K4j56r4J10j22J05j5n4J48l5j86k25L12
$$ 3 -75 -26 -240 9 229 318 228 -69 56 -83 23 47 -109 -203 -93 -215 -110 -125 -179 -31 -66 -252 -477 -165
730a65J10o4K7J4J04j04r5K70j67K13j73J1l7L84k68K19k79k49K08J82l25L14
$$ -165 -55 -119 -92 -78 26 -78 -173 97 -70 143 -30 -19 -56 328 60 279 0 -249 -41 141 -184 130
752A30j18l7J86j38k8J7K70j13K6k43L8m8m7J33J49K3j19l33N6L57q1jk17m9J29
$$ 130 12 -25 161 23 -5 12 282 169 195 -48 -10 -58 -105 28 177 200 81 -252 -196 161 80 79 -138 -187 -58
777e8j9R8K01q4l98Q5J12N2O6J3J9j87jR0k6L00j93o0j75qJ96j29j92K21K93j89
$$ -58 -77 21 222 138 -260 -175 -63 -11 55 68 87 -100 -101 -11 -37 263 70 10 -165 -173 23 -106 -298 -77 216 27
803B7j77L09m76O54k71j17K45l53J57K33oN9k60r3J69j79O3j49J45j61l1R0j09
$$ 27 -150 159 -317 337 66 -51 194 -159 -2 231 225 284 24 -69 100 -79 -16 -165 -20 -181 -212 -122 -231
826b31K11J32J6j30n5l4N6l08M44j91K24l61L15j89P4O5p2l9J85n0m6N2P2J08
$$ -231 -20 112 128 -2 -57 -91 -35 -343 101 -90 134 -227 88 -101 -27 38 -34 -73 112 62 16 68 140 248
850B48o7j83L4K10j58j04Q9k48M7J64l16M08j4J58k10j13mQ7k56J02J47k27O7
$$ 248 181 -2 32 242 84 -20 69 -179 -132 32 -284 124 110 268 58 -55 -59 28 -228 -126 21 -206 -139
873a39O0k4M8K83p8p6r5j56J73N9j56K35j36J71Rj47J73m20J07Q4n4K49k22rJ80
$$ -139 -79 -103 -55 228 150 74 -21 -177 -4 55 -101 134 -2 169 178 31 204 -216 -109 -25 -79 170 -52 -61 119
898A19j73o9R7R9k66M04r2q8j21K4L4J4K07n8j89J81n6L0R1j83Q4r9j74Q2l1J05
$$ 119 -54 -123 -26 73 -193 211 119 31 -90 -66 -32 -18 189 131 -58 123 67 97 188 5 89 -10 -184 -102 -133 -28
924b8O2o3M6j08q3Q4J01Q2k11J63pJ59l19K38j24j3N7j76o%K35j89NL27l95nJ23
$$ -28 34 -29 17 -91 -174 -90 11 93 -118 45 38 197 -122 116 -8 -21 36 -140 -146 -146 89 -100 -95 232 -163 -168 -45
951d5K27l06JJ1m9J83j09L04l50O3L5j76K53j4j04J83k31Q4J91j81K64j34j43
$$ -45 182 -124 -123 -112 -161 22 -87 217 -133 -70 -35 -211 42 28 -76 107 -124 -40 151 -30 234 100 -43
974d3k9J47R0o1M2o6J20m10K00q9J87q3l9j40J89j52K72j61O4j78R5K61k20k72
$$ -43 -72 75 165 104 146 80 200 -210 -10 -99 88 5 -34 -174 15 -137 135 -26 38 -140 -45 216 -4 -276
998b76K27P8l1R8L5o9j05J90n3k12L1M9K3J41r5o3l4J17k52J18J91K1k70L24j70
$$ -276 -49 29 -2 96 131 62 -43 147 94 -118 -87 -38 -15 126 31 -32 -66 51 -201 -83 108 129 -141 183 13
1023A3j55Q4r9J90j56J12J91j17J02q9n7M3J88l98p0J45K40n4k92K05K23l01J54
$$ 13 -142 -58 -157 33 -123 -11 180 63 165 76 19 62 250 -148 -218 -73 167 113 -179 26 249 -52 102
1046A02j15n7k9J68j69O4m0J81K1P7l96J84nLM%o7l1J90M0m7j46k43M23q1n6j17
$$ 102 -13 -70 -99 69 -100 -36 -76 105 126 203 -193 -9 -14 -11 -7 -7 -74 -105 85 125 78 -68 -311 112 31 -25 -142
1073a42j59N28j25j43j55K40J56j95l4j64K19j70R1j09L62j34j70o7K02L2k36
$$ -142 -301 227 102 -41 -196 44 200 5 -29 -193 26 -144 -53 -162 200 66 -104 -171 31 63 -173
1094a73K71j33j55L07n5j58J49M9m7M8o5J05j45O0k3j47L03j63j36j05L93k2j50
$$ -173 98 -35 -190 117 62 -96 53 102 55 103 38 143 -2 58 35 -112 191 28 -108 -213 180 158 8
1117Hq8J76r3J52n76K46K43j77J28M0Oj33L1j37o1J71J60J65k76o3q3J51Q0o7
$$ 8 -80 96 3 155 -421 -175 68 -109 19 59 65 -68 -37 -174 -235 -64 96 261 -15 -78 -161 -10 70 3
1141CKM3O6j96J56l63K90J49j45p3J02M5j31l3K28J03k81M9k4P1l9O4o8J22k47
$$ 3 5 48 114 -82 74 -289 1 150 5 -68 34 79 -52 -85 143 246 -35 14 -10 61 22 86 18 140 -107
1166a07J13n5l8J2k02L14%k10L33q0N2q2n3n9J27P2k88J32J34k53J67j51J8j4
$$ -107 6 -49 -87 -75 -277 37 37 -173 160 80 132 50 -3 -62 65 137 -151 -19 115 -138 29 -122 -104 -118
1190a18Q6J30j64J85m1k05M16J9n60K79q0L15k01o6K7q1Q7JL0Q4J1j2k11J12j14
$$ -118 -32 98 -66 119 78 -127 289 308 -252 27 -53 262 61 -5 22 -59 28 29 59 143 154 142 -69 43 -71
1215g1J82l87K63j5j3K28k10O9N8N6K8m7l6oo8n4J56P7k51l0K25j53j28K9J5P1
$$ -71 111 -276 -13 -28 -41 187 -23 46 104 160 188 141 105 99 31 -23 133 210 -41 -71 154 1 -127 -98 -83 -12
1241a2k4j68J35k36L28r2J19j06Q7P4j74jJ17Q3l19J61l6K98q1m8q6j39J04N3
$$ -12 -36 -204 -69 -305 23 -69 50 -56 31 105 -69 -70 47 130 -189 -28 -64 234 153 105 19 -120 -16 37
1265C7J64q4j43J61k19pK37M8l50J43m7J4P4q7j24K46l34K59K13j73j86L0K20
$$ 37 201 117 -26 135 -84 -91 146 194 -156 -13 -60 -46 28 -59 -183 63 -271 -12 201 28 -158 -128 92
1288I2o3j29J98n7l07L08k0Mp2j42K49j74K88j32J11q3QJ03l23n5J87j53K60J16
$$ 92 29 -100 98 41 -266 42 22 26 -46 -188 61 -113 175 43 154 71 79 182 -141 -196 -9 -162 98 214
1312B14l83K67j34K97j85j16k5R7j64J91J05l71J76l8kN5p1L7k1J43K2p4j98J94
$$ 214 -169 98 -36 261 76 -40 -65 32 -132 59 164 -207 -31 -69 -71 -16 -87 -50 -71 72 94 20 -178 16
1336A6k57M41k42j9j0Q5r4j35Q3L4N6K7l4K21l09J39R1J6j48J17P9q6n1m6J64
$$ 16 -241 200 -42 -61 -71 14 -80 -215 -132 -98 -42 -15 -49 172 -137 2 93 109 -39 78 157 71 20 -26 138
1361A38n7J9r3j07L5J73J9j30j18K88m6j6j39m0OL13k12L7o6R2j06K57l66K54
$$ 138 81 100 7 -100 -65 108 127 -3 -121 167 121 105 -34 -74 -68 245 33 70 4 96 -10 247 -119 135
1385A35j5k80O2J57K82j74ol61N67n17K35j6j24J84l13q3J14K14l0P8k60M0O05
$$ 135 120 -160 -98 59 341 167 161 -200 367 -150 85 69 -55 129 -184 -267 -153 61 31 109 -151 -111 494
1408D94n35Pl1J38j76mL30j6k8k63J26J15j30OR3n2k05R1j80K65j47M9j25M9R2
$$ 494 -41 -34 -65 73 -103 -107 223 207 179 -84 42 157 27 33 126 74 -131 -40 -220 45 -102 -53 -178 -129 -37
1433c7K2l60L63L0l9J11r9j08J73k05L43j07n5M0L8j66K4Q7k32K35J02k09m2Q8
$$ -37 -15 -375 -12 18 -21 90 -9 -117 56 -149 194 87 32 72 110 -56 -32 55 -177 58 160 -49 -91 -3
1457cO2j39j43K71k08K23j90M0K43k31q3K33J60j86n4j06j01K00J47k21pL23l07
$$ -3 59 -80 -223 48 -160 63 -127 -87 156 -75 -158 75 235 49 -5 -111 -212 -12 135 -86 -93 230 -77
1480g7L35k13l39J58L41j76j31R1O3P9l72L84j12n1R1j85K28k00O8K32k35m4p2
$$ -77 258 45 -294 -136 205 29 -102 -11 52 131 -241 143 31 -20 71 -114 114 -86 -18 214 -21 -65 -137
1503a37L6J37r0j5J39j10J02r0P9o2j73J08K58j84k9J11j46m1J84J26j83m7%M6
$$ -137 -101 36 -54 -69 70 -40 62 -28 51 -11 -184 -76 182 -2 -31 80 -66 -107 77 203 20 -27 -27 19
1527A9L2O1m0J04l5j63j21k80N74p5l2J39j07j80R3OR3j80j0Q3J23j13P8j02J64
$$ 19 51 112 72 176 141 -22 -143 -423 151 76 44 183 76 -104 -11 -5 88 -92 -102 -19 104 -9 69 -33 131
1552A31j91R2o3N4M1j44j5L07j80n4M1kK97l05jk62M12k46m6L53k07m3j32L7J19
$$ 131 -60 32 -31 23 64 -80 -95 212 32 -22 19 17 314 9 8 -254 158 -88 -134 219 12 -31 -163 -126 -7
1577gK05k16J67K4l46K74Kj6k42M80l75j24K85j30k99J45J01K30l10K06pJ77k17
$$ -7 198 -18 149 173 -173 101 103 87 -155 325 -50 -174 111 -19 -318 -173 -72 158 -152 54 47 224 7
1600Gj40J73j46K25q7K7Q4j63K1J62j32r7J12q7j36J81j69J26o7o8M4K5J3j37
$$ 7 -133 40 -106 119 32 59 143 -20 1 163 31 -66 46 -41 -177 4 -165 -39 -106 -174 -130 -105 -92 -229
1624b29J72L3o3Q2j0O1r8K11k40K29j36J5P5j33J4K6nj23O0K64j00k39J69r6k5
$$ -229 -57 -24 -87 -5 -15 46 -52 159 -81 148 12 27 102 -31 -17 9 4 -119 -59 205 105 -134 35 -61 -86
1649h6O2j2p4K98J24p4k41m2J05j4J68l05L37k53j16j0J4J61O6j49j5l8k4J47
$$ -86 -24 -36 -110 188 312 238 -3 -45 60 46 214 -91 246 -7 -123 -133 -119 42 108 -41 -56 -94 -118 29
1673B9M7j68n2P9J13o9J65P5o6k15j09N2j75J11J53L0J30j87O1J3O2o6J07j33
$$ 29 76 -92 -144 -65 48 -21 144 219 153 -62 -171 -119 -294 -183 -30 0 130 -57 4 17 79 13 120 -13
1697a3J17k2j44J48l1o3J0J7J15k43l5J24j3o2J42O3n2Q1j23L30N8n23J76K02
$$ -13 104 82 -62 86 55 -8 2 19 134 -109 -144 -20 -33 -95 47 110 58 139 16 346 404 -119 57 259
1721B59k54r5p6J02J63j12k07L88m06J24J5J74j01J08k87R8N2J53j96j35L37j78
$$ 259 5 -90 -166 -64 99 -13 -220 168 -238 -114 -99 75 -26 82 -205 -107 -55 98 -98 -233 104 -74
1743g4L9k05K23K49k06J0j16L11l56K34Ln0j67N7rO3OJ24k21PP9O8j62J8Q2K3
$$ -74 -35 -240 -17 232 26 36 -80 231 -125 109 112 62 -105 -48 -57 6 12 136 -85 -78 1 69 -93 -75 7 30
1769C0M5k8j77J61K3k38K44k61L56l54L66q7L1n6N2n1k71J28K31q1k03R3k55K17
$$ 30 75 47 -130 31 54 -184 60 -201 155 -199 167 80 111 55 107 56 -215 -87 144 63 -140 -47 -302 -85
1793h5j4J47j8k32J29K31K3k08k3K3K2J0M0k98K29k0lJ26Q0k3k06K73l00K73k32
$$ -85 -99 48 30 -202 -73 158 181 -27 -50 -27 -5 5 45 -253 -24 -44 -47 79 159 136 -70 203 -97 176 -56
1818e6J21J20l32L2K76k55R2P6l53L19J4K6qj3R3k60K35k0j36k6QP4P7k27O0J84
$$ -56 65 185 -147 -115 161 -94 -2 74 -279 40 54 80 72 59 152 -108 127 107 -29 -55 -47 27 104 -123 -63 121
1844A21o1j51M1j0J33r4k4N6J5K15rl52J15k13L23p7j62J13L31k80n3J64m9m04
$$ 121 60 -91 -50 -60 73 -21 -45 11 26 241 232 -120 -5 -218 105 28 -134 -21 310 30 -23 141 92 -312
1868c12L04j35K78j01j8P4r2m1j1k08K07jJ1k03M40k38jj7j04O1K51j21k4l41
$$ -312 -8 -143 135 34 16 90 -2 -43 -54 -262 -55 -56 -45 -248 192 -46 -47 -64 -168 -107 144 23 -1 -342
1892c42K25J61l15L8M74l08r7K8K00J6l9n7o9J58Q5J90l66p2J95o5J07k20n1O7
$$ -342 -117 44 -271 -233 241 -67 -164 -136 64 80 41 -16 -85 73 158 348 -18 -90 105 40 147 -73 -124 -57
1916e7j8K15l5r1N8Q8j26J5J20k47J99k93K65k4J26l27J76j17QO4J15l4r5J62
$$ -57 -75 140 105 14 72 160 34 49 169 -78 121 -172 93 69 195 -132 44 -73 -65 -1 114 80 -15 147
1940A47p3j52N9pkk5L21L6l41L0K18k22K16j16J3p6j00J61k22K59k69K38j01O7
$$ 147 74 -78 -19 -26 -28 -53 268 304 -37 -7 211 -11 205 89 102 26 -74 87 -135 124 -145 93 -8 59
1964E9j70J42j28j23K17m8%J38L2j2m0l8j67L89J9m21J02Q7L6j48r4K15j64L14
$$ 59 -111 31 -97 -220 -3 -51 -51 87 119 107 67 29 -138 251 270 -151 -49 38 74 -74 -168 47 -117 197
1988A97k79J6K05m5o5l01K02K29k33M7O5j27j75K93K35k49j22nL38k49N8J8k5
$$ 197 -82 -66 139 94 29 -272 -70 159 -74 -27 38 -89 -264 29 264 15 -107 -112 226 -23 35 53 28
2011B8r7K10r0j27J11R1k1l29M94j36m0N8k42qM8J83j81nKK62j06j5l70J34o6
$$ 28 -69 141 51 -76 35 126 105 -224 270 134 94 152 -90 -98 -50 133 -48 -53 -51 211 105 90 -280 -146 -212
2036b12p5N03k30r5J04K24l28K79j75r8M61n42M8O2J32m6J83k16J79k80j5J43
$$ -212 -287 216 -14 -109 -5 219 -109 170 -5 -103 358 -184 -136 -74 58 12 195 -21 158 -122 -137 6
2058Fk32L10l16K40Q3j28K5k19RK42j6j45J36j97J62J31N0j45n6ol0J3M12n31
$$ 6 -226 84 -232 8 91 -37 -12 -231 -222 20 4 -141 -5 -202 -40 91 141 -4 -60 -66 -96 -83 329 -202
2082b02K42J11l46R1J07l13J80J40K2J85k73j21mK16N0n9j10J45r7j85O1p9J45
$$ -202 40 151 -195 -104 3 -310 -130 10 32 217 -56 -177 -181 35 85 26 -84 61 -36 -221 -160 -239 -94
2105i4J77q4j17j3Q5K3M2j2J00L1k40J78l09K75j9p1K17l20K44k29R1p7O3j91
$$ -94 83 -1 -118 -131 -46 -23 19 7 107 138 -102 76 -233 42 23 -48 169 -151 93 -136 -45 -122 -59 -250
2129b50L04j08K7j10N0J95k1J57j24j07j1R2j6j36j50RK64j05J0M3J51l95K89
$$ -250 54 -54 -27 -137 -87 108 87 244 120 13 2 94 78 -58 -208 -199 65 -40 -30 13 164 -231 58
2152E8P5r0k68M07r1k56Q5p5J53j16K22j43q4L08L5k41p8O6Q7L0j11k4K07m04
$$ 58 133 43 -225 182 91 -165 -80 -155 -2 -118 104 -39 -123 185 220 -21 -99 -33 54 84 -27 -51 156 -248
2176b48J86J32r0m6K23k25J1J39k06J52p3L6L3M4Q3n6J08k34M5J6j20M3q2J26
$$ -248 -62 70 -20 -66 157 -68 -57 82 -124 28 -45 -9 24 68 151 95 203 -31 14 30 -90 -47 -129 -3
2200cJ17l8mk27m6R9J10J10j2j85J82mj91P6m3p0J25n3kK49l54M22j80M5o4q3
$$ -3 114 76 72 -155 -201 -102 8 118 106 -79 103 99 -92 -16 -59 -129 -4 -57 -59 190 -164 258 78 123 59 -24
2226b4j1L2l1J32J69j13k60O8L3k8j61K51j10l1q9k0J55RM0N9l9j57Q4J06j17
$$ -24 -35 -3 -34 98 267 154 -106 -38 -5 -33 -194 57 -53 -84 -173 -193 -38 -29 11 70 31 -126 -42 64 -53
2251e3L15k57n6j20L0r3L73p4n6r2J3J98q1q9J84j06p9J67k47K79j74Q2j53L5
$$ -53 262 5 -51 -171 -141 -234 139 65 9 -83 -70 128 47 -42 142 36 -43 124 -123 156 -18 64 -89 -54
2275e4J62j18J7J06K4p0j15J10l6P1j64o3L31k98J50J3K4j25J25r3n7L17j47j00
$$ -54 108 -10 7 113 137 67 -48 62 26 97 -67 -130 201 -97 53 66 90 -35 90 -3 -60 257 110 10
2299A0J08k01J1J72j28j52J33Q6n4O6j62L53p3k6j67o7J05n5J37p3k41K37k5j33
$$ 10 118 -83 -72 100 -28 -180 -47 39 -15 51 -111 242 169 143 -24 -91 14 -41 96 23 -218 19 -6 -139
2323a39L7j41J59L5J14j80L64l62J31q3J62k00J58kj28Q4j40L23r8j25j37J08
$$ -139 -102 -243 -84 -49 65 -115 249 -113 18 -65 97 -103 55 53 -75 9 -131 192 94 -31 -168 -60
2345f0L2P5o9K13l15N5J08J17m7j55K4Q6j17J8P0J67k01k64J43o6J47N4j18J06
$$ -60 -28 47 -22 191 -124 -69 39 156 109 -46 -22 64 -53 -35 35 202 1 -263 -120 -186 -39 15 -103 3
2369CJ8j64J95O7k71J36K17k59o2J29r1J37o0M6P8J15l4k80k6Qr4O5J79%o7ol4
$$ 3 21 -143 52 119 -152 -16 201 -58 -120 9 -82 55 -5 41 119 234 200 -80 -106 -98 -192 -127 52 52 -15 -21 -55
2396e5R0k90J55j48K12J05r1K30l08K80k34J9m4K1J13M8l7k45q1L09K6q4j9Rj8
$$ -55 35 -255 -100 -248 -36 69 -22 208 -100 180 -54 -35 -79 -58 55 103 66 -179 -260 49 75 -9 -28 -19 -37
2421c7P0L7m1P9J8Ko3kl0m6j38J83j82J49J01j80J90J22k41J28q8J64l32K52K6
$$ -37 33 70 29 108 126 128 65 63 33 -13 -151 32 -150 -1 100 -80 110 232 -9 119 31 195 -137 115 141
2446A41l75L84L1k37m4O8M9J58o1j06p5J48Mk06lL86j33lJ08j11J9j32K50m52
$$ 141 -234 150 181 -56 -100 -32 17 175 114 8 -67 81 85 -121 -124 262 129 126 234 123 142 10 260 -192
2470a92K01k4P6q2q4q9K67j91K23k0J40l03N9J33M5n00L27q1J53J56r2p2J7O7
$$ -192 9 -15 61 -21 -105 -194 73 -118 105 85 225 -78 -19 114 159 -341 -14 -95 58 214 122 50 67 134
2494A34p1j00J48j67P0j04r7K93k7J60k44K05l83J94R2r8J99l01n2L03q4j29M5
$$ 134 63 -37 111 -56 14 -90 -187 106 79 239 -5 200 -183 11 103 5 204 -97 -149 154 70 -59 -14
2517a4k16R5j15J04K02No8O8K5k6J20k86O0J11l99L14kN2P7J5J41m69L42k51O8
$$ -14 -230 -135 -250 -146 56 61 -7 61 86 60 180 -106 -46 65 -334 -20 -22 30 107 122 263 -206 136 -115 -47
2542d7k2l7Q7P0k79J47k72M19M2j40J35r9j2rj0J14R5j44J75k62J77j34n0j5j12
$$ -47 -69 -106 -19 51 -228 -81 -353 66 108 -32 103 4 -8 -17 -27 87 182 38 213 -49 128 -6 -56 -71 -183
2567a83L36k49K41j14k10J47J69n4m72K68J78n8j20J15k1J74k21K1K67m6m69P0
$$ -183 153 -96 145 31 -179 -32 137 83 -389 -121 57 -1 -121 -6 -27 147 -74 -53 214 168 -301 -231
2589b31L49k30M3p8J94j80k18J44K61n8N2K37j75o4r8K35k46J0J42k05J75q9l2
$$ -231 118 -112 -69 -147 47 -133 -351 -207 54 -4 48 285 110 46 -52 183 -63 -53 89 -116 59 -30 -62
2612f2J50j3q6M1m5J04j64J93j55K8n5L4J41Nr8j92J21O6j94l4J57K28k35J33
$$ -62 88 75 -11 30 -15 89 -75 118 -37 -9 -64 -30 111 116 18 -174 -53 13 -181 -215 -58 170 -65 68
2636F8q3l16L07%k6K75k7k00j9K34k70J85J44J47m27L6q0J83l47K67j38L60l62
$$ 68 -15 -331 -24 -24 -50 225 198 -2 -21 213 -57 128 272 419 -8 28 -52 131 -216 51 -87 273 -89
2659h9o7J96R6k3l3p6k81L47j60K49k08k00J37m3K45Pj37J15j77J69nj53J00M4
$$ -89 -156 40 136 113 80 4 -277 70 -90 159 -49 -249 -112 -155 90 97 -40 75 -102 67 62 -91 9 53
2683E3k6j75R8j74K17n2K32k16J04R3k51N5k11K72Q3j46J60K4k0l60M12l18K93
$$ 53 27 -148 -50 -224 -7 -59 173 -43 61 154 -97 -42 -253 19 102 -44 116 140 120 -240 172 -146 147
2706A47j59L6J84k04k9J15j12J18j18j10J09j33J47J21j08L8Q5r4O6kj15K29p3
$$ 147 -12 24 208 4 -25 90 -22 96 -22 -132 -23 -156 -9 112 4 42 127 33 99 97 -18 211 138
2729A38j79L8J46j5L3N9l22kj12K11K00k93J44j6k16J30J37j7L5j09L2o2K6n2
$$ 138 -41 -3 143 128 161 220 -102 -104 -216 -5 195 -98 46 30 -186 -56 81 64 99 -10 22 -40 -14 -66
2753f6J67J9K1M5k08K33m6j93m5J97N3Oj93j04J32P8Nj00k60M75n4l37R1J59l79
$$ -66 101 120 141 186 -22 211 165 -28 -73 124 177 183 -10 -114 18 96 101 1 -259 216 162 -175 -84 75 -304
2778c04K44J48k50Q1K86m25K20j5m0N9N0J61k46K71j68j73P0j4Q9j35J85k72l3
$$ -304 -60 88 -162 -81 205 -220 0 -15 -55 4 54 215 -31 240 72 -101 -31 -45 44 -91 94 -178 -211
2801b11K53j11j80K33Q4j89L18k35J85l30J29J25o9j28J82K4K7n7p1o2j75L07
$$ -211 42 -69 -249 -16 68 -121 197 -38 147 -183 -54 71 2 -126 56 80 107 50 -21 -83 -258 49
2823D9j77O9L3O1j47J27o2J8o4j45J21l6K20q3k02K34p2J80J04j91r6r3L4J13
$$ 49 -128 -59 -26 35 -112 15 -47 -29 -93 -238 -117 -153 67 -16 -218 16 -56 124 228 37 -59 -152 -118 -5
2847en9PJ97m01K43J85l6j80O4J67q5K52l66r7p4R7J50L0q3j6M3k70K26j62MK16
$$ -5 -64 -57 140 -261 -18 167 131 -49 15 182 97 349 -17 -114 -188 -91 59 89 6 -10 33 -237 -11 -173 -169 47
2873D7k86K43j8j70J76j37OK40k00K81j83n7N4q3K03j33j53J56J10r7J33k88J27
$$ 47 -239 4 -14 -184 -8 -145 -139 101 -99 182 -1 -58 -4 -87 116 -17 -170 -14 96 -1 132 -156 -29
2896b9M2Q1k04nJ09j2k0O7m2J31rj30M8P8j32O7R8j45l4J03k64L02J3k64L1j92
$$ -29 13 94 -110 -115 -6 -18 -38 29 -13 118 109 -21 27 105 -27 40 138 -7 -41 62 -202 100 113 -151 -120 -312
2922c12K3J00L08j90K00J0j29K9K66l20p2j86J68J42n6j56L26j58K3J25q7n2M5
$$ -312 -289 -189 119 -71 129 139 10 39 305 -15 -87 -273 -105 37 -19 -175 151 -7 16 141 54 2 47
2945D7j3j08Q0j06J97J8k06J89l0J03r9k20l5K01q1J82l5j03r2N9L34m44J1l3
$$ 47 34 -74 6 -100 97 115 -91 98 68 171 72 -148 -183 18 -63 119 84 -19 -111 -52 282 -162 -151 -184
2969a84M52j72j01Q4j35J58N9k69J05k72K39J53k59J00k71J46J69nL29l55K7Q
$$ -184 268 96 -5 79 -56 102 161 -108 -3 -275 -36 117 -142 -42 -313 -167 2 -3 326 -29 -2 6
2991FmqJ42k23R2J73l19J71n2j27J9J23J95l89OJ10J03l1L5j21K36k04J41K1J5
$$ 6 2 -6 136 -87 5 178 -141 30 -22 -149 -130 -7 188 -201 -195 -85 18 -13 22 -99 137 -67 74 95 110
3016A10L1m4k92K16j4j34O6kj7J09rj14L00o3j67p1K41l13L17j44L3l4K24k56
$$ 110 141 97 -195 21 7 -127 -61 -63 -80 29 20 -94 206 143 -24 -95 146 -167 150 6 39 5 229 -27
3040b7J41j92N2j91K08K1j74J53O1J60O9n84J43K00l30L11P4o3m6O6M7j66N3k66
$$ -27 114 -78 -26 -217 -9 12 -162 -9 52 212 281 -303 -160 40 -290 21 95 32 -14 52 99 -67 -14 -280
3064b80J65Q8M9j4J52m4k10j17K00J89j26K56j21q5m1j72Q3lk7j49P0J64K59l30
$$ -280 -115 -27 22 8 160 116 -94 -211 -11 178 52 308 187 102 61 -111 -28 -31 -58 -207 -137 27 286 -44
3088d4J61n0j68K50l47J47j04J12K81j58K75k12m46J87J64j79r3K39J07m05L47
$$ -44 117 67 -101 149 -198 -51 -155 -43 238 80 355 143 -303 -116 48 -131 -224 15 122 -283 64
3109F4j85J50j39K06J16j47j8J54j34j2p0K62Pj96k9o7K17l04R5J37j00K7j5l3
$$ 64 -121 29 -110 96 212 65 47 201 67 55 -15 247 254 58 29 -38 179 -125 -30 107 7 34 19 -14
3133a4R8r1O3j65n5n0J63J3J48r9N3k01P8K24k06j40L87q7k07J55j05K1Q2j58
$$ -14 84 -7 56 -109 -164 -214 -51 -38 110 11 64 -137 -59 165 -41 -181 206 119 -88 67 -38 -17 65 -93
3157i3j94J53K48k00qJ44j17J49r2K30l73m3J35M1M9k64J18O5J94j60k20K74O7
$$ -93 -287 -134 114 -86 -94 50 -67 82 -10 220 -153 -196 -61 -20 29 -235 -117 -52 142 -18 -238 36 103
3180A03j40n3l4K77l40K8Q5Pq1L34k85M9J53J6k4k9%q8n7p1L9K85l93J85l0J90
$$ 103 -37 -90 -124 153 -187 -159 -74 -67 -148 186 -99 -50 103 119 95 66 66 -22 -79 -150 -111 174 -219 -34 -64 126
3206A26k63J71j0Np6p7j11L04r7k00J49K63P2l50K50k0k84J55K6j62J55K06j91
$$ 126 -137 34 24 29 -47 -124 -235 69 -28 -228 -79 184 256 -94 156 136 -148 7 33 -129 26 232 41
3229D1l47J41PL49k67Q5Q2k33J74m04K91J23m6j12oJ81N6j99K35j04o9l5J84k71
$$ 41 -306 -165 -158 191 -76 9 91 -142 32 -372 -81 42 -4 -116 -122 59 115 -84 151 47 -22 -57 127 -144
3253a44J09Q6j71Q5J40j10j57L1J25m6N6J6K23n58K60N0K53j66Nj74P3J38j63
$$ -144 -35 51 -120 -35 105 -5 -162 -131 -6 -52 4 20 243 -315 -55 -5 248 82 87 -87 -14 124 -39
3276c9J70j94j5l8M29m28J03j02J09K31j96r2J1l3Q3oJ30l04M6P8J46j5j84K19
$$ -39 131 -63 -78 -116 313 -115 -12 -114 -5 226 30 -62 -51 -84 -1 -7 123 -181 -135 -57 89 74 -110 109
3300A09r4O5j85p2k1K19J31j65P3J26l61K97J4J27l78Q7l6K75l89K3K35k29nJ2
$$ 109 15 80 -105 -177 -198 21 152 -13 60 186 -175 122 136 263 -115 -28 -64 211 -178 -155 80 -149 -154 -142
3324a42L2K23k02L31j44R0j29J84j35Q2m03N7o6L10o8J77J0k49o5J60J40k45R0
$$ -142 -110 113 -89 242 98 188 59 243 108 190 -213 -156 -222 88 20 197 207 -42 -107 53 193 -52 38
3347C8j63J52q9L7p2M4o7J60n8J15k79Q3J16J96k73lK23j31P8j0P2k06j69K27
$$ 38 -125 27 -62 -25 -97 -53 -120 40 -18 97 -182 -99 17 213 -60 -63 160 29 107 97 169 -37 -206 21
3371B1p9K10j72l5J04j62J6k08L82j27K79l37K45k82K06j16J56p2m0j6R1l19J88
$$ 21 -58 152 -20 -55 49 -113 -97 -305 77 -50 229 -108 137 -145 61 -55 101 29 -11 -27 64 -255 -67
3394f7K36k30o6K35k45L49j94j50J33K42l80K16M4O7k30J45l78J60j50K94N8o5
$$ -67 169 -61 -127 108 -137 212 18 -132 1 243 -137 79 123 190 -40 105 -273 -113 -263 31 89 24
3416B4j55K53j17l5K76k21J36j73l3m9K26j96K75j78JJ27q4K0l52L38p5j93%K15
$$ 24 -131 122 5 -30 246 25 161 -12 -45 -94 132 -64 211 33 34 161 77 97 -255 83 8 -185 -185 30
3440C0j65J73j32K70r5j2O9k17K12j33j00J37Lk9k3k93L84k41K56j91K24M3m30
$$ 30 -135 38 -94 176 81 69 138 -79 133 0 -100 37 40 11 -12 -305 79 -162 94 -97 127 170 -260
3463b60L75p3p8o7K78l33L57j84j06J85k19J20o0j9o9N3J10L21l46j10J72l2j28
$$ -260 115 42 -36 -103 175 -158 199 15 -91 94 -125 -5 -65 -84 -153 -100 10 331 -15 -125 47 15 -113
3486a13R6J88l01K7K53l0J90j68m2J01pn3j55O1q0N8m5K32k11q1l4N0K07k36p9
$$ -113 -17 171 -130 -103 150 120 310 142 100 201 194 141 -14 47 -33 25 -20 212 1 -80 -114 -64 143 -93 -172
3511a72J95J11K15n44K70J43q1k12r2K41p1J51j96k03K14K0q8L1RJ1k8p0O5M3
$$ -172 23 134 349 -195 75 218 137 -75 -167 74 3 154 -42 -245 -31 -11 -99 -68 -59 -48 -76 -146 -81 -38
3535c8J80o3R2j8j03k36K05J0q7k41K65M4J8r2k9O5J1J86j81N4q2R9k02K76k68
$$ -38 142 79 171 153 50 -186 19 29 -58 -299 -34 10 28 -64 -93 -28 -17 169 -12 42 -40 59 -143 133 -135
3560a35L03k5j41o3J14j5n1K9o4Jj38J05J43o7J42k64J29l0k45K05j20N95m75
$$ -135 168 143 2 -61 53 38 -13 16 -48 -47 -185 -80 63 -4 138 -126 3 -27 -272 -67 -187 408 -67
3583f7J00j15J79n8J02K4j17J8M1m58L06K93k23%J29j17P1k8r6P9L0M0k41K92
$$ -67 33 -82 97 39 141 165 48 66 107 -351 -45 248 25 25 154 37 108 80 -16 63 93 133 -108 184
3607A84j20j40R9k09K13k18J89K7j28j3J62k31L98m54J37Q3j59K41j44N3M52m75
$$ 184 64 -76 23 -186 27 -191 -2 25 -103 -116 46 -185 213 -241 -104 -21 -180 61 -83 -30 422 -53
3629e3j20K92j94J20j54J17Q3Q8k63K75j13J15j64O3p5n8J91j24J66j29l1R6k87
$$ -53 -173 119 -75 45 -109 8 91 179 -84 191 78 193 29 92 17 -41 150 26 192 63 32 128 -159
3652a59K50o9j92L10j99j15K5M7m8L32j31l2J9k27L36m6Q2j04j95L02k22M9j39
$$ -159 91 22 -170 140 -59 -174 -149 -102 -150 182 51 19 38 -189 147 101 183 79 -116 186 -36 13 -126
3675a26J26K21j20p8P4j70J37L3J8N7k36J56k91J57J6p8J53p6k8PJ92k99j4K15
$$ -126 0 221 101 23 97 -73 64 97 115 172 -64 92 -199 -42 -26 -104 49 -27 -55 -48 144 -155 -169 46
3699D6P0m7k61O1j70J03M32j53J4M2p7N0j40L26k02o1j27P7j00J59J69o5k84j6
$$ 46 116 69 -192 -131 -301 -198 234 81 95 137 60 110 -30 296 94 33 -94 -17 -117 42 211 146 -138 -154
3723a54J9O4k15N59l84K00K7J06j70k15K55j21K0J18j46R0p3J87k26N9j0n6J89
$$ -154 -135 -71 -286 273 -111 89 116 222 52 -163 92 -29 -9 109 -37 53 -20 167 -59 0 -10 -66 123
3746A23j95j03O6M1K57p3j81R6J28k54J68k75K96J40k73N5q6j36J89j07J14N9
$$ 123 -72 -175 -109 -68 189 116 -65 31 159 -95 73 -202 94 234 -39 16 -70 -206 -17 -124 -10 49
3768D9r8N8L9k2j6J10j3j62J23l20J31r8J92L33m35J21j05P2K14k72j05J60J59
$$ 49 -49 9 48 26 10 120 107 -55 68 -252 -121 -219 -27 306 -129 -8 -113 -41 173 -99 -204 -44 115
3791A15r5o9K41r2o2K78m45K73m7k00K28k45M00k31j41L1N3k23L70R7k44l6j12
$$ 115 20 -49 192 100 38 316 -129 144 97 -103 125 -120 280 49 -92 -61 -8 -231 139 236 -8 -44 -156
3814a56J23r3k7L18j32K1J44k02p0J48n3Q7R6k34K49mj67j53l1L02q2j55J48P5
$$ -156 -33 -126 -153 165 33 54 198 -4 -74 74 21 108 204 -30 219 215 48 -105 -136 166 84 -71 77 152
3838A52J06k13J9j79L30k82m0N0J41j9j40O1m3J28q6K27m92L37j7K8o4K3m6l6
$$ 152 258 45 64 -115 215 -67 -107 -57 84 65 -75 -14 -57 71 -15 212 -280 57 40 68 4 27 -19 -55
3862e5P6n2K7l85M18j25j50K95J17k02oK76k43P1N4N6j06j07J27j04LJ93j72p9
$$ -55 21 -31 -4 -389 29 -96 -246 49 166 -36 -42 234 -9 62 116 172 66 -41 86 -18 -15 178 6 -73
3886g3K00k14k0N8MQ6K3j56L04l12L38k60K5k27M52r2l2m8n3p2J37k78L60p2k51
$$ -73 127 -87 -107 -49 -45 41 64 -92 212 -100 238 -22 3 -224 228 136 104 56 3 -69 68 -210 150 78 -173
3911a73K7K9J26j90K70J6k50Q2K30k98J98k09M74l83j07K59n6J34J56k01L7l40
$$ -173 -146 -117 9 -181 89 105 -145 -63 167 -131 67 -142 332 -51 -158 101 45 179 335 134 171 -169
3933a69K07p4O2m9j5M9k7K79m64r9K51j91J37PJ4q7L30k21J50jk13n2j14L59n
$$ -169 38 -36 26 -23 -38 11 -16 263 -201 -300 -49 -240 -103 -96 -82 -169 161 -60 90 89 -124 -176 -290 69 64
3958F4L2k68J51N7l5KK31j76K28l99K0l6Q0K68j35j36K38j50k50L09j75O7p6O4
$$ 64 96 -172 -21 36 1 3 234 58 286 -113 -93 -129 -49 219 84 -52 186 36 -214 95 -80 -13 -89 -25
3982b5j40K63j49J90r5j97J06J01p9m28O33j47K02k41r1lJ94m6l01L24j32Pj2
$$ -25 -165 98 -51 139 44 -153 -47 54 -25 -453 180 33 235 -6 -97 -100 94 48 -253 71 -61 -54 -66
4005f6J75j49q7L24l23M29l30R5j50Q1K70k57J51k20j63N5K16K03J41n01k26M21
$$ -66 109 -40 -127 197 -126 303 -27 68 -82 -1 269 12 163 -57 -220 -165 51 254 395 -106 -332 89
4027H9J85j30l40J00Q5m0J03l14J82n4K33MJ6j26j43L27m83M85m0n5k60qj4J46
$$ 89 274 144 -196 -96 -11 -51 52 -262 -80 -134 99 103 119 -7 -150 177 -306 179 139 84 -176 -184 -198 -52
4051e2M1r0K78Ok20j18J55J97r6j56M62m72q7L2K42j87k3rJ12J34l6j11j24J36
$$ -52 -11 -101 177 183 -37 -155 0 197 101 -55 407 -65 -152 -120 122 -65 -88 -97 15 149 113 2 -122 14
4075A4L5j44R8R1k2n2l38M16j86K50k65k6K73m40M16l40J0L81k74K64k6j72o8
$$ 14 49 -95 3 94 72 20 -318 98 -88 162 -103 -129 144 -296 120 -220 -210 171 -103 161 135 -37 -105
4098a05K64k78K30j64J73ml69K00k58K98R1L0O0j47kj27p1j24L06l7J37k7j02
$$ -105 159 -119 111 -53 120 116 -253 -53 -311 -13 78 108 168 21 19 -108 -179 -303 3 -34 103 76 -26
4121b6l8Q2k09J66J27K6j43J10j80O7J05R3k61L07k40Q3j27m3r5K03j6J54j06
$$ -26 -64 18 -191 -25 102 128 -15 95 -85 -18 87 180 -81 226 -14 69 -58 -101 -196 7 -9 145 39
4144C9J4M5r2K25j96k29L76p3k98K40j79J12j5P5n8k73K20K00j99j3P3j8J52k29
$$ 39 53 98 6 231 35 -194 182 109 -189 51 -128 -16 -31 44 -14 -287 -67 133 -66 -79 -6 -24 128 -101
4168a01K63j55j09R2q1R2J76k7n9j55P0j11J34P3o4j54K64l77J17J84j7K0p1J26
$$ -101 162 7 -102 -10 -91 1 177 150 91 -64 6 -105 29 102 38 -116 148 -229 -112 72 55 75 4 130
4192A30p8j14m0J13o9N1K8No6p0J42pP8m16J63L80m78K28M6q5J9K31j20j54P7
$$ 130 52 -62 -102 11 -58 -7 21 26 -40 -110 32 25 103 -313 -150 230 -248 -20 26 -59 -40 191 71 -83 -6
4217fOJ85R4j57o0j3L9j70P4N8P4J49n38K59j02m1L04m51L47j84K85j19l23J02
$$ -6 0 185 279 122 62 49 88 -82 -8 50 124 273 -265 -6 -108 -149 155 -296 51 -133 152 33 -290 -188
4241a88L19l39O9L6J27P4K27k45Q2k68o4J23J81r0r2J28r6J57n10K50J00K21k74
$$ -188 131 -208 -139 -103 24 98 325 80 162 -106 -170 -47 134 44 -48 80 -16 141 -369 -119 -19 202 -72
4264g2K86j75j35QJ20Jq0L98j68k79K20p9n9R5k89K81q1Po8J72J36n9k51J32j56
$$ -72 214 39 -96 -88 32 33 -47 351 183 -96 124 45 -14 81 -208 73 -8 -1 -69 103 239 180 -71 61 -95
4289i5K21p8j08L1j29J39P9k6N1j40l28M61k16Q6J01m5l5N4j14O0K2J09j69K48
$$ -95 126 48 -60 -29 -158 -19 60 34 85 -55 -383 78 -138 -52 49 4 -31 23 -91 -31 -9 100 -69 179
4313A79j56j09J79j34l9J64m2k82K67J16J50k85M4j02J65k00j14j54M03n9j42
$$ 179 23 -86 93 -41 -80 84 42 -240 27 143 293 8 52 -50 115 -85 -199 -353 50 -9 -151
4334a51j9J34L37m17R7j46K51r1J88k29Jl0M3K34k43J16O4j70K78m18j26M8K87
$$ -151 -170 -36 301 -116 -19 -165 86 -5 183 -46 -45 -75 -32 202 -41 75 139 -31 247 -171 -297 -249 38
4357C8k67N30m66K31k60J8N1J52J71l73K23P2j1j37J00o3m7J32o3O2r9J07k53
$$ 38 -229 301 -165 66 -194 -176 -125 27 198 -175 48 120 109 -28 72 9 -38 94 31 93 -6 101 -152
4380a52L44j81j30K2J42l08N08j91j47K16j85Q4k6K9N3m6j35Q4J62n3k66K16k29
$$ -152 192 11 -119 -97 45 -263 245 54 -93 123 -62 22 -4 25 78 32 -103 -19 143 90 -176 40 -189
4403a89J94o7J16r7L42j65j89J53j50J07j73O9K33j45k46L51l32QJ78J41j52M3
$$ -189 5 -62 54 -43 299 134 -55 98 -52 55 -118 -49 184 39 -207 144 -188 -180 -2 139 -13 30
4425C0j13Q3K05j39l31J71J53r6J11m93P70n36J79j75K28j18J09j61K94j14k64
$$ 30 -83 0 205 66 -265 -94 59 -37 74 -419 351 -185 -6 -181 47 -71 38 -123 171 57 -207
4446b07M97j29k78K73j93p5J77j82J75J9l2n1j12K26l47K45K0J56k51O2L71m87
$$ -207 290 161 -117 156 -37 -112 65 -117 58 77 45 -6 -118 108 -239 6 26 182 -69 -7 364 -123
4468a23K31q4j53M2K24k53J26m4J34K52k03j33Ok85K04j2J35l06M99m1m24K73
$$ -123 108 24 -129 -87 137 -116 10 -34 100 352 149 16 22 -263 -59 -71 64 -242 257 216 -208 65
$$ [...]
8191g9
##END NTUPLES=NMR FID
##END=
