##TITLE=1H_SR146H3_Et
 D2O
 48 sc, 
 17.4.2023
##JCAMPDX= 6.0         $$ Bruker NMR JCAMP-DX V2.0
##DATA TYPE= NMR FID
##DATA CLASS= NTUPLES
##ORIGIN= UXNMR, Bruker Analytische Messtechnik GmbH
##OWNER= root
$$ XWIN-NMR		Version 3.5
$$ Mon Apr 17 16:24:19 2023 Russian Standard Time (UT+4h)  she@DPX200
##.OBSERVE FREQUENCY= 200.13135
##.OBSERVE NUCLEUS= ^1H
##.DELAY= (6, 6)
##.ACQUISITION MODE= SIMULTANEOUS
##.ACQUISITION SCHEME= undefined
##.AVERAGES= 48
##.DIGITISER RES= 18
##SPECTROMETER/DATA SYSTEM= spect
##.PULSE SEQUENCE= zg30
##.SOLVENT NAME= D2O
##.SHIFT REFERENCE= (INTERNAL, D2O, 0, 15.7039)
##AUDIT TRAIL= $$ (NUMBER, WHEN, WHO, WHERE, WHAT)
$$ ##TITLE= Audit trail, XWIN-NMR		Version 3.5
$$ ##JCAMPDX= 5.01
$$ ##ORIGIN= Bruker BioSpin GmbH
$$ ##OWNER= she
$$ F:/spectra/data/she/nmr/H-F/1/audita.txt
$$ ##AUDIT TRAIL=  $$ (NUMBER, WHEN, WHO, WHERE, WHAT)
(   1,<2023-04-17 16:23:08.76 +0400>,<she>,<DPX200>,
      <continue with go, POWCHK disabled, PULCHK disabled
       configuration hash MD5:
       00 E9 B6 7A A2 85 ED C7 34 08 36 98 17 FE 4E 26
       data hash MD5: 16K
       21 D7 97 DA 43 8A 89 EF 0D EF E9 17 A2 88 9F 8E>)
$$ ##END=
$$ 
$$ hash MD5
$$ 8F EA 5B 31 6A A5 44 20 00 EC DB F5 20 78 8E 50
##$RELAX= 
##$RELAX= 
##$RELAX= 
##$RELAX= 
##$RELAX= 
##$RELAX= 
$$ Bruker specific parameters
$$ --------------------------
##$DU= <F:/spectra>
##$EXPNO= 1
##$NAME= <H-F>
##$PROCNO= 1
##$TYPE= <nmr>
##$USER= <she>
##$AMP= (0..31)
100 100 100 100 100 100 100 100 100 100 100 100 100 100 100 100 100 100 
100 100 100 100 100 100 100 100 100 100 100 100 100 100 
##$AQSEQ= 0
##$AQ_mod= 1
##$AUNM= <au_zg>
##$AUTOPOS= <>
##$BF1= 200.13
##$BF2= 200.13
##$BF3= 200.13
##$BF4= 200.13
##$BF5= 200.13
##$BF6= 200.13
##$BF7= 200.13
##$BF8= 200.13
##$BYTORDA= 1
##$CFDGTYP= 0
##$CFRGTYP= 5
##$CHEMSTR= <none>
##$CNST= (0..31)
1 1 145 1 1 1 1 1 1 1 1 1 1 1 1 1 1 1 1 1 1 1 1 1 1 1 1 1 1 1 1 1 
##$CPDPRG= <>
##$CPDPRG1= <>
##$CPDPRG2= <>
##$CPDPRG3= <>
##$CPDPRG4= <mlev>
##$CPDPRG5= <mlev>
##$CPDPRG6= <mlev>
##$CPDPRG7= <mlev>
##$CPDPRG8= <mlev>
##$CPDPRGB= <>
##$CPDPRGT= <>
##$D= (0..31)
0 1.2 0 0 0 0 0 0 0 0.06 0 0.03 0 0 0 0 0.0002 0 0 0 0 0 0 0 0 0 0 0 0 
0 0 0 
##$DATE= 1681734004
##$DBL= (0..7)
120 120 120 120 120 120 120 120 
##$DBP= (0..7)
150 150 150 150 150 150 150 150 
##$DBP07= 0
##$DBPNAM0= <>
##$DBPNAM1= <>
##$DBPNAM2= <>
##$DBPNAM3= <>
##$DBPNAM4= <>
##$DBPNAM5= <>
##$DBPNAM6= <>
##$DBPNAM7= <>
##$DBPOAL= (0..7)
0.5 0.5 0.5 0.5 0.5 0.5 0.5 0.5 
##$DBPOFFS= (0..7)
0 0 0 0 0 0 0 0 
##$DE= 6
##$DECBNUC= <off>
##$DECIM= 32
##$DECNUC= <off>
##$DECSTAT= 4
##$DIGMOD= 1
##$DIGTYP= 9
##$DL= (0..7)
0 120 120 120 120 120 120 120 
##$DP= (0..7)
150 150 150 150 150 150 150 150 
##$DP07= 0
##$DPNAME0= <>
##$DPNAME1= <>
##$DPNAME2= <>
##$DPNAME3= <>
##$DPNAME4= <>
##$DPNAME5= <>
##$DPNAME6= <>
##$DPNAME7= <>
##$DPOAL= (0..7)
0.5 0.5 0.5 0.5 0.5 0.5 0.5 0.5 
##$DPOFFS= (0..7)
0 0 0 0 0 0 0 0 
##$DQDMODE= 0
##$DR= 18
##$DS= 0
##$DSLIST= <SSSSSSSSSSSSSSS>
$$ [...]
##$SUBNAM2= <"">
##$SUBNAM3= <"">
##$SUBNAM4= <"">
##$SUBNAM5= <"">
##$SUBNAM6= <"">
##$SUBNAM7= <"">
##$SUBNAM8= <"">
##$SUBNAM9= <"">
##$SW= 18.05172834244
##$SWIBOX= (0..15)
0 0 2 0 0 0 0 0 0 0 0 0 0 0 0 0 
##$SW_h= 3612.71676300578
##$TD= 16384
##$TD0= 1
##$TE= 0
##$TE2= 300
##$TE3= 300
##$TEG= 300
##$TL= (0..7)
0 120 120 120 120 120 120 120 
##$TP= (0..7)
150 150 150 150 150 150 150 150 
##$TP07= 0
##$TPNAME0= <>
##$TPNAME1= <>
##$TPNAME2= <>
##$TPNAME3= <>
##$TPNAME4= <>
##$TPNAME5= <>
##$TPNAME6= <>
##$TPNAME7= <>
##$TPOAL= (0..7)
0.5 0.5 0.5 0.5 0.5 0.5 0.5 0.5 
##$TPOFFS= (0..7)
0 0 0 0 0 0 0 0 
##$TUNHIN= 0
##$TUNHOUT= 0
##$TUNXOUT= 0
##$USERA1= <user>
##$USERA2= <user>
##$USERA3= <user>
##$USERA4= <user>
##$USERA5= <user>
##$V9= 5
##$VALIST= <valist>
##$VCLIST= <CCCCCCCCCCCCCCC>
##$VD= 0
##$VDLIST= <DDDDDDDDDDDDDDD>
##$VPLIST= <PPPPPPPPPPPPPPP>
##$VTLIST= <TTTTTTTTTTTTTTT>
##$WBST= 1024
##$WBSW= 4
##$XGAIN= (0..3)
0 0 0 0 
##$XL= 0
##$YL= 0
##$YMAX_a= 770168
##$YMIN_a= -1099132
##$ZGOPTNS= <>
##$ZL1= 120
##$ZL2= 120
##$ZL3= 120
##$ZL4= 120
##$ABSF1= 10
##$ABSF2= 0
##$ABSG= 5
##$ABSL= 3
##$ALPHA= 0
##$AQORDER= 0
##$ASSFAC= 0
##$ASSFACI= 0
##$ASSFACX= 0
##$ASSWID= 0
##$AUNMP= <proc_1d>
##$AZFE= 0.1
##$AZFW= 0.1
##$BCFW= 1
##$BC_mod= 2
##$BYTORDP= 1
##$COROFFS= 0
##$CY= 11.3945322036743
##$DATMOD= 1
##$DC= 2
##$DFILT= <>
##$DTYPP= 0
##$F1P= 15.7292609196834
##$F2P= 12.9074282941183
##$FCOR= 0.5
##$FTSIZE= 0
##$FT_mod= 4
##$GAMMA= 1
##$GB= 0.15
##$INTBC= 1
##$INTSCL= 1
##$ISEN= 128
##$LB= 0.24
##$LEV0= 0
##$LPBIN= 0
##$MAXI= 10000
##$MC2= 0
##$MEAN= 0
##$ME_mod= 0
##$MI= 1.114404
##$NCOEF= 0
##$NC_proc= 0
##$NLEV= 6
##$NOISF1= 3.799351
##$NOISF2= 2.8
##$NSP= 1
##$NTH_PI= 0
##$NZP= 0
##$OFFSET= 15.70392
##$PC= 1
##$PHC0= -19833.59
##$PHC1= 12.20081
##$PH_mod= 1
##$PKNL= yes
##$PPARMOD= 0
##$PSCAL= 0
##$PSIGN= 0
##$REVERSE= no
##$SF= 200.130013532006
##$SI= 16384
##$SIGF1= 3
##$SIGF2= 2
##$SINO= 400
##$SIOLD= 16384
##$SREGLST= <1H.CDCl3>
##$SSB= 0
##$STSI= 0
##$STSR= 0
##$SW_p= 3612.71676300578
##$SYMM= 0
##$S_DEV= 0
##$TDeff= 0
##$TDoff= 0
##$TI= <>
##$TILT= no
##$TM1= 0
##$TM2= 0
##$TOPLEV= 0
##$USERP1= <user>
##$USERP2= <user>
##$USERP3= <user>
##$USERP4= <user>
##$USERP5= <user>
##$WDW= 1
##$XDIM= 8192
##$YMAX_p= 0
##$YMIN_p= 0
$$ End of Bruker specific parameters
$$ ---------------------------------
##NTUPLES= NMR FID
##VAR_NAME=  TIME,          FID/REAL,        FID/IMAG
##SYMBOL=    X,             R,               I
##VAR_TYPE=  INDEPENDENT,   DEPENDENT,       DEPENDENT
##VAR_FORM=  AFFN,          ASDF,            ASDF
##VAR_DIM=   8192,          8192,            8192
##UNITS=     SECONDS,       ARBITRARY UNITS, ARBITRARY UNITS
##FACTOR=    0.0002768,     1,               1
##FIRST=     0,             0,               0
##LAST=      2.2672688,     0,               0
##MIN=       0,             -1099132,        0
##MAX=       2.2672688,     770168,          0
$$ Real data points
##PAGE= N=1
##DATA TABLE= (X++(R..R)), XYDATA
$$ [...]
$$ plain form
2329 443 -85 702 -359 -29 -506 -767 17 181 183 -29 -55 424 -190 -73 54 -197 69 -838 658 423
2349 423 91 -433 -82 356 53 60 -369 77 688 -96 258 535 -48 -316 218 28 -210 8 115 -184 417
2370 417 -433 127 -132 -158 200 -136 94 -28 -18 -598 -34 -131 -198 743 216 -164 -362 149 -196 -310 -43
2391 -43 220 812 84 32 168 -374 -38 -332 -362 555 314 -54 -228 -502 469 -19 146 244 -388 498 -65
2412 -65 351 -187 -494 4 348 -29 8 -56 579 -166 -95 -415 -359 -520 159 -171 -519 -188 -57 125 -178 -547
2434 -547 -146 -334 112 -43 412 -655 -642 -414 -360 771 -254 441 -272 353 -787 174 -574 -507 382 279
2454 279 528 -260 -145 -499 48 57 -55 -67 -414 665 86 -72 -119 -75 50 266 -338 -40 -103 -31 -589 31
2476 31 -296 -433 -237 -41 802 89 317 495 604 -67 187 123 76 147 413 104 187 -135 181 443 92 -85
$$ packed form
2329D43n28P87j061L30m77k61P84J64Kk12k6M79o14J17J27k51K66r07J496k35
2349D23l32n24L51M38l03Pm29M46O11p84L54K77n83k68N34j90k38K18J07k99O01
2370D17q50N60k59k6L58l36K30j22J0n80N64r7o7R41n27l80j98N11l45j14K67
2391d3K63N92p28n2J36n42L36k94l0R17k41l68j74k74R71m88J65R8o32Q86n63
2412f5M16n38l07M98L44l77L7o4O35p45P1l20N6j61O79l30l48L31J31J82l03l69
2434e47M01j88M46j55M55j067J3K28N4J131j025O95p13O25j140R61p48O7Q89j03
2454B79K49p88J15l54N47Rj12j2l47J079n79j58m7M4J25K16o04K98o3P2n58O20
2476C1l27j37J96J96Q43p13K28J78J09o71K54o4m7P1K66l09Q3l22L16K62l51j77
$$ plain form
2498 -85 483 134 -234 47 -119 -4 330 -690 -573 -50 140 -120 -188 -233 -407 -550 -328 -399 -69 836 99
2519 99 174 -137 -155 810 756 504 -388 -104 57 59 -134 -188 -167 58 24 507 444 41 -304 61 -18 -308 -156 173
2543 173 428 -85 -344 -322 638 -509 146 567 46 536 90 -850 -203 624 232 -163 309 -45 -103 162
2563 162 335 492 -720 -340 -429 -9 270 491 159 -173 311 -366 33 -39 -90 518 -279 70 403 -167 28
2584 28 -190 352 114 -74 15 169 -470 -229 236 -167 252 193 662 -39 68 467 -67 -675 -787 -352 27
2605 27 81 466 748 -115 370 -34 -139 -477 140 297 -24 191 -47 -659 32 199 402 80 -422 -174 388
2626 388 97 135 -339 -213 -519 -238 150 18 109 18 -175 -372 -31 7 -100 506 35 -45 -260 -215 78 393
2648 393 344 -199 152 -17 587 -105 285 520 -73 243 -280 483 190 21 -117 340 493 181 -578 -46
$$ packed form
2498h5N68l49l68K81j66J15L34j020J17N23J90k60o8m5j74j43K22p1L30R05p37
2519I9P5l11j8R65n4k52q92K84J61Kj93n4K1K25l4M83o3m03l45L65p9k90J52L29
2543A73K55n13k59K2R60j147O55M21n21M90m46r40O47Q27l92l95M72l54n8K65
2563A62J73J57j212L80q9M20K79K21l32l32M84o77L99p2n1O08p97L49L33n70J95
2584B8k18N42k38j88Q9J54o39K41M65m03M19n9M69p01J07L99n34o08j12M35L79
2605B7N4L85K82q63M85m04j05l38O17J57l21K15k38o12O91J67K03l22n02K48N62
2626C88k91L8m74J26l06K81L88j32R1r1j93j97L41L8j07O06m71q0k15M5K93L15
2648C93m9n43L51j69O04o92L90K35n93L16n23P63k93j69j38M57J53l12p59N32
$$ plain form
2668 -46 -277 200 363 10 106 -258 101 -134 -192 275 -450 -153 229 -585 485 -214 221 109 -218 -86 85
2689 85 483 3 172 31 27 -222 177 278 433 -320 -52 -352 404 244 248 143 -938 -85 -153 176 -204 -1309
2711 -1309 -345 243 317 64 222 -172 217 309 -429 -318 223 -21 -553 -55 251 -331 215 291 585 -162 -312
2732 -312 -493 333 154 2 -621 -123 455 -54 64 356 -15 -12 -160 -331 860 -171 663 -162 -219 91
2752 91 -53 -117 -205 621 45 210 8 -191 180 181 -256 230 47 565 45 -434 70 213 603 -281 -69 -74
2774 -74 -610 -190 555 -85 -400 402 189 -364 -431 -500 235 27 -1018 -107 397 -512 762 -139 100 565
2794 565 34 429 8 -491 489 -388 -849 -234 -61 -418 -1 129 -334 486 -353 193 177 -376 22 -412
2814 -412 -3 -95 -287 429 -95 272 489 -228 -121 -356 236 -278 341 211 200 -454 66 103 15 297 63
$$ packed form
2668d6k31M77J63l53R6l64L59k35n8M67p25K97L82q14J070o99M35j12l27J32J71
2689H5L98m80J69j41mk49L99J01J55p53K68l00P56j60Mj05j081Q53o8L29l80j105
2711a309R64N88P4k53J58l94L89R2p38J11N41k44n32M98L06n82N46P6K94p47j50
2732c12j81Q26j79j52o23M98N78n09J18K92l71Lj48j71J191j031Q34q25n7L10
2752I1j44o4q8Q26n76J65k02j99L71Jm37M86j83N18n20m79N04J43L90q84K12n
2774g4n36M20P45o40l15Q02k13n53o7o9P35k08j045R11N04r09J274r01K39M65
2794E65n31L95m21m99R80q77m61O15J73l57M17J30m63Q20q39N46j6n53L98m34
2814d12M09r2j92P16n24L67K17p17J07k35N92n14O19j30j1o54N20L7q8K82k34
$$ plain form
2835 63 333 24 185 -144 171 -122 172 29 255 271 292 -195 314 237 -104 333 6 85 -76 419 -352 -283
2857 -283 -154 104 404 85 -537 -538 312 -439 -120 -239 25 -260 71 -541 106 416 219 118 451 -168 56
2878 56 -359 -506 171 175 219 -62 85 -258 -796 160 92 478 134 66 279 14 65 -84 -37 -94 497 138 -8
2901 -8 -64 224 -247 226 -233 -344 -319 79 335 416 417 185 538 -479 721 -154 276 26 -175 391 -14 -210
2923 -210 264 162 -768 -200 -374 79 104 168 -98 353 159 -147 671 294 -528 -97 -196 -438 54 98 -69
2944 -69 59 45 78 68 -493 -171 -142 -165 212 -356 -518 -429 -313 -410 -207 -182 79 204 -51 7 -199 -248 533 -358
2968 -358 268 -223 156 548 617 14 326 -25 -27 222 -449 214 -127 226 43 -267 -288 -54 -286 337 127
2989 127 -163 178 165 105 197 252 348 579 -360 11 -242 -467 319 349 -558 -980 -18 166 -452 276 -129 318
$$ packed form
2835F3K70l09J61l29L15k93K94j43K26J6K1m87N09p7l41M37l27P9j61M95p71O9
2857b83J29K58L00l19o22jQ50p51L19j19K64k85L31o12O47L10j97j01L33o19K24
2878E6m15j47O77MM4k81J47l43n38R56o8L86l44o8K13k65N1j49M7n7N91l59j46
2901hn6K88m71M73m59j11K5L98K56Q1Jk32L53j017J200q75M30k50k01N66m05j96
2923b10M74j02r30N68j74M53K5O4k66M51j94l06Q18l77q22M31r9k42M92M4j67
2944f9J28j4L3j0n61L22K9k3L77n68j62Q9J16r7K03K5K61J25k55N8k06m9P81q91
2968c58O26m91L79L92O9o03L12l51kK49o71O63l41L53j83l10k1K34k32O23k10
2989A27k90L41j3o0R2N5R6K31r39L71k53k25P86L0r07m22R62J84o18P28m05M47
$$ plain form
3011 318 76 740 171 -253 365 740 115 185 22 -421 45 141 128 -441 -19 302 -386 37 -374 -178 -451
3032 -451 -284 -256 549 19 -166 -105 233 -454 45 324 -73 -223 -434 -76 390 -274 141 -317 -126 7 -153
3053 -153 -365 -462 -6 59 -429 121 377 -203 127 -395 307 -70 -321 4 351 -140 -167 26 162 -394 111
3074 111 61 -645 -286 185 293 19 194 -436 -261 258 721 -34 29 308 -574 11 -304 -226 563 213 -133
3095 -133 48 -364 -82 -696 -241 12 362 266 387 258 -72 -123 -152 549 405 81 94 -321 -414 -278 -221 423
3117 423 398 63 -641 184 -126 -37 -110 9 175 197 -408 -769 21 207 -420 150 -211 -22 906 178 245 1
3139 1 -817 -57 -8 237 -326 378 313 -437 -35 138 467 97 -237 323 -351 326 -113 243 -122 -20 217
3160 217 96 439 -44 -282 -110 -491 140 -425 -66 -397 -520 -444 -582 454 22 -95 10 -292 245 106
$$ packed form
3011C18k42O64n69m24O18L75o25P0j63m43M66R6j3n69M22L21o88M23m11J96k73
3032d51J67K8Q05n30j85O1L38o87M99K79l97j50k11L58M66o64M15m58J91J33j60
3053a53k12r7M56O5m88N50K56n80L30n22P02l77k51L25L47m91k7J93J36n56N05
3074A11n0p06L59M71J08k74J75o30J75N19M63p55O3K79q82N85l15P8P89l50l46
3095a33J81m12K82o14M55K53L50r6J21j29l30n1k9P01j44l24J3m15r3J36N7O44
3117D23k5l35p04Q25l10Q9p3J19J66K2o05l61P90J86o27N70l61J89R28p28O7k44
3139Aq18P60M9K45n63P04o5p50M02J73L29l70l34N60o74O77m39L56l65J02K37
3160B17j21L43m83k38J72l81O31n65L59l31j23P6j38J036m32j17J05l02N37j39
$$ plain form
3180 106 -303 93 194 -306 -586 -468 -133 500 128 1043 196 -13 -125 366 406 126 118 210 464 -13 235
3201 235 -692 18 -434 212 830 313 104 301 -490 170 463 500 260 -260 -158 -328 -20 193 166 -60 24
3222 24 200 -647 -457 176 11 132 -260 703 -321 46 56 -332 233 151 -370 487 4 -810 47 -51 36
3243 36 67 167 109 92 -57 -106 404 -221 -1012 -144 100 849 365 -80 130 177 -195 152 561 -25 -169 78
3265 78 823 -107 220 159 324 -62 -163 210 -103 -692 -779 188 -280 -40 262 -417 -246 323 333 88 -39
3286 -39 372 -213 109 -389 146 -423 -368 -270 57 -557 -477 -183 350 189 -403 164 -355 101 2 9 231 547
3308 547 661 -5 -309 168 -16 -4 -309 -42 -13 79 -283 529 114 535 411 -423 179 -45 107 -67 -178
3329 -178 -97 260 -470 86 -75 -41 -349 -292 -496 580 -553 -81 127 58 -172 99 201 620 -145 -88 148
$$ packed form
3180A06m09L96J01n00k80J18L35O33l72R15q47k09j12M91M0k80qR2K54m77K48
3201B35r27P10m52O46O18n17k09J97p91O60K93L7k40n20J02j70L08K13k7k26Q4
3222B4J76q47J90O33j65J21l92R63j024L67J0l88N65q2n21Q57m83q14Q57r8Q7
3243C6L1J00n8j7j49m9N10o25p91Q68K44P49m84m45K10M7l72L47M09n86j44K47
3265G8P45r30L27o1J65l86j01L73l13n89q7R67m68K40L02o79J71N69J0k45j27
3286c9M11n85L22m98N35n69N5R8L27o14Q0K94N33j61n92N67n19M56r9PK22L16
3308E47J14o66l04M77j84J2l05K67K9R2l62Q12m15M21j24q34O02k24J52j74j11
3329a78Q1L57p30N56j61L4l08N7k04J076j133M72K08o9k30K71J02M19p65N7K36
$$ plain form
3350 148 92 -428 183 369 180 -119 45 360 53 203 19 17 -205 545 72 -517 59 -43 -75 543 -267
3371 -267 -282 222 322 660 125 -12 72 -593 395 -280 -205 367 -72 22 -84 -102 -617 -429 -140 221 348 -448
3393 -448 355 -489 16 -242 -245 24 261 -139 47 -124 725 281 -307 -196 39 -9 21 -111 -181 52 367 104
3415 104 -221 -352 94 14 -171 23 79 271 18 -288 88 -400 -450 187 6 -143 -519 -164 -227 183 -365
3436 -365 -83 285 132 116 -175 -97 -251 -432 -134 255 -656 -198 278 -360 30 238 178 -237 -289 -371 -169 -41
3458 -41 -234 -40 316 195 99 -157 -455 -216 44 85 330 -19 -56 -51 527 883 9 -81 262 -89 151 3
3480 3 -343 -321 129 -100 102 -353 119 -87 -358 363 663 -215 571 -254 153 -414 -337 -66 78 -725 2
3501 2 300 -218 392 -57 -402 -306 61 -254 -364 -104 72 64 -108 -483 -519 373 24 18 28 -136 244 137 -86
$$ packed form
3350A48n6n20O11J86j89k99J64L15l07J50j84kk22P50m73n89N76j02l2O18q10
3371b67j5N04J00L38n35j37Q4o65R88o75P5N72m39R4j06j8n15J88K89L61J27p96
3393d48Q03q44N05k58lK69K37m00J86j71Q49m44n88J11K35m8L0j32p0K33L15k63
3415A04l25j31M46q0j85J94N6J92k53l06L76m88n0O37j81j49l76L55o3M10n48
3436c65K82L68j53j6k91P8j54j81K98L89r11M58M76o38L90K08o0m15n2q2K02J28
3458d1j93J94L56j21r6k56k98K39K60M1K45l49l7NN78L56q74r0L43l51K40j48
3480Cl46K2M50k29K02m55M72k06k71P21L00q78P86q25M07n67P7K71J44q03P27
3501BK98n18O10m49l45R6L67l15j10K60J76qj72l75l6Q92l49oJ0j64L80j07k23
$$ plain form
3524 -86 -106 -81 360 85 229 345 731 209 367 -135 646 94 361 154 -338 -413 103 -213 76 370 9
3545 9 171 253 -355 15 -13 12 58 120 17 -548 209 -462 -402 -103 288 56 192 365 368 -187 262 -81 273
3568 273 73 162 198 109 26 -361 -174 -107 -181 -40 -66 -427 317 185 -588 -36 -70 14 -27 -314 -244 5 -458 -542
3592 -542 161 -281 -118 -29 382 79 -49 -451 182 85 147 941 -162 252 -171 -335 66 -299 173 419 212
3613 212 -10 141 162 163 523 7 -166 -151 -190 344 -149 -201 -424 -250 -495 -90 -192 -310 -92 33 333 227
3635 227 -264 170 979 69 189 28 323 -16 23 -426 353 -108 -355 52 -364 297 -104 50 -211 210
3655 210 -238 -146 -114 135 135 -285 148 -48 -213 -495 -406 321 202 -151 -6 313 -192 -109 42 170 -219 542
3677 542 -81 -230 -146 144 9 -721 -233 -339 231 -97 235 546 103 -135 5 -125 -438 -97 50 -154
$$ packed form
3524h6k0K5M41k75J44J16L86n22J58n02P81n52K67k07m92p5N16l16K89K94l61
3545IJ62Q2o08L70k8K5M6O2j03n65P57o71O0K99L91k32J36J73Ln55M49l43L54
3568B73k00Q9L6q9q3l87J87O7p4J41k6l61P44j32p73N52l4Q4m1k87P0K49m63q4
3592e42P03m42J63Q9M11l03j28m02O33r7O2P94j103M14m23j64M01l65M72K46k07
3613B12k22J51K1JL60n16j73J5l9N34m93n2k23J74k45M05j02j18K18J25L00j06
3635B27m91M34Q09r10J20j61K95l39L9m49P79m61k47M07m16O61m01J54k61M21
3655B10m48R2L2K49%m20M33j96j65k82Q9P27j19l53J45L19n05Q3J51J28l89P61
3677E42o23j49Q4K90j35p30M88j06N70l28L32L11m43k38J40j30l13L41J47k04
$$ plain form
3697 -154 200 104 687 121 -206 143 47 330 -208 526 387 530 -39 93 193 -360 -238 365 244 -152 -270
3718 -270 180 124 72 -200 369 188 20 -123 659 458 -2 125 7 229 -83 284 -323 873 252 -820
3738 -820 -453 -157 -558 -156 -78 377 -434 223 215 235 43 327 -253 -616 -182 -403 301 -342 735 -7 716
3759 716 662 -345 -78 -669 -587 -589 -743 371 -108 -472 -117 -163 60 362 109 220 -20 41 169 -325 16
3780 16 142 -398 -173 215 -292 -62 142 106 356 -136 -68 -54 308 275 11 187 -432 -308 112 44 -194 -2
3802 -2 -28 -69 -402 284 222 137 224 69 -492 118 107 -90 -262 -111 -181 -451 272 -215 -140 8 -272 -362 390 219
3826 219 -494 -549 -372 276 106 278 -234 -208 -145 365 -109 -135 541 402 -268 506 -313 -214 -283 91 125 187 316
3849 316 602 -40 125 -193 419 -541 -64 -44 472 405 -191 245 46 -585 184 -258 92 -166 -339 423 5
$$ packed form
3697a54L54r6N83n66l27L49r6K83n38P34j39J43n69J32J00n53J22O03j21l96j18
3718b70M50n6n2k72N69j81j68j43P82k01m60J27j18K22l12L67o07J196o21j072
3738h20L67K96m01M02P8M55q11O57qK0j92K84n80l63M34k21P04o43J077p42P23
3759G16n4j007K67n91Q2kj54J114m79l64L55m6K23L02k53J11k40O1J28m94L41
3780A6J26n40K25L88n07K30K04l6K50m92O8J4L62l3k64J76o19J24M20o8k38J92
3802bk6m1l33O86o2q5Q7j55n61O10j1j97j72J51p0k70P23m87P5J48k80r0P52j71
3826B19p13n5J77O48j70J72n12K6O3N10m74k6O76j39o70P74q19R9o9L74L4O2J29
3849C16K86o42J65l18O12r60M77K0N16o7n96M36j99o31P69m42L50k58j73P62m18
$$ plain form
3870 5 172 -470 -3 -313 -72 -130 23 -516 349 -429 -571 255 -516 198 -292 21 233 64 386 491 -106
3891 -106 117 66 -312 106 -87 -160 -454 322 -128 -463 138 387 247 51 253 -46 241 570 202 -201 -146
3912 -146 396 402 -25 -272 233 20 498 -195 -282 -139 227 -243 332 -354 561 264 123 -487 71 -130 -171
3933 -171 -97 -15 -512 327 36 399 -444 -373 118 -7 107 491 -135 -487 -60 6 -59 -94 525 -411 197 -263
3955 -263 -403 100 -268 -101 316 19 249 33 -104 -204 -172 432 -94 -24 193 177 -31 -379 -816 233 -69
3976 -69 327 322 -178 -107 -500 -146 -732 71 -73 -208 -178 185 332 493 -87 132 -210 162 -442 555 408 114
3998 114 391 -6 371 -453 346 145 245 -288 -182 -111 136 324 -305 -579 135 222 -725 -346 76 518 11
4019 11 420 10 -71 221 -135 677 506 -226 160 -138 171 642 189 178 -160 -91 -155 -54 69 236 -333 -360
$$ packed form
3870EJ67o42M67l10K41n8J53n39Q65p78j42Q26p71P14m90L13K12j69L22J05n97
3891a06K23n1l78M18j93p3k94P76m50l35O01K49j40j96K02k99K87L29l68m03N5
3912a46N42Om27k47N05k13M78o93q7J43L66m70N75o86R15k97j41o10N58k01m1
3933a71P4Q2m97Q39k91L63q43P1M91j25J14L84o26l52M27O6o5l5O19r36O08m60
3955b63j40N03l68J67M17k97K30k16j37j00L2O04n26P0K17j6k08l48m37J049l02
3976f9L96nn00P1l93L54n86Q03j44j35L0L63J47J61n80K19l42L72o04R97j47k94
3998A14K77l97L77q24P99k01J00n33J06P1K47J88o29k74P14Q7r47L79M22M42n07
4019A1M09m10q1K92l56Q12j71p32L86k98L09M71m53j1l38O9o4J01J23J67n69k7
$$ plain form
4041 -360 -234 -335 -202 164 -100 -282 -56 873 121 -88 -281 -52 -105 -50 -176 158 -367 -40 379 -171 -505
4062 -505 237 -237 219 -161 26 -203 -174 -213 351 -18 -246 126 485 -425 -60 484 -440 -35 164 -311 178
4083 178 -100 -535 -140 281 46 741 -212 -2 286 -127 -84 -173 -80 330 80 732 -229 163 138 38 36 -103
4105 -103 22 -51 -42 -353 125 -5 131 -20 -225 -42 66 355 423 -251 172 -303 -172 169 -133 30 -281
4126 -281 -128 592 323 -108 -218 180 465 604 -11 43 -115 -102 416 189 -330 -196 243 73 481 59 -308
4147 -308 -406 343 -398 -291 -43 289 25 683 268 11 290 312 487 324 152 118 -335 -81 313 -17 -296
4168 -296 -347 409 -18 -114 -221 347 83 378 143 -444 -761 76 -268 622 15 298 174 -55 446 148 60
4189 60 440 989 176 -269 144 114 -220 -217 102 -122 -307 -64 363 -293 618 308 -510 317 -1007 -282 -237
$$ packed form
4041c60J26j01J33L66k64j82K26R29p52k09j93K29n3N5j26L34n25L27M19n50l34
4062e05P42m74M56l80J87k29K9l9N64l69k28L72L59r10L65N44r24M05J99m75M89
4083A78k78m35L95M21k35O95r53K10K88m13M3q9R3M10k50O52r61L92k5j00kj39
4105a03J25p3Rl11M78j30J36j51k05J83J08K89O8o74M23m75J31L41l02J63l11
4126b81J53P20k69m31j10L98K85J39o15N4j58J3N18k27n19J34M39j70M08m22l67
4147c08r8P49p41J07K48L32k64O58m15k57K79K2J75j63j72l4m53K54L94l30k79
4168b96n1P56m27r6j07N68k64K95k35n87l17Q37l44Q90o07K83j24k29N01k98q8
4189F0L80N49q13m45M13l0l34LL19k24j85K43M27o56R11l10q18Q27j324P25M5
$$ plain form
4210 -237 -44 78 813 -409 91 -260 345 100 38 -266 74 -407 148 -85 -72 -82 -302 240 -102 -34 -255
4231 -255 -41 -54 814 7 185 63 -159 -231 -10 195 -174 130 -139 192 64 278 -116 -120 -641 -270 283
4252 283 735 -188 -254 555 351 40 108 49 -339 -504 540 69 -445 686 -238 -297 45 399 280 69 -57
4273 -57 379 209 66 -292 -341 91 -383 -285 -18 -104 -444 175 435 -82 60 190 148 188 230 -311 439 579
4295 579 81 557 155 -498 -38 673 339 -122 -103 -147 33 439 -29 26 -483 228 -119 -638 641 -422
4315 -422 193 277 292 55 -11 -34 623 45 -225 -159 105 582 -225 -362 -197 -110 -433 -205 -343 187 187 162 -12
4338 -12 -166 -275 142 -296 -109 -412 462 152 54 6 58 513 -158 197 477 191 678 -259 -32 319 116
4359 116 224 479 -121 491 -29 -449 349 -131 -60 386 -116 121 -104 -383 -133 -399 481 -155 490 408 -179
$$ packed form
4210b37J93J22P35j222N00l51O05k45o2l04L40m81N55k33J3j0k20N42l42O8k21
4231b55K14j3Q68q07J78j22k22p2K21K05l69L04k69L31j28K14l94mn21L71N53
4252B83M52r23o6Q09k04l11O8n9l88j65J044m71n14J131r24n9L42L54j19k11j26
4273e7M36j70j43l58m9M32m74R8K67q6l40O19K60n17J42J30m2M0M2n41P50J40
4295E79m98M76m02o53M60P11l34m61J9m4J80M06m68N5n09P11l47n19J279j063
4315d22O15Q4J5k37o6k3O57n78k70O6K64M77q07j37J65Q7l23K28j38N30%k5j74
4338a2j54j09M17m38J87l03Q74l10r8m8N2M55o71L55K80k86M87r37K27L51k03
4359A16J08K55o00O12n20m20P98m80P1M46n02K37k25k79K50k66Q80o36O45q2n87
$$ plain form
4380 -179 200 -414 21 -428 5 56 -320 -160 -135 165 -398 229 317 77 -274 732 -88 -137 225 8 155
4401 155 223 -48 -39 1062 62 -135 -593 -46 593 -267 -74 108 -386 251 -21 -451 318 -127 494 -742
4421 -742 86 -55 -863 -39 -103 -294 447 52 -840 -69 1 115 -96 436 180 139 -93 -254 317 582 268
4442 268 96 -149 636 269 28 291 -234 19 606 153 363 15 -65 -854 -9 -599 -213 -109 701 -132
4462 -132 471 313 394 -159 -167 288 -196 181 -160 295 -276 253 -109 227 -40 296 224 -320 371 -469 27
4483 27 357 155 406 -27 13 156 656 671 -49 8 116 -9 -121 -434 273 -107 -386 160 -86 -364 69
4504 69 130 -367 110 70 329 -130 -57 -332 -345 -71 -501 -132 -66 -231 -107 61 -48 516 -357 66 -185 139
4526 139 538 334 238 -193 44 -357 -11 -41 -271 -505 -107 -161 76 -246 209 -46 -578 -221 23 61 157 47
$$ packed form
4380a79L79o14M35m49M33N1l76J60K5L00n63O27Q8k40l51J006q20m9L62k17J47
4401A55O8k71RJ101j000j97m58N47O39q60J93J82m94O37k72m30P69m45O21j236
4421g42Q28j41q08Q24o4j91P41l95q92P71P0J14k11N32k56m1k32j61N71K65l14
4442B68j72k45P85l67k41K63n25K53N87m53K10l48q0p89Q45n90L86J04Q10q33
4462a32O03j58Q1n53qM55m84L77l41M55n71N29l62L36k67L36p2n44O91q40M96
4483B7L30k02K51m33M0J43N00J5p20N7J08j25j12l13P07l80k79N46k46k78M33
4504F9O1m97M77m0K59m59P3k75j3K74m30L69O6j65J24J68j09N64q73M23k51L24
4526A39L99k04r6m31K37m01L46l0k30k34L98n4K37l22M55k55n32L57K44L8R6j10
$$ plain form
4548 47 109 -185 -102 83 47 160 71 122 -613 -673 -159 131 -33 315 662 221 67 74 -459 -238 -228 -274 104 -392
4572 -392 -271 142 379 -269 -442 -254 220 112 284 -37 -277 -299 -101 -284 337 -256 -764 284 69 -43
4592 -43 -127 901 -146 349 -53 -237 -379 239 99 -227 -466 -506 2 -4 -400 -81 -571 204 386 396 453 175
4614 175 311 -294 48 169 -50 -322 -431 257 -277 -166 12 -248 -23 -172 -264 725 83 261 -127 131
4634 131 -42 465 -388 -660 204 -179 -247 -94 -170 110 -2 -22 -257 7 -298 266 273 220 335 53 -553 -22
4656 -22 -521 -145 127 -92 138 42 559 445 -413 -398 -203 -809 -4 -24 22 -157 -255 -81 -663 251 -284 -273
4678 -273 -340 -164 -47 44 487 395 -506 -155 352 -96 178 135 783 151 180 -190 -270 11 21 -365 686 -32
4700 -32 -225 -127 -616 -244 204 -62 -127 338 100 -399 -7 -59 -279 -369 -385 -450 108 -8 -174 477 67 -462
$$ packed form
4548D7O2k94Q3J85l6J13q9N1p35o0N14K90j64L48L47m41j54Pn33K21J0m6L78m96
4572c92J21M13K37o48j73J88M74j08J72l21k40k2J98j83O21n93n08J048k15j12
4592d3q4J028j047M95m02j84j42O18j40l26k39m0N08ol96L19m90P75J82J0N7k78
4614A75J36o05L42J21k19k72j09O88n34J11J78k60K25j49r2R89o42J78l88K58
4634A31j73N07q53k72Q64l83o8J53p6K80j12k0k35K64l05N64Pn3J15k82o06N31
4656b2m99L76K72k19K30r6N17j14q58J5J95o06Q05k0M6j79r8J74n82R14n35J1
4678b73o7J76J17R1M43r2r01L51N07m48K74m3O48o32K9l70q0K81J0l86J051p18
4700c2j93R8m89L72M48k66o5M65k38m99L92n2k20r0j6o5N58j16j66O51m10n29
$$ plain form
4722 -462 -297 553 545 -65 322 190 115 278 567 574 57 -263 -75 566 -140 24 -180 110 -36 -251 -49 -90
4744 -90 -284 -210 -443 -57 -102 -791 189 257 34 -238 -81 -584 -411 225 631 332 242 -233 -155 156 534 -544
4766 -544 -59 256 -185 313 177 147 561 299 148 113 377 249 -209 -569 -44 -142 420 -87 -228 225 147
4787 147 86 -273 83 -44 302 226 153 183 -108 -284 231 -13 -129 3 -199 602 -172 -509 905 -276 114
4808 114 83 -47 52 -145 109 203 -99 -225 157 326 258 -445 -163 35 228 -573 -499 -526 497 -66 70 217
4830 217 -108 178 -27 491 -148 -252 133 -325 154 275 436 436 -719 52 -292 -146 145 333 97 -211
4850 -211 12 -143 238 -343 -76 249 -46 -271 -152 -90 400 123 -287 103 -238 -113 -372 -90 14 233
4870 233 -407 -162 -381 39 542 112 -388 62 -23 10 207 -70 -107 59 -289 -10 -14 547 -154 -205 -4 -221
$$ packed form
4722d62J65Q50qo10L87j32p5J63K89Pn17l20J88O41p06J64k04K90j46k15K02m1
4744i0j94P4k33L86m5o89R80O8k23k72J57n03J73O36M06k99r0m75P8L11L78j078
4766e44M85L15m41M98j36l0M14k62j51l5K64j28m58l60N25r8N62n07j41M53p8
4787A47o1l59L56j27L46p6p3L0k91j76N15k44j16J32k02Q01p74l37J414j181L90
4808A14l1j30R9j97K54R4l02j26L82J69o8p03K82J98J93q01P4k7J023n63J36J47
4830B17l25K86k05N18o39j04L85m58M79J21J61%j155P71l44J46K91J88k36l08
4850b11K23j55L81n81K67L25k95k25J19O2M90k77m10L90l41J25k59K82J04K19
4870B33o40K45k19M20N03m30n00M50q5L3J97k77l7J66l48K79mN61p01n1K01k17
$$ plain form
4892 -221 -86 207 -303 174 47 187 104 -186 79 140 521 230 327 576 536 189 -108 -537 -392 185 -231
4913 -231 548 165 -176 -608 104 -466 131 -233 100 39 -741 44 -122 -255 158 430 114 -317 -2 -563
4933 -563 557 -52 62 -242 681 -268 -325 -217 -387 627 -113 -142 -570 -223 -160 24 202 -323 406 206
4953 206 -364 -562 248 70 294 360 250 254 -94 -13 -146 -40 161 186 -10 -295 207 436 -331 284 -274 345
4975 345 265 -114 258 -29 407 -29 -131 -691 -79 78 -135 90 -201 -426 234 107 29 76 200 -463 -491
4996 -491 -363 -125 -17 -99 147 -189 44 -345 410 -435 -318 -263 497 -703 -293 -440 543 86 316 -60
5016 -60 -449 -308 -335 -51 -126 -16 73 505 395 -256 -509 352 167 -281 -26 -250 50 -76 68 12 263 49
5038 49 -103 -934 388 -628 254 38 -354 -276 29 33 311 83 108 -44 197 -81 313 124 -157 165 492
$$ packed form
4892b21J35K93n10M77j27J40q3k90K65O1L81k91R7K49m0l47k97m29J45N77m16
4913b31P79l83l41m32P12n70N97l64L33o1p80P85j66j33M13K72l16m31L15n61
4933e63J120o09J14l04R23r49n7J08j70J014p40k9m28L47O3J84J78n25P29k00
4953B06n70j98Q10j78K24O6j10Ml48Q1j33J06K01K5j96k85N02K29p67O15n58O19
4975C45q0l79L72k87M36m36j02n60O12J57k13K25k91k25O60j27p8M7J24o63k8
4996d91J28K38J08q2K46l36K33l89P55q45J17N5P60j200M10j47R83m57K30l76
5016f0l89J41k7K84p5J10Q9M32j10o51k53Q61j85m48K55k24L00j26J44n6K51k14
5038D9j52q31J322j016Q82k16l92P8L05MK78k28K5j52K41k78L94j89k81L22L27
$$ plain form
5059 492 284 241 -140 287 491 -197 -87 404 -385 -281 529 -394 -225 313 323 245 519 -466 -615 240 -277
5080 -277 -144 -269 -105 196 -580 7 -491 198 -319 228 -191 476 -302 606 -4 20 350 -233 -190 52 425
5101 425 -356 414 23 20 -128 161 -425 -9 246 -92 -195 607 89 422 117 -661 -22 -898 -507 -132 180
5122 180 -447 -141 -539 34 176 218 107 -228 -290 -449 323 -273 472 173 -435 160 278 44 219 -383 154
5143 154 42 655 127 -519 -364 -167 30 245 207 384 370 -254 424 -63 95 307 -118 -228 -198 685 151
5164 151 109 171 -100 150 -210 103 38 160 117 -77 -162 -61 -116 370 370 -56 27 437 -381 265 -2 -166 458
5187 458 -752 59 -365 -329 508 -205 -105 -223 -132 -176 2 -331 33 577 -617 450 -59 11 -346 88
5207 88 433 704 -108 -596 62 -135 171 -324 5 -93 -247 109 461 98 139 427 -205 307 479 -161 740
$$ packed form
5059D92k08m3l81M27K04o88J10M91p89J04Q10r23J69N38J0p8K74r85j49Q55n17
5080b77J33j25J64L01p76N87m98O89n17N47m19O67p78R08o10K4L30n83M3K42L73
5101D25p81P70l91lj48K89n86M16K55l38j03Q02n18L33l05p78O39q76L91L75L12
5122A80o27L06l98N73J42M2j11l35o2j59P72n96P45k99o08N95J18k34J75o02N37
5143A54j12O13n28o46J55J97J97K15l8J77j4o24O78m87J58K12m25j10L0Q83n34
5164A51m2O2k71K50l60L13o5J22m3j94q5J01n5M86%m26Q3M10q18O46k67j64O24
5187D58j210Q11m24L6Q37p13J00j18R1m4J78l33L64N44j194J067n09P0l57M34
5207H8L45K71q12m88O58j97L06m95L29r8j54L56L52l63M1K88o32N12J72o40R01
$$ plain form
5228 740 237 -135 408 120 469 333 434 -53 -341 25 506 -398 304 -87 1 591 15 -245 -120 184
5248 184 36 -633 107 -11 -528 -497 -347 -724 -184 -98 24 151 121 -300 133 -182 -167 496 -156 14 308
5269 308 -18 19 387 -56 276 -135 73 68 556 -100 -155 146 -329 -290 -177 499 372 -89 -434 -136 61 236
5291 236 14 -332 -488 -321 -58 532 -302 296 -573 -393 63 73 385 -395 474 481 -262 80 539 -315 365
5312 365 201 42 -384 330 -454 258 302 343 -56 -82 52 6 454 -132 -165 95 -10 -1 -485 -299 299 -28
5334 -28 482 307 -187 -513 336 419 -228 40 114 -299 150 -154 -17 -229 -432 170 -563 -170 -13 -72 57
5355 57 -358 383 137 -252 1065 64 303 228 -122 241 172 241 263 -429 33 -565 905 -638 114 216
5375 216 380 -122 -127 -122 82 227 -248 292 -44 -546 -159 130 -154 15 91 60 188 211 39 112 -553 600
$$ packed form
5228G40n03l72N43k88L49j36J01m87k88L66M81r04P02l91Q8N90n76k60J25L04
5248A84j48o69P40j18n17L1J50l77N40Q6J22J27l0m21M33l15J5O63o52J70K94
5269C08l26L7L68m43L32m11K08nM88o56n5L01m75L9J13O76j27m61l45K98J97J75
5291B36k22l46j56J67K63N90q34N98q69J80M56J0L12p80Q69Pp43L42M59q54O80
5312C65j64j59m26P14p84P12M4M1l99k6J34m6M48n86l3K60j05Rm84J86N98l27
5334b8N10j75m94l26Q49Q3o47K68P4m13M49l04J37k12k03O02p33L93J57n9J29
5355E7m15P41k46l89J317j001K39p5l50L63o9O9K2o92M62n98J470j543P52J02
5375B16J64n02nNK04J45m75N40l36n02L87K89k84J69P6l1J28K3j72P3o65J153
$$ plain form
5397 600 83 -14 511 205 -556 -3 462 -516 -42 320 56 438 69 -3 -361 207 39 528 298 443 -139
5418 -139 527 176 207 -6 -117 322 -561 201 -191 224 -73 -117 -61 -245 113 232 -404 -565 -36 -155 -554
5439 -554 154 -129 270 330 187 474 -385 389 -13 484 50 82 -75 326 -319 20 273 118 -67 -101 -15
5460 -15 -167 -349 -474 -285 717 -222 213 155 -177 -234 -345 -116 399 312 -88 -376 -149 -649 23 309 -217
5481 -217 400 -116 137 -266 57 -238 -130 -101 33 101 43 -10 24 -257 340 -292 54 113 142 -43 -224 -537
5503 -537 544 325 -676 223 -617 200 440 373 -23 -413 454 375 340 -123 44 292 -685 -319 226 177 -246
5524 -246 -462 549 162 73 489 46 -654 108 -842 162 560 -680 -351 -398 433 57 -950 -418 -606
5543 -606 32 -292 240 -82 188 677 80 70 152 84 -150 253 -62 105 -215 315 70 1 10 19 440 226 29
$$ packed form
5397F00n17r7N25l06p61N53M65r78M74L62k64L82l69p2l58N68j68M89k30J45n82
5418a39O66l51L1k13j11M39q83P62l92M15k97m4N6j84L58J19o36j61N29j19l99
5439e54P08k83L99O0j43K87q59P74m02M97m34L2j57M01o45L39K53j55j85l4Q6
5460a5j52j82j25J89J002r39M35n8l32n7j11K29N15q7m00k88K27n00O72K86n26
5481b17O17n16K53m03L23k95J08K9J34O8n8n3L4k81N97o32L46N9K9j85j81l13
5503e37J081k19j001Q99q40Q17K40o7l96l90Q67p9l5m63J67K48r77L66N45m9m23
5524b46k16J011l87q9M16m43p00P62r50J004L98j240L29m7Q31l76j007N32j88
5543f06O38l24N32l22K70M89n97j0Q2o8k34M03l15J67l20N30k45o9RRM21k14j97
$$ plain form
5566 29 205 103 -125 -37 -48 1 352 -217 259 -402 -405 -117 344 398 374 265 -302 65 -249 278 464 -205 -15
5589 -15 -45 150 343 -49 -781 238 -739 30 385 -249 -261 -135 79 -90 -466 270 39 185 178 -79 -582
5610 -582 -505 -353 173 274 -421 74 -90 -462 354 53 -269 387 -265 32 -55 -101 -106 -407 498 -57 -259 180
5632 180 -257 24 196 359 351 -245 246 119 -170 -241 -29 -33 -414 712 -83 -795 -623 -205 -888 285 465
5653 465 -233 244 189 438 166 -660 -37 251 -581 592 235 290 230 -154 604 424 389 46 308 63 363
5674 363 56 354 128 -605 661 -61 324 -274 362 107 -92 52 914 -305 43 278 552 -229 344
5693 344 110 528 273 -267 -175 -174 88 3 347 -405 208 223 525 71 -56 -86 -23 330 90 11 -391 260 258
5716 258 444 -158 -861 111 -676 79 89 -65 -489 249 625 -187 -516 -755 647 -15 -324 553 88 -302
$$ packed form
5566B9J76j02k28Q8j1M9L51n69M76o61lK88M61N4k4j09n67L67l14N27J86o69J90
5589a5l0J95J93l92p32J019r77P69L55o34j2J26K14j69l76P36k31J46pk57n03
5610e82P7J52N26J01o95M95j64l72Q16l01l22O56o52K97q7m6nl01R05n55k02M39
5632A80m37K81J72J63qn96M91j27k89p1K12ml81J126p95p12J72M18o83J173J80
5653D65o98M77n5K49k72q26O23K88q32J173l57N5o0l84P58j80l5l43K62k45L00
5674C63l07K98k26p33J266p22L85n98O36k55j99J44Q62j219L48K35K74p81N73
5693C44k34M18k55n40R2JK62q5L44p52O13J5L02m54j27l0O3L53k40p9m02O51k
5716B58J86o02p03R72p87P55J0j54m24P38L76q12l29k39J402o62l09Q77m65l90
$$ plain form
5736 -302 1052 137 729 482 -396 -28 25 382 -212 -206 710 -193 -166 107 20 -106 212 117 -118 170 416 -63
5758 -63 -96 -381 -445 -384 -239 -269 397 -270 412 724 647 154 -89 53 -410 440 345 123 133 48 -155 -269 -47
5781 -47 -526 257 -25 841 631 -24 -73 -642 -187 7 -372 484 607 -33 -450 216 275 -237 434 -333 161
5802 161 -307 -477 -595 140 63 42 52 352 -31 623 -64 200 572 333 179 -207 167 -473 6 99 232
5823 232 -331 382 433 40 -260 -173 -108 285 742 -99 28 52 99 525 637 197 -390 344 344 12 149 167 710
5846 710 -34 -311 148 97 -251 673 213 -38 75 405 -156 274 -60 -290 -208 46 345 26 -129 260 184
5867 184 67 92 336 108 141 -375 -113 -204 -863 37 -531 -340 485 -79 266 -533 75 303 151 -1 19
5888 19 -162 16 -152 -477 295 442 394 -247 255 -24 398 -58 448 351 83 357 -372 64 -278 -389 -341
$$ packed form
5736c02J354r15N92k47q78L68N3L57n94OR16r03K7K73q7j26L18r5k35K88K46m79
5758f3l3k85o4O1J45l0O66o67O82L12p7m93k43J42m63Q50r5k22J0q5k03j14K22
5781d7m79P83k82Q66k10o55m9n69M55J94l79Q56J23o40m17O66N9n12O71p67M94
5802A61m68j70j18P35p7k1J0L00l83O54o87K64L72k39j54l86L74o40M79R3J33
5823B32n63P13N1l93l00Q7O5L93M57q41J27K4M7M26J12m40n87P34%l32J37J8N43
5846G10p44k77M59n1l48R24m60k51J13L30n61M30l34k30Q2K54K99l19j55L89p6
5867A84j17K5K44k28L3n16K62r1o59R00n68J91Q25n64L45p99O08K28j52j52K0
5888A9j81J78j68l25P72J47m8o41N02k79M22m56N06r7k68K74p29M36l42j11M8
$$ plain form
5909 -341 63 -417 4 261 63 -5 163 -251 322 289 41 97 -372 252 232 60 -703 -231 -352 -63 454
5930 454 432 141 -86 -168 -372 60 485 180 63 -540 -100 -128 414 -61 -521 -195 -683 -385 152 19 -251
5951 -251 7 -74 -320 46 106 -287 571 -232 185 165 -395 -353 158 42 -47 73 443 -132 91 198 489 -30
5973 -30 -278 217 116 410 -54 139 -286 18 168 133 34 8 -131 107 -178 297 19 -320 87 262 -169
5994 -169 -459 191 -548 -301 138 -170 38 353 48 -199 36 -421 298 -322 503 136 54 -50 -108 531 -40
6015 -40 146 -344 46 144 73 60 87 308 -397 -21 90 242 -475 -174 388 21 179 -169 -28 312 -105 -428
6037 -428 -250 -52 171 38 417 -181 38 -315 548 -427 -299 142 -728 -336 361 101 -302 -452 -491 -119
6057 -119 397 154 -98 -17 -472 281 -23 -326 302 721 -149 227 348 355 -414 331 276 216 31 319 -4 48
$$ packed form
5909c41M04m80M21K57j98o8J68m14N73l3k48N6m69O24k0j72p63M72j21K89N17
5930D54k2k91k27q2k04M32M25l05j17o03M40k8N42m75m60L26m88K98N37j33k70
5951b51K58q1k46L66O0l93Q58q03M17k0n60M2N11j16q9J20L70n75K23J07K91n19
5973c0k48M95j01K94m64J93m25L04J50l5r9k6j39K38k85M75k78l39M07J75m31
5994a69k90O50p39K47M39l08K08L15l05k47K35m57P19o20Q25l67q2j04n8O39n71
6015d0J86m90L90R8p1j3K7K21p05L76J11J52p17L01N62l67J58l48J41L40m17l23
6037d28J78J98K23j33L79n98K19l53Q63r75J28M41q70L92O97k60m03j50l9L72
6057a19N16k43k52Q1m55P53l04l03O28M19q70L76J21Pp69P45n5o0j85K88l23N2
$$ plain form
6079 48 30 294 -605 -100 147 197 126 -530 -23 -219 -198 41 53 416 189 -123 -167 -380 268 -400 165 -396
6101 -396 343 138 -612 556 147 -127 169 -101 -15 476 -405 253 39 -890 -108 109 -160 22 30 -356 -9
6122 -9 150 21 -103 -333 -301 203 123 557 -244 592 242 118 0 -281 -42 542 -525 202 129 -413 761
6143 761 517 -513 220 -178 -248 -96 -224 217 341 308 95 -271 -418 -7 -433 -187 -221 -3 466 3 -115
6164 -115 264 -103 -115 -191 -263 446 -651 413 -166 321 -323 20 -25 332 -1 85 34 452 106 85 -183 324
6186 324 147 754 401 -430 29 20 136 467 -149 -275 131 -88 -67 689 413 63 190 -392 -174 255 -427
6207 -427 -350 -63 381 -142 161 175 -355 -233 52 26 220 185 -105 -289 -743 428 360 798 -382 -406 -374 -21
6229 -21 -67 182 -15 -402 -190 -452 166 -317 1 -560 -265 188 -321 379 197 307 -171 423 -8 804 -184
$$ packed form
6079D8j8K64q99N05K47N0p1o56N07j96K1K39J2L63k27l12m4k13O48o68N65n61
6101c96P39k05p50J168m09k74K96k70Q6M91q81O58k14r29P82K17k69J82Ql86L47
6122iJ59j29j24k30L2N04q0M34q01Q36l50j24j18k81K39N84j067P27p3n42J174
6143G61k44j030P33l98p0J52j28M41J24l3k13l66j47M11m26K46l4K18M69m63j18
6164a15L79l67j2p6p2P09j097J064n79M87o44L43m5L57l33Q6n1M18l46k1k68N07
6186C24j77O07l53q31M59rJ16L31o16j26M06k19K1P56k76l50J27n82K18M29o82
6207d27P7K87M44n23L03J4n30J22K85k6J94l5k90j84m54J171o8M38j180k4L2L53
6229b1m6K49j97l87K12k62O18m83L18n61K95M53n09P00j82J10m78N94m31Q12r88
$$ plain form
6250 -184 -51 -139 -746 393 36 -210 -51 658 41 -220 -38 316 87 -65 372 65 -332 -427 403 -36
6270 -36 -237 -166 22 -127 -227 70 -518 129 -181 576 18 -138 -196 -213 -299 26 57 -308 59 -72 -20 -104 282
6293 282 217 -873 -533 -20 -19 -12 -623 -5 24 -143 -226 -245 -93 302 -151 -251 136 -86 466 444 -29 -268 -12
6316 -12 122 236 314 -13 142 114 -34 293 48 228 -205 370 312 323 -691 -346 -363 273 -118 -198 -160 -65 296
6339 296 -245 -274 193 -554 -86 -82 -34 -213 -257 -78 -58 61 -626 133 -41 -38 300 133 -415 -47 -87 490 -267
6362 -267 -80 260 82 -423 -17 -693 85 -121 130 479 -63 -116 -150 -395 -799 -12 66 98 257 -103 -38 980
6384 980 -491 -87 524 -13 -2 -618 108 31 30 421 -84 -91 366 287 -70 -175 -72 -214 495 -27 -241 -962
6406 -962 -156 -166 -87 -504 -122 174 600 162 77 -7 349 496 -349 257 23 -356 325 -142 58 -181 -417
$$ packed form
6250a84J33q8o07J139l57k46J59P09o17k61J82L54k29j52M37l07l97r5Q30m39
6270c6k01P1J88j49j00K97n88O47l10P57n58j56n8j7q6L25L1l65L67j31N2q4L86
6293B82o5j090L40N13JPo11O18K9j67q3j9J52L95m53j00L87k22N52k2m73k39K56
6316a2J34J14P8l27J55k8j48L27k45J80m33N75n8J1j014L45j7O36l91q0L8R5L61
6339B96n41k9M67p47M68MM8j79m4J79K0J19o87P59j74LL38j67n48L68m0N77p57
6362b67J87L40j78n05M06o76P78k06K51L49n42n3l4k45m04P87P8L2J59l60O5J018
6384I80j471M04O11n37J1o16P26p7jL91n05pM57p9l57j05J03j42P09n22k14p21
6406i62Q06j0P9m17L82K96M26m38q5q4L56J47q45O06k34l79O81m67K00k39k36
$$ plain form
6427 -417 -570 221 -6 343 -206 409 249 -392 -143 -375 -359 -91 -617 564 321 -21 -51 452 667 -578
6447 -578 39 688 7 135 -306 -236 -304 7 286 360 73 -881 223 -11 -721 105 151 -30 230 570 -123
6468 -123 -231 105 -744 -133 2 38 136 -418 47 -915 796 594 28 272 -18 260 524 69 -899 57
6488 57 132 -231 113 -44 -339 123 60 -382 -263 -369 4 40 135 650 164 -12 54 -414 434 -398 240 76
6510 76 -168 242 107 -555 223 -224 -115 596 -481 -50 51 310 505 27 121 -28 263 -156 258 234 -183
6531 -183 77 125 287 -187 77 -177 -18 85 539 -343 -195 118 34 187 34 -747 -317 -23 55 491 -119
6552 -119 -468 -367 -269 -420 237 194 -519 79 457 -188 195 -188 49 304 -262 4 -547 -132 96 -28 -109
6573 -109 -297 -412 224 108 484 92 405 150 -214 -416 -205 -349 105 -130 71 -62 -88 -205 648 -187
$$ packed form
6427d17j53P91k27L49n49O15j60o41K49k32J6K68n26J181k43l42l0N03K15j245
6447e78O17O49o81J28m41P0o8L11K79P4k87r54J104k34p10Q26M6j81K60L40o93
6468a23j08L36q49O11J35L6R8n54M65r62J711k02n66K44k90K78K64m55r68R56
6488E7P5l63L44j57k95M62o3m42J19j06L73L6R5N15m86j76O6m68Q48q32O38j64
6510G6k44M10j35o62P78m47J09P11j077M31J01K59J95m78R4j49K91m19M14k4m17
6531a83K60M8J62m74K64k54J59J03M54q82J48L13q4J53j53p81M30K94P8M36o10
6552a19l49J01R8j51O57m3p13N98L78o45L83l83K37K55n66K66n51M15K28j24q1
6573a09j88j15O36j16L76l92L13k55l64k02K11j44M54k35K01j33k6j17Q53q35
$$ plain form
6593 -187 352 -151 -408 51 91 67 201 -173 294 543 143 -34 428 88 285 207 97 345 51 28 -117
6614 -117 277 -406 -496 -105 -175 -12 -412 -111 -338 5 83 -502 -244 -176 151 -11 -394 9 30 53 210 -59
6636 -59 180 -215 2 -107 402 32 210 -209 205 -132 292 269 19 679 268 -30 7 53 -214 88 245
6657 245 138 376 -80 -177 190 283 -109 -135 -293 -228 -49 -80 340 -167 -406 -446 248 386 -397 293 -114 257
6679 257 24 -201 574 70 -237 -369 407 -579 210 77 -452 -61 436 7 12 -25 121 738 364 182 -302
6700 -302 120 -311 -250 -482 -164 284 141 198 220 111 -279 -64 43 301 -410 718 -499 -396 -261 -372
6720 -372 -50 -514 329 49 84 -10 198 485 485 284 -504 -366 -73 264 -356 -309 -331 154 -198 82 415 -566
6742 -566 -105 118 885 304 448 -265 -255 -388 -25 106 -172 -108 -107 3 -133 -194 126 -245 186 -64 112 -218
$$ packed form
6593a87N39n03k57M59M0k4J34l74M67K49m00j77M62l40J97p8j10K48k94k3j45
6614a17L94o83r0L91p0J63m00L01k27L43P8n85K58O8L27j62l83M03K1K3J57k69
6636e9K39l95K17j09N09l70J78m19M14l37M24k3k50O60m11k98L7M6k67L02J57
6657B45j07K38m56r7L67R3l92k6j58O5J79l1M20n07k39m0O94J38p83O90m07L71
6679B57k33k25P75n04l07j32P76r86P89j33n29L91M97m29Nl7J46O17l74j82m84
6700c02M22m31O1k32L18M48j43N7K2j09l90K15J07K58p11J128j217J03J35j11
6720c72L22m64Q43k80L5r4K08K87%k01p88J38K93L37o20M7k2M85l52K80L33r81
6742e66M61K23P67n81J44p13J0j33L63J31k78O4JJ10j36o1L20l71M31k50J76l30
$$ plain form
6764 -218 427 -252 -194 440 682 -217 -601 417 172 -139 519 -167 -310 286 337 435 704 -400 512 487 -727
6785 -727 -45 -420 25 -70 -45 232 -385 -553 114 -245 -18 -263 -67 -61 183 -182 -633 -30 -258 -12 140
6806 140 -306 324 -288 198 544 -32 -243 -379 -194 -262 589 209 -87 110 278 64 17 -595 301 -46 287
6827 287 89 -14 -50 -293 205 -140 760 -364 -770 -249 -346 -137 367 -46 109 -461 -296 -412 126 -390
6847 -390 358 94 -148 -199 -525 182 -210 0 21 97 -467 238 -55 71 -369 107 408 334 39 -140 -258
6868 -258 -239 417 122 -266 -91 -264 51 -156 -150 -104 -4 -163 262 437 108 643 -172 -368 52 11 25 25 -407
6891 -407 301 235 -221 -525 -247 113 -14 545 247 -832 -179 -93 -210 181 294 170 63 315 -25 80
6911 80 164 -253 -108 -104 9 127 377 206 -6 63 -360 131 -219 -377 -28 -26 -156 -330 549 14 167 17
$$ packed form
6764b18O45o79N8O34K42q99l84J018k45l11O58o86j43N96N1R8K69j104R12k5j214
6785g27O82l75M45r5K5K77o17j68O67l59K27k45J96OK44l65m51O03k28K46J52
6806A40m46O30o12M86L46n76k11j36J85o8Q51l80k96J97J68k14m7o12Q96l47L33
6827B87j98j03l6k43M98l45R00j124m06N21r7K09N04m13J55n70J65j16N38n16
6847c90P48k64k42n1l26P07l92K10K1P6n64P05k93J26m40M76L01p4k95j79j18
6868b58J9O56k95l88J75j73L15k07OM6J00j59M25J75l29N35q15j96M20m1J4%m32
6891d07P08o6m56l04K78L60j27N59k98j079O53Q6j17L91J13j24j07K52l40J05
6911H0Q4m17J45MJ13J18K50j71k12O9m23M91l50j58L49Kj30j74Q79n35J53j50
$$ plain form
6933 17 697 207 -258 -207 -53 -159 -205 -204 312 316 -122 -105 401 250 130 15 -442 -48 198 236 314 243 8 -53
6957 -53 -340 102 -177 152 185 533 -25 167 184 -20 300 352 293 -642 132 280 -248 235 221 -54 301 402
6979 402 420 -248 -3 168 121 109 62 288 -406 -64 -110 196 187 252 11 9 297 613 -98 -158 490 -92 -127 -48
7003 -48 567 -358 -411 225 -14 170 -308 134 -155 -126 -186 -209 -527 297 300 156 -296 61 -433 -369 526 -911
7025 -911 -143 156 357 -102 -410 -170 116 106 678 -134 430 -438 -39 89 258 -77 -240 -72 314 -364
7045 -364 64 -361 -464 -25 605 798 -64 275 255 313 -346 115 -339 -211 -134 -363 -569 405 217 -287 -376
7066 -376 7 -108 -544 -173 -89 79 360 -34 -88 352 170 -449 186 -51 159 262 218 -201 -405 -363 -497
7087 -497 103 11 738 -551 166 -14 452 94 -198 124 -122 -217 -338 372 1 229 224 -164 129 26 -211
$$ packed form
6933A7O80m90m65N1J54j06m6JN16Mm38J7N06j51j20j15m57L94K46L8P8p1k35o1
6957e3k87M42k79L29L3L48n58J92J7k04L20N2n9r35P74J48n28M83j4k75L55J01
6979D02J8o68K45J71m7j2m7K26o94L42m6L06rO5k41kK88L16p11o0O48n82l5P9
7003d8O15r25n3O36k39J84m78M42k89K9o0k3l18Q24Lj44m52L57m94O4Q95j437
7025i11P68K99K01m59l08K40K86j0N72q12N64q68L99J28J69l35j63J68L86o78
7045c64M28m25j03M39O30J93q62L39k0N8o59M61m54J28P7k29k06R74j88n04q9
7066c76L83j15m36L71Q4J68K81l94n4M40j82o19O35k37K10J03m4m19k04M2j34
7087d97O00r2P27j289P17j80M66l58k92L22k46r5j21P10l71K28nl88K93j03k37
$$ plain form
7108 -211 -48 74 352 -181 180 -86 -331 -169 -173 312 294 -139 -538 -85 96 282 41 147 400 -32 237
7129 237 -622 45 -177 -195 10 137 -87 342 -245 -216 -368 196 -236 -129 -82 -168 -126 218 -72 -219 -103 12
7151 12 -189 120 -233 -239 296 -327 288 28 -408 -274 -43 100 -236 -549 197 120 -654 -440 257 -290 -187
7172 -187 -513 380 34 -67 -134 246 -130 -293 404 172 83 435 334 -59 12 35 -117 611 73 -1 -255 198
7194 198 484 -71 428 -86 116 -50 23 66 331 225 -510 433 676 36 404 574 -5 -732 96 -180 -482
7215 -482 -212 -361 -354 -1 -11 -443 -211 -186 13 470 -154 -16 513 342 319 230 -179 273 287 -447 8 -97
7237 -97 24 291 -1002 -67 184 -154 -257 263 -515 -361 578 298 185 -89 -478 -179 -321 90 474 -613
7257 -613 -285 312 -151 208 -557 -425 254 -164 -143 141 600 194 -36 25 -92 652 239 -252 -969 -169 -88
$$ packed form
7108b11J63J22K78n33L61k66k45J62mM85j8m33l99M53J81J86k41J06K53m32K69
7129B37q59O67k22j8K05J27k24M29n87K9j52N64m32J07M7q6M2L44k90j47J16J15
7151A2k01L09l53oN35o23O15k60m36J34K31J43l36l13P46p7p74K14O97n47J03
7172a87l26Q93l46j01o7L80l76j63O97k32q9L52j01l93P1K3j52P28n38p4k54M53
7194A98K86n55M99n14K02j66P3M3K65j06p35R43K43o40L68J70n79p27Q28k76l02
7215d82K70j49PL53j0m32K32K5J99M57o24J38N29j71k3q9m09M52J4p34M55j05
7237i7J21K67j293R35K51l38j03N20p78J54R39k80j13k74l89K99j42M11L84j087
7257f13L28N97m63L59p65J32O79m18K1K84M59m06k30O1j17P44m13m91p17Q00Q1
$$ plain form
7278 -88 -312 -46 -184 306 0 -139 -342 197 97 -203 -58 132 38 194 -374 821 297 153 -216 -208 107
7299 107 327 -81 -140 -57 -240 121 -90 333 -157 167 -554 -19 -180 -247 -37 -162 366 220 456 125 229
7320 229 -327 397 474 550 -54 -160 170 131 -494 108 246 -375 -443 -161 164 -557 274 -402 -65 -162 341 56
7342 56 -329 126 -5 98 544 -99 -45 -232 -73 163 -187 -85 871 480 286 -280 -192 -380 -690 -200 -241
7363 -241 -131 177 307 -117 -248 -40 137 -502 -60 -164 -472 -280 -219 -163 458 118 -247 -176 905 -32 -216
7384 -216 -18 98 20 -154 223 -16 -392 -683 49 -268 188 249 472 764 435 58 -337 -31 -249 -40 891
7405 891 175 -177 144 -81 374 158 -103 153 92 -448 -217 -320 164 -66 401 88 93 -408 188 121 332
7426 332 152 -178 -186 373 254 -46 -286 211 -28 -43 -2 125 -419 -452 278 489 41 757 -259 -141 -408
$$ packed form
7278h8k24K66j38M90l06j39k03N39j00l00J45J90r4J56n68J195n24j44l69QL15
7299A07K20m08n9Q3j83L61k11M23m90L24p21N35j61o7K10j25N28j46K36l31J04
7320B29n56P24P7P6o04j06L30l9o25O02J38o21o8K82L25p21Q31o76L37r7N03k85
7342E6l85M55j31J03M46o43N4j87J59K36l50J02R56l91j94n66Q8j88l10M90m1
7363b41J10L08J30m24j31K08J77o39M42j04l08J92O1N6O21l40l65P1J081r37j84
7384b16J98J16p8j74L77k39l76k91P32l17M56O1K23K92l29l77l95L06k18K09R31
7405H91p16l52L21k25M55k16k61K56o1n40K31j03M84k30M67l13Nn01N96o7K11
7426C32j80l30qN59j19l00k40M97k39j5M1J27n44l3P30K11m48P16j016J18k67
$$ plain form
7447 -408 -773 -748 -205 195 -770 443 -38 11 -150 343 -225 -235 223 -108 -392 -480 356 113 -21 17 -73 209
7469 209 -396 -509 -27 -108 -281 87 272 196 -318 393 -366 9 -343 30 181 -250 206 -146 461 -264 -267
7490 -267 -225 -47 -206 -223 -103 -660 367 -580 32 215 361 61 234 217 -117 -488 -354 401 -393 -206 -63
7511 -63 468 -89 136 146 276 -407 12 137 294 163 310 -314 190 215 245 269 -428 470 97 66 6 538
7533 538 -477 -587 287 -155 67 402 -287 56 -55 247 62 112 -272 50 0 -387 -39 132 -430 -296
7553 -296 -24 191 270 386 -254 26 -39 178 -109 82 28 43 207 -646 -480 99 118 -159 690 -128 -715 336
7575 336 -394 18 -70 212 187 57 -48 590 -235 -11 -497 751 -53 -28 -489 -131 265 -582 14 -301 -428
7596 -428 -623 -438 -674 306 46 -115 410 101 -351 571 77 -482 -142 82 8 136 158 -219 58 -238 690
$$ packed form
7447d08l65K5N43M00r65J213m81M9j61M93n68j0M58l31k84q8Q36k43j34L8r0K82
7469B09o05j13M82q1j73L68J85p6n14P11p59L75l52L73J51m31M56l52O07p25l
7490b67M2J78j59j7J20n57J027r47O12J83J46l00J73j7l34l71J34P55p94J87J43
7511f3N31n57K25J0J30o83M19J25J57j31J47o24N04K5L0K4o97Q98l73l1o0N32
7533E38j015j10Q74m42K22L35o89L43j11L02j85N0l84L22n0l87L48J71n62J34
7553b96K72K15P9J16o40K80o5K17k87J91n4J5J64q53J66N79J9k77Q49q18n87J051
7575C36p30M12q8K82k5j30j05O38q25K24m86J248q04K5m61L58L96q47N96l15j27
7596d28j95J85k36R80k60j61N25l09m52R22m94n59L40K24p4J28K2l77K77k96R28
$$ plain form
7617 690 -162 -175 492 -244 -372 23 -95 -356 252 -106 69 -136 -344 -86 162 60 -278 209 140 -148 144
7638 144 -461 312 251 142 -104 -663 54 102 305 634 42 50 -500 -6 179 183 -150 181 184 -98 107 -265 255
7661 255 133 316 -196 12 383 317 340 538 -81 6 313 194 123 -47 -178 443 -250 55 -225 -254 234 331
7683 331 429 646 332 -189 -185 -137 -735 -656 -298 96 -434 -392 128 358 556 221 17 -89 -304 19 -94 6
7705 6 59 -94 224 -29 -8 258 -34 -752 -269 -163 164 -429 -207 472 -227 80 -174 27 -5 258 -69 246
7727 246 288 -474 280 -475 -283 -350 34 -137 174 -271 461 117 129 -244 -261 -499 190 502 -277 803 53
7748 53 -80 148 -24 264 378 61 78 -496 -80 209 149 -389 -32 -237 636 198 149 -90 -224 178 -319
7769 -319 6 -15 320 -244 -362 217 192 -710 467 457 -381 -121 158 393 32 -252 -182 -255 4 129 343
$$ packed form
7617F90q52j3O67p36j28L95j18k61O08l58J75k05k08K58K48j02l38M87o9k88K92
7638A44o05P73o1j09k46n59P17M8K03L29n92Qn50M94J85Ml33L31Lk82K05l72N20
7661B55j22J83n12K08L71o6K3J98o19Q7L07j19p1j70j31O21o93L05k80k9M88R7
7683C31R8K17l14n21MM8n98P9L58L94n30M2N20K30J98l35k04j06k15L23j13J00
7705FN3j53L18k53K1K66k92p18M83J06L27n93K22O79o99L07k54K01l2K63l27L15
7727B46M2p62P54p55J92o7L84j71L11m45P32l44J2l73j7k38O89L12p79J080p50
7748E3j33K28j72K88J14l17J7n74M16K89o0n38L57k05Q73m38m9k39j34M02m97
7769c19L25k1L35n64j18N79k5r02J177j0q38K60K79K35l61k84P0p3K59J25K14
$$ plain form
7790 343 174 -45 -207 94 3 -63 95 -24 -80 112 -399 -241 -61 -84 632 141 -198 93 297 -97 330
7811 330 -178 148 248 -67 158 -460 -292 -162 745 -225 -220 563 7 -761 564 937 460 586 391 -217
7831 -217 -128 -88 -563 -158 218 -466 563 294 -184 422 -44 669 513 127 -258 -371 -540 8 -158 -54
7851 -54 -31 -207 483 -541 -189 259 281 63 -46 93 177 -260 -293 598 -441 465 615 -148 -344 -98 323
7872 323 177 -104 218 -405 -749 -15 -127 94 204 -248 398 -57 260 310 287 -299 464 186 557 -321 -74
7893 -74 -514 351 110 -300 157 -359 109 -121 -35 -169 9 201 190 100 -37 -226 -522 329 -252 277 -76
7914 -76 223 429 -159 -28 -354 -44 75 702 425 -585 80 481 -49 -277 -80 -87 -119 330 42 -769 21
7935 21 80 -222 -149 -201 -124 -371 6 308 -364 231 767 -107 -66 380 -323 -539 255 -118 190 520 -448 330
$$ packed form
7790C43j69k19j62L01r1o6J58j19n6J92n11J58J80k3P16m91l39K91K04l94M27
7811C30n08L26J00l15K25o18J68J30R07r70NP83n56p68J325L73m77J26j95o08
7831b17Q9M0m75M05L76o84J029k69m78O06m66P13j56l86l85j13j69N48j66J04
7851e4K3j76O90j024L52M48K2k18j09J39Q4m37l3Q91j039R06J50p63j96K46M21
7872C23j46k81L22o23l44P34j12K21J10m52O46m55L17N0k3n86P63k78L71q78K47
7893g4m40Q65k41m10M57n16M68k30Q6j34J78J92j1r0j37j89k96Q51n81N29l53
7914g6K99K06n88J31l26L10J19O27k77j010O65M01n30k28J97pl2M49k88q11P90
7935B1N9l02P3n2P7k47L77L02o72N95N36q74M1M46p03k16P94l73L08L30r68P78
$$ plain form
7957 330 458 -278 166 -153 167 146 368 205 436 -128 -27 175 -321 -433 -114 -287 -312 656 390 -288 48
7978 48 98 303 -93 -263 134 -103 -60 -296 156 -462 47 -365 -265 -177 427 295 338 -117 91 -372 -107 117
8000 117 -311 36 284 93 -117 202 307 -15 -459 275 515 -2 -19 48 34 276 -270 113 -100 622 -256
8021 -256 -154 453 -263 -57 -352 227 8 -206 -32 -52 -631 -828 -263 -189 240 -43 -501 69 -313 -151 -225
8042 -225 -99 441 133 602 -598 182 -13 174 240 -351 -192 54 165 -21 -270 -149 -439 -376 542 -116
8062 -116 -124 -565 -123 406 375 503 413 94 410 210 400 -69 184 538 353 15 -118 -212 133 73 133 -573
8084 -573 -53 221 -21 167 -507 -41 -118 231 -326 -719 338 440 356 81 -91 -154 247 -362 253 430 282
8105 282 -287 455 421 -113 98 -5 329 82 -46 137 -40 -363 99 596 -153 636 -387 -400 -235 641
$$ packed form
7957C30J28p36M44l19L20k1K22j63K31n64J01K02m96j12L19j73k5R68k66o78L36
7978D8N0K05l96j70L97k37M3k36M52o18N09m12J00Q8O04j32M3m55K08m63K65K24
8000A17m28L47K48j91k10L19J05l22m44P34K40n17j7O7j4K42n46L83k13P22q78
8021b56J02O07p16K06k95N79k19k14J74k0n79j97N65P4M29k83m58N70l82J62p4
8042b25J26N40l08M69j200P80j95J87O6n91J59K46J11j86k49J21k90O3R18o58
8062a16qm41M42N29l1J28r0l19L16k00J90m69K53L54j85l38j33r4L45o0O0p06
8084e73N20K74k42J88o74M66p7L49n57l93J057J02q4k75j72o3M01o09O15J77j48
8105B82n69P42l4n34K11j03L34k47j28J83j77l23M62M97p49P89j023j3J65Q76
$$ plain form
8125 641 -385 -623 -495 23 379 586 264 -346 -181 -326 51 129 -111 -156 61 28 234 6 235 238 -108
8146 -108 -8 -112 -35 174 86 -651 678 331 -101 -762 93 335 -379 43 445 -755 411 -133 127 275
8166 275 -460 235 120 -37 41 112 -48 -88 17 682 473 -196 68 -140 -82 -407 19 264 422 277 -194
8187 -194 -127 348 -113 83
$$ packed form
8125F41j026k38J28N18L56K07l22o10J65j45L77P8k40m5K17l3K06k28K29Ll46
8146a08J00j04P7K09q8p37J329l47m32o61Q55K42p14M22M02j200J166n44K60J48
8166B75p35O95j15j57P8P1j60m0J05O65k09o69K64k08N8l25M26K45J58j45m71
8187a94O7M75m61J96
8191H3
$$ Imaginary data points
##PAGE= N=2
##DATA TABLE= (X++(I..I)), XYDATA
$$ plain form
0 0 0 0 0 0 0 0 0 0 0 0 0 0 0 0 0 0 48 -48 48 -48 48 -71 96 -96 100 -144 144 -192 192 -240 267 -299 338 -385
34 -385 438 -491 549 -619 689 -771 851 -946 1051 -1160 1283 -1417 1561 -1723 1898 -2088
50 -2088 2302 -2535 2799 -3086 3417 -3788 4216 -4710 5284 -5976 6814 -7854 9194 -10980
64 -10980 13497 -17286 23650 -36249 70690 -364666 -1099132 -350295 -113982 -179623 393196
75 393196 770168 386318 188305 -114025 -713951 -677679 -124568 27727 274597 706031
85 706031 530145 44251 -180755 -562989 -738268 -167234 279660 210323 440010 636422
95 636422 131968 -366655 -455307 -558720 -345359 252160 440508 350654 468868 200706
105 200706 -431231 -524109 -313472 -295266 39534 522733 451655 249933 207057 -228254 -661290
$$ packed form
0@%%%%%%%%%%%%%%%%M8r6R6r6R6j19J67j92J96k44K88l36L84m32N07n66O37p23
34c85Q23r29J040j168J308j460J622j797J997k211K443k700K978l284L621l986
50b088M390m837N334n885O503p205Q004q926R994j1260J2790j4668J7048k0174
64a0980K4477l0783M0936n9899J06939m35356p34466P48837K36313o5641N72819
75C93196L76972l83850j98013l02330n99926L6272N53111J52295K46870M31434
85G06031j75886m85894k25006l82234j75279N71034M46894o9337K29687J96412
95F36422n04454m98623q8652j03413K13361N97519J88348q9854J18214k68162
105B00706o31937r2878K10637J8206L34800M83199p1078k01722m2876m35311m33036
$$ plain form
116 -661290 -414121 -64885 56800 374440 543455 238465 1050 -158821 -508067 -489717
126 -489717 -47795 133975 246692 544648 385984 -135959 -284958 -315646 -463829 -186738
136 -186738 280240 323132 304445 367275 27270 -381296 -361466 -290712 -223614 175341 460085
147 460085 316620 199158 65365 -321602 -458856 -215762 -83995 57299 389716 419780
157 419780 136248 -21845 -207504 -451041 -312564 14083 135267 284495 420259 176709
167 176709 -134718 -210014 -320046 -349978 -34355 229895 254297 324730 252234 -120486 -322284
178 -322284 -261091 -251266 -104507 234911 334252 227498 179333 -24899 -329527 -326657 -161541
189 -161541 -72741 147262 374330 272924 75264 -38316 -249060 -365957 -167720 29858
$$ packed form
116f61290K47169L49236J21685L17640J69015l04990k37415j59871l49246J8350
126d89717M41922J81770J12717K97956j58664n21943j48999l0688j48183K77091
136a86738M66978M2892j8687O2830l40005m08566J9830P0754O7098L98955K84744
147D60085j43465j17462j33793l86967j37254K43094J31767J41294L32417L0064
157D19780k83532j58093j85659k43537J38477L26647J21184J49228J35764k43550
167A76709l11427p5296j10032k9932L15623K64250K4402P0433p2496l72720k01798
178c22284O1193R825J46759L39418R9341j06754m8165k04232l04628K870J65116
189a61541Q8800K20003K27068j01406j97660j13580k10744j16897J98237J97578
$$ plain form
199 29858 117246 289981 324518 74282 -123902 -202863 -307738 -227527 52583 195661 229790
210 229790 277191 126329 -154896 -246602 -232422 -206195 -115 235717 250677 198517 128125
221 128125 -110427 -298135 -234072 -124863 -17103 197177 299429 179920 54637 -72930
231 -72930 -261077 -280213 -102904 37003 155206 278113 213703 15873 -109123 -210432
241 -210432 -267170 -126919 79178 169389 225593 215019 29334 -155462 -204039 -215803 -144710
252 -144710 68390 214792 206218 165348 54608 -147774 -240951 -184654 -101108 38225 209901
263 209901 237150 132312 19581 -118824 -236522 -201835 -67977 57454 182356 236660
273 236660 139029 -8171 -121605 -212409 -204937 -62309 83882 169386 212484 147004 -19320
$$ packed form
199B9858Q7388J72735L4537k50236j98184p8961j04875Q0211K80110J43078L4129
210B29790M7401j50862k81225r1706J4180K6227K06080K35832J4960n2160p0392
221A28125k38552j87708O4063J09209J07760K14280J02252j19509j25283j27567
231g2930j88147j9136J77309J39907J18203J22907o4410j97830j24996j01309
241b10432n6738J40251K06097R0211N6204j0574j85685j84796m8577j1764P1093
252a44710K13100J46402q574m0870j10740k02382r3177N6297Q3546J39333J71676
263B09901K7249j04838j12731j38405j17698L4687J33858J25431J24902N4304
273B36660r7631j47200j13434r0804P472J42628J46191Q5504M3098o5480j66324
$$ plain form
284 -19320 -144773 -190601 -182518 -73773 95746 187453 185572 128534 -6119 -154775 -201747
295 -201747 -155280 -58851 82113 192358 186795 101217 -15471 -141477 -202460 -151263 -36778
306 -36778 85842 181188 186949 94238 -30674 -137829 -194250 -149607 -26721 95874 171792
317 171792 177091 90958 -40304 -141958 -178875 -138817 -26330 102189 173000 162163 82146
328 82146 -41708 -148286 -175316 -121770 -18088 98536 172480 156645 65643 -46781 -138630
339 -138630 -171376 -117668 -4776 103411 162503 149899 61126 -58517 -141717 -158689 -108283
350 -108283 -621 109419 157573 137754 58674 -58701 -147284 -152828 -94063 592 107501
361 107501 162820 126713 40211 -57524 -140560 -153843 -83623 11526 100146 157714 128372 30051
$$ packed form
284a9320j25453m5828Q083J08745J69519R1707j881n7038j34653j48656m6972
295b01747M6467R6429J40964J10245n563q5578j16688j26006o0983N1197J14485
306c6778J22620R5346N761r2711j24912j07155n6421M4643J22886J22595P5918
317A71792N299q6133j31262j01654l6917M0058J12487J28519P0811j0837q0017
328H2146j23854j06578k7030N3546J03682J16624P3944j5835r1002j12424r1849
339a38630l2746N3708J12892J08187N9092j2604q8773j19643q3200j6972N0406
350a08283J07662J10040M8154j9819p9080j17375q8583n544N8765R4655J06909
361A07501N5319l6107q6502r7735q3036j3283P0220R5149Q8620N7568k9342r8321
$$ plain form
373 30051 -65805 -131859 -149853 -82627 27922 103999 138451 123792 31417 -79411 -129736 -130813
385 -130813 -81474 24915 116536 135164 106665 31434 -80668 -140170 -116964 -63856 17633
396 17633 115038 142059 90066 20076 -66089 -141391 -125797 -44421 28667 100890 142912 93819
408 93819 -732 -70269 -122794 -127096 -45775 46543 94788 126265 100740 -1900 -88268 -114299
420 -114299 -110486 -53417 51706 110027 108424 84295 7421 -92147 -122366 -90886 -45044 37829
432 37829 118223 115813 62786 3190 -80292 -130293 -89341 -22618 34329 104914 125054 56843
444 56843 -17457 -70813 -118560 -100920 -14248 53420 92620 116378 65903 -30917 -82191 -98109
456 -98109 -94449 -25489 64204 95997 96879 66624 -23221 -97692 -95781 -72698 -30608 58331 113250
$$ packed form
373C0051r5856o6054j7994O7226J10549P6077L4452j4659r2375j10828n0325j077
385a30813M9339J06389R1621J8628k8499p5231j12102n9502K3206N3108Q1489
396A7633R7405K7021n1993o9990q6165p5302J5594Q1376P3088P2223M2022m9093
408I3819r4551o9537n2525m302Q1321R2318M8245L1477k5525j02640q6368k6031
420a14299L813N7069J05123N8321j603k4129p6874r9568l0219L1480M5842Q2873
432C7829Q0394k410n3027n9596q3482n0001M0952O6723N6947P0585K0140o8211
444E6843p4300n3356m7747J7640Q6672O7668L9200K3758n0475r6820n1274j5918
456i8109L660O8960Q9693L1793Q82l0255q9845p4471J911K3083M2090Q8939N4919
$$ plain form
469 113250 87453 44418 -14347 -92680 -108808 -59369 -14290 43951 110351 99814 27897 -27000
481 -27000 -75817 -108990 -66742 5669 49767 92759 103313 32371 -44717 -72920 -92124 -75787
493 -75787 4525 69405 84249 86215 42923 -46936 -89511 -76671 -60226 -8166 72620 95687
505 95687 68774 32707 -33562 -94153 -83962 -42330 -4671 61118 104772 68098 12041 -29158
517 -29158 -81886 -95290 -38261 15552 51268 92485 79784 4996 -45724 -68419 -86707 -50541
529 -50541 25844 64538 75318 74233 16391 -57292 -75505 -67619 -48468 16870 77155 77348 54511
542 54511 18536 -48644 -86603 -64300 -32949 10823 73296 85827 44474 6851 -38158 -86167
554 -86167 -73268 -17758 19493 58189 87487 52626 -9825 -41755 -69459 -76997 -23741 37471
$$ packed form
469A13250k5797m3035n8765p8333j6128M9439M5079N8241O6400j0537p1917n4897
481b7000m8817l3173M2248P2411M4098M2992J0554p0942p7088k8203j9204J6337
493g5787Q0312O4880J4844J966m3292q9859m2575J2840J6445N2060Q0786K3067
505I5687k6913l6067o6269o0591J0191M1632L7659O5789M3654l6674n6057m1199
517b9158n2728j3404N7029N3813L5716M1217j2701p4788n0720k2695j8288L6166
529e0541P6385L8694J0780j085n7842p3683j8213P886J9151O5338O0285J93k2837
542E4511l5975o7180l7959K2303L1351M3772O2473J2531m1353l7623m5009m8009
554h6167J2899N5510L7251L8696K9298l4861o2451l1930k7704p538N3256O1212
$$ plain form
566 37471 57503 70298 57829 -6322 -57547 -65065 -61789 -30605 35271 70701 61608 45532 1711
579 1711 -58902 -73230 -49867 -23094 27411 73665 65227 32240 252 -49581 -80688 -50574
591 -50574 -8007 23787 65191 73722 28121 -14480 -42126 -72350 -59615 -2103 36737 52678
603 52678 66711 37934 -21346 -51641 -58537 -53886 -10699 44893 58487 53479 35524 -15390 -59102
616 -59102 -59226 -42967 -12263 41604 65994 47265 24623 -8822 -57633 -66489 -33347 -4218 31481
629 31481 67299 54358 12778 -15206 -46380 -67818 -39502 8155 34434 55485 56874 15731
641 15731 -26904 -45085 -57221 -42911 7790 44960 50304 47695 21190 -28384 -52376 -48647 -35988
654 -35988 1234 47735 56127 38175 16712 -21684 -56745 -51557 -25206 2661 40787 61036
$$ packed form
566C7471K0032J2795j2469o4151n1225p518L276L1184O5876L5430r093j6076m3821
579A711o0613j4328K3363K6773N0505M6254q438l2987l1988m9833l1107L0114
591e0574M2567L1794M1404Q531m5601m2601k7646l0224J2735N7512L8840J5941
603E2678J4033k8777n9280l0295o896M651M3187N5592J3594n008j7955n0914m3712
616e9102j24J6259L0704N3867K4390j8729k2642l3445m8811q856L3142K9129L5699
629C1481L5818j2941m1580k7984l1174k1438K8316M7657K6279K1051J389m1143
641A5731m2635j8181j2136J4310N0701L7170N344k609k6505m9574k3992L729J2659
654c5988L7222M6501Q392j7952k1463l8396l5061N188K6351K7867L8126K0249
$$ plain form
666 61036 36935 5068 -19065 -49859 -56300 -21723 12504 35230 54819 43487 1897 -27638
678 -27638 -43903 -52329 -25833 18253 39527 45851 41090 5944 -34342 -45314 -42336 -25742 14675
691 14675 46064 44461 31434 8118 -31761 -51248 -38812 -17041 11367 44329 49847 25975
703 25975 2088 -26407 -50913 -42034 -10457 15328 38504 49557 28440 -5661 -29191 -44317
715 -44317 -42086 -10858 21194 37573 43517 29062 -6452 -33187 -40835 -37590 -14037 22968 41108
728 41108 38219 26235 -2773 -35988 -43147 -30465 -10575 19103 42649 38461 19441 -3793 -32210
741 -32210 -45325 -29146 -4695 18441 39800 40783 16360 -9613 -29676 -41789 -30832 -1537
753 -1537 22529 36564 37751 17778 -13059 -31684 -37659 -29466 -1970 25750 35774 33441 17353
$$ packed form
666F1036k4101l1867k4133l0794o441L4577L4227K2726J9589j1332m1590k9535
678b7638j6265q426K6496M4086K1274O324m761l5146m0286j0972K978J6594M0417
691A4675L1389j603j3027k3316l9879j9487J2436K1771K8408L2962N518k3872
703B5975k3887k8495k4506Q879L1577K5785K3176J1053k1117l4101k3530j5126
715d4317K231L1228L2052J6379N944j4455l5514k6735p648L245K3553L7005J8140
728D1108k889j1984k9008l3215p159J2682J9890K9678K3546m188j9020k3234k8417
741c2210j3115J6179K4451K3136K1359R83k4423k5973k0063j2113J0957K9295
753a537K4066J4035J187j9973l0837j8625n975Q193K7496K7720J0024k333j6088
$$ plain form
766 17353 -12308 -34409 -35998 -25036 -2329 25411 37808 30636 13006 -10911 -34135 -37501 -20863
779 -20863 934 22393 37796 31302 8816 -13216 -31131 -36709 -21873 4418 25026 34354 30215
792 30215 8876 -15919 -30977 -33826 -20118 4916 25327 33515 27589 8268 -16994 -31793 -31402
805 -31402 -17917 5542 27303 32191 24386 7046 -16294 -32682 -30449 -14396 5896 25893 33350
818 33350 24056 3848 -16461 -30383 -30231 -13722 8853 25419 30742 22011 3101 -18061 -30189
831 -30189 -28413 -12639 10026 25769 30471 20242 615 -18674 -29142 -27722 -11125 10946 26396
844 26396 28783 18820 -68 -19079 -28977 -25582 -8868 11348 25942 28912 17318 -1829 -20013
857 -20013 -27171 -24548 -8383 12390 26370 26752 15645 -2775 -20218 -27726 -20813 -7753 11547
$$ packed form
766A7353k9661k2101j589J0962K2707K7740J2397p172j7630k3917k3224l366J6638
779b0863K1797K1459J5403o494k2486k2032j7915n578J4836K6291K0608R328m139
792C0215k1339k4795j5058k849J3708K5034K0411Q188n926j9321k5262j4799L91
805c1402J3485K3459K1761M888p805j7340k3340j6388K233J6053K0292J9997P457
818C3350r294k0208k0309j3922J52J6509K2575J6566N323q731j8910k1162j2128
831c0189J776J5774K2665J5743M702j0229j9627j9289j0468J420J6597K2071J5450
844B6396K387r963j8888j9011r898L395J6714K0216J4594K970j1594j9147j8184
857b0013p158K623J6165K0773J3980L82j1107j8420j7443p508O913J3060J9300
$$ plain form
870 11547 26269 26073 14043 -3410 -19684 -27594 -20491 -3753 12471 24169 26210 12762 -6209
883 -6209 -20054 -25873 -20136 -3280 14186 24155 23987 12469 -7209 -20850 -24477 -18613 -3069 15725
897 15725 24087 22211 11680 -5878 -22339 -23818 -15423 -2423 14705 25091 20715 8077 -6558
910 -6558 -20715 -24819 -14384 -12 13722 23683 21202 6262 -7935 -18655 -24436 -15285 2883
923 2883 14459 21043 20491 7263 -11219 -19802 -20790 -15692 1982 18139 21092 16710 7386 -10357
937 -10357 -20810 -18849 -12140 1155 17491 22243 14758 5395 -8021 -21142 -20713 -8873 2023
950 2023 14920 23540 15240 663 -9213 -18661 -20781 -9154 5725 14638 20497 16545 480 -12209
964 -12209 -17168 -19554 -10391 7222 17182 16772 14652 3523 -13828 -19599 -14544 -9191 4650 18781
$$ packed form
870A1547J4722j96j2030j7453j6274p910P103J6738J6224J1698K041j3448j8971
883f209j3845n819N737J6856J7466R969j68j1518j9678j3641l627N864J5544J8794
897A5725Q362j876j0531j7558j6461j479Q395J3000J7128J0386m376j2638j4635
910f558j4157m104J0435J4372J3734R961k481j4940j4197j0720n781R151J8168
923B883J1576O584n52j3228j8482q583r88N098J7674J6157K953m382r324j7743
937a0357j0453J961O709J3295J6336M752p485r363j3416j3121M29J1840J0896
950B023J2897Q620q300j4577r876r448k120J1627J4879Q913N859l952j6065j2689
964a2209m959k386R163J7613R960m10k120j1129j7351n771N055N353J3841J4131
$$ plain form
978 18781 18898 11061 2538 -11546 -20184 -14755 -5600 3859 16913 19919 8821 -193 -9236 -19271
992 -19271 -17626 -2998 8167 13460 18638 12193 -3861 -12111 -16009 -15605 -5064 8576 14751 16043
1006 16043 11792 -3165 -14591 -15183 -12813 -6648 8847 18148 13903 8253 -97 -13887 -18896 -10798
1020 -10798 -2402 7233 16454 15258 6026 -1870 -11405 -19024 -11132 150 6885 13461 17126 6480
1034 6480 -6116 -11618 -15394 -13477 -142 10054 13571 14216 7667 -5430 -13800 -12842 -10918 -1562
1048 -1562 11226 14549 10619 7677 -4035 -15538 -14484 -7096 -698 8590 16451 11908 4219 -4405
1062 -4405 -12900 -15293 -6729 1722 7259 14435 12983 2093 -5661 -11300 -14930 -9152 3595 9648
1076 9648 11405 12053 4623 -8061 -13020 -11810 -8502 2280 11475 11921 9383 4602 -7204 -13884 -11097
$$ packed form
978A8781J17p837q523j4084q638N429R155R459J3054L006j1098r014r043j0035
992a9271J645J4628J1165N293N178o445j6054q250l898M04J0541J3640O175J292
1006A6043m251j4957j1426n92K370O165J5495R301m245n650q350j3790n009Q098
1020a0798Q396R635R221j196r232p896r535p619P892J1282O735O576L665j0646
1034F480j2596n502l776J917J3335J0196L517O45o549j3097q370R58J924R356
1048a562J2788L323l930k942j1712j1503J054P388O398R288P861m543p689q624
1062d405q495k393Q564Q451N537P176j452j0890p754n639l630N778J2747O053
1076I648J757O48p430j2684m959J210L308J0782R195M46k538m781j1806o680K787
$$ plain form
1091 -11097 -5585 1076 11222 13658 7364 1717 -5631 -13720 -12415 -3400 2448 9181 13575 9070
1105 9070 -230 -5827 -11098 -12827 -3787 5404 8444 11593 9859 -2 -8964 -10747 -10260 -5555 4791
1120 4791 10605 10488 8023 1620 -9315 -11888 -8594 -4528 3059 11086 11478 6005 876 -7216 -13105
1135 -13105 -9058 -1189 3382 9513 11720 5659 -1991 -6749 -11028 -9989 -1928 5486 8412 10978 6839
1150 6839 -2157 -8201 -9355 -8732 -2147 6988 9413 9030 6586 -2377 -9910 -9270 -6454 -3134 5310 10841
1166 10841 8411 4506 -1091 -8731 -11138 -6291 -18 4651 10354 10007 2628 -2812 -7162 -10718 -6800
1181 -6800 1384 5166 8507 9200 3340 -4797 -7168 -8976 -7058 697 6754 8720 7470 4260 -4492
1196 -4492 -8963 -8336 -4989 -454 6857 9544 6998 3072 -2948 -8941 -8470 -3850 443 6092 9858
$$ packed form
1091a1097N512O661J0146K436o294n647p348q089J305R015N848O733M394m505
1105I070r300n597n271j729R040R191L040L149j734r861q962j783M87M705J0346
1120D791N814j17k465o403j0935k573L294M066P587Q027L92n473n129q092n889
1135a3105M047P869M571O131K207o061p650m758m279J039Q061P414K926K566m139
1150F839q996o044j154O23O585R135K425l83k444q963p533O40K816L320Q444N531
1166A0841k430l905n597p640k407M847O273M669N703l47p379n440m350l556L918
1181f800Q184L782L341O93n860q137k371j808J918P755O057J966j250l210q752
1196d492m471O27L347M535P311K687k546l926o020n993M71M620M293N649L766
$$ plain form
1211 9858 6840 1319 -3287 -8145 -8406 -4205 2004 6240 8763 7126 1472 -4381 -7309 -8997 -4391
1226 -4391 2231 6001 7198 6691 1635 -4850 -7459 -7316 -3717 1296 6917 7964 5315 1094 -3873
1241 -3873 -8293 -7138 -2732 2126 6439 7967 4762 322 -4611 -7638 -6678 -2784 2572 6326 7831
1256 7831 4176 -599 -4637 -7330 -6375 -2276 2929 5397 6751 5067 -681 -5684 -6629 -5438 -2494
1271 -2494 2815 7271 6976 3901 -384 -5174 -7343 -4964 -1501 3274 6497 6566 3150 -772 -5285 -6870
1287 -6870 -5022 -1235 3105 6442 6763 3017 -1649 -5132 -6743 -4808 -416 3578 5783 5490 3643
1302 3643 -1493 -5293 -6042 -4242 -613 3480 6303 5315 2668 -1523 -5433 -5768 -4248 329 3409 6123
1318 6123 5523 1635 -1756 -4983 -5449 -4008 84 3762 6389 4986 2067 -2519 -4601 -5734 -3080
$$ packed form
1211I858l018n521m606m858k61M201O209M236K523j637n654n853k928j688M606
1226d391O622L770J197n07n056o485k609J43L599N013N621J047k649m221m967
1241c873m420J155M406M858M313J528l205m440m933l027R60L894N356L754J505
1256G831l655m775m038k693R55M099N205K468J354j684n748n003r45J191K944
1271b494N309M456k95l075m285m790k169K379L463M775L223O9l416l922m513j585
1287f870J848L787M340L337L21l746m666l483j611J935M392L994K205k93j847
1302C643n136l800p49J800L629M093K823r88k647m191l910l35J520M577L080K714
1318F123o00l888l391l227m66J441M092L678K627j403k919m586k082j133K654
$$ plain form
1333 -3080 341 3947 5543 4648 1984 -2862 -4946 -5808 -3322 823 4498 5705 4492 1801 -2474
1348 -2474 -5010 -5437 -2590 569 4046 5603 4402 1344 -2495 -5135 -5709 -2866 1116 4178 5136 3935
1364 3935 568 -3199 -5502 -4453 -2373 923 4874 5359 3407 888 -2826 -5245 -4787 -2115 1362
1379 1362 4408 5086 3082 -264 -2572 -5147 -4419 -1765 1697 3929 5106 3054 -564 -3060 -4787
1394 -4787 -3718 -1051 1690 3851 4426 2499 100 -3838 -4649 -4084 -1071 1962 4075 4620 2854 400
1410 400 -3476 -4479 -3727 -1222 1787 4256 4158 2162 -1283 -2936 -4443 -3141 -819 1894 3637 4088
1426 4088 1961 -1201 -3467 -4535 -3719 -566 2434 4167 3375 2281 -597 -3792 -4263 -2657 -82 2306
1442 2306 3965 3831 1166 -918 -3362 -4162 -2467 -17 2032 4510 3406 1570 -1728 -3120 -4294
$$ packed form
1333c080L421L606J596q95k664m846k084q62K486M145L675J207j213k691m275
1348b474k536m27K847L159L477J557j201l058l839k640n74K843L982L062R58j201
1364C935l367l767k303J049K080L296L951M85j952k519l714k419M58K672L477
1379A362L046O78k004l346k308k575P28K654L462K232J177k052l618k496j727
1394d787J069K667K741K161N75j927k399l938q11N65L013L033K113N45j766k454
1410D00l876j003P52K505L009K469r8j996l445j653j507J302K322K713J743M51
1426D088k127l162k266j068Q16L153L000J733p92j094k878l195m71J606K575K388
1442B306J659j34k665k084k444q00J695K450K049K478j104j836l298j392j174
$$ plain form
1457 -4294 -2747 -550 2403 3810 3437 1413 -1485 -2851 -3610 -2572 -442 2783 3981 2641 1088
1472 1088 -1500 -3052 -3657 -2490 729 2982 3707 2695 1153 -950 -3607 -3735 -1182 405 2174 3987
1488 3987 2840 883 -1225 -2844 -2873 -1819 495 2295 3214 2702 -390 -2152 -3541 -2884 -1535 690
1504 690 2530 3056 2378 980 -2225 -2916 -3102 -2024 291 2847 2587 1491 393 -2062 -3411 -2454 -1521
1521 -1521 963 2621 3826 1870 135 -1066 -3560 -3329 -1161 825 1733 3135 1667 -471 -2149
1536 -2149 -2919 -2623 -1308 833 1999 2843 1942 -385 -2498 -3667 -2315 -1016 1777 3183 2693 2258
1552 2258 -509 -2405 -3331 -2025 -505 915 2691 2846 1184 -153 -1955 -2747 -1441 -330 1496 2247
1568 2247 3216 1373 -681 -1652 -2686 -1434 -90 1708 2326 2425 1073 -421 -2116 -2223 -2223 -517 1791
$$ packed form
1457d294J547K197K953J407l73k024k898j366p59J038K130L225J198j340j553
1472A088k588j552o05J167L219K253P25j012j542k103k657j28K553J587J769J813
1488C987j147j957k108j619k9J054K314J800R19n12l092j762j389O57J349K225
1504F90J840N26o78j398l205o91j86J078K315K556k60j096j098k455j349R57R33
1521a521K484J658J205j956j735j201k494K31K168J986R08J402j468k138j678
1536b149p70K96J315K141J166Q44r01k327k113j169J352J299K793J406m90m35
1552B258k767j896r26J306J520J420J776J55j662j337j802p92J306J111J826P51
1568B247R69j843k054r71j034J252J344J798O18R9j352j494j695j07%J706K308
$$ plain form
1585 1791 2411 1608 1089 -219 -2715 -2428 -1662 -91 1835 1947 1710 758 -287 -2075 -2849 -1013 14
1602 14 1318 2176 2809 546 -1561 -1636 -2518 -920 185 1912 2118 2238 493 -889 -1748 -2086 -1471 92
1620 92 1225 1420 1406 728 -1074 -1773 -1393 -1240 409 1778 2367 1542 -172 -1207 -2316 -2026 -1082 207
1638 207 1526 1988 1598 84 -1518 -2843 -1322 -403 888 1274 1708 1903 115 -1132 -1091 -2073 -914
1655 -914 1138 2171 1480 1125 437 -1847 -1384 -1074 -313 15 2479 1423 1383 728 -1296 -1665 -1781 -264
1673 -264 230 1639 1641 846 68 -1200 -1949 -1210 -777 1025 1616 2121 595 -228 -1268 -1805 -1697 -634 1225
1692 1225 1763 1928 1009 -95 -1199 -1816 -1822 -475 695 2060 1582 728 220 -1606 -1620 -1691 -137 1211
1710 1211 1981 1251 476 -919 -1030 -1356 -1245 -894 1285 1697 710 418 -889 -1402 -1876 -781 -214 680
$$ packed form
1585A791O20q03n19j308k496K87P66J571J926J12k37r52j045j788p74J836J027
1602A4J304Q58O33k263k107p5q82J598J105J727K06J20j745j382q59l38O15J563
1620I2J133J95j4o78j802o99L80J53J649J369N89q25j714j035j109K90R44J289
1638B07J319M62l90j514j602j325J521R19J291L86M34J95j788j247M1r82J159
1655i14K052J033o91l55o88k284M63L10P61L28K464j056m0o55k024l69j16J517
1673b64M94J409Kp95p78j268p49P39M33J802N91N05j526q23j040n37J08J063J859
1692A225N38J65r19j104j104o17oJ347J170J365m78q54n08j826j4p1J554J348
1710A211P70p30p75j395j11l26J11L51K179M12r87k92j307n13m74J095N67Q94
$$ plain form
1728 680 1349 1511 1071 -569 -964 -1494 -1422 -469 1086 1348 1111 561 -628 -1223 -1554 -1042 505 749 1444
1747 1444 665 -58 -799 -1376 -1368 -560 237 938 1389 1256 -146 -226 -975 -1029 -525 -218 1050 1705 719 301
1767 301 -248 -838 -931 -857 10 1032 550 879 15 -556 -1572 -1228 -479 716 1405 1349 1363 -71 -664 -1014
1787 -1014 -970 -771 364 950 1358 946 -200 -349 -1573 -1610 -643 -382 1667 1320 1089 -176 -848 -1420 -994
1806 -994 -713 449 1330 1076 1125 -33 -783 -687 -484 -51 392 1101 771 351 397 -755 -789 -425 131 -131
1826 -131 1173 1292 429 -1 -912 -1050 -797 -293 66 861 1240 739 -453 -1161 -1191 -1197 -215 880 1151 1478
1846 1478 943 64 -849 -1754 -932 32 856 1499 663 -258 -311 -1131 -362 -445 1021 429 630 1023 -134 -171
1866 -171 -657 -893 -530 -7 610 848 976 434 -666 -955 -1217 -641 -87 684 1043 983 136 -252 -807 -936
$$ packed form
1728F80O69J62m40j640l95n30P2R53J555K62k37n50j189n95l31N12J547K44O95
1747A444p79p23p41n77QQ08P97P01M51j33j402q0p49n4N04L07J268O55r86m18
1767C01n49n90r3P4Q67J022m82L29q64n71j016L44P49J195O89n6J4j434n93l50
1787a014M4J99J135N86M08m12j146j49j224l7R67K61K049l47k31j265o72n72M26
1806i94K81J162Q81k54M9j158p50R6K03M33M43P09l30m20M6j152l4L64N56k62
1826a31J304J19q63m30r11j38K53N04L59P95L79n01j192p08l0oR82J095K71L27
1846A478n35q79r13r05Q22R64Q24O43q36r21n3q20P69q3J466n92K01L93j157l7
1866a71m86k36L63N23O17K38J28n42j100k89k62N76N54P71L59o0q47l88n55j29
$$ plain form
1886 -936 -907 449 685 1355 725 6 -366 -920 -549 -797 343 692 688 1064 63 -728 -121 -1128 -331 467
1906 467 234 686 437 218 -127 -1023 -530 -354 202 546 1297 406 -98 -325 -461 -657 -302 224 506 694
1926 694 418 75 -922 -978 -571 212 739 1300 787 245 178 -730 -1171 -427 -298 424 693 670 243 392 -84
1947 -84 -713 -791 -784 936 847 309 170 -218 -402 -304 -930 -714 -472 381 615 345 -317 -174 -1326 -631 -19
1968 -19 90 539 824 322 35 30 -38 -902 -242 221 654 875 332 -651 -508 -769 -190 -866 382 445 334
1989 334 369 -231 -373 -509 20 -99 238 699 644 -104 -326 -410 -374 -268 269 465 756 1001 883 -322 -277
2010 -277 -1038 -280 212 -64 204 663 73 -285 -179 -311 -452 284 813 367 808 463 -283 -722 -594 -497
2030 -497 545 742 663 497 14 -409 -932 -350 -324 292 -156 620 232 59 -200 -10 -398 -286 -181 290
$$ packed form
1886i36K9J356K36O70o30p19l72n54L71k48J140L49mL76j001p91O07j007P97P98
1906D67k33M52k49k19l45q96M93J76N56L44P51q91n04k27j36j96L55N26K82J88
1926F94k76l43r97n6M07P83N27N61n13n42o7r08m41P44J29P22K69k3m27J49m76
1947h4o29p8PJ720q9n38j39l88j84R8o26K16K42Q53K34k70o62J43j152O95O12
1968a9J09M49K85n02k87no8q64O60M63M33K21n43r83J43k61N79o76J248O3j11
1989C34L5o00j42j36N29j19L37M61n5p48k22q4L6J06N37J96K91K45j18j205M5
2010b77p61P58M92k76K68M59n90l58J06j32j41P36N29m46M41l45p46m39J28R7
2030d97J042J97p9j66m83m23n23N82K6O16m48P76l88j73k59J90l88J12J05M71
$$ plain form
2050 290 554 150 -84 -114 -577 149 53 320 214 771 284 398 402 3 -101 102 257 400 444 -104 -452 302
2072 302 -546 -567 -210 434 183 310 682 -193 -827 -530 -389 29 -25 64 476 176 -140 -301 -955 -131 282
2093 282 306 727 125 161 -147 -618 -122 209 -292 257 428 523 -326 -9 -834 -884 -502 579 603 366 567
2114 567 289 67 73 -496 -951 -410 -110 383 78 -171 -118 -910 -728 213 -878 66 711 375 -310 -49 -130
2135 -130 -116 -953 -603 425 338 202 -48 101 -890 18 -564 498 415 1069 201 463 -309 -141 114 -237
2155 -237 -133 343 -106 275 36 -82 235 -154 -267 186 745 107 756 -106 82 -517 -825 -154 -195 142
2175 142 1116 281 77 -557 -178 301 -186 -402 61 1153 -104 258 -14 -275 -517 -507 47 305 205 -347
2195 -347 312 -135 -129 -406 -99 56 600 997 367 -219 -254 -124 77 182 294 313 474 695 -404 -183 -625
$$ packed form
2050B90K64m04k34l0m63P26r6K67j06N57m87J14Ml99j04K03J55J43M4n48l48P54
2072C02q48k1L57O44k51J27L72q75o34K97J41M18n4Q9M12l00l16j61o54Q24M13
2093B82K4M21o02L6l08m71M96L31n01N49J71R5q49L17q25n0L82J081K4k37K01
2114E67k78k22On69m55N41L00M93l05k49N3p92J82R41j091R44O45l36o85K61q1
2135a30J4q37L50J028q7j36k50J49r91R08n82J062q3O54q68K62p72J68K55l51
2155b37J04M76m49L81k39j18L17l89j13M53N59o38O49q62J88n99l08O71m1L37
2175A42R74q35k04o34L79M79m87k16M63J092j257L62k72k61k42J0N54K58j00n52
2195c47O59m47Ok77L07J55N44L97o30n86l5J30K01J05J12J9J61K21j099K21m42
$$ plain form
2216 -625 -144 -484 48 -189 753 413 239 97 -52 79 -28 92 514 -129 -953 -158 -312 46 -186 43
2236 43 224 141 295 88 -91 -574 -473 -259 427 159 460 984 -216 279 40 -217 -329 229 166 912 237
2257 237 28 -209 337 -188 20 94 57 -385 136 -51 548 -434 174 283 -114 -62 274 268 -312 -289 141 -64
2279 -64 163 78 608 763 -331 -76 -318 -362 -85 -242 343 147 -583 -232 143 -541 -299 -89 83 -65 -134
2300 -134 -366 441 87 -480 86 74 -238 -244 70 50 -123 -213 338 -415 -227 55 445 -65 50 536 -260 0
2322 0 -454 -255 -269 -247 -265 345 347 577 -245 -299 -146 74 -66 199 395 -152 45 530 -438 -125 757 -511
2344 -511 215 -371 -236 -117 -403 -375 276 -305 -338 -565 -64 425 581 14 157 -118 91 477 -488 278 500
2365 500 -347 -164 -871 -201 -157 -231 11 105 65 -385 236 -262 789 227 64 -59 796 -156 253 -324 -125
$$ packed form
2216f25M81l40N32k37R42l40j74j42j49J31j07J20M22o43q24P95j54L58k32K29
2236D3J81q3J54k07j79m83J01K14O86k68L01N24j200M95k39k57j12N58o3P46o75
2257B37k09k37N46n25K08P4l7m42N21j87N99r82O08J09l97N2L36on80K3M30k05
2279f4K27q5N30J55j094K55k42m4K77j57N85j96p30L51L75o84K42K10J72j48o9
2300a34k32Q07l54n67N66j2l12oL14k0j73r0N51p53J88K82L90n10J15M86p96K60
2322@m54J99j4K2j8O10KK30q22n4J53K20j40K65J96n47J97M85r68L13Q82j268
2344e11P26n86J35J19k86K8O51n81l3k27N01M89J56n67J43k75K09L86r65P66K22
2365E00q47J83p07O70M4p4K42R4m0m50O21m98J051n62j63j23Q55r52M09n77J99
$$ plain form
2386 -125 389 30 -134 198 1107 -18 418 361 -387 -206 180 778 44 1 -692 363 -820 -335 479 -78
2406 -78 -365 325 285 337 376 453 -604 291 451 -65 101 683 431 -389 335 -514 780 -736 -319 492 206
2427 206 37 -207 -82 76 -260 330 494 -363 -165 -196 -226 196 -492 -338 -23 253 389 -123 -6 114 613
2448 613 -294 -266 307 349 -426 -181 -190 434 -66 180 -181 -70 -38 -188 -458 -214 -455 -305 367 306 822 -189
2470 -189 444 -116 443 286 186 -380 66 248 -10 171 134 -2 84 -530 -361 -377 329 -162 -642 270 456
2491 456 565 162 65 -496 5 69 486 99 290 -764 -21 794 80 -202 -120 40 -179 33 -114 -176 -399
2512 -399 -613 379 -116 -34 458 -195 -80 -457 188 301 -223 -210 221 337 138 369 451 -91 -195 182 -150
2533 -150 -32 119 -142 -406 -15 290 -779 83 -274 -622 -552 -276 -51 -13 -351 -209 62 -198 508 -91
$$ packed form
2386a25N14l59j64L32R09j125M36n7p48J81L86N98p34m3o93J055j183M85Q14n57
2406g8k87O90m0N2L9P7j057Q95J60n16J66N82k52q20P24q49J294j516M17Q11k86
2427B06j69k44J25J58l36N90J64q57J98l1l0M22o88J54L15K76J36n12J17J20M99
2448F13r07K8N73M2p75K45rO24n00K46l61J11L2j50k70K44k41J50O72o1N16j011
2470a89O33n60N59j57j00n66M46J82k58J81l7j36Q6o14J69j6P06m91m80R12J86
2491D56J09m03r7n61N01O4M17l87J91j054P43Q15p14k82Q2J60k19K12j47o2k23
2512c99k14R92m95Q2M92o53J15l77O45J13n24J3M31J16j99K31Q2n42j04L77l32
2533a50J18J51k61k64L91L05j069Q62l57l48P0K76K25L8l38J42K71k60P06n99
$$ plain form
2553 -91 -208 9 65 133 -138 -351 -38 -35 142 165 343 550 42 365 393 137 -241 430 -473 302 536 307
2575 307 55 244 -146 523 189 -281 263 -688 471 -199 103 140 585 241 181 -585 -79 -335 577 305
2595 305 -114 -127 -850 -670 5 262 112 230 -317 -466 -145 -633 -81 -390 -407 69 -407 36 369 -153 -41
2616 -41 465 390 -390 -437 -194 516 140 -176 115 -449 271 -432 454 116 -318 -121 -220 -248 -219 -385 249 454
2638 454 -172 151 470 482 423 -658 -331 -60 197 -156 191 -551 -3 -546 -15 -80 -177 357 41 -298 82
2659 82 158 381 76 -134 -206 102 -232 -158 -210 -137 -124 426 119 -472 -155 48 328 368 139 305 -432 158 -78
2682 -78 -850 205 -14 35 -449 -60 333 -89 -129 -308 54 279 521 215 122 -257 309 359 -332 636 778
2703 778 325 -65 -41 205 -425 340 -692 437 501 -435 -331 -371 237 -548 403 458 -168 381 563 182 -83
$$ packed form
2553i1j17K17N6O8k71k13L13LJ77K3J78K07n08L23K8k56l78O71r03P75K34k29
2575C07k52J89l90O69l34m70N44r51J159o70L02L7M45l44o0p66N06k56R12k72
2595C05m19j3p23J80O75K57j50J18n47j49L21m88N52l09j7M76m76M43L33n22J12
2616d1N06p5p80m7K43P10l76l16K91n64P20p03Q86l38m34J97r9k8K9j66O34K05
2638D54o26L23L19J2n9j081L27K71K57l53L47p42N48n43N31o5r7N34l16l39L80
2659H2P6K23l05k10p2L08l34P4n2P3J3N50l07n91L17K03K80M0k29J66p37N90k36
2682g8p72J055k19M9m84L89L93m22m0j79L62K25K42l06r3l79N66N0o91R68J42
2703G78m53l90K4K46o30P65j032J129O4r36J04m0O08p85R51N5o26N49J82l81k65
$$ plain form
2724 -83 -99 742 249 102 360 120 24 375 408 -106 125 -225 -168 -682 488 -170 292 16 103 141 -349 -415
2746 -415 -596 -247 355 523 361 53 700 -293 -339 -220 -166 225 -315 -289 -198 -63 259 -272 -60 81 -701
2767 -701 -355 -666 277 19 -292 -115 345 -302 -301 66 -77 -634 -482 -66 -317 215 36 -665 -435 -19 -189
2788 -189 519 -137 -393 426 69 180 -333 -524 141 113 244 417 149 -69 57 137 447 64 118 161 141 -336
2810 -336 229 -563 -48 195 -265 100 -9 128 40 387 -228 187 -448 -129 137 -170 348 360 298 -328 126
2831 126 -41 -127 810 535 -127 -16 384 765 202 296 152 -50 414 -196 128 420 -374 213 668 164 -374
2852 -374 93 -55 523 -319 -116 70 -509 -174 -6 -177 -154 247 1008 63 172 -13 -446 9 -136 237
2872 237 -74 -324 13 -379 -994 -41 -346 13 -680 620 180 -180 64 3 432 -76 -28 -8 -144 159 236
$$ packed form
2724h3j6Q41m93j47K58k40r6L51L3n14K31l50N7n14J170o58M62k76Q7L8m90o6
2746d15j81L49O02J68j62l08O47r93m6J19N4L91n40K6R1J35L22n31K12J41p82
2767g01L46l11R43k58l11J77M60o47JL67j43n57J52M16k51N32j79p01K30M16j70
2788a89P08o56k56Q19l57J11n13j91O65k8J31J73k68k18J26Q0L10l83N4M3k0m77
2810c36N65p92N15K43m60L65j09J37q8L47o15M15o35L19K66l07N18J2o2o26M54
2831A26j67q6R37k75o62J11M00L81n63R4j44k02M64o10L24K92p94N87M55n04n38
2852c74M67j48N78q42K03J86n79L35J68j71K3M01P61r45J09j85m33M55j45L73
2872B37l11k50L37l92o15R53l05L59o93J300m40l60K44o1M29n08M8K0j36L03P7
$$ plain form
2893 236 98 241 -158 224 300 -17 202 41 253 -121 25 -104 -142 62 371 13 74 371 12 64 -5 242
2915 242 400 563 -194 -260 213 263 23 -154 271 35 0 59 -406 -295 38 -60 -39 -314 -189 218 -42 519
2937 519 23 548 47 -364 -224 323 135 -204 305 403 365 -47 -19 -19 440 361 125 -17 159 175 -140 -356
2959 -356 -372 283 134 470 -533 -446 129 83 150 -601 -104 51 -40 352 108 563 148 -367 289 -82 49
2980 49 -256 -160 19 122 403 213 51 72 -176 33 -328 279 238 228 379 -144 -632 -64 68 380 93 -372
3002 -372 485 64 -221 352 -47 126 114 -185 156 -37 -156 -61 218 59 193 -71 -84 20 20 210 -51 -737
3024 -737 144 258 104 -637 -261 270 77 558 367 -366 -215 379 -141 -79 -475 -287 -187 333 4 344
3044 344 -65 -235 514 -196 -525 59 249 -290 -506 204 339 -243 -215 -231 414 47 276 52 -168 -192 81
$$ packed form
2893B36j38J43l99L82P6l17K19j61K12l74J46j29l8K04L09l58O1K97l59N2o9K47
2915B42J58J63p57o6M73N0k40j77M25k36l5N9m65J11L33r8K1k75J25M07k60N61
2937E19m96N25n01m11J40N47j88l39N09R8l8m12K8%M59p9k36j42J76J6l15k16
2959c56j6O55j49L36j003Q7N75m6O7p51M97J55r1L92k44M55m15n15O56l71J31
2980D9l05R6J79J03K81j90j62K1k48K09l61O07m1j0J51n23m88N68J32L12k87m65
3002c72Q57m21k85N73l99J73j2k99L41j93j19R5K79j59J34k64j3J04%J90k61o86
3024g37Q81J14j54p41L76N31j93M81j91p33J51N94n20O2l96J88J00N20l29L40
3044C44m09j70P49p10l29N84J90n39k16P10J35n82K8j6O45l67K29k24k20k4K73
$$ plain form
3065 81 285 -250 -79 188 -525 37 120 28 -224 186 -578 517 -301 -181 -470 -900 -312 -87 182 -757 -365
3086 -365 -474 -359 -215 92 248 434 675 556 -517 -290 -219 58 209 58 333 -624 109 -409 73 -363
3106 -363 -245 280 305 136 -146 -273 -194 452 25 196 50 -80 234 -100 -328 -91 -127 -140 -25 109 1
3127 1 -80 271 200 250 -676 26 -344 -447 138 -371 -792 -211 -219 79 18 -597 116 401 -13 53 90 248 284 -376
3151 -376 -307 236 -192 294 -158 -116 514 -21 86 -126 192 -217 200 455 156 -460 208 -50 444 -295 296
3172 296 -9 37 192 -207 347 -900 -456 135 464 -438 -159 -7 -387 226 -553 -95 -272 -96 211 -31
3192 -31 -334 -496 -143 -3 -265 -255 -65 -264 121 59 299 701 219 -200 314 -3 361 -309 -290 174 -661
3213 -661 293 -146 -270 -129 -498 -233 226 -269 -322 -78 338 -15 -465 -181 24 -76 -274 393 526 -232
$$ packed form
3065H1K04n35J71K67p13N62Q3r2k52M10p64J095q18J20k89m30N88K25K69r39L92
3086c65j09J15J44L07J56J86K41j19j073K27P1K77J51j51K75r57P33n18M82m36
3106c63J18N25K5j69k82j27P9O46m27J71j46j30L14l34k28K37l6j3J15J34j08
3127Aq1L51p1N0r26P02l70j03N85n09m21N81qK98o1o15P13K85m14O6L7J58L6o60
3151c76O9N43m28M86m52M2O30n35J07k12L18m09M17K55k99o16O68k58M94p39N91
3172B96l05M6J55l99N54j247M44N91L29r02K79J52l80O13p79M58j77J76L07k42
3192c1l03j62L53J40k62J0J90j99L85o2K40M02m82m19N14l17L64o70J9M64q35
3213f61R54m39j24J41l69K65M59m95n3K44M16l53m50K84K05j00j98O67J33p58
$$ plain form
3233 -232 82 183 -32 -77 62 -783 -452 -508 501 -236 -39 -526 33 -377 242 286 5 267 -216 -139 -113
3254 -113 259 -515 -732 -534 52 -230 59 106 512 69 494 141 264 346 -160 -285 104 -593 33 310 -24
3275 -24 196 -310 8 57 -321 34 -552 -485 411 -899 236 -74 -165 -172 -385 101 720 292 137 -430 -475 -452
3297 -452 -28 -218 257 -164 186 -34 -622 273 -426 105 -407 -117 -380 -17 370 851 209 83 108 109 22
3318 22 317 28 121 -577 -113 50 -704 -69 -13 -503 101 690 316 -488 219 -11 36 -121 288 95 -120
3339 -120 136 65 273 24 326 53 11 191 1 20 323 -21 -260 462 122 -100 -91 210 -346 -136 -51 -50 -273
3362 -273 -435 -611 -226 -357 -275 243 -366 -675 405 -61 -719 27 -113 243 -453 108 498 -209 70 -330
3382 -330 151 -33 -36 -426 -385 -107 568 -529 241 -259 -120 127 529 111 413 -428 685 43 -260 -396
$$ packed form
3233b32L14J01k15m5J39q45L31n6J009p37J97m87N59m10O19M4k81K62m83P7K6
3254a13L72p74k17J98N86k82K89M7M06m43M25l53J23Q2n06j25L89o97O26K77l34
3275b4K20n06L18M9l78L55n86O7Q96j310J135l10r1pk13M86O19m28j55n67m5K3
3297d52M24j90M75m21L50k20n88Q95o99N31n12K90k63L63L87M81o42j26K5Jq7
3318B2K95k89R3o98M64J63p54O35N6m90O04N89l74q04P07k30M7j57M09j93k15
3339a20K56p1K08k49L02k73m2J80j90J9L03l44k39P22l40k22RL01n56K10Q5Jk23
3362b73j62j76L85j31Q2N18o09l09J080m66o58P46j40L56o96N61L90p07K79m00
3382c30M81j84ll90M1K78O75j097P70n00J39K47M02m18L02q41J113o42l03j36
$$ plain form
3402 -396 -376 393 119 -56 352 -401 -142 344 -115 -14 242 155 40 476 226 276 -160 121 -44 133 -794
3423 -794 -537 -120 -149 151 519 314 -264 266 230 -242 -789 20 190 -507 -105 -271 -508 -101 -104 50 -109
3444 -109 300 1169 -40 9 -191 337 371 158 1026 -269 -48 -469 -64 -363 253 243 199 -341 387 -55 -40
3465 -40 113 -253 572 -166 -13 375 -385 -332 19 208 367 -103 183 137 103 -124 279 45 -449 237 -313
3486 -313 -130 -9 416 -52 -410 121 -468 -298 -704 396 -180 -218 -149 506 430 264 -548 -219 120 -58 -492
3507 -492 -176 -29 -422 -340 6 -50 -630 74 315 -405 245 456 -150 565 145 -117 366 683 75 -276 168
3528 168 -186 -155 514 -714 -136 5 -280 239 330 312 -32 616 -326 309 393 -183 134 -296 44 -131 -179
3549 -179 460 -308 -215 234 -297 -234 -31 -667 -656 49 98 -296 230 -275 153 122 83 -19 -222 -137 42 159
$$ packed form
3402c96K0P69k74j75M08p53K59M86m59J01K56q7j15M36k50N0m36K81j65J77r27
3423g94K57M17k9L00L68k05n78N30l6m72n47Q09J70o97M02j66k37M07lJ54j59
3444a09M09Q69j209M9k00N28L4k13Q68j295K21m21M05k99O16j0m4n40P28m42J5
3465d0J53l66Q25p38J53L88p60N3L51J89J59m70K86m6l4k27M03k34m94O86n50
3486c13J83J21M25m68l58N31n89J70m06J100n76l8O9O55p6j66q12L29L39j78m34
3507d92L16J47l93Q2L46n6n80P04K41p20O50K11o06P15m20k62M83L17o08l51M44
3528A68l54L1O69j228N78J41k85N19R1j8l44O48r42O35Q4n76L17m30L40j75m8
3549a79O39p68R3M49n31O3K03o36J1P05M9l94N26n05M28l1l9j02k03Q5J79J17
$$ plain form
3571 159 -374 698 -615 290 363 246 -226 -410 165 314 -210 -115 212 -401 -55 953 476 -131 134 -876
3591 -876 336 90 122 492 485 386 -456 73 470 -296 -162 -31 -63 -258 -573 18 341 -152 213 -795 -521
3612 -521 -256 29 -99 -646 -385 364 493 -135 174 -162 346 -51 -21 -86 -230 126 49 150 229 -49 -168
3633 -168 -355 -651 -116 -210 108 -326 -76 -64 145 -329 132 -258 -445 108 -508 506 243 -335 148 -802
3653 -802 372 141 -112 -65 333 260 -926 -555 108 -38 491 -9 -107 -236 96 -168 508 -55 25 -273 -152
3674 -152 -37 429 -484 -370 -94 -237 -346 205 9 278 -48 -270 -120 -357 11 34 -466 -471 -65 -262 88
3695 88 -214 -61 477 593 82 298 -524 -229 32 285 -603 -161 -589 -376 -560 172 -68 -68 -729 -314 88
3716 88 -305 -20 -305 -396 133 373 -180 -29 -784 361 -385 -231 -101 -375 849 104 157 -532 225 -212
$$ packed form
3571A59n33J072j313R05P3j17m72j84N75J49n24R5L27o13L46J008m77o07K65j010
3591h76J212k46L2L70pr9q42N29L97p66J34J31l2j95l15N91L23m93L65j008K74
3612e21K65K85j28n47K61P49J29o28L09l36N08l97L0o5j44L56p7J01P9k78j19
3633a68j87k96N35r4L18m34K50J2K09m74M61l90j87N53o16J014k63n78M83r50
3653h02J174k31k53M7L98p3j186L71O63j46N29n00r8j29L32k64O76n63Q0k98J21
3674a52J15M66r13J14K76j43j09N51j96K69l26k22J50k37L68K3n00nM06j97L50
3695H8l02J53N38J16n11K16q22K95K61K53q88M42m28K13j84P32k40%o61M15M02
3716H8l93K85k85r1N29K40n53J51p55J145p46J54J30k74J224p45N3o89P57m37
$$ plain form
3736 -212 -56 -191 -94 -209 228 480 210 -254 288 377 -289 -39 125 -304 -80 -318 100 99 -164 -252 -136 249
3758 249 340 121 51 -110 53 -228 395 920 28 -293 -710 90 2 -56 411 148 -732 234 -235 -319 -159 -192
3780 -192 4 100 -54 -63 221 401 341 303 76 -163 399 -136 -320 -356 -235 131 -171 117 525 574 201 163 344
3803 344 253 -230 678 -252 -528 307 -7 51 -215 311 447 -420 213 -130 -923 223 15 -299 207 395
3823 395 673 -57 545 657 -159 -294 76 -415 202 135 -185 181 348 -507 -94 -125 -103 232 16 247 -137
3844 -137 -382 -133 -201 -21 764 -330 54 678 -585 -56 -21 -429 -220 98 9 -101 581 -222 -307 467 -20
3865 -20 -276 533 233 384 -286 -79 -227 580 39 -494 -7 198 223 -20 -26 -122 349 -466 372 10 -479 117
3887 117 -303 207 -44 70 -144 -180 336 -209 321 119 -308 -155 -209 -173 212 151 228 217 130 477 -64 -239
$$ packed form
3736b12J56j35R7j15M37K52k70m64N42Q9o66K50J64m29K24k38M18jk63q8J16L85
3758B49R1k19p0j61J63k81O23N25q92l21m17Q00q8n8M67k63q80R66m69q4J60l3
3780a92J96R6j54rK84J80o0l8k27k39N62n35j84l6J21L66l02K88M08M9l73l8J81
3803C44r1m83R08r30k76Q35l14N8k66N26J36q67O33l43p93J146k08l14N06J88
3823C95K78p30O02J12q16j35L70m91O17o7l20L66J67q55M13l1K2L35k16K31l84
3844a37k45K49o8J80P85j094L84O24j263N29L5m08K09L18q9j10O82q03q5P74m87
3865b0k56Q09l00J51o70K07j48Q07n41n33M87K05K5k43or6M71q15Q38l62m89N96
3887A17m20N10k51J14k14l6N16n45N30k02m27J53n4L6L85o1P7j1q7L47n41j75
$$ plain form
3909 -239 -129 -7 -157 -573 -77 468 257 25 304 205 -485 -200 524 277 -98 22 -72 306 636 -28 -48
3930 -48 285 734 247 147 -554 -498 378 91 127 -99 -523 199 517 504 -32 -238 262 -130 135 625 252
3951 252 -395 136 -376 60 78 -405 713 -464 595 371 498 84 470 -403 554 -227 -244 -55 -281 -334
3971 -334 150 -480 -660 482 -306 -403 35 450 253 334 -498 221 124 232 304 -525 -354 44 -58 -230 353
3992 353 -348 -5 -259 145 158 -245 13 -63 200 -215 730 -53 -227 165 11 298 64 143 -211 369 224
4013 224 -317 -133 130 -136 -72 484 -43 686 145 359 -155 581 -167 74 299 -19 898 -143 352 -38
4033 -38 -37 -534 -219 249 274 43 -281 -60 179 287 -245 -408 131 -269 -329 -181 445 108 -48 -117 -57 -269
4055 -269 -530 -270 -134 -162 -124 -108 -164 317 361 677 -521 61 207 808 367 120 57 332 -175 167 80 11
$$ packed form
3909b39J10J22j50m16M96N45k11k32K79r9o90K85P24k47l75J20r4L78L30o64k0
3930d8L33M49m87j00p01N6Q76k87L6k26m24P22L18j3n36k06N00l92K65M90l73
3951B52o47N31n12M36J8m83J118j177J059k24J27m14L86q73R57p81j7J89k26n3
3971c34M84o30j80J142p88r7M38M15j97Q1q32P19r7J08P2q29J71L98j02j72N83
3992C53p01L43k54M04J3m03K58p6K63m15R45p83j74L92j54K87k34P9l54N80j45
4013B24n41J84K63k66O4N56n27P29n41K14n14P36p48K41K25l18R17j041M95l90
4033c8Jm97L15M68K5k31l24K21K39J08n32j63N39m00o0J48O26l37j56o9O0k12
4055b69k61K60J36k8L8J6n6M81M4L16j198N82J46O01m41k47o3K75n07L42q7o9
$$ plain form
4077 11 -414 -468 438 43 -518 554 -189 -371 -223 143 -123 314 62 -195 -248 88 180 -10 95 195 -513
4098 -513 -110 0 -289 337 843 -232 -97 -25 -312 246 -301 -239 -671 343 304 235 187 12 440 501 -357
4119 -357 41 30 -163 -273 40 584 -60 257 -438 265 -147 42 -217 -633 -24 -203 -139 414 53 408 276
4140 276 -449 -571 99 1035 374 -365 -45 148 -50 130 -198 -329 187 452 179 972 26 -229 -271 -60
4160 -60 492 -59 507 324 117 640 -261 396 -428 -336 -186 4 -283 90 -39 166 -126 -357 -232 173 11
4181 11 -296 -280 -182 428 404 120 -365 -90 369 154 284 83 -776 -42 -670 29 295 235 193 197 33 354 -153
4204 -153 304 -134 230 517 154 468 -358 -283 -414 -460 313 35 224 160 195 225 -128 106 -260 -165 97 -345
4226 -345 517 234 -176 84 186 557 -293 -264 -64 371 -346 294 399 -291 -411 -830 -44 264 -182 31
$$ packed form
4077A1m25n4R06l95n61J072p43j82J48L66k66M37k52k57n3L36R2j90J05J00p08
4098e13M03J10k89O26N06j075J35P2k87N58n47O2m32J014l9o9m8j75M28O1q58
4119c57L98j1j93j10L13N44o44L17o95P03m12J89k59m16O09j79O4N53l61L55j32
4140B76p25j22O70R36o61p39L20J93j98J80l28j31N16K65k73P93r46k55m2K11
4160f0N52n51N66j83k07N23r01O57q24R2J50J90k87L73j29K05k92k31J25M05j62
4181A1l07J6R8O10k4k84m85K75M59k15J30k01q59P34o28O99K66o0m2Mj64L21n07
4204a53M57m38L64K87l63L14q26P5j31m6P73k78J89o4L5L0l53K34l66R5K62m42
4226c45Q62k83m10K60J02L71q50K9K00M35p17O40J05o90j20m19P86L08m46K13
$$ plain form
4246 31 188 736 -154 -87 -330 156 -163 -3 -58 -366 -246 -133 51 375 -13 -448 -8 412 92 344 537
4267 537 227 -232 -112 -257 607 -72 -64 221 -300 -169 572 549 -172 86 55 -55 28 -217 544 108 -79 -3
4289 -3 -209 176 543 313 271 -99 264 -263 -255 461 72 -233 -303 -85 -579 220 133 253 -133 -44 -275 189 500
4312 500 113 378 103 -19 -474 -41 30 -255 -246 559 -64 -616 425 -33 -147 -502 -176 -153 407 203 56
4333 56 301 -102 -727 306 -82 -38 -204 -110 345 464 -32 -148 -178 -666 -19 -190 99 455 24 42 -65
4354 -65 -165 -174 104 -257 -47 618 65 -522 -781 308 -116 -156 39 -120 -489 -196 178 -74 -347 361 126
4375 126 23 122 198 216 -136 -128 321 -100 0 -176 64 360 148 -368 466 589 453 -58 -18 525 -19 125
4397 125 -265 -333 241 -38 -263 309 -81 -157 -66 -677 371 105 -193 -222 -387 -228 170 -321 -91 10 43
$$ packed form
4246C1J57N48q90O7k43M86l19J60n5l08J20J13J84L24l88m35M40M20l20K52J93
4267E37l10m59J20j45Q64o79QK85n21J31P41k3p21K58l1j10Q3k45P61m36j87P6
4289ck06L85L67k30m2l70L63n27QP16l89l05p0K18m94P99q7J20l86Q9k31M64L11
4312E00l87K65k75j22m55M33P1k85RQ05o23n52J041m58j14l55L26K3N60k04j47
4333E6K45m03o25J033l88M4j66R4M55J19m96j16l0m88O47j71K89L56m31J8j07
4354f5j00rK78l61K10O65n53n87k59J089m24m0J95j59l69K93L74k52k73P08k35
4375A26j03R9P6J8l52QM49m21J00j76K40K96k12n16Q34J23j36n11M0N43n44J44
4397A25l90o8N74k79k25N72l90p6R1o11J048k66k98k9j65J59L98m91K30J01L3
$$ plain form
4418 43 -503 115 31 198 -398 311 -56 41 94 -181 -93 221 -224 322 176 227 293 120 430 -332 -196 -234 -394
4441 -394 -24 187 14 -91 407 -427 3 211 450 55 -566 -152 180 365 12 252 -1 -368 5 588
4461 588 362 -388 128 -114 327 -272 381 219 -191 -101 126 33 -90 -174 -527 -237 -692 16 0 209 819
4482 819 259 -364 -402 -513 -543 -1 -119 180 491 -411 -144 94 36 130 -651 -601 -20 -286 367 77 -55 -135
4504 -135 -44 321 72 135 -344 251 -195 -402 562 -219 514 -444 165 330 -446 423 276 314 30 -166 -372
4525 -372 184 -7 -333 90 382 41 -257 -67 182 36 498 301 -424 -304 13 -181 -647 474 21 232
4545 232 527 164 -157 205 -354 321 -205 192 -493 333 16 -54 -350 -340 105 -466 534 -20 530 365
4565 365 -365 -342 1 -193 247 -268 -26 45 -249 271 -71 769 -22 -76 -2 88 -483 -48 -588 -296 353 192
$$ packed form
4418D3n46O18q4J67n96P09l67R7N3k75Q8L14m45N46j46N1O6j73L10p62J36l8j60
4441c94L70K11j73j05M98q34M30K08K39l95o21M14L32J85l53K40k53l67L73N83
4461E88k26p50N16k42M41n99O53j62m10R0K27r3j23q4l53K90m55P08j6K09O10
4482H19n60o23l8j11l0N42j18K99L11r02K67K38n8R4p81N0N81k66O53k90j32q0
4504a35R1L65k49O3m79N95m46k07R64p81P33r58O09J65p76Q69j47L8k84j96k06
4525c72N56j91l26M23K92l41k98J90K49j46M62j97p25J20L17j94m66J121m53K11
4545B32K95l63l21L62n59O75n26L97o85Q26l17p0k96J0M45n71J000n54N50j65
4565C65p30K3L43j94M40n15K42P1k94N20l42Q40p91n4P4R0n71M35n40K92O49j61
$$ plain form
4587 192 -212 -454 82 -52 213 -202 589 -395 -225 -451 -215 655 -153 639 -603 -319 -118 -138 837 159
4607 159 -373 -257 234 -315 149 185 -433 233 258 -158 350 -496 714 -129 226 -306 -192 328 666 -48
4627 -48 -191 -160 250 232 -322 -243 -671 -109 717 194 829 -112 -134 313 187 -144 201 144 285 -116 398 -329
4649 -329 591 301 361 616 -366 -603 -284 -120 -433 65 315 -56 0 88 -302 -213 -96 -673 -7 143 99 -243
4671 -243 -130 163 143 239 -81 -13 55 -25 -294 -127 425 -199 339 37 453 -326 152 458 -1 -690 -97 -423
4693 -423 81 498 -109 -286 -479 -42 -28 91 74 -17 -421 -95 244 -148 -61 86 114 -157 -89 -166 -77 607 436
4716 436 483 -385 119 759 -157 29 661 412 -226 405 228 434 274 428 -464 27 326 107 307 -919
4736 -919 -46 371 82 -1 -157 336 -205 -107 -242 -194 427 -338 238 -184 374 123 203 -74 24 24 -287 -149
$$ packed form
4587A92m04k42N36j34K65m15P91r84J70k26K36Q70q08P92j242K84K01k0R75o78
4607A59n32J16M91n49M64L6o18O66K5m16N08q46J210q43L55n32J14N20L38p14
4627d8j43L1M10j8n54P9m28N62Q26n23O35r41k2M47j26l31L45n7J41m01N14p27
4649c29R20k90O0K55r82k37L19J64l13M98K50l71N6Q8l90Q9J17n77O66J50m4l42
4671b43J13K93k0R6l20O8O8q0k69J67N52o24N38l02M16p79M78L06m59o89N93l26
4693d23N04M17o07j77j93M37J4J19j7r1m04L26L39l92Q7J47K8k71O8p7Q9O84j71
4716D36M7q68N04O40r16J86O32k49o38O31j77K06j60J54q92M91K99k19K00j226
4736i19Q73M17k89q3j56M93n41R8j35M8O21p65N76m22N58k51Q0k77R8%l11J38
$$ plain form
4758 -149 483 413 -297 341 156 16 53 -429 275 -432 532 266 -371 -521 752 262 478 128 37 -180 -200
4779 -200 492 122 30 1 13 -13 415 -95 497 336 84 -16 -20 -238 -67 -451 407 847 436 -101 244 728
4801 728 -434 170 -28 -315 -433 -159 223 138 679 -108 88 36 96 -133 -126 110 542 42 239 344 577
4822 577 -55 -181 329 -66 -15 -233 499 -142 104 14 -70 548 -221 197 -68 364 354 358 -10 160 73 -173
4844 -173 221 288 56 40 -586 -232 90 52 293 -359 -473 -27 246 643 -300 77 -332 -41 149 -600 -349
4865 -349 450 119 -75 187 962 -264 -384 382 -359 -57 -262 207 -318 -72 -345 11 649 -11 267 243
4885 243 193 41 357 -348 -650 -114 -17 -144 222 668 -622 28 92 564 388 96 -92 174 86 388 28
4906 28 -268 179 461 9 -638 344 -6 172 -249 70 188 -277 286 -335 -54 -280 -82 -13 -46 -184 208
$$ packed form
4758a49O32p0p10O38j85j40L7m82P04p07R64k66o37j50J273m90K16l50r1k17k0
4779b00O92l70r2k9J2k6M28n10N92j61k52j00mk18J71l84Q58M40m11n37L45M84
4801G28j162O04j98k87j18K74L82q5N41p87J96n2O0k29PK36M32n00J97J05K33
4822E77o32j26N10l95N1k18P32o41K46r0q4O18p69M18k65M32j0Ml68J70q7k46
4844a73L94O7k32j6o26L54L22l8K41o52j14M46K73L97r43L77m09K91J90p49K51
4865c49P99l31j94K62P75j226j20P66p41L02k05M69n25K46k73L56O38o60K78k4
4885B43n0j52L16p05l02N36R7j27L66M46j290O50O4M72j76k92j88K66q8L02l60
4906B8k96M47K82m52o47R82l50J78m21L19J18m65N63o21K81k26J98O9l3j38L92
$$ plain form
4927 208 93 -148 -92 233 378 344 -330 -382 -490 347 -351 -348 -334 -509 -157 -647 383 19 115 446 277 361
4949 361 -190 631 -166 10 -314 265 262 85 -112 -70 -151 29 333 465 47 506 -117 145 -514 -84 -41 89
4971 89 -137 -415 290 -376 -117 -171 -42 145 118 83 -593 258 248 -50 170 -51 -253 92 -525 -54 426 114
4993 114 87 -531 269 123 211 105 -22 -168 -263 29 229 8 137 692 -39 -63 139 54 53 7 -582 133 81
5016 81 -293 50 23 403 196 -202 -204 149 345 636 143 73 -690 -293 -256 217 217 -6 -56 167 -117 489 -93
5039 -93 -193 -61 236 -70 40 439 130 368 77 129 -5 72 -468 28 -440 -15 -269 235 -74 -204 65
5060 65 -68 -488 418 49 289 -474 633 -99 -826 -46 -138 278 -786 -407 57 -173 54 249 -106 269
5080 269 -641 141 71 257 -93 -198 -454 124 -214 -89 -11 -374 -92 -695 -106 -191 -50 -232 -912 128 126
$$ packed form
4927B08j15k41N6L25J45l4o74n2j08Q37o98LJ4j75L52m90J030l64R6L31j69Q4
4949C61n51Q21p97J76l24N79lj77j97M2q1J80L04J32m18M59o23K62o59M30M3J30
4971H9k26k78P05o66K59n4J29J87k7l5o76Q51j0k98K20k21k02L45o17M71M80l12
4993A14k7o18Q00j46Q8j06j27j46r5K92K00k21J29N55p31k4K02q5jm6n89P15n2
5016H1l74L43k7L80k07l98kL53J96K91m93p0p63L97L7M73%k23n0K23k84O06n82
5039i3j00J32K97l06J10L99l09K38k91N2j34P7n40M96m68M25k54N04l09j30K69
5060F5j33m20R06l69K40p63J107p32p27P80r2M16j064L79M64k30K27J95l55L75
5080B69r10P82p0J86l50j05k56N78l38J25P8l63K82o03N89q5J41j82o80J040k
$$ plain form
5101 126 -144 99 85 -30 -214 447 -301 657 113 78 298 -83 538 -247 53 581 319 103 619 306 -347
5122 -347 -334 -475 89 -108 379 -187 -301 -444 -145 51 -119 120 -277 -216 -103 368 -89 -74 -46 -172 -570
5143 -570 -289 -216 106 30 204 -230 -889 -315 148 -24 67 -7 248 106 51 590 152 -129 67 -213 240 324
5165 324 408 366 75 238 195 269 258 221 -294 -412 363 175 -721 81 -8 114 85 -602 427 -471 -185 470
$$ packed form
5101A26k70K43j4j15j84O61p48R58n44l5K20l81O21p85L00N28k62k16N16l13o53
5122c47J3j41N64j97M87n66j14j43K99J96j70K39l97O1J13M71m57J5K8j26l98
5143e70K81P3L22p6J74m34o59N74M63j72R1p4K55j42n5N39m38k81J96k80M53Q4
5165C24Q4m2k91J63m3P4j1l7n15j18P75j88q96Q02q9J22k9o87J029q98K86O55
$$ [...]
8191b55
##END NTUPLES=NMR FID
##END=
