##TITLE=1H_SR146H3HCl
 D2O
 8 sc, 
 11.4.2023
##JCAMPDX= 6.0         $$ Bruker NMR JCAMP-DX V2.0
##DATA TYPE= NMR FID
##DATA CLASS= NTUPLES
##ORIGIN= UXNMR, Bruker Analytische Messtechnik GmbH
##OWNER= root
$$ XWIN-NMR		Version 3.5
$$ Tue Apr 11 16:21:10 2023 Russian Standard Time (UT+4h)  she@DPX200
##.OBSERVE FREQUENCY= 200.13135
##.OBSERVE NUCLEUS= ^1H
##.DELAY= (6, 6)
##.ACQUISITION MODE= SIMULTANEOUS
##.ACQUISITION SCHEME= undefined
##.AVERAGES= 8
##.DIGITISER RES= 18
##SPECTROMETER/DATA SYSTEM= spect
##.PULSE SEQUENCE= zg30
##.SOLVENT NAME= D2O
##.SHIFT REFERENCE= (INTERNAL, D2O, 0, 15.7039)
##AUDIT TRAIL= $$ (NUMBER, WHEN, WHO, WHERE, WHAT)
$$ ##TITLE= Audit trail, XWIN-NMR		Version 3.5
$$ ##JCAMPDX= 5.01
$$ ##ORIGIN= Bruker BioSpin GmbH
$$ ##OWNER= she
$$ F:/spectra/data/she/nmr/H-F/1/audita.txt
$$ ##AUDIT TRAIL=  $$ (NUMBER, WHEN, WHO, WHERE, WHAT)
(   1,<2023-04-11 16:19:42.53 +0400>,<she>,<DPX200>,
      <created by zg, POWCHK disabled, PULCHK disabled
       configuration hash MD5:
       00 E9 B6 7A A2 85 ED C7 34 08 36 98 17 FE 4E 26
       data hash MD5: 16K
       89 E8 95 8B B0 97 63 37 A8 55 78 E5 D3 38 D0 C3>)
$$ ##END=
$$ 
$$ hash MD5
$$ 57 E8 D3 E4 EF 0C 22 8D BF 15 90 75 D9 3D 18 C8
##$RELAX= 
##$RELAX= 
##$RELAX= 
##$RELAX= 
##$RELAX= 
##$RELAX= 
$$ Bruker specific parameters
$$ --------------------------
##$DU= <F:/spectra>
##$EXPNO= 1
##$NAME= <H-F>
##$PROCNO= 1
##$TYPE= <nmr>
##$USER= <she>
##$AMP= (0..31)
100 100 100 100 100 100 100 100 100 100 100 100 100 100 100 100 100 100 
100 100 100 100 100 100 100 100 100 100 100 100 100 100 
##$AQSEQ= 0
##$AQ_mod= 1
##$AUNM= <au_zg>
##$AUTOPOS= <>
##$BF1= 200.13
##$BF2= 200.13
##$BF3= 200.13
##$BF4= 200.13
##$BF5= 200.13
##$BF6= 200.13
##$BF7= 200.13
##$BF8= 200.13
##$BYTORDA= 1
##$CFDGTYP= 0
##$CFRGTYP= 5
##$CHEMSTR= <none>
##$CNST= (0..31)
1 1 145 1 1 1 1 1 1 1 1 1 1 1 1 1 1 1 1 1 1 1 1 1 1 1 1 1 1 1 1 1 
##$CPDPRG= <>
##$CPDPRG1= <>
##$CPDPRG2= <>
##$CPDPRG3= <>
##$CPDPRG4= <mlev>
##$CPDPRG5= <mlev>
##$CPDPRG6= <mlev>
##$CPDPRG7= <mlev>
##$CPDPRG8= <mlev>
##$CPDPRGB= <>
##$CPDPRGT= <>
##$D= (0..31)
0 1.2 0 0 0 0 0 0 0 0.06 0 0.03 0 0 0 0 0.0002 0 0 0 0 0 0 0 0 0 0 0 0 
0 0 0 
##$DATE= 1681215581
##$DBL= (0..7)
120 120 120 120 120 120 120 120 
##$DBP= (0..7)
150 150 150 150 150 150 150 150 
##$DBP07= 0
##$DBPNAM0= <>
##$DBPNAM1= <>
##$DBPNAM2= <>
##$DBPNAM3= <>
##$DBPNAM4= <>
##$DBPNAM5= <>
##$DBPNAM6= <>
##$DBPNAM7= <>
##$DBPOAL= (0..7)
0.5 0.5 0.5 0.5 0.5 0.5 0.5 0.5 
##$DBPOFFS= (0..7)
0 0 0 0 0 0 0 0 
##$DE= 6
##$DECBNUC= <off>
##$DECIM= 32
##$DECNUC= <off>
##$DECSTAT= 4
##$DIGMOD= 1
##$DIGTYP= 9
##$DL= (0..7)
0 120 120 120 120 120 120 120 
##$DP= (0..7)
150 150 150 150 150 150 150 150 
##$DP07= 0
##$DPNAME0= <>
##$DPNAME1= <>
##$DPNAME2= <>
##$DPNAME3= <>
##$DPNAME4= <>
##$DPNAME5= <>
##$DPNAME6= <>
##$DPNAME7= <>
##$DPOAL= (0..7)
0.5 0.5 0.5 0.5 0.5 0.5 0.5 0.5 
##$DPOFFS= (0..7)
0 0 0 0 0 0 0 0 
##$DQDMODE= 0
##$DR= 18
##$DS= 0
##$DSLIST= <SSSSSSSSSSSSSSS>
$$ [...]
##$SUBNAM2= <"">
##$SUBNAM3= <"">
##$SUBNAM4= <"">
##$SUBNAM5= <"">
##$SUBNAM6= <"">
##$SUBNAM7= <"">
##$SUBNAM8= <"">
##$SUBNAM9= <"">
##$SW= 18.05172834244
##$SWIBOX= (0..15)
0 0 2 0 0 0 0 0 0 0 0 0 0 0 0 0 
##$SW_h= 3612.71676300578
##$TD= 16384
##$TD0= 1
##$TE= 0
##$TE2= 300
##$TE3= 300
##$TEG= 300
##$TL= (0..7)
0 120 120 120 120 120 120 120 
##$TP= (0..7)
150 150 150 150 150 150 150 150 
##$TP07= 0
##$TPNAME0= <>
##$TPNAME1= <>
##$TPNAME2= <>
##$TPNAME3= <>
##$TPNAME4= <>
##$TPNAME5= <>
##$TPNAME6= <>
##$TPNAME7= <>
##$TPOAL= (0..7)
0.5 0.5 0.5 0.5 0.5 0.5 0.5 0.5 
##$TPOFFS= (0..7)
0 0 0 0 0 0 0 0 
##$TUNHIN= 0
##$TUNHOUT= 0
##$TUNXOUT= 0
##$USERA1= <user>
##$USERA2= <user>
##$USERA3= <user>
##$USERA4= <user>
##$USERA5= <user>
##$V9= 5
##$VALIST= <valist>
##$VCLIST= <CCCCCCCCCCCCCCC>
##$VD= 0
##$VDLIST= <DDDDDDDDDDDDDDD>
##$VPLIST= <PPPPPPPPPPPPPPP>
##$VTLIST= <TTTTTTTTTTTTTTT>
##$WBST= 1024
##$WBSW= 4
##$XGAIN= (0..3)
0 0 0 0 
##$XL= 0
##$YL= 0
##$YMAX_a= 165139
##$YMIN_a= -213038
##$ZGOPTNS= <>
##$ZL1= 120
##$ZL2= 120
##$ZL3= 120
##$ZL4= 120
##$ABSF1= 10
##$ABSF2= 0
##$ABSG= 5
##$ABSL= 3
##$ALPHA= 0
##$AQORDER= 0
##$ASSFAC= 0
##$ASSFACI= 0
##$ASSFACX= 0
##$ASSWID= 0
##$AUNMP= <proc_1d>
##$AZFE= 0.1
##$AZFW= 0.1
##$BCFW= 1
##$BC_mod= 2
##$BYTORDP= 1
##$COROFFS= 0
##$CY= 11.3945322036743
##$DATMOD= 1
##$DC= 2
##$DFILT= <>
##$DTYPP= 0
##$F1P= 2.36226072786647
##$F2P= -0.459571619588291
##$FCOR= 0.5
##$FTSIZE= 0
##$FT_mod= 4
##$GAMMA= 1
##$GB= 0.15
##$INTBC= 1
##$INTSCL= 1
##$ISEN= 128
##$LB= 0.24
##$LEV0= 0
##$LPBIN= 0
##$MAXI= 10000
##$MC2= 0
##$MEAN= 0
##$ME_mod= 0
##$MI= 1.114404
##$NCOEF= 0
##$NC_proc= 0
##$NLEV= 6
##$NOISF1= 3.799351
##$NOISF2= 2.8
##$NSP= 1
##$NTH_PI= 0
##$NZP= 0
##$OFFSET= 15.70392
##$PC= 1
##$PHC0= -19475.76
##$PHC1= 9.600801
##$PH_mod= 1
##$PKNL= yes
##$PPARMOD= 0
##$PSCAL= 0
##$PSIGN= 0
##$REVERSE= no
##$SF= 200.130013532006
##$SI= 16384
##$SIGF1= 3
##$SIGF2= 2
##$SINO= 400
##$SIOLD= 16384
##$SREGLST= <1H.CDCl3>
##$SSB= 0
##$STSI= 0
##$STSR= 0
##$SW_p= 3612.71676300578
##$SYMM= 0
##$S_DEV= 0
##$TDeff= 0
##$TDoff= 0
##$TI= <>
##$TILT= no
##$TM1= 0
##$TM2= 0
##$TOPLEV= 0
##$USERP1= <user>
##$USERP2= <user>
##$USERP3= <user>
##$USERP4= <user>
##$USERP5= <user>
##$WDW= 1
##$XDIM= 8192
##$YMAX_p= 0
##$YMIN_p= 0
$$ End of Bruker specific parameters
$$ ---------------------------------
##NTUPLES= NMR FID
##VAR_NAME=  TIME,          FID/REAL,        FID/IMAG
##SYMBOL=    X,             R,               I
##VAR_TYPE=  INDEPENDENT,   DEPENDENT,       DEPENDENT
##VAR_FORM=  AFFN,          ASDF,            ASDF
##VAR_DIM=   8192,          8192,            8192
##UNITS=     SECONDS,       ARBITRARY UNITS, ARBITRARY UNITS
##FACTOR=    0.0002768,     1,               1
##FIRST=     0,             0,               0
##LAST=      2.2672688,     0,               0
##MIN=       0,             -213038,         0
##MAX=       2.2672688,     165139,          0
$$ Real data points
##PAGE= N=1
##DATA TABLE= (X++(R..R)), XYDATA
$$ [...]
1781h70k16P4Q46N77M60J19n32k77o55m20J83N11O16N92j37k68n13m85m37K95
1801e37M49K55P55j84j56o92m11l15J01O74O59J36N6k37p13m67l82K21N79N96
1821C87M28J48p53m92l73k32M00L10O94L01j04l51n17n68j00K79L05Q69J30O2
1841H23m86q31l56j16L21O09N02N47m71q6p42k24k19J50O39M00L66j5l31r16k35
1862f71p4M76J96P19q8j48j42n58l32k54M40P52P9K31n0n31j98l95m1J71N28L43
1884D53M05k37l21p44l29J40J42N94M76K73l18n54l48l73J32Q4P54M20K7m8m55
1905A73n30l29K77R4N65L11J91k29n08l93m51L48J56N22L08N33m28o07k34o43
1925h74L56J89N65K91J23k21l33m75k03N9L50J14P03j80l6n22n33J73m1L14K60
$$ y = [-870, -1086, -1012, -166, 411, 871, 990, 458, 181, -474, -894, -711, -200, 416, 1008, 871, 603, 90, -395, -832, -537, -88, 167, 922, 738, 582, -110, -521, -836, -735, -61, 598, 734, 790, 553, -160, -627, -1009, -788, -209, 387, 815, 963, 210, -282, -655, -887, -487, -177, 517, 818, 714, 363, -154, -722, -822, -543, -238, 631, 761, 823, 337, -494, -850, -966, -645, -36, 466, 1013, 542, 456, -286, -510, -729, -579, 60, 460, 826, 811, 480, -436, -671, -745, -269, -73, 646, 558, 410, 268, -290, -622, -876, -436, 316, 395, 626, 576, 45, -153, -548, -589, -418, 110, 453, 858, 621, 300, -444, -773, -633, -491, 103, 579, 852, 534, -20, -368, -741, -609, -525, 229, 649, 676, 628, 173, -357, -686, -409, -315, 250, 561, 752, 523, 15, -378, -829, -481, -325, 197, 505, 1038, 610, 3, -231, -874, -518, -329, 236, 527, 650, 429, 96, -379, -582, -523, -173, -59, 644, 464, 428, -94, -627, -454, -495, -181, 79]
1946G9K63J58j04l12o06J07j76L08N42K40m3k26l37l68k55R4N91J32K40L50p8
1967E99p67r4k81N3M55L67L02k77k41k47j63k80J08L94L70M9P9k05k41l65k46
1988f31J53J83M00N29K2m52o32L3k61Q2M83J89O41k30m41k00l39k02L23L66K70
2009B86J50j04j54m78l9k00K89L31K85p0L0lk81l97k81L41L38K66L5L3L0o98j47
2032d38mP9M35J11L37J11k36n40k97n9O9O46L95Q8j47l78m12n1j41K80L02K16
2054C66J14k41q0m99k43l4L98J43M24K83k95k78k68n0j17J57M34J44J05k64j81
2075A8n25L5J88J24K0N00L37l37l43K6n59J59K96N84j63K1j95n5m00k03R2M75
2097I5J32K53O9k13l48k64M5j08K03M19K85j90m11J2k86PJ16r5L37L96L3l67k2
$$ y = [79, 342, 500, 396, 84, -522, -415, -591, -283, 259, 499, 456, 230, -107, -475, -730, -636, -45, 87, 327, 677, 599, -168, -262, -543, -490, -35, 332, 634, 357, 116, -131, -294, -574, -466, -72, 298, 347, 426, 221, -20, -385, -631, -478, -295, 105, 634, 656, 204, -428, -395, -656, -574, -91, 98, 739, 509, 68, -132, -471, -673, -350, 16, 286, 436, 332, 178, -300, -339, -539, -250, 81, 366, 296, 326, 323, 42, -355, -636, -295, 43, 309, 344, 377, 407, -291, -438, -442, -363, 72, 183, 520, 631, 395, -145, -442, -501, -432, 214, 609, 697, 550, 172, -240, -291, -432, -152, 150, 366, 480, 239, 159, -340, -583, -617, -219, -76, 348, 631, 336, 58, -210, -260, -377, -220, 214, 358, 463, 199, 18, -507, -472, -284, -160, -140, 360, 697, 360, 17, 43, -516, -357, -61, 523, 360, 381, 186, 131, -269, -472, -380, 95, 227, 480, 549, 336, -12, -276, -231, -339, -136, 283, 568, 378, -33, -21, -307, -300, -184, -279, 58, 454, 487, 120, 98]
2120I8l01l3n5K22K68L84j17k89m88n4J10j20J52M82K92j28k72k53k46l6l3J35
2142b82L37K71J31l67j76l81K33k86Q05j56J6M5j61m62J00M6r5L50q9O23j43l56
2164Cj31l94J01J37K09L66j36J09j59n8k77j32j38N51K1K20L2l18q1k76j52J33
2186c70P32k32M84m09K20n31k20j43N3M22J92M57k34k87j71j99k29K16N18O9q9
2207B49O7j40m90O3O2O5K40J83q7Q6p7o70J40j3J72J01L98q8O5k08l30p7J35n4
2231b08L53J13K39k83j15j44j55lJ81J81K43K9j79j53l98j57K04K68K04m1K28
2252D07m63L21l64j33j86J52K65O8L4o3nj57p6o3J00lK58J57j95m1j52j22j30
2275c91K58L14n6k40M60l00k38r3k8J41L80J54K0k76k05k08o6J67K25j27M46k30
$$ y = [98, -203, -236, -291, -69, 199, 583, 466, 177, -311, -365, -255, -375, -223, 259, 551, 423, 151, -102, -348, -384, -417, -282, 55, 326, 457, 90, -86, -467, -234, -520, 285, 129, 145, 190, 29, -433, -333, -287, -382, -32, -121, 502, 359, 3, -128, -522, -421, -284, -75, 291, 155, 264, 105, 47, -230, -362, -500, 51, 72, 292, 324, 6, -75, -351, -503, -370, 362, 130, 614, 205, 425, -106, -326, -469, -416, 6, 198, 655, 421, 134, -37, -236, -465, -249, 269, 338, 249, 316, 176, -314, -251, -189, -124, 116, 299, 212, 298, 221, -449, -309, -322, -150, -49, 349, 261, 326, 118, -212, -289, -154, -208, 145, 258, 497, 214, 99, -45, -200, -203, -22, 159, 402, 431, 252, 99, -299, -456, -252, 16, 220, 179, 407, -56, 265, -99, -232, -418, -266, -1, 67, 101, 38, 33, -124, -200, -263, -163, -166, 92, 249, 54, 13, -139, -261, -391, -133, 181, 125, -115, 345, 45, -193, -286, -314, -173, 207, 361, 381, 105, -100, -308, -374, -207, 18, -109, 337, 107]
2297A07K00j60k13l02K23j77M41r0K76O7l29j70j27J05JL41J03O4l42j82R5m9
2319a18j83K18L59j37J00o9O1m15j83N1J55K09L55k28k9k36Lr1j84K84L96%L3
2342C51l06j03J5k04K04l7J68J40M7j56nn16K22K73j68J66J12K13l50k40j03K69
2364hl93J69L72N8K21n37J36k07k54L54l8K00j98M64k08l50L12l94K33n7K91J43
2386C09r5k70j07j0O9J9J2L03k15k1J91k67k54J89J00J2L02O9l28n0M8l04q2J85
2410a95K34L23lk16j26j74pm0J69J36J33J94l99m6j62j57K52L2K99j92L72k68
2432A59n6k28j90K64j41J86j58K17j6j97J9p4J88J57j40J83j6j4j96o3k33L01
2454d8L72k71N41m06J58l91Q0J98m10J82J82L8J4k64j53o7L8QL49j73L49k70k25
$$ y = [107, 307, 147, -66, -368, -145, -322, 119, 29, 305, 372, 43, -127, -254, -149, -148, 193, 296, 360, 18, -164, -69, -118, -301, -83, 276, 139, 239, 170, 231, -184, -367, -316, -161, 48, 403, 175, 146, -90, -87, -178, -362, -78, 318, 318, 351, 45, -58, -43, -247, -43, -80, 88, 228, 275, 119, 114, -402, -180, 93, -75, 91, 203, 416, 66, -174, -277, -8, -401, -232, 140, 198, 419, -118, 18, -189, -443, -89, -127, 73, -125, 339, 131, -219, 93, -301, -68, -125, 166, 309, 214, -56, -163, -173, -104, -85, -73, 230, 15, -6, 185, -82, -336, -147, -47, -35, 267, 336, 8, -42, 6, -298, -380, -195, 39, 362, 359, 143, 17, -157, -164, -204, -35, 101, 234, 428, 29, -17, -179, -336, -84, -52, 247, 55, 427, 159, 103, -125, -315, -51, -192, -6, -164, 53, 37, -160, -141, -215, -27, 130, -10, 173, 157, 143, -53, -116, -349, -48, 324, 53, 594, 188, 346, -45, 35, 233, -177, 5, 187, 225, 239, -25, -178, -245, -207, -199, 150, -23, 326, 56, -169]
2477a69K68l53j67L72J8K85l8m9r5k38K77l12J81P7M2P3j81m1J7Pj09J12J01r
2501F9p3K44j60j24m2k25J93N9P4K45p6J58k43j88N0k81K78mK78k27l6k8j2j86
2525b57L07j0K20Nq7j20n8k55J36p8L26r5KL0l4p4K7N7K3j19K23k0j07j88K54
2550A08k72j61L18o2J21K5J31K5k96m0k28M35k05J59R9k0k00k91K75k03L53k34
2572a63M06p8j44p7Q3k09pM5L06n2J4R2r0ok68m2m7K65q0J79l92K91j06q1R8J40
2598G7J2K3P9R8n45k0L40n5J48k69M52j29j48L8q7j0n3j13J19j16L67l67K56j97
2622a00q0j83L11O6O2o4J64k82j37M8K63M1j10pR3p6J24j21j18j81N25j49J10
2645A99k76K85j43l54N7J26j7J48MK23r3k48n6N8J22j60M02k43k09J45K82n19
$$ y = [-169, 99, -254, -421, -49, -31, 254, 216, 167, 72, -166, 111, -201, -20, 57, 99, 172, -9, -50, -33, -26, -135, -23, 78, 69, -4, 240, 80, -44, -86, -311, -118, -59, 15, 260, 184, 342, 99, -89, -39, -320, -42, -46, 232, 5, -31, -59, -71, -257, 50, 40, 260, 265, 178, 58, 0, -255, -119, -197, 129, 34, 36, 66, 32, -42, -15, 42, 65, -54, 169, 149, 42, -146, 108, -164, -325, -7, -69, 52, 77, 208, 233, -63, -103, -331, 104, -101, 58, 157, 137, -63, -354, -79, -282, 71, -163, 243, 165, 21, -56, 27, -182, -189, -144, 162, 110, 124, 216, 126, 120, -148, -190, -237, 28, -52, 127, -265, 26, -80, -161, -63, 77, 89, 112, 191, 289, -256, -276, 64, 9, 157, -112, 340, 211, 63, 101, 14, 4, -49, -162, -43, -159, 208, -159, 97, -100, -180, -363, -52, 14, 76, 12, 176, -106, -243, -195, 68, 109, -1, -8, 85, 9, 133, 12, -106, -287, 238, 89, 199, -77, 208, 65, -289, -232, -106, -123, 25, 29, 252, 159, -89, -145, -87, 35, -125, 277, 34, -175, -30, 252, -267]
2667b67K19J64k25M3J56J48k11O6k93P9kJ1K58J13j70P1l26J02K6J20J66m34K85
2690I9K1j55K19k14j58J08N0qK87k23J76j85q0j43pK74J02j04j45M41o34J97l
2713h5J83j06q5K19j30J59op3k07O4L3m1J82k38m3k4K21K9k47J42K48j70%lk46
2738b24K00p1m8K39R2J17jm26k20L62l3pJ3J13J4k30j8K13j07j0M0J73l21M34
2762B94k53R9k16L7l09L91l3J32K7j37lj94P6J29m8K6J75Qj98n0M5j20J76j71
2786a17K21K58n14K49j14q9J44k21K07j0oR2j19p7Q2m7%O8J1K4M0r7O5j94Q5J94
2812A35O9r1j50Nm3J70O0k62J01R9K23k5r0k20j03l0J3J58K78j56Q9l35K98n37
2836c44J20K68j72J92K9J24o3k79J01k7K86j52K5Q7j30m5N1J2j89j39R5J21M4
$$ y = [-267, -48, 116, -109, -66, 90, 238, 27, 93, -200, -121, -123, -112, 146, 259, 89, 160, -166, -64, -38, 82, 248, -186, 99, 120, -35, 184, -30, -188, -80, -30, -38, 249, 26, 202, 17, -63, -206, -213, 61, 163, 59, -86, 355, -279, -82, -85, 98, -8, -93, 126, -4, 155, 149, 76, -131, -67, -34, -75, 107, -131, -174, -198, 23, 52, -195, -53, 195, 25, 25, 22, -224, -24, -95, -143, 96, 188, 305, 304, -122, -342, 20, -13, -20, -7, 106, 120, -110, -128, 85, -22, -32, 8, 181, -140, 294, 41, 140, -76, -39, -348, 43, 10, 142, 169, 32, 29, -165, -89, 40, -8, 18, 193, 201, 3, -47, -2, -122, 54, -117, 104, 362, -152, 97, -17, -106, 38, -183, 24, 14, 8, 100, -19, -96, -14, -61, -61, 7, 18, 42, 82, -15, 50, -144, -59, 135, 204, 113, -37, -32, -75, 95, 155, -107, -6, 93, 316, 291, 201, -19, -122, -152, -139, 19, 297, 141, 230, -105, 193, -344, -224, 44, -128, 64, 93, 217, 154, -125, -24, -51, 235, 83, 108, 195, 65, 20, 71, 83, -106, -245, -150, -29, 15]
2859A5r5J7J39n29J95J67o7L69K2j55o0P3l65J90j32K10p4R7J17qj34m2p2NL3
2884h4K21m3j49J49O7r4J64n84K95o6R3K12r9j69J43k22L9j14K03J60k88O31m97
2907c2J38r7r9mJ36j93L53k71L2J52j18l1R3J30J41l21o9R3j25L79l38Q4j7R0
2931A06J23q3l16L41j96Mj43K09K72K4l76Q4j07l9P0k74K77N2j79L87k57J48k19
2954i2J0J15k67L14k57K47k3o6O2k79M15kp1J6K6m1k66J15j01M4J46Q3j82Q5J72
2979B03J1o0j53j13K7J66j79K09k30L47l71J39j15N2K82k07K0k8j04K06k15J0
3001a03mJ74n9J08l20l2L05n2J34o8j77R6m8J94M7k65l8P6M7n2M9N6L7j94J02
3026A3m6kl3J15l9K19k04k20K93k07J55J59J2l27J28k80K05j74M17k69L44K5k84
$$ y = [15, -80, -63, 76, -453, -258, -91, -158, 211, 233, 78, 18, 91, -274, -84, -216, -6, -80, 17, 134, 126, -8, -50, -122, -117, -84, 137, 94, -55, 94, 161, 67, 231, -353, -58, -124, -31, 181, 82, -87, 56, -166, -127, -241, -38, 122, -166, 465, -32, 106, 9, -90, -94, 42, -151, 202, -69, -37, 115, -3, -34, 59, 189, 330, 9, -60, 33, -92, 287, -51, 33, 16, 106, 229, 146, -170, 171, -25, -21, -164, 45, 317, 341, -35, 49, -58, -97, -27, -301, -24, 28, -151, 236, -21, 127, -92, -82, 33, -234, 80, -177, 70, 47, -19, 43, -236, 179, 177, 106, 122, 148, 107, -159, -44, -145, -101, 45, 128, -54, 31, 203, 214, 154, 1, -112, -85, 81, -98, 111, -119, 228, -143, -4, -119, -67, 215, 8, 28, 0, -104, 102, -113, -103, -107, 67, 8, 116, -204, -236, 69, 17, 151, 83, -94, 2, -46, 148, 195, -70, -108, -32, 15, -37, 12, 68, 105, -89, 13, -33, -35, -68, 47, 8, 227, 23, -197, 96, -111, 44, 203, 215, -112, 16, -264, -59, -233, 184, -85, 259, 284, 0]
3049@K06j26q7Q0j91R6j55K98o0j3j44k2r8J6J14R2Mo6J12j50r8M0j2L23j73q6
3075a00J25j24K16j12N8R0l59P7l6M0J23j80K28Jj19j0K36k82J0K84j73N3K34
3098B80k64J1M2j32Q9J4p3o0J15k14L3K61j18K7Jk39J50O1K43k83L48k02J3j29
3122b6L38k89j06j03K21J78j89nk0p1M6J4R3j39L48lk61R1k20P9J52l34J91o2
3146g7K81j62j42J39j30M2J75K0l5m8o2k41J72j79K29K4r1K13Rn9j1j73O9J06
3170F9j64J19M0q6M7N3j91N6K2p6N2Q8p8K92l11J06O8j19o0J74k19K75k84RJ31
3195A3l3N1j6K6J44j76j91M15l14J53o5J34J92l06J30k27J16o6j11j32L82j14
3217EM3m2J41m30J42nL71l24qK97j69j2j48J03J73k50k8J47J77l67k5K53k68K83
$$ y = [0, 206, 80, -7, 73, -118, -22, -177, 121, 61, 48, -96, -118, -216, -200, -86, 6, 10, -56, 56, -94, -192, -152, -164, 159, -14, -100, 25, -99, 117, 5, 63, 153, -206, -129, -165, -125, -2, -182, 46, 47, -72, -82, 154, -128, -118, 166, -7, 46, 280, 16, 27, 69, -63, 26, 40, -33, -93, 22, -192, -159, 102, -16, 11, 12, -227, -77, -16, 227, -56, 292, 90, 103, -26, 312, 23, -83, -186, 35, 213, 24, 19, -1, -72, -26, -12, 81, -58, 290, 287, 26, 117, -103, -24, 128, -206, -15, -77, 204, 42, -100, 39, -91, -49, 126, 146, 111, 63, 1, -240, -68, -247, -18, 6, -85, 128, 137, 78, 67, -106, -37, 69, -95, 24, 64, -22, 25, 78, -113, -57, -35, -111, -59, 29, -49, 243, -68, 38, 106, -13, -73, 101, -118, 157, -127, -118, 13, -20, 31, 15, 41, 185, 9, -182, 233, -81, 72, 7, 141, 333, 27, 157, -70, 46, -20, -131, -263, 119, 5, 48, 6, 147, -283, -141, -146, 225, -99, -107, 190, 21, 9, -139, -36, 137, -113, -141, 6, 183, -184, -209, 44, -224, 59]
3241E9q1M1Qj11K58j69k27K38J04j86J38j36Q7K31l08N2j89O6j50K94K11k32K18
3264B16p5j79K14M6m05K80J62k85M2j21J34o4r3K00m0J08j34K54j06k06L2q9L15
3287B06l61K37M5k26J35q2p0N2J06L1k9or2J20m0P2k71R4Rn9j00M03j71m5J19
3312G7j28J27j71K30j37J39k50j13L30j00q2%j2j00K60np3k6j6J07K9k60J03L62
3336B91r9j52k82J87Q2o1j18L43k07K1j94L00j79J07k22L29l21M7P4J16O3k61
3358a36J93j25J05K6j00O1P5J01k92M55l64O6k39K32p6jJ49k13N7L06j66l09J76
3381a9o2k27L42J27j13K6O7M2k90K3J32j51jp6K95j10m7m2J41p5N0O6k93K9K27
3406F1r7q8r8J41J97J15k01J15j74N8JK3k39K82l21L89k29J44q3j13J56j37j27
$$ y = [59, -22, 19, 27, -84, 174, 5, -222, 16, 120, -66, 72, -64, 23, 254, -54, -2, -191, -125, -275, 19, 230, -2, 216, 141, -38, 176, 222, -183, 97, 259, -26, 16, -105, 29, -35, -128, 72, 32, 140, 6, 260, 154, -52, -20, -109, 206, -155, 82, 127, -99, 36, -46, -116, -64, 42, 73, 44, 38, -54, 66, 26, 98, -173, -79, -70, -129, -229, 174, 3, -42, 77, -51, 76, -95, 135, -2, 137, -113, -226, 104, 4, -78, -78, -90, -190, 70, 65, -8, -34, -50, 57, 86, -174, -71, 291, 192, 40, -242, -55, 27, -34, -152, 191, -16, 5, -189, 111, -68, 39, -183, 146, -175, -128, -54, 62, 125, -136, 57, -68, 37, 63, -37, 24, 99, 200, -92, 363, -1, 65, -174, 58, -18, -19, 130, -83, -26, 280, 114, -195, -19, -81, -308, 34, 161, 48, 74, 141, 183, -107, -84, 48, -103, -104, -180, 115, 5, -42, -84, 57, -18, 32, 98, -195, -166, 61, -36, -124, -222, -81, 116, 231, 30, 145, -29, 29, 30, 53, -186, 96, -225, 164, -65, 79, -4, -117, 39, -98, -225]
3429b25J80O6k59M02j32l8lJ16k28L67j97J75O3m73J06J08k16J63j20J27n0J46
3451G8M9k45R0NJ05k17J88JQ5l3j55J79j75j5J39m9k27L8L14j67j57J59n7J73
3475A06K9k16o3NR4K4k7L2K22n26M82k37n3L48j69l14J20K43q4Q2K65l07l13L80
3499A23k10K2j1mK55j43k37K53j47K41j19j03J19J44k31J67k16J06j07N9K67k47
3521a9R2j31Q3j62k5P6J96o0R7k04k1P5pj05K0K82l33J74k41J84M24l78k55O05
3545C67l59j61K30o7M5k2r8K37j60j69L43j51j86J15J13j5k53J81m1o2N9J99l6
3568A09q1j75K16J06k77J75k39P4K80j16Qk94J48J04l26L05mo2K0N4J40j18j03
3591e6p0J1m5R5R2m6R3j27J91k3k48K6J12J50k82J3M72k17Nlj45j04J56o2J28
$$ y = [-225, -45, 21, -238, 164, 32, -6, -9, 107, -121, 246, 49, 224, 287, -186, -80, 28, -188, -25, -145, -18, -68, 78, 127, -118, -28, -23, 82, -135, 53, 54, 139, 106, -49, 130, -45, -60, 79, 30, -197, -159, 155, -12, -169, -10, -67, 106, 135, -81, -144, -139, -45, -21, -48, -16, 206, -320, 162, -75, -128, 220, 51, -263, -143, 100, 16, 98, 363, 56, -257, 123, -87, -65, -76, -80, 175, 32, -205, 48, -99, 142, 23, -80, 39, 183, -48, 119, -97, 9, -98, -39, 228, -19, 73, -58, 25, -137, -162, -86, 110, 50, 147, -57, -78, -3, -10, -115, -95, 187, -146, 28, -213, -29, 395, 17, -238, 367, 8, -153, 77, 10, 55, 33, -65, 172, 12, -157, 186, 35, -151, -36, 77, 62, -191, -10, -51, -113, -54, 145, 109, 28, -147, 69, 175, -102, 73, -166, -92, 188, 72, 80, -214, -66, 38, -288, 17, 13, -49, -29, 25, 165, 47, -56, -126, -115, -160, -65, 27, -19, 74, -53, 138, 115, -133, -107, 5, 155, -127, -114, 358, 141, 146, 143, -2, -106, 50, -12, 116]
3616A16LL1j39K6J46k8k07J18j98N3J90l4j51J69m0j11J86j47p4R2j5N6L25l26
3640D1o5j4j82N08k13j81j08K67Nl49K71N1j41M24k80j53pJ51L8k12J10J10M8
3663A19Ok97J06p2J24Q4l5j09J80j09k47M78k01J93q2j54Q8j43Q1L5J26l01n6
3686a86J46Q7l0j72J70j65K21k71K75k34J12J65k33l1K06r7n5j34L11J64k03n2
3708fj17J60Jj29J46j93j42L23j09l4J80K92o00K79n1N8J85j56m4l28K67L5l14
3731b97L55j20j8J82lq4r8J28jP8j95m9J56R3q1n9N8J12j84L5k0q8J76J0j39L44
3757B91j86o6j8j43K03K7j4pm4r5j09k7L50J7j83n6J96k01K29k05J44Kp2%K2l5
3783B0N0Kk5l7j94K02K28l65O3K45o2j50k62L16j70J48J62o5j69L5j42OJ25m4
$$ y = [116, 119, 150, 11, 37, 183, 155, -52, 66, -132, -79, 111, 77, -74, 95, 55, -56, 130, -17, -91, 1, -14, 42, 367, 41, -24, -38, -220, 288, 75, -106, -214, 53, 58, -291, -20, 31, -110, 314, 34, -119, -126, 25, 63, -149, -39, 71, 119, 125, -172, -66, -138, -14, 70, 35, -74, 106, -3, -250, 228, 27, 220, 138, -16, 72, -71, 10, 45, 171, -130, -186, -40, 47, 17, -155, 15, -150, 71, -200, 75, -159, -47, 118, -115, -146, 60, -37, -92, -226, 85, 249, 46, -6, -123, 37, 38, -91, 55, -138, -280, 43, -66, -100, 80, 372, -228, 51, 0, 58, 243, 87, 43, -285, -18, 17, -297, 58, -62, -80, 102, 99, 15, -83, 45, 44, 122, -73, -122, 34, 127, 46, -13, 45, 157, -27, 8, -12, -100, 76, 86, -53, 291, 105, 39, 21, -122, 81, 108, 94, 87, 43, -52, -161, -188, 162, 179, -4, -60, 136, -65, 164, -41, 103, 105, 33, 33, 55, 20, 70, 72, 47, 10, -184, 18, 246, -119, -56, 189, 127, -23, -285, 31, -139, 9, 171, 106, -63, -28, -170, -164, -39, -83]
3807h3J49j79P4J31j2Q0j32m7r8J98p1j01k0K98l49J33O6j89M25l03J69k70K47
3830A16j38M6M2M9j06J7M1j39Q4j31K64k8j72k8J26Lr7k7N54o11r8L35O8j78J9
3855A1j58L82j71q5K2qp5Q7K1j17R6j41K81j94P6J60k69O1J16M9j00L8k07k3L2
3880a16J26k32L48k29K41ll5o1N9j57K19j92j51L28O8m29J73L5k0J67j42J70j78
3903a1J09j13P8r4O4j13J88o2k6j85K69j55J20j58q1K80j51J47j85K47J43l92
3925h1K07N4l8j91K3k2M7J0j0k64J41P1K1L46m46K70o6j0R7l29KnM24l52K09j42
3951c4J53l71K05M1P7j5M0n7k75K55J32j30j43J71j28j2l7J20K4L5J5J35k22J58
3975A37j21j30q3J03K1n6n5L07k12PoK00r5j2m0M8J36p2M5k42K30L7Ql50Q2J10
$$ y = [-83, 66, -113, -39, 92, 80, 160, 28, -19, -117, 81, 10, -91, -111, 187, -162, -29, 37, -152, 273, -30, 139, -131, 116, -22, 24, 66, 115, 9, 26, 67, -72, 12, -119, 145, 117, -55, -83, 43, 46, -51, -78, 476, -135, -233, 102, 170, -8, 11, -147, 235, 64, -21, 1, -7, -82, 5, 26, -91, 5, -136, 145, -49, 27, 187, -82, -21, 95, 144, 44, 82, -125, -148, -116, 10, -222, 126, -103, 138, 135, 100, 39, 98, -59, 160, -32, -183, 145, 213, -216, -43, -8, -28, 139, -3, 167, -11, 98, -15, 63, -31, 33, -80, 108, 46, 20, -165, 104, -51, 69, -89, -170, 110, -41, 106, -79, 168, 311, -81, 126, 180, 142, -49, -26, -48, -1, 9, -1, -265, -124, -53, -32, 314, -132, 138, 72, 62, 159, -170, -168, -173, 251, -101, 108, -34, 119, -252, -47, -6, 71, 56, 96, 39, -236, 19, 151, 21, -122, 49, -79, -91, -128, -8, 16, 51, 66, 201, -21, 137, 16, -114, -197, -94, -73, -129, -184, 123, -89, -82, -88, 112, 17, 5, -35, 13, 149, 77, 122, -120, 110, 147, 155, -195, -113, -3]
4001cL7K71k14m0pl7J12K24m53Q1J05k59J18m0J28p4J95j59J00j52K56l13L85
4024B61m45J21N1LJ42M9j81Rj04o4K57k10J73k0j32kK24m11L43j83q4K79j09k02
4048b35K86l5l99N30k49O0l9O3K33k54K90j92R7j47k5N1K1r1mJ42n7j45p7L24
4072A48jk15k4J01j07Q3J05j18m5J35j27k1J40j27J71J6K24m16Q5j22PqJ72Mo3
4097cL29j90j63q1N6J59k33j92M39j93p0J59j53J22n0K56n1m30M23k16k34J08
4119b08L60l32K06k59j31M39J3l05J88l0J83k54J41j4j50O0R0j27J63J1N1j07
4141a2kK32m45j28L91j10J75j60k09J8Q1N3n0n3J69J73j52j48K28j18j9m4K40
4164A10l44K92K3p7k5N9k82M43q9l46L78l51L97j74m5n8j76K29J2j19J72K4k61
$$ y = [-3, 34, 305, 91, 51, 44, 7, 119, 343, -110, -29, 76, -183, -65, -105, 23, -51, 144, -15, 85, -67, 189, -124, 261, -184, -63, -12, -9, 133, 182, 1, 10, -94, -158, 99, -111, 62, 42, -90, -92, 132, -279, 64, -119, -203, 76, -33, -235, 51, 16, -383, 147, -102, -42, -81, -18, 215, -39, 251, 59, 156, 9, -16, 35, 56, -35, -39, 103, 46, -99, -176, 148, 147, -68, -92, 9, -98, -15, 90, -28, -73, 62, -65, -86, 54, -73, 98, 114, 338, -78, 7, -115, -108, -116, 56, 60, -3, 326, 136, -27, -108, -52, 107, -126, -318, 121, -72, -142, 17, -136, -14, -64, 192, 141, -289, 134, -82, -316, -208, 152, -180, 26, -233, -364, 75, 88, -217, -29, -59, 124, -130, 11, -3, -153, -93, -3, -130, 33, 44, 95, -12, -14, 218, -227, -355, 36, -74, 101, -59, -268, -250, -169, -116, -166, -219, -50, 123, -29, -177, 51, -67, -86, -130, 110, -234, 58, 81, 4, -21, 38, -244, 199, 110, -236, 142, -209, 188, 14, -31, -89, -265, -36, -24, -143, 29, 53, -208]
4187b08K95j07J49j92j52JK71N2J62k53j32K22j82L48l04J23o6P0j32j27Q2J06
4209B6j04K86J0l38L33k22Q3j09J67n9n9L28j47j64n2M9j59R6k8O2k8J1J25k53
4233a46j3K68j22K08N7k60J06j53l3R6K42l58K29k14J2k6k9K81L5k31J59p8r7
4256f7J83n5k63M08k73j70L03J76j31R3j56k64L19l7k52K19j23k6l9J21k09L71
4278A28n03K22L88k41n1K66m75J74J82j85K03J9j54Q1J97j82J09k23J87Nr1j75
4300a19p0L20n3j79K3L7p7K33j93j9O6o4M1j37J40N1N1l2j54K29r9J10l12lK36
4325B6K1j45J8J76L8J62m99Q7J30j36O7J82k57P9Q1k16K24Kj54r1l9K34k23K89
4349E6k4m3J61k51K0K76l64N6J12j81K20K17j38J7p4j71j33m8L36J6p7O0Q3k84
$$ y = [-208, 87, -20, 129, -63, -215, -214, 57, 109, 271, 18, -114, 108, -74, 274, -30, 93, 27, 97, -35, -162, -80, 26, -78, 208, 218, -120, 213, -9, 74, -35, 132, 73, 14, 342, 195, 31, -21, 28, -131, -35, -63, -1, -29, -18, 107, -146, -159, 109, -13, 195, 252, -8, 98, -55, -88, 8, 250, -108, 121, -93, -81, -107, -136, 145, 180, -51, 108, 30, -67, 116, 61, -202, 206, -67, -237, 66, 242, 111, 204, 48, -216, 103, 66, -186, 33, -90, -116, -155, -34, -243, 128, -375, -153, 235, -6, -57, 209, -266, -92, 90, -95, 108, 127, -27, 54, 251, 69, 178, -45, 142, 147, 56, -119, -189, 131, 78, -101, -78, -41, -118, 115, -78, -97, -31, -95, -54, -191, -51, 0, 51, 19, -135, 94, -5, 105, -207, -210, 26, 47, -98, -80, 96, 134, 296, -203, -116, 14, -122, -55, 127, -130, -51, 30, -186, 38, 40, -114, -205, -244, -10, -233, 56, 32, -11, 150, -101, -81, 195, -169, -113, -1, -182, 38, 255, 117, 134, 60, -111, -244, -292, 44, 60, -17, 43, 126, -158]
4373a58M20j57%j12L4j34J33q2K30k38k7J06M5p9p5J12O5m00M48k00j33L52k81
4396a31mQ2K43l26R5j44O7J33j64N6J96jqk29M3L20k09J93m97K90O1k8J5M3N6
4421A52j58m63K83O5J05n5R2mj00J36o8O2M8Q1k1k26N6L8j38J51J47k13k6K0j2
4446d8J34j52J34ln3l05L10l21M17p4m9J35k00P3k3Q5J6k07K13j64J59o2J41j52
4470DJ09k13J6j3L26n1k12J46k54K15J4r1j05J32l7J28j85j9OJ29j76K0L3J8J71
4495A11j75K11p3j29J57J72n97J06%j27N24k52n9K44j10J30k1j07K10k12J49q8
4517F4k84K32K72j33m1l35M50o9l04J49j7K93l05N8j2K44m33Q6J95j9j44j6L60
4540B91m40J33Q2o0r6L34j97L5l16L36N9l78L88k36o4J49q6j8j46M16p5k39n0
$$ y = [-158, 262, 105, 105, -7, 27, -107, 26, -56, 174, -64, -91, 15, 60, -19, -94, 18, 83, -317, 131, -69, -202, 150, -131, -135, -53, 190, -136, -41, -185, -118, 15, -149, -93, 103, 102, 94, -135, -92, 228, 19, 212, -285, 5, 66, 38, 53, 96, 152, -6, -469, -186, -121, -16, -71, 21, 17, -83, 53, -15, 47, 95, 176, 155, -71, -15, 23, -115, 36, 183, -30, -56, -36, -48, 86, -66, 68, 65, 12, -293, 17, -304, 113, 39, -10, 125, -75, -2, -25, 60, 76, -131, 82, -82, 77, 15, 156, 4, 113, -100, -84, -97, 229, 178, -34, 112, -142, 73, 87, -4, -109, 23, -14, 114, -71, -90, -84, 45, -131, -111, -78, -60, 111, -64, 147, 74, -55, 102, 274, -323, -217, -217, -344, 180, -72, -131, 113, 3, 133, 112, 5, 215, 3, 152, 64, -220, 12, 284, 151, 110, -225, 225, 156, -148, 1, -16, 277, -28, 30, 18, 262, -171, -85, 110, 91, -53, -69, 291, -149, -16, 66, 6, -90, 244, 47, 82, -234, 102, 161, -217, 171, -65, -129, 20, -66, -84, -230, 186, 111, -128, -178]
4563a78K0K99k6Qj55J5k74J11M22m18P%L47m21K21j24K27k5m3k54K59J14p1J69
4587B30n15K48q3Q2K68k83k85M98o1j20K3N4K34k02j50L15j55k71J35r3J19n4
4609f6J98j88J62k3r3j47J46J69Lm12L88j70K6o1k15J73J27l9K0n2j13LL2N4J25
4634D7K9Q5j38j35q9K73o6o1nj41L22j95P7P6j15mkk0j00K21J92n33J64n6L44
4659A70l17L45k06j88M07p2l28M20K4l28M6L7K06k03j96N7J01K79j45j11P0l8
4681C0O4j69K88j74j06J11k4j5Rj5K75m74K23N2k3n3k59N7O4K86P0j84r7j84L77
4706A29k2l16L7K31k03K47k36J92Nl19K73Jk04J91j33P5J82l58L94n0j12k88M46
4729A62k56j00J35P2j27N6lj14J64n1J37j27J99j67L0P9J09m70K38L2K13j41j47
$$ y = [-178, -158, 141, 115, 123, -32, -17, -291, -180, 242, -176, -169, -169, 178, -243, -22, -146, 81, 56, 13, -241, 18, 132, 61, 230, -285, -37, -120, -38, 230, -53, -338, 160, 99, -21, 2, 56, 290, 88, -62, 253, 98, -173, -38, -131, -12, -66, 132, -56, 106, 83, -10, -157, -11, 158, 161, -251, 137, -33, -7, -68, -283, -110, 17, -22, -2, -54, -167, -164, -132, -78, 47, 76, 161, 23, -112, -201, 72, 6, -55, -60, -201, 121, -74, 3, 79, -36, -40, -42, -62, -162, 59, 251, -282, -118, -174, 170, -147, 198, -8, -196, 211, 139, -189, 231, 255, -73, -27, 10, 216, 13, -183, -126, -25, 254, 109, -2, 68, 30, 94, -75, 213, 39, -67, 44, 20, 5, 14, -1, 274, -200, 23, 75, 52, -1, -260, -203, -139, 147, 217, 33, -64, -248, 129, 107, -209, -172, 59, -144, 103, -133, 59, 64, -255, 18, 19, -185, 6, -127, -52, 130, -228, 166, 116, 4, -284, 162, -94, -194, -59, 13, -114, -58, -61, -175, -11, -62, 75, -52, 147, -20, 10, 89, 198, -272, -34, -2, 211, 70, -77]
4752g7K20k31Q3MJ30k27K30j51PJ8K4M5j54L45j57j57p2J50q6p4L9J54J21k55
4776g1n5J00j03M3K71l95M1L61k27p2K88l61Q6J76M1J01k05R7L9k36K43k98J01
4799c5J32J69m70J30QP5n0J25j79j08K36J9J37j12k82R5l1J48J60n7j52J14Mm5
4823C1L1j27K60j02j62K16q3p7J18r2J04p1k60M11j41n1J73r1m0l0P5k0Q5l45
4847a88L67r7k63J50j41J85j3n3K36k90K05j13Q5o9j5LQ5j99K32l58J09K06M5
4870A09j01j28M0J26q7j78M49j18m5j66J93J75k51j12q0o2K59o2J8Q5k21K58k21
4893a20J7J98j60J88j29J15j30K11l7k15J56j27p3O8j7J35j41o3K97O2j63Rj22
4916d1K46l59J34P6LN8K44m73K1R4QK02k9j64L5l4r0K8NJ55j57j77J98Pr6J18
$$ y = [-77, 143, -88, -5, -1, 129, -98, 132, -19, -12, 6, 30, 75, -79, 266, 109, -48, -120, 30, -56, -130, -91, 63, 184, -71, -126, -26, -129, -86, 185, -210, -169, 192, -35, -107, 181, -180, -94, 82, 123, 224, 19, 116, 155, -81, 162, -136, -35, 97, 266, -204, -74, -66, 9, -41, 84, -95, -203, 33, 52, 189, 77, -205, -110, -141, 7, 167, 110, -42, 72, 76, 31, 62, -65, 195, 93, -69, 147, 64, -13, 105, 13, 117, 46, -214, 197, 56, 5, 178, 87, 47, 17, 92, 72, 157, -188, 179, 82, -181, -31, -172, 13, 0, -53, 183, -107, 98, -15, 70, 1, -14, -11, 74, -125, 107, -251, -142, 64, 109, 8, -120, -80, 46, -41, -219, 230, 112, 67, -99, 94, 269, 18, -94, -174, -236, 23, -39, -21, 64, -157, 101, -120, -103, 95, -65, 123, -6, 109, -21, 190, 153, -62, 94, -33, -106, -38, -55, 80, -61, -124, 173, 235, 72, 81, -41, 205, -154, -20, 56, 59, 117, 361, -112, -91, 3, 11, 213, 184, 20, 55, 21, -69, -41, -36, 119, -38, -215, -17, -10, -106, 12]
4942A2k82O2p7K76j31n4L68r9o2M7K7l35M01p5j02q2j86M66k8j15J65k42J35j
4966H8K9j81k18K81q1P6L9k29K35K38m20K87l00r2L08J7k20K63R4k34o3j42J57
4989f8p1K08JN9j17m4J77j08Q0j39J5J0J18n5N0k81J30on1K97j31o1j68K74r2
5014B7K8K74l66L8K1r9L2O2j94K30M9m66K49J43l62K67P1l2J35k67L10o0l40L06
5038E6j82Q6J51M3q9j07J65p7j11j13K09k99P1N3K34l0j09L07j32pJ12m67J10
5061a26K56k95J4L11l86M80k99OK2P9n0M0N5q9R6j10j71O9K23Ol70J77m8K2Q4
5086dk88K37J41l84L31P8k87Q5J8kK9j9k02J91K56p5P8ll8j91R8J2K56m01n0l0
5112a64K21L8j10n3K57N0l24Q5RJ43j64K01l19K21j20J6L4j53K7L8K13j34j07
$$ y = [12, -270, -208, -285, -9, -140, -194, 174, 75, 13, 60, 87, -248, 153, 78, -24, -106, -292, 174, 146, 31, 196, -46, 89, 88, 117, -64, -282, -1, -82, -6, 33, -196, 39, 277, -143, 144, -156, -248, 60, 77, -143, 120, 214, -20, -83, -225, -68, -139, 69, 70, 129, 12, -32, 145, 37, 117, -22, -7, 3, 121, 66, 116, -165, -35, -41, -92, 205, 74, 13, -155, 119, 27, 55, 329, -37, 1, 22, -77, -45, 17, -177, 53, 102, -364, -115, 28, -334, -67, 4, -28, 107, -160, 150, 90, -250, 56, -126, -40, 111, 154, 65, -42, 123, 46, -65, -178, 31, -268, -197, -144, 90, 60, -49, 258, 126, 119, 231, -236, -126, 130, -165, -151, 160, -226, 254, -45, -39, -17, 62, 12, 52, 107, 18, 114, 4, -167, -98, 125, 131, -239, -62, -110, -88, -4, -292, -55, 86, -298, 33, 111, -176, -91, -73, -75, -46, -65, -267, -76, 180, 105, 183, 180, 142, -49, 49, 61, 317, -84, -134, -164, 57, 95, -15, -68, 189, 239, -85, 0, 9, 152, -12, 189, -130, 91, -29, -13, 21, -132, -105, -67, 146, 12, -95]
5135i5J07q8J38k6j60L73j55o3Q5m2J45k92J43k09K8K44k70K48k31PJ17RO9k17
5159a35K82k72K46k79k6K03K62m08K49l16K68M9l24J27MJ60j93L0R6Q2m4m1P7
5182I7M7j25l14J36P1j24J11J04j8P0K65j63k35L7j12J10J16q3l04L31J35j25
5204B7j09P1o2K16j05R4k91Q1J26J44l27L3J41J88p2P5l09K96k01j46J40mq5m
5228h3J78j39m6R6L69n23K68K18k99m6n2K36j98K25o0n4j94J57mLj2K4p7j20J36
5253Cm7L54k80j35J78N5P1k29R5m5Q0n3Q8j00J52j05J38k67J19Q5k72j19q1J73
5277a42pK02j90K30k69j22K84n2K9J32j48q0K07M2j39L9Q7N0j78M3j38j9L04l92
5301b27L13k3j93J28K8O7l15O10o14K90Mk05K13j1N9J52m06L64k40j9j17L26o8
$$ y = [-95, 12, -76, 62, 36, -124, 249, 94, 31, 116, 74, 219, -73, 70, -139, -111, 133, -137, 111, -120, -113, 4, 13, 82, -135, 147, -125, 121, -158, -184, 19, 281, -127, 122, -194, 74, 123, -201, -74, -70, 90, -103, -73, 23, 105, 61, 20, 97, 144, 19, -295, -159, -88, -212, -101, 3, -15, 55, 320, 157, -78, -41, -153, -43, 73, -10, -314, 17, 152, 27, -82, -11, -73, 143, 38, 132, -159, -78, 48, 192, -135, -102, 39, 227, 155, 230, -79, 217, 16, -130, 10, 6, -79, -83, 95, -44, -90, 6, 375, -148, 120, 338, 39, -7, -59, 177, -21, 204, 144, 90, -104, 53, 49, 52, 40, 64, -13, -133, 3, -44, 310, 30, -105, 73, 128, 199, -30, 65, 20, 100, 47, 135, 35, 187, 82, 220, -47, 72, 157, -115, -234, -315, -142, -149, 53, -137, 93, -176, -298, -14, -66, -37, 95, -53, -133, 74, 116, -23, 16, 103, 153, -25, 18, -120, -139, 165, -227, 86, 63, -130, -2, 26, 93, -222, 388, -226, 64, 68, -137, 76, 65, 124, 276, -130, 234, -6, -25, -142, 184, 116]
5324A16k56L70j34k3j09O3P0p6j4Q8o7j99J68J61k12J39l6Lk00J02K10j71J56
5347A49q0j47m0n9K25p2J14K0l17K44q0k6K31l74K60J71l50K41j41q0M23m42p4
5370b04J36J40J27j45J11k41J19nm6K5o9P5j2%pJ5n9K41k05j07N8K06k45q6J87
5395IJ34j45J36j09k0M5m2QK3j69J71k1J75j56q6n0o0J06k77N93l31l2K9K21r4
5420E8LK24k84J11j32q1J75p8R1L37n52K45j64%J91m24K84J77p2j30Q7j02rJ05
5444F0O7L9k95J6j0K29J21k59p2J06J93k6j62QJ5j94Q9j23K26j71M4K1k2Pj28
5469b21J23k4r3K04m8J7O0K8j18O7j4o3O2P2l2P0k50J57j36J77j94J4J38O8j65
5494a01J77j83J46M4l88J65M90n20M15l00PLj32j06L33J43m93K53JJ75q3q7j0
$$ y = [116, -140, 230, 96, 73, -36, 27, 97, 21, 7, 95, 28, -171, -3, 158, -54, 85, 49, 52, -148, -46, 164, -7, 149, 69, -78, -118, -177, 48, -24, 90, 110, -207, 37, -43, -69, 162, -212, 48, 219, -131, 110, -31, -111, 312, -130, -204, -68, 72, 199, 54, 165, -76, 43, 38, -8, 17, -52, 23, 11, 11, 4, 19, -40, 201, -4, -111, -53, 153, -92, -178, 9, 143, -2, 134, 25, 5, 50, 8, 16, 39, -130, 41, 20, 195, 39, -47, -97, -157, -51, -328, 265, -66, -98, -69, 152, 58, 61, 285, 1, 112, -20, -101, 74, -4, 87, 424, -128, 117, -47, -47, 144, -280, 4, 181, 109, -21, 66, -36, -45, 60, 127, 166, -129, -113, -123, 106, 227, -32, -104, 2, 195, 169, 7, 15, 30, -164, -75, -198, 28, -143, -99, -78, -100, -93, -221, -98, -122, -215, -11, -59, -42, 18, 46, -72, -5, -19, -82, -20, 52, 20, 90, -160, -3, -139, 38, -156, -142, -4, 64, -101, 76, -107, 39, 83, -305, -140, 350, -170, 245, -55, -48, -45, -177, -283, 50, 193, -300, -47, -46, 129, 46, -41, -51]
5517e1J66k56K94k15L1K83j27n3j00J65J49k93k34K23r1NQ6k6J24k49J5J75j19
5540i8L04m08Q6L44n5pl19J17K81m39J99j3k3L8N3j1q3L00m76M5J25p9K94j18
5564E7l27J55l08K10P7J10j10K22j57N3m3q3Q7J98m60Q2J53rK02n3J62k85r5R9
5588f3K6J61j36N3q1rj63L74M6j82J44l74J56J53k29K52j02n1n3L4K1L5rk18K89
5613G4q9J69l20Q5nj26K04K7n3j39J95M3l7j66L20k03J1j23K30K23m40K90j99
5636b9L99j61n9k11O5P0k57Q1k47O18j15m58J94L50l48Q2J89j33nM6L6J09m14
5659a98L59j37q8m5J8k4K05J2r3K92k34k17J05O1K9%Jj18K6K16j05k97K18J56
5683A42j76j09J82rJ72k87o0K38n6J89k60k25P4J57J47j02o8LQo4L11k18O2m6
$$ y = [-51, 115, -141, 153, -62, -31, 252, 125, 72, -28, 137, 286, -7, -241, -18, -109, -104, -18, -44, 80, -169, -154, 21, -98, 206, -202, -116, 228, 173, 166, -153, -36, 245, -194, 5, -8, -31, 7, 60, 49, -34, 266, -210, -165, -40, -119, 175, 57, -270, -115, -423, -213, -136, -26, -136, 86, -71, -18, -61, -144, -57, 141, -319, -237, -84, -93, 109, 56, 218, -67, -162, -63, -37, 124, -12, 41, -40, -49, -212, 162, 208, 26, 170, -204, -48, 105, -124, 128, 26, -25, -78, -44, -23, 12, 3, -215, 74, -15, 154, -166, -81, -86, -212, -8, 19, -34, -173, 22, 65, 28, -138, 182, -21, -10, -133, 97, 320, -120, 170, -29, 370, 209, 150, -61, 4, 74, -183, -102, -349, 269, 154, -304, -110, 240, -108, -26, 163, 30, 25, 71, 107, 216, -198, 161, 24, -64, -109, -91, -115, 90, 102, 9, 301, 67, -150, -45, 16, 45, 45, 46, -72, -46, 170, 65, -232, -14, 142, -34, -143, 39, 30, 202, -85, -145, 93, 37, 226, -34, -259, -185, -28, 119, 17, -51, -48, -40, -104, 207, -11, 51, 5]
5707Ek94K82J49k91R6K02j44k20K13j0j87M58l58K19O4k46J68k00K8M7k41J45
5729a15J43J52j8r0M6O0k06m9K2M6K6J87l04O6K4r9K45j11k74L63o2Q3k16o1J13
5754b9J04j94J15n0J15N1L2m07K04K50O8k60J74j98j15P5oJ67k96K01j44j36L22
5777D3j55J18o9J0K18k74R7k64L95j47M8J0J48l3j17j18K43k32M5kj48J05O4Q5
5801G0l7j16J28Rp1J43p1k06Q2l06K66K33k05O7J46j73m2j34K19M3K5ol11K72
5825B5m8K07p0k7k51L41k92l5K68k82j09M48j05n3m7Lj00R2N5P5j11J73M7n55
5849c51N37k86K21N8k37R7r2J76k8j20K7l17K88LN8J8j00k02L42q7j2J55Lk70
5873a19m9j33M73N7q8j33j44J96K11j92j22N9J49k65j10K57J65j43o8jQ0p5k69
$$ y = [5, -289, -7, 142, -149, -53, 149, 5, -215, -2, -12, -199, 259, -99, 120, 184, -62, 106, -94, -66, -19, -260, -115, 28, 180, 162, 72, 118, 178, -28, -77, -55, -9, 17, 204, -100, -34, -10, -109, 136, 25, -249, 114, 52, 135, -81, -142, -29, 75, -119, -4, -54, 61, 112, 144, -263, -59, 191, 259, -1, 173, -25, -140, -65, -71, 96, -200, 1, -143, -279, 43, -112, 6, -63, -53, 165, -109, -12, -276, 119, -28, 20, 30, 178, 145, 28, -90, 153, -79, -34, -36, -184, -79, -15, 70, 33, -83, 45, 54, -17, 126, 55, -151, -69, -375, -109, 124, -81, -14, 132, -41, -83, -217, 2, 45, 70, 64, -247, 25, -23, 184, 114, 87, -164, 177, -115, -150, 118, -164, -273, 175, 70, 17, -30, -27, -127, -35, 20, 95, -16, 157, 204, -351, 186, -100, 121, 179, -58, 39, -53, 123, 95, -25, 2, -315, -27, -24, 34, 52, -48, -250, 92, 5, -7, 148, 151, -119, -168, -301, 172, 229, 141, 8, -136, 60, 271, 79, -43, 16, 165, -100, -210, 47, 212, 69, 1, 0, 80, 5, -264]
5896b64J06K54r9l33K98K0J59j24O9q8j16M50l81J75m07J81J51J01K6j65J88k91
5918i0J01K20l79L4p5K38j27K08o8q7J99k89J24j51J88P4m3j88J76k01m3J35Q2
5941C8k13J44k65N43l56L90o9k79o8k42K57J08m4L0j8J11j10Q3k09K56J0l20M5
5964a78L3K30j94J57j40P0P6j15l8K8j56L14k17M4R8J78k17p5K09o6j71J96J21
5987A87q1K6k81L13j60n1mn5J21k11K05R0j96K66q5N7K3r0j50K07k30M5p6J0j28
6012b48L37j84K43j08Q1j61j30N6J24l9L2J52M5j73k05J23J0Q1k21K31JR8l15
6035a70K05r5q6K67j97J8j6J63k10J2J71J30m02J10J46k38L5K35j02Q3j51L0K0
6058d2m1k3j20P9J22q4K52m17J98Q8K1L8l25L34p7q0P5J78m3k62J89O4K0j42J15
$$ y = [-264, -158, 96, -3, -336, -38, -18, 141, 17, 86, -2, -118, 332, -49, 126, -281, -100, 51, 152, 178, 13, 201, -90, 11, 231, -148, -114, -189, 49, -78, 130, 62, -25, 174, -115, 9, -142, 46, 120, 77, -111, 65, -136, -179, -44, 38, -175, -31, -296, 247, -109, 281, 212, -67, -135, -377, -120, -12, -56, -26, -44, 67, -43, 40, -169, 87, 97, -223, -178, -145, 85, -109, 48, -92, -22, 54, -61, -99, -71, -227, 87, -130, -86, 12, 190, -27, -102, 107, 41, -130, 66, 187, 106, 132, -149, 164, 4, -47, -51, -106, 15, -196, 9, 99, -97, 169, 84, 141, 164, 74, -76, 131, -99, -54, -130, -120, -248, 89, -95, 148, 40, 121, -40, -170, -114, 10, -29, 3, 155, 200, 27, -178, -55, -45, 36, -185, 46, 47, 145, -170, 35, -60, -146, 121, -76, -58, -74, 89, -121, -109, 62, 192, -210, -100, 46, -192, -157, 78, -24, 59, -92, -62, -42, -83, -106, -226, -147, -25, -109, 143, -274, -76, 12, 33, 71, -254, 80, 3, -77, -2, 176, 133, -129, 60, 124, 144, 2, 117]
6083A17Kj02k11R7K7q3Q0J65m5R0p6J36k35O2j76KM1P0j34J76m4J60k06K07O5
6108A85j79MQ1q6p2K65k92Q0R5m7l7N5Q6k64M8L78n10L51r1j48o6J47k76m5K43
6133i5L46k34o1L4m9ON2RJ2J54k87J19R9m3l9k25R5K96k09j35o5L33p9j03J89
6158A20L03l20j0n8k15J74L8k1%N7j62j18K91j53J84k61q0J51j67K87o0K21j82
6181A9K1j24p8L50m6l18J03J05M1j26L74m86O1j43K78j44K32J6K68l84l04M01
6203A16j94K91l02P2pJ8Lp5n1K50j95J79j90j6K13k56K54k93L15k98K47J69l42
6226i2jL26n32O96l59r8J64q0J03k8N8j64k55M60k65j98M50k15J6J26k27J03Q2
6249G0j34J04q5j83K36j28J29O3j15O1j11M16m98NJ72K44l52j32L46q5j92K30
$$ y = [117, 119, 17, -194, -97, -70, -153, -73, 92, 47, 137, 61, 197, -38, 24, -152, -150, -109, -39, -173, 3, -41, 119, -87, 120, 185, 6, 10, 91, 5, -67, 198, -94, -14, 81, 34, -3, 52, 138, -126, -78, 300, -210, 141, 50, -98, -164, -17, -293, -338, -95, 251, 17, -44, -10, -59, -53, -1, 8, 20, 174, -113, 6, 105, 62, 23, -202, -107, 189, -20, -155, -220, 113, 34, -69, 120, 423, 103, 93, 35, -180, -6, 32, 11, 11, 68, -94, -212, 79, -74, 110, -151, -231, -80, -247, 40, -20, 201, 19, 40, -84, -162, 188, 142, -176, -73, 32, 73, -53, 321, -165, -104, -247, 31, -113, 119, 135, 403, 19, -285, 116, -78, 213, -89, -17, -24, -6, -3, -78, -129, 121, -74, 105, -85, -101, 112, -144, 110, -183, 132, -166, 81, 250, -92, -93, 233, -299, 397, 38, -60, 104, 24, 127, 99, 157, -7, -262, 198, -67, -265, 185, -30, -14, 112, -115, -12, 70, -64, 40, -45, -228, 8, -120, 9, 72, -43, 18, -93, 323, -175, -170, 2, 246, -106, -238, 108, 23, -169, 61]
6271F1k58K08r8kJ96j67m6N6J04M3r1m1k01L52l29K86J26l24J87p5J28q0Kj82
6295a45K62j6j78J4m5J76j44L2L0J57l26J05J16M8k73n1L18P4K8l48J65j10K71
6318A60j61j21R3j83J62L0N3j5J97m17K01m3R5lP6j54O2K41l34K64k01j22J01
6341a9J01k42L46j49r3K01j14m5J71k72l7n6K84j49J03j47N7Q5J41j56J6j75J48
6364ak82K48o4J60j47L4k5m6Q0Qn3J92k5M1k51J15M5Q6l13J72j2J6M2kM3o6J01
6391I6j77J66J64J7m26K78J01j98m4J13j71l9M2J36j87K07R0k62k5K77PNj84M
6415a0M9j29J08J07q0q7j02L28o9o1j11%J58k04K09k78L7L85j81NP7JPq6j75n4
6441a56R5O9NR2k43j7K20L1L0o7j25n5L7j00J55J56k08j17J50k1o9J51r1p2K00
$$ y = [61, -197, 11, -87, -89, 107, -60, -106, -50, 54, 97, 6, -35, -236, 116, -213, 73, 199, -125, 62, -13, 115, 35, 37, -145, 117, 101, -77, -63, -108, 68, -76, -44, -14, 143, -183, -78, 38, 86, -187, -238, 80, 154, 182, -166, -1, -111, 160, -1, -122, -29, -212, -50, -20, 33, 18, 215, -202, -1, -44, 51, 48, 124, -30, 32, 273, -61, 203, 2, -120, -19, 82, -160, 186, 37, -56, 145, 31, -14, 157, -115, -152, -208, 76, -73, 30, -117, -60, 25, 166, 10, 26, -149, -1, -283, -35, -99, 61, -86, -52, -77, -123, -43, -35, -88, 104, 79, 120, -131, -16, 29, 115, -198, -26, -38, -22, 20, 18, 61, -5, 96, -81, 85, 249, 266, -160, 118, 219, 21, -23, 90, -81, -120, -78, 58, -129, 78, 168, -94, -119, 158, 165, 170, -14, -10, 39, -90, 18, 125, 45, -42, -144, 184, 115, 54, -57, -57, 101, -103, 106, -172, -135, 250, 69, 74, 151, 152, 159, 73, -102, -156, -61, 8, 13, 105, -138, -155, 65, 96, 126, 59, -66, -121, -84, -184, -29, 127, -81, -198, -48, -69, -138, 13, -78, -150, 50]
6466E0p1k44M48l15pK3j37M03k00l4J07K1k12K60j15K75j21j17P8j34mJ08L85
6489D47m90JJ09j23Kj8Q2O7r9J51k01J67j03J59k51n1J08qk1J22o4j90J40oqK40
6515A62q1k03p8J26J87k87L77l29P2Q7j70L32l01k04L75k17K78o9j09K5K40k67
6537e4J35o9o1Q8J86k08o5o6J74k61R6L51k60J88l30Q9K63l23J22R6k13L79k44
6560A3m0J81k29l0L73k65j65L8J47k95L00nj0m6J87j91q9K23l2k33L6J57j05K30
6584A50Pk57K16N3l08L6L00l46M4r9L70l96K70K18k67o0L49l87k41K21j6r8N6
6607a85L62m54K60j58K46n7j49K45n8j23N5n5K07k0o9j00j25r2N03k66J73k06
6629f6r3J14J39k29O2J11J73l41K70k14q9kJ37J91l21P0J04O5l5q6RK8M3j08J70
$$ y = [50, -21, -265, 183, -132, -139, -116, -253, 150, -50, -84, 23, 44, -168, 92, -23, 252, 131, 14, 92, -42, -46, 62, 447, -43, -42, 67, -56, -54, -72, 10, 77, -22, 129, -72, 95, -8, 151, -100, -151, -43, -51, -72, 50, -14, -204, -64, -70, -78, 162, 81, -122, -200, -74, 113, -174, 203, -126, -54, 33, -137, 195, -106, -310, 65, -152, 126, 57, -52, -27, 213, -54, 81, 12, -49, 39, 225, 17, -48, -114, 60, -201, -105, 246, -14, 174, -156, -67, 196, -127, -5, 91, -122, 257, 13, -27, 154, -75, -105, 268, 3, -162, -124, 23, -272, 28, 23, 13, -33, 154, -37, -126, 97, 65, -168, -132, 25, -80, 150, 157, -100, 116, 169, -139, -103, 197, -149, -105, -204, 166, -230, 40, 258, -9, -69, 280, -107, -348, -127, -143, -241, -185, 177, -277, -17, -175, 71, 14, -135, 110, 52, -71, -16, -71, 136, 116, 47, -53, -178, -270, 233, -33, 140, -66, -159, -45, 94, -135, -73, 38, 211, -130, 140, -74, -163, -165, -28, 163, -158, -88, 16, 81, 46, -40, -31, -3, 40, -68, 102]
6654A02j35Q3o9K85k11j71J50l2L7k29M18k96N7o8J61j53jL5R2l08L31n5L6j76
6678a17K05l8j17J44j33R4j21J4R3j20K31j10j63N0J16k1k30L42m0j2q6mQ7l4
6702C0j18J72Q2j66j01K20J38Rk07q0m9k00L87j15K31l32m2K17N2K3k46K54k27
6725f8R8j7j34J17M4J33j49k7k30L25q0m0j0Q6j02P4o3k6K0k1J25Q2q9k4p3k1
6751g0O7N2j60l7L04M2j89J14k48L0qM14k56m5J24j10m3L1j92J34J00j52p5K30
6775E7k4r0P3r4R8n9R4j13k8J69Q5r5k11K78k6k22JO5j73K56j8m5JP0mm6l9p7
6803a17n9L36N4k85J43l3J68j71mJ75j5j73q6j21J97j26K3J96j8p9N5l34K46l0
6827e8J23k00J03J47k19J35j25R9M4J9j05p0L15N8l20N6j63J08Q2k1Q2k78O3J09
$$ y = [102, -33, 50, -19, 266, 55, -116, 34, 2, 39, -190, 228, -68, -11, -79, 82, -71, -72, -37, 55, -253, 78, 23, 59, -117, 88, 50, -67, 77, -56, 38, -83, -69, 24, -96, 135, 25, -138, -88, 28, 7, -223, 119, 79, 67, -19, -23, 64, 30, -88, 84, 166, 0, -101, 119, 257, 266, 59, -21, -70, -270, 117, 2, 233, -99, -141, 76, 128, 151, -95, 159, -68, 30, 13, -121, -4, 40, 173, 24, -3, -233, 92, 12, -28, -38, 48, -54, 20, -43, -69, -49, -70, 55, 137, 48, 24, -49, -70, -3, 49, -111, -148, 156, 198, 9, 123, -125, -95, -103, 311, 55, 10, 134, 24, -19, 12, -180, -46, 54, -98, -173, 57, 33, -57, 16, -78, 20, -39, 55, -58, -86, 83, 168, 73, -138, 140, 114, -108, -107, -42, -215, 41, 23, -22, -21, 49, 45, -1, -40, -117, -176, 160, 214, -71, 72, 39, 207, 36, 32, 207, 192, 19, -67, -188, 9, -117, -94, 102, 84, 5, 60, -274, -28, -58, 65, -135, -32, 115, -104, 31, -94, 5, 49, 68, -37, -107, 208, 266, -54, 2, -161, -53, 29, 8, 90, -188, -125, -16]
6851a6QJj40L17k16j78J48o8J23J2K6M4K5m3q4K86l61j01K31JK11m55L37j49L0
6876a1j47J17r4J3L8K77k64L1M0J17j96J48J31m7k03k6l5j46O38n80K92j17K8
6899DJ07r0m6qj4R6k37K24N2J47j69r0K38l01J46j64j0J14j17O5J1Q3K14o6m0
6924A49L1k71rK39J5l13L9J00J52k73k9K50p7J10k73J20n5J5J87k31K69k3l02
6947a80K49l0r8K45j85k98J74J68M5l38N25l42J66k60R5J78l20J85n2K1L5N9P2
6970A14j56N6j62K29m6j24O6J54j05j46L16k17l15L44q1r1J45j52L60k32k14L34
6992G7j26K5j16J8K08j77Nn0K56k14Pk10M73j14j5j11R0J30k76k2M6J12j46k1
7016a51L68j22j14J12k01p3J74k1K7j23K02k0j46K51j12o0k26K18l9l1M8n5K93
$$ y = [-16, -8, -7, -147, 170, -46, -224, -76, -144, -21, -9, 17, 61, 86, 43, -41, 245, -116, -217, 14, 15, 226, -229, 108, -41, -11, -158, -41, -135, -122, -84, 193, -71, -40, 0, 117, -79, 69, 200, 153, -50, -76, -111, -257, 381, -199, 93, -24, 4, 111, 21, -25, -33, -47, 49, -188, 36, 88, 235, 66, -24, 214, -87, 59, -105, -115, -1, -118, -53, -42, 41, 255, 189, 149, 180, -91, -100, 139, 154, -159, -120, -20, 132, -141, -170, 80, 3, 113, -160, -40, -95, -80, 107, -124, 145, 122, -180, 69, 39, -59, 186, 1, -297, -123, 45, 90, -248, 277, -65, 101, -159, -64, 114, -206, -21, -73, -52, -17, 42, 114, -42, 14, -148, 81, 35, -89, -23, 131, 26, -120, 196, -21, -336, 8, -73, -164, -19, -171, 189, -43, -257, 77, -49, -24, -140, -122, 86, -91, -86, -136, 120, -94, -87, -297, 176, 62, 47, -64, 26, 156, -120, -142, -96, 16, -130, -151, 217, 95, -19, 93, -108, -181, -7, -28, -1, -124, 78, 58, -88, 163, 51, -9, -235, -17, -56, -87, -39, -94, 199]
7039A99l06L38k35N1r7o0j4M27k35k54K03k70J43R4j53J4K04k46K19K4r7Ol0K39
7063A64k24N5p1J36J02k2j60j38J37J96j48J36j84Q5j62L0j67%K94q5J0L3J57
7086A74k31O3J27N2l05j07M9M75l75j21J17K11n6L8Ko7j13J23o8j72R0N2J79j71
7110c4J51p8j03l8J46l6p7j90L95j86l9q6R0J81o3j26j45K50J85L6l24J90j66
7133f7j8Q5o4KL6J2O5K7M8Q4m04K34l10N17l22J06m5oj87L30n3k61J67K03j56
7158B3P9o3j86J92N1j21r1J86l03K90J16k87R9k8Jk06L52r1P2j66M7o5K04l55
7182b50K86j15j80n6K92l9J13j47JR5MN8j78J7P8N4L9Oj8O0k08J8J32k72N18j75
7208A33j49J20j99Q1j49N2L23k72O7L0m8p1K2K41j12J48j07j64o3J96q9l5N1J38
$$ y = [199, -107, 231, -4, 47, -50, -110, -124, 303, 68, -186, 17, -253, -110, -16, -169, -155, 49, -197, 22, 46, -51, -45, -75, 164, -60, -5, -76, 60, 162, 140, -20, -158, -21, 175, 27, 163, -21, 64, -98, -68, -235, -235, 59, -26, -16, 17, 174, -57, 6, 133, 185, -120, -227, -178, 297, -78, -199, -82, 129, 73, 111, 113, 46, -67, 56, -12, -184, -94, -42, 137, -34, 117, 39, -64, -102, 44, 8, -69, -259, 136, -50, -89, -175, -85, 96, 33, -93, -238, 12, 197, 233, -91, 99, -67, -85, 0, -64, -62, -26, -14, 51, 78, 126, 210, -194, 40, -270, 247, -75, 31, -14, -20, -207, 123, 70, -191, -24, 179, 23, 102, 39, -147, 45, 96, -25, -116, 70, -233, 57, 173, -114, -15, -43, -42, -248, 104, 13, 85, -81, -34, -99, 105, -250, 36, -79, -259, -315, -23, -62, 51, -96, -95, 0, 4, 62, -116, -99, -21, 33, 72, 78, 60, 120, -88, -70, 62, -210, 308, 133, -16, 104, -95, -14, -163, -111, 212, -60, 7, 37, -11, -82, -60, 181, 69, 217, 110, -54, -117, 79, -10, -45, 6, 144]
7232A44k54J64p6j19K41J25k65p6r1P7L66l81K18j15o8K61lk69K37j9J5m3j35
7255f6Q0K22k69j14Q7R9j85N5J17p6r5K56j19O2j81L1O8J29m0k15J71j45J87j35
7279g6J87n2nk26l7L54j93J2q7J82j19j9l4k49J41K09j04k08L24j48jL3pR0K3
7304a0o9K00k43p9J47J14j23j4l6J83m3l2J9J13k28J83R2k75p2J95j44L79l72
7327a15K66M1m0j97J37r5n8k7J33n9l6J5n6M11p7l20l1O4J6j01O8M3k09L8L5Q0
7353g4J37K64l38J29r1L02k95k2L9J06l9k51L87k96j42K07q4J82j04j29Q9o8Q4
7376gJ31l9R7j95l1L8j24J51j36K75Ln5k14J17j70n8L87Kl12K20j31J2Q6L3L5
7401A15j25Q3o3m0k29L22J66k73j90L62j93R2o3N8r4q0O7J43j51k0r5K05q3N6
$$ y = [144, -110, 54, -22, -141, 100, 225, -40, -116, -207, -130, 236, -145, 73, -42, -110, 151, 148, -121, 116, 97, 112, 69, -66, 14, 236, -33, -147, -60, 39, -146, -91, 26, -50, -145, 111, -8, 54, -127, -96, -28, 101, 61, -154, 17, -128, 59, -76, 111, 59, 54, -172, -209, 145, -48, -36, -123, 59, -60, -79, -113, -362, -221, -12, -116, -324, 0, -148, -149, -116, -123, -33, -10, -79, 121, -122, -201, -54, 60, -63, -77, -113, 70, 27, -5, 14, 127, -101, 82, 174, -101, -173, 22, -122, 257, -115, 151, 192, 152, -45, 92, -3, -61, -88, 45, -14, -50, -35, -91, 320, 243, -77, -108, -44, -28, -129, -61, -18, -227, -189, -154, -74, 63, 327, -11, 118, 27, 329, 34, 12, 51, 157, 118, -133, 254, -42, -184, 23, -61, 121, 17, -112, -23, -91, -7, 124, 85, 182, -13, -44, -6, -130, 21, -115, 160, 163, 108, -106, 11, -159, -217, 170, 172, -140, 80, -51, -39, 47, 80, 115, -10, 73, 10, -30, -259, 63, 229, -44, -234, 128, -65, 27, -36, 22, -72, -152, -85, 58, -93, -113, -208, -3, -86, -30]
7425c0K02j79J08k53K91n2k7L7K1j92M6l7Q9rl6L02l4n65L74M9Qj0j50L6j2m8
7451g1L9K20j33R2j38j1N1O4k73J59J56l13K28o5q6n6K25j19q2J49k70j14K86
7474f2j45J08Q0N7J0l1K73l63K06m30L27l13M87k26P2J0P7k43p6J23O7j04r3L14
7498A25M5j23j26J29j43J97n2J85m44P9J59k38M36m07J46N7J81j24J00j18k53
7519a89L20k26o8M8K49q4m0n3l0j79K55P5L1k16J0J18j4j6k29J45J98j8j54P3
7543Fp2pJ77q8J86l35Q7L01j1j92K4l01K64k7k04J94p9k3k15L40j66L8K15n7j28
7568g3K69j52k31K94M8n49L92J90k88M0Q4j92J55J92k88J7M4R0J06j74j01K58
7590A31k32J55j23OM0P3J29k29K57j22l14K45P4l01J86l8L18r9j6k28J27j26P4
$$ y = [-30, 172, -7, 101, -152, 139, 87, 60, 97, 118, -74, -28, -65, 24, 15, -21, 281, 247, -318, 56, 105, 113, 103, -47, -11, -23, -71, -32, 188, 55, 147, 9, -2, 49, 113, -160, -1, 155, -158, 70, 5, -81, -137, 88, -31, -113, 36, -234, -348, -62, -207, -99, -19, 38, 48, 17, 290, -73, 133, -297, 30, -283, 204, -22, 50, 60, 137, -106, -182, -59, 8, -96, -189, 125, 170, 47, -79, 50, -93, 104, 52, 237, -207, -128, 31, -207, 229, -178, -32, 25, 206, 82, 182, 64, -189, 131, -95, -163, -115, 134, 50, 10, -43, -73, -252, 3, 78, 109, -107, -97, 21, 7, -9, -238, -93, 105, 87, -67, 6, -66, -73, 104, 16, 202, -133, -46, 255, 244, 52, 76, -225, 39, 12, -192, 2, -77, -100, -315, 25, -141, -103, 112, 55, -73, 196, 44, -187, 107, 155, -394, -2, 188, -100, -60, 24, -168, -13, 179, -109, -92, -48, 42, 148, -26, -127, 131, -101, 54, -69, -63, -23, 50, 179, -50, 207, 85, -229, 16, 90, -211, -25, -63, 255, 156, 140, -88, 39, -87, -13]
7613a3k0n5O2j63J17K63k62K01o2mO9k05J73k45J54p7j47L23k80K6J15K64r0p1
7637G3N4j72M0nJ23j73N3n8J58l8M7j58L1mOR0k04J11o9O1K95k70l26M13k80m2
7663b44N6o4K19m0L38k31O6m9N3q3j10K14j1l7j3p6p9K63J71l33K30m34J06K7
7687f1Q4k63K9J06L12j94n7mJ03l7m5J51j94L25l72P2L2k94K77J8j05L7K63j89
7711fK48n05J47J87J38O8j79k01J96p0m5n5K54k61q0K49L0j95J14J01k24N3m6
7734h2R5k1%J8m0N8j1j5M4J24k62J52j32J04Q8j27N5j32J46l55L59j73J32J58
7758A83p7N8j19j1j14K37l50J99j19K83r1k71K37k7k9RO0j04J90j11l1m4K27k43
7782e8J11J70k13M3n4L0J27l3k48J69J24k08J59k76K57K29k46l5J48k59Q4j3R
$$ y = [-13, -33, -88, -26, -189, -72, 191, -71, 130, 68, 64, 133, -72, 101, -144, 10, -67, -214, 109, -171, -145, -30, 234, 144, 73, 127, -45, -5, -10, 113, -60, -7, -65, 93, 55, 102, -56, -25, -29, -23, 67, -137, -26, -95, -34, 261, -9, -335, 78, -202, -244, -188, -252, -33, -73, 265, 34, 100, 51, 104, 21, -89, 125, 114, 77, 64, -12, -91, 172, 343, 10, 240, -194, -88, -61, 23, -240, -211, -105, 207, 13, -44, -48, 55, 18, -27, 124, -70, 255, -117, -45, -13, -307, -30, -12, -117, -80, 183, -6, 242, -263, -116, 71, 209, 277, 98, -103, 93, 23, -22, -77, 177, -84, -164, 85, 115, -80, 34, 135, -89, -36, -82, 13, -8, -8, 10, -30, 28, 17, 2, 46, 170, -92, 60, -72, 32, 120, -7, 48, -84, 62, -293, 66, -107, 25, 183, 106, 164, 45, 34, -80, 157, -193, 6, -113, 170, 79, -192, 45, 18, -11, -2, 58, -46, 144, 33, 2, -42, 185, -58, 53, 223, 10, 53, -1, 29, 156, 123, -125, 44, 168, -40, 119, -157, 100, 329, 83, 48, 196, -63, 21, 8, 17]
7805A7o8Q3J6q3J64L4j8n8L0p6j14j1k5K21Q8l18n1K78n5l6j04K0K32n3n6o6K03
7832A94m44J97rJ03l4L27n26K05r6k2J70QK1Q0k48m7J64k42M77r5j59j83K41J23
7856B05J57k37m99J17J90m8N4J38l22J82J41L5k43J2L16l05J05j10R9J52k49J62
7878E2j99P7p7J26j1n2K8k8N7Pj4k7k7J33J54j16p6K7l24K45J68l91M52q4n8j25
7904h3N4K4J43j08m5Jjk3kN6j10L2K57j05L7l31J82N9K0O3k40j3j63J67L04j31
7930D4j96J06M0J63j53L98o71M32Rk71l5P4J32k68K38r0J40q7JJ43j53k27j3P0
7954a74L33k30M7J1l7j73P7K12n4k27K06J55L6j11J5k09q8J76q8K11P6j25j34
7977i5O9m8J56P2k8j23J07j81O1o2m0K21j09KJK99l60N9l5p4J6Q0q0%k39M18j31
$$ y = [17, -51, 32, 48, -35, 129, 163, 145, 87, 117, 41, -73, -84, -109, 112, 200, -118, -169, 109, 54, 18, -86, -66, 166, 113, 57, -9, 194, -250, -53, -62, 41, 7, 334, -192, 13, -83, -105, 65, 73, 94, 174, -74, -121, 43, -199, 278, 183, 24, -159, 82, 205, 362, 125, -374, -257, -67, -115, -61, 77, -245, -63, 78, 113, -130, -118, 198, -107, -2, -112, -13, 139, -110, 52, -147, -70, -147, -21, -32, -84, -56, -84, -27, -20, -34, -61, -88, 45, 199, 83, 7, 34, -290, -45, 123, -268, 184, 100, 42, -83, -29, -5, 138, 30, -15, -14, -15, -38, -40, 16, -94, -62, 195, 90, 127, -204, -22, 37, 57, 120, -120, -133, -296, -129, 175, 44, -152, -46, -6, 157, 4, 402, -269, 163, 172, -99, -134, -60, 72, -196, 42, -48, 92, 5, 6, 149, -4, -231, -244, -174, 159, -71, -24, -13, -50, -223, -146, 66, 12, -215, -9, 146, 182, 71, 86, -123, -211, -35, -123, 88, 164, 39, -95, -26, -74, 82, 154, 126, 3, 110, -71, -10, -72, -112, 109, 0, 2, 3, 302, -58, 1, -34, -108, -92, -12, -92, -92, -331, 87, -44]
8004d4K82m51J46J6j67n8J06J40k4j37K87j06J7j02P2j22L59l77n3N4K72k20J43
8027C3q7oJ54l03L24k59L89k11J07l07J98k56J39m8J88n6j22J68l07K89m4l74
8049c91N56k64J28j20P9K08m09J07R7J07k63K58m0k0j15n1N9J78m46L21k39K43
8071a7Q9q4r1nJ11j29K25r8K7k15K08m7J70k64R1J15k14J27j19R8j28p0K08m4
8095e6J05P4J17l01j19L13k10O6J40k76K06J13l99L61j61J3k4j9J11j58L02o6
8117A32k77K71n5k62J92k08L43R6k27q5J3L6l7n2J88l13K28L6k0k45M58j34q4
8140fj85J76Jj01oJ69o5K08k29K45l95K66m2k5k36L91n8j6P3k82j83K51O1L7m2
8165Gj24J07O1j44J70j2l95K64R4J44j83q0qJ9j20K71L6j14K38m04K83p4m3L27
$$ y = [-44, 238, -213, -67, -51, -218, -276, -170, -30, -54, -191, 96, -10, 7, -95, -23, -145, 214, -163, -216, -162, 110, -110, 33, -54, -60, 94, -209, 115, -144, 245, 34, 141, -166, 32, -224, -85, -133, 55, -1, -123, 45, -262, 27, -17, -391, 165, -99, 29, -91, -12, 196, -213, -106, -9, 98, -165, 93, 53, 33, -82, -133, -74, 104, -342, -21, -260, -17, 72, -12, -103, -108, 3, -126, 99, 1, 28, -187, 21, -26, 144, -120, -29, 86, -128, -1, -120, -22, -150, -220, -12, -56, 49, 123, 240, -61, -180, 133, -77, -11, 129, -147, 59, 172, -227, 134, -27, -14, -38, -57, 54, -104, 198, 132, -145, 126, 71, -191, 1, -207, 136, 232, 5, -80, -67, -31, -68, -120, 68, -245, -17, 19, -1, -246, 212, 78, -6, -191, -15, -14, -115, -121, 48, -17, 191, -38, 207, -188, 78, 36, 11, -225, 166, 108, 92, 165, -117, -300, -49, 12, 49, 7, -117, -10, 51, -93, 77, 65, -330, -66, 28, 172, -11, -91, -99, -80, -200, 71, 107, -7, 231, -173, 110, 36, -7, 320]
8189C20l85p1
$$ y = [320, -65, -136]
8191a36
$$ Imaginary data points
##PAGE= N=2
##DATA TABLE= (X++(I..I)), XYDATA
0@%%%%%%%%%%%%%%%oJ4j6J6j6J6k4L2l2M0m8N6o6P4q8J02j15J30j47J66j85K07
37A10k33K60k90L24l59L99m42M86n37N93o56P23p96Q76r64J064j173J295j435
56g55J596j779J990k240K544k917L384l998M839o067Q038j1701K0737q3496j43213
71b13038J15938N0607L0901J18588O2143p4094n5146p9953j09644J1201J02512
82c9985N0398O9201P5528m3563r9320o0727q0708k5908J08984R5773J7579M9275
94A16527J2970j08670j00834l0590j6493N7709J21495M8517n251O816p1064j21809
106i0677k6667L1576K3712Q2688R1483p167l7108l2726r6353p6001M1299O7113
118b8828M7585P4704K8208o0252n8682n2352o7503J1236Q6912N1873L8323M7803
$$ y = [0, 0, 0, 0, 0, 0, 0, 0, 0, 0, 0, 0, 0, 0, 0, 0, -6, 8, -8, 8, -8, 8, -16, 16, -16, 24, -24, 32, -34, 40, -48, 54, -61, 69, -78, 88, -97, 110, -123, 137, -153, 171, -188, 211, -231, 255, -282, 311, -345, 378, -418, 458, -506, 558, -615, 680, -755, 841, -938, 1052, -1188, 1356, -1561, 1823, -2175, 2664, -3403, 4635, -7066, 13671, -69825, -213038, -97100, -46493, -15592, 102996, 165139, 91045, 35899, -44054, -153698, -142497, -39985, 10413, 79614, 155142, 111579, 12259, -48468, -129176, -155084, -46100, 49673, 67252, 116527, 129497, 20827, -80007, -110597, -127090, -69381, 52114, 100631, 95380, 102196, 31132, -90677, -117344, -85768, -62056, 20632, 112115, 104948, 67840, 35114, -61239, -137240, -95941, -28828, 18757, 93461, 121669, 61417, 2735, -49617, -117120, -105884, -18972, 32901, 71224, 119027]
130A19027l9384j00425m4608k0096j6428O3536R3342K4633K872m824p5702q1779
142g9836r778J3404L1753Q5504N9155j7944k9413m5920q0948k9327M2439L8358
154b2553M6846O5523M369n4518m4513n0514m6094K8446O6545L9969L9832K1585
166I4923n1128o7291l0654k6642K426O6891O0166J8689J2175k5179p7559m8144
178g1327K96Q280M2310P1917K6771j5418k0585n2347o2590n397L0488L1691N4392
191C8481M5612j5897m1675l7946n0407k2027L7407M6581L3483L8546K119n0664
203B3613m8364k9456k1021K1729N8714L9725J7756M180l7431n9916k9228l286
215f2985J3482M8767N2169J2640r724k5311n4079m2074M652K5526L4915M8571
$$ y = [119027, 79643, -20782, -65390, -85486, -101914, -38378, 54964, 79597, 82469, 77645, 1943, -79836, -89614, -76210, -44457, 41047, 100202, 82258, 52845, 6925, -74023, -103350, -60911, -22553, 24293, 89816, 94185, 39667, -4846, -55360, -101454, -73008, -6463, 33506, 73338, 94923, 43795, -23496, -54150, -80792, -78366, -11475, 48691, 67380, 79555, 54376, -23183, -71327, -71031, -62751, -20441, 51476, 78247, 62829, 42244, -10103, -72693, -78090, -47602, -15911, 38481, 84093, 68196, 26521, -11425, -61832, -83859, -46452, 129, 33612, 72158, 74277, 23613, -24751, -54207, -75228, -53499, 5215, 44940, 62696, 66876, 29445, -30471, -59699, -62985, -49503, -736, 51433, 64073, 54349, 29038, -25041, -67115, -62463, -36937, -2022, 46549]
227D6549K4104k0214l3057l8457m1086n244L4864L8312L5554K6119j3758m2962
239A0724l6683k8640j0857L0902M7888K9356J6488n713m1765m5429j9699l095
251e6523J9981M8239L8345N886j1392l0074m7064k6157P649K2869L6744M0231
263D8734J0847k0287l1278l7094k8712M682L0308L4980L2856J4238k0309l6145
275B820l2552k3484K61L1583L8336K6579J0825j4738l8314l5027j6959K509K6436
288b1725M0332K7336N058j5254l4195l6204j6516O718K5798L6680K8010L679j8039
301C1678l1550l4217j6931R042K6863L3366K7138L669k0419l1571l0148j6821
313d9901Q829K8838L2824K2409L991j9485l3041k8694j2711Q042K7556L3540K1329
$$ y = [46549, 70653, 50439, 17382, -21075, -62161, -67405, -32541, 5771, 41325, 67444, 53686, 10724, -25959, -54599, -65456, -34554, 13334, 42690, 59178, 53465, 11700, -33729, -53428, -56523, -36542, 11697, 50042, 55928, 44536, 14462, -32602, -58759, -51110, -28241, 8503, 48734, 59581, 39294, 8016, -29078, -57790, -53108, -22800, 12180, 45036, 59274, 38965, 2820, -29732, -53216, -52955, -21372, 16964, 43543, 54368, 39630, 1316, -33711, -50670, -48161, -21725, 18607, 45943, 51001, 35747, 1552, -34652, -51168, -44450, -18652, 18028, 46038, 49717, 31678, 128, -34089, -51020, -41978, -15115, 18251, 45389, 49058, 28639, -2932, -33080, -49901, -41072, -12234, 20590, 42999, 46990, 27505, -5536, -34230, -46941, -38899, -11343, 22197, 43526]
326D3526N52j8764l1318k9322j0961J0935K6015L0798K1814lk1039l0154k5706
339c3627j1480J0546K7987K9633J8307K4k0438l0913k4652q113J0615K6484K9978
352B4351J6512k530j8998k9229k5722n998J2975K4130K8098J7976m551k1397k6856
365a1239k3089p024J4756K5201K4953J6431l545k2782k6691k0216o844J3724K7873
378A508K3542J2104k499k1434k8768j7818l211J1572K6186K5319J0010m943j8639
391A2929k8480k0078J008J3522K2192K5662J0877r149j8861k3673k0686j051J7781
404a8007K1583K1185J2841q737k2951k1652j6313l184J7609K4659J7662R450m817
417B9328k3478k4663j2537r63J4285K6021J9381M826o306j9909k6026j2732L906
$$ y = [43526, 44078, 25314, -6004, -35326, -46287, -35352, -9337, 21461, 43275, 43272, 22233, -7921, -33627, -45107, -34561, -6574, 23059, 41366, 41390, 20952, -9961, -34613, -42726, -32111, -5627, 24351, 40863, 38333, 19335, -9894, -35616, -41614, -28639, -4509, 23589, 41565, 37014, 15617, -11239, -34328, -41352, -26596, -1395, 23558, 39989, 36444, 13662, -13029, -33245, -40089, -26365, 1508, 25050, 37154, 34655, 13221, -15547, -33365, -36576, -25004, 1182, 26501, 36511, 31568, 12929, -15551, -35629, -34621, -21099, 1093, 26755, 37632, 28483, 9622, -14051, -34737, -35788, -18007, 3576, 24761, 37602, 28865, 5914, -15738, -32051, -35235, -17626, 7033, 24695, 34145, 29328, 5850, -18813, -31350, -32313, -18028, 7993, 27374, 32200, 25894, 5985, -20041, -32773, -28867]
430b8867J2845K2400K1697M871j0649j7805k2779j5493N179J6694J8759J9298
442B6150P698j2553k0732j8228j3838J829J9128K0598J5189O938j0003k3761j8720
455b0305q329J003J6123K3696J4050K428p458k1777k1919o257N001J2820K1676
468A0752J7662L63j1085j8077k1242r123Q549J4424J7455J7930J977j4967j7674
481c056j6637j0189O710J8800J6233J3114M178j4233k1152j3807o487L304J8108
494e114J9866R986J696j0653k1854j6720l213N691J4693K0740J1151k111j1115
507A3043j8590j7934k808R101J3086J7824J3627l468j4302j5183j5282o308R773
520a7421J6519J4255J1518J09j5950j7794j1556n166P180J8442J6339P158j090
$$ y = [-28867, -16022, 6378, 28075, 32946, 22297, 4492, -18287, -33780, -28601, -11907, 6852, 26150, 33848, 21295, 563, -17665, -31503, -29674, -10546, 10052, 25241, 32179, 22176, -1585, -20305, -28634, -27631, -11508, 12188, 26238, 28666, 21208, -569, -22488, -28745, -23744, -10924, 10752, 28414, 28777, 17692, -385, -21627, -30750, -22201, -7777, 9678, 27608, 29585, 14618, -3056, -19693, -29882, -23172, -4372, 11861, 24975, 29153, 14920, -6232, -20039, -26526, -23222, -5114, 14752, 24738, 26434, 15781, -6073, -22793, -26006, -20315, -5622, 15118, 26269, 24158, 13043, -5547, -23481, -26289, -17188, -4102, 13722, 27349, 23881, 9579, -5604, -20886, -27194, -17421, -902, 13353, 24871, 24980, 9030, -8764, -20320, -25486, -18306, 136, 16475, 23633, 22543]
533B2543j2681j9730j2051q98O572J5943J7607O694m176j1059j7892j3434j37
546b2699R391J2756J6682R155o261j3168j4268j3124k780J1667J5213J2728Q416
559B3708l633j5853j4724r313l139R644J7722J2055N056k675j3757j7008q481
572b0398K03P424J6179J4401L195l858j2005j7144r564K491Q171J3845J5714L548
586B2202p801j0781j3964j1955K289J2482J1570J2233O216p893j4020j1203r184
599a9809p01J2773J4407Q969M649m663j5025j3454n729j2J0207J5813R439J886
613A8750m836j3199j4607m865K520Q163J5135J1429m92o443j0272j4204p616M854
627a5683J0178J1914J1081J840r009j1197j1114p737L148J2474J1946Q357K491
$$ y = [22543, 9862, -9868, -21919, -22817, -16245, -302, 17305, 23999, 19823, 8764, -9128, -22562, -22699, -13308, -552, 16130, 25285, 19024, 5856, -8412, -21536, -24316, -12649, 2564, 15292, 23708, 20075, 4222, -10502, -19815, -22954, -13310, 4412, 16467, 21523, 18848, 5091, -11917, -20398, -20195, -12771, 3408, 17809, 21004, 17146, 5141, -12003, -21567, -19076, -10905, 2940, 18654, 22202, 14401, 3620, -10344, -22299, -20010, -7528, 4042, 16275, 22491, 14598, 578, -10625, -19809, -20510, -7737, 6670, 15639, 20288, 15625, 600, -12854, -18583, -18595, -8388, 7425, 16864, 18750, 13914, 715, -13892, -18757, -16237, -8074, 7061, 18490, 17998, 11555, 1283, -12921, -20537, -15683, -5505, 6409, 17490, 19330, 10321, -876, -11990, -19727, -16579, -4105, 7841, 16198, 18689]
640A8689q128j3496r568n155J588J2038J3423O507N88n785j3343j1146l229L005
654a4012R584J3810Q017j759o753j0942j2187l714N551R259J1688R267j932r098
668F779r607j0147n128N750J1323R390P519M54r736j1143q089m511M283J2416
682d47J0805M506K87p768j3205p760j702L549J0716J2245M154k294o495j1662
696e071r241o68N451Q639J1361N896l846p764r227r834j542P336Q743R460O105
711A5798k642r386r123p772k516P195J0328P696M845j455r924r984n422j792N023
726i131J1205R147K571k223p672j1219o207N10N320R575R484K820l617p614r808
741f859o706P49O468Q651Q629L419m355q387q571o262N67O880Q786P231L469l617
$$ y = [18689, 10561, -2935, -12503, -17658, -16070, -4032, 9391, 15898, 16486, 10701, -2642, -13788, -17017, -14012, -4428, 9382, 17399, 15640, 8887, -2055, -14242, -17956, -12405, -3146, 8542, 17809, 15877, 6779, -2828, -12975, -18103, -12353, -1030, 8360, 15879, 16333, 6597, -4546, -12635, -17146, -12863, -447, 10358, 14864, 15151, 7383, -5822, -13582, -15284, -11735, -1019, 11226, 15380, 13086, 6591, -5071, -14312, -14980, -9529, -890, 10471, 16367, 12521, 4757, -4470, -14304, -15846, -8510, 233, 9693, 15798, 13156, 3770, -5353, -13125, -15641, -8446, 1882, 9578, 14423, 12968, 3044, -6940, -12362, -14154, -9131, 2074, 11221, 13792, 11569, 3897, -7322, -13529, -13019, -7699, 1876, 11360, 14180, 10563, 2949, -6859, -13565, -12816, -6348, 2303, 10932, 14351, 9996, 1609, -6962, -13224, -12657, -5777, 3009, 10240, 13709, 10092]
757A0092r117q539m671k16O520R957O617K054l589p888r567m279J363N891R115
772C743P425J369m464p242q930m761J972O592Q327O921J585m758p820p666m667
787a2374J784P164P692O539J591n079q462o873l882J547P231Q618N030R68m559
802F935q198p252k834K000O416Q370N327J47m507p672p502k868L049O497P722
817E630N201m51m539p781o581k867L030O609P546M720l89m750p495o381k732L252
833g978O739P273M327m02n594o879o198k033L127O667P015M081o82n293o984n860
849h674j676L148O818O769L273l79n430p286n007j159K586O538P101L336j421
864H537m931p256n262o30L376O078O794L284j944n020o813m770j086M061O210
$$ y = [10092, 975, -7564, -12235, -12451, -5931, 4026, 10643, 12697, 9108, 1220, -8347, -12626, -11263, -5372, 3743, 11168, 12537, 8073, 831, -8099, -12860, -10888, -4296, 4031, 10952, 12537, 7779, -41, -7707, -12374, -10590, -3426, 4266, 10805, 12396, 7317, -1145, -8018, -11900, -10353, -3122, 5496, 10526, 11494, 6935, -1263, -8515, -11349, -9349, -2933, 5437, 10764, 10911, 6404, -1268, -8770, -11638, -8589, -2092, 5630, 10831, 10380, 5841, -1940, -8521, -11388, -8358, -1749, 5797, 10517, 10128, 5378, -2117, -8498, -11230, -7978, -1239, 6034, 10361, 9959, 4365, -2514, -8712, -10745, -7618, -951, 6064, 10145, 9463, 4170, -2814, -8674, -10350, -7202, -384, 6385, 9658, 9279, 3849, -3437, -8444, -9603, -7017, -479, 6622, 9958, 8537, 3606, -3650, -8912, -9542, -6166, -88, 6706, 9990, 8046, 3026, -3787, -8557, -9643, -5582, 628]
879F28O041L124j778n916o162m286q42L961O213N519K779j582n622o636l688m12
895h659L730O474N440J615j198n533o667l734M97L565N945N812J849k441n120
910A575o272m197J003L993N702N330K066l221n197n147l983O1M961N592M285J979
926H530k244o051n263k766j28M732O123L708J314j607n990o096j952P59L248O884
942C201M451k44k427m560n813k686J702L687N045N111L29l251m452n039l558K098
958f406M793M292L963J345l626n708l512k831R47N004N422K643R27k664n941m343
974e695j072P42M158N835K841o35k048m819n489j092K566K962N163L902q49l686
990B784l571m744k206L001M257L683L621K48m525m068l294k098J442N880L603
$$ y = [628, 6669, 9793, 8015, 2099, -4063, -8349, -9191, -5230, 983, 6502, 9281, 7699, 2077, -4559, -8247, -8659, -4929, 1545, 6985, 8600, 7402, 1869, -4798, -8532, -8035, -4470, 1475, 7287, 9136, 6695, 1575, -4697, -8894, -7891, -3898, 1804, 7134, 9200, 5979, 782, -4365, -8348, -8287, -3326, 2266, 6551, 8530, 6286, 235, -5028, -7794, -7922, -3190, 2933, 6641, 7955, 6348, 358, -5738, -7690, -6931, -3683, 3201, 7652, 7408, 4981, 421, -5392, -8078, -6376, -2689, 2356, 7467, 7796, 4545, 93, -4946, -8504, -6406, -1613, 2679, 6642, 7987, 4361, -1347, -4859, -7690, -6743, -1739, 3683, 6326, 7253, 4589, -1352, -5695, -6767, -6025, -1867, 3968, 6809, 6174, 4126, -693, -6182, -7274, -4708, -1746, 3417, 7319, 6470, 2784, -787, -5531, -7737, -4736, -479, 3204, 6825, 7073, 2548, -1520, -4814, -6912, -5470, 410, 4013]
1005D013J772R36l305n977k963o72J064M949M785J572m54k714n432l673M26J604
1021d069L183N398K545k152k623l883m638m99L393L474L698L023j446m101l182
1036a879l546j437L737L945K796K495q9m904m343j839q38J973M992L506Q00k17
1052E152l370m827k608K54J898M152M566L75j528k339m496l772J218L016K911
1067F02L929J788k141l644k934k846n62L503L551K752J485j325l867l322k338
1082e369j0L057M643K040O83q19l597m350j862R94K265M009L195J26j492k843
1098F70m115k193J486K458L184L054O34k279l120k798k303P78L351L223K001J312
1114E343j988m033k742j554QM044L390J693N59j744l498l269j004R30K222M026
$$ y = [4013, 5785, 6721, 3416, -2561, -5524, -6196, -5132, -183, 4602, 6174, 5720, 3006, -2426, -6099, -5673, -4069, -886, 4512, 7057, 4905, 2282, -1601, -6239, -6738, -3345, 129, 3827, 6850, 5404, 1303, -1879, -5425, -6862, -3125, 820, 3616, 6111, 6022, 1118, -3225, -5064, -5902, -3929, 1063, 4569, 5369, 5152, 1782, -3045, -5653, -5399, -3501, 651, 5217, 5592, 4064, 1725, -2771, -6543, -5325, -2309, 602, 4531, 6319, 4178, 534, -2400, -5246, -5808, -2305, 1246, 3998, 5483, 4158, 291, -3031, -5369, -5379, -2322, 2321, 4361, 5044, 4225, 628, -3722, -5584, -4590, -2325, 1684, 4879, 5005, 3513, 670, -3445, -5638, -4152, -1694, 1490, 4544, 5178, 2899, -221, -3019, -5322, -4544, -1193, 2030, 4031, 5343, 3355, -678, -3420, -4974, -4966, -922, 2468, 4161, 4720, 2976, -522, -3791, -4795, -3865, -1643, 2383]
1130B383K159l34j499l139l659j269K022K377K928K792k54k275k796l206j330
1145e100J935K664K704K304P8k578l426j902j398J012L546K987J155J97j914l670
1161a406k574m97R99L062L338J256l57j945l179l077k08J953K456K822K063q97
1177C809k426k698k618n26J866K911K284J864n87k628l037j870m99J563L136K291
1193B835R69k43k231l359j877J11J220K832L323M85q64j693l271k083K34J641
1209a971K328L094Q51j542j906k807k038Q2K219K336J888J733j248k691k265j545
1225c482m29J998L316J519P52q58k470k431j492R7J474L306J802K77q33k183k913
1242b550r17M24J206K514K516K25j095j878k595j746O60K115K103J799P42j025
$$ y = [2383, 4542, 4208, 2709, -430, -4089, -5358, -3336, -959, 1969, 4761, 4507, 2232, -564, -3770, -5100, -3165, -501, 2203, 4507, 4585, 2007, -1419, -3321, -4719, -3707, -161, 2826, 3981, 4178, 2264, -1406, -3980, -4477, -3478, -416, 2922, 4178, 3821, 1876, -1303, -4380, -4588, -2635, -179, 2643, 4706, 3809, 1383, -1315, -3933, -4459, -2593, 318, 2602, 4466, 3879, 1251, -1786, -3656, -4155, -2592, 544, 2835, 3804, 3561, 1330, -2029, -3906, -3795, -2575, 257, 3580, 4065, 3201, 1508, -1763, -3846, -3612, -1971, 357, 3451, 4302, 2760, 854, -1953, -3991, -3909, -1690, 646, 2534, 4267, 3019, 328, -1937, -3482, -3911, -1913, 1403, 2922, 3674, 2816, 346, -2085, -3577, -3480, -2006, 1300, 3102, 3379, 2546, 363, -2550, -3467, -3043, -1837, 677, 3193, 3418, 2323, 445, -2150, -3896, -3236, -1121, 982, 2781, 3523, 2498]
1258B498k497k461j160L64K331K009K136K96j354k256k198j130O17J794K443J546
1274B978L23j158k462k252p76O25J508K530J708K09j583j906k095r01N15K082
1290f55J889J718J36j482k094j886q64N10K091K213J367L21j645k248j680o32
1306b941N05J910K375J014l57r59k416j670m75J123J360K028J578k16j681j975
1322g97j845m46J307J491K132J249n03j302k135j480n79Q22J896K166J029n53
1338B452j488j964j386n10J080K006J659R67m16j253k260j595J60R08J531J838
1354A729R84m07j628j790j434N0R04J843J672O79l14j670j873j183k00J141J842
1371C45J844K92l44j503j894j374j1J241J811J457J005q20j798j392j384Q5J416
$$ y = [2498, 1, -2460, -3620, -3256, -925, 1084, 3220, 3516, 2162, -94, -2292, -3422, -2805, -1011, 1432, 2978, 3301, 2143, -319, -2571, -3347, -2722, -1214, 1316, 3024, 3233, 1650, -256, -2351, -3252, -2737, -655, 1234, 2952, 3088, 1606, -488, -2374, -3238, -2728, -637, 1576, 2943, 3264, 1619, -629, -2309, -2941, -2436, -526, 1849, 2863, 2506, 1547, -869, -2539, -3014, -1891, -531, 1497, 3075, 2859, 1178, -797, -2642, -3088, -1781, -290, 1842, 3091, 2588, 1286, -849, -2329, -2908, -2086, -190, 1976, 3005, 2452, 964, -1000, -2386, -2896, -1816, 190, 1849, 2816, 2400, 1147, -1113, -2708, -2548, -1640, -109, 1729, 2713, 2306, 678, -1112, -2546, -2496, -1592, 251, 1923, 2602, 2288, 618, -1255, -2438, -2638, -1497, 345, 2189, 2481, 2137, 634, -1260, -2634, -2645, -1404, 407, 1864, 2869, 2049, 251, -1141, -2525, -2440, -1024]
1388a024J645J464M45r34j224j648j136J32J210J678J370O79q10j518j643j429
1404b743N13J370J652J142O53j016j385j536j271M52J357J360J703J01p66j593
1420gj354j126M04J306J404J418K33q32j632j377p62M20J287J503J235J41p60
1437A501j564j839j32L1J283J678J081L3p63j392j821l93N36J202J359J435l20
1454A915p94j534j082p90N90J355J372R67K39j180j621j026o31P48J564Q11Q86
1471A789K07o43k167r26r8K96J595J315N38k28o51j392j297m55Q45R61J369J145
1489B203n41p80j407j266k54P57J246J189Q27q6j288j219j165m8O54J459R87O45
1507A913L7j375j501n89j20J21J598J018P14k18q34j526j112K07N12J254J058
$$ y = [-1024, 621, 2085, 2530, 1596, 372, -1276, -2412, -2280, -1070, 608, 1978, 2657, 1847, 329, -1314, -2743, -2230, -860, 792, 1934, 2587, 1571, 186, -1350, -2621, -2169, -812, 548, 2251, 2352, 1586, -7, -1361, -2487, -2083, -777, 627, 2045, 2278, 1446, -186, -1563, -2325, -1905, -618, 885, 2120, 2261, 1501, -63, -1902, -2034, -2003, -720, 958, 2039, 2072, 1309, -83, -1904, -2297, -1761, -559, 800, 2235, 1915, 1121, -413, -1495, -2285, -1695, -340, 1032, 1999, 2238, 1058, -563, -1589, -2220, -1472, 92, 903, 1789, 1996, 1353, -814, -1740, -1838, -1542, 53, 1368, 1906, 1678, 1027, -365, -1662, -2117, -1272, -311, 1058, 2203, 1662, 882, -525, -1791, -2045, -1288, -42, 1147, 1974, 1888, 600, -619, -1784, -1832, -1178, 281, 1268, 1913, 1950, 575, -926, -1515, -1635, -1514, 84, 1102, 1816, 1598, 764, -762, -1874, -1667, -1155, 99, 1157]
1524A157Q21p53p50j153j229M8R72Q84J327N69n82j296r08q64p3J077J050O70
1542I67R22m87j304r91n56r0N23J434Q50M05l06j104j377j41k24M41J665R62j42
1561A447k32j054j169p66M41P99Q78J543m41m21r75r33q67J75J037J218P16J58
1579A554n30j224o29p97O7Q42J226P37K07l97j230r69k27%Q39J256N48or2j036
1599A39j566l9L51O24J006Q84rq16o99j115l58O66R87O50P67j20p53p62p10m58
1619a331J24J120R23L49J67l60j199q37m30L90R35J006L73o2l53j120j199L34
1637a170K18P92J013P29l35o73p89q90m63Q79N11Q70Q14k55o61j169n80l96Q01
1656g54P81O71P34k73o74j031m50k15L99Q86O80K29K07r81o82o91K94J62O96Q88
$$ y = [1157, 1978, 1225, 475, -678, -1907, -1859, -887, -3, 1324, 1893, 1311, 15, -893, -1757, -1830, -753, 297, 967, 1889, 1402, 98, -893, -1449, -1539, -1016, 418, 1268, 1673, 1367, 263, -1114, -1255, -1479, -1038, 627, 1589, 1447, 1215, 161, -1008, -1774, -1333, -534, 344, 1887, 1446, 1025, 50, -883, -1750, -1575, -538, 680, 1396, 1554, 1024, -200, -829, -1626, -1559, -717, 509, 1246, 1453, 1056, -174, -1143, -1370, -1370, -531, 725, 1273, 1267, 1175, 139, -1427, -1466, -1115, -491, 515, 1399, 1390, 574, -125, -1240, -1598, -932, 55, 705, 1472, 1352, 599, -163, -873, -1331, -1207, -87, 836, 1185, 1352, 992, -207, -1044, -1474, -1084, -149, 857, 1230, 1168, 815, -305, -1504, -1170, -952, -160, 853, 1582, 1247, 574, -215, -1105, -1568, -689, -178, 692, 1506, 1251, 590, -579, -1159, -1555, -754, 27, 698, 1432, 1159, 485, -546, -996, -1211, -812, 74, 754, 983, 1190, 209, -473, -1164, -870, -708, -12, 876]
1676H76L45m29l89q97r36M45M67O21P70K34k50q09n03q39p3P03Q79Q46K05m00
1696H66q46p86m95J21N42Q44N44L96j62p86p04o51n7M73J001P86M7m34n05p63
1716e69n38L93L54Q74M95K6m80k33r63n89K35O67P00M11P58r88p42j89m74l65
1736a217P93R51L22J02p8r22o41j34M7M71O72O95L5r2j179n82l85M95K03Q11P96
1757A163k14k63p77o73k71L12O78P24K68K47o84m84p13n26N12O95K89O35P3l86
1777F05q27n48j44L88L34O34K86K29n18n93n32l66K64R88M37K04j57j97p14m45
1797f72k84O2Q53N12M18j37m34m47p23J75Q0N94M55N11j88k72q51m80NK77K52
1818b94Q15J27J79o65m21n28j48M17K55R42K86l20n25m48n93n1L63N82N00M36
$$ y = [876, 1221, 792, 403, -494, -1430, -985, -518, 103, 873, 1107, 857, 48, -455, -1294, -1367, -664, 215, 1061, 1266, 866, 20, -766, -1261, -1140, -598, 246, 790, 1186, 1024, 238, -466, -1117, -1174, -701, 300, 1086, 1133, 699, 194, -569, -1107, -714, -360, 514, 1009, 1035, 555, 322, -641, -1230, -995, -328, 372, 783, 1541, 553, -189, -378, -852, -1217, -424, 527, 849, 951, 873, -49, -690, -824, -777, -306, 366, 1061, 1096, 1004, -175, -757, -1142, -647, -444, 367, 1163, 949, 686, -91, -764, -1035, -723, -45, 679, 947, 1194, 510, 26, -687, -1213, -701, -6, 283, 918, 991, 605, -222, -770, -914, -526, -192, 442, 728, 957, 439, -154, -686, -1052, -788, 200, 637, 841, 684, 487, -227, -672, -956, -894, -41, 471, 889, 752, 318, -129, -852, -677, -597, -3, 452, 963, 775, 503, -348, -828, -823, -546, -294, 521, 648, 827, 162, -259, -787, -935, -518, -263, 679, 965, 645, 120, -328, -921, -972, -609, -27, 473, 909]
1838I09l45l67l79n78l9J92N97L72J94J76p28m67j94J07m0P31K08N34m12j08p38
1859c75l04N6K16P39K56R4o0l68p00m17q5N70N54N64q7j42m26o29j88j20L01O82
1881A31P69l05n7l65o02k86K07J81N08M98N3m49k71o67k50J86M92M21L90l4l27
1902B23l63n00j43L36K36L79K99J26p3n07l85k55L6L97L45N94l3n1p63n00Q1p3
1924e94K39O37M13p5l85l46n01M2r1M93M32J32L29l63m78o53k7K98P29n9N88l16
1946D44k99k07n73p9R5J56Q54K80k25j20m79k96l54K29M45K68M47j62J4n44m06
1967e12j5O9N74K05L13j27k58j89m86j87L12L71L75J54p0l59l22k43k16K11P00
1988C00L9L58j91l19m58l66j38P05K20J91K8N4k36l76k49j51L72L74K3L00L4k65
$$ y = [909, 564, 197, -182, -760, -799, -607, -10, 362, 556, 732, 4, -463, -657, -550, -590, 141, 349, 883, 471, 363, -375, -679, -623, -407, 332, 588, 682, 622, 254, -446, -863, -948, -378, 176, 740, 653, 511, 85, -544, -732, -852, -551, 131, 900, 595, 538, 173, -429, -715, -508, -327, 181, 679, 732, 283, 12, -655, -905, -719, -227, 194, 584, 550, 223, -140, -640, -783, -447, -211, 168, 467, 593, 520, 13, -372, -627, -591, -194, 151, 745, 712, 661, -102, -602, -521, -594, -355, 282, 695, 620, 235, -111, -612, -570, -661, -168, 264, 396, 725, 362, -116, -769, -796, -498, 231, 172, 760, 444, 145, -62, -635, -714, -619, -463, 391, 671, 446, 326, -153, -449, -803, -574, -129, 139, 586, 424, 438, -106, -512, -527, -458, 116, 321, 634, 507, 249, 60, -426, -613, -301, 70, 445, 599, 529, 170, -152, -395, -611, -400, 300, 339, 697, 506, 187, -271, -637, -775, -70, 150, 341, 369, 423, 187, -189, -438, -589, -217, 157, 180, 480, 514, 249]
2010B49m83l81J48M6L06K64O17l72k01m70k43m8M03K64N8M14j46l60m12k64L52
2031b59KJ00N17K85m2l64o12N3j81O8P03R3J13n4m96k67j27R8O9J38O16J29j95
2054C87l08k24j15k37K25L25K24L94n12k78j02k42J39J16K65M43k33J38l50k13
2074a58q8j70K98O9N59Q3k84m95l2n9K1k9N59J67j74n5m74QLk49L11J80L95N1
2098D37k86j0o18K35L2R1L26J01M4j80L4o59J84M8L56K14K88k44l34p7j75k27
2120d20mM13n9L54M5j82j11l44m2J73P8J86M59l56o6o52J35j03J95K41O04k3l79
2143A42K45p17K8P7N8K64K04j26N6l51j45j68J1R7M22L67p2j49j88k21j50m7L41
2166b2j94L89L15k7m38k65k91L76L58k05K79L57m44k04k6k53L4P1J17L08r4J74
$$ y = [249, -234, -615, -467, -421, -115, 149, 766, 394, 193, -277, -520, -568, -165, 99, 157, 571, 425, 65, -347, -611, -259, -257, -157, 360, 645, 603, 239, -373, -320, -501, -433, 270, 363, 476, 422, -74, -341, -468, -370, -301, -163, 453, 582, 387, 79, -145, -260, -497, -272, 53, 277, 671, 159, -119, -221, -463, -324, -208, 57, 500, 267, 405, 55, -158, -246, -416, -118, -49, 510, 593, 309, -186, -218, -277, -256, -285, 274, 441, 267, 212, -262, -254, -251, -500, -189, -9, 386, 437, 151, 141, -477, -242, -210, -119, 207, 308, 352, 172, 206, -453, -269, -221, 135, 349, 637, 393, 59, -18, -193, -420, -424, -11, -70, 284, 329, 147, 36, -308, -350, -177, -99, 87, 546, 190, 124, -528, -393, -496, -301, -60, 544, 521, 142, 387, -330, -302, -225, -167, 97, 301, 175, 231, -120, -265, -433, -422, -325, 97, 464, 392, 243, 55, -166, -316, -363, -22, -216, 173, 488, 461, 23, -242, -533, -157, 201, -4, 275, 632, 188, -16, -42, -295, -261, -190, -73, 235, 141, 315]
2188C15j41k21k35k55L88L15L0K79k73l26K50k76k10K19K88K3K6M7j43k67j44
2209c11j44K89K36K05j87J92l15j55J45k36RJ64N10j92Q7l77j29k61j3L26K51
2230I4j27L37j65k62j90o9M09K6K10J8N9M1o05n9j79MK47J87L18J43k41p8l68
2253b50j49J49k4M27J56J43m33%k55J0J15K29j41j2M40l89k99K47j35l36P95M0
2275C28K6j80M4k00m1m95L98K60K17K2j49j79p1j53j74K47p8N58O3j3k30j83m76
2298d59J04K95p4K64o5R7k04j40O8j09J50lK63k07J10N5k66l29K81P3J93J24K47
2321D68k46k10j03l26JK94M4K85J87k7j49m67j6K8K47J5K7Q8J37n63Q1j46r9L23
2345a27K45J71J58l08j02r2j69J6K29n5J63M1J43j91k73k26K48jp0N69j30k10
$$ y = [315, 174, -47, -282, -537, -149, 166, 196, 475, 202, -124, 126, -150, -360, -141, 147, 170, 196, 243, 100, -167, -311, -455, -166, 70, 275, 88, 280, -35, -190, -45, -281, -272, -108, 402, 210, 297, -80, -209, -470, -483, -157, 94, -33, 304, 139, -123, -313, -382, 27, 53, 263, 281, 340, 381, -224, -283, -462, -458, -211, -24, 294, 437, 196, 118, -250, -399, -250, -274, 153, 309, 452, 19, 19, -236, -226, -111, 118, -23, -35, 405, 16, -283, -36, -171, -507, 288, 328, 354, 174, 218, 18, -23, -518, -120, 140, 357, 379, 230, 51, -20, -173, -347, -100, -178, 380, 443, 430, 200, 17, -459, -355, -60, -134, 130, 65, 162, -42, -182, -114, -223, -73, -76, 187, -20, 90, 145, -121, -450, -169, -96, 97, 221, 468, 222, 12, -91, -417, -416, -122, -78, 207, 394, 367, 218, -249, -265, -237, 10, 25, 52, 140, 277, -286, -205, -351, -450, -127, 118, 289, 447, 139, 37, -55, -224, -208, 21, -34, 129, 170, 313, 122, -151, -377, -129, -130, -200, 369, 239, 29]
2367B9j75J78m86J93J20L87j40J42j31J55n49K58j7J03J03j7J49q1j49j57l86
2388d71K28Q2M66J53k01j25k07J99n43K31J87R9O6J00p2k35m2j54J2J74J47j45
2410e1K68L53n72l27J56Q6R5K65o1p2ml30N4j18J57j71N54j77k2n6j67n3J0k65
2434d48N61OL4J71k03j51j77J15J28N6j45L88j69M6j85j18k70K20J95J91k59P
2456gp8M2l4L1l7k8K55J73m8j84l85J49j90M48j34J04l8J95l84R5r1p4K08n2L43
2481B79p9q6j24j40N0K9q2K45k16L62j12j13q2j58R8J30j15K93k4q1j75J62q5
2504b4k15J06K13q2K55q7k46j50j02J25k8K30p5L04l1l13j62K51j27j9J04M16
2526C43j93r1J24l46k16J83N03k34l6qO8K22m35k8K6K92K78j99j45J39k29j42
$$ y = [29, -146, 32, -454, -261, -141, 246, 106, 248, 117, 272, -277, -19, -36, 67, 170, 153, 302, 221, 72, -85, -471, -243, -161, 305, 458, 257, 132, -75, 124, -419, -188, -1, 98, 164, 264, 192, -43, -85, -239, -227, -53, 94, -51, 217, 570, -2, -329, -173, -87, 8, 273, 212, 140, 136, -194, -140, -258, -101, -272, 282, 105, 83, 27, -140, -193, -183, -448, 113, 119, 153, 324, 121, -30, -207, -92, 36, 92, -53, 335, 166, 212, 27, -91, -361, -141, 54, 245, -14, -7, -85, -43, -77, -46, -83, -111, 144, 317, 269, 85, -300, -151, -341, 107, -27, 77, 39, 234, -150, -55, -146, -220, -12, -64, 279, 200, 114, -10, -150, -100, -71, -153, 92, -124, 238, 126, 13, -69, -227, -129, 1, -114, 179, 155, 74, -101, 61, -24, -239, -133, 80, -2, 253, 166, -80, -230, -332, -207, -235, -5, -80, 224, 193, -120, -282, -31, -158, -177, -73, 343, 150, 59, 183, -163, -379, -196, 307, 73, 37, 29, 97, 319, -116, -144, -118, 174, 452, 253, 108, 247, 18, -124]
2548a24j98j56N52J58J7J14m13m3K85l19J52l20L20J31j02l4k18J75r0J0J53L4
2570H4K6k1M8p4n6m00N59o3q1K64j08J11j84k61p1L22O7R0j75J59qj53L0l04N9
2595a40k1n3M39J14j55q2m05%K43j0J31M6J47N5k98k19q0J71J50j16K52o9r7R2
2619I5j78jj59M2J51Q9Q9j84p0j46K71P4Q7N9J32l04k01l1J2J71j9J08K64l38
2643A3l4R6P2p9k27J62J7O7K90k9k02j82j13K07n7Nk19J45K58j17k0J36l80O3
2667a28K22l5J06J17k09m3j18j8l7J46r9P1J15l7K04n62L6K03J71Pk49K21P5j39
2691B0j92M3J17L9J91n6K09l94q2r8J40m5L27k89P6K03m34J18J26P4O9k30K48
2714A80k10J84k81m1K47m69N49k33L3M2J32j86kj52J01J90P6l24L8J15j69M3N5
$$ y = [-124, -322, -478, 74, 232, 249, 363, -50, -93, 192, -127, 25, -295, 25, 156, 54, 20, -198, -23, -113, -103, 50, 84, 110, 89, 137, 63, 7, -393, 166, 103, 22, 286, 178, 289, 105, -156, -227, 95, 162, 252, 77, 236, 228, 75, 105, -199, -140, -161, -214, 225, 339, 184, 102, -303, -303, -60, -70, 61, 107, 254, 309, 11, -208, -288, -117, 33, -83, 169, 100, 3, 95, -83, -84, -243, -201, -50, 39, 128, -56, -126, -272, -1, 73, 160, 219, 351, 47, -154, -185, -173, -2, -21, 87, 351, 13, -21, 75, 147, 68, -159, 3, 20, 87, 377, 348, 146, -36, -149, 58, 1, 6, -213, -68, 190, 73, 53, 189, -191, -128, 94, 59, 165, 282, 73, 30, -88, -106, -143, 3, -96, -25, 90, 53, 257, -305, -269, -66, 105, 112, -137, 84, 159, 20, -172, -129, -12, 27, 218, 162, 371, -23, -105, -203, -63, -108, 219, -70, 6, 209, -225, -107, 19, 93, 162, -68, 180, -30, 154, -127, -168, 79, -390, 159, -74, -41, 1, 133, -53, -55, -207, -106, 84, 160, -164, -126, -11, -180, -137, -82]
2737h2j36J80K34j34N1j26J8K2j76J5k3J74k35K66K3j18k5q8j41K79M1r3K30j14
2761D2n1j97Q7J21k0J15q6K62k06k05K00k12o6K48K1k8L5q2P2q0j33J53k22L09
2785G7J74k10%j7j23Q9j99J25L3K30k12r6j18P6J91l14K73Q2Jq4J84m33K40J56
2809A25k12o3j18N85m80Q5j26O6J25J08J63j73K2q7O4l9o7Q7j24K53j55K00k08
2832C1L2k18J23J00k67K68R1j43n9J42j37j48K88J71l95L72j55J97j86n7j79M
2854a25l1J45j32K21Q5p0k28j66J24L13j78j9o7L78k10k73K01J18m3MK28m93L12
2877I4Q4k30j56M19m2k50qj27J36O7p1J0r5QL0J60p0K45m46M38l08k64N97RJ76
2902D06n02L07j87J12q4pq2q6K27r1j51m8K40L3j11P5KKj55M04k52k76O5K00l35
$$ y = [-82, -218, -38, 196, 62, 113, -13, 5, 27, -149, -134, -157, 17, -218, 48, 71, -47, -72, -160, -301, -22, 19, -74, 156, 42, -9, -206, -119, 2, -18, 97, 11, 273, 67, -138, 62, -150, -216, 32, 53, 25, 60, -22, 50, -30, -163, -10, -232, 77, 251, 41, 41, 24, -99, -10, -209, -84, -51, 179, -33, -129, -247, -171, 20, -294, -21, 61, 62, -22, 162, -271, -31, 125, -87, -150, -268, 317, -163, -78, -204, -138, -13, 95, 258, 85, 107, 20, 84, 45, -22, 65, -59, 194, 39, 239, 31, 63, -155, -32, 68, -199, 69, 160, 17, -42, 100, -37, -185, 103, 274, -121, 251, 96, 293, 107, 50, -129, -125, -156, -11, -143, 78, 163, 93, -135, -301, -177, 136, -42, -61, -128, 250, 40, -233, -32, 86, 43, 47, 275, -218, 94, 178, -52, -208, 211, 169, -81, -89, -216, -80, -13, -84, -74, -169, -161, -131, 29, -41, 204, -242, 196, -112, -376, 221, 230, 406, -96, 211, 24, 136, 52, 45, -37, -123, 104, 13, -138, -186, 54, 87, -24, 51, 53, 55, -100, 304, 52, -224, -159, 41, -294]
2927b94M54k00q4L31j67k28Q0R0j4l7p1O9nL31l08J42k89J31P8q3K53L1j65r8
2951e3k0j08N03k52j67O0J96k79K00j17j88M48l82J98l1q8LoK31Nk21J41J80k94
2975d1Q1o3p2j2K00o7q0J6K4m3n6K82j72k8J10j22K35K13o01O1O1O6l0J66j04
3000B4q3J21p4L75l58j78K78j52j27J77J13l50K66j92N3J55k9p0p5J51n2N2k03
3023a78Q4J57k14K13n3Q3j92J46O6k9k16K54k33N7K32j68j14j17J88j4P2J25n5
3046I4J80l73l1k00K33R0pl0k7K13m8Q9m34L19M2k84K91k26j19Q9P2M2J32j49
3070d2R5R6j13K86m77K21k36L12J21j99J5J01p3j57J29l6j39n5J07R2p0K69j86
3093F1j73J01R2j95M5j36K25J66k45p0Q5J88k93K17p7J90r0J6j06o7N6J81k11
$$ y = [-294, 160, -40, -124, 207, 40, -188, -108, -18, -32, -69, -140, -71, -76, 255, -53, 89, -200, -69, 9, -74, 179, 210, 45, -53, -73, -181, 322, 70, -97, -37, 159, -120, 80, -37, -225, 223, -159, 39, 8, -80, -77, -83, 148, 153, -68, 73, 253, -41, 40, -23, -95, -107, 93, 26, -54, -38, -14, -57, -113, 169, -3, -31, 79, -43, 192, 405, -196, -135, -74, -8, -38, 128, 24, -59, 62, -12, 363, 5, -173, 105, -47, -174, 3, 116, -234, 32, -160, -107, 48, 19, -51, -126, 25, -27, 25, -178, -94, 63, -151, 62, 9, 92, -100, 46, 112, 83, -133, 121, -112, -55, 177, 9, -105, -222, -34, -48, 24, 149, 94, 274, -99, -130, -330, -97, -7, -14, -44, -71, 142, 94, 183, -251, 68, 110, -174, 117, -109, -228, -139, -67, -25, 107, -42, 53, 149, 36, 322, -155, 66, -170, 142, 263, 64, 79, 180, 107, -50, 79, 43, -96, -151, -44, 48, -22, 247, 61, -112, -11, 81, -114, -69, -205, 20, 186, -59, -129, -44, 144, -149, 68, -9, 181, 91, 107, 1, -66, -10, 171, -40]
3116d0M4j65L9J7J45l3k85R3j12L75Pj27J67K1k69J03p5N5k0J33l1k09K03O0k03
3141a07jR5J24K6j82k18L5J79lK81j79p8r9K84l1k53Q0J78k1j08K5j3K67k32j8
3166C1k76L91k12R6M0j5q3O4J46k02L9r4M0M4M1j82K47p5J99n39L98p3k42M22
3190B05l20J13m0n9J79Rk86r3L14J70m34M12j63J41l64J54J72j18J1j46K65lL9
3213A58k93k67L53n2K3q9J14Np4j75M41j87K57l40k03R8K89n1J13j54J12k7j34
3236h3K9O5j00Q6O3J59l54J84L8j23K02j25o5r2J01l6l5K17l89M56r5k67K29k60
3260a95K40m8j00j4J27K15k07K4J36n3N5k33k75L86m6Q9jk54o4L28m6Pl48M85
3284B08j93O1l2J59k63r6L47k80J32K6j84J30J7j35J05R4Q9l0j12k69L52j62K93
$$ y = [-40, 4, -161, -122, -105, 40, 7, -278, -185, -297, 78, 85, -42, 125, 146, -123, -20, -95, -40, -60, 73, 42, -167, 36, 96, -107, -108, -13, 111, 137, -45, -263, -228, -49, -52, 229, 50, -28, -127, 157, 126, -127, -47, 131, 110, 2, 27, 14, 281, 49, 31, -245, 146, -66, 30, 70, 55, -28, 36, 182, -20, 19, -75, -35, 9, 50, -132, 115, 40, 239, -300, 98, 25, -217, 205, -115, -2, -42, -101, 78, 87, -199, -292, 22, 192, -242, 170, 7, 148, -216, -62, 110, -8, 3, -143, 122, 119, 158, -135, -402, -49, -101, -78, -167, -53, -48, -122, -297, 144, -43, 214, -126, -329, -231, 58, 7, 120, -34, 78, 51, -83, -54, 11, -89, -3, 60, 219, -135, 49, 87, -36, 166, 41, -24, -116, -15, -51, -86, 131, -258, 198, 103, -164, 65, -195, 45, -3, -103, -117, 10, 225, 18, 42, 178, 125, 180, -53, -328, 58, 12, 101, 100, -154, -218, 110, 64, 71, -277, 208, 15, 76, 44, 203, -60, -156, 191, -89, 43, 69, -115, 15, 32, -103, 2, 96, 185, 155, 43, -226, 126, -36, 257]
3307B57l8j70k26L16k15o4M9J53k4j51K54n5k60K74j34J69l07K01P8j86j46K48
3329B3j96N4J05J68j53K41o9j92O7lr7J06o0r7K46L6j45j85j17K00K04j51J29
3352A14j89l8j15J40J1J59k85K37j05J42j25jQ2l5K5j74K75M8m38M28k68o4K78
3375A02k59J51N4k01J91j74O0q0J06L36j40k96l5J96k34J76R2M3L30l86J34j27
3397C9j71J81k63J83J21j23N8j37M1o0J73Q7k85L13k57j56K0R3J44n2p1J96j91
3420a17K89l2k64R6j44J33J21K63l16l5J15R8l46J64q1K22k85Q9n2J99j65L80
3442C32k65mj31J76j40Q3Op4j75K29P9k84M3L82k08j77M32m00J83M8J06l00N4
3465ej89J53j01J97k11J48l7J78p2j30J26J45l94N29n81K35M1O0j66J16J36k08
$$ y = [257, 219, 49, -177, 139, -76, -140, -91, 62, 38, -113, 141, 86, -174, 100, -34, 135, -172, 29, 107, -79, -225, 23, -173, -119, -14, 154, 1, 242, 173, -19, 48, 45, -52, 54, -6, -103, 143, 179, 34, -151, -268, -68, 136, -15, 114, -75, -113, -228, -88, -77, 82, -203, 34, -71, 71, -54, -55, 27, -8, 17, -157, 118, 166, -272, 156, -112, -176, 102, -157, -6, 48, -153, 38, -136, -76, -156, -50, 286, 146, -150, -185, 11, -223, -47, 45, 88, 418, 32, 166, 39, -132, 49, -214, -31, 90, -33, 25, -112, -71, -131, 42, 129, -156, 157, -100, -256, -236, -143, 1, -51, -122, 74, -117, 172, 140, -124, -28, -172, -39, 82, 345, 29, -6, 109, 207, -139, 25, -56, 166, -119, -30, -82, 117, -48, 332, 67, 63, -68, 108, -32, 51, 57, -17, -192, 37, 116, -168, -125, 257, 49, -128, 304, -96, 87, 135, 241, -59, -5, -194, -41, -142, 55, -156, -8, -45, 133, 61, -69, 57, 202, -192, 337, -244, -9, 32, 92, -74, 42, 178, -30]
3487c0r8J76k1k9N5j07K74l56M7k0L0m3J22M6j93K09O5l6j10KoJ19k94M9PJ81
3513C9K72l49K35j97j11L36k73J05k60L02j87R8j23J59L9Jk50MO1J42n6k18L95
3536A64j86J24O6j79M2K21j79k23J13O6j57J26l3j05J60k2J48m39J56J2J86k69
3558b08L2J33K12k40j14J99q4K3J19j69J02l1r9L10q2o2J69j1r4j67j67K87j05
3581d7kJ0N5j27J85K55j94k06j68K43p1J24n4o5R6j29L66lm77J84j80J02Q2J96
3605A75q9pJL9q7j34J41j70j44J53J38L3j8J49l93K08K09m27K87j50l0M3N3p5
3629i5J10l23K52J13k27J04P4q1K13M1p2J12j44j99L6M8Q1n8L4K4R7O2j71m3j81
3654a93J64q8L51l57k5L02P4k0l21m5L30j77j36L71m60K23J11n7p9l0L9q6M6k5
$$ y = [-30, -128, 48, 27, -2, 53, -54, 220, -136, -89, -109, -79, -122, 0, 46, -147, 62, 127, 91, -19, -17, -23, 96, -198, -149, -142, 39, 311, -38, 197, 0, -111, 225, -48, 57, -203, 99, -88, 10, -113, 46, 85, 86, -164, -160, -99, 43, -13, -231, 164, -22, 102, 168, -11, 31, 252, 73, -150, -37, 29, -128, -2, -35, -140, 20, -2, 146, -293, -137, -125, 61, -208, -176, -43, 169, -71, -185, 14, -70, -47, 72, -97, 5, -26, -125, 185, 103, 41, 210, 199, 105, -62, -229, 58, -47, -49, -39, 16, -111, 74, 329, 135, -71, -239, 4, -67, 57, 3, -62, 34, -95, 271, 268, -209, -25, -205, -103, -21, 175, 86, 79, 80, 119, 32, -102, 39, -131, -275, -122, 16, 49, 31, 180, -213, -5, 204, -223, 64, -86, -116, -73, -20, -95, 15, -308, -56, 57, -170, -66, 8, -73, 140, 181, 109, 221, 77, -122, -86, -38, 43, -15, 19, 43, 140, 202, 31, -12, -193, -29, -117, 234, -123, -148, 154, 228, 208, -113, -158, 172, -5, -141, 230, -230, -7, 104, 47, -32, -62, -23, -109, -63, -88]
3678h8NQ2J36P9j61r0M6J74l46L03j41L1q5j03P4NK97k03j64m4J7K47j90J87J89
3703B57l11Ok09K81p5K85r0k40j55M88l64L86r3l9K9l30J54p9K16j53L1l38N86
3726B43j87m9N9p5o8K75q4m60L86q7j75L29M3k10K2J72J6k99P2L9K29l40L0R8
3750b1J05k07jL4j6J46r8J11j95K38l3r7p5J03n1lL19j87k8n2l0J39l1j96J44
3775A8j8l7J18n2j00k8n9J15N9P7j38J31K09m25K46m5Q2j03kr9K3q6L40p6j13
3800C7k12J67LK5j4j08K17n9m3j26j3K26j08R6j27K49m51J10K62R1k52P9J7J11
3824A77j18j22J55nj57J90J65l50K14l62N35m10L30j57j67J09O6o9j26R1l8j4
3846f3J60J05k42K17j04J34l03K42o8j38Q5m7J69j38O2k8l6j41J32o8M1j8q9O0
$$ y = [-88, -83, -1, 135, 214, 53, -37, 9, 183, -163, 140, -1, 30, -55, -158, -84, -79, 218, 15, -149, -193, -176, 71, -119, 68, 257, -54, -48, -257, 24, -51, 234, 144, -96, -251, 237, -127, 259, 166, 127, 156, -174, -20, -99, 117, -36, -5, -343, 243, 56, 7, 66, -9, -77, 198, 114, -346, 40, -47, -222, 107, 150, -60, -38, 134, 150, -149, -77, -38, 191, -149, -119, -21, 84, -123, -124, -90, -106, 40, -58, 53, -142, 96, 63, -34, -109, -6, -57, -60, 259, 72, 44, -8, -38, 101, 70, -126, 18, 0, -37, 81, 29, -71, -99, -158, -43, 16, 93, -45, 86, 295, -130, 116, 71, 153, 50, 48, -51, -28, -114, 226, 150, 37, -175, -8, -5, 20, 6, -102, 115, 56, 13, -113, -126, 100, -8, 88, -39, 210, -241, -131, 131, 222, -30, 49, 66, 177, 59, -63, 92, 87, -70, 120, 285, -65, 149, -213, 322, -88, 242, 85, -82, 27, 93, 24, -102, -11, -49, -63, 97, 202, -40, 177, 73, 207, -96, 146, 78, -60, 25, -22, 147, 9, 71, 43, 7, -134, -2, -70, -29, -47, -136, -76]
3870g6P0M7J38j23j21J84J35j45l53L77r3j0K3L7N5k24q2P8o2K25j13J25k67J81
3894FJ87N7m10J13K05j93k03J52J90P7j19p2J56K8l89L82j37j49K10j40n4K22
3916A19k10J24j3n9J71q5j61J47k09J41J30k4j63N4J17j17L80m06j3J36K6p2j1
3939Bj18J27j01L28l65J59K1j16OK60j53Pq5r1J45j97M87m25K58o5jM6j45P4j45
3964h7KN7r8M0J52j56j1K0K44l02K62j17k2J46l30J84J08p0J39k07q0N2J10j43
3988a07K44j42o5J58k75M87k14j44N8J0m2o9K14k08J92j34mJ99k57M0J31r5L8
4011A5j26J25k20J26K16j98P2J17Pj15Q2q5p4Q6j8j68K70m7k23K46j68J08L5M1
4035A04k00L4L9O6j70J73L12k53L8Lj13R1k47J32j7l1l9Q9J36k26O7j13J17O3
$$ y = [-76, -6, 41, 179, 56, -65, 119, 254, 109, -244, 133, 40, 30, 53, 90, 145, -79, -161, -83, -145, 80, -33, 92, -175, 6, 193, 250, -160, -47, 158, -35, -238, -86, 104, 181, 62, -10, 146, 174, -215, 167, 30, -119, 91, -49, -103, 119, -91, 33, 20, -39, 132, 47, -114, 33, -176, -35, 95, 71, -92, -38, 79, -38, 342, -64, -77, 59, 85, 13, 2, -116, 11, -90, 238, -127, 32, 53, -63, -57, 203, 50, 57, -28, -119, 26, -171, 316, -109, 149, 84, 83, 129, -16, 58, -87, -85, -28, -126, -86, 66, -90, -101, -81, 163, -139, 123, 6, -16, 130, -200, -16, 92, 22, 161, -46, -126, -74, 36, -107, 137, -5, -70, 88, -187, 300, 86, -58, 0, 10, -32, -101, 113, -95, 97, -37, -41, 158, -99, -59, 72, -23, 15, -111, 14, -206, -80, 136, -62, 10, 127, 134, 19, 101, 16, -58, 28, 10, -158, 112, 65, -158, 88, -80, 28, 63, 104, -96, -62, -23, 43, -127, 46, 358, 105, 143, 146, 33, 124, -123, 9, -8, -39, -78, 11, 147, -79, -12, -125, -8, 55]
4059E5P8j11P2k43PJ93k00K4J22j9J06q1k3J22n1O5r8Q1j50M7O9j93j09K34j5
4084a8k7J20q7n8q8P1J61O1k40K70k7m71J31J40o1j9L09q7o4j37R8R9P3k20o6
4109a37J48Q6j56O9j11L17j1r4jj95K88mr3q3j54k8L44l72J03j35J64l4P0R1j19
4134d7O2n6o6R0K01r4p9J61j83n6OmK6J38k1k47J93k0P7j22K10j48j16J68r5p2
4160i4K78Q4m94L78j82p6J31r9R9K7J77L2l01L8j24K00J05j88K86m16J79K5j94
4183a29L1M9k0P3n0n0J24o1l7j12J76q3n2oK97l63J54J10m3J71l79L21o8Ln5R1
4209I2j3j22o9O4J55j30rn4J23L2jk3k88L04k67K94LMj19K74k84R2n8J5J43l02
4235a44K05k73J86L4j7rJ31j09j50l3J73j4L8J03k19J34m7o2o7J05p4PJ96k94
$$ y = [55, 133, 22, 94, -149, -142, 51, -149, -125, -3, -22, 84, 3, -20, 102, 51, 116, 18, 99, -51, -4, 65, -128, -237, -3, -18, -45, 75, -12, -70, -158, -87, 74, 135, -105, 165, 138, -333, -202, -62, -123, -142, 167, 80, 16, -121, -23, 76, 149, -71, -137, 11, 97, -59, 10, -101, 216, 205, 111, 110, -85, 203, 199, 106, 23, -131, -159, 185, -187, -84, -219, -55, -89, -19, 72, -47, 15, -41, -107, -17, 184, 90, 11, 172, -11, -67, -61, -65, -39, 99, 78, -169, 24, 4, 81, -41, 169, 21, -95, 73, -22, -94, 184, 268, -226, 152, -30, -106, 25, -74, 25, 52, 229, 261, -40, -2, -126, 74, 179, -9, 277, -139, 40, 65, -129, -98, -49, -69, 4, -46, -96, 28, -33, -70, -182, -6, -89, -141, -147, 150, -213, -59, 51, 8, 179, -200, 121, 53, 56, 1, 92, 79, -43, -112, -48, 107, -23, -32, -86, 37, 69, 68, 45, -243, 61, -206, 88, 91, 95, -24, 250, -34, 58, 0, 15, 158, -144, 61, -212, -26, 8, -9, -18, 113, 4, -146, -179, -6, -20, 18, 121, -98, 36, -11, -73, -140, -35, -109, -102, 94, -200]
4259b00L22m5m7K58k25j56m0kK75l04L05k27J68r7r8J32K0N1JL9j83j2K49k48
4283f4m4J30R6j73J72K28m13M9L0k5k1o2J27k06J77p0J48j4j24j08J23pl6J64
4307G7p5J78j37n1J46j13k37K31r2K58k29j00K84j20n9Qn1K91l14J30j45K5J78
4330H3j15m9J25p3K53k36k5K49l3j79m7O5j44J32m5J23o3M9j20J75n15L78p8j4
4354a04N6J63j98K05j11k6J12pr2m3q6K67P9k73P8m21L09K10j43j81K82l25J68
4377h1K57j52k35L79k31P0k07K34P4O5j56q4J46r0Q6j41J51k54K97k13J05k66
4399b46K51Pj15J32o4J63j79j27K12j39J30K98l82j27j8K38l8L8n0j57J67mQ0
4422G0nqp5NJ3k08P0Q0M7o3J91l7j37j9j85N00j35m4r4M6j5O4k21P0n3j16K25
$$ y = [-200, 122, 77, 30, 288, 63, -93, -133, -135, 140, -164, 141, -86, 82, -15, -113, 19, 39, 90, 91, 130, -53, -65, 184, -64, -108, 22, 118, -55, 117, 345, -68, -19, 11, -14, -35, -97, 30, -176, 1, -69, 79, 65, -59, -167, -44, -51, -87, 77, 2, 180, 43, -8, 138, 25, -212, 19, -73, 185, -44, -144, 140, 20, -39, -31, -82, 209, -105, 25, -120, -95, 83, -32, -81, 44, -29, 224, -12, -37, 212, 179, 0, -47, 18, -126, 6, -39, 84, 21, 70, -50, 125, -390, -12, -90, -104, -48, 115, -83, 122, 11, -15, 97, 90, -2, -45, -131, 136, 215, -58, 20, -401, -92, 118, -25, -206, 76, -249, -81, 176, 24, -211, 168, -63, 7, -200, 34, 108, 173, 17, -67, 79, -11, 75, -66, 85, -169, 128, -85, 20, -246, 5, 12, -103, 29, -35, 128, -51, -178, 34, -105, 25, 323, -59, -186, -204, 34, -4, 34, -16, -173, -6, -10, 70, 65, 57, -18, -13, 0, -208, -138, -58, -11, -74, 117, 80, -57, -76, -261, 239, 104, 60, -34, 12, -3, 61, -160, -90, -143, -259, -34]
4449c4j38nK96p3M1L4J68k64K49j09r6M4j85J9K29l30R7J96J18m28J56J70j02
4472E3l8k47K96k80K31k12J42q5K0Rj45N2J90K9Q9P2k11Q0j29m2K02q0j30L27
4496A93l83J16J89l48L66K4J2j99O2k17K47k49O9J33J25k67J20k28J62K95P2j95
4518I9QK9j20N1l41L76j00R5l22J64K55l16P7J04lj12j0j7O5k24K20J11j62R3
4542B0q2J10j37K49k68K44j55P9j80j74K14K37jOj41r5j53K49N1Q2K03k22j0q5
4566D1p7k06J60r2R9k54J05K21J5n1J55n6O5k16J19R1Q0l11K24j7O2M0O3l52J80
4591H8j40q6J02J86k06J72l12L07J23m88L98j95P2pQ9k92O4L4K95j75R4k4k06
4614a07J16Lq4N5qj6J05J15m25O5J92p0OK6L4RL6k65L23p4O4j29J84j52j96K36
$$ y = [-34, -172, -177, 119, 46, 87, 121, 289, 25, 274, 165, 69, 113, -72, -53, 176, -154, -57, 139, 257, -171, -15, 155, 53, 15, -232, 64, -216, 15, -197, -55, -140, -120, -111, -256, -204, -14, 15, 104, 176, -35, 45, -84, -126, 76, -4, -134, 193, -190, -74, 115, -233, 133, 157, 169, -30, 32, -185, 62, -187, -118, 15, 140, -127, -7, -235, -73, 222, 294, 99, 107, 136, 16, 67, -274, 102, 2, 97, -225, -61, 194, -122, -45, 59, 56, -56, -66, -83, -18, -242, -22, 89, -73, 20, -62, 48, -89, 160, -108, 136, -19, 60, -120, -294, -80, 157, 156, 162, 21, -74, -227, 22, 73, 155, 358, 136, 126, 41, -36, -242, -82, -174, -75, -329, -224, -3, 12, -39, 116, 60, 125, -91, 28, 119, 199, -112, 112, 95, 157, 197, 260, -92, 88, -52, -138, -36, 150, -56, 116, -196, 111, 234, -254, 144, -51, 21, 14, 103, -189, -125, -91, 204, 29, 123, 99, -107, 9, 12, -72, -17, -25, -41, 64, 179, -246, -181, 11, -59, -53, -27, 7, 16, 52, -213, 110, 36, 100, -29, 155, 3, -193, 43]
4640D3Q4p5j31P3p6K52l12J68J7j41L75r2n5j21R7m5n5J46j74k65J13J91Q0l03
4664b06K86M5q0L2j81L35n20M02k65J91j3o9J76k18n9J62j77J38p7J6R7j2k4k1
4688d2J99r5k59M61j21l66K88k05P4P9J18k51J56R0j67K04Jj52r5J02j61M34l04
4711a2P8K5k39J03n2nN2J37q0J7J49l17J21L2j8R2mj22RK75m04L74k48j38J44
4736c1J37k5J20m7J47q3k40K32k58j06P0J15q3n1L15m9k55J18R0k39K33k23O0
4759e3j3J49Po4k79L57k2m2m6j04J15o7M8r4M9J59n0j07p1J75j4o4J10j92J44
4784C1l6P4J35j30p6L1n1o5j68J85L5j60L22p8j88L45l08J24j63K93k79J28J65
4807A66l20oL28J48l68Q7K1j68J40m7K67l55J3K78j78J4p8p0M3J34K7m9r0K58
$$ y = [43, 127, 52, -79, -6, -82, 170, -142, 26, 43, -98, 277, 185, 130, 9, 106, 61, 6, 152, -22, -287, -174, 17, 97, -206, 80, 125, 45, 77, -104, 231, -289, 113, -152, 39, 26, -43, 133, -85, -144, 18, -159, -21, -98, -82, 15, 3, -21, -42, 157, 62, -197, 264, 143, -223, 65, -140, -66, 13, 131, -120, 36, 126, -41, 163, 164, 12, -83, 19, -142, 292, -12, 66, 91, -148, -45, -97, -102, -50, 87, 7, 24, 173, -144, -23, 9, -9, 83, 79, -43, -34, 241, -163, 211, -37, -175, -31, 106, 81, 201, 154, 301, 218, -22, 210, -48, -154, -84, 31, -52, -103, 212, 163, -92, 26, 116, -123, 110, -113, -53, -66, 83, 90, 26, -253, 104, 82, 40, -6, -110, 5, -62, -14, -108, -59, 100, 50, -57, -128, 47, 33, -31, 79, -113, 31, -5, 69, 204, 74, -2, 29, -22, -87, -255, -70, -35, -195, 127, 49, -139, 206, -102, 22, -141, 152, -127, 1, 166, -154, -160, 168, 316, -52, 35, 56, -112, 28, -19, 248, -107, -94, 184, 6, 20, -58, -128, -85, 49, 76, 27, -63, 195]
4831A95q2k54J9J25op3q9l2J78J55l18K82o2KJ15k28J09j4n2J07k72L17l61P0
4855a69J24J5j44K74N2j18R3J1N1k30k3P1Q3p0j17k32M13j25r3L16o9J46l93J06
4879b8O9j79K78p9q4k23L7K49J29n4r7j81K29j94pN7Q7N6L5j6l2Q2j9k84p1M42
4905B02l8Pj9k32K12j48M0J51j29J3J18Pj24m3k4J20n1j18j86K35N9K46k45r4
4929d1K15k03j4M0J64j29k0j67J38K13j69j5k21J1J42K90j43p1J11k98M45k46
4951C2l03M34k41KJ77q2k85J40P8O5J25o9qP4j4q5L1j7k45J03j03J92j19K38k66
4976a46j54O14j52j50J82j52r7N2l6J08M8q3j83N7kJ99q5j1J66j92J82K7j13N4
5000A33k88j86K93K26k48j05K72j18J39n7p4k8p5L79l68M3K28n7j23P5J82j44
$$ y = [195, 113, -141, -122, 3, -3, -76, -165, -197, -19, 136, -182, 100, 38, 40, 155, -73, 36, 22, -30, 77, -195, 122, -239, -169, -45, -30, -174, 100, 152, 34, 127, 138, 189, -41, -64, 7, 90, 20, -97, -329, 84, -41, -134, 182, 113, 259, -134, -28, 41, -138, 140, 61, -23, -246, -209, 40, 169, 115, 18, -163, 66, -128, -135, -78, 9, 65, 100, 84, 52, 134, 115, -169, -240, 202, 164, 171, 152, -80, 132, -16, 24, 175, 46, 59, 177, 184, 60, 17, -7, 113, 62, -56, -242, -7, 52, 298, 53, -41, 174, -29, -43, -3, 161, 32, 12, -155, -17, 196, 27, 12, -209, -198, -56, 234, 91, 20, 131, -167, 278, 32, -271, 163, -78, -76, 101, 19, -266, -126, -48, 17, 142, 73, 65, 139, 125, 40, 71, 54, -191, -88, -191, 1, -118, 120, -146, -300, 314, 162, 12, 194, 42, -55, -3, -39, 69, 117, 34, -149, -92, -94, 105, 20, 9, 175, -17, 165, 192, 79, 133, -155, -341, -48, 178, -70, -175, 97, -21, 118, 61, -13, -41, -116, 263, -105, -62, 166, 109, -14, 61, 243, 99]
5022I9p1k04K08L4j49K4N8j69K82o8l7P9l3j10k2N5k32O8J23j87J06q8J0K97j13
5047d0M79k12o4j8k16Oj33R4Q7RL7J36k97l5J3K99j1k09Q5L0N2j85K91l02J8J18
5073C2l44N16m63N9R4L0J1J13J79m48K09q7K57l93J42J34j35K65j29M6Mo1O6j25
5097b8q3q7K51q9j27m4J43J74m3j55K0Q7N3m7N1j52J06l3m2P3Q7q5J72j4j49l3
5123FP5j34J07j2N7l09R0J19J08k66J69L3oj02J28r0K15m35K54K2K16k41J60j81
5147a7LK8k95J18J31J14j9N1k57j9j21K95K69q9m20k1L35l63M77j76p0j04L19
5170A69k91L39j62Pj65J95Q2k89j5pJ30l8R3j75K56l70M21j54%m1J09k8O6K0k04
5195e2J5r6m5K81k5j88j1m1J49pj81R3K54p2r7j16L8p8k2L66k6m00J68K1J40n8
$$ y = [99, 28, -176, 32, 66, -83, -59, -1, -170, 112, 44, 7, 86, 53, -57, -79, -24, -256, -188, -65, -252, -146, -234, -224, 73, -40, 439, 227, 163, 145, -71, -65, -198, -104, -17, -8, 29, 165, -132, -167, -154, 145, 134, -75, 10, 40, 92, -93, 198, -104, -86, 32, -312, 204, -259, -200, -106, -76, -65, 48, 227, -221, -12, -99, 158, -235, -93, 41, -94, 171, 42, 88, 92, 31, 97, -28, -111, -198, 53, -36, -163, -207, -64, 110, 67, -88, -68, 19, 72, 25, 76, -76, 30, -3, -45, 28, 115, 30, 202, 188, 39, 6, 81, -53, 54, 42, 99, -210, -120, -1, 107, -159, 10, 43, 37, -65, 63, -27, 188, -247, 7, 29, 245, 4, 164, -17, -14, 14, -281, -163, -32, 82, 63, 114, -143, -162, -283, 12, 281, 192, -228, -249, 86, -277, 200, 24, -46, -150, 169, -122, 217, 55, 62, -103, 92, 174, -115, -130, -137, -7, -45, 48, -127, 129, -241, 180, 26, 26, -15, 94, 66, 132, 152, -52, -37, -133, -178, 103, 78, -110, -121, -162, -13, -20, -201, -108, 146, 74, -23, -139, -101, -179, -201, 165, 139, -261, -93, -72, 68, 10]
5221A0J11k23J04jJ19j98M4J54l8M6j20j35j49J45L35k41k1L7n2K72j3k46j08
5244a68J46J85mk51K85k57N3KJ30m7l3j08o9L86j57J49l19j47J66k4N0L4P3l47
5268b72K74j2N4J97k79j25kK36J13j76J37n6l7J60Q6k67m2j98Q7K36l5k62k7K59
5292D9N2j61L04k86j3j41L92n63M40l34K36L13j60q5j24%JP3k30M53l94K70k04
5315a12J54p3J16q5K4j70L98j55J19m62J48k2J95M8o1j1J27j24j11J5K09l41L3
5338a41K30j72J23j53J57j50J54j07J1L26j48j51R6o9Kn0p8J22N9j21m7R3K97
5361B83m89Q7J18LJ1k14J86N9j33J39j15J11n3P9J8k44K40m8J00j63RK44l11J81
5385I8k50N6J12l0m4K23l27J38J40k51O5L63l65o0k9J60PN7Q6Ll9o2M0m5j20K09
$$ y = [10, 121, -102, 2, 1, 120, -78, -34, 120, 82, 128, 8, -127, -276, -131, 204, -37, -58, -21, -73, 199, 186, -60, -168, -22, 163, 159, -92, 193, -64, -11, -9, 121, 74, 41, -67, -136, 250, 93, 242, -77, -224, -58, -82, -32, 2, 75, -272, 2, -10, 44, 241, -38, -163, -165, 71, 184, 8, 145, 89, 52, 212, 298, 31, -11, -209, -122, 114, 79, -183, -210, 49, 101, -60, 244, -42, -55, -196, 196, -367, 73, -261, -25, 288, 128, 43, -81, -81, -80, -7, -237, 216, -178, 92, -112, 42, -31, 85, 0, 24, -146, 252, 97, 216, -246, -98, -120, 75, 123, 62, 51, 178, 54, -57, -42, 167, -174, -141, 89, -83, 40, -113, 44, -106, 48, -59, -48, 278, 130, -21, 75, 6, 8, -42, -120, 2, 61, -60, -107, -14, 283, -206, -119, -1, 2, 13, -201, -15, 44, -89, 50, -65, 46, -7, 72, 90, -154, 86, 38, 138, -25, -16, 228, -83, 98, -152, -96, 16, -14, -58, 165, -162, -24, 116, -135, -70, 293, -72, -132, -161, -1, 6, 63, 149, 152, 113, 51, 91, 46, -74, 135]
5411A35j35J84l37Q2n8PR2Q3j66Q5J44m8j04L2k49L61j92J3L59l85K2O3j5J09
5435H2j24K3R3k72L17m3J52n2j79N7k43L54m2k17K38k70PJ89r5R2m0O0L2o7m5
5460GQ3M8j19J86m61K37K0K06m05J52K05j76Q8m2j6o6mR0j54R5l0J24P6k26O3
5485a9R9Rr0J12o2p1O0P1q7r5j49K25Q2J09L7k43mr1R4%K1n7K28N0o2l40lL8J29
5514iJ70k60R9QJ6j05J05K09j98M1j34O6j83L11l11J43j09%J9J33k7R1k70K3J76
5539Dk72K13op3J18j4l0J35p6L9p7j33J53J10j12o9K10p4Q2m9k65K65n3J9j27
5564h2j42M98Jk09n6N4j63K7l9N5n5n2K79n4k66J26K69j59J78j28l66Q4n2M56
5588B04m04K60Q7k54J71k50L63j95J08j20R9p9J47n8R8Q4r5K3m3j43R8j80J53
$$ y = [135, 0, 184, -153, -71, -129, -122, -30, 53, -113, -28, 116, 68, -36, -4, -253, 108, -84, -71, 288, -97, -75, -12, -27, 82, -42, -19, 74, -198, 119, 76, 228, 176, -3, 54, -189, 165, 123, -94, 144, -126, -119, 70, -25, 67, 27, 87, 119, 52, 7, 90, 138, 19, 205, -256, -19, 1, 207, -198, -46, 159, -17, 71, 29, 13, -53, -57, 33, -121, -26, -56, 68, 144, -82, -19, 80, 89, -1, 111, 49, -22, 38, 109, 22, -73, -222, 3, 85, 194, 231, -12, -16, -107, -13, -13, 8, -49, 179, 229, 167, -173, -176, -138, -9, 161, -99, 0, 8, 24, -81, 24, 233, 35, 76, -58, 8, -175, 136, -175, -32, -141, -141, -122, 11, -16, 75, -195, -172, 4, -268, -55, -61, -134, -16, -30, -60, 75, -1, 38, -39, -172, -19, 91, -21, -90, 120, 46, 128, 79, -186, 79, 26, 45, -82, -224, 274, 275, 66, 10, 64, -99, -72, -111, -56, -111, -163, 116, 62, -204, -78, 191, 32, 210, 82, -284, -200, -252, 204, -200, 60, 147, -107, 64, -186, 177, -18, 90, -30, 69, -10, 137, 79, 177, 261, 166, 189, 146, 3, 101, -79, 74]
5611G4m3j43J65j3L33k90j04J24k63j6L9J67K18m13Q7N5o2j26L0R9K7J62l01J65
5635b9n3R5j02J17J42j82l5p3J53r2J00M8k32m1K17k0k9J29m1pk96L27j93O0o5
5660a02OM06l19R9m9kjj14K1rJ22M9j48P1L3j43L5O4Jj1J21n7m3KJ4K3j12j89
5688b32J37J21j0o7J77k63J60N6k0q2k43L39j29J3P4J28j93r0J06n0n4L5rj1K50
5713A43Jj03j05L05j10j61q3J49m5j65L68j99j17j80M68j6jj3k38j56L27j39o4
$$ y = [74, 31, -112, 53, 40, 373, 83, -21, 103, -160, -176, -137, 30, 248, -165, -78, -23, -85, -211, -181, -82, -55, 107, -194, -29, -82, 13, -89, 28, 170, -12, -47, -120, 33, -59, 41, 89, -143, -184, 33, 13, -16, 113, 72, 65, -231, 96, -97, -37, -102, -96, 310, -9, 90, 41, 39, 38, -76, -55, -64, 58, 107, -41, 30, 63, -80, -45, 19, 20, 9, 130, 73, 30, 32, 46, 69, -43, -232, -95, 26, 16, -51, 126, -137, 23, 79, 59, -23, -266, 73, -56, -43, 31, 159, -34, -124, -18, -68, -122, -87, -96, -107, 143, 144, 41, -64, 241, 131, -30, -113, 36, -9, -174, 194, -5, -122, -302, 166, 150, 149, 136, -102, -258, 69, -70, -134]
$$ [...]
8191F3
##END NTUPLES=NMR FID
##END=
