##TITLE=1H_SR146H3
 D2O
 8 sc, 
 27.10.2023
##JCAMPDX= 6.0         $$ Bruker NMR JCAMP-DX V2.0
##DATA TYPE= NMR FID
##DATA CLASS= NTUPLES
##ORIGIN= UXNMR, Bruker Analytische Messtechnik GmbH
##OWNER= root
$$ XWIN-NMR		Version 3.5
$$ Fri Oct 27 16:17:27 2023 Russian Standard Time (UT+4h)  she@DPX200
##.OBSERVE FREQUENCY= 200.13135
##.OBSERVE NUCLEUS= ^1H
##.DELAY= (6, 6)
##.ACQUISITION MODE= SIMULTANEOUS
##.ACQUISITION SCHEME= undefined
##.AVERAGES= 8
##.DIGITISER RES= 18
##SPECTROMETER/DATA SYSTEM= spect
##.PULSE SEQUENCE= zg30
##.SOLVENT NAME= D2O
##.SHIFT REFERENCE= (INTERNAL, D2O, 0, 15.7039)
##AUDIT TRAIL= $$ (NUMBER, WHEN, WHO, WHERE, WHAT)
$$ ##TITLE= Audit trail, XWIN-NMR		Version 3.5
$$ ##JCAMPDX= 5.01
$$ ##ORIGIN= Bruker BioSpin GmbH
$$ ##OWNER= she
$$ F:/spectra/data/she/nmr/H-F/1/audita.txt
$$ ##AUDIT TRAIL=  $$ (NUMBER, WHEN, WHO, WHERE, WHAT)
(   1,<2023-10-27 16:16:29.07 +0400>,<she>,<DPX200>,
      <created by zg, POWCHK disabled, PULCHK disabled
       configuration hash MD5:
       00 E9 B6 7A A2 85 ED C7 34 08 36 98 17 FE 4E 26
       data hash MD5: 16K
       DE B9 02 25 7A 29 71 3F 7A 57 BB 6A 15 35 83 57>)
$$ ##END=
$$ 
$$ hash MD5
$$ B2 E5 73 26 DE B9 DE C3 52 99 39 02 9D 5B A1 75
##$RELAX= 
##$RELAX= 
##$RELAX= 
##$RELAX= 
##$RELAX= 
##$RELAX= 
$$ Bruker specific parameters
$$ --------------------------
##$DU= <F:/spectra>
##$EXPNO= 1
##$NAME= <H-F>
##$PROCNO= 1
##$TYPE= <nmr>
##$USER= <she>
##$AMP= (0..31)
100 100 100 100 100 100 100 100 100 100 100 100 100 100 100 100 100 100 
100 100 100 100 100 100 100 100 100 100 100 100 100 100 
##$AQSEQ= 0
##$AQ_mod= 1
##$AUNM= <au_zg>
##$AUTOPOS= <>
##$BF1= 200.13
##$BF2= 200.13
##$BF3= 200.13
##$BF4= 200.13
##$BF5= 200.13
##$BF6= 200.13
##$BF7= 200.13
##$BF8= 200.13
##$BYTORDA= 1
##$CFDGTYP= 0
##$CFRGTYP= 5
##$CHEMSTR= <none>
##$CNST= (0..31)
1 1 145 1 1 1 1 1 1 1 1 1 1 1 1 1 1 1 1 1 1 1 1 1 1 1 1 1 1 1 1 1 
##$CPDPRG= <>
##$CPDPRG1= <>
##$CPDPRG2= <>
##$CPDPRG3= <>
##$CPDPRG4= <mlev>
##$CPDPRG5= <mlev>
##$CPDPRG6= <mlev>
##$CPDPRG7= <mlev>
##$CPDPRG8= <mlev>
##$CPDPRGB= <>
##$CPDPRGT= <>
##$D= (0..31)
0 1.2 0 0 0 0 0 0 0 0.06 0 0.03 0 0 0 0 0.0002 0 0 0 0 0 0 0 0 0 0 0 0 
0 0 0 
##$DATE= 1698408988
##$DBL= (0..7)
120 120 120 120 120 120 120 120 
##$DBP= (0..7)
150 150 150 150 150 150 150 150 
##$DBP07= 0
##$DBPNAM0= <>
##$DBPNAM1= <>
##$DBPNAM2= <>
##$DBPNAM3= <>
##$DBPNAM4= <>
##$DBPNAM5= <>
##$DBPNAM6= <>
##$DBPNAM7= <>
##$DBPOAL= (0..7)
0.5 0.5 0.5 0.5 0.5 0.5 0.5 0.5 
##$DBPOFFS= (0..7)
0 0 0 0 0 0 0 0 
##$DE= 6
##$DECBNUC= <off>
##$DECIM= 32
##$DECNUC= <off>
##$DECSTAT= 4
##$DIGMOD= 1
##$DIGTYP= 9
##$DL= (0..7)
0 120 120 120 120 120 120 120 
##$DP= (0..7)
150 150 150 150 150 150 150 150 
##$DP07= 0
##$DPNAME0= <>
##$DPNAME1= <>
##$DPNAME2= <>
##$DPNAME3= <>
##$DPNAME4= <>
##$DPNAME5= <>
##$DPNAME6= <>
##$DPNAME7= <>
##$DPOAL= (0..7)
0.5 0.5 0.5 0.5 0.5 0.5 0.5 0.5 
##$DPOFFS= (0..7)
0 0 0 0 0 0 0 0 
##$DQDMODE= 0
##$DR= 18
##$DS= 0
##$DSLIST= <SSSSSSSSSSSSSSS>
##$DSPFIRM= 0
$$ [...]
##$SUBNAM2= <"">
##$SUBNAM3= <"">
##$SUBNAM4= <"">
##$SUBNAM5= <"">
##$SUBNAM6= <"">
##$SUBNAM7= <"">
##$SUBNAM8= <"">
##$SUBNAM9= <"">
##$SW= 18.05172834244
##$SWIBOX= (0..15)
0 0 2 0 0 0 0 0 0 0 0 0 0 0 0 0 
##$SW_h= 3612.71676300578
##$TD= 16384
##$TD0= 1
##$TE= 0
##$TE2= 300
##$TE3= 300
##$TEG= 300
##$TL= (0..7)
0 120 120 120 120 120 120 120 
##$TP= (0..7)
150 150 150 150 150 150 150 150 
##$TP07= 0
##$TPNAME0= <>
##$TPNAME1= <>
##$TPNAME2= <>
##$TPNAME3= <>
##$TPNAME4= <>
##$TPNAME5= <>
##$TPNAME6= <>
##$TPNAME7= <>
##$TPOAL= (0..7)
0.5 0.5 0.5 0.5 0.5 0.5 0.5 0.5 
##$TPOFFS= (0..7)
0 0 0 0 0 0 0 0 
##$TUNHIN= 0
##$TUNHOUT= 0
##$TUNXOUT= 0
##$USERA1= <user>
##$USERA2= <user>
##$USERA3= <user>
##$USERA4= <user>
##$USERA5= <user>
##$V9= 5
##$VALIST= <valist>
##$VCLIST= <CCCCCCCCCCCCCCC>
##$VD= 0
##$VDLIST= <DDDDDDDDDDDDDDD>
##$VPLIST= <PPPPPPPPPPPPPPP>
##$VTLIST= <TTTTTTTTTTTTTTT>
##$WBST= 1024
##$WBSW= 4
##$XGAIN= (0..3)
0 0 0 0 
##$XL= 0
##$YL= 0
##$YMAX_a= 35473
##$YMIN_a= -41790
##$ZGOPTNS= <>
##$ZL1= 120
##$ZL2= 120
##$ZL3= 120
##$ZL4= 120
##$ABSF1= 10
##$ABSF2= 0
##$ABSG= 5
##$ABSL= 3
##$ALPHA= 0
##$AQORDER= 0
##$ASSFAC= 0
##$ASSFACI= 0
##$ASSFACX= 0
##$ASSWID= 0
##$AUNMP= <proc_1d>
##$AZFE= 0.1
##$AZFW= 0.1
##$BCFW= 1
##$BC_mod= 2
##$BYTORDP= 1
##$COROFFS= 0
##$CY= 11.3945322036743
##$DATMOD= 1
##$DC= 2
##$DFILT= <>
##$DTYPP= 0
##$F1P= 15.7292609196834
##$F2P= 12.9074282941183
##$FCOR= 0.5
##$FTSIZE= 0
##$FT_mod= 4
##$GAMMA= 1
##$GB= 0.15
##$INTBC= 1
##$INTSCL= 1
##$ISEN= 128
##$LB= 0.24
##$LEV0= 0
##$LPBIN= 0
##$MAXI= 10000
##$MC2= 0
##$MEAN= 0
##$ME_mod= 0
##$MI= 1.114404
##$NCOEF= 0
##$NC_proc= 0
##$NLEV= 6
##$NOISF1= 3.799351
##$NOISF2= 2.8
##$NSP= 1
##$NTH_PI= 0
##$NZP= 0
##$OFFSET= 15.70392
##$PC= 1
##$PHC0= -23888.18
##$PHC1= 31.05273
##$PH_mod= 1
##$PKNL= yes
##$PPARMOD= 0
##$PSCAL= 0
##$PSIGN= 0
##$REVERSE= no
##$SF= 200.130013532006
##$SI= 16384
##$SIGF1= 3
##$SIGF2= 2
##$SINO= 400
##$SIOLD= 16384
##$SREGLST= <1H.CDCl3>
##$SSB= 0
##$STSI= 0
##$STSR= 0
##$SW_p= 3612.71676300578
##$SYMM= 0
##$S_DEV= 0
##$TDeff= 0
##$TDoff= 0
##$TI= <>
##$TILT= no
##$TM1= 0
##$TM2= 0
##$TOPLEV= 0
##$USERP1= <user>
##$USERP2= <user>
##$USERP3= <user>
##$USERP4= <user>
##$USERP5= <user>
##$WDW= 1
##$XDIM= 8192
##$YMAX_p= 0
##$YMIN_p= 0
$$ End of Bruker specific parameters
$$ ---------------------------------
##NTUPLES= NMR FID
##VAR_NAME=  TIME,          FID/REAL,        FID/IMAG
##SYMBOL=    X,             R,               I
##VAR_TYPE=  INDEPENDENT,   DEPENDENT,       DEPENDENT
##VAR_FORM=  AFFN,          ASDF,            ASDF
##VAR_DIM=   8192,          8192,            8192
##UNITS=     SECONDS,       ARBITRARY UNITS, ARBITRARY UNITS
##FACTOR=    0.0002768,     1,               1
##FIRST=     0,             0,               0
##LAST=      2.2672688,     0,               0
##MIN=       0,             -41790,          0
##MAX=       2.2672688,     35473,           0
$$ Real data points
##PAGE= N=1
##DATA TABLE= (X++(R..R)), XYDATA
$$ [...]
1992A216l81j157j076l15N51J083J287M18m44n37j234q97MN94J207O47O14j23
$$ 1216 835 -322 -1398 -1713 -1162 -79 1208 1626 1182 645 -589 -1486 -1482 -888 319 966 1580 1457
2010A457q41q78j108p5O03J038P71Q80m21j075j203p72Q3Q83P21J221O1k22o88
$$ 1457 616 -262 -1370 -1445 -842 196 967 1847 1426 351 -852 -1624 -1541 -658 63 1284 1345 1123 435
2029D35j171n73k56Q90Q72J212J17n51r00r68o93K13Q00J014Q26K41m27r70j318
$$ 435 -736 -1309 -1565 -675 197 1409 1526 975 75 -893 -1586 -1373 -573 441 1267 1508 1081 111 -1207
2048a207k44J86N71J220N81N83q53o94j027o19l2J285O28R76q2o28p61q65m49
$$ -1207 -1451 -1265 -694 526 1107 1690 837 143 -884 -1503 -1535 -250 378 1354 1272 644 -117 -982 -1431
2067a431J94P47J133R13j51p03q39j034l92K37J370J003M51Q3j013j164m33l62
$$ -1431 -1237 -490 643 1556 1405 702 -137 -1171 -1563 -1326 44 1047 1498 1581 568 -596 -1029 -1391
2085a391K54P67J038P95j92o51j129m80n10N48Q27J011P47m48m80r21r72l34Q07
$$ -1391 -1137 -370 668 1463 1271 620 -509 -989 -1499 -951 -124 887 1634 1186 706 -215 -1187 -1521 -714
2104g14Q87Q44N24j96j005j235l86l94P90J196O37M59k21q73q91q99J24L96J373
$$ -714 173 1017 1541 1345 340 -895 -1281 -1675 -885 311 948 1407 1186 313 -578 -1477 -1353 -957 416
2123D16P23K58m10r61o97o08j6O82P96J006P6l43o05j121n42P4P88R07P85K46
$$ 416 1139 1397 987 26 -671 -1279 -1295 -613 183 1189 1265 922 317 -804 -1346 -1272 -484 423 1208 1454
2143A454k61q78j141m75J95N87J404M05j66l18q93q50n50J06P83R62O02L40n74
$$ 1454 1193 315 -826 -1301 -1106 -519 885 1290 1124 806 -87 -937 -1487 -1381 -598 364 966 1306 732
2162G32j046p32m48K40R30R51P60k67n87o16j024k33J69J155O87N14j15l85j076
$$ 732 -314 -1046 -1494 -1254 -324 627 1387 1120 533 -83 -1107 -1340 -1171 -16 671 1185 1070 685 -391
2181c91p97k30L67Q71J234M39l39p31n43p59o08O00P61J092K24q1p98p13q42k8
$$ -391 -1188 -1418 -1051 -180 1054 1493 1154 423 -120 -879 -1487 -887 -126 966 1190 1109 311 -402 -1244 -1272
2201a272N77N84J018L83j99p12o40r05M9K81J029P90N33o12o70r20n23L3O82R48
$$ -1272 -695 -111 907 1290 1091 379 -261 -1166 -1117 -836 193 983 1516 904 234 -686 -1209 -1176 -494 454
2221D54N39K41k87r93o23o21r4P72R30M04P40n77p55q83o28J47P34Q80N02M16
$$ 454 993 1234 947 -46 -669 -1290 -1384 -612 318 722 1462 885 130 -753 -1381 -1234 -500 380 882 1298
2241A298o59o81p86m93J61O38R19P45j6j83j115q00k35J10O25R32N89M26r44o28
$$ 1298 639 -42 -828 -1321 -1160 -522 397 1142 1126 943 -172 -972 -1207 -1097 -472 460 1049 1475 531 -97
2261i7q36l82J2R79R54M63J11m14j234n20k30K1P82R95K16L54m62r51n24j33k4
$$ -97 -933 -1315 -1303 -324 630 1093 1204 790 -444 -964 -1194 -1173 -391 604 820 1174 712 -239 -763 -896 -920
2282i20Q25P55M64j05o17r57n29p3M16R79L25L73j01m63r54p65r6N93J170M83
$$ -920 -95 660 1124 1019 402 -555 -1084 -1157 -741 238 563 936 835 372 -582 -1347 -1443 -850 320 803
2302H03K09Np04r90n03J77M11R31M77q7Mn55p66m95J47K41Q66P58M35l57r83n94
$$ 803 1012 1017 313 -677 -1180 -1003 -592 339 816 729 733 178 -588 -1083 -936 -695 171 929 1364 1007 24 -570
2324e70p17M25N59M97Q05J93k96p12p27p18K88N44P67M28m4R9o18r46k08P5M88
$$ -570 -1287 -862 -303 194 999 1192 896 184 -543 -1261 -973 -429 338 766 722 821 203 -743 -951 -876 -388
2345c88O18P68J73o65m64n84n80L16O45O31N96ro44l17r47N9m7O40N26M38J97
$$ -388 230 998 1171 506 42 -542 -1122 -806 -161 470 1066 1057 413 96 -851 -792 -839 -199 327 765 962
2366I62m61n83p87k19K78O20J073p5J87p04n38o38O4J93M56P43L59j07p26m27
$$ 962 501 -82 -869 -1088 -810 -190 883 808 995 291 -247 -885 -821 -628 -172 571 930 823 97 -330
2386c30p38M8L42Q89M94J34L11q76o76n77j00K78P96J005K8l15o03l23o99q6L98
$$ -330 -1068 -1020 -678 211 705 839 1150 274 -402 -979 -1079 -801 -5 1000 1028 713 110 -213 -912 -998 -600
2407f00N64O82O2j00m66p77l44k7N05Q93K12K98k10n29n53o77J03Q01K40R49l26
$$ -600 -36 646 708 608 142 -635 -979 -1006 -501 392 604 902 692 163 -390 -1067 -964 -163 77 1026 700
2428G00j67m76o07m93k21P96Q01P13M9n10p33n61m03M48N16O13L82j29po55r36
$$ 700 533 57 -550 -1043 -1264 -468 333 1046 1095 585 -148 -709 -1112 -664 -148 465 847 718 711 56 -880
2449h80j94K09M94P64O95K48p54j081k78l43L34N60P07M23q9j73q24m37j75J99
$$ -880 -1074 -865 -371 393 1088 1336 582 -499 -777 -1120 -786 -226 481 904 815 642 -182 -619 -794 -595
2469e95L62Q87M26j40n00q38l70l55N16N47O56M59m46k87o10l83l60N99N73O66
$$ -595 -233 654 1080 940 440 -398 -768 -1123 -607 -60 596 1055 609 322 -288 -671 -1031 -432 141 807
2489H07J4N6n40p29l82P5Q4O93M59L48q5p25m30l23k91M45Q28O93J22n91m59l82
$$ 807 821 877 337 -392 -774 -699 -615 78 537 885 800 75 -355 -678 -969 -524 304 997 1119 528 69 -313
2511c13k61l91L76P95M64R1l03k47p89m73L93M42N56N41j33p3q74j99m21R7J60
$$ -313 -574 -965 -589 206 670 761 458 211 -578 -1051 -658 -216 340 881 748 675 -199 -398 -819 -722 -562
2532e62R88L09P5k59m71p84r5M4N28P44K09k4k70m40o12l15L94L94N70K45J99
$$ -562 426 735 810 551 80 -704 -799 -755 -227 517 726 702 432 -8 -620 -935 -541 -147 423 668 867
2553H67m02n27p34k3L38K04P19P2J92k79n36l19m57K81O37L04N50m6o48l32p67
$$ 867 465 -62 -796 -819 -481 -277 442 514 706 427 -109 -428 -885 -604 33 337 887 841 193 -139 -906
2574i06J15lO46Q45N9m2l83n12m32l97M36O84M07L87j68n73o57o44K27M98K93
$$ -906 -791 -794 -148 697 756 714 331 -181 -613 -1010 -574 110 517 904 736 163 -494 -1138 -911 -413 -120
2595a20N89M87k80l44o29o38J81N08L36L97M20l56l23l64p23K85K27M38N89p7
$$ -120 469 956 676 332 -297 -935 -754 -246 90 487 907 551 228 -136 -859 -574 -347 91 680 603
2615F03p4n47n14k39M9K91P38M99j51j29k78o27m77j83O77M90M06K51n05l90o17
$$ 603 529 -18 -532 -771 -722 -431 307 806 655 526 248 -379 -856 -1039 -362 128 534 785 280 -110 -727
2636g27k37N35J92Q85J70k0n80k39n04m70L52O61O74J94j52k95n48m16l57L69
$$ -727 -964 -429 -237 648 818 798 218 -21 -525 -995 -643 18 692 886 734 439 -109 -525 -882 -513
2656e13N48N60J52j32l61m49k09l48L60M26L04M25k05k67m44n55j35L51M71N32
$$ -513 35 595 747 615 254 -195 -404 -752 -392 34 338 763 558 291 -153 -708 -843 -492 -21 511
2676E11J23K57n45o96k35k36M59M02M79K51r6n24m91l94J01J15N17P39Q6j10o35
$$ 511 634 891 346 -350 -585 -821 -362 40 519 770 674 150 -341 -735 -634 -519 -2 737 823 713 78
2697G8n14k53qJ25L42Q89J42k63l84o59j95R7J81O78K86L0O5o50l21j98k94N88
$$ 78 -436 -689 -697 -572 -230 659 801 538 154 -505 -700 -603 -422 256 542 572 637 -13 -334 -532 -826 -238
2719b38L17L79j7j01l72j86k92p1M33L94M08K12o19k33l83l33J55L53N60L1J82
$$ -238 79 458 441 340 -32 -218 -510 -581 -148 246 654 866 247 14 -369 -702 -547 -194 366 397 579
2740E79j18m93n89k43K37L97M78M91j27n18k70n12K1K89J04M97M98l19m5m66j62
$$ 579 461 -32 -621 -864 -627 -230 248 739 612 94 -176 -688 -667 -378 -274 223 721 402 357 -109 -271
2761b71k21J3L96O26J03j27m6o04m65k82J94N58O37J28J39o62n66k16j26K92N38
$$ -271 -492 -479 -83 543 646 519 473 -131 -596 -878 -684 -126 511 639 778 116 -450 -666 -792 -500 38
2782C8L40K48j36k70n22l76P1J21M73O79j72j54J3q38l16L3K90L63N02J03km05
$$ 38 378 626 490 220 -302 -678 -607 -486 -13 666 494 340 353 -485 -801 -768 -478 -115 387 490 488 83
2804H3l01l89P5J48N29L62J75j79l12l61k67mM46K52K53K21j20o12n54j8j45L40
$$ 83 -218 -607 -532 -384 145 507 682 503 191 -170 -437 -441 5 257 510 731 611 -1 -555 -573 -718 -378
2826c78M15O46k8k58k23p69N4Q2K68L18N21k06K1l19m25l64L67L28J39J57j14
$$ -378 37 683 655 397 174 -595 -541 -459 -191 127 648 442 463 144 -281 -645 -278 50 189 346 232
2847B32O3k83m26l52K09M59O32J90r8n51k53k53k18J41M76N00n5K94m52o24K9
$$ 232 295 12 -414 -766 -557 -98 534 724 626 75 -178 -431 -649 -508 -32 468 413 707 255 -369 -340
2868c40k35N3L11N33L56M9n94m49k80j42M06K87K81M65l29j99j55o33n4O96k8
$$ -340 -575 -522 -211 322 678 727 133 -316 -596 -738 -332 -45 236 701 372 173 18 -615 -669 27 -1
2889aM26J62j25k51l54l27j74J66O04L80P2m6k51l65n77N9K26M47L04L89m52k02
$$ -1 425 587 462 211 -143 -470 -644 -478 126 506 578 532 281 -84 -661 -602 -376 71 375 764 312 110
2911A10n69j0K82j48O51L28K30n56l86L7l88J02J90L54J35L02l87k23l80j50j84
$$ 110 -459 -469 -187 -335 316 644 874 318 -68 -31 -419 -317 -127 227 362 664 277 54 -326 -476 -660
2932f60M70N90J31J91j87m42l08k69K76K44L42L59P8n85l90k43j76k6O35M07P9
$$ -660 -190 400 531 722 535 93 -215 -484 -208 36 378 737 815 230 -160 -403 -579 -605 30 437 516
2953E16Q9l19j81o28j39K39M61l9L51J63l21j51l84j05J01M54R7J60J68l22j91
$$ 516 605 286 105 -523 -662 -423 38 -1 350 513 192 41 -343 -448 -347 107 204 364 532 210 19
2974A9o32k2J69M51M61J59J6m27l47m41K06P5M83n6N20k86k00l27k38j10o1O77
$$ 19 -613 -635 -466 -15 446 605 621 194 -153 -594 -388 -313 170 114 634 348 148 -179 -417 -527 -588 89
2996H9L73j62M8k82m57n3j56M00L18J04K57j01l38o25Q7J83K72M5K79M65m42l7
$$ 89 462 300 348 66 -391 -444 -600 -200 118 222 479 378 40 -585 -498 -315 -43 2 281 746 304 267
3018B67n46k06k6M17K96P4J36k01j86l65j57p0M17M99J39n1k00m49j00q0q9M38
$$ 267 -279 -485 -511 -94 202 276 412 211 25 -340 -497 -567 -150 349 488 437 237 -212 -312 -392 -481 -43
3040d3L98J77P8k64m23k19j34J94O3L74N4K20j18o06j02l12J55M60M55J3J45j40
$$ -43 355 532 610 346 -77 -296 -430 -236 -173 201 255 475 357 -249 -351 -663 -508 -48 407 420 565 425
3062D25n43m90L47J2j20N39L41j18l64k71m6m7M0N17J2L04k6j07n52m65K18m4
$$ 425 -118 -608 -261 -249 -369 170 511 393 29 -242 -288 -335 -295 222 234 538 512 405 -147 -612 -394 -438
3084d38O06o4R7Mj80m02j87L56J15L35pJ92n5k97l89j15j15L32J35M73J06j12
$$ -438 168 104 201 205 25 -377 -564 -208 -93 242 235 427 372 75 -314 -429 -544 -212 -77 396 502 390
3106C90l47k19j04l75M34J23K14K14j53l73j20j63k3L80L17K26j12R7n73k08k36
$$ 390 43 -176 -280 -655 -221 -98 116 330 177 -196 -316 -479 -502 -122 195 421 309 406 -167 -375 -611
3127f11L57J25K37L92j01j89k99j77q3j99L03L03Q3K88m54K54n80J41m2J56K85
$$ -611 -254 -129 108 500 399 210 -89 -266 -349 -548 -245 58 141 429 -25 229 -351 -210 -252 -96 189
3148A89K67J41o20k11K0k56N2K67L84M10q3k93m66j47oK91Q6M4L69Q6m33N2n29
$$ 189 456 597 -23 -234 -214 -470 -418 -151 233 643 560 267 -199 -346 -352 -61 25 69 438 524 91 143 -386
3171c86J41O4J42L47j44J20M3o13j20j06K67J61M76n7K15k84n21j24k36N83K82
$$ -386 -245 -181 -39 308 164 284 327 -286 -406 -512 -245 -84 392 335 550 266 -255 -379 -615 -32 250
3192B50o7l8L47j60p95K17j36J82j02K79M06q7l23o4k63l13L98M00N0K24j22k44
$$ 250 183 145 492 332 -463 -246 -382 -200 -302 -23 383 296 -27 -91 -354 -667 -269 131 181 405 283 39
3214C9k39k65R3L61J74o1N25k29m01k72N9k7J83P2J51K48j26j26l81k26N2L00
$$ 39 -200 -465 -372 -11 163 102 627 398 -3 -275 -216 -243 -60 12 163 411 285 159 -222 -448 -396 -96
3236i6K80J80j17j60J40l80j43J6J57L10N29j64m78k47j97J67L7K09K13L15j37
$$ -96 184 364 247 87 227 -153 -296 -280 -123 187 716 552 74 -173 -370 -203 -166 43 256 571 434
3257D34l10l29j99j21J96P4P07j31m2p1l87p1j09nL61K11K8J58m66Rk17k69K97
$$ 434 124 -205 -404 -525 -329 -255 452 321 279 208 -179 -250 -359 -364 -3 208 236 394 -72 -63 -280 -549 -252
3280b52M38O1J74K9m31k05jj35j30O28J64j87J05N4m46r0lm1M18k7k7q8J3j33
$$ -252 186 247 421 450 19 -186 -187 -322 -452 176 340 153 258 312 -134 -224 -227 -268 150 123 96 8 21 -112
3304a12k58j06J74N23N5Pjk81k55l5n7J95J54N28r8l16L5l12j64J05K27K54M1
$$ -112 -370 -476 -302 221 276 283 282 1 -254 -289 -346 -151 3 531 433 117 152 -160 -324 -219 8 262 303
3327C03K27j41o54n5P6j05L98J19P7J68p7j95n29j12K92k1O52p1j94j3k70J03
$$ 303 530 389 -265 -320 -244 -349 49 168 245 413 336 141 -388 -500 -208 -229 423 352 158 145 -125 -22
3349b2l16O1J66L08R5j05j2j13l04q8K4K48L42J77q8L5n58k54K23k17L75K46q4
$$ -22 -338 -277 -111 197 292 187 175 62 -242 -330 -306 -58 284 461 373 408 -150 -404 -181 -398 -23 223 139
3372A39J81r6l08l64K73J93j6J59p2j74n5r3j34r9L61r7J59J3L17k98j32j64m4
$$ 139 320 224 -84 -448 -175 18 2 161 89 -85 -140 -233 -367 -466 -105 -202 -43 -30 287 -11 -143 -307 -351
3395c51L07LL63K30l88k56L8m42J39K64L19m6n6L4l15q6J9N7l3P8L37n9J45j50
$$ -351 -44 -41 322 552 164 -92 -54 -496 -357 -93 226 180 124 158 -157 -243 -224 -167 -200 -122 215 156 301 151
3419A51l79J11N3j60K86K27N0k83k56k02K69N4n6M35p5K9r6m09J03l93L17N2M82
$$ 151 -228 -117 -64 -224 62 289 339 56 -200 -402 -133 -79 -135 300 225 254 158 -251 -148 -541 -224 -172 310
3442C10j42K05j60l32j73k3O3K07l9K55J12o3k77j01l11K71L30j53M02j42R8k41
$$ 310 168 373 213 -119 -292 -315 -252 -45 -84 171 283 220 -57 -158 -469 -198 132 -21 381 239 337 96
3464I6l56K13k70J38M31K18l05k6k42j12k80J52M98k5J53k40Ml74L69m11N14j81
$$ 96 -260 -47 -317 -179 252 470 165 139 -103 -215 -495 -343 155 130 283 43 47 -327 42 -369 145 -36
3486c6K92K55j69k13k95K3j53o7O12J43P1Jn40j88k4j41M92O6Q5nN2m48l8j33
$$ -36 256 511 342 129 -166 -143 -296 -363 249 392 463 464 -76 -264 -288 -429 63 129 214 209 261 -187 -225 -358
3510c58K97n3K75j92J42M33n96o0j29r7J58K48J5K89k38J07n05j31J24K44R7J77
$$ -358 -61 -114 161 -31 111 544 -52 -112 -241 -338 -180 68 83 372 134 241 -264 -395 -271 -27 70 247
3532B47n2j43l6j41l35K67N2L08M9j00O7J8n02J86j22J01K93J46k55rk12j29L29
$$ 247 195 52 16 -125 -460 -193 -141 167 216 116 183 201 -301 -115 -237 -136 157 303 48 39 -173 -302 27
3555B7j77o8M09j09O0k69J39j87j47j54N51Q6k9K52l04J05m77j40L45l1L05Q1
$$ 27 -150 -218 191 82 142 -127 12 -175 -322 -476 75 161 132 384 80 185 -292 -432 -87 -118 187 268
3577B68j28M9k66O5l14K09K69k95N31rl50k91M9rj31L60j1K07j36J18L5k71k83
$$ 268 140 189 -77 -12 -326 -117 152 -143 388 379 29 -262 -213 -222 -353 7 -4 203 67 185 220 -51 -334
3600c34M06n3J42n4L2j07l5n58N54r6K73R0Q1j87p3m17K05j58J47J44K91nO8k31
$$ -334 72 19 161 107 139 32 -3 -561 -7 -103 170 260 341 154 81 -336 -131 -289 -142 2 293 288 356 125
3624A25n69J80K7L81j62J72j71J91l26K6j33J37K14j36J35K02k30p8m5k18K48
$$ 125 -444 -264 -237 144 -18 154 -17 174 -152 -126 -259 -122 92 -44 91 293 63 -15 -60 -278 -30
3645c0J35j17K07N5k81J52m06J75j85J03M20N8r6j39p5j26%J2R0L79q6M0k17k70
$$ -30 105 -12 195 250 -31 121 -285 -110 -295 -192 228 286 190 51 -24 -150 -150 -138 -48 331 245 285 68 -202
3669b02m4j3o7L87j02K14M6l12J87k48M7lK81n1P4L4l42j05j61k4M77q4J8J77
$$ -202 -246 -259 -326 61 -41 173 219 -93 94 -154 -107 -110 171 120 194 228 -114 -219 -380 -404 73 -11 7 184
3693A84j26jQ6j88j12j03L98M8P0r9m53j15Q3L36j6N8J31M6o7O6m40J00q7J56
$$ 184 58 57 143 -45 -157 -260 138 186 256 157 -296 -411 -328 8 -8 50 181 227 160 226 -214 -114 -201 -45
3717d5n0M15j98k48n8Oj4K5K75q0J26n3m6j05P3k39N2J53j57M78k9l75j11q7K19
$$ -45 -95 320 122 -126 -184 -178 -192 -167 108 28 154 101 55 -50 23 -216 -164 -11 -168 310 281 -94 -205 -292 -73
3742g3k63O3L35J96j60o4j65j77K9J81N5r7K73j24R2o6k03J6O9m0K49P6p6j30
$$ -73 -336 -273 62 258 98 34 -131 -308 -279 -98 -43 -140 133 9 101 35 -168 -152 -83 -123 126 202 126 -4
3766drj0p4j2J24J22j03P0J2l81k0Q0jJ88J81p0k4J48l06J5j04J83m0K6J65m9
$$ -4 -13 -23 -97 -109 15 137 34 104 116 -265 -285 -205 -206 -18 163 93 69 217 -89 -74 -178 5 -35 -9 156 107
3792A07k41K10m62L47o7K71k3K2l1o4j6l10K20J49k5P5K34m86J90r3j02J2MpK12
$$ 107 -134 76 -386 -39 -106 165 142 164 133 69 53 -257 -37 112 87 162 396 -90 100 7 -95 -83 -79 -86 126
3817A26o8P2N8l11N5k51K89j01L96j48N7l04J15r8N5J00M6O1QJ82k94l90J66J36
$$ 126 58 130 188 -123 -68 -319 -30 -131 265 117 174 -130 -15 -113 -58 42 88 149 157 339 45 -345 -179 -43
3841d3J85K4O8J2l56P2L4n4j05K49K37k82N7j13O5k08k43L12J08R6ln6M6k32k7
$$ -43 142 166 234 246 -110 -38 -4 -58 -163 86 323 41 98 -15 50 -158 -401 -89 19 115 112 56 102 -130 -157
3866a57Q5j37J90O6o0K97m20K10p6k75J30L05pp5L15l69j15J09j14K24j64K67
$$ -157 -72 -209 -19 47 -13 284 -136 74 -2 -277 -147 158 151 76 391 22 -93 16 -98 126 -38 229
3888B29J0k88J37k52j30K47l6J50j32K89k08K11k97r0J25o7K5K15j8j16r7J41
$$ 229 239 -49 88 -164 -294 -47 -83 67 -65 224 16 227 -70 -160 -35 -102 -77 138 120 4 -93 48
3910D8J9j99N3jJ72l8J34m29J41j13K65j60Q7j2J28kk4K4m98K80r1L77j26J69
$$ 48 67 -132 -79 -80 92 54 188 -241 -100 -213 52 -108 -21 -33 95 93 69 93 -405 -125 -216 161 35 204
3934B04l60J79J36j98j62M8L30l4j64K25l36J14M0l47L18j30L63k93N7K01l19
$$ 204 -156 23 159 -39 -201 -153 177 143 -21 204 -132 -18 22 -325 -7 -137 226 -67 -10 191 -128
3955a28L1K63L7n5L16k47oj54j81O6N3oL19o0k44k06J44m6m2j60K99J67R8k3l
$$ -128 -97 166 203 148 464 217 211 57 -124 -58 -5 -11 308 248 4 -202 -58 -104 -146 -306 -7 160 258 235 232
3980B32n31M6K06j45O44l47L9N4l71J3L47k77J17r9L09K45n10n9J37j23q7N3R5
$$ 232 -299 -253 -47 -192 452 105 144 198 -173 -160 187 -90 27 -72 237 482 -28 -87 50 -73 -160 -107 -12
4003a2K96j36k06Q4L0p1L3j97J63P7R2j63k6j08N9L8q7J98Q2j8k1mj87j59K22
$$ -12 284 148 -58 26 56 -15 18 -179 -16 61 153 -10 -36 -144 -85 -47 -134 64 146 128 107 103 -84 -243 -21
4028b1j25R3J52L11p41K48o7P0k03L46j37K05j10K0j10K24k31j75L10r8J97k23
$$ -21 -146 -53 99 410 -331 -83 -150 -80 -283 63 -74 131 21 41 -69 155 -76 -251 59 -39 158 -65
4050f5K00j03j67O2o6l4J45K51j06j41J21l83K17j02o3L13j00K85j94l66J05K40
$$ -65 135 32 -135 -73 -139 -173 -28 223 117 -24 97 -286 -69 -171 -234 79 -21 264 70 -296 -191 49
4072D9j21K68j49J25p9j84Mk8o5K87J98m57K92j90N0Q3l24J2J58O2M18l80K57
$$ 49 -72 196 47 172 93 -91 -87 -115 -180 107 305 -152 140 -50 0 83 -241 -229 -71 -9 409 29 286
4095B86k98J39l76J45J49K2q0J54n9q9K14k55K4J05n8K45j0N4m11m2QP7k0j9N3
$$ 286 -12 127 -249 -104 45 67 -13 141 82 -7 207 -48 -24 81 23 268 258 312 -99 -141 -133 -56 -76 -95 -42
4120d2m4M2K26l33j15K20j42L88j81r3J77mq3j15K0k51M87m6K9j46j13l1j27M2
$$ -42 -86 -44 182 -151 -266 -46 -188 200 19 -74 103 99 16 -99 -79 -330 157 111 140 -6 -119 -150 -277 -235
4144b35j10M31k34K13lr6j66o2L97j65K69l57J89K17m34J26j40N23l39k0o1j5
$$ -235 -345 86 -148 65 62 -34 -200 -262 135 -30 239 -118 71 288 -146 -20 -160 363 24 4 -57 -72
4166g2l4K10j75j55J23K14J6j04j69J78j4r1l7j29P2L68k0j35J0j93j93J66rM03
$$ -72 -106 104 -71 -226 -103 111 127 23 -146 32 18 -73 -110 -239 -167 201 181 46 56 -137 -330 -164 -173 230
4190B30j61O2rj65k85J47K02m49J26O19l07j13K15J92l17j96M95j22j33j32QL64
$$ 230 69 131 122 -43 -328 -181 21 -428 -302 317 10 -103 112 304 -13 -209 286 164 31 -101 -93 271
4212B71k17o2J35j69KR8o0K09k28J36l20N8lK9J99J23k97K37j44j27lk1j94L32
$$ 271 54 -8 127 -42 -40 58 -2 207 -21 115 -205 -147 -150 -121 78 201 -96 141 -3 -130 -133 -154 -348 -16
4236a6Q2k6j03J54l23J59Q1M2n5k46M13k88J66l13L07J53k96J47pJ5l3l9M9Q7
$$ -16 66 40 -63 91 -232 -73 8 50 -5 -251 162 -126 40 -273 34 187 -109 38 31 46 13 -26 23 110
4260A10l34K75L1k8m8J19k16N2J61k85J93n6J86j15P7j71j03m8J70L9L1R4m7M6
$$ 110 -224 51 82 54 6 125 -91 -39 122 -163 30 -26 160 45 122 -49 -152 -200 -30 9 40 134 87 133
4284A33j51p8M5O4j63K45n5M4k20R3J2r2J13J13L6j3m05K68l3o8p5K47k6Q9j40
$$ 133 -18 -96 -51 13 -150 95 40 84 -136 -43 -31 -123 -10 103 139 126 -279 -11 -44 -112 -187 60 34 123 -17
4309a7J31k02j13K78j40p5M9J42j56OP9j9k13J31K03j14l5J21o4j48K30m1r0n6
$$ -17 114 -88 -201 77 -63 -138 -89 53 -103 -97 -18 -37 -250 -119 84 -30 -65 56 -8 -156 74 33 -57 -113
4333a13J19p5J94k26M1p3q6N8JR6J67qk29J99k1k8J14j41J69k50p4K69k18J33
$$ -113 6 -69 125 -101 -60 -133 -219 -161 -160 -64 103 95 -134 65 44 16 130 -11 158 -92 -166 103 -115 18
4357A8k3m3p3J4L30k71r7J14J3j04J32M4Q7j56K7j4K11q5l46K38j12J29o5O5r8
$$ 18 -5 -48 -121 -107 223 -48 -145 -31 -18 -122 10 54 141 -15 12 -2 209 124 -222 16 -96 33 -32 33 -65
4382f5J81j78m0O2j75L32j73q5K56k81J06N6k26J03J19l3J38k7k56N6J74p8P1
$$ -65 116 -62 -102 -40 -215 117 -56 -141 115 -166 -60 -4 -230 -127 -8 -41 97 70 -186 -130 44 -34 37
4405C7rL06k16q9j51q6P9nP6k4L60k71o1J44k62L8J45N2j90K02m6Q7j84j40R2
$$ 37 28 334 118 29 -122 -208 -129 -134 -58 -82 278 7 -54 90 -172 -134 11 63 -127 75 29 116 -68 -208 -116
4430a16J54K3K1n9J2j32n7K47q5K7L9k10K94m8l31J08q5J47K26q6k0R4j72r6L03
$$ -116 38 61 82 23 35 -97 -154 93 8 35 74 -136 158 110 -221 -113 -198 -51 175 89 69 163 -9 -105 198
4455A98j08j95k9J92j2p6R9J24m08J41L12k19L34m30n8L13k37kJ90j73K55oJ61
$$ 198 90 -105 -134 58 46 -30 69 193 -215 -74 238 19 353 -77 -135 178 -59 -61 129 -44 211 205 366
4478C66m01k70K64J19o7O8J31j27O3k62n8P6J2P9M1j42R7K23l69J19q0J33p7J39
$$ 366 -35 -305 -41 78 11 79 210 83 146 -116 -174 -98 -86 -7 34 -108 -11 212 -157 -38 -118 15 -62 77
4502G7p8J60j61M6p0J12k84J65j59J10J56j10K61L2m93L37L4M2nj66K51k62J13
$$ 77 -1 159 -2 44 -26 86 -198 -33 -192 -82 74 -36 225 257 -236 101 135 177 172 6 257 -5 108
4525A08l38J90r9K16k27K38m3N9j65K62p7j7p5o2J4j10k7M21p4m77N6J48o8K41
$$ 108 -230 -40 -139 77 -150 88 45 104 -61 201 124 107 32 -30 -16 -126 -153 268 194 -283 -227 -79 -147 94
4549I4j68M7k80P3K65l8R0P1j5j90M4j31J25J46j84j37N27j49l74n5L30k1l60
$$ 94 -74 -27 -307 -234 31 -7 83 154 139 -51 -7 -138 -13 133 -51 -188 339 190 -184 -239 91 70 -290
4572b90L10L7p5J1m4p3j40J07n5L11j24J88l24j12L97k98J44M6l19L33n8J87r3
$$ -290 20 57 -18 -7 -51 -124 -264 -157 -212 99 -25 163 -161 -273 124 -174 -30 16 -303 30 -28 159 66
4595F6Q0j15J13l56K32J12r7R0j35O6n1k02K37j69O8K4K46k84K34k86J02m7J2
$$ 66 146 31 144 -212 20 132 35 125 -10 56 5 -197 40 -129 -61 -37 209 -75 159 -127 -25 -72 -60
4618f0K29j34P8k38K09o5l20K63R2k64K2K20k1M7p4J04k5l67J97J52p4j4N0P6
$$ -60 169 35 113 -125 84 19 -301 -38 54 -210 -188 32 11 58 -16 88 63 -304 -107 45 -29 -43 7 83
4642H3j72o6K40j06K23j2J9j81q0r1K58l47J00J04J41j90kP3j21M14k41r8R0j45
$$ 83 -89 -155 85 -21 202 190 209 28 -52 -143 115 -232 -132 -28 113 -77 -79 -6 -127 287 46 -52 38 -107
4666a07J46o1n4L9J44j05k0J25k10J34q4R7j24J45l6J3j17M93l73r9J24J34l2
$$ -107 39 -22 -76 -37 107 2 -18 107 -103 31 -53 44 -80 65 29 42 -75 418 45 -54 70 204 172
4689A72j73j2q3L3j38O9j48J49p5K49l5k39R5J05N4J0j71K36m1N5r2r3J16jQ6
$$ 172 -1 -13 -96 -63 -201 -132 -280 -131 -206 43 8 -231 -136 -31 23 33 -138 98 57 112 20 -73 43 42 128
4714A28O5k2k8m9k32J13j01n2l0K56k5l5J72j78j39J1L03k16k1K05j13J94k10
$$ 128 193 171 143 94 -138 -25 -126 -178 -208 48 23 -12 160 -18 -157 -146 157 -59 -80 125 12 206 -4
4737dJ24q4m6n5n4j41K72J08q5j67K76n8k20L63j25mk60K4o1P0K7J17N6k87K22
$$ -4 120 36 -10 -65 -119 -260 12 120 35 -132 144 86 -134 229 104 100 -160 -136 -197 -127 -100 17 73 -214 8
4762HR9N3k03K26j74K53l80N5J69p0R1o7J91j98P5j70J07N1l22L39j46J18m7o4
$$ 8 107 160 -43 183 9 262 -118 -63 106 36 127 60 251 53 128 -42 65 116 -206 133 -13 105 58 -6
4786fJ27n6k37J58r6k1J77l69O30m09K9J10p5QQ3J01j20J61%m8k97L25k78J82
$$ -6 121 65 -172 -14 -110 -131 46 -323 307 -102 -73 37 -38 -30 53 154 34 195 195 147 -150 175 -103 79
4810G9j88J35j4n1p9J83RO5k19N5mO3J99k81P5J07J12m39M48m72M3L22j1j71M7
$$ 79 -109 26 12 -39 -118 65 74 139 -80 -25 -29 34 233 -48 27 134 246 -193 255 -217 -174 148 137 -34 13
4835A3n6J42K32p52M04Q7k1%M00n18K2n8K32J16j64l61L86k08o8J36p6K71k95
$$ 13 -43 99 331 -421 -17 70 49 49 449 -69 -47 -105 127 243 79 -282 104 -104 -172 -36 -112 159 -136
4858a36j20K12M1k54J75q5K13K9k13K38n5K05j91m0P9j01j35J66k39J43R6l41
$$ -136 -256 -44 -3 -257 -82 -167 46 75 -138 100 45 250 59 19 98 -3 -138 28 -211 -68 28 -313
4880c13L10J07K6j51K48k19j99L18j83J56j59J89P4l03k5M0m8M11k66o0L8r4Q7
$$ -313 -3 104 130 -21 227 8 -191 127 -56 100 -59 130 204 -99 -124 -84 -132 279 13 -47 -9 -103 -16
4903a6n6R2k66K53R4j48j06K16o2J3k6P0j53K64l13J66R6p1q4j85M36l97L02p2
$$ -16 -72 20 -246 7 101 -47 -153 63 1 14 -12 58 -95 169 -144 22 118 47 -37 -222 214 -183 119 47
4927D7j26K07qr3q7Q2J20j01k91M3J65J16J47l26M7k60L09j9j06n3J51K8o1l0
$$ 47 -79 128 120 27 -60 22 142 41 -250 -207 -42 74 221 -105 -58 -318 -9 -28 -134 -187 -36 -8 -69 -99
4951i9J76j21J27l94L44p4Q1p0l05J88J02R5j29r2J0J85k2J42k54K47j12j13N9
$$ -99 77 -44 83 -311 33 -41 40 -30 -335 -147 -45 50 -79 -171 -161 24 2 144 -110 137 25 -88 -29
4974b9J16k13J21j88r4K65J06k31J24J17j59M0J34l00J76K41l39J42k57K24q0
$$ -29 87 -126 -5 -193 -287 -22 84 -147 -23 94 -65 -25 109 -191 -15 226 -113 29 -228 -4 -84
4995h4L21m51L33M4k80L02k75J27J53j89k08J12P2j7j2K87l60nR3j26J52k6J27
$$ -84 237 -214 119 163 -117 185 -90 37 190 1 -207 -95 -23 -40 -52 235 -125 -130 -37 -163 -11 -37 90
5018I0j02l9K45O8j43J53l15j77K0J66l5%p1J54k53L65l98p6L95Q6L4l10J63j
$$ 90 -12 -51 194 262 119 272 -43 -220 -200 -34 -69 -69 -140 14 -239 126 -272 -348 47 133 167 -143 20 19
5042A9L6m8k6k16K35K0L2J04j65LL9j67R2J9k0J04r6r5J96q4J84j42K87j1j53
$$ 19 55 7 -19 -235 0 20 52 156 -9 -6 33 -134 -42 -23 -43 61 -35 -130 66 -18 166 24 311 300 147
5067A47l6n9k35J42k2L7j57J14J64j74J33j13R8km0j31J59J2k02Q3J4m1Q9K50
$$ 147 111 52 -183 -41 -63 -26 -183 -69 95 -79 54 -59 39 37 -3 -134 25 37 -165 -82 -68 -109 -20 230
5091B30l3P2l01M1k64K52J9n7M3P7o9r2R5j50o5J85M8m4J14q8q8P2O2n2j57K07
$$ 230 197 269 -32 9 -255 -3 16 -41 2 79 10 -82 13 -137 -202 -17 31 -13 101 13 -75 -3 59 7 -150 57
5117E7L6k89Q6J19k10K85M0n5l09K66K09kl53M39l88j08R7J50j68j74L13j6R3
$$ 57 93 -196 -110 9 -201 84 124 69 -240 26 235 233 -120 319 -69 -177 -80 70 -98 -272 41 25 118
5140A18j04J4J09l95M02j89k9J71K9o8k80K27l0J20N2m4rj0q1J00m8j95lL26l31
$$ 118 14 28 137 -258 144 -45 -74 97 126 58 -222 5 -25 95 147 103 94 84 3 103 55 -140 -143 183 -148
5165a48J16J46j64J84m33K85j56J69Pj36Q6N6j72K34n2m20K75K76n12M02j4k7
$$ -148 -32 114 -50 134 -299 -14 -170 -1 6 -130 -44 12 -160 74 22 -398 -123 153 -359 43 29 2
5187BJ38j50m0j07M14l30j76M0O32n30k08L23n7J43o1j08o5O8Q8Q8j67QP8J58
$$ 2 140 -10 -50 -157 257 -73 -249 -209 423 -107 -315 8 -49 94 33 -75 -140 -72 16 104 -63 -55 23 181
5211A81k48K07k8k6Oj79K00K5j58P9o8J03k34J7o2J10J91j5Pl7j54l0K49l65J69
$$ 181 -67 140 112 86 92 -87 113 138 -20 59 -9 94 -140 -123 -185 -75 116 101 108 71 -83 -113 136 -229 -60
5236f0J69m13K09L8j05J28n3J17k26K35k84N8O4L25k84J36lj51J9L12l9r0q0m5
$$ -60 109 -304 -95 -57 -162 -34 -87 30 -196 39 -245 -187 -123 202 -82 54 51 -100 -81 231 192 102 22 -23
5260b3Q1j76J4J02J70L21m02k96N5L68j49j78J00J91j51J75j79k76L11J4O9l78
$$ -23 58 -118 -104 -2 168 489 87 -209 -154 214 65 -113 -13 178 27 202 23 -253 58 72 141 -237
5282b37L33j82J49k08J56l04J61J90M5Ql06P8N6N5j72M0j8K8J59J01o9Kl87K52
$$ -237 96 -86 63 -145 11 -293 -132 58 103 111 -195 -117 -61 -6 -178 -138 -156 -128 31 132 63 65 -322 -70
5306g0Q2j83L22J5jm49N93m37J27r9J63K7R1j32j88K98j29K1j43M1NJ36p3M7k78
$$ -70 12 -171 151 166 165 -284 309 -128 -1 -100 63 90 181 49 -139 159 30 51 -92 -51 -46 90 17 64 -214
5331b14Q3KJ14L7q7m84N85j11K38n05L01p3P7q3R8Rj50K68k05K54k33r6K97k5
$$ -214 -131 -129 -15 22 -65 -549 36 -75 163 -342 -41 -114 -37 -120 -22 -13 -163 105 -100 154 -79 -175 122 97
5355I7k86K21j87K00p1J44P1k59K0P1M7k6o5o5J86r6J01J89l50P7m5m8r4Q3jK03
$$ 97 -189 32 -155 45 -26 118 189 -70 -50 21 68 42 -23 -88 98 2 103 292 -58 19 -26 -74 -168 -85 -86 117
5381A17k57J28J4k1pl0L29o3l51L01J16p8j4p8q9L8nj33J35L02l96M7%j87N3N5
$$ 117 -140 -12 2 -19 -26 -56 273 210 -141 160 276 198 184 106 17 55 50 -83 52 354 -42 5 5 -182 -129 -74
5407g4L86n52K84O2p2p8K39j38k61O03m47j4O1k06J98K1P1l0k1r8J52k11J65J03
$$ -74 312 -240 44 106 34 -44 195 57 -204 399 -48 -62 -1 -207 -9 12 83 53 32 -66 86 -125 40 143
5431A43N3k7p7j19K44j48q7R4j14Mp4r4L52k33O4O1j36J10j15J73N4k35K04r8
$$ 143 196 169 92 -27 217 69 -18 76 -38 -34 -108 -202 150 -83 -19 42 -94 16 -99 74 128 -107 97 -1
5455am5n3R9O9m17K94J88q1o2l5r6J31p4K39k84J88q7j99J24J23j62j48K91N2
$$ -1 -46 -99 0 69 -348 -54 134 53 -9 -44 -140 -9 -83 156 -128 60 -27 -226 -102 21 -141 -289 2 54
5479E4K00k35j16J37k09N4J30l5J19j89R2P8j46k32L27k22L95j64L7J9j28j04
$$ 54 254 19 -97 40 -169 -115 15 -20 99 -90 2 80 -66 -298 29 -193 202 38 75 94 -34 -138
5501a38j91K54k82M14p2J57l93N32l72J65l05L70j89M3R2j88J44J85k49MJ77k47
$$ -138 -329 -75 -357 57 -15 142 -251 281 -91 74 -231 139 -50 -7 85 -103 41 226 -23 -19 158 -89
5523h9K01k29o4M37k58j52L00k87K06j16k41K96J78m88K07N9L3O0n4O5q6j24K69
$$ -89 112 -117 -181 256 -2 -154 146 -141 65 -51 -292 4 182 -306 -99 -40 -7 53 -1 64 -22 -146 123
5546A23m87M84J67m01n7J67j7J63j60M4o4r9J22O9J06N5k72j9j12J79O4J26k12
$$ 123 -364 120 287 -114 -171 -4 -21 142 -18 26 -38 -137 -15 54 160 215 -57 -76 -188 -9 55 181 -31
5569c1J46j79J29P4j45k2L80k24j47K85k48k01L90j26j20J25J8J95m00j7N7j88
$$ -31 115 -64 65 139 -6 -28 352 128 -19 266 18 -183 207 81 -39 86 104 299 -101 -118 -61 -249
5591b49K69j95M27k73R8Nj96J17m8L11l20K75j82j12N8J8m4K7j47M20j08l42L60
$$ -249 20 -175 252 -21 77 82 -114 3 -45 266 -54 221 39 -73 -15 3 -41 -14 -161 259 151 -191 169
5614A69O3l84k67Q39l34k63K78lr8j39K75q3j01m09M43M8j05n8K59r8j28k29M66
$$ 169 232 -152 -419 420 86 -177 101 98 0 -139 136 53 -48 -457 -14 34 -71 -129 130 32 -96 -325 141
5637A41k23J2J70L8j84J1N9j22L57m48j57M41L45n22L6q6J61n3lk39N47j45p7
$$ 141 -82 -70 100 138 -46 -35 24 -98 259 -189 -346 95 440 -82 -46 -132 29 -24 -27 -266 281 136 59
5660E9O2j54J73l15J75k8J68j91M5m8J33j94k7J75K58j69j21k38J6K64Qj92q0
$$ 59 121 -33 140 -175 0 -28 140 -51 -6 -54 79 -115 -142 33 291 122 1 -237 -221 43 51 -141 -221
5683b21L64l72J91P7p8m5J14J33l95%J98j56J03L6no5J29J0N0r1J18k79J50J14
$$ -221 143 -229 -38 39 -39 -84 30 163 -232 -232 -34 -190 -87 -51 -56 -121 8 18 68 -23 95 -184 -34 80
5707H0j26K42k48P7m8L4j3k6L7k1P2j63j8Q9j32J06J64j03j52M04k09rk61J83
$$ 80 -46 196 -52 25 -23 11 -2 -28 9 -12 60 -103 -121 -32 -164 -58 106 3 -149 255 46 37 -224 -41
5731d1J17k37K87q9o0p8P8J14j94K30j78q6K48j41O1j20J6j37M52m09K05l6J18
$$ -41 76 -161 126 37 -23 -101 -23 91 -103 127 -51 -137 111 -30 31 -89 -73 -210 242 -167 38 2 120
5754A20L3k81j44J61K45q0r0K00k92J22O7k3j63R1j69J77j05J72K2l4k52L22j42
$$ 120 153 -128 -272 -111 134 54 -36 164 -128 -6 61 38 -125 -34 -203 -26 -131 41 63 29 -223 99 -43
5777d3R0J40%o1j88J86n3l14J07q9K00K57k78m5J4K56j77k4J32q6K32l60J06L6
$$ -43 47 187 187 126 -62 124 71 -243 -136 -225 -25 232 -46 -91 -77 179 2 -22 110 24 256 -104 2 38
5801C8k33K83L5k19K7j39L09nj0j58k24P3J30P1j6O0Q1k39M6OR2Qk3K7%j98M5
$$ 38 -195 88 123 -96 -69 -208 101 96 86 -72 -296 -223 -93 -22 -38 22 103 -136 -90 -84 8 16 -7 20 20 -178 -133
5828a33J51j08j03L77l27K2OK67k52p5K43j36K36J20k78Q9k0k56J39j01K11J47
$$ -133 18 -90 -193 184 -143 -121 -115 152 -100 -175 68 -68 168 288 10 99 79 -177 -38 -139 72 219
5850B19j21m0O1j45j4kJ42q%J28j19j48K78j52k26j61K56m4r5k4L13k4k1J74l31
$$ 219 98 58 119 -26 -40 -42 100 92 92 220 101 -47 231 79 -147 -308 -52 -96 -191 -215 98 74 53 227 -104
5875a04PK14K46l38J71p5N8n8p1k11R1M4J66k70Q0J06n8r9K09N9j93J60R6r0k95
$$ -104 -97 117 363 25 196 121 179 121 50 -161 -70 -26 140 -130 -50 56 -2 -101 108 167 -26 134 230 140 -155
5900a55P4J14k10J66J74k12J02q7Kj12M56j93l66J94j21K47o2r2J43j28n6K97
$$ -155 -81 33 -177 -11 163 -49 53 -34 -32 -144 312 119 -247 -53 -174 73 11 -81 62 -66 -122 175
5922A75l61M60p1om54K64m0J1r4J4L9R4oL6k00J13o1k2P8J29J20j22M6k92J92
$$ 175 -186 274 203 197 -257 7 -33 -22 -116 -102 -63 31 25 61 -139 -26 -87 -109 -31 98 218 96 142 -150 42
5947D2n4j57K34j76J2Q2Pl5k77L45k48L04j44J47j10k46K53j45rJ92J48j9J76
$$ 42 -12 -169 65 -111 -99 -17 -10 -45 -322 23 -225 79 -65 82 -28 -274 -21 -166 -175 17 165 146 322
5970C22k31Jl45Q0J08j8N0j06j09K29l8rP6N0M2o7O9j32k4o3J64j4j16P6r7J11
$$ 322 91 92 -253 -173 -65 -83 -33 -139 -248 -19 -57 -66 10 60 102 35 104 -28 -52 -115 49 35 -81 -5 -102 9
5996IP0m8J6r0L8Nj69L37k4j27j47RJ00J11J17k61L91k74JN2j94m2M4Q7j59K19
$$ 9 79 31 47 -43 -5 0 -169 168 144 17 -130 -121 -21 90 207 -54 337 63 64 116 -78 -120 -76 11 -148 71
6022G1J05j74j10P8J7Q2n3Q2j03oj17J47k6q6K3J53L67m17j02K10k81J11j36K21
$$ 71 176 2 -108 -30 -13 69 16 98 -5 -11 -128 19 -7 -93 -70 83 450 33 -69 141 -140 -29 -165 56
6046E6p8L39l19kj41L27k17J6p2j3m1q6M48l12m0n5M12m55M13k32K03q7J36k95
$$ 56 -22 317 -2 -4 -145 182 -35 -19 -91 -104 -145 -231 217 -95 -135 -190 222 -233 180 -52 151 64 200 -95
6070i5J22o5N8J1p3j1k4L66m56J50O0n7r7J65N3k69O9K1L72m22n5K46l6J42j87
$$ -95 27 -38 20 31 -42 -53 -77 289 -167 -17 43 -14 -111 54 107 -162 -93 -72 300 -122 -177 69 33 175 -12
6095a2J11k68J12K01m66L11j90J52R8j39J21j20J95K56l49P0p8l6J19M6k21J9
$$ -12 99 -169 -57 144 -322 -11 -201 -49 49 -90 31 -89 106 362 13 83 5 -31 88 134 -87 -68
6117f8N3J52j58O4J08j89J3q3J83j47J14q5Q7J29k05J32k84J65N9q8J52j77K69
$$ -68 -15 137 -21 43 151 -38 -25 -108 75 -72 42 -43 44 173 -32 100 -184 -19 40 -48 104 -73 196
6140A96j38k83N0L03p3R6j04k1J22o4l90M3Q2J85J25O5j63Q5j74K30m9j19p3J91
$$ 196 58 -225 -175 128 55 151 47 26 148 84 -306 -263 -181 4 129 194 31 116 -58 172 123 4 -69 122
6164A22M9n2j27Np6k05N02k46R1p1j08L51l09OJ81l06M22l03L00k14J25J46l18
$$ 122 171 119 -8 -3 -79 -284 218 -28 63 -8 -116 235 -74 -68 113 -193 229 -74 226 12 137 283 -35
6187c5j28K01k85L96k96J0N2k0k7M5M05o95K81J41n2J15q7l65L22N6j08m4J73
$$ -35 -163 38 -247 149 -147 -137 -85 -105 -132 -87 318 -377 -96 45 -7 108 21 -344 -22 34 -74 -118 55
6210E5k51K44J08j33k51K50nj84Q2K04j33L2J66k34K06l25K23J39j74k94L13l12
$$ 55 -196 48 156 23 -228 22 17 -167 -85 119 -14 18 184 -50 156 -169 54 193 19 -275 38 -274
6232b74M24j68K99m5l39Q8L7j19K77j55N0p1p4k7j16J56o2K7j82L05j21J68J3
$$ -274 150 -18 281 236 -103 -15 22 -97 180 25 75 4 -70 -97 -213 -57 -119 -92 -274 31 -90 78 91
6255I1k16J04O9k56M31j40l3K5m14L80k04L01j04Nj26N0K38J34k52j44n2K18k16
$$ 91 -125 -21 48 -208 223 83 50 75 -339 41 -163 138 34 39 -87 -37 201 335 83 -61 -113 105 -111
6278a11J4Q9L7L72l87m1J94k87L1J24J7q0K9J18l37K28k10K17R6R9k51j06j1K91
$$ -111 -97 -8 29 401 14 -27 167 -120 -89 35 52 -28 1 119 -218 10 -200 17 113 212 -39 -145 -156 135
6302A35k07K05r2k15L28j78L30m03P5j06J9J89q2O9j62L16k23J8P0j66j5K39K10
$$ 135 -72 133 41 -174 154 -24 306 -97 -22 -128 -109 80 -2 67 -95 221 -2 16 86 -80 -95 144 354
6325C54k26k0j24k47L04k20J46R9K03j65J35k43nq5J74l35M68p6o8J5k18j46J31
$$ 354 128 108 -16 -263 41 -179 -33 66 269 104 239 -4 -9 -94 80 -255 213 137 69 84 -134 -280 -149
6348a49Q8QJ75k04K25l4j33N4k76L40j18J86k87QK60j67M0l13L36m2ML0L3j98
$$ -149 -61 -53 122 -82 143 109 -24 30 -246 94 -24 162 -125 -117 143 -24 16 -297 39 -3 1 31 64 -134
6372a34J47N0k13K6O3M6M23l79j19J44o0K70k29J81k09M9j01P3j70J0P6J42Q9
$$ -134 13 63 -150 -124 -61 -15 408 29 -90 54 -6 264 35 216 7 56 -45 28 -142 -132 -56 86 175
6395A75N0k6M1j46rk52K19N5j4L1m0l3jNk47L48l4k78K14k08K71r6L0o0R8L5j3
$$ 175 225 199 240 94 85 -167 52 107 93 124 84 51 50 55 -192 156 122 -156 58 -150 121 25 55 -5 93 128 115
6422A15r2J11J02p9k79J04l51L11P5j07K13Ql61K98l4j44P6k6p1J5K14k08J37
$$ 115 23 134 236 157 -122 -18 -369 -58 17 -90 123 131 -230 68 34 -110 -34 -60 -131 -116 98 -110 27
6445B7J8N8k25L33j52k64J52r5J90k19J74M2k7J42L6l47K56l35K06K26K0l75J07
$$ 27 45 103 -122 211 59 -205 -53 -148 42 -177 -3 39 12 154 190 -157 99 -236 -30 196 216 -159 -52
6468e2pj10J57J12p7n9K03j19j03j76K20n9j37O1L08k43K09o9j9m09M20j2J22
$$ -52 -59 -169 -12 100 23 -36 167 48 -55 -231 -11 -70 -207 -146 162 -81 128 59 40 -369 51 39 161
6491A61q8j75l3J30K66k11R2l79J99k5Q5J48j30r5K17k85J75j37M9q0j22J36N72
$$ 161 73 -102 -135 -5 261 50 142 -237 -38 -63 22 170 40 -55 162 -123 52 -85 -36 -116 -238 -102 470
6514D70m03k05j31K20L20n36J22R2K56j16R6L6l03K42J27j44k8Om6j12K65n02
$$ 470 67 -138 -269 -49 271 -265 -143 -51 205 89 185 221 -82 160 287 143 115 121 75 -37 228 -274
6536b74J60K44j58l2J8O3j7N1j60K03MJ26k79K05k10j90j9J61n4L27j03K01k10
$$ -274 -114 130 -28 -60 -42 21 4 55 -105 98 102 228 -51 154 -56 -246 -265 -104 -158 169 66 267 57
6559E7q4m1J02N1p8N5m2qq4o1K22K8k39K45n7k71L73l03q7J34K41k17Q3L8R5j79
$$ 57 -27 -68 34 85 7 62 20 12 -72 -133 89 117 -122 123 66 -205 168 -135 -222 -88 153 -64 19 57 152 -27
6585b7J92l14J34j15K06J2q4J53k84R9p5P8L9n8O4O9q0L70n29R1J18j70n4J20
$$ -27 165 -149 -15 -130 76 88 4 157 -127 -28 -103 -25 14 -44 20 89 9 379 -150 -59 59 -111 -165 -45
6609d5J43k99K87k00K3J44J92l41J20J83j52o6k6K00j22l93M45r7J18o0l36L18
$$ -45 98 -201 86 -114 -91 53 245 -96 24 207 55 -11 -37 163 41 -352 93 -4 114 54 -282 36
6631C6J01j29O9P6j8K26l68L4m8J8o3L01j06J13k06l25M11j50J25k04K28q1p4
$$ 36 137 8 77 153 135 361 -7 27 -21 -3 -66 235 129 242 36 -289 122 -28 97 -107 121 40 -34
6654c4qL97k96j14J05k28K92k27q6J67oj2J88j77J04l97N77K41k55k80N9q8J4
$$ -34 -42 355 59 -55 50 -178 114 -113 -199 -32 -38 -50 138 -39 65 -332 245 486 231 -49 10 -78 -64
6677f4n6K55k25J46K2q5j79K11k25K43K8o7J71k43P4j87K62n7j21M6L2K47m66
$$ -64 -120 135 -90 56 78 -7 -186 25 -200 43 71 4 175 -68 6 -181 81 24 -97 -51 -19 228 -238
6700b38K18l8j9p2J69K13m83P01m92K88k06k07J32L1K22j74J44j85q4j06K61j24
$$ -238 -20 -58 -77 -149 20 233 -250 451 -41 247 41 -166 -34 -3 219 45 189 4 -80 -186 75 -49
6722d9J29j91Q9K23J0l11j87O46p1j42k92KK93q3j07J35j68j48J05J1J51J57p3
$$ -49 80 -111 -22 201 211 -100 -287 359 288 146 -146 -144 149 66 -41 94 -74 -222 -117 -106 45 202 129
6745A29K7l26J38J32k59J33M2m0l6J04L5J37r7m7k71J72L13l82j7n8J92q2j81
$$ 129 156 -170 -32 100 -159 -26 16 -24 -60 44 79 216 119 72 -199 -27 286 -96 -113 -171 21 -61 -242
6768b42L81j50o4N5K05j40r7r7K14P5k26r3L47n2N9j14n7o7j7K30k51k9K4j1Q8
$$ -242 139 -11 -75 -20 185 45 -52 -149 65 140 -86 -179 168 116 175 61 4 -63 -80 150 -101 -130 -106 -117 -29
6793b9R3r1k23J29rM2j78P5L18l80M29j44O8K48j01l83J51k8N0j28J65J58j4l47
$$ -29 64 -27 -250 -121 -130 -88 -266 -191 127 -253 176 32 100 348 247 -136 15 -13 37 -91 74 232 218 -129
6817a29J19M6k60J61K88k27O9M9M8k16K4Rm5K38j86kJ1j49K72k02Q8l1Q4k24L05
$$ -129 -10 36 -224 -63 225 -2 67 116 164 -52 -28 -19 -64 174 -12 -14 -3 -152 120 -82 6 -25 59 -165 140
6842A40Qkm32P6M1L73j35O9N3l34L24o5%P6l61K90P7l90L3K57j85J7o5J56O8K27
$$ 140 148 146 -286 -210 -169 204 69 138 191 -143 181 116 116 192 -169 121 198 -192 -159 98 -87 -70 -135 21 89 316
6868C16l47J70m09qm0K45Q3N5k79L67o6p6n4qJ82j12J93j15l4k23L25J4m94M07
$$ 316 -31 139 -270 -278 -318 -73 10 65 -214 153 87 11 -43 -51 131 19 212 97 63 -160 165 179 -315 92
6892I2jj56m7R5j85k6K72oK31k50M8J11j71n1R4L6j26P0l5K11j58l1L72l29j37
$$ 92 91 -65 -112 -17 -202 -228 44 38 269 19 67 178 7 -44 50 86 -40 30 -5 206 48 17 389 60 -77
6917g7j92KK53q8Q5m4J96n7k15L43k71j53L80j96j46J04N6P2k47K4K88n8k36K73
$$ -77 -269 -267 -14 -102 -17 -61 135 78 -137 206 -65 -218 162 -34 -180 -76 -20 52 -195 -171 117 59 -177 96
6941I6k02r2N0K22Q7k80J8N4O8q5r0L32l42K25J02j32l0L5q1J56k5k1j5j55L9
$$ 96 -106 -198 -148 74 161 -119 -101 -47 21 -64 -154 178 -164 61 163 31 1 36 -45 111 86 65 50 -105 -66
6966f6J41P4j12N7K7l48K35N6L35m44K35k13J39k1j16K8J1Q3kj66M9m2j23J33
$$ -66 75 149 37 94 121 -227 8 64 399 -45 190 -23 116 95 -21 7 18 101 99 -67 -18 -60 -183 -50
6990e0K2N6K05l18K03j49j30K5j17J67M8j69M9J32L05l63j89N39j64j7k47M16
$$ -50 -28 28 233 -85 118 -31 -161 -136 -253 -86 -38 -207 -158 -26 279 -84 -273 266 102 85 -162 254
7012B54m79o1L48o1m8R2Q6J99m45J34J5n5K68l08L01m7k38j1j06J00L6N0p7J10
$$ 254 -225 -286 62 1 -47 45 131 330 -115 19 34 -21 247 -61 240 193 -45 -56 -162 -62 -26 24 -53 57
7036E7o6j02J09o0M6K7j0j50q0K28K15o4j78J01j22j80K56J2J6J41j12J60j79
$$ 57 -9 -111 -2 -62 -16 11 1 -149 -229 -1 214 150 -28 73 -49 -229 27 39 55 196 84 244 65
7059F5P1j32N3o0L6l78N54k64m0J80l55M53l86M13j30j67j68K8K13j17pK01MJ2
$$ 65 136 4 57 -3 33 -345 209 -55 -95 85 -270 183 -203 210 80 -87 -255 -227 -14 -131 -138 63 67 79
7083G9j58J55l72L19j32O4K47m66L00l30K90o1j37K42Mq2J34L1l11j12L42n8j26
$$ 79 -79 76 -296 23 -109 -45 202 -264 36 -294 -4 -65 -202 40 44 -38 96 127 -184 -296 46 -12 -138
7106a38J49N7Q6j89J69r4J47n2j53J15J51j21k5j38J60j28j38L43j19JJ55k43
$$ -138 11 68 154 -35 134 40 187 135 -18 97 248 127 102 -36 124 -4 -142 201 82 83 238 -5
7128eK17m03M3J92N7j00L7K8k9k32N3j13J15K14n2Q6j74R9k24L7L03o4L5j76J84
$$ -5 212 -191 -148 44 101 1 38 66 37 -195 -142 -255 -140 74 22 108 -66 33 -191 -154 149 85 120 -56 128
7153A28o2J70n4k07N6J3N3k23J04k3L3j00J83k68K08j86L21j31J07Jp7j37J23
$$ 128 66 236 182 -25 31 44 97 -126 -22 -45 -12 -112 71 -197 11 -175 146 15 122 123 46 -91 32
7176C2K10k66J07J82k34K28q8l26NK85j40K13n0j12K8k46J17j21K4J78k19M9N1
$$ 32 242 -24 83 265 31 259 171 -155 -150 135 -5 208 158 46 74 -172 -55 -176 -152 26 -193 -144 -93
7199i3Q9r7J36kk66k2K53J08p2J8j33j0l1K89l57P0J54m5J15j41r8J36l09K52
$$ -93 -4 -101 35 33 -233 -255 -2 106 34 52 -81 -91 -122 167 -190 -120 34 -11 104 -37 -135 1 -308 -56
7223e6L78l64o5r6M99l31J34k78J17J82n7k04K99j57j10P8R2j48J77q1P2j94K65
$$ -56 322 -42 -107 -203 296 -35 99 -179 -62 120 63 -141 158 1 -109 -31 61 -87 90 9 81 -113 152
7246A52j90j1k91M04j91K02Q1k19O2k7K23o7R1j15j04r5J79k92R3j40P1K94l39
$$ 152 -38 -49 -340 64 -127 75 156 -63 -1 -28 195 128 219 104 0 -95 84 -208 -115 -255 -184 110 -229
7269b29J68L17j94p4j22r2J25K37j2j35MJ24j02O6n7J5o48R29l62q5K6J89j43
$$ -229 -61 256 62 -12 -134 -226 -101 136 124 -11 -7 117 15 81 24 39 -609 320 -42 -127 -101 88 -55
7292e5q1P6J61j03L4k13L46j28P6j03OK9m8J6J19k28J60Q2o2R0l03J60k12L23
$$ -55 -136 -60 101 -2 32 -181 165 37 113 10 16 45 -3 13 132 -96 64 146 84 174 -129 31 -181 142
7316A42j47J66l08J68k86N94k33l37K11j30j49L42j15K65k53Q5O1q5J02J39k86
$$ 142 -5 161 -147 21 -265 329 96 -241 -30 -160 -309 33 -82 183 -70 15 76 -9 93 232 -54
7337e4q9L22k00L2J07k42j69J76J88J14k52q3L16k01j78J00K29r7k24K58L8r7
$$ -54 -143 179 -21 11 118 -124 -293 -117 71 185 -67 -150 166 -35 -213 -113 116 19 -205 53 91 -6
7359fJ07J40l79L5K07k50J67J69m6O8o6l67R7J94R9q3P9k81N6J88q4Q2j76K42
$$ -6 101 241 -138 -103 104 -146 21 190 144 212 146 -221 -124 70 169 86 165 -116 -60 128 44 126 -50 192
7383A92k91P0j73K30j89O6K62k66R4j13M17m84K5K28j58j54M59k06ML00l70k5
$$ 192 -99 -29 -202 28 -161 -95 167 -99 -5 -118 299 -185 -160 68 -90 -244 215 9 13 313 -57 -82
7405h2m9K29k70K50k29lL7J04n0J76l6r0k23K72J5k82J95J7J8l64N15k5r2Jl2
$$ -82 -131 98 -172 78 -151 -154 -117 -13 -63 113 77 -13 -236 36 51 -231 -36 -19 -1 -365 150 125 33 34 2
7430Bk53M84j03l00M9J24j21K63j94J31k10K99l45K22R0o4L9o0k93L23m33L06
$$ 2 -251 233 130 -170 -121 3 -118 145 -49 82 -128 171 -174 48 138 74 113 53 -240 83 -350 -44
7452d4o5j10J69J53L2j21J6j59J16j46L5q8K12J13m2j33N3r5J66J3j4Q4Qk75M6
$$ -44 -109 -219 -50 103 135 14 30 -129 -13 -159 -124 -212 0 113 71 -62 -9 -104 62 75 61 145 153 -122 -76
7477g6J11k8P8l38J44J02L9J4Mk51J96n8M2m6J58j04k67K50R4j33J23k31K50k84
$$ -76 35 7 85 -253 -109 -7 32 46 50 -201 -5 -63 -21 -67 91 -13 -280 -30 64 -69 54 -177 73 -211
7501b11K43J48m58L47K4P1k93M35k47n9j75J15J47j24J79m71M33M2J94m15j0J40
$$ -211 32 180 -278 69 93 164 -129 306 59 0 -175 -60 87 -37 142 -329 104 146 340 -75 -85 55
7523E5k11J25K32k94M19J4l12l0K5j72K71l9j72K06k76J66K29k62J60j25K43j99
$$ 55 -156 -31 201 -93 326 340 28 -2 23 -149 122 83 -89 117 -159 7 236 -26 134 9 252 53
7545E3l2J9l16N32n56M06l15K75oR7m58K09J51j55Q5P3J39l21K60k06N3o6J7j39
$$ 53 21 40 -276 256 -300 106 -209 66 60 157 -301 -92 59 -96 -11 62 201 -120 140 -66 -13 -79 -62 -201
7569b01O3j24K73o0J23K8J7N9m51J70N2m1o7J76J0q1m2j13K17m1N5L6n5J31q3
$$ -201 -138 -262 11 -49 74 102 119 178 -273 -103 -51 -92 -159 17 27 -54 -96 -209 8 -33 22 58 3 134 51
7594E1k10oJ43J47r1J37k07N4k0k54K99k3O2j0J47l36J67K0L9j47Q1p1j37J29
$$ 51 -159 -165 -22 125 34 171 -36 18 -2 -256 43 20 82 72 219 -117 50 70 109 -38 43 -28 -165 -36
7618c6j1k71L52n1K1L3M0l72P3J43N1P3RM3l8j2K73m03L2j0j8K39P8K6l92m3K90
$$ -36 -47 -318 34 -17 4 37 77 -295 -222 -79 -28 45 54 97 59 47 320 -83 -51 -61 -79 160 238 264 -128 -171 119
7645A19j22M2O7j38o1J47O0j31j81K88j09K12k46k10O49n87J04p0K94l83J52%
$$ 119 -3 39 106 -32 -93 54 114 -17 -198 90 -19 193 -53 -263 386 -201 -97 -167 127 -256 -104 -104
7667a04J09K50j54k58K22l22K92j08K7K0J38j58n3rj80K74K03j64j74N3Mk5J63
$$ -104 5 255 101 -157 65 -257 35 -73 -46 -26 112 -46 -99 -108 -288 -14 189 25 -149 -96 -92 -117 46
7690D6J66j67M0J58m49J64J67j56M2N0O2P3l05J39PL0j19J75k87K33k15K78k75
$$ 46 212 45 85 243 -206 -42 125 -31 11 61 123 196 -109 30 37 67 -52 123 -164 69 -146 132 -143
7713a43q1K28RJ29l87L09j12J1Q2J7j48j61K3K99l05J68J5M9J30L3J99j75j80
$$ -143 -224 4 13 142 -245 64 -48 -37 45 62 -86 -247 -224 75 -230 -62 -47 2 132 165 364 189 9
7736IK7J04k65O2J10j05P8Q0j59J50j06j65J74o3J07M6k23J27J55J3k08K19j57
$$ 9 36 140 -125 -63 47 -58 20 100 -59 91 -15 -180 -6 -69 38 84 -139 -12 143 156 -52 167 10
7759A0J30l35J73o6J35K2r5L8l3J23j45K59k16K08l53O1o4K17o0o4j15L20k34
$$ 10 140 -195 -22 -88 47 69 -26 12 -21 102 -43 216 0 208 -145 -84 -148 69 9 -55 -170 150 -84
7782h4O0J4o2Q4j4K6K56n10L88k47K54q2j67K00k31J82j72oK22j40j5o6l6J41
$$ -84 -24 -10 -72 12 -2 24 280 -230 158 -89 165 83 -84 116 -115 67 -105 -111 111 -29 -44 -110 -146 -5
7806er1M3l26N18n2o0j0Q3l90L13m4J24k52R9j30K66j44J7J44o3j42O3K70j94
$$ -5 -96 -53 -379 139 87 27 17 100 -290 23 -21 103 -149 -50 -180 86 -58 -41 103 40 -102 -39 231 37
7830C7j33j17K20K13k26J53k76J82n9R7J31j39mj54O8j03J69L2q1K5r8J93o3p8
$$ 37 -96 -213 7 220 -6 147 -129 53 -6 91 222 83 79 -75 -7 -110 59 91 10 35 -63 130 67 -11
7854a1j54L24j48K9K06j49q6j0K07k80N2k16L63n0k42J67J22Kj76K9K8M0r8Pm3
$$ -11 -165 159 11 40 246 97 11 1 208 -72 -20 -236 127 77 -165 2 124 126 -50 -21 7 47 -51 -44 -87
7879h7R2j69J90n1K0q2K4J75o7l7k6l03M09k11J94k61k39J50M34k73O4N8j71L03
$$ -87 5 -164 26 -25 -5 -87 -63 112 45 8 -18 -321 88 -123 71 -190 -429 -279 155 -118 -54 4 -167 136
7903A36m92N75l57K21j9k13K11pJ00j6k34k7K87j78q5K47o8P9j02oO1r9j42K77
$$ 136 -356 219 -138 83 64 -149 62 55 155 139 -95 -122 165 -13 -98 149 81 160 58 52 113 14 -128 149
7927A49K14l66j29j12J93J23j53J23O1o3J65k84N4p2L80j19q3J1j01Nj17k2j16
$$ 149 363 -3 -132 -244 -51 72 -81 42 103 40 205 -79 -25 -97 283 164 81 92 -9 -4 -121 -143 -259
7950b59J67j62L34l35L24k4P3q1M0j79P0r4J21M3j72J61L9j83k35L4K01p3K37
$$ -259 -92 -254 80 -255 69 45 118 37 77 -102 -32 -126 -5 38 -134 27 66 -117 -352 -318 -117 -190 47
7973D7j98J46J57j11r8j6L8k05K55n8Qn6q5R3q3J73J21k59J32R7o3J9k87L45j36
$$ 47 -151 -5 152 41 -57 -73 -35 -240 15 -43 -35 -91 -176 -83 -166 7 128 -131 1 98 35 54 -233 112 -24
7998b4J12p5j18N8OQ8Rq9J89l41K56j4j22J6j11J14J3J48r9j2L1j2k5q6OK85n5
$$ -24 88 13 -105 -47 -41 47 56 -33 156 -185 71 57 -65 -49 -160 -46 -33 115 16 4 35 23 -2 -88 -82 203 148
8025A48J0Jj33j97L64j97J58j32R6NP9l54J63m2j91l8L80l63L97o9k98L36k42
$$ 148 158 159 26 -171 193 -4 154 22 118 123 202 -152 11 -31 -222 -260 120 -243 154 85 -213 123 -119
8048a19n6M61l26M2K79l93J57j10J41r7k01L3J57K38J9j94K5M8l13N6J60J70n6
$$ -119 -175 286 -40 2 281 -112 45 -65 76 -21 -222 -189 -32 206 225 31 56 104 -209 -153 7 177 121
8071A21r0J92j49k32J17qj84K49J68m28l9M17p2p9K4j02J85n7N7J24k68P8j65
$$ 121 31 223 74 -158 -41 -49 -233 16 184 -244 -283 134 62 -17 7 -95 90 33 90 214 -54 24 -141
8094a41K16R5n1j35L3J18n5k03K2K71k18M5j52L76n14K23m1N0K55j37j41n0K09
$$ -141 75 170 119 -16 17 135 80 -123 -101 170 -48 -3 -155 221 -293 -70 -111 -61 194 57 -84 -134 75
8117G5k6M4pj42J34m4k2j88J47K73k73k3J57P7k22q2K5L0r6K85k40J70j72K71
$$ 75 49 93 86 -56 78 34 12 -176 -29 244 -29 -52 105 182 -40 -122 -97 -67 -163 122 -118 52 -120 151
8141A51k05q3J65O1j09j99K42j2j6J70j58k74K56j26Q1J78m7L5j17O8k24K53m04
$$ 151 -54 -137 28 89 -20 -219 23 11 -5 165 7 -267 -11 -137 -56 122 75 110 -7 61 -163 90 -314
8164c14N32m9j09j55L61%j38K9Rl05j8J75J57o0p4p7K32Q5l60j33K59o9j58K46
$$ -314 218 169 60 -95 266 266 128 157 166 -139 -157 18 175 115 41 -36 196 281 -79 -212 47 -22 -180 66
8188F6QPl32
$$ 66 74 81 -251
8191b51
$$ Imaginary data points
##PAGE= N=2
##DATA TABLE= (X++(I..I)), XYDATA
0@%%%%%%%%%%%%%%%%%%Mj2J6j6J6j6J7k5L2l2L9m7N1n9O8p6Q7r9J08j20J36j52
$$ 0 0 0 0 0 0 0 0 0 0 0 0 0 0 0 0 0 0 0 4 -8 8 -8 8 -8 9 -16 16 -16 23 -24 27 -32 36 -40 47 -52 56 -64 72 -80
40h0J70j90K08k32K57k81L12l44L80m19M61n09N61o19O85p58Q39r33J042j168
$$ -80 90 -100 108 -124 133 -148 164 -180 200 -219 242 -267 294 -325 360 -398 441 -492 550 -618
60f18J319j504J733k026K421k982L842n355Q831l5851N673M0345K143J3511l528
$$ -618 701 -803 930 -1096 1325 -1657 2185 -3170 5661 -30190 -24517 15828 17971 31482 27954
75B7954k0685k4900q995o550J3964K7356J8462L012k703j9242k5604j2558J509
$$ 27954 7269 -17631 -26626 -33176 -19212 8144 26606 29618 26915 7673 -17931 -30489 -28980
88b8980J1251K6021J9713k58q749j1720k3548j6679M790J5174J9844K0433L513
$$ -28980 -17729 8292 28005 27747 18998 7278 -16270 -32949 -28159 -12985 6859 27292 30805
101C0805j3261j5182j7128j5967M161J9166J6689J3457P967j2004k1591j4375
$$ 30805 17544 2362 -14766 -30733 -26572 -7406 9283 22740 30707 18703 -2888 -17263
113a7263r496q85J8029K3197J0040O38p129j9162j8173n550L862J3896K1051J2917
$$ -17263 -26759 -27644 -9615 13582 23622 24260 17131 -2031 -20204 -25754 -21892 -7996 13055 25972
127B5972j664r121j6828j9818n524R003J2879J6286J4414j943j3644j4093j5123
$$ 25972 24308 15187 -1641 -21459 -26983 -17980 -5101 11185 25599 23656 10012 -4081 -19204
140a9204q207Q357J7361J4174J1110R39j4306j8057j1023m593N646J8079J5474
$$ -19204 -27411 -19054 -1693 12481 23591 24530 10224 -7833 -18856 -23449 -17803 276 15750
153A5750N854m12j0377j9585j2634p10O261J4826J7610O211n032j0293j5501j4089
$$ 15750 21604 21192 10815 -8770 -21404 -22114 -15853 -1027 16583 22794 17762 7469 -8032 -22121
167b2121O6J0080J2646J4987Q818o337j3344j2833j2405k066J1908J4625J0780
$$ -22121 -22055 -11975 671 15658 24476 18139 4795 -8038 -20443 -22509 -10601 4024 14804
180A4804P157m167j5538j3335q348j929J0257J6662J0997L357l680j3149j5713
$$ 14804 21961 17794 2256 -11079 -19427 -21356 -11099 5563 16560 19917 16237 3088 -12625
193a2625o690J455Q304J5577J2206J434n862j1570j5063q339L944J0122J2671
$$ -12625 -19315 -17860 -9556 6021 18227 19661 13799 2229 -12834 -21173 -17229 -7107 5564
206E564J2060K095q210j1857j2208p947L344J2206J2819R431K553q459j3368j0892
$$ 5564 17624 19719 11509 -348 -12556 -20503 -17159 -4953 7866 17297 19850 11391 -1977 -12869
220a2869o086K627J2387J3613P485O88p526j3808j1642l487L904J0623J3933Q102
$$ -12869 -18955 -16328 -3941 9672 17157 17845 10319 -3489 -15131 -18618 -14714 -4091 9842 17944
234A7944j280q004j1972j1642l876O558J0614J2203Q260k021r957j1736r904l584
$$ 17944 16664 8660 -3312 -14954 -18830 -12272 -1658 10545 18805 16784 6827 -4909 -14813 -18397
248a8397O399J1708J1119O553j501j0412j2251q678k145O102J2513J1177N083
$$ -18397 -11998 -290 10829 17382 15881 5469 -6782 -15460 -17605 -11503 1010 12187 17270
261A7270k226r233j2968q564k47N990J1626J1389M510m034r718j1838q424k5P544
$$ 17270 15044 5811 -7157 -15721 -15968 -9978 1648 13037 17547 13513 3795 -8043 -16467 -16492 -8948
276h948J0953J0671M687m513j0459j0912p473J42Q384J1624R323L631m872j0484
$$ -8948 2005 12676 17363 12850 2391 -8521 -15994 -15852 -7468 4156 13479 17110 12238 1754
290A754j0942o699J126P872J1358R094K408n103j0739j0933n049J703Q264J1387
$$ 1754 -9188 -15887 -14761 -6889 4469 13563 15971 10868 129 -10804 -15853 -14150 -5886 5501
304E501Q448J931n898r938j0478n329K827Q706J0566Q168J114o782j0618r611
$$ 5501 13949 15880 9982 44 -10434 -15763 -12936 -4230 6336 14504 15618 8836 -1782 -11393
318a1393m578L036R264J0679P162O51o977j0446r077l730L896R308J0443O351
$$ -11393 -15971 -12935 -3671 7008 14170 14821 7844 -2602 -11679 -15409 -11513 -2205 8238 14589
332A4589k76p234j0333q743l055M445R057J0290N787j303p399j0482p961k425
$$ 14589 14313 7079 -3254 -11997 -15052 -10607 -1550 8740 14527 13224 5825 -4657 -12618 -15043
346a5043N007R785R841M804j576p649r955p927j413N142R779R481M300k325p978
$$ -15043 -10036 -251 9590 14394 12818 5169 -4786 -12713 -14126 -8984 795 10276 14576 12251 4273
361D273j0316p377n73N617R585Q621M235l030q199r694o226m97O570R706Q214
$$ 4273 -6043 -13420 -13993 -8376 1209 9830 14065 11035 2836 -6858 -13084 -13581 -7011 2695 10909
376A0909L322l387q798r320n703J88O507R829P666K379l931q981r129n052R99
$$ 10909 14231 10844 2046 -7274 -12977 -12789 -6282 3547 11213 13592 9661 680 -8449 -13501 -12502
391a2502O448J0239P355J915m527q456r148m730K340O658R106P711J011n580q341
$$ -12502 -6054 4185 11540 13455 8928 472 -8676 -13406 -11066 -4408 4698 12409 13420 7840 -501
406e01q440m661K363P820Q661O331J049n432r072p751l303K566P858R210N408
$$ -501 -8941 -13602 -11239 -3419 5242 11573 12622 7190 -1882 -9633 -12936 -10370 -2512 6698 12106
421A2106L55n659r398p656k550L197Q013R137M717r70n596q624q153j790M148
$$ 12106 12461 6802 -2596 -10252 -12802 -9605 -1592 7545 12262 11292 5696 -2928 -11081 -12871 -8723
436h723P376Q535N576j761o506q262o850j880N028P830P645M384j358o955r014
$$ -8723 -1347 7188 12764 11003 4497 -3765 -10615 -12495 -7467 363 8008 12392 11034 4079 -4935
451d935o006j010M239Q696P528L168j854o717q484o130j10M688Q115P980K941
$$ -4935 -10941 -11951 -7712 984 8512 11680 9826 3109 -5375 -11505 -11615 -6927 1188 9168 12109
466A2109k764o542q329o128L38O076P554O740K948l112p419p880n517P69O192
$$ 12109 9345 2803 -5526 -11654 -11316 -5240 2314 9054 12002 8890 1471 -6409 -11926 -11157 -4965
481d965P684O500K465k954q014p829l915O70N769Q576O140J151l085p651q063
$$ -4965 2719 9219 11684 8730 716 -7113 -11028 -10358 -4589 3987 10127 11278 8193 542 -7521
496g521m038J746N565Q397O063N34m031p284p312m073K973O131P225O360L96n004
$$ -7521 -11559 -9813 -4248 4149 10212 10746 6715 -569 -7881 -11954 -8981 -2850 4375 10735 11131 6127
512F127p273o673l816K690P048P523M557L76m822q265o149k025K106P036P713
$$ 6127 -1146 -7819 -11635 -8945 -1897 5626 10183 10559 5737 -2528 -8677 -10702 -8596 -1560 6153
527F153M195n55m827p997o077j394L327O570P395M171j316n658p193o485j084
$$ 6153 10348 9793 4966 -3031 -9108 -10502 -7175 -605 6790 10961 9645 3987 -3206 -9691 -10775
542a0775M191O768O302M385j969o203o741n328j334M441P485N629L748j459o230
$$ -10775 -6584 184 6486 10871 8902 2699 -4042 -9370 -10704 -6263 1222 6851 10599 9140 2910
557B910p870m336l47L834P656O198K067j959n842p482m937O97M242O797O548K070
$$ 2910 -4960 -9296 -9643 -5809 1847 8045 10112 8153 2311 -5171 -10108 -9411 -5169 1628 8176 10246
573A0246l192n719o907m585Q59N468O466N715K040l310o245o516m140N82N931
$$ 10246 7054 1335 -5572 -10157 -9298 -3830 2636 8351 10391 7081 836 -5680 -9820 -9238 -3307
588c307O644M949J334k732p194o354k963R18N475P190M570R96l577o312o649k545
$$ -3307 3337 8286 9620 6888 -306 -6660 -9623 -8705 -3230 3960 8530 9526 5949 -363 -7012 -9557
604i557K189M731P261M783m4m228o045o450k768K904N415N989N028k0m784o348
$$ -9557 -7368 -2637 4624 9407 9363 5135 -910 -7360 -10128 -7224 -1809 4180 9208 9188 4404 -1944
620a944n897j845K562O650N847L710q5m714o785n083j676K718N992O730K652p49
$$ -1944 -7841 -9686 -7124 -474 5373 9083 8998 4284 -2501 -7584 -9260 -6542 -550 6180 8832 8083
636H083m497o943n000q83L346N453O583L086j254n021o370n125k19L906N549N657
$$ 8083 3586 -3357 -8357 -9240 -5894 -441 6142 9228 7974 2953 -3417 -8542 -8761 -4855 694 6351
652F351L247k070n570n994m285m28L907O327M802K441j610n547o464l611M4L810
$$ 6351 9598 7528 1958 -4036 -8321 -8749 -4842 1485 6287 8728 7118 1571 -4893 -8504 -8460 -4650
668d650O646N339J610k367n262n952l968Q65M221N629N534R78k821n219n348m180
$$ -4650 1996 7335 8945 6578 1316 -4636 -8604 -7739 -3518 2111 7645 8623 5802 583 -4765 -8945
684h945J123M848N558M755J331l463n619m916l022J085N151N788L825R64l095
$$ -8945 -7822 -2974 2584 7339 8670 5207 -412 -5328 -8350 -7265 -2114 3674 7499 8463 5368
699E368o142n579j893J260M687O333L504R4l231n537n438j985J996M991N851L938
$$ 5368 -774 -6353 -8246 -6986 -2299 4034 7538 7632 4401 -1136 -6574 -8559 -6563 -1572 4279 8217
715H217o52l909n152m862j793K489N191N120L372n34m376n417m519j910L017N757
$$ 8217 7565 3656 -1496 -6358 -8151 -5662 -471 4649 8021 7487 3111 -2306 -6825 -8735 -5718 39
731C9M922K976o19m707n632l653j145K849N339N439J976j117m051n947l899k12
$$ 39 4961 7937 7318 2611 -3021 -6674 -7819 -4970 369 5808 7784 6667 2616 -3331 -7230 -7442
747g442K787N603M716J923j446m510n261l876k26L574N261M749J914k106m210
$$ -7442 -4655 948 5664 7587 6141 1631 -3630 -7506 -7732 -4158 1103 5852 7766 5660 1450
762A450n376l301K26L696N169M324J379k197m574n278l012O82L567N449M337P01
$$ 1450 -3926 -7227 -7001 -3305 1864 6188 7567 5370 796 -4482 -7494 -6812 -3245 2204 6541 7242
778G242k166m946m989k592J264L556N194M243Q96l138m765m733k264J140M071
$$ 7242 5076 130 -4859 -7451 -6187 -2631 2563 6806 7702 4564 -201 -4934 -7198 -6058 -1987
793a987N203L467J82k831m940m397k246J473M672N228K648L42l075m777m554j415
$$ -1987 3216 6683 6865 4034 -906 -5303 -7549 -6076 -1404 3824 6472 6814 3739 -1038 -5592 -7007
809g007J729M411M631L087j93l404m928l959j439J986M393M719K773o75l528m725
$$ -7007 -5278 -867 3764 6851 6658 3254 -1674 -5633 -7072 -5086 -693 4026 6799 6124 2596 -2129
825b129m082m99K219M504M454K350m42l863m728l482j180K882M422M377K026j151
$$ -2129 -6211 -6710 -4491 13 4467 6817 6375 2512 -2216 -5698 -6878 -3996 426 4803 6829 5678
841E678m057m741l078p23L121M533M168J877j390l949m473k945l69L054M549L978
$$ 5678 1621 -3120 -6198 -6921 -3800 733 4901 6778 5388 1439 -3034 -5979 -6348 -3294 1255 5233
857E233J533j465m539m411k723J61L403M138M073R32j655m273m474k175N85L210
$$ 5233 6766 5301 762 -3649 -6372 -6211 -2808 1330 5403 6335 4680 407 -4067 -6242 -5657 -2447
873b447M453L631J028k411m148m243k172P30L522M195L465R91k699m531l706k197
$$ -2447 2006 5637 6665 4254 106 -4137 -6309 -5579 -2057 2138 5603 6594 3895 -636 -4342 -6539
889f539J158L500M569L036L71k656m220l772j564J168L628M433K738J67k923m385
$$ -6539 -5381 -1881 2688 5724 6095 3439 -781 -4553 -6117 -4949 -1321 3112 5850 6017 3094 -1291
905a291l514j294J786L301M293K733m54k953m285l594r10J892M046L958K054j3
$$ -1291 -4805 -6099 -4313 -1012 3281 6014 5560 2607 -1678 -5272 -6182 -4290 -244 3714 5768 5755
921E755l613l803l367r75K276M016L526K124o19l606m101k953m23J824M137L569
$$ 5755 2142 -1661 -5028 -6003 -3727 289 3815 5939 5320 1714 -2387 -5340 -5763 -3939 198 3767
937C767J962q88l216m443k664J62K065M138L973R63j081l423l932k864MK826L723
$$ 3767 5729 4841 1625 -2818 -5482 -5320 -3255 883 4856 5819 4738 1315 -2617 -5481 -5477 -2651 1072
954A072L406J391j470l839l660k428K89K838M242K979P94j382l842l871k043N07
$$ 1072 4478 5869 4399 560 -3100 -5528 -5239 -2401 1841 4820 5614 4232 390 -3481 -5524 -5017
970e017L241L769K960L66j415l769l945j858R06L033L560L304N07k520l721l141
$$ -5017 -1776 1993 4953 5319 3904 135 -3810 -5668 -4762 -1729 1831 5135 5642 3122 -599 -3740
986c740j971J182L461L653K733J19k731l312l477j739J475L344L473K344L25k512
$$ -3740 -5711 -4529 -1068 2585 5318 5437 2706 -606 -4083 -5822 -4347 -1003 2470 4814 5139 2627
1002B627m017l045r58J058L666L794K056l33k274l967l154q28J888L234L848J764
$$ 2627 -1390 -4435 -5393 -4335 -669 3125 5181 4848 2574 -1393 -4547 -5375 -3487 -253 3595 5359
1018E359j051k135l668l056p49J635L496L422J920q37k986l470k691k89K273L488
$$ 5359 4308 2173 -1495 -4551 -5300 -3665 -169 3253 5173 4336 1350 -2120 -4811 -5100 -2827 661
1034F61K877J770r26l081l707k135m24K133L754L314Q74j450k948l384k251J81
$$ 661 3538 5308 4382 1301 -2406 -4541 -4965 -2832 922 4236 5110 3660 712 -2672 -4923 -4742
1050d742K122L363L454O80j282k946l315k100K20K774L242K872Q46j925l038k883
$$ -4742 -2620 743 4197 4877 3595 649 -2666 -4766 -4546 -1772 1470 4342 5188 3263 225 -2658
1066b658k420N78K767L320K599P61j816l353l323j305M94K944L673K339J03j658
$$ -2658 -5078 -4500 -1733 1587 4186 4947 3131 -222 -3545 -4850 -4356 -1412 2261 4600 4703 3045
1082C045l315l106j282O99L110L200K084J8k078l087l190j309J526K733L315K006
$$ 3045 -270 -3376 -4658 -3959 -849 2351 4435 4453 2375 -712 -3902 -5211 -3685 -952 2363 4369
1098D369N0k560l103k515j033J387L095L504J487k78k362l224k970n44J550K920
$$ 4369 4419 1859 -1244 -3759 -4792 -3405 -310 3194 4681 4403 2041 -1183 -4153 -4697 -3147 -227
1114b27L259J460o88k195l365k759O8J357L135L046J535r91k206l364k301l23
$$ -227 3032 4492 3804 1609 -1756 -4515 -4447 -3090 45 3091 4626 3635 1429 -1935 -4236 -4559
1130d559J970L048L104J011j057k899k781k231j21K104L201K970R36j379k659
$$ -4559 -2589 459 3563 4574 3517 618 -2163 -4394 -4515 -2411 790 3760 4696 3317 658
1145F58k985j626j29J744L656K421O66j472k583l116j468L46K161K808K614N22
$$ 658 -2327 -3953 -4082 -2338 1318 3739 4405 2933 350 -2766 -4234 -3888 -1727 1081 3695 4217
1161D217j294k817k835j669M67K573K942K055P01j568l174k791q87N02K492K841
$$ 4217 2923 106 -2729 -4398 -3931 -1358 1584 3639 4340 2772 -402 -3193 -4080 -3578 -1086 1755
1177A755K475k49j560l086k803j039Q14K818L147J514K30j883k833k552j161J291
$$ 1755 4230 3981 2421 -665 -3468 -4507 -3693 -875 2272 3786 4016 2133 -700 -3252 -4413 -3122
1193c122K690K628K002j36k080l157k239p08J092K917K603J455j37k259k856k196
$$ -3122 -432 2196 4198 4062 1982 -1175 -3414 -4122 -3030 -113 2490 3945 3808 1549 -1307 -3503
1209c503o43J128K801K778J278m38k065k833k166l54J411K876K647J287r77k173
$$ -3503 -4146 -3018 -217 2561 3839 3401 1336 -1497 -3663 -4017 -2606 270 2917 4204 3227 1054
1225A054k638k357J25J301L080K420J081j219k315k593j992J55J939K729K540
$$ 1054 -1584 -3941 -3816 -2515 565 2985 4066 2847 532 -2061 -4053 -3898 -1959 770 3310
1240C310R52j107k650k562j630o3K107K520K359N49j197k358k617j645N08K138
$$ 3310 4262 3155 505 -2057 -3687 -3750 -1643 877 3236 3785 2588 230 -2387 -4032 -3524 -1386
1256a386K661K107K95j266k303k530j485P26K016K730J945K45j550k318k621j166
$$ -1386 1275 3382 3677 2411 108 -2422 -3907 -3181 -1165 1565 3510 3755 2205 -113 -2734 -3900
1272c900O71K270K530J977J37j725k458k459q33R65K083K637J695n4j625k561
$$ -3900 -3229 -959 1571 3548 3685 1960 -498 -2957 -3790 -2825 -742 1895 3590 3536 1911 -650
1288f50k338q11J078K071K875J628o15j830k381j971q55J056K522K597J374l76
$$ -650 -2988 -3799 -2721 -650 2225 3853 3238 1408 -973 -2944 -3799 -2743 -221 2376 3750 3374
1304C374j677k726k213l74J309K615K264J123m02k122k447k030l37J592K400K279
$$ 3374 1697 -1029 -3242 -3616 -2307 308 2572 3695 3293 1171 -1276 -3306 -3643 -2051 349 2628
1320B628J177q40k033k561k009Q9J549K477K397Q38j085j963k435j499j54J595
$$ 2628 3805 2965 932 -1629 -3638 -3549 -2000 477 2874 3712 2627 664 -1771 -3270 -3424 -1829
1336a829K496K216P03j029k188k404j635K58J861K559J792O42q75k493k255j251
$$ -1829 667 2883 3586 2557 369 -2035 -3670 -3412 -1551 1008 2800 3442 2567 74 -2181 -3432
1352c432L76J849K345J751N46j171k126k334j266K04K052K499J525M25j298k371
$$ -3432 -3056 -1207 1138 2889 3435 2264 138 -2196 -3462 -3258 -1206 1293 2818 3243 1945 -426
1368d26k061j226Q03J981K479J577K51j488k247j825j306R90K096K157J463l7
$$ -426 -2487 -3713 -2910 -929 1550 3127 3378 1890 -357 -2182 -3488 -2498 -402 1755 3218 3181
1384C181j635k239j993p35Q92K092K107J394l06j340k653j497l26P61K378J983
$$ 3181 1546 -693 -2686 -3421 -2529 -437 1670 3064 2758 1418 -1235 -2732 -3058 -2297 81 2064
1400B064J306l35j743k224j986l04J438J544K442R57o43j578k419j696l85J686
$$ 2064 3370 3035 1292 -932 -2918 -3222 -1784 -240 2202 3159 2516 938 -1481 -3177 -3562 -1876
1416a876J976K239P06o38j455k208j570N4J478J845J911Q27o44k135k073j403
$$ -1876 100 2339 3045 2407 952 -1256 -2826 -2772 -1294 551 2462 3289 2645 510 -1563 -2966
1432b966Q5J362K271J682O96j137j768k035j336M16J298K418J694M52r90k062
$$ -2966 -2881 -1519 752 2434 3130 1993 225 -1810 -3146 -2730 -1432 986 2680 3132 2142 80
1448H0k118r25N77J324K238J692J14j069j968k013j125M33J666K280J673L50j504
$$ 80 -2038 -2963 -2386 -1062 1176 2868 2982 1913 -55 -2068 -3193 -2760 -1094 1186 2859 3209 1705
1465A705k033j857j044Q44J947J619J585J86j335k362j476p78P86J923J694J423
$$ 1705 -328 -2185 -3229 -2385 -438 1181 2766 2952 1617 -745 -2221 -2999 -2213 -290 1404 2827
1481B827lj456k012j690n84P51J714K187J137j87j471j689k016n80J092J689J927
$$ 2827 2824 1368 -644 -2334 -2918 -2167 -453 1734 2871 2684 1213 -476 -2492 -3072 -1980 -291 1636
1498A636J258n91j149k221j470j98P80J894K068J135n85j792j977j348j59J142
$$ 1636 2894 2303 1154 -1067 -2537 -2735 -1955 -61 2007 3142 2557 765 -1212 -2560 -2719 -1577
1514a577J937J855O25l37j478k313j521K74P52K400J643O05n04k061j776j346
$$ -1577 360 2215 2840 2503 1025 -1288 -2809 -2535 -1783 617 2260 2865 2361 300 -1476 -2822
1530b822J77J391K103J431M20p21j566k153r34J75J542J933J414M68q17k132j934
$$ -2822 -2645 -1254 849 2280 2700 1979 413 -1740 -2674 -2499 -957 976 2390 2858 2041 -91 -2025
1547b025q02L01J688J770J540K15j009j993j711q48P32J170K144J378m8j049j534
$$ -2025 -2827 -2526 -838 932 2472 2687 1678 -315 -2026 -2874 -2142 -972 1172 2550 2502 1453 -81
1564h1j793j033Q58J373J849J388K0j244j872j840l93Q53J469J933J081K7j391
$$ -81 -1874 -2907 -2049 -676 1173 2561 2581 1337 -535 -2375 -2768 -1915 -446 1487 2568 2595 1204
1581A204j968j361m93O83J895J455P87K77j497j910j478l67J105J451J965R43
$$ 1204 -764 -2125 -2618 -1935 -40 1415 2202 2479 982 -928 -2406 -2773 -1668 -217 1748 2691
1597B691p02j262j762j356q9R44J736J809M89k03j352k048j236j85R99J823J533
$$ 2691 1989 727 -1035 -2391 -2480 -1536 200 2009 2498 2295 943 -1105 -2341 -2526 -1527 296 1829
1614A829M45j59j791j531j280q0J622J566J267O08o13j400j795j109J31J495J642
$$ 1829 2274 2115 324 -1207 -2487 -2567 -945 621 1888 2496 1883 483 -1312 -2421 -2290 -795 847
1631H47J269K77r13j345j465r53o8J266K027Q21R33j366j238j764p82K75J310
$$ 847 2116 2393 1480 135 -1330 -2283 -2351 -1085 942 1763 2696 1330 92 -1672 -2454 -2179 -869
1648h69J989J173J30r62j476j711q12N76J383J657R98K49j086j467j472o12K69
$$ -869 1120 2293 2423 1461 -15 -1726 -2538 -1962 -579 1078 2076 2325 1239 -228 -1700 -2312 -2043
1665b043J373J908Q58K03j073j544j454m86M94J487J719R91k27j554j294j491
$$ -2043 -670 1238 2096 2299 1226 -318 -1772 -2258 -1764 -277 1442 2433 2206 652 -642 -2133
1681b133l48R26J314J720P13k56j047j641j141m54O58J752J510P28n7j533j728
$$ -2133 -2481 -1555 -241 1479 2192 1936 889 -752 -1893 -2347 -1689 63 1573 2301 2244 711 -1017
1698a017r13l64J045J372J555N45n28j020j708j238j2J104J345J561O91n69j416
$$ -1017 -1930 -2294 -1249 123 1678 2223 1695 675 -1033 -2271 -2283 -1179 166 1727 2418 1849 433
1715D33j434j099L24N70J492J463P44q03j432j620q79N1J235J604J277M23p56
$$ 433 -1001 -2100 -1776 -1206 286 1749 2493 1690 258 -1362 -2241 -2190 -955 649 1926 2349 1593
1732A593j535j460r24K90J222J733Q65L73o21j435j310j039N78J196J307J328
$$ 1593 58 -1402 -2326 -2036 -814 919 1784 2157 1536 101 -1209 -2248 -1670 -474 833 2161
1748B161k17m84j641j332p54M33R61J775J169J0q22j590j139q16M43J683J316
$$ 2161 1944 1460 -181 -1513 -2267 -1834 -873 902 2071 2081 1259 -331 -1470 -2286 -1843 -160 1156
1765A156P84K23j196j211j554n57M98J569J501Q82j38j106j335j678Q1O83J040
$$ 1156 1940 2163 967 -244 -1798 -2355 -1857 -288 1213 2095 1957 851 -484 -2162 -2081 -1398 -358
1782c58J566Q72j54j260j281j172l61Q92J135J559O65n12r00j587q95j05M42J547
$$ -358 1208 2080 1926 666 -615 -1787 -2148 -1256 -121 1438 2103 1591 691 -896 -1791 -1896 -1454 93
1800I3J048P00k01j223j343j086Q6O18J708J402L45m19j573j226j064M11P16J500
$$ 93 1141 1841 1640 417 -926 -2012 -1926 -1308 400 1802 2147 1728 155 -1071 -2135 -1724 -1008 492
1818D92J182J88m42j284j200p58n2J084J277J232L62n72j308j412n38l54J284
$$ 492 1674 1862 1420 136 -1064 -1822 -1874 -790 487 1719 2081 1509 201 -1211 -1749 -2103 -819
1835h19J616Q71J83o48j141j516m84L04J017J414P75L24q85j135j281l78K90R65
$$ -819 797 1668 1851 1203 62 -1454 -1938 -1634 -617 797 1572 1896 1011 -124 -1405 -1783 -1493 -528
1853e28J695O03P2j106j060j295m2L12R47J487O42k45p04j283r91j99K74J293
$$ -528 1167 1770 1842 736 -324 -1619 -1661 -1349 -402 1085 1727 1482 778 -505 -1496 -1695 -1421 -128
1871a28J533O57m81q16j347r47l31N25J024J450Q21j91j011j357j376K98P30R07
$$ -128 1405 2062 1581 765 -582 -1529 -1860 -1335 -311 1139 1960 1769 758 -599 -1975 -1677 -947 -40
1889d0J201Q57n50q09j575p34k8M95J355J166N84n45q26j420j012j2J093R39J046
$$ -40 1161 2018 1468 659 -916 -1650 -1678 -1183 172 1338 1922 1377 551 -869 -1881 -1893 -800 139 1185
1908A185P39n39j132j312q62R6Q30J328J108L82n88j152j141o63K29N07J355J263
$$ 1185 1924 1385 253 -1059 -1921 -1825 -995 333 1441 1823 1235 83 -1058 -1721 -1492 -985 370 1633
1926A633J59n68j191j207n89L37P12J169J198m9l05j413j291l53K79J002J075
$$ 1633 1792 1224 33 -1174 -1763 -1426 -714 455 1653 1604 1299 -114 -1405 -1758 -1479 -477 598
1943E98J188K32r47j035j231k93J69Q84J243O58K86q42j358q38l97Q5J501J203
$$ 598 1786 2018 1071 36 -1195 -1488 -1319 -435 808 1466 1752 910 -448 -1286 -1683 -1598 -97 1106
1961A106M94L4q83j291n26n44N38P65J137O36r9o84r76j563N06K44P56J705J62
$$ 1106 1600 1634 751 -540 -1066 -1610 -1072 -307 830 1466 1367 683 -293 -1856 -1350 -1106 -350 1355 1517
1980A517J36j228j015j226J66K43J272J391O43m42j064j236n28k63O52J039J163
$$ 1517 1653 425 -590 -1816 -1650 -1407 -135 1256 1899 1457 393 -843 -1371 -1634 -982 57 1220
1997A220M87k90j018j154q39L81M47R94R19N72m06j072j276p63M15P79J188R78
$$ 1220 1707 1417 399 -755 -1594 -1213 -766 228 1147 1719 1313 241 -1035 -1798 -1383 -604 584 1562
2015A562K87q19j162p33q49K61Q32J148O07K24l71r32r35p30J02J086J110P42
$$ 1562 1849 1030 -132 -865 -1714 -1453 -621 527 1134 1358 987 55 -880 -1610 -1508 -422 688 1430
2033A430K87q29p17j151m48Q8Q01J220M93O13p96j306r86l97N58J254P14O10j06
$$ 1430 1717 888 171 -980 -1428 -1340 -539 681 1174 1787 991 -315 -1301 -1698 -1140 114 828 1438 1332
2052A332o58r72j079l13O25R50J018N62lp33r31j193j2M57P89J018P30l07o43
$$ 1332 674 -298 -1377 -1690 -1065 -115 903 1465 1462 729 -202 -1395 -1407 -950 -161 857 1587 1280 637
2071F37j272n40k91M99R06J237K86k0r83j074q34L44L35R05J111L40k59j113p27
$$ 637 -635 -1175 -1466 -967 -61 1176 1462 1442 459 -615 -1449 -1105 -770 135 1246 1586 1327 214 -513
2090e13q17K07M27R28P58M04k93j050q88m90P8N83P17J301J3k16r71r21n12j44
$$ -513 -1330 -1123 -696 232 990 1394 1101 51 -837 -1327 -1249 -666 51 1352 1365 1149 178 -743 -1255 -1399
2110a399J028P87O00M77l74j253p59o29K10N80J222P28J94o08q82p98m72K67P56
$$ -1399 -371 416 1016 1493 1119 -134 -893 -1522 -1312 -732 490 1218 1412 804 -78 -876 -1348 -1081 -325
2129c25P87P68M14o44j241n70n84J94R86P99N29K48p99o13r34l3j38R41J114P
$$ -325 462 1230 1644 1000 -241 -811 -1395 -1201 -215 584 1113 1361 562 -51 -985 -1018 -1156 -215 899 906
2149I06N94q33q84p50j23K49P12R41K90K64p28j195m42k63K71J045Q59K98j91
$$ 906 1500 667 -217 -967 -1090 -841 -129 812 1102 1366 638 -557 -999 -1262 -991 54 913 1211 1020
2168A020p13m77j075m3N04P42Q45M85R9p86q63q94j2M01P98Q78O45n02q07q55
$$ 1020 307 -170 -1245 -1288 -784 -42 803 1288 1387 601 -262 -1156 -1168 -767 31 909 1554 1052 245 -610
2188f10m00k84N94Q38Q35K52k99n75r98n05N3N12P51Q30K67n01k69j242p07K90
$$ -610 -1010 -1294 -700 138 973 1225 926 351 -647 -1152 -1099 -587 164 994 1261 760 491 -751 -1458 -1168
2208a168N22Q92P44J11k78n80o80q81L07N88P60Q14R6m69p41r12j98j24P94Q90
$$ -1168 -646 246 990 1101 823 243 -437 -1318 -1011 -423 337 1151 1247 778 37 -875 -1073 -1197 -403 487
2228D87M97L31n33q68q05k65J7R00O85O94L5m10j079n94n38L60R97Q08P30l20
$$ 487 984 1315 782 -86 -891 -1156 -1139 -239 446 1140 1175 765 -314 -908 -1446 -1086 -89 719 1449 1129
2248A129p71o70p86p0J24Q12R47N21j2p61o46p55j08J18R09P37L33j5p92n47p12
$$ 1129 358 -312 -1098 -1168 -1044 -232 715 1236 1224 463 -183 -938 -1046 -928 -19 718 1051 1036 244 -303 -1015
2269a015l88N20P07R29M21j93o15r00p14J77K16J016N80O45n77o00p60n93O4M98
$$ -1015 -1403 -883 -176 753 1174 981 366 -534 -1248 -1071 -855 161 741 1386 809 209 -551 -1144 -1080 -582
2289e82R80M82L28l44o16r47l26m9O00J036J54M79n39q39m25l40j8O63M85Q19
$$ -582 398 880 1208 864 248 -699 -1025 -1074 -474 562 716 1195 656 -183 -608 -948 -966 -303 182 1001
2309A001K73m74p48n79k94k22P95O39O19km58m54r35j14j21Q42O12O81j19l47
$$ 1001 1274 800 52 -527 -821 -1043 -248 391 1010 1008 550 96 -839 -953 -1074 -232 380 1061 942 595
2329E95q39p33K2K15L91P24O21K6l47n53q75l90K96M91R46N83j31m40q09p49k97
$$ 595 -244 -977 -955 -740 -349 375 996 1022 675 122 -753 -1143 -847 -356 590 1173 1042 602 -207 -956 -1253
2350a253M24O70O86O34j51l38r55m46n29O18M25Q31N89n01m84n99m03m16N17P82
$$ -1253 -829 -159 527 1161 1010 672 -283 -729 -1258 -640 -215 616 1205 704 220 -379 -782 -1198 -681 101
2370A01O40J98k38l55r83j02m4r3R54O17L69m25l46r05k48j97O83N66N82J55l9
$$ 101 741 939 701 346 -637 -739 -783 -876 78 695 1064 639 293 -612 -860 -1057 -374 192 774 929 890
2391H90o99o33m69LN24N63Q05J12k36o89n98n76Q9N44L96P79J70k78o96o95j48
$$ 890 191 -442 -911 -908 -384 179 984 1096 860 171 -427 -1003 -914 -370 26 805 975 697 1 -694 -842
2412h42j43R25L14N58o4m3o22p82m03J58P23Q17L01L50o17o25q87k1K19P05L68
$$ -842 -985 -60 254 812 748 705 83 -699 -1102 -944 -221 596 897 1247 630 5 -882 -903 -684 21 389
2433C89M14L10o23r00l66k26J52N23J061K18K0m82p71l26l73J72M82R73L87n6
$$ 389 803 1113 490 -410 -776 -1002 -850 -327 734 952 972 490 -281 -607 -980 -808 -326 647 1034 978
2453I78q37m66k05m01L58Q02K83L24j80j48r20o52R9N10M99P32K69k19m61p93
$$ 978 141 -325 -530 -931 -573 229 512 836 656 508 -412 -1064 -965 -455 44 776 1045 826 365 -428
2473d28n60N8L13Q35M51J53l44k89p91j21q1K38N92P29K51k02o23q09k40j77P53
$$ -428 -988 -930 -617 218 669 822 478 189 -602 -723 -804 -566 26 755 1006 804 181 -628 -868 -1045 -292
2494b92O16K58K63l30k08r44k61j97O47P11M93J75l04l37j075k64J28R59L60M11
$$ -292 324 582 845 515 307 -637 -898 -1095 -448 263 756 931 627 290 -785 -1049 -921 38 398 809
2514H09J12l54q79r2n40K80N84K29R65l64k85k75r01j67J92N81M69L14N8j30o24
$$ 809 921 567 -312 -404 -944 -664 -80 149 1114 750 465 190 -711 -878 -686 -105 364 678 736 606 -18
2535a8o44K0jL80P68M09o9k97r44k92o8n5Q25L80N71k19n23k72p34j84N28M90
$$ -18 -662 -642 -643 -263 505 914 845 548 -396 -688 -756 -811 14 394 965 746 223 -49 -783 -967 -439 51
2557E1N58J97O1m09q36m88O9J10P19M02M51k99m54l66q16J28M77N79M55Q4J76
$$ 51 609 806 867 458 -378 -866 -797 -687 32 434 885 586 132 -234 -1050 -922 -445 134 589 673 849
2578H49m34p43n02J47L71M13N89j5j49m21p24r1J6K57M44P81k0j22o04m84q8l50
$$ 849 415 -328 -830 -683 -312 101 690 675 526 105 -619 -710 -694 -437 7 788 768 646 42 -442 -530 -880
2600h80M30M66P68K03l57q50l47n29M36M06P07M0J55j56o02n60n9n2M27P09L28
$$ -880 -450 16 784 987 630 -220 -567 -1096 -660 -254 453 493 648 492 -110 -670 -729 -781 -354 355 683
2621F83J28m70n41k36l91J00O93N39J76M14o96o65m41Q1QM72N70J77L12m03n94
$$ 683 811 341 -200 -436 -827 -727 -34 505 681 1095 399 -266 -707 -626 -618 -146 424 601 913 510 -84
2642h4p24q4K73L14O87L92q9l45p23k78k58K60P37L46K42L8k81o49l84k87K40
$$ -84 -808 -892 -619 -305 382 774 685 340 -383 -661 -919 -659 78 424 666 704 423 -226 -610 -897 -657
2663f57O61P23K14l53l15m84m71m5K11L76O31N61m48m02n21m85R8L38M09J95O52
$$ -657 4 727 941 588 273 -211 -682 -727 -516 -140 491 1052 604 202 -319 -804 -706 -368 41 236 888
2684H88l79n28k87m19r1L39P51M07N7k16l51n48m29J78K32O71K30J02j01m89n96
$$ 888 509 -19 -306 -725 -816 -477 274 681 738 522 171 -377 -806 -628 -396 275 505 607 506 17 -579
2705e79l53J55N28M62L54P0Lm69o40l38J84J46P45L96j95K3p58j05l09j49O25
$$ -579 -932 -777 -249 213 567 637 640 171 -469 -807 -623 -477 268 664 469 492 -266 -371 -680 -829 -204
2726b04N57M03P4q60J35n47m02K14N91L65K09K34n36l34n57j13K92M87M11L62
$$ -204 353 756 830 -30 105 -442 -844 -630 -39 326 535 769 233 -101 -658 -771 -479 8 419 781
2746G81J85n92o53L7n98K59O14O06j24J60m92m38m31n2M76L04M25L23l69j53n46
$$ 781 966 374 -279 -242 -840 -581 33 639 515 675 183 -255 -686 -738 -262 42 467 790 421 268 -278
2767b78k21k11M19L58L28K99l05k64n98k83J01L05M12O79j59J31o21k90k63M8
$$ -278 -499 -710 -291 67 395 694 389 125 -473 -756 -655 -350 62 741 582 713 92 -198 -461 -413
2787d13Q1M68L87jK47o01k84m83m8K66M42L41L32m08k91l24k79j25M58N18J65
$$ -413 -332 136 523 522 769 168 -116 -599 -647 -381 61 402 734 326 35 -289 -568 -693 -235 283 448
2808D48P6j01n06J4o95j25Q32L97R0R9k86l45k37n91M22L05N22L12l28J94m06
$$ 448 524 423 -83 -69 -764 -889 -57 340 430 529 243 -102 -339 -930 -508 -203 319 631 303 497 91
2829I1m74j78K02M49J16N87m93L8m67k94J2m19Q89J77O9K61n17l28k77q9J67L61
$$ 91 -383 -561 -359 90 206 793 300 338 -129 -423 -411 -830 59 236 305 566 49 -279 -556 -645 -478 -117
2851a17L80K67r5r7l77m06j72L73K68J76N28m81k80j74p1m36M11L77M41p9l9l54
$$ -117 263 530 435 338 -39 -445 -617 -244 24 200 728 247 -33 -207 -278 -714 -303 74 515 436 397 43
2873D3n33j06j01L95M90M02J32k29n75j10k81o0M26K26K74M82o35m8l49k20j18
$$ 43 -490 -596 -697 -302 188 590 722 493 -82 -192 -473 -533 -107 119 393 875 240 192 -157 -377 -495
2894d95L48L87K01J09j11n03k18k52n5M87K39N65k0m77k27m20k96M11R2N30L48
$$ -495 -147 240 441 550 439 -64 -282 -534 -589 -102 137 702 682 205 -22 -442 -738 -327 -235 295 643
2915F43l96J84m50l60k53J90L9Q38N7K3k85k32l29j45J53J56N92N9K10n10k34
$$ 643 247 431 -19 -379 -632 -442 -403 435 492 515 230 -2 -331 -476 -323 -167 425 484 694 184 -50
2936e0l30K20m06M30M10L12j52J65p18k96j19L02K59J55L18J02o13j76k60l56
$$ -50 -380 -160 -566 -136 274 586 434 599 -119 -415 -534 -232 27 182 500 602 -11 -187 -447 -803
2956h03N57J67M60J16j42p3o64J1l01M45P5P15J34j67k74m58j7l85K02M22K66
$$ -803 -246 -79 381 497 355 282 -382 -371 -672 -227 -152 563 697 530 256 -202 -219 -604 -402 20 286
2977B86J16M4l19l17l66J96K94K17M21K26j3p90k59k57k2L29L24L40J64j25k84
$$ 286 402 446 127 -190 -556 -360 -66 151 572 798 785 -5 -264 -521 -543 -214 110 450 614 489 205
2998B05o54j16L33N2L50J98M9K30p62k55j41K96M3M14K42%j87m48j83l1j05L52
$$ 205 -449 -565 -232 -180 170 368 417 647 -115 -370 -511 -215 -172 242 484 484 297 -151 -334 -365 -470 -118
3020a18K89M96j76k71k53n47K75O5J62K01M20k75Jl57m2k45P4L09J93L39k34j53
$$ -118 171 667 491 220 -33 -580 -305 -240 -78 123 543 268 269 -88 -130 -375 -301 8 201 540 306 153
3042A53j75m49j9J9K43N76Rj32j78n2l51K10l85L73O24J8r2m26K4l69j41lM92
$$ 153 -22 -471 -490 -471 -228 348 357 225 47 -5 -356 -146 -531 -158 466 484 392 -34 -10 -379 -520 -523 -31
3065c1L79L39j70m27k44l71K2J68L14L17K36p2j85o53J8k90P11J56L28M0m24n1
$$ -31 348 687 517 90 -154 -525 -503 -335 -21 296 532 460 275 -378 -360 -650 61 217 545 585 161 110
3087A10n38k52J95J35L59M57k57J10k90k33m52L40J76M70J57Q5l13k76k31k68
$$ 110 -428 -680 -485 -350 9 466 209 319 29 -204 -656 -316 -140 330 487 572 259 -17 -248 -516
3107e16R7J76N43k60M83j62k88k64j97P6M31o6K38j76p7j29j47k54M05l26R52
$$ -516 -419 -243 300 40 523 361 73 -191 -388 -312 119 53 291 115 38 -91 -238 -492 -87 -413 539
3128E39k01k0j46n1m92j0K23J40J94J19m6k47j03l86J32J07K64J02K95k49l24
$$ 539 338 318 172 121 -371 -381 -158 -18 176 295 249 2 -101 -487 -355 -248 16 118 413 164 -160
3149a60K03m64j4J46N18K61j73mq0n23l22M49p2J70J86M67k19l75J4m01J77j65
$$ -160 43 -421 -435 -289 229 490 317 313 233 -290 -612 -163 -235 -65 121 588 369 -6 8 -393 -216 -381
3171c81N27K79K97j94n78n8l30O2J43L88j6K33K96o13m31j22L23k4L21K41O0k4
$$ -381 146 425 722 528 -50 -108 -438 -376 -233 155 139 372 668 55 -376 -498 -175 -199 122 363 423 399
3193C99k48l65JN8o3N12KN0J51k45m58k43M37j83J64M71j01j6l88j30j30rJ81
$$ 399 151 -214 -213 -155 -218 294 296 346 497 252 -206 -449 -12 -195 -31 440 339 323 -65 -195 -325 -334 -153
3216a53M21J07J52j71o37L9k07N3M35K42l2j8Pl78j73K3M5K2K72L21R1l35p8n67
$$ -153 268 375 527 356 -281 -242 -449 -396 39 281 249 231 238 -140 -313 -290 -245 -223 49 370 461 126 48 -519
3240e19L08r9K23L26K27j91k37j42j53J06k27J56K80J21M31n62j35qm31O14j24
$$ -519 -211 -310 -87 239 466 275 38 -104 -257 -151 -378 -222 58 179 610 48 -87 -95 -526 88 -36
3261c6k8K92q8J5m39J3j49K85K5L47K68l19n7j93n71N57MK47P7J92N1n70R3k30
$$ -36 -64 228 140 155 -284 -271 -420 -135 -110 237 505 186 129 -64 -635 -78 -74 173 250 442 493 -77 16 -214
3285b14j75K70J37M54k22j04j7m20j88J42J56L11K76j51Qk69o3m31J98L30pJ70
$$ -214 -389 -119 18 472 250 146 129 -291 -479 -337 -181 130 406 255 263 -6 -69 -500 -302 28 21 191
3307A91K40k8l95k49l25L80L40J62O3k24J86k61n24K42J05r6L63L29k35k7l9o35
$$ 191 431 403 8 -241 -566 -186 154 316 379 155 341 80 -444 -202 -97 -193 170 499 264 237 198 -437
3329d37K09q1L85K85J36k56m5j92pm67M37l0J28K06m4K8n73J37l31M23J82O2L82
$$ -437 -228 -309 76 361 497 241 196 4 -3 -470 -33 -63 65 271 227 255 -318 -181 -512 -89 93 155 537
3352E37l11j33j32k75J63n8L40K78j1J13m01m03J3p6k9L90J63L78k79k75j89k8
$$ 537 226 93 -39 -314 -151 -209 131 409 398 511 110 -293 -280 -356 -385 5 168 546 267 -8 -197 -225
3374b25n1j80M61J79RJ14Jp04R5K60j32L20L52j14k15j69j06l83l2N14kK00j75
$$ -225 -276 -456 5 184 193 307 308 -396 -301 -41 -173 147 499 385 170 1 -105 -488 -520 -6 -8 192 17
3397A7L34l63k17J49m65M24J07K56n0Q8k26j58k40J04K91L44O6p1k19k60k74K1
$$ 17 351 -12 -229 -80 -545 -121 -14 242 192 280 54 -104 -344 -240 51 395 461 390 171 -89 -363 -342
3419c42K75k8M09p2K74m07j48l56J15J32K1M91j8k50j55j48j33o6N9K80L21j26
$$ -342 -67 -95 314 242 516 109 -39 -395 -280 -148 -127 364 346 96 -59 -207 -340 -406 -347 -67 254 128
3441A28J77j74k92p8L51l24K62J80j71K71k96k43j98R4r1N72J93j00m3k92l73
$$ 128 305 131 -161 -239 112 -212 50 230 59 330 34 -209 -407 -313 -404 168 361 261 218 -74 -447
3462d47N43l04K61l9J54Q8M5l28l18Pj47M74O0m3K35k98L56n00K55k91n7M69j44
$$ -447 96 -208 53 14 168 256 301 -27 -345 -338 -485 -11 49 6 241 -57 299 -201 54 -237 -294 175 31
3485C1M06k44k06q6j39P2J18L34L9K8m58J51J5m35K15j22N18k50J92p0k12q0K08
$$ 31 437 193 -13 -99 -238 -166 -48 286 325 353 -105 46 61 -374 -159 -281 237 -13 179 109 -103 -183 25
3508B5l2J19K34j25N2j75j52L0l00J31K82L37k16J36k47k2j26l76J96M09r6J45
$$ 25 -7 112 346 221 273 98 -54 -24 -324 -193 89 426 210 346 99 77 -49 -425 -229 180 84 229
3530B29N9m43K3p8J16J3J01J45J34k18o5m3q2L9k42L65j7J92%k71P1j40q7J20
$$ 229 288 -155 -132 -210 -94 -81 20 165 299 81 16 -27 -109 -70 -312 53 36 228 228 -43 28 -112 -199 -79
3554g9O9L04k2q6l10L04l15l7M00k43j00M24N2m27P9k36P4M6K45O8J39lj18l97
$$ -79 -10 294 272 186 -124 180 -135 -172 228 -15 -115 309 361 -66 13 -223 -149 -103 142 210 349 346 228 -169
3578a69p0R0J33k25M83J35J08n88qk71J19J7M95k19K01j17Ml00m5M70n31K15J76
$$ -169 -239 -149 -16 -241 242 377 485 -103 -111 -382 -263 -246 249 30 231 114 118 -182 -227 243 -288 -73 103
3601A03L36m57L23m06Q9k49K21K08J0O7n3j10j88k30J63J0K87j85L17l24P2k32
$$ 103 439 -18 305 -101 -12 -261 -40 168 178 245 192 82 -106 -336 -173 -163 124 -61 256 -68 4 -228
3623b28J7Q9N9L62j89K10l10o7m6N0L5J6L04l70L64k17j05k10J07R0l3K72mj0
$$ -228 -211 -122 -63 299 110 320 10 -57 -103 -53 -18 -2 302 -68 296 79 -26 -236 -129 -39 -72 200 196 186
3647A86k51j21j68L60o1J2K69O5j64l01J65j61k96L47K31o1l4K5k6j0k99K32j65
$$ 186 -65 -186 -354 6 -55 -43 226 291 127 -174 -9 -170 -466 -119 112 51 17 42 16 6 -293 -61 -226
3670b26J94R4K38m4j23j42j30oK5K03L07j65l30Q2r9N7j55k03K80K28o8J00j38
$$ -226 -32 62 300 256 133 -9 -139 -145 -120 83 390 225 -105 -23 -122 -65 -220 -423 -143 85 17 117 -21
3693b1k3l21L19m3K72L2J26j13j98n5m19M35M0K47k31K47M8o02L24k34P5j95L38
$$ -21 -44 -365 -46 -89 183 215 341 228 30 -25 -444 -9 31 278 47 294 342 -260 64 -170 -95 -290 48
3716D8L36k31j8k77Q1k58L0J78K85p5l4O2q1k54M8j37O30k14K5q0l4q4k50J29
$$ 48 384 153 135 -142 -61 -319 -289 -111 174 99 65 127 46 -208 -160 -297 333 119 144 64 30 -54 -304 -175
3740a75J44Q8p6K45q3n9r6nj22J42p6L77k51j24N1lj37O5J3M9q4L22j61P1J80
$$ -175 -31 57 -19 226 143 84 -12 -17 -139 3 -73 304 53 -71 -20 -23 -160 -95 -82 -33 -117 205 44 115 295
3765B95l14m52K04J28K00j11J7k36J55P0k52j84L75J85L3q8o6j45Q9j20P0M42
$$ 295 -19 -471 -267 -139 61 -50 -33 -269 -114 -44 -296 -480 -105 80 113 25 -41 -186 -97 -217 -147 295
3787B95j5j07k19j24J52m28L86J58k06L06J24M1k96p5k71K95q4J27J74l7j47j2
$$ 295 280 173 -46 -170 -18 -446 -60 98 -108 198 322 363 67 -8 -279 16 -68 59 233 196 49 37
3809C7l07J33R8j3L05N4m21K50k78J44o6j94K51k8L95m7l96K53k17k07q0L62L98
$$ 37 -270 -137 -39 -52 253 307 -114 136 -142 2 -64 -258 -7 -35 360 313 -83 170 -47 -254 -334 28 426
3832D26m08K68j14k00j31k47K66K9K44k02J76n7%j65m23K61L13j9k6K95l62j03
$$ 426 18 286 172 -28 -159 -406 -140 -111 133 -69 107 50 50 -115 -538 -277 36 17 -9 286 -76 -179
3854a79j5K37k28L36l2q8J88j27j05p0J15K8J11j01l2j5m2K3n5j08L88q6j35K51
$$ -179 -194 43 -185 151 119 31 219 92 -13 -83 32 60 171 70 38 23 -19 4 -51 -159 229 143 8 259
3878B59k27J6k17J21L7J24j08M11l57j58k60JK14l3Q5K48lj99R2Ko2k08K29k24
$$ 259 32 48 -169 -48 -11 113 5 416 59 -99 -359 -358 -144 -177 -92 156 153 -46 46 48 -14 -222 7 -217
3902b17K99O7k5n8j77K77n13K89N1n5K52M9k56j08j20N7J48O5J30n4N9j53R4j88
$$ -217 82 149 124 66 -111 166 -347 -58 -7 -62 190 239 -17 -125 -245 -188 -40 25 155 101 160 7 101 -87
3926h7j13J46J17o8K67j46j44k8J67k06K0P2J99k4j04l4m5l9P0J06Kj22K15l18
$$ -87 -200 -54 63 -5 262 116 -28 -56 111 -95 -75 -3 196 172 68 34 -11 -50 20 126 128 6 221 -97
3950i7L14k79k06J55J50R8J29q7k05J93m43L13R7k62J11N4J83m19N25j49l56J51
$$ -97 217 -62 -268 -113 37 135 264 177 -28 165 -278 35 132 -130 -19 35 218 -201 324 175 -181 -30
3972c0p4J87J90k93Q8Jk26K91k14j07J9K30j11K26n7k77k06J0K67j5J63K38m53
$$ -30 -104 83 273 -20 68 69 -157 134 -80 -187 -168 62 -49 177 120 -157 -363 -353 -86 -101 62 300 -153
3995a53p8K30p9p6K12K2l7K78l58K03m37K54O5k36K88q7j32K23j23K01j10J71
$$ -153 -231 -1 -80 -156 56 78 41 319 -39 164 -273 -19 46 -190 98 11 -121 102 -21 180 70 241
4017B41m63J06Q7J84J15l81L3l00N16k24J59j29J84Ll92K52j00K4K72k58J83O5
$$ 241 -222 -116 -29 155 270 -111 -78 -378 138 -86 73 -56 128 131 -261 -9 -109 -85 187 -71 112 177
4039A77k61j27J02R0Q5l10K25J01k33J89K63k53l73K28M55k13m3p7o5K50k45j8
$$ 177 -84 -211 -109 -19 66 -244 -19 82 -151 38 301 48 -325 -97 358 145 102 25 -40 210 -35 -53
4061e3OK05n2O1k21j33K93j80q7J49j60K45J36m2j64J61l72mK39O3j09J80k07
$$ -53 -47 158 106 167 -54 -187 106 -74 -161 -12 -172 73 209 167 3 164 -208 -212 27 90 -19 161 -46
4084d6r9J78k15O2p5J01L18k68K33k13J05j68J8K01j31M1K13r2k43K38k59J20
$$ -46 -145 33 -182 -120 -195 -94 224 -44 189 -24 81 -87 -69 132 1 42 255 163 -80 158 -101 19
4106A9r9O6J96j94j92K35j12n0N2o4J32L3N2L7k66m7j0K77k26L47M7p6O9q6J34
$$ 19 -80 -14 182 -12 -204 31 -81 -131 -79 -143 -11 22 74 111 -155 -202 -212 65 -161 186 233 157 226 140 274
4131B74m07J33N2j18L8N79m02j58k6N7L9j71L98q4l30M04j49l35L46j71j89L80
$$ 274 -133 0 52 -66 -28 551 149 -9 -35 22 61 -110 288 204 -126 278 129 -206 140 -31 -220 160
4153A60m5K1j6j21j54m0K29N4J59n8k25K0j33MK04p4k01L76k9J67n02N3Q5p0L2
$$ 160 115 136 120 -1 -155 -195 34 88 247 189 -36 -16 -149 -145 59 -15 -216 160 131 298 -204 -151 -66 -136 -104
4178a04K92j05j82K40k30j47K59L1rJ45K25m34J19m8r8J27j32j98L18K15j91M7
$$ -104 188 83 -99 141 -89 -236 23 54 45 190 415 -19 100 52 -46 81 -51 -249 69 284 93 140
4200A40k16r5KK2l3J98Q5k4J7J8M6j71lp7j1J47r2J12PQ9l65K94k20J17Mj7o1
$$ 140 -76 -171 -169 -147 -180 18 103 79 96 114 160 -11 -14 -91 -102 45 -47 65 72 161 -204 90 -130 -13 -9 -26 -87
4227h7o5L01k37K43K2j41J66r3m6j52o3k2K89O2n2o6j84K02j75OQ3j30j58L86
$$ -87 -152 149 -88 155 177 36 202 109 63 -89 -152 -174 115 177 125 59 -125 77 -98 -92 -9 -139 -297 89
4251H9L1j33m1r2K37r2p7K96j86j62K46j36n3k5J87p8J4J68l59K99k10l3Lr7J92
$$ 89 120 -13 -54 -146 91 -1 -78 218 32 -130 116 -20 -73 -98 89 11 25 193 -166 133 -77 -110 -107 -204 -12
4276a2R9j10K07l40K90J9k4j84j73M15q2l9K5P8l15J76j84K10j88J25J40m02L83
$$ -12 87 -23 184 -156 134 153 129 -55 -228 187 105 66 91 169 -146 30 -154 56 -132 -7 133 -269 114
4299A14p6L8L4k00K43P1k47n0M7j12Rp6K50J36N2j07j0k1k78J94K8J5J36k53j46
$$ 114 38 76 110 -90 153 224 -23 -73 -26 -138 -129 -205 45 181 233 126 116 95 -183 11 39 54 190 -63 -209
4324b09M40j39k85J49j3J83k67K87J09l04J29k72K25k5K4n3q5J77o7P0J32m32
$$ -209 231 92 -193 -44 -57 126 -141 146 255 -49 80 -192 33 8 32 -21 -106 71 4 74 206 -226
4346b26K1J39K56r3P2k05o1J02lk17J83L9k5P7j77L1K20k04R6J04m5j46O6P1j76
$$ -226 -205 -66 190 97 169 -36 -97 5 2 -215 -32 7 -18 59 -118 -87 133 -71 25 129 84 -62 4 75 -101
4371a01J54l6J8k47L53j85J25J38l64J54j61J92j3K41m65J89K58j72k24K07J3
$$ -101 53 17 35 -212 141 -44 81 219 -145 9 -152 40 27 268 -197 -8 250 78 -146 61 74
4392G4n3j88O3K66k5Q2l71O2J35j63J11J53k2p2p4M4m28P68l31J17j29j63K82
$$ 74 21 -167 -104 162 137 219 -152 -90 45 -118 -7 146 124 52 -22 22 -406 362 31 148 19 -144 138
4415A38l70K27j00R1P0k40M45j9k19Q0k44L28r6q9J91j69j49J2k06L04K4K34l29
$$ 138 -232 -5 -105 -14 56 -184 261 242 23 103 -141 187 91 2 193 24 -125 -113 -319 -15 9 243 -86
4438h6J94l6j5K05k75K40m10K60k82L41M5k24J45j45k25J84J57k40K57o8j40J48
$$ -86 108 72 57 262 -13 227 -183 77 -205 136 181 -43 102 -43 -268 -84 73 -167 90 22 -118 30
4460C0r8m4J96j02N4Q5k7R0j8l15N1K47k53J15J25O7j63q2J01j35L2L3k4L05l70
$$ 30 -68 -112 84 -18 36 121 94 184 166 -149 -98 149 -104 11 136 203 40 -42 59 -76 -44 -11 -35 270 -100
4485a00J91j9n3j43K67j78j31L05p8J04L1L4l77L74l88K77r3j67J01M6j90n2L43
$$ -100 91 72 19 -124 143 -35 -166 139 61 165 196 230 -147 227 -161 116 23 -144 -43 3 -187 -239 104
4508A04m63L16m1Q5oJ8j28J16J33j55l9j04J30P3k36L42l39j41L10R4K8k37O7
$$ 104 -359 -43 -84 1 -5 13 -115 1 134 -21 -60 -164 -34 39 -197 145 -194 -335 -25 69 97 -140 -73
4531g3j7n5K30J63j78n5%q5m5J88j27R1j97N6K08k04J43k0Q0M7j20O3m4l9J06
$$ -73 -90 -145 85 248 70 15 15 -70 -115 73 -54 37 -160 -104 104 -100 43 23 103 150 30 93 49 10 116
4556A16j4j16l03K67k56M46j03J12p3o0R9k15k16L92N7p9j46J69m01M0K79j33
$$ 116 102 -14 -317 -50 -306 140 37 149 76 16 115 -100 -316 76 133 54 -92 77 -324 -284 -5 -138
4578a38L83k19o9J12N4j20J92k54L83k48j10j89K4K94M7Q9j54j47JR8q9j32J67
$$ -138 245 26 -43 69 123 3 195 -59 324 76 -34 -223 -199 95 142 231 77 -70 -69 29 -60 -192 -25
4601b5R0k04J44k28L3mM13k26N5o3J2J18o7n7J73p3j84J27n6n3l75M70Q5P3k50
$$ -25 65 -139 5 -223 -190 -194 219 -7 48 -15 -3 115 48 -9 164 91 -93 34 -22 -75 -450 20 105 178 -72
4626g2l7L09m19J33L1j4k45J47K29j58J18K31k24m9j18j22L18K34k26K0k25P7
$$ -72 -109 200 -219 -86 -55 -69 -314 -167 62 -96 22 253 29 -20 -138 -260 58 292 66 86 -139 -62
4648f2J77k87M05k22M4M4j48j00K01k64L01J27n53L37N7R3k16J07k19K9K85k56
$$ -62 115 -172 233 11 55 99 -49 -149 52 -212 89 216 -337 0 57 150 -66 41 -178 -149 136 -120
4670a20Oj9L25l83K90n6r1M8l5M9j19K36l2j09P4l6J7J27l44P6l3K97k61k32K71
$$ -120 -114 -133 192 -191 99 43 -48 0 -35 14 -105 131 99 -10 64 28 45 172 -172 -96 -129 168 -93 -325 -54
4695e4q0L31l77J08K69k65k8O0K5n5r5J03J70J13l18K21J41k61l58N23q0P2N4
$$ -54 -134 197 -180 -72 197 -68 -96 -36 -11 -66 -161 -58 112 225 -93 128 269 8 -350 173 93 165 219
4718B19j31J03k48K62l3m06M63m81J95j98L25J9j07K36K08m94J10J56Ll41L00
$$ 219 88 191 -57 205 172 -234 229 -252 -57 -255 70 89 -18 218 426 -68 42 198 201 -140 160
4739A60j10j17L00K7l24M3n2j27J59j54L00j63L57l58o7K47k89J55N1j52J42j03
$$ 160 50 -67 233 260 -64 -21 -73 -200 -41 -195 105 -58 299 -59 -126 121 -168 -13 38 -114 28 -75
4761g5J14j69K49j89m7J32k40Q7K91k23J0k8KJ74j42J9R9J21Jqj59l2k2jm6Mr
$$ -75 39 -130 119 -70 -117 15 -225 -138 153 -70 -60 -88 -86 88 -54 -35 64 185 186 178 19 -13 -35 -36 -82 -78 -87
4788h7k8Q6P4L49l95k68J40J35K20j14k07P3K12k39J66j91K04j49kJ27p3j23Q4
$$ -87 -115 -29 45 394 -1 -269 -129 6 226 112 -95 -22 190 -49 117 -74 130 -19 -21 106 33 -90 -6
4811fn1K17M0m05R3O7l20N98j02p2M8j90J80j29J16m48N91n0k77k0J02j21J00
$$ -6 -57 160 200 -205 -112 -45 -365 233 131 59 107 -83 97 -32 84 -364 227 177 -100 -120 -18 -139 -39
4834c9o1K39k50J58j96O5L15p3m64K47P7o1J60j5r5k39K93j05j11q2L20l17K74
$$ -39 -100 139 -111 47 -149 -84 231 158 -306 -59 18 -43 117 102 7 -232 61 -44 -155 -237 83 -234 40
4857D0J53m5n8o2kj28k2L32j63q4m4M6J39On55L71R0L3n0j04j8J93K21k04l41
$$ 40 193 148 90 28 26 -102 -124 208 45 -39 -83 -37 102 108 -447 -76 14 47 -3 -107 -125 68 289 85 -256
4882b56L13L1k66l7J77K57k40j2J75n5k95K63J64k02M6k09K20Lm7J70l07K25k12
$$ -256 57 88 -178 -215 -38 219 -21 -33 142 87 -208 55 219 17 63 -146 74 77 30 200 -107 118 -94
4905i4K51r8r7K55j84n6p9J99R7j88K74L8k24l6m03K58J11J0k33K89k56J81j48
$$ -94 157 59 -38 217 33 -23 -102 97 194 6 280 318 94 58 -345 -87 24 34 -199 90 -166 15 -133
4928a33l7N3J19J0K24j01j08k42J30K3L5K24k71K79l00J58k97K14N0j06j48J85
$$ -133 -170 -117 2 12 236 135 27 -215 -85 -62 -27 197 -74 205 -95 63 -234 -20 30 -76 -224 -39
4950c9j40J90L50l84L48j17L0l51M6P6J9L3j7L1m15M07q1K7l03K11Pj83K52J10
$$ -39 -179 11 361 -23 325 208 238 -113 -67 9 28 61 44 75 -340 67 -14 13 -290 -79 -72 -255 -3 107
4974A07j57R5M3j50k1J98j44k42K19J73j73J31o8K1Pk55M8j74K55J81j8j85K44
$$ 107 -50 45 88 -62 -83 115 -29 -271 -52 121 -52 79 11 32 39 -216 -168 -342 -87 94 76 -109 135
4997A35l17J5L22l8j60k2K26l77N3J55j20L40j43j9k39JL06j22J24l3j16L2K5
$$ 135 -182 -167 155 117 -43 -65 161 -216 -163 -8 -128 212 69 50 -189 -188 118 -4 120 87 -29 3 28
5020B8l8p0Mp5K47m3j04o0n0J81l9j1K51m02Q9J77l3K4k97L75k88K34j55K13k71
$$ 28 -10 -80 -76 -151 96 53 -51 -111 -161 20 -19 -30 221 -181 -92 85 52 76 -221 154 -134 100 -55 158 -113
5045a13L9K13k83O6Jq6K19q8J74Mk89K16J44j59k45K20J7j79J38J17k76M03j77
$$ -113 -74 139 -144 -78 -77 -163 56 -32 142 146 -143 73 217 58 -187 33 50 -129 9 126 -150 253 76
5068G6M2nl97K83M0Lj03o2L41j59j41O2o0K83j78j44p9R4k0L36l65j3M6J99l4
$$ 76 118 113 -284 -1 39 42 -61 -123 218 59 -82 -20 -80 203 25 -119 -198 -104 -124 212 -153 -166 -120 79 45
5093D5k97L34q1nR7N0l94K74Q4o9m6P4k6j15j12J66j22J2P1L5r3J02K02k08lJ02
$$ 45 -252 82 1 -4 93 143 -251 23 107 38 -8 66 40 -75 -187 -21 -143 -131 -60 -25 -118 -16 186 -22 -25 77
5119G7j16R8l56K25J54J09j55k05R0r4R4r6K83L1j90N6m1J10l9P7k33L58j71N8
$$ 77 -39 59 -297 -72 82 191 36 -169 -79 -173 -79 -175 108 139 -51 5 -36 74 35 112 -121 237 66 124
5143A24J29l72L3p3J71j27J70o0R1k08P9j0K18j58j33J63j65o3J91N0o0L3j20
$$ 124 253 -119 -86 -159 12 -115 55 -5 86 -122 -43 -53 165 7 -126 37 -128 -191 0 50 -10 23 -97
5166i7J58j23m8P8J06Lj68O9K04k11k66K4J37N0L9K06k84K31l65L28P3l25J11
$$ -97 61 -62 -110 -32 74 77 -91 -22 182 -29 -295 -271 -134 -84 -45 161 -123 108 -257 71 144 -181 -70
5189g0J65J04l36oJ66l52K24J07k00J27K43p6j08M3j1R1k64Q1K77k31K74k02p1
$$ -70 95 199 -137 -143 23 -329 -105 2 -198 -71 172 96 -12 31 20 111 -153 -72 205 -26 248 46 -25
5212b5j33n3L99j97L0M0J44j17l33Q9K31l31p1K70Q9j25M5m9J26k1K15j12j22
$$ -25 -158 -211 188 -9 21 61 205 88 -245 -156 75 -256 -327 -57 32 -93 -48 -97 29 8 223 111 -11
5235a1k7K4L38j95j45J42k51j42L47k3J64l61J86j75J76om7O1r5K90j59k21J23
$$ -11 -38 -14 324 129 -16 126 -125 -267 80 57 221 -140 46 -129 47 41 -6 55 -40 250 91 -130 -7
5258gK43l31O8J63j22M8o7J6r1J79Pk29K63j3j12j8l2K84l05L12k81k5q6J29J56
$$ -7 236 -95 -27 136 14 62 -5 11 -80 99 106 -123 140 127 15 -3 -35 249 -56 256 -25 -50 -136 -7 149
5283A49j02p3J77p0j55J92n8p8J1j45J49j6N3n8kj52K93j58K0n0J36m8K85l11
$$ 149 47 -26 151 81 -74 118 60 -18 -7 -152 -3 -19 34 -24 -26 -178 115 -43 -23 -73 63 15 300 -11
5307a1J2q9J98m11M30k8K2j6k5k6n7P9k49K33j4n8K65k82L07m29K41j98j7K04
$$ -11 1 -88 110 -301 129 101 123 107 82 56 -1 78 -171 62 48 -10 255 -27 280 -149 92 -106 -123 81
5331H1j75O2K48n0j02j09O4j2J61j38K06m48M2L04k32J34k38J12K18K07l12N1
$$ 81 -94 -32 216 166 64 -45 19 7 168 30 236 -212 -170 134 -98 36 -202 -90 128 335 23 74
5353G4m8r7J29J36j04k45K69l6J44l37L3K32o2n8j70L9J19q3J22o4o0j19K81j54
$$ 74 26 -71 58 194 90 -155 114 78 222 -115 -82 150 88 30 -140 -101 18 -65 57 -7 -67 -186 95 -59
5377e9j5O0j41P6m1l4j45K46j4J07q5K21l54L27j87%P1K1n0N9J83j23j54R7l5
$$ -59 -74 -14 -155 -79 -120 -154 -299 -53 -67 40 -45 176 -178 149 -38 -38 33 54 4 63 246 123 -31 66 31
5402C1q3J22l7J02k09R2j81J77j42Q4k84L07l20N50k12k72L74j26J11k74K34j07
$$ 31 -52 70 33 135 -74 18 -163 14 -128 -44 -328 -21 -341 209 -3 -275 99 -27 84 -190 44 -63
5424f3J70k36J45nj24K27j50j36J43J78j48l22O85m47p7K74O6j34L3k78J21q1
$$ -63 107 -129 16 11 -113 114 -36 -172 -29 149 1 -321 364 -83 -160 114 180 46 79 -199 -78 -159
5446a59K20R1n9p9q4L07l53R0n1j97L20j07J33M7oj68K1m5q0J18ON1j5p9p1K04
$$ -159 61 152 93 14 -70 237 -116 -26 -77 -274 46 -61 72 119 113 -55 -34 -79 -159 -41 -35 16 1 -78 -149 55
5472E5k68K82r4m7J88L8q7j74J50K38k63kj62N81m28j11q5M63k74j5l0J44k7l2
$$ 55 -213 69 -25 -72 116 154 67 -107 43 281 18 16 -146 435 7 -104 -189 274 0 -15 -45 99 72 40
5496D0N2l26K69j58k6L00m05p0J96J26K29k04j20K18mnj79J66j5j61k4R2N0M4
$$ 40 92 -234 35 -123 -149 151 -254 -324 -128 -2 227 23 -97 121 117 112 -67 99 84 -77 -101 -9 41 85
5520H5l8J58r2lk22k64N64rl48p9L06J97k32j00K53l00J77P0q3J59l38K43j46
$$ 85 47 205 113 110 -112 -376 188 179 -169 -248 58 255 23 -77 176 -124 53 123 40 199 -139 104 -42
5543d2l30L33J75m8p3n9j19J41J97j55M2j87K22Qm71M19O9k82K69p1l7K56J4k48
$$ -42 -372 -39 136 88 15 -44 -163 -22 175 20 62 -125 97 105 -366 53 122 -160 109 38 1 257 271 23
5567B3opj5j81K53j3lJ51k50J51N3k18J52J09j11j98N8j1J11l4N32m83k20J06
$$ 23 17 10 -5 -186 67 54 51 202 -48 103 156 -62 90 199 88 -110 -52 -63 48 14 546 63 -157 -51
$$ [...]
8191h6
##END NTUPLES=NMR FID
##END=
