##TITLE=1H_SR146H12W
 D2O
 48 sc, 
 14.4.2023
##JCAMPDX= 6.0         $$ Bruker NMR JCAMP-DX V2.0
##DATA TYPE= NMR FID
##DATA CLASS= NTUPLES
##ORIGIN= UXNMR, Bruker Analytische Messtechnik GmbH
##OWNER= root
$$ XWIN-NMR		Version 3.5
$$ Fri Apr 14 14:01:24 2023 Russian Standard Time (UT+4h)  she@DPX200
##.OBSERVE FREQUENCY= 200.13135
##.OBSERVE NUCLEUS= ^1H
##.DELAY= (6, 6)
##.ACQUISITION MODE= SIMULTANEOUS
##.ACQUISITION SCHEME= undefined
##.AVERAGES= 48
##.DIGITISER RES= 18
##SPECTROMETER/DATA SYSTEM= spect
##.PULSE SEQUENCE= zg30
##.SOLVENT NAME= D2O
##.SHIFT REFERENCE= (INTERNAL, D2O, 0, 15.7039)
##AUDIT TRAIL= $$ (NUMBER, WHEN, WHO, WHERE, WHAT)
$$ ##TITLE= Audit trail, XWIN-NMR		Version 3.5
$$ ##JCAMPDX= 5.01
$$ ##ORIGIN= Bruker BioSpin GmbH
$$ ##OWNER= she
$$ F:/spectra/data/she/nmr/H-F/1/audita.txt
$$ ##AUDIT TRAIL=  $$ (NUMBER, WHEN, WHO, WHERE, WHAT)
(   1,<2023-04-14 14:00:28.50 +0400>,<she>,<DPX200>,
      <continue with go, POWCHK disabled, PULCHK disabled
       configuration hash MD5:
       00 E9 B6 7A A2 85 ED C7 34 08 36 98 17 FE 4E 26
       data hash MD5: 16K
       D4 08 55 49 54 2B 60 35 EE 1C 09 60 D8 F5 71 CD>)
$$ ##END=
$$ 
$$ hash MD5
$$ 03 CF 08 F8 E7 84 C0 1E D1 03 B9 76 E4 14 F0 72
##$RELAX= 
##$RELAX= 
##$RELAX= 
##$RELAX= 
##$RELAX= 
##$RELAX= 
$$ Bruker specific parameters
$$ --------------------------
##$DU= <F:/spectra>
##$EXPNO= 1
##$NAME= <H-F>
##$PROCNO= 1
##$TYPE= <nmr>
##$USER= <she>
##$AMP= (0..31)
100 100 100 100 100 100 100 100 100 100 100 100 100 100 100 100 100 100 
100 100 100 100 100 100 100 100 100 100 100 100 100 100 
##$AQSEQ= 0
##$AQ_mod= 1
##$AUNM= <au_zg>
##$AUTOPOS= <>
##$BF1= 200.13
##$BF2= 200.13
##$BF3= 200.13
##$BF4= 200.13
##$BF5= 200.13
##$BF6= 200.13
##$BF7= 200.13
##$BF8= 200.13
##$BYTORDA= 1
##$CFDGTYP= 0
##$CFRGTYP= 5
##$CHEMSTR= <none>
##$CNST= (0..31)
1 1 145 1 1 1 1 1 1 1 1 1 1 1 1 1 1 1 1 1 1 1 1 1 1 1 1 1 1 1 1 1 
##$CPDPRG= <>
##$CPDPRG1= <>
##$CPDPRG2= <>
##$CPDPRG3= <>
##$CPDPRG4= <mlev>
##$CPDPRG5= <mlev>
##$CPDPRG6= <mlev>
##$CPDPRG7= <mlev>
##$CPDPRG8= <mlev>
##$CPDPRGB= <>
##$CPDPRGT= <>
##$D= (0..31)
0 1.2 0 0 0 0 0 0 0 0.06 0 0.03 0 0 0 0 0.0002 0 0 0 0 0 0 0 0 0 0 0 0 
0 0 0 
##$DATE= 1681466234
##$DBL= (0..7)
120 120 120 120 120 120 120 120 
##$DBP= (0..7)
150 150 150 150 150 150 150 150 
##$DBP07= 0
##$DBPNAM0= <>
##$DBPNAM1= <>
##$DBPNAM2= <>
##$DBPNAM3= <>
##$DBPNAM4= <>
##$DBPNAM5= <>
##$DBPNAM6= <>
##$DBPNAM7= <>
##$DBPOAL= (0..7)
0.5 0.5 0.5 0.5 0.5 0.5 0.5 0.5 
##$DBPOFFS= (0..7)
0 0 0 0 0 0 0 0 
##$DE= 6
##$DECBNUC= <off>
##$DECIM= 32
##$DECNUC= <off>
##$DECSTAT= 4
##$DIGMOD= 1
##$DIGTYP= 9
##$DL= (0..7)
0 120 120 120 120 120 120 120 
##$DP= (0..7)
150 150 150 150 150 150 150 150 
##$DP07= 0
##$DPNAME0= <>
##$DPNAME1= <>
##$DPNAME2= <>
##$DPNAME3= <>
##$DPNAME4= <>
##$DPNAME5= <>
##$DPNAME6= <>
##$DPNAME7= <>
##$DPOAL= (0..7)
0.5 0.5 0.5 0.5 0.5 0.5 0.5 0.5 
##$DPOFFS= (0..7)
0 0 0 0 0 0 0 0 
##$DQDMODE= 0
##$DR= 18
##$DS= 0
##$DSLIST= <SSSSSSSSSSSSSSS>
$$ [...]
##$SUBNAM2= <"">
##$SUBNAM3= <"">
##$SUBNAM4= <"">
##$SUBNAM5= <"">
##$SUBNAM6= <"">
##$SUBNAM7= <"">
##$SUBNAM8= <"">
##$SUBNAM9= <"">
##$SW= 18.05172834244
##$SWIBOX= (0..15)
0 0 2 0 0 0 0 0 0 0 0 0 0 0 0 0 
##$SW_h= 3612.71676300578
##$TD= 16384
##$TD0= 1
##$TE= 0
##$TE2= 300
##$TE3= 300
##$TEG= 300
##$TL= (0..7)
0 120 120 120 120 120 120 120 
##$TP= (0..7)
150 150 150 150 150 150 150 150 
##$TP07= 0
##$TPNAME0= <>
##$TPNAME1= <>
##$TPNAME2= <>
##$TPNAME3= <>
##$TPNAME4= <>
##$TPNAME5= <>
##$TPNAME6= <>
##$TPNAME7= <>
##$TPOAL= (0..7)
0.5 0.5 0.5 0.5 0.5 0.5 0.5 0.5 
##$TPOFFS= (0..7)
0 0 0 0 0 0 0 0 
##$TUNHIN= 0
##$TUNHOUT= 0
##$TUNXOUT= 0
##$USERA1= <user>
##$USERA2= <user>
##$USERA3= <user>
##$USERA4= <user>
##$USERA5= <user>
##$V9= 5
##$VALIST= <valist>
##$VCLIST= <CCCCCCCCCCCCCCC>
##$VD= 0
##$VDLIST= <DDDDDDDDDDDDDDD>
##$VPLIST= <PPPPPPPPPPPPPPP>
##$VTLIST= <TTTTTTTTTTTTTTT>
##$WBST= 1024
##$WBSW= 4
##$XGAIN= (0..3)
0 0 0 0 
##$XL= 0
##$YL= 0
##$YMAX_a= 643274
##$YMIN_a= -718730
##$ZGOPTNS= <>
##$ZL1= 120
##$ZL2= 120
##$ZL3= 120
##$ZL4= 120
##$ABSF1= 10
##$ABSF2= 0
##$ABSG= 5
##$ABSL= 3
##$ALPHA= 0
##$AQORDER= 0
##$ASSFAC= 0
##$ASSFACI= 0
##$ASSFACX= 0
##$ASSWID= 0
##$AUNMP= <proc_1d>
##$AZFE= 0.1
##$AZFW= 0.1
##$BCFW= 1
##$BC_mod= 2
##$BYTORDP= 1
##$COROFFS= 0
##$CY= 11.3945322036743
##$DATMOD= 1
##$DC= 2
##$DFILT= <>
##$DTYPP= 0
##$F1P= 15.7292609196834
##$F2P= 12.9074282941183
##$FCOR= 0.5
##$FTSIZE= 0
##$FT_mod= 4
##$GAMMA= 1
##$GB= 0.15
##$INTBC= 1
##$INTSCL= 1
##$ISEN= 128
##$LB= 0.24
##$LEV0= 0
##$LPBIN= 0
##$MAXI= 10000
##$MC2= 0
##$MEAN= 0
##$ME_mod= 0
##$MI= 1.114404
##$NCOEF= 0
##$NC_proc= 0
##$NLEV= 6
##$NOISF1= 3.799351
##$NOISF2= 2.8
##$NSP= 1
##$NTH_PI= 0
##$NZP= 0
##$OFFSET= 15.70392
##$PC= 1
##$PHC0= -19834.74
##$PHC1= 12.40081
##$PH_mod= 1
##$PKNL= yes
##$PPARMOD= 0
##$PSCAL= 0
##$PSIGN= 0
##$REVERSE= no
##$SF= 200.130013532006
##$SI= 16384
##$SIGF1= 3
##$SIGF2= 2
##$SINO= 400
##$SIOLD= 16384
##$SREGLST= <1H.CDCl3>
##$SSB= 0
##$STSI= 0
##$STSR= 0
##$SW_p= 3612.71676300578
##$SYMM= 0
##$S_DEV= 0
##$TDeff= 0
##$TDoff= 0
##$TI= <>
##$TILT= no
##$TM1= 0
##$TM2= 0
##$TOPLEV= 0
##$USERP1= <user>
##$USERP2= <user>
##$USERP3= <user>
##$USERP4= <user>
##$USERP5= <user>
##$WDW= 1
##$XDIM= 8192
##$YMAX_p= 0
##$YMIN_p= 0
$$ End of Bruker specific parameters
$$ ---------------------------------
##NTUPLES= NMR FID
##VAR_NAME=  TIME,          FID/REAL,        FID/IMAG
##SYMBOL=    X,             R,               I
##VAR_TYPE=  INDEPENDENT,   DEPENDENT,       DEPENDENT
##VAR_FORM=  AFFN,          ASDF,            ASDF
##VAR_DIM=   8192,          8192,            8192
##UNITS=     SECONDS,       ARBITRARY UNITS, ARBITRARY UNITS
##FACTOR=    0.0002768,     1,               1
##FIRST=     0,             0,               0
##LAST=      2.2672688,     0,               0
##MIN=       0,             -718730,         0
##MAX=       2.2672688,     643274,          0
$$ Real data points
##PAGE= N=1
##DATA TABLE= (X++(R..R)), XYDATA
0@%%%%%%%%%%%%%%jM9r6R6r6R6j42J90j92K35k83L26l74M32m96N44o24P20q25
$$ 0 0 0 0 0 0 0 0 0 0 0 0 0 0 0 -1 48 -48 48 -48 48 -94 96 -96 139 -144 182 -192 240 -256 288 -336 384 -441
33d41R48j082J220j366J535j723J922k141K379k643K933l245L589l964M368m812
$$ -441 507 -575 645 -721 814 -909 1013 -1128 1251 -1392 1541 -1704 1885 -2079 2289 -2523
49b523N303n845O441p100P830q637R551j0594J1780j3150J4753j6657J8973k1853
$$ -2523 2780 -3065 3376 -3724 4106 -4531 5020 -5574 6206 -6944 7809 -8848 10125 -11728
63a1728K5553l0501L7503m8283O7177j10120M10118l7483n93388j18573j95664
$$ -11728 13825 -16676 20827 -27456 39721 -70399 339719 302236 -291152 -409725 -605389
74f05389J45288M18836M16132J65394M5848l24398m75913k93646l6935J21859
$$ -605389 -460101 -41265 374867 540261 586109 261711 -214202 -507848 -544783 -422924
84d22924L94888M07867J83756n6105k70331m66550k99154J6945J82682K87075
$$ -422924 -28036 379831 563587 507482 237151 -229399 -528553 -511608 -328926 -41851
94d1851L99628K19230j10664l03484l58794l07867k7984K44754L14930L06833
$$ -41851 357777 577007 466343 162859 -195935 -503802 -531786 -287032 27898 334731
104C34731K16273j01014l51704l18778k15849p6870K16782L81551K68799J23851
$$ 334731 551004 449990 98286 -220492 -436341 -513211 -296429 85122 353921 477772
114D77772m6876l16063l84831j80601J1290J76969L42088K97148Q1851r4426k67042
$$ 477772 430896 114833 -269998 -450599 -439309 -262340 79748 376896 458747 364321 97279
125I7279l57652j93439M7051J81244L01542L10002P9342j59705k49896k92774
$$ 97279 -260373 -453812 -406761 -225517 76025 386027 465369 305664 55768 -237006
135b37006k11707M7780K38382K63732K42222J09437j50862k92637k55669j63919
$$ -237006 -448713 -400933 -162551 101181 343403 452840 301978 9341 -246328 -410247
145d10247J4220K45208K99049J91799O8052j19240l00257k65473j01797L1892
$$ -410247 -396027 -150819 148230 340029 408081 288841 -11416 -276889 -378686 -346794
155c46794J94746L06368K03264J5089j20031k58277k81644j00291Q4926J84228
$$ -346794 -152048 154320 357584 372673 252642 -5635 -287279 -387570 -302644 -118416
165a18416K67551K14036k608j59603k19828k47111j23230J01492K11931K24174
$$ -118416 149135 363171 360563 200960 -18868 -265979 -389209 -287717 -75786 148388
175A48388J93328K2827j85723k40034j94886j06528P9175K35626K24374J40016
$$ 148388 341716 364543 178820 -61214 -256100 -362628 -283453 -47827 176547 316563
185C16563J9643j59390k59503j87448o1965P1010K14448K44691J22106k1058j42161
$$ 316563 336206 176816 -82687 -270135 -332100 -261090 -46642 198049 320155 299097 156936
196A56936k40806k01486l4878R8361J85712K28944J34822m6593j60663k06358
$$ 156936 -83870 -285356 -320234 -221873 -36161 192783 327605 281012 120349 -86009
206h6009j91355m6471J26835J92912J89591J27689l6695j81342k02776j53953
$$ -86009 -277364 -323835 -197000 -4088 185503 313192 276497 95155 -107621 -261574
216b61574m7804J18905K11912J76343R4057k9627j76463k15945j32027j9825J03683
$$ -261574 -309378 -190473 21439 197782 291839 262212 85749 -130196 -262223 -282048 -178365
227a78365K07271J86126O7188m9013j56152k10384j37663M204J15641J85266J82228
$$ -178365 28906 215032 282220 233207 77055 -133329 -270992 -266788 -151147 34119 216347
238B16347O8743p4178j57961j87004j33250N063J34511J78542J59777O7698p7500
$$ 216347 285090 210912 52951 -134053 -267303 -262240 -127729 50813 210590 278288 200788
249B00788j70412j71794j14608L226J37711J85441J40927N1686p1988j74062j74000
$$ 200788 30376 -141418 -256026 -252800 -115089 70352 211279 262965 190977 16915 -157085
260a57085r0896J4323J26668J88396J39488K7998p8347j59742j73735q6906L3827
$$ -157085 -247981 -233658 -106990 81406 220894 248892 170545 10803 -162932 -249838 -216011
271b16011J27541J73874J37392K1777r2437j56162j59621q3109M2579J35739J62791
$$ -216011 -88470 85404 222796 244573 152136 -4026 -163647 -246756 -204177 -68438 94353
282I4353J24428J9679r9985j59002j46077p3508M4166J41651J60613J08177J1905
$$ 94353 218781 238460 138475 -20527 -166604 -240112 -195946 -54295 106318 214495 226400
293B26400r7905j62760j39291n6529M7275J38113J60774R8800k229r9253j54994
$$ 226400 128495 -34265 -173556 -230085 -182810 -44697 116077 214877 212648 113395 -41599
304d1599j36607m7952N9096J35685J51739R3348j0272j05627j50662j26570m0578
$$ -41599 -178206 -226158 -167062 -31377 120362 213710 203438 97811 -52851 -179421 -219999
315b19999O5879J36514J44424Q4021j7041j09414j46619j17755l2909P0416J37176
$$ -219999 -154120 -17606 126818 210839 193798 84384 -62235 -179990 -212899 -142483 -5307
326e307J37738P4986k3833j11845j44273j09132k1960P3783J35755J31771O6337
$$ -5307 132431 207417 183584 71739 -72534 -181666 -203626 -129843 5912 137683 204020
337B04020l1521j12104j40353j01340j4866P8094J34778J24489N8868l7462j14648
$$ 204020 172499 60395 -79958 -181298 -196164 -118070 16708 141197 200065 162603 47955
348D7955j36292r1839q136Q1636J33116J18497M8248m0520j14823j33993q4511
$$ 47955 -88337 -180176 -188312 -106676 26440 144937 193185 152665 37842 -96151 -180662
359a80662K110Q3764J29031J14502M0706n0276j12528j25773q1209Q891Q9835
$$ -180662 -178552 -94788 34243 148745 189451 139175 26647 -99126 -180335 -171444 -81609
370h1609J23949J06788L6963n7072j15127j18033p2989J2290R4636J23149R5451
$$ -81609 42340 149128 186091 129019 13892 -104141 -177130 -164840 -70204 52945 148396
381A48396L0074n6307j18299j15375n9970J5724R3064J25264Q9514J6543n8035
$$ 148396 178470 122163 3864 -111511 -171481 -155757 -62693 62571 152085 168628 110593
392A10593j13589j15215n1292K6558Q9913J20018Q7407R109o5038j09221j09324
$$ 110593 -2996 -118211 -169503 -142945 -53032 66986 154393 163502 98464 -10757 -120081
403a20081m9702L6161R4033J10443Q1576P896p2871j09803r6660m5635L5967J00043
$$ -120081 -169783 -133622 -39589 70854 152430 160326 87455 -22348 -119008 -164643 -128676 -28633
415b8633J07143P0613L636p1830j13341r1840l3983L7620R7868J09628O1572o399
$$ -28633 78510 149123 152759 80929 -32412 -124252 -158235 -120615 -22747 86881 148453 142054
427A42054o8215j10397r2868k3960M5436R1503J05432O3498j7559p4515j00965
$$ 142054 73839 -36558 -129426 -153386 -107950 -16447 88985 152483 134924 60409 -40556
438d0556q8881k2337N4378R1804R5487O0273j7835q4010r7591p6840k2676N6192
$$ -40556 -129437 -151774 -97396 -5592 89895 150168 132333 48323 -49268 -126108 -148784 -92592
450i2592R9247Q8352M8188j5272q5097j02550o6268j2999N1095R9097R0270L7793
$$ -92592 6655 95007 143195 127923 42826 -59724 -125992 -138991 -87896 11201 101471 139264
462A39264k1639p9714j03458o5518N19N3917R0777R1504L4308l4405p6855r3911
$$ 139264 117625 37911 -65547 -131065 -130546 -76629 14148 105652 139960 105555 28700 -65211
474f5211o7657L750O4369Q6079Q2324L6883l7942q5984q6005n9051J887O8686
$$ -65211 -132868 -129118 -64749 21330 103654 140537 102595 16611 -69394 -128445 -126558 -57872
486e7872R0325P0951L0485l4024r0862q7023m6230N408O3159R5740O9112J7089
$$ -57872 32453 103404 133889 99865 9003 -78020 -124250 -118842 -55683 40057 109169 126258
498A26258l5950q3476r0642m1879J6965O1082Q8510P2408J1052m6363p7118q3984
$$ 126258 90308 6832 -83810 -125689 -108724 -47642 40868 113276 124328 77965 847 -83137
510h3137m5568K4192O9510P8533O6843J4972n4010q2365p1313m0605J8901P6270
$$ -83137 -128705 -104513 -35003 43530 110373 125345 71335 -11030 -82343 -122948 -104047 -27777
522b7777Q1220N3320J2037m9679q8771o8347k7839J8017P2097Q7947M6370L26
$$ -27777 53443 106763 118800 69121 -19650 -87997 -115836 -97819 -25722 62225 108595 108921
534A08921m4501q4746p5184j8871K9387O2815Q4065N2690j0856n1610p4571p2246
$$ 108921 64420 -20326 -95510 -114381 -84994 -22179 61886 114576 103720 52110 -22461 -94707
546i4707k2131L8995O7244P3086M9875q470o0880p3582o0740k3099L7883P4235
$$ -94707 -116838 -77843 -10599 62487 112362 103892 43012 -30570 -91310 -114409 -76526 -2291
558b291O9194L9908p168n9635p8681n4658j3379L3667P4800P2290L0919j3064
$$ -2291 66903 106811 99643 40008 -38673 -93331 -106710 -73043 1757 74047 104966 91902
570I1902n5113p9166n6036k936L7851O6256P3652L1106k4320n5843o8342n7607
$$ 91902 36789 -42377 -98413 -101349 -63498 2758 76410 107516 83196 27353 -40989 -98596
582i8596l628M8370O4430O2861L3574k5505o3763o4084m8389m849M8417P0976
$$ -98596 -102224 -53854 10576 73437 107011 81506 17743 -46341 -94730 -99579 -51162 19814
594A9814N5429K5864k1379o6001o7332l9049n53M4274P3643N5236J6106k3390
$$ 19814 75243 101107 79728 13727 -53605 -92654 -93207 -48933 24710 79946 96052 72662
606G2662o1303o9848l6329R624M2173O7909N9171J1259l2349n5787o5032l9156
$$ 72662 11359 -58489 -94818 -85194 -43021 24888 84059 95318 62969 7182 -57850 -97006
618i7006J4336M9693O0064N4712J4724l8310o0051n6041l6362J1463N5769O1429
$$ -97006 -82670 -32977 27087 81799 96523 58213 -1838 -57879 -94241 -82778 -27009 34420
630C4420M5011J3174l5826o5074n4205k6247J0624N3095O5978L9983M639l2368
$$ 34420 79431 92605 56779 -8295 -62500 -88747 -78123 -25028 40950 80933 85572 53204
642E3204o3493n6854k0283J7549M7857O4280M2829k945l7626n6252n5875k0612
$$ 53204 -10289 -67143 -87426 -69877 -22020 42260 85089 82144 44518 -11734 -67609 -88221
654h8221K4203N0149N6368M1632k222m4232n6174m7627k0739K3781N5945N3511
$$ -88221 -64018 -13869 42499 84131 81909 37677 -18497 -66124 -86863 -63082 -7137 46374
666D6374L2814k45m3436o0833m2039j3336K0337N6161N7178K5843p207l8514o0496
$$ 46374 79188 78943 35507 -25326 -67365 -80701 -60364 -4203 52975 78818 71611 33097 -27399
679b7399m4023o842K5527N0184N5930K7740j4386m0432n3474m5894n687L2596
$$ -27399 -71422 -78264 -52737 -2553 53377 81117 66731 26299 -27175 -73069 -78756 -46160
691d6160M9260M9615K7479j4830m5964n0732l8826p168L4147N3310M4497K1955
$$ -46160 3100 52715 80194 65364 19400 -31332 -70158 -77326 -43179 10131 54628 76583
703G6583j3607m6547n2191l3265l384L1084N4013M6192J5298j5753m5212n2478
$$ 76583 62976 16429 -35762 -69027 -72411 -41327 12686 58878 74176 58423 13211 -39267
715c9267l0870K304L3050M9419M4959J3731k1037m1893n0176l1739O129L5489
$$ -39267 -70137 -67833 -34783 14636 59595 73326 52289 10396 -39780 -71519 -65390 -29901
727b9901M7369M2436J3476k4706m4582m4935k9457O099L8156M8323L6894J0845
$$ -29901 17468 59904 73380 48674 4092 -40843 -70300 -64201 -26045 22278 59172 70017
739G0017k3596m6926m4168k3287O443L8900M8538L4146O150k3155m5864m4550
$$ 70017 46421 -505 -44673 -67960 -61517 -22617 25921 60067 66217 43062 -2802 -47352
751d7352j9571J0049L7544M7711L3351K214k6486m3454m2968j8372J4718L7671
$$ -47352 -66923 -56874 -19330 28381 61732 63946 37460 -5994 -48962 -67334 -52616 -14945
763a4945M4337L2535O87k9728m2152l9436j7121J5747L9987M2186K8718p14k9610
$$ -14945 29392 61927 62614 32886 -9266 -48702 -65823 -50076 -10089 32097 60815 60101 30491
776C0491m3618l6785j3819J6906L8734M3577K5307l171l0650m3719l4875j0195
$$ 30491 -13127 -49912 -63731 -46825 -8091 35486 60793 57622 26972 -16747 -51622 -61817
788f1817J8893L8745M1203K3729o573l0616m1803l4234q043K1356L8147L9652
$$ -61817 -42924 -4179 37024 60753 54180 23564 -18239 -52473 -60516 -39160 -1013 38639
800C8639K1211p929l2203m0851l1022o733K2548L9501L6992J8134q292l3193m1029
$$ 38639 59850 51921 19718 -21133 -52155 -58888 -36340 3161 40153 58287 49995 16802 -24227
813b4227k8675l009K2511L8698L5941J5710j0219l3671l9570k6049j291K3335
$$ -24227 -52902 -55911 -33400 5298 41239 56949 46730 13059 -26511 -52560 -53851 -30516
825c0516L8545L4561J3591j2822l3287l8576k4519J109K5210L7696L3280J1282
$$ -30516 8029 42590 56181 43359 10072 -28504 -53023 -51914 -26704 10992 44272 55554
837E5554j4528l4495l6685k2039K868K5792L6893L1098R527j6198l3920l6028
$$ 55554 41026 6531 -30154 -52193 -49325 -23533 13360 44458 53985 37787 3867 -32161
849c2161j9963M646K7228L5806K9091P491j7963l3193l4482j8001O642K7843L5534
$$ -32161 -52124 -47478 -20250 15556 44647 52138 34175 982 -33500 -51501 -44859 -17016 18518
862A8518K7088M812j8925l4506l1518j6088P635K8671L5490K4050K714j8794l3419
$$ 18518 45606 50418 31493 -3013 -34531 -50619 -42984 -14313 21177 45227 47941 29147 -4272
875d272l2103j3327J0426K7907L3975K3065P19k0174l2879k9573j2565J1487K8817
$$ -4272 -36375 -49702 -39276 -11369 22606 45671 46390 26216 -6663 -36236 -48801 -37314 -8497
888h497L2444K2435j183k3149l1621k7139j1012J2643K9366L1156J9166j302k3370
$$ -8497 23947 46382 45199 22050 -9571 -36710 -47722 -35079 -5713 25443 44609 43307 19937
901A9937l2083k5404q833J3332K9403L0526J7534l296k2470l2678k4667n268J3811
$$ 19937 -12146 -37550 -46383 -33051 -3648 26878 44412 41116 18646 -14032 -38699 -43967 -30156
914c0156K8767L1150J4072n784k2463l0923k4008m097J6199K8016K8855J4702
$$ -30156 -1389 29761 43833 38049 15586 -15337 -39345 -43442 -27243 773 29628 44330
926D4330p701k4610k9292k1592l010J7443K8566K5740J3358q182k5268k8763j9602
$$ 44330 36629 12019 -17273 -38865 -41875 -24432 4134 29874 43232 35050 9782 -18981 -38583
939c8583k785J8506K9449K4509J0828r325k5118k8810j7695L06J8316K8383K4845
$$ -38583 -41368 -22862 6587 31096 41924 32599 7481 -21329 -39024 -38718 -20402 7981 32826
952C2826P515j0334k4241k7751j7915L439J9183K6621K3072Q317j2857k5118k5324
$$ 32826 40341 30007 5766 -21985 -39900 -36461 -17278 9343 32415 40732 27875 2757 -22567
965b2567j6018K145K1713K6594K0606O286j1889k7043k4350j3645L964K0754K7384
$$ -22567 -38585 -36440 -14727 11867 32473 38759 26870 -173 -24523 -38168 -34204 -13450 13934
978A3934J8555M951j2987k5891k4696j0777N354J9811K6320J9861J796j4942k3767
$$ 13934 32489 37440 24453 -1438 -26134 -36911 -31557 -11746 14574 34435 36231 21289 -2478
991b478k3684j1405Q498K0591K4949J8239N80j6343k3262k2456r759Q632K1844
$$ -2478 -26162 -37567 -29069 -8478 16471 34710 35290 18947 -4315 -26771 -36530 -27898 -6054
1004f054K3049J6021J233j7478k3797k0750p197Q438K1306K4383J4678j493j6720
$$ -6054 16995 33016 34249 16771 -7026 -27776 -34973 -26535 -5229 19154 33832 32339 15619
1017A5619k4568j9031n543Q718K1876K3807J2985m162j5796k3261j9689n039J1922
$$ 15619 -8949 -27980 -33523 -24805 -2929 20878 33863 29701 13905 -9356 -29045 -34084 -22162
1030b2162K0685K2798J1913l627j8422k2735j7615l195J1671K1876K0032J1588
$$ -22162 -1477 21321 33234 29607 11185 -11550 -29165 -32360 -20689 1187 21219 32807
1042C2807m218j9395k2447j5169k960J2171K2552J9035Q937m483j9084k1965j4782
$$ 32807 28589 9194 -13253 -28422 -31382 -19211 3341 22376 31313 26830 7746 -14219 -29001
1055b9001k76J1166K2659J9484O353n879j7909k1351j4435R36J2524K0546J9460
$$ -29001 -29277 -18111 4548 24032 30385 24506 6597 -14754 -29189 -28253 -15729 4817 24277
1068B4277P143q884j8812j9632j3303J012J5029J9781J7516O189r050j8826j9406
$$ 24277 31420 22536 3724 -15908 -29211 -28199 -13170 6611 24127 30316 21266 2440 -16966
1081a6966j1916K088J4867K0664J5877M220q232j9836j9699r153K725J5744J9611
$$ -16966 -28882 -26794 -11927 8737 24614 28834 20602 766 -18933 -28086 -25361 -9617 9994
1094I994J5427K828j0472j8171j8594r498N512J4769J9190J4708K573j2301j8624
$$ 9994 25421 28249 17777 -394 -18988 -28486 -22974 -8205 10985 25693 28266 15965 -2659
1107b659j6038r776N782J6905J8142J2526K528j2767j8842j5806o606M971J6154
$$ -2659 -18697 -28473 -22691 -5786 12356 24882 27410 14643 -4199 -20005 -26611 -21640 -5486
1120e486J8995J1371M34j1350j9712j6035l909N608J5399J9734J0370j737j1681
$$ -5486 13509 24880 25314 13964 -5748 -21783 -25692 -20084 -4685 15049 25419 23682 12001
1133A2001j8471j5210m319P591J5802J7487J1050l420j2671j6794j4820l756Q754
$$ 12001 -6470 -21680 -25999 -18408 -2606 14881 25931 22511 9840 -6954 -21774 -25530 -16776
1146a6776J6248J5580R936k835j3649j6661j3738k752R080J6466J5234Q373l384
$$ -16776 -528 15052 24988 22153 8504 -8157 -21895 -24647 -15567 899 16133 24506 21122
1159B1122j3477j8105j0914k211R165J6649J4968P069n205j2716j7090j1247r95
$$ 21122 7645 -10460 -21374 -23585 -14420 2229 17197 24266 19061 6345 -10745 -21992 -22987
1172b2987J0042J6042J4768O066n607j3849j5937j0609K22J0474J5836J3603M981
$$ -22987 -12945 3097 17865 23931 18324 4475 -11462 -22071 -21849 -11375 4461 18064 23045
1185B3045n951j3723j5909q665K61J0192J6510J2458M117n980j4219j5201q439
$$ 23045 17094 3371 -12538 -21203 -20942 -10750 5760 18218 22335 16355 2136 -13065 -21504
1198b1504K404R901J5577J2684K733p424j3562j4305p984L029J0890J5156J0944
$$ -21504 -19100 -9199 6378 19062 21795 14371 809 -13496 -21480 -18451 -7561 7595 18539
1211A8539L084q360j3988j3273p207K854J2854J3130J1490J929q438j4945j2372
$$ 18539 21623 13263 -725 -13998 -21205 -18351 -5497 7633 19123 21052 12614 -2331 -14703
1224a4703o430L972J1732J4276R349J264q269j4020j2321n085M074J1658J4246
$$ -14703 -21133 -17161 -5429 8847 18196 19460 11191 -2829 -15150 -20235 -16161 -4503 9743
1237I743J0164o82r133j3398j3247l515M995J2033J3275Q611j369q590j3896j0574
$$ 9743 19907 19225 10092 -3306 -16553 -20068 -15073 -3040 10235 18846 17477 8887 -5009 -15583
1251a5583m045N553J3000J2418P297j195r662j3708r946l128N547J2731J2902
$$ -15583 -19628 -14075 -1075 11343 18640 17445 7783 -5925 -15871 -18999 -13452 -721 12181
1264A2181O686k043r530j4093r414j612N504J2630J2147N835l268r070j3002r581
$$ 12181 18867 16824 7294 -6799 -16213 -17825 -12321 309 12456 18291 15023 5953 -7049 -16630
1278a6630j467P178J2118J2324M833l806j0926j1652q437p74P713J1927J1398
$$ -16630 -18097 -10919 1199 13523 18356 14550 3624 -8028 -16465 -17239 -9526 2401 13799
1291A3799L883l843j0730j0885q457m58P502J2780J0248L958n641r240j2370p190
$$ 13799 17682 13839 3109 -7776 -16233 -16691 -9189 3591 13839 17797 12156 2916 -9454 -16644
1305a6644R09P780J2002R572L469n569r845j1492o786J299Q403J1966R461K053
$$ -16644 -15735 -7955 4047 13619 17088 11519 1674 -9818 -16604 -15305 -6902 5064 14525 16578
1319A6578n502j0742j0206o531J347Q872J2447P993K182n890j1657r607n160J966
$$ 16578 11076 334 -9872 -16403 -15056 -6184 6263 14256 16438 10548 -1109 -10716 -15876 -13910
1333a3910Q965J1349P618J556o083j0591r638m543K417Q739J1313O779O97o169
$$ -13910 -4945 6404 14022 15578 9495 -1096 -10734 -15277 -12860 -4121 7192 13971 14668 8499
1347H499j0094r861l804L578R263J0082P286j104n806j1007q651l587L605R136
$$ 8499 -1595 -11456 -15260 -11682 -2419 7663 14949 13845 8039 -2968 -11619 -15206 -11601 -2465
1361b465J0732N904l71o948j1066p779k695M920Q650R622N011o99p468r684p080
$$ -2465 8267 14171 13800 6852 -4214 -11993 -14688 -9768 -1118 8504 13515 12816 5348 -4336 -11416
1376a1416l781N568Q685R723N304j095q684r192p197j497M972Q805R347L356j055
$$ -11416 -15197 -9629 -944 8779 14083 12988 4304 -4888 -12085 -13582 -8610 195 9542 12898 11843
1391A1843p561r442p115j218N436R074Q770L648k921p503q668o512q74N732R050
$$ 11843 4282 -5160 -12275 -13493 -8057 1017 9787 13435 10514 3011 -5657 -12169 -13043 -7311 1739
1406A739P865M105l608p064r303o467P53N188Q909P563L446l717p001r083n315
$$ 1739 9604 13709 10101 3037 -6266 -12733 -11980 -6792 2117 9680 13126 9409 2408 -6675 -11990
1421a1990L20N394R729O718K260l247q362q157m709J159O148Q133O992K195m082
$$ -11990 -11670 -6276 3453 10171 12431 9184 822 -7335 -12044 -10885 -4737 3396 10388 12583 8501
1436H501q020q625m075J232O810Q183O531Q34m211p780p715l809J815P230P118
$$ 8501 481 -8144 -12219 -10987 -4177 4006 10537 11371 7160 -620 -8335 -12144 -10329 -3099 4019
1451D019O370J371m824p707p365l413K101O251Q709N118L28m697p554q015k485
$$ 4019 10389 11760 6936 -771 -8136 -11549 -9448 -3197 5512 10630 10958 6261 -1293 -9308 -11793
1466a1793K657O598Q484M753R3n288p615o732k410K699P344P337N471j558m866
$$ -11793 -9136 -2538 5946 10699 10792 5504 -2111 -8843 -11253 -8554 -1210 6127 11598 10040 5174
1481E174p969o173k323L102P458P290M169l71n993p738n439k460M219O276P652
$$ 5174 -2795 -8968 -11291 -8189 -731 6559 10728 10357 4364 -3374 -8813 -11273 -7054 -778 6874
1496F874K674j44n580p677n011k092M627O502O587L679k116n108p626n416J81
$$ 6874 9548 9404 3824 -3853 -8864 -10956 -6329 173 6760 10439 8323 3215 -4411 -9827 -9646
1511i646M038O043O952L713k819o269o451m791k01L718P025N839K693j853o440
$$ -9646 -5608 435 7387 11100 8281 2012 -4439 -9230 -9431 -5713 1312 7151 9844 7991 1551
1526A551o376m249o18M399P768M794K356k316o118o043m527J069L856O770N445
$$ 1551 -4825 -9074 -9692 -5293 2475 7269 9625 7309 1191 -4852 -9379 -8310 -4454 2316 7761
1541G761K055l408n394o979l684J335M664O310N291J118l171n586n886m073J390
$$ 7761 9816 6408 1014 -5965 -9649 -8314 -3650 2660 7951 9069 5898 312 -5574 -9647 -8257
1556h257O004N720M689J071k932o961n163k971J288M183O971M095N67l630n450
$$ -8257 -2253 3467 8156 9227 6295 -666 -5829 -8800 -7512 -3329 3642 7737 8304 4674 -776
1571g76m938k498J033N024O089L719L92l519n104o270j824J898M921N902L552
$$ -776 -5714 -8212 -7179 -2155 3934 7653 8045 4526 -578 -6848 -8672 -6774 -1853 4049 7601
1586G601P26m367n258n062k484K353N434N485M155o26m247n775m549j694K652
$$ 7601 8327 3960 -1298 -6360 -8844 -6491 -1057 4428 8583 7957 3710 -2065 -6614 -8308 -5656
1601e656N072N330L391n81m593m954m857j337K469N818M437M053j436m041n755
$$ -5656 -584 4746 8137 7556 2963 -1991 -6848 -8185 -5716 102 4539 8592 7156 3115 -2640
1616b640l929j116L134M449N612K366j349m626n047l541j063L530M795M509K739
$$ -2640 -6569 -7685 -4551 -102 5510 7876 6527 1901 -3146 -6687 -7750 -4220 575 5084 7823
1631G823j590m514n963k742n90K841N978M090K051j878m279n097l179k0L391N576
$$ 7823 6233 1719 -4244 -6986 -7576 -4735 1243 5333 7384 5506 1227 -3870 -7049 -7069 -3678 1898
1647A898L622J583k225l902m650l118J12L433M558M818J226k288m430m998k087
$$ 1898 5520 7103 4878 976 -3674 -6792 -6680 -3247 1311 6129 7355 5067 637 -4361 -6448
1662f448j6L397N469L185J738k547m432m867j922K95L186N195L212J603k257n235
$$ -6448 -6464 -3067 2402 5587 7325 4778 346 -4521 -6443 -6148 -2962 2233 5445 7048 4791 -444
1678d44l709k874R89M446M461L516j13k249m292m350k253K046L471N048K437R4
$$ -444 -4153 -7027 -6038 -1592 2869 6385 6272 4023 -269 -4619 -6872 -4826 -1355 3693 6130 6224
1694F224l066m244l817j500J133L058M918L885m47k987m592l370q91J408L461
$$ 6224 3158 -1086 -4903 -6403 -5270 -2212 2706 6591 6144 3157 -1435 -4805 -5696 -4288 -827
1709h27M337K823q16k390n051l467n73J515L950M454K574j380k664l991l505q14
$$ -827 3510 6333 5517 3127 -1924 -5391 -5964 -4449 -499 3955 6529 5149 2485 -1506 -5011 -5825
1725e825K003L893L659J827j33l813l161l572m09J416M404M195J431n08l946l813
$$ -5825 -3822 71 3730 5557 5424 1611 -1550 -5122 -5531 -4115 289 4484 5915 5407 1461 -2352
1741b352l018j20K295L620M164R52j014l364l833k609j97K384L887L172J763j424
$$ -2352 -5370 -5490 -3195 425 4589 5541 4527 1163 -2670 -5279 -5476 -3092 795 3967 5730 4306
1757D306l177l766k625J80K313L086L269J700j694k449m299k493O04K688K899
$$ 4306 1129 -2637 -5262 -5082 -2769 317 3586 5286 3592 1143 -3156 -5649 -5045 -2357 542
1772E42L787J022j333l731l565j606J14K555L788K530J180j535l290l688j830
$$ 542 4329 5351 4018 287 -3278 -4884 -4770 -2215 1573 4103 5283 3748 458 -3230 -5060
1787e060K52L196L149L205J35j194l957l447q71l5K486M111K870J90k482l235
$$ -5060 -4808 -1612 1537 4742 4877 3683 -274 -3721 -4592 -4627 -2141 1970 4840 5030 2548 -687
1803f87k344j591M99K892L467K276M86k294l316l084j469J418K818K622K934R1
$$ -687 -3031 -4622 -4123 -1231 2236 4512 4998 2704 -612 -3696 -5165 -3747 -929 1693 4627 4718
1819D718k352l205k884j268J773K806K699J659L00j989l234k373j748J698L025
$$ 4718 2366 -839 -3723 -4991 -3218 -412 2287 3946 4246 2257 -977 -3350 -5098 -3400 -375
1834c75L444R97j53k283k142l743r01K329L015K637J807m12l232k519k553p36
$$ -375 3069 4066 3913 1630 -512 -4255 -5156 -2827 188 2825 4632 4220 988 -1531 -4084 -4820
1850d820K377K455K735J709j045k283k776k703L94J074L850J712J399n32k328
$$ -4820 -2443 12 2747 4456 3411 1128 -1648 -4351 -3957 -2883 967 2679 4078 3546 1218
1865A218l236k344r6K273K144L074J596j421j946k903k327k25K448K921K248J312
$$ 1218 -2018 -4362 -4458 -2185 -41 3033 4629 3208 1262 -1641 -3968 -4193 -1745 1176 3424 4736
1881D736j400k890k284k491N31J705K938K005J007j424k213k436k098P15K705
$$ 4736 3336 446 -1838 -4329 -3798 -2093 845 2850 3857 2433 220 -2216 -4314 -3599 -894
1896h94J604K474Q28j270k365k587j083l19K454K008J987Q49o23l060l199n14
$$ -894 710 3184 4012 2742 377 -2210 -3293 -3612 -1158 850 2837 3686 3063 3 -3196 -3710
1912c710N90K206K115K413q8j107k577k910j194J247J855K958J541P44j906k128
$$ -3710 -3120 -914 1201 3614 3526 2419 -158 -3068 -4262 -3015 -1160 1798 3339 4083 2177 49
1928D9k382k185K190J335K863K012k29j754k958j213j320J929J166J890J891l43
$$ 49 -2333 -4518 -2328 -993 1870 3882 3653 1899 -1059 -2272 -3592 -1663 -497 1393 3284 2941
1944B941j823k233j698m10Q06J556L022P88M33k603j563j956m18J210J584K062
$$ 2941 1118 -1115 -2813 -3223 -2417 -861 2161 2949 3382 779 -784 -2740 -3158 -1948 -364 1698
1960A698J356k74j600j995j517j334J415K447K148O84p7k165k088j457n45J232
$$ 1698 3054 2780 1180 -815 -2332 -3666 -2251 196 2344 3028 2951 786 -1302 -2759 -3304 -2072
1976b072J973K291J328r75j688k841q78L05M36K862J768J392j292j511k558j762
$$ -2072 -99 2192 3520 2545 857 -1984 -2862 -2557 -2121 741 2509 3901 2609 1098 -1460 -3222
1992c222P91R87K046J804J5l61j191k308j245K46M44K798J697O27j229j083j915
$$ -3222 -2431 -1444 602 2406 2421 2060 869 -1439 -2684 -2438 -1994 804 2501 3128 1899 816 -1099
2009a099j542m54J281K325K291J40r88j487k128j333J24K092J851J246K94o42
$$ -1099 -2641 -3095 -1814 511 2802 2942 1954 467 -1661 -2994 -2870 -778 1073 2319 2613 1971
2025A971j705k149n08K17J183K246J616J5j873p50j850j429J376J049J688J294
$$ 1971 266 -1883 -2391 -2174 -991 1255 2871 2886 1013 263 -1587 -3016 -1640 -591 1097 2391
2041B391J92j270j525j682r32P84J227K486P47k4j331j948j492m11P81J712J840
$$ 2391 2583 1313 -212 -1894 -2826 -2042 -815 1671 2418 2394 1063 -885 -2377 -2788 -2007 -295 1545
2058A545J022L28j369k661q58p94J019J821R36J365j23j153j780o55q71N67K223
$$ 1545 2567 2895 1526 -1135 -1993 -2787 -1768 53 989 2354 2231 1078 -702 -1357 -2228 -1661 562
2075E62Q80R63m60r17j849j404m95R83J560J910R89r17r70j235j343j089J412
$$ 562 1442 2405 1945 1028 -821 -2225 -2720 -1737 -177 1733 2722 1805 835 -400 -1743 -2832 -1420
2092a420J073K429M41p15j186j296j495l75J194J949J357O25j334p68j135j338
$$ -1420 -347 2082 2523 1808 622 -674 -2169 -2544 -1350 599 1956 2581 1247 479 -656 -1994
2108a994j87J730N93J292P48N7j655j921o96j58J254J786K54J105q48p57j548
$$ -1994 -2181 -451 142 1434 2182 2239 584 -1337 -2033 -2191 -937 849 1103 2208 1360 603 -945
2125i45m52j346J752J751P31O59N9j700j923m29l75J498J904O09L82q68j421q22
$$ -945 -1397 -2743 -991 760 1491 2150 2209 509 -1414 -1843 -2218 -720 1184 1793 2175 1307 -114 -936
2143i36p76K45R53J345Q81L46k90k229j136n04M63J053R53R77N20q89j065j747
$$ -936 -1712 -1467 -514 831 1712 2058 1768 -461 -1597 -2101 -1638 -585 368 1345 1865 976 -89 -1836
2161a836L57k64R02J234J790k97q14r63j531j031J070R32J647J45k39l64r32q98
$$ -1836 -1479 -1743 -841 393 2183 1886 1072 109 -1422 -2453 -1383 -451 1196 1341 1102 738 -194 -1092
2179a092j392R72N01K391J99J77n98k012j016n29O97J540J476R65m93j092j702
$$ -1092 -2484 -1512 -1011 1380 1579 1756 1158 -854 -1870 -2399 -1702 -162 1314 2279 1786 694 -1008
2196a008n60m44O65P75J999j00K28q54j681l02p30J140J375R12M96r78l03j030
$$ -1008 -1568 -2012 -1347 -572 1427 1327 1555 701 -980 -1282 -2012 -872 503 1415 1911 933 630 -400
2214d00q84n41R01J009J279j4J43j218q75p25j4O63R59J397n6r34r07q32l44l21
$$ -400 -1284 -1825 -924 85 1364 1350 1493 275 -600 -1325 -1339 -676 283 1680 1624 690 -217 -1049 -1393 -1714
2234a714Q86J280P60K26o61j089q12j01k43R63J430L31o7J36j288q09m98o37J564
$$ -1714 -828 452 1212 1438 777 -312 -1124 -1225 -1468 -505 925 1256 1189 1325 37 -772 -1270 -1907 -343
2253c43M21J017L19l0j382r82J07K56M81jJ639K19m97j021o10j758J025K66J439
$$ -343 78 1095 1414 1384 2 -980 -873 -617 -136 -137 1502 1721 1224 203 -407 -2165 -1140 -874 565
2272E65Q26L2p36j278k20p80M07J084O99L68M31q99q14p46p69J58J597K03J871
$$ 565 1391 1423 687 -591 -811 -1591 -1184 -100 599 967 1398 499 -315 -1061 -1830 -1672 -75 128 1999
2291A999q69r79m16J3j084J11N85J374O11j61n77j086p98l01J216O6R58M33P0
$$ 1999 1130 151 -265 -252 -1336 -1225 -640 734 1345 1184 607 -479 -1277 -1578 -362 -296 662 1095 1165
2310A165p91o69j173J24M52M81R13M37N87j138r93k99p08J440M53J281n02o4o55
$$ 1165 374 -295 -1468 -1344 -892 -411 502 939 1526 388 -605 -904 -1612 -172 281 1562 1060 996 341
2329C41q35p20l33O83J142M83K60j94n74o53p78L43j22J620Q8J55L45j576o31
$$ 341 -494 -1214 -1547 -864 278 761 1021 827 253 -400 -1178 -835 -957 663 751 906 1251 -325 -956
2348i56j64L51L93K86Q35J24J95l04r71p51l10P76O21P05J6m02m41p37j265J043
$$ -956 -1120 -769 -376 -90 745 869 1064 760 -211 -962 -1272 -496 125 830 846 444 3 -734 -1999 -956
2368i56L01N95Q00p5N17j658l6n24J94N5O60J297nl28j040o77l18J05O17P05P03
$$ -956 -655 -60 740 665 1182 -476 -512 -1036 -842 -787 -127 1170 1165 837 -203 -880 -1198 -1093 -476 229 932
2389I32O1j052N13p56n33j09N10J067K88m99l2o49m68n66L64J126M62Q32p13R6
$$ 932 993 -59 454 -302 -835 -944 -434 633 921 422 390 -259 -727 -1293 -929 197 659 1491 778 874
2409H74p56j066J91M7O80N35Q32o6k67j618Lm0k33O27N14O64P0p07r64J03j52
$$ 874 118 -948 -757 -710 -30 505 1337 1271 1004 -614 -611 -651 -884 -257 257 921 991 284 -680 -577 -729
2430g29J6R64L68K46j35l73q84l14l7J79O18R27O75j078k98o05l78j28N38L30
$$ -729 -713 251 619 865 730 357 -527 -841 -878 -699 -81 846 1521 443 145 -460 -838 -966 -428 -98
2450i8Q05j73P26r29j322M81k55M11M68N26j66j65n4j043O17o83J45J364M64r31
$$ -98 707 534 1260 331 -991 -510 -765 -354 114 640 474 309 255 -788 -171 -854 -709 655 1119 188
2470A88O44j224k81m44L52K26L92J043M80o61m20m97k08o09M10R13L59j56j42
$$ 188 832 -392 -673 -1117 -765 -539 -147 896 1376 715 295 -202 -410 -1019 -609 304 663 507 365
2489C65k78l31p08j12P41R65J65j07l79l50q90K38m10O09N04R10j31k83q10k7
$$ 365 87 -244 -952 -1064 -323 642 807 700 321 -29 -919 -681 -1091 -482 22 932 801 518 -292 -319
2509c19m36l26J163j80R81k94n4r46k52L29j87J92R30k26Q51n91o12n85o83P99
$$ -319 -755 -1081 82 -98 883 589 535 -411 -663 -334 -521 -329 601 375 1226 635 23 -562 -1245 -446
2529d46Q4J219k96N5J60l38p29r2Q8M58O7L8L19n0l12p08L04o76Q88P11j59j10
$$ -446 -362 857 561 616 776 438 -291 -383 -295 163 230 268 587 537 225 -483 -179 -855 33 744 585 475
2551D75o0n44p86O74nj99J038k57J29M20j222K24l98M83N4LK43J48l53p60j06
$$ 475 415 -129 -915 -241 -246 -445 593 336 465 885 -337 -113 -511 -28 26 29 272 420 67 -693 -799
2572g99K45n1O37O06K67o9j010j11j93l92P10K99N43M40r28O15r97q17J207l30
$$ -799 -554 -605 32 638 905 836 -174 -285 -478 -870 -160 139 682 1122 194 809 -188 -1005 202 -128
2592a28K94p0j84m4J68J5m71j15M89n4Q59J98j118J29o1j038O00O96m31O19Mm21
$$ -128 166 96 -88 -132 36 51 -420 -535 -46 -100 759 957 -161 -32 -93 -1131 -531 165 -266 353 357 -64
2614f4K50Qp77k99N17J158q6p71Q34q53p00M43K02k68O22j42M52m72j09j36J34
$$ -64 186 194 -583 -882 -365 793 707 -64 770 -83 -783 -340 -138 -406 216 74 526 54 -55 -191 -57
2635e7r60Q90J17K53M92n03J0j000L18k38J70O54L95q2n40J4m16j29N20l0R03
$$ -57 -1017 -127 -10 243 735 232 242 -758 -440 -678 -508 146 541 459 -81 -67 -483 -612 -92 -122 781
2656G81j6m83O2m27l17m51J00R94P09k24r87J48j47j06q4k98Q17R2k21j80K60
$$ 781 765 282 344 -83 -400 -851 -751 243 952 728 -259 -111 -258 -364 -448 -746 71 163 -58 -238 22
2677B2l0q78j58N05L61J82O72o3N8o63l79j83O92J34P6K7l29K6j01n73L54P8j00
$$ 22 -8 -886 -1044 -539 -178 4 676 613 671 8 -371 -554 138 272 348 375 46 72 -29 -602 -248 -170 -270
2700b70N46N2k97p3Q5p87P61k45J70K73k15n30O49j02n27l11O58J51L09n6M8n71
$$ -270 276 328 31 -42 43 -744 17 -228 -58 215 0 -530 119 17 -510 -821 -163 -12 297 241 289 -282
2722b82J25K4j063P20J063m96N38l46N3l04q36M87n53J195l43J64l02O32m79l
$$ -282 -157 -133 -1196 -476 587 91 629 283 336 32 -804 -317 -870 325 -18 146 -156 476 -3 -6
2742fJ2j10N46K31p25M56l2m05n6m30M63K43K73o25P21r25k41L24n1O25O8l94
$$ -6 6 -104 442 673 -52 404 372 -33 -89 -519 -56 187 460 -165 556 -369 -610 -286 -337 288 356 -38
2764c8M62m04L36n08J36P9k36M01K60k25k2n89M44m57L1J049j133J69N02K18q10
$$ -38 424 20 356 -152 -16 63 -173 228 488 263 241 -348 96 -361 -330 719 -414 -245 257 475 -335
2785c35R4o26N11P23J96n05J02J50J51n86J70p11R3J049j37j09k42j82L68k55
$$ -335 -241 -867 -356 367 563 58 160 310 461 -125 45 -666 -573 476 339 230 -12 -194 174 -81
2805h1M21j66Q5M06l65l39o78M97k56O32m88L34O43o55k60K72M5K67r31P28N05
$$ -81 340 174 259 665 300 -39 -717 -220 -476 156 -332 2 645 -10 -270 2 47 314 -617 111 616
2826F16m35j17j4l48l48L08N24O9l4L94%p60k99j76J1M48L57J78N02q21N31p88
$$ 616 181 64 50 -298 -646 -338 186 255 221 615 615 -145 -444 -620 -609 -161 196 374 876 55 586 -202
2848b02L74p2L39l60R0j01J11j63oN7o89O29L24J88j16M40p71K87n23j29K99P3
$$ -202 172 100 439 79 169 68 179 16 10 67 -622 7 331 519 403 843 72 359 -164 -293 6 79
2870G9m13M54N52m34L1p49O26o65R00l49L20L01r17M88j86o07O90K30J8O8q75
$$ 79 -334 120 672 238 269 -480 146 -519 381 32 352 653 -264 224 38 -569 121 351 369 437 -438
2891d38N18q65N88J8M83j3k59j9k85Qk55J94qO6M86J78L7k7m21k91J63k63M85
$$ -438 80 -785 -197 -179 304 291 32 13 -272 -264 -519 -325 -333 -267 219 397 434 407 -14 -305 -142 -405 80
2914H0j55M16n0j4m89k42o5l50N01L36K13j26p94P03rm02L64j78n26N28M22j02
$$ 80 -75 341 291 277 -212 -454 -519 -869 -368 -32 181 55 -739 -36 -45 -447 -83 -261 -787 -259 163 61
2936F1k61j10K47M7M51Pk38M04r84j9J59Rk02J67M54J89l20k19M23l77m9P75j404
$$ 61 -200 -310 -63 -16 435 442 204 608 -376 -395 -236 -227 -429 -262 192 381 61 -158 265 -112 -161 614 -790
2959g90P88NP8o7n45M12o7K75j35N44nk51o72M82K7j67K26j22L0M33l72m77K63
$$ -790 -2 3 81 14 -531 -119 -186 89 -46 498 493 242 -430 52 79 -88 138 16 46 479 107 -370 -107
2982a07l90M90j1M94j094P10M50l34l30m16N3Q50l01J85L12n93k55k67L32K87
$$ -107 -497 -7 -18 476 -618 92 542 208 -122 -538 -485 365 64 249 561 -32 -287 -554 -222 65
3002F5L7J6j86l29O51k99p51N40L05j52n1M07J1K74K1r83Q0L49j50K71J88l30
$$ 65 102 118 -68 -397 254 -45 -796 -256 49 -103 -154 253 264 538 559 -424 -344 5 -145 126 314 -16
3024a6j25J03J35m23k22M43j05K98p99N07j58M0N4K6J66R29p29M9M44n24k57n68
$$ -16 -141 -38 97 -326 -548 -105 -210 88 -711 -204 -362 -322 -268 -242 -76 853 124 173 617 93 -164 -732
3046g32L16K8K34K77K66j4n58pJ03J92k44L94K92j57o36j73j51P87Qj0n95j62
$$ -732 -416 -388 -154 123 389 375 -183 -190 -87 105 -139 255 547 390 -246 -419 -570 217 225 215 -380 -542
3068e42O77K36o00l64M92J58K36l51M17m64O6p02J117q58N32J40j76N87k88m34
$$ -542 135 371 -229 -593 -101 57 293 -58 359 -105 -39 -741 376 -482 50 190 14 601 313 -121
3088a21L82n53P06o67R17j74n15K06k15K26k44P9j2K71K10o03j59M8j89M22n85
$$ -121 261 -292 414 -253 664 490 -25 181 -34 192 -52 27 15 286 496 -107 -266 -218 -407 15 -570
3109e70K15L02L46j54K5K39k32Q4k57l7k63j0J58O77k62n26l26K11M35m47R2J18
$$ -570 -355 -53 293 139 164 403 171 255 -2 -39 -302 -312 -154 523 261 -265 -591 -380 55 -392 -300 -182
3131a82o5Q72r31K3M9J81J75j18J90p35P74k25q8J2R1j23N04l70k20ko56M93k4
$$ -182 -247 625 -306 -283 -234 -53 122 4 194 -541 233 8 -80 -68 23 -100 404 34 -186 -188 -844 -351 -375
3154c75N06j60R8l65o0q1Q58l88j31J09j18o45J348m36j74n18K93L47o6k7k94
$$ -375 131 -29 69 -296 -356 -437 421 33 -98 11 -107 -752 596 160 -14 -532 -239 108 42 15 -279
3175b79j60R95p82k80R82m66l85L37L45k82O27q29J47J14n90K05P88m00n88Q53
$$ -279 -439 556 -226 -506 476 10 -375 -38 307 25 652 -177 -30 84 -506 -301 487 87 -501 352
3195C52m59M62m75L85n51J72N75m16j43N2m49JJ81L41N67J85l49p79M54l74J78
$$ 352 -107 355 -120 265 -286 -114 461 45 -98 -46 -495 -494 -313 28 595 780 431 -348 106 -268 -90
3216i0k37O54l15j62K02o0l8M21m0n08p9M43K5J86j26q14R92p36K73O2N2l45N39
$$ -90 -327 327 12 -150 52 -8 -46 375 335 -173 -252 191 216 402 276 -538 454 -282 -9 53 105 -240 299
3239B99Lk65k7K27n84K97l61R22n14o51J051o27J153j340Q35l17k04m73O55m06
$$ 299 302 37 10 237 -347 -50 -411 511 -3 -654 397 -230 923 -417 418 101 -103 -576 79 -327
3259c27L53l28M57n1J0J09m1m03N24o28o0O14N4j75n4M38p00o9L72p81J280n85
$$ -327 26 -302 155 104 114 223 182 -221 303 -325 -385 229 283 108 54 492 -208 -277 95 -686 594 9
3281In52P60%M09q40K44J35r0k28P89o28M4L42q21M58l7m89N90M28k77j98l42
$$ 9 -543 217 217 626 -214 30 165 75 -153 636 8 52 394 -427 31 -6 -495 95 523 246 48 -294
3303b94M97q73O68K02l91P03o66J60p05M03O3j22Q11l20l20j21kN46r9L76m98
$$ -294 203 -670 -2 200 -191 512 -154 6 -699 -296 -233 -355 456 136 -184 -305 -307 239 140 516 18
3324A8LL29o71N71J97k35L76r70M08K97n01j83j44L06K63k74Mj79N60l44K30l52
$$ 18 21 350 -321 250 447 212 588 -382 26 323 -178 -361 -505 -199 64 -210 -206 -385 175 -169 61 -291
3346b91j82J83M57j89p2O51o99M7J4L66m22l33Q40p93J017m58k29j64k53K42p2
$$ -291 -473 -290 167 -22 -94 557 -142 -95 -81 285 -137 -470 370 -423 594 136 -93 -257 -510 -268 -340
3367c40J024o86j5n1Q7l69P12p92N39l47J48l40P25m77K52M20l08m05L81j26M26
$$ -340 684 -2 -17 -68 19 -350 362 -430 109 -238 -90 -430 295 -182 70 490 182 -223 158 32 458
3388D58l4n08J70N5R9m4m87O9O72q04L88n11M32K80n27J23oK53N70q04J41K60
$$ 458 424 -84 86 141 240 196 -291 -222 450 -354 34 -477 -45 235 -292 -169 -175 78 648 -156 -15 245
3410B45o22P15m06r5P32j119O0L19j16O83m48P6k42Q56q87J58j48k15K03Q33m75
$$ 245 -377 338 -68 -163 569 -550 -490 -171 -287 396 -52 24 -218 638 -249 -91 -239 -454 -251 582 107
3431A07K21n87P4k17j64r7R10k05L71j39j24L68p87o0N63J60l26n94N23R2K3m87
$$ 107 328 -259 -185 -402 -566 -663 247 42 413 274 150 518 -269 -329 234 394 68 -526 -3 89 112 -375
3453c75M75k66l49Q65k62k41L96N67q85J36J87O3r23J292p61M2J01l15L2L14l26
$$ -375 100 -166 -515 350 88 -153 243 810 -75 61 248 311 -612 680 -81 -39 62 -253 -221 93 -233
3474b33j48P70j42o03K17j9m8j60J45J48k06Q98q95L50N1K43p58L28L45n8m10
$$ -233 -381 389 247 -356 -139 -158 -206 -366 -221 -73 -279 619 -276 74 125 368 -390 -62 283 225 -185
3495a85P01p41K68L6L28q56K76l83K87K18m57M93L17r96J61M25L17n0n28N18L51
$$ -185 516 -225 43 79 407 -449 -173 -556 -269 -51 -508 -15 302 -694 -533 -108 209 159 -369 149 500
3516E00q98N2Q28j61J64j96J24p8j49m00K72J42n5J44n77K90K68l11M14k37J26
$$ 500 -398 -346 482 321 485 289 413 335 186 -214 58 200 145 289 -288 2 270 -41 373 136 262
3537B62n49R83p08J43M75r26O18p50K50J91J71N4k47m7K57K94k02r90O65J63l4
$$ 262 -287 696 -12 131 606 -320 298 -452 -202 -11 160 214 -33 -80 177 471 269 -721 -56 107 73
3558G3n57P99r69Q16n1J50j09j11k07J92K97p11O41m5K39r36L97k58P88k96j90
$$ 73 -484 315 -654 162 111 261 152 41 -166 26 323 -388 253 208 447 -489 -92 -350 438 142 -48
3579d8J46p85R70m58N10j60J23o66J04l91O54l99N84l69K78O09n49M19p92P2L9
$$ -48 98 -687 283 -175 335 175 298 -368 -264 -655 -1 -400 184 -185 93 702 153 572 -220 -148 -109
3600a09M81l28L13K2p82N57q99P60k36M9k96N40j73N59r81K45L99M4l42O51R9
$$ -109 372 44 357 379 -403 154 -745 15 -221 -172 -468 72 -101 458 -523 -278 121 165 -177 474 573
3621E73p42O5r6L87M73o23J8J6l22O35K56n27l58O75j52P0l54j56L97m11L3N5
$$ 573 -169 -104 -200 187 660 37 55 71 -251 384 640 113 -245 430 278 348 -6 -162 235 -176 -143 -88
3643h8j23j84k0R1k14N60K73l92L39m49K18j61M1j08O35J07q62P25r53M41R4L21
$$ -88 -211 -395 -415 -324 -538 22 295 -97 242 -207 11 -150 -109 -217 418 525 -337 388 -565 -124 -30 291
3665B91l19j85L93j08J77N1p43K72J25k11r5L01n31J06O17R0k04k31K6J51j03
$$ 291 -28 -213 180 72 249 300 -443 -171 -46 -257 -352 -51 -582 -476 141 231 27 -204 -178 -27 -130
3686a30K01k70K97k03k4j55N62k33n4j2O8M41p13K06K52k06k08K87n75J08J025
$$ -130 71 -199 98 -105 -129 -284 278 45 -9 -21 47 488 -225 -19 233 27 -181 106 -469 -361 664
3707F64n60r4j7P1j66O24p67O3J76m17J224r32J70O8Nm13O2K86j97K58J91o07
$$ 664 104 10 -7 64 -102 522 -245 -182 -6 -423 801 -131 39 107 112 -301 -239 47 -150 108 299 -308
3729c08L12n07M41J10K01J15l52J79l77Q8j65K37K69j46M3j07o34M86P2N3k7l47
$$ -308 4 -503 -62 48 249 364 12 191 -186 -98 -263 -26 243 97 140 33 -601 -115 -43 10 -17 -364
3751c64K86O57r10N54k70l79O78j51M27q63N22k63K5j3P34j083J21l55J103o12
$$ -364 -78 579 -331 223 -47 -426 252 101 528 -335 187 -76 -51 -64 670 -413 -292 -647 456 -156
3771a56M86l01M04R4j76n95j47J64k0J21j21K21L04k40k24P86o99m80N51k86K63
$$ -156 330 29 433 527 351 -244 -391 -227 -247 -126 -247 -26 278 38 -186 600 -99 -579 -28 -314 -51
3792e1L57o24L58k37P9l3K72K4l61N20n8p08P76j82n20K09L55l37J33j10J88j21
$$ -51 306 -318 40 -197 -118 -151 121 145 -216 304 246 -462 314 132 -388 -179 176 -161 -28 -138 50 -71
3814g1k47j0l56Q70n30K5K21M31o61P32n02j85L4K96pl06N22k08L90q17J016j76
$$ -71 -318 -328 -684 186 -344 -319 -98 333 -328 404 -98 -283 -249 47 40 -266 256 48 438 -379 637 461
3836D61j71k35L91l51M6p01M60n98n2P03R5l71Q31l99P2k42l88M31M26j72R4m
$$ 461 290 55 446 95 141 -560 -100 -698 -750 -47 48 -323 508 109 181 -61 -449 -18 408 236 330 326
3858C26o37j55O40k84N06l33N8q67M23O62n00M80j55nn38N75j72J3q82J308l80
$$ 326 -311 -466 174 -110 396 63 121 -746 -323 339 -161 319 164 159 -379 196 24 37 -845 463 83
3879H3J82q0r61R67L35r86K75o7R1R93n31o81J34J78k72O19m00N71p18O3L84l21
$$ 83 265 185 -776 191 526 -460 -185 -252 -161 832 301 -380 -246 -68 -340 279 -121 450 -268 -205 179 -142
3901a42ML30M78q42OK09Q3n88N06p2k62J80K05k50j42N74L62m44K53j75l35j35
$$ -142 -138 192 670 -172 -166 43 126 -462 44 -28 -290 -110 95 -155 -297 277 639 195 448 273 -62 -197
3923a97J47m0L53r08O97N26m41m91L27K5l1k7J22p19N57n9J64K00j46l04K94n7
$$ -197 -50 -90 263 -645 52 578 137 -354 -27 -2 -33 -60 62 -657 -100 -159 5 205 59 -245 49 -8
3945hK28L1l37N30m40N6L28L0o21Q1O93n24N1K75l14l38Q26p75M51k20L81j064
$$ -8 220 251 -86 444 4 60 388 418 -203 -122 571 47 98 373 59 -279 547 -228 223 3 384 -680
3967f80N36K40L00j14n51O56q1K08j249R09L51l01Q1j15j34L06n8J29j83L83o92
$$ -680 -144 96 396 282 -269 387 306 514 -735 174 525 224 305 190 56 362 304 433 250 633 -59
3988e9q8j35q0M64n53L5L93p11L43k63N03p8J51n8M12o12N55l31p60J056J1j67
$$ -59 -147 -282 -362 102 -451 -416 -23 -734 -391 -654 -151 -229 -78 -136 276 -336 219 -112 -872 184 195 28
4010B8j01j5k65O12L27k48K03m17P3p22K38O73o69O0j23J87J04j36L96j7J52l80
$$ 28 -73 -88 -353 259 586 338 541 124 197 -525 -287 386 -283 -223 -346 -159 -55 -191 205 188 340 -40
4032d0R2Q3K20l6o77O44o79O97j96K26m26L46j29M06p47J31l28O27k1K96j23m45
$$ -40 52 135 355 319 -358 286 -393 304 108 334 -92 254 125 531 -216 -85 -413 214 193 489 366 -79
4054g9K46m80N24K6N74o67L20m03J7k51M86n56mJ64K53k10O05n95J37J23k01k29
$$ -79 167 -313 211 237 811 144 464 61 78 -173 313 -243 -247 -83 170 -40 565 -30 107 230 29 -200
4076b00J84K30K08j123M75J90R3J79l64N02Q0j229J013Rj80K25l5o8O4N4k81L44
$$ -200 -16 214 422 -701 -226 -36 57 236 -128 374 454 -775 238 247 67 292 257 189 253 307 26 370
4098C70p36P42j5p76L13M62m07n83P30q4q5q2P1j47K47l07o6k81P76K50p12P40
$$ 370 -366 376 361 -415 -102 360 -47 -630 100 16 -69 -151 -80 -227 20 -287 -353 -634 142 392 -320 420
4120D20q74L46Q3o29N05N99k98J72n90K74K64P5o92N65k25j02K5L56L5o94L45
$$ 420 -454 -108 -25 -654 -149 450 152 324 -266 8 272 347 -345 220 -5 -107 -82 274 309 -385 -40
4141d0j60m9L02n26N07m41P00n15j2M8Q67n68j73K56q04P52J97qp14L74o6P4m74
$$ -40 -200 -249 53 -473 34 -407 293 -222 -234 -186 681 113 -60 196 -608 144 341 333 -381 -7 -73 1 -473
4164d73N09k3o18M76j66KK78m0l23L73L34n48K06L72p09M9Q06j52m83q6R1N73
$$ -473 36 13 -605 -129 -295 -293 -15 -55 -378 -5 329 -219 -13 359 -350 -301 505 353 -130 -216 -125 448
4186D48q73m9Q89l96k68L91k13p60P30P84p51n56M06J99q7R6k04M05m42Q55Mm46
$$ 448 -425 -474 415 19 -249 142 -71 -831 -101 683 -68 -624 -218 -19 -106 -10 -214 191 -251 604 608 162
4208A62K40k73P2l36o7J41j17M04l28O97r82j09J246p00Q3K64l77K40k87O82j072
$$ 162 402 129 201 -135 -202 -61 -178 226 -102 595 -387 -496 750 50 133 397 20 260 -27 655 -417
4229d17j9L38r2J59k62M52R04j038K84m81O50l06j97K7R2K5M71p02M8J43n12O01
$$ -417 -436 -98 -190 -31 -293 159 1063 25 309 -172 478 172 -25 2 94 119 590 -112 -64 79 -433 168
4251A68J94n82n2n8K7r1P80j55p61J025j11K66o25K92j43l34N32j65l51k55j07
$$ 168 362 -220 -272 -330 -303 -394 386 231 -530 495 384 650 25 317 174 -160 372 207 -144 -399 -506
4272e06J26R6P01k19l41O3k73L54L9K33O08q21L1o75P85j38J50J71p90M15K27
$$ -506 -380 -284 417 198 -143 -80 -353 1 40 273 881 60 91 -584 201 63 213 384 -406 9 236
4293B36L41m29l46p23J224k69J03r0j52N16o33l1N60l37J09K15LK22j055J192
$$ 236 577 148 -198 -921 303 34 137 47 -105 411 -222 -253 307 -30 79 294 297 519 -536 656
4313F56o31K20j84J76K79m29J5K53o86M92k08K07O9k10Q8r0j99M51m84k06L98
$$ 656 25 245 61 237 516 87 102 355 -331 161 -47 160 229 19 107 17 -182 269 -215 -421 -23
4334b3L2k71M4j00n7M36J23l00n73M65K76m66K01J65J23m16N33p31N01L48j84
$$ -23 9 -262 -218 -318 -375 61 184 -116 -689 -224 52 -414 -213 -48 75 -341 192 -539 -38 310 126
4355A26j15k31j10J60M72K42j34q40J128j119P30r77K17J107r74J43K32J11K87
$$ 126 11 -220 -330 -170 302 544 410 -430 698 -421 309 -668 -451 656 -318 -175 57 168 455
4374D55q72L29l97N24K55l00j44N08p25L19L43m08L17p48P93k62L4J64j47O6K16
$$ 455 -417 -88 -485 39 294 -6 -150 358 -367 -48 295 -113 204 -544 249 -13 21 185 38 104 320
4395C20k52j80Q2K16l84j7j8K24M42r55M25l26Q57m08j08M45k46M0n14J85J19
$$ 320 68 -112 -30 186 -198 -215 -233 -9 433 -522 -97 -423 434 26 -82 363 117 157 -357 -172 -53
4416e3L81k5m62K22J07Q5m81N56l06J99J57k53M6k18L58j62l77K97L8K69l93L26
$$ -53 328 303 -159 63 170 255 -226 330 24 223 380 127 173 -45 313 151 -226 71 109 378 -15 311
4438C11l15r6J46k84L29k21K12j09L15o67R37p41K58j44L22P0k24o9N45o84l10
$$ 311 -4 -100 46 -238 91 -130 82 -27 288 -379 558 -183 75 -69 253 323 99 30 575 -109 -419
4459d19N14j2m87l76O66P4O37r54K49j15M97K60n70n1L32n69K85N1O20k68P1j74
$$ -419 95 83 -404 -780 -114 -40 597 -357 -108 -223 274 534 -36 -87 245 -324 -39 12 632 364 435 261
4481B61k98L59k28n2j24k22L53j31K73m73p6O41n78K82K58k40qK32n1p30K75N79
$$ 261 -37 322 94 42 -82 -304 49 -82 191 -282 -358 283 -295 -13 245 5 -3 229 178 -552 -277 302
4503C02j26l37j40P29n26J43l1j04K06m54N75K50p21K18J50K39r58P57k25L68
$$ 302 176 -161 -301 428 -98 45 14 -90 116 -338 237 487 -234 -16 134 373 -585 172 -53 315
4523C15n37K08j31j32O3j02J80j11q4K32p7L32K46n05J041q46K0m3j7n49R80l00
$$ 315 -222 -14 -145 -277 -214 -316 -136 -247 -331 -99 -176 156 402 -103 938 92 112 69 52 -497 483 183
4545A83J01P7j66L10k89o92M70J93j86l42N66m5N0l3k90Q5l59L67O2M1m47L04
$$ 183 284 361 195 505 216 -476 -6 187 1 -341 225 180 230 197 -93 -8 -367 0 62 103 -344 -40
4567d0M35p62O54n35j76M37k79RL79j19p7m03K95J97J86p37k1J54q3M84j20J11
$$ -40 395 -367 287 -248 -424 13 -266 -257 122 3 -74 -477 -182 15 201 -536 -557 -403 -486 -2 -122 -11
4589a1j79K52K23k2q2p0L32l21j17j44L66J12j07m74N15p15P7N48K83m16M3J64
$$ -11 -190 62 285 263 181 111 443 122 5 -139 227 339 232 -242 273 -442 -365 183 466 50 93 257
4611B57o0Q4l17m32N52J23l52M47J4l99k0JK69o1K49p15O41m62P41p7j91n35J02
$$ 257 197 281 -36 -468 84 207 -145 302 316 -83 -103 -102 167 106 355 -360 281 -181 560 483 292 -243 -141
4634a41m5l61N64N04o15l79K99K49r21J123n41L25M9l5O1r69Q84M58l55P2L30
$$ -141 -186 -547 17 521 -94 -473 -174 75 -846 277 -264 61 110 75 136 -833 51 509 154 226 556
4655E56n71p1K83l05L58j73L74n88K59J02m90L58l6M15L3q83P78q48Q45r73J55
$$ 556 -15 -86 197 -108 250 77 451 -137 122 224 -266 92 56 471 504 -379 399 -449 396 -577 -422
4676d22J072j020N28N05p60K00K44q09O10j23n1J78K42l55m33J014n51P2O7j40
$$ -422 650 -370 158 663 -97 103 347 -462 148 25 -26 152 394 39 -394 620 69 141 208 68
4696F8l42l10Q19p87q7J268O6q23l40O20N1k29J16k56K12j15q3N14l70k8k11O27
$$ 68 -274 -584 235 -552 -639 629 695 -128 -468 152 203 -26 90 -166 46 -69 -152 362 -8 -36 -247 380
4718C80R0m25l44K96p52P72J4K37l19l55M73k1k32l63P97m3q22P10m2L3K44M15
$$ 380 470 45 -299 -3 -755 17 31 268 -51 -406 67 46 -186 -549 248 205 -617 93 51 84 328 743
4740G43n74j19J73k79k68J10O79m56m3m81J55M19M63p60L62J00l58M14n80Q46
$$ 743 169 50 223 -56 -324 -214 465 9 -34 -515 -360 59 522 -238 124 224 -134 280 -300 546
4760E46l24j64j9J46j36n3m9j33n8N05m14J35j72M89m23K50l73L13L16l58j48
$$ 546 222 58 39 185 49 -4 -53 -186 -244 261 -153 -18 -190 299 -124 126 -247 66 382 24 -124
4781a24K65j181J322r59P32M03n06l79P36Mr08P12nN83p61N70j018Q58p22L66
$$ -124 141 -1040 282 -677 55 458 -48 -427 309 313 -595 117 112 695 -66 504 -514 344 -378 -12
4801a2n0M44l51O17q86J39o9M9M8o5q54J235K2q37O36O51p08l65Q88o60j52J91
$$ -12 -62 382 31 648 -238 -99 -168 -119 -71 -136 -990 245 267 -570 66 717 9 -356 532 -128 -280 -89
4823h9Q0L3q8L75o25L68J83o0n37n0L49J49K64l99k18O4l48L12L54n62L92Q4n63
$$ -89 -9 24 -64 311 -314 54 237 177 -360 -410 -61 88 352 -47 -265 -201 -549 -237 117 -445 -53 31 -532
4846e32N35j39J87k75M90n32K50o35O81r7k94P70m21l6M75j91j66m7M2k03M22
$$ -532 3 -136 51 -224 266 -266 -16 -651 30 -67 -361 409 -12 -48 427 236 70 23 65 -138 284
4867B84n03o08R91o57M53K73k83kJ44k64O44o41rk2L63L52j68n11N16k84o5K17
$$ 284 -219 -827 164 -493 -40 233 -50 -52 92 -172 472 -169 -178 -200 163 515 347 -164 352 68 3 220
4889B20K90j19n26K71q06N54p9O42n65L91j95j37K62m47N47j71m44J38L11l53
$$ 220 510 391 -135 136 -670 -116 -195 447 -118 273 78 -59 203 -244 303 132 -312 -174 137 -216
4909b16M41n59J66K16J79o03N39l74Q8O40n62J34k41l76J214l0q68K94l93N39
$$ -216 225 -334 -168 48 227 -376 163 -211 -123 517 -45 89 -152 -528 686 656 -212 82 -311 228
4929B28k24l06L79k00%K76m96L39r8K48J46o50N53m55J204j049P6N11q76M11j95
$$ 228 4 -302 77 -123 -123 153 -343 -4 -102 146 292 -358 195 -260 944 -105 -29 482 -394 17 -178
4950a78O55q4n10k71O68J57n42j42O55r41R33n89r7L99k04k01R83o16j89J28l03
$$ -178 477 393 -117 -388 280 437 -105 -247 408 -533 400 -189 -286 113 -91 -292 691 75 -114 14 -289
4971b89O28n83M35k35L2Q8r6J54o0J49j88k42j6L90jj6N1l52L61J02r15L97K88
$$ -289 339 -244 191 -44 -12 76 -20 134 74 223 35 -207 -223 167 166 150 201 -151 210 312 -603 -206 82
4994H2l34L46r4n0p2M04l84L47j99m85J088j036Q72n58J36K12n46N8M62J41r23
$$ 82 -252 94 0 -50 -122 282 -102 245 46 -439 649 -387 485 -73 63 275 -271 -213 249 390 -533
5015e33O50o17N60l21M02l98M32l90R9J11j80Q5N63o1q66P58m29l6J63j96k71
$$ -533 117 -500 60 -261 141 -257 175 -215 -116 -5 -185 -100 463 402 -464 294 -135 -171 -8 -204 -475
5036d75L78J87l45k44Q80L52k25j067K32Q63n05n8L92p19j28N56K07m56K97J22
$$ -475 -97 90 -255 -499 381 733 508 -559 -327 536 31 -27 365 -354 -482 74 281 -175 122 244
5056B44l77O9k76J4j67J126j050N18K05m14k28K80K01o18P15j24Q1J4n2l31Q7
$$ 244 -133 -64 -340 -326 -493 633 -417 101 306 -108 -336 -56 145 -473 242 118 199 213 161 -170 -83
5077h3%l3m28P65j86j74J65j19o2L77k46k01K29k89N31n26O09k99j4o48R6R49
$$ -83 -83 -116 -544 221 35 -139 26 -93 -155 222 -24 -225 4 -285 246 -280 329 30 16 -632 -536 413
5099D13p86L01n03L41L82k13K60l68j13J00J94m02M96l52j51Q43j22m24RN02k99
$$ 413 -373 -72 -575 -234 148 -65 195 -173 -286 -186 8 -394 102 -250 -401 442 320 -104 -95 407 108
5120A08K73o92l35J97Q34j160L34P44j99M73r37R9N55K23o32M6PL76k56q7q6L90
$$ 108 381 -311 -646 -449 385 -775 -441 303 104 577 -360 -261 294 517 -115 -69 -62 314 58 -29 -115 275
5142B75q04P59l19O5J09l2k23K67J74q49N06J58j76k0J62j24K25o43Q35n96l6
$$ 275 -529 230 -89 -24 85 53 -170 97 271 -578 -72 86 -90 -110 52 -72 153 -490 345 -251 -287
5163b87k56P00o14R45k91r2j24K06j10k94P58j28k06M7n37P28j054N97K43j47
$$ -287 -543 157 -457 488 197 105 -19 187 77 -217 541 413 207 254 -283 445 -609 -12 231 84
5183H4M54k29r5m90K78M20k91k11K66J48n85M2L85o34O59J03j19L37j124O62j51
$$ 84 538 309 214 -276 2 422 131 -80 186 334 -251 -209 176 -458 201 304 185 522 -602 60 -91
5204i1L43o18L80m63K42K00k03j87q2OJ72PM53l15l43K80N48m0o48N6N88k83L32
$$ -91 252 -366 14 -449 -207 -7 -210 -397 -479 -473 -301 -294 159 -156 -499 -219 329 289 -359 -303 285 2 334
5227C34n03K99o5n75R71m20J62n3n32L83J30l67n36R70m9j51J00k12L90k02Q3
$$ 334 -169 130 65 -510 461 41 203 150 -382 1 131 -236 -772 198 149 -2 98 -114 276 74 157
5248A57p7L57n47N78k65j48l43K84n11J085j114P36K54m62N1M49m04l19P77j7
$$ 157 80 437 -110 468 203 55 -288 -4 -515 570 -544 192 446 -16 35 484 80 -239 538 521
5268E21K8l56q22R81l64N62o80P7M89q84q6M53M81n82O90l10%j31o52N83k23O5
$$ 521 549 193 -629 352 -12 550 -130 -53 436 -448 -534 -81 400 -182 508 198 198 67 -585 -2 -225 -160
5290a60N80j068L36l29P23j1l65N24J69m04o2j40m51O04M3L7J06L07n12J2j14
$$ -160 420 -648 -312 -641 82 71 -294 230 399 -5 -67 -207 -658 -54 -11 26 132 439 -73 -61 -175
5311a75K51k42K4l8j10N36j76m60K96N13p61J59M65n98J38M23r8k21m46J8O56
$$ -175 76 -166 -142 -180 -290 246 70 -390 -94 419 -342 -183 282 -316 -178 245 147 -74 -520 -502 154
5332A54M58m15p6n62L92J51k19M69k89r1j47j43k11O11L35n75k29J13K36m07N05
$$ 154 612 197 121 -441 -49 102 -117 352 63 -28 -175 -318 -529 82 417 -158 -387 -274 -38 -445 60
5353F0n55j7N83n70O64R3m96K43k21K98K01K95p46j47m48M19M45l61P16j71m2
$$ 60 -495 -512 71 -499 165 258 -238 5 -216 82 283 578 -168 -315 -763 -344 101 -260 456 285 243
5374B43m94J85Q8l66N4M85m63L95R1l63j98j9M5L47O55j443L04O1J10L92p3j5
$$ 243 -251 -66 22 -344 -290 195 -268 127 218 -145 -343 -362 -317 30 685 -758 -454 -393 -283 109 36 21
5396B1K38N46j202P86p64K22L12m25O75m50k4m1J16J22K47m81l63J20K33M35q66
$$ 21 259 805 -397 389 -375 -153 159 -266 409 -41 -65 -106 10 132 379 -102 -465 -345 -112 323 -543
5417e43N85J42k11M2K01m19o3M69N36o48O8p21N65J15k4J84m75k39P03o69j21
$$ -543 42 184 -27 15 216 -203 -266 203 739 91 159 -562 3 118 94 278 -197 -436 267 -402 -523
5438e23O94k65j44l13P37l39N91l38k08L2L9L28m17k17j91N3J160o86oJ20n22
$$ -523 171 -94 -238 -551 186 -153 438 100 -108 -76 -37 291 -126 -343 -534 -481 679 -7 -13 107 -415
5459d15L37M24j028O78K6J59P3M57l17p03K35l46M47k64j41L27N5j42n11M64j51
$$ -415 -78 346 -682 -4 22 181 254 711 394 -309 -74 -420 27 -237 -378 -51 4 -138 -649 -185 -336
5480c36J70l09L80n25K66L8J40K86n4L61j79L6j32p63Q97J00k69o94P36n33O08
$$ -336 -166 -475 -95 -620 -354 -316 -176 110 56 417 238 274 142 -621 276 376 107 -587 149 -384 224
5501B24L1n08L31R4J78L99m46m33jn38k43J217k88k09M98l70J93n37O89r57L46
$$ 224 255 -253 78 172 350 749 303 -130 -131 -669 -912 305 17 -192 306 -64 129 -408 281 -676 -330
5522c30N04n70O88o18L36k01M69j87l12L7K22k11M58j65J19m1m16L9L78M33n05
$$ -330 174 -396 292 -326 10 -191 278 91 -221 -184 38 -173 285 120 239 198 -218 -179 199 632 127
5543A27j39j34K37N41o86J25P6p2L78m59jM73o89J94O79r93K09n32M50K52J53
$$ 127 -12 -146 91 632 -54 71 147 75 453 -6 -7 466 -223 -29 650 -343 -134 -666 -216 36 189
5564A89J32K33j091J87l19P62j02P26j92l09m2o55P29q47M91K31k7n02L00k22
$$ 189 321 554 -537 -350 -669 93 -9 717 525 216 174 -481 248 -599 -108 123 96 -406 -106 -328
5584c28l6R2nJ83N17l15Qj32j89K68l3l00M78k1r6k77m62J008l88M4o9l73M71
$$ -328 -364 -272 -277 -94 423 108 116 -16 -205 63 30 -270 208 187 91 -186 -648 360 -28 16 -53 -426 45
5607D5M17n59M49o29N35n76j68J023p86L44m67J94l7J45O4K97j16j45J9M99o28
$$ 45 462 -97 352 -277 258 -318 -486 537 -249 95 -372 -178 -215 -70 -6 291 175 30 49 548 -80
5628h0L33j59m33L43n62P48o2M1j35o1J78M10j91m93J95m09L07L16p6r3K87o25
$$ -80 253 94 -339 4 -558 190 128 169 34 -27 151 561 370 -123 72 -337 -30 286 210 117 404 -221
5650b21K96m1m16r8P83l46j09Q2L69K56m93P4J4m13M78l56P52p47L40k42L60R9
$$ -221 75 34 -382 -480 303 -43 -152 -70 299 555 62 136 150 -263 215 -141 611 -136 204 -38 322 421
5672D21Q9o38K49Q1K65n97N43o20J75k53K01L67j73m7k67M6L78n15M37j46n81
$$ 421 510 -128 121 202 467 -130 413 -207 -32 -285 -84 283 110 63 -204 -158 220 -295 142 -4 -585
5693e85J125j450O56L64K54j01kl33O41o19L5p13J231j079Q71K88o48N00m81J15
$$ -585 540 -910 -254 110 364 263 261 -72 569 -50 -15 -728 503 -576 295 583 -65 435 -46 69
5713F9Jn41N40n83O94l04k77L87m72Q70k37M31o61J09P3k74M5R70j131Q06j22
$$ 69 70 -471 69 -514 180 -124 -401 -14 -486 384 147 578 -83 26 99 -175 -130 840 -291 515 393
5734C93n65O60q25J060p20m02M61N8j09j05p9K23j53K42l56L61m48M04J24l66
$$ 393 -172 488 -337 723 3 -399 62 120 11 -94 -173 50 -103 139 -217 144 -304 100 224 -142
5754a42K97n60K35R2l27M89k25M31j81l31J34L10o61M02j21K62j22J00J9j042
$$ -142 155 -405 -170 -78 -405 84 -141 290 109 -222 -88 222 -439 -37 -158 104 -18 82 101 -941
5774i41J038lJ95l91L86j33l82l02O04O85o97q9k29k09P38p74P28l89P2M82o78
$$ -941 97 94 289 -102 284 151 -231 -533 71 756 59 -30 -259 -468 270 -504 224 -165 -93 389 -289
5795b89p56Q24Q3K00j13J79l87K2M59k33K4k86mN54m14L5K53k72j93l07O22M11
$$ -289 -1045 -221 -138 62 -51 128 -259 -237 222 -11 13 -273 -277 277 -137 -102 151 -121 -314 -621 1 412
5817D12l58K18K1m1ml95L11k24L77k49k90L46n99p2J495q21q1j40L33k34p9o4
$$ 412 54 272 293 252 248 -147 164 -60 317 68 -222 124 -475 -547 948 127 46 -94 239 5 -74 -138
5839a38p64J185k90L76mm71l81O9N02j74M50o53J10L8L33l53K93r4p1M95l13N9
$$ -138 -902 283 -7 369 365 -106 -487 -418 84 -90 360 -293 -183 -145 188 -165 128 34 -37 458 145 204
5861B04q5o55R6O27j46K72l04J94n20P14l0k57M36n79n76J030j195Q44L22n93
$$ 204 119 -536 -440 187 41 313 9 203 -317 397 367 110 546 -33 -609 421 -774 70 392 -201
5881b01Q64m26m16M27M9l30P4L21k50j55J42J27r3l91K1K82k48l33K74k39J23
$$ -201 663 237 -179 248 297 -33 41 362 112 -43 99 226 133 -258 -237 45 -203 -536 -262 -501 -378
5902c78L44j81K0L10N65j00q56K4j05L95j72J52K48p13M7J17J1J19N56L9p96L64
$$ -378 -34 -215 -195 115 680 580 -276 -252 -357 38 -134 18 266 -447 -400 -283 -272 -153 403 442 -354 10
5924A0j21M78k82Q0p03J055p21L58N5m35N1N66m95J58m00N26J77j94j98k62K98
$$ 10 -111 367 85 165 -538 517 -204 154 209 -226 -175 391 -104 54 -346 180 357 163 -35 -297 1
5945AP0k97L55J28m98Q3j02K5j65K93J63k4k67J136j097k64K14M83K83m19l57
$$ 1 71 -226 129 257 -241 -158 -260 -235 -400 -107 56 32 -235 901 -196 -460 -246 237 520 101 -256
5966b56N68J67n33n26R80p63K45L04L32n08o02J52P89rn86M76j23l60L04m35N89
$$ -256 312 479 -54 -580 400 -363 -118 186 518 10 -592 -440 349 340 -246 230 107 -253 51 -384 205
5987B05J0Q3q14j50N80K08j27j279J158L05m5k0k59j59J81L35m04m5O4K26l5q2
$$ 205 215 298 -516 -666 -86 122 -5 -1284 -126 179 134 114 -145 -304 -123 212 -192 -237 -173 53 18 -64
6009f4j6k6N50o14P5K41m11K95n26J58Q25l29j53j09M22O9qo66l9K96N98m88k89
$$ -64 -80 -106 444 -170 -95 146 -265 30 -496 -338 487 158 5 -104 318 387 379 -287 -326 -30 568 80 -209
6032b09j58J59J10K69J42j06n74Q68p75j66J72P77m19j03L15l41k66J12L12n93
$$ -209 -367 -208 -98 171 313 207 -367 501 -274 -440 -268 509 90 -13 302 -39 -305 -193 119 -474
6052d74K15L03L28r3q19J05L54J39J72l22j31M88o8j44j27l2J1j12J40K75j78
$$ -474 -259 44 372 279 -540 -435 -81 58 230 -92 -223 265 197 53 -74 -106 -95 -207 -67 208 30
6073C0R5J18n20k11N74k52R4J23j03j15M29l01O2N86n63J35o47M51j00KK31k36
$$ 30 125 243 -277 -488 86 -166 -72 51 -52 -167 262 -39 23 609 46 181 -466 -15 -115 -113 118 -118
6095a18j83N2q7M41m91K61L94j39L3n75K85k30L14P19m67q27L59m3J37l27L53
$$ -118 -301 -249 -336 105 -386 -125 269 130 163 -412 -127 -357 -43 676 209 -618 -259 -302 -165 -492 -139
6116a39P1K90m48L85J91j88M46j36l71k47L78l19M21l89l04K04K34m29N82M4j66
$$ -139 -68 222 -226 159 350 162 608 472 101 -146 232 -87 334 -55 -359 -155 79 -350 232 276 110
6137A10m34N5L61K58m66m9n8J86r5k62N52P59p35l92l54m5K74M4Q0O25j27L74
$$ 110 -324 -269 92 350 -116 -165 -223 -37 -132 -394 158 917 182 -210 -564 -609 -335 -291 -211 414 287 661
6159F61j216Q8P29ko52L41K42j93M1l68q4N2N00J05o03N00L3k86K91L7k41N6j32
$$ 661 -555 -467 262 260 -392 -51 191 -2 39 -329 -413 -361 139 244 -359 141 174 -112 179 216 -25 31 -101
6182a01o55J187l60J93j40J82r2k58K41l06n8j03L04j77j35J23j34N43L27o57
$$ -101 -756 431 71 264 124 306 214 -44 197 -109 -167 -270 34 -143 -278 -155 -289 254 581 -76
6202g6K95j74m51O55K00l79k72n5N14j3l09O15n18m6L02n14M48j2m56N86m54j81
$$ -76 219 45 -406 249 449 70 -202 -257 257 244 -65 550 32 -14 288 -226 222 210 -246 340 -114 -295
6224b95N02l52j38O1L20o13N35n35O68k02o2l36M88m4L75q6l86k00P28l4l01j4
$$ -295 207 -145 -283 -222 98 -515 20 -515 153 -49 -111 -447 41 -3 372 286 -100 -300 428 394 93 79
6246G9M7Rn11N82m36K64lm8m40L16k91j5K05K58n76L10L95k76J73j5K00o44L83
$$ 79 126 135 -376 206 -230 34 31 -17 -457 -141 -432 -447 -242 16 -560 -250 145 -131 42 27 227 -417 -34
6269c4k73K19O5K40n14J84J31M1N51n12j65K66L12r69M05j74j0M2K77m69P98o93
$$ -34 -307 -88 -23 217 -297 -113 18 59 610 98 -67 199 511 -458 -53 -227 -237 -195 82 -387 411 -282
6291b82K89j82r4L33j55N14l83l02L49K21r91R99l75K55m78K73N5k62L88k09j68
$$ -282 7 -175 -269 64 -91 423 40 -262 87 308 -683 316 -59 196 -282 -9 46 -216 172 -37 -205
6312b05K50K32O21q61L10M1q35M82n58M51o36L25O79O5o35R9O42n42M39m23L08
$$ -205 45 277 898 37 347 388 -447 35 -523 -72 -708 -383 296 361 -274 -175 467 -75 364 -59 249
6333B49m18N54r2j33J47j71o9l4J62k94o4k66J46N93p94P51K39p48J1N99L04r19
$$ 249 -169 385 293 160 307 136 67 33 195 -99 -163 -429 -283 310 -484 267 506 -242 -231 368 672 -247
6355b47L36o05K77K16J9L22o25N83k80k1k05K45n1j44L17L45j14k69k26k81R20
$$ -247 89 -516 -239 -23 -4 318 -307 276 -4 -25 -230 15 -36 -180 137 482 368 99 -127 -408 512
6376E12n90k9J72o49J16N85M70l29p5o11J207l58k80l5KP9n33l36N04J87j99k37
$$ 512 -78 -107 65 -584 -468 117 587 258 183 -428 779 421 141 106 108 187 -346 -682 -178 9 -190 -427
6398d27K4J74QQ40k82l13j060N52J42M01k12j28R23k85j57n89J229j375L49K64
$$ -427 -403 -229 -221 619 337 24 -1036 -484 -342 59 -153 -281 642 357 200 -389 840 -535 -186 78
6418G8l77p8J81L46O01l56m95j83L21k05P4Q20j133P92J20o28O59m25J04k29m93
$$ 78 -299 -377 -196 150 751 395 -100 -283 38 -167 -93 727 -406 386 506 -122 537 112 216 -13 -506
6439e06N94J02L8rml13J43k52K32l29P62o47N48K94j149J289q72L99M99j243L88
$$ -506 88 190 228 219 215 -98 45 -207 25 -304 458 -189 359 653 -496 793 -79 320 819 -424 -36
6460c6p31P25L90m53k48L10l10K04L44k82O99n86j23N39n09K11m52N59K53n34
$$ -36 -767 -42 348 -105 -353 -43 -353 -149 195 -87 612 26 -97 442 -67 144 -308 251 504 -30
6480c0j82j25k87L73L18p5j15M39n03j02p6L90J18r9J39q43N90m32K20L00j56
$$ -30 -212 -337 -624 -251 67 -8 -123 316 -187 -289 -365 25 143 44 183 -660 -70 -502 -282 18 -138
6501a38R3J84l63J39j95QN67m11L18j49l84Q4O57m74J83n37N45j01n5o60J043
$$ -138 -45 139 -224 -85 -280 -272 295 -116 202 53 -331 -247 410 -64 119 -418 127 26 -29 -689 354
6522C54p32L64K30l88N9k72N63J08o53L42J08q1n05J83R58m26j85j92k22r7M70
$$ 354 -378 -14 216 -172 -113 -385 178 286 -367 -25 83 2 -503 -320 638 212 27 -165 -387 -484 -14
6543a4l60J11K88k48N5L6J44l20n3P0J30M06K99q0j0l77K29j7N0l05o30N39J32
$$ -14 -374 -263 25 -223 -168 -132 12 -308 -361 -291 -161 245 544 464 454 77 306 289 339 34 -596 -57 75
6566G5rj11L4N2n2j2L80n68J03L95N5k97R2o99O3J001j118Q11K54r35P44k12j28
$$ 75 66 -45 -11 41 -11 -23 357 -211 -108 287 342 45 137 -562 -499 502 -616 195 449 -486 258 46 -82
6589h2j56J89NL82l41K78p20J56K91k59N86l79m95J047n5n92j93K86j99q1N59
$$ -82 -238 -49 -44 338 -3 275 -445 -289 2 -257 329 -50 -545 502 447 -145 -338 -52 -251 -332 227
6610B27m96L70j57R1k74K5N79k16m63N36n92M68j99q7L57l57k35J4P28p82l37
$$ 227 -269 101 -56 35 -239 -214 365 149 -314 222 -370 98 -101 -188 169 -188 -423 -409 319 -463 -800
6631h00J41O07l61O05%J88m7M50l82m39j11l48N70p8k57n3K7K38k64L05n13J50
$$ -800 -659 -52 -413 192 192 380 333 783 401 -38 -149 -497 73 -5 -262 -315 -288 -50 -314 -9 -522 -372
6653c72M48m8n91L05l40R85o18O58m11M74j46l25m74L93N3j61q5L34l9l85K26
$$ -372 76 28 -563 -258 -598 387 -231 427 16 490 344 19 -455 -62 -9 -170 -255 79 40 -345 -119
6674a19K6J41m0K93r8l34j69K74J76r3k85P21n83p7q2N65p41M23l8J73J79l52
$$ -119 -93 48 8 301 203 -131 -300 -26 150 57 -228 493 -90 -167 -249 316 -425 -2 -40 133 312 -40
6696d0o2K6J63j47K03m57J094p70J24n5k81Q70n41K29n96K90KL96o16L89q07O56
$$ -40 -102 -76 87 -60 143 -314 780 10 134 79 -202 668 127 356 -240 50 52 448 -168 221 -586 70
6718G0j03k78L55j81l5q1L2p10J372k60p14O89l88Q5k92N32l43J041n96l06N29
$$ 70 -33 -311 44 -137 -172 -253 -221 -931 441 181 -533 156 -232 -147 -439 93 -250 791 195 -111 418
6739D18r8k98l74k11J01J251L1r42K69n1j24j40M05J37m80K2K66k31J91L63l99
$$ 418 320 22 -352 -563 -462 789 820 -122 147 96 -28 -168 237 374 -106 -84 182 -49 142 505 106
6760A06k84L8kj98Q69k32j84m20K55K55o11P27m42L62n84j91R09p27M66l4l26
$$ 106 -178 -140 -142 -340 529 297 113 -307 -52 203 -408 319 -123 239 -345 -536 373 -354 112 78 -248
6781b48L76M23j25j28m18L07J80k84m2K25n47K47J4K63R8N3k81k59o2rJ76j89
$$ -248 128 551 426 298 -120 187 367 83 41 266 -281 -34 -20 243 341 394 113 -146 -208 -217 -41 -230
6803b30L73j96J67K20P9j021N39R0M18o66o1o6O97o54M04J43L1k47j04J89j71
$$ -230 143 -53 114 334 413 -608 -69 21 439 -227 -288 -354 343 -311 93 236 267 20 -84 105 -66
6824f6M40j39l66N41k26n55M62j67J82j35P4m69O9J47P35q12L99M74n70k45K9
$$ -66 374 235 -131 410 184 -371 91 -76 106 -29 45 -424 -355 -208 527 -285 114 588 18 -227 -198
6845a98L19q14M95j31J32r2Q95l39j91J82l64P5j38L12n3j76O5M23k11l89j53
$$ -198 121 -693 -198 -329 -197 -289 606 267 76 258 -106 -31 -169 143 90 -86 -21 402 191 -198 -351
6866c51Q76p17J36M6M77l72k33L00L2P3l23O65n47n48O36J03k01M37n42M41j18
$$ -351 525 -192 -56 -10 467 95 -138 162 194 267 -56 609 62 -486 150 253 52 489 -53 388 270
6887B70p87O81k6q67J052l37j39j63O90R2q91P60K60m16l60j49N64k03N17q23
$$ 270 -517 164 138 -729 323 -14 -153 -316 374 466 -425 335 595 179 -181 -330 234 31 548 -275
6907b75J33K27j33O15k15L13o03j38j81O2P43l54p2l76K52j59L17m71k58J65R3
$$ -275 -142 85 -48 567 352 665 62 -76 -257 -195 548 194 122 -254 -2 -161 156 -315 -573 -408 -315
6928c15N33L12j09p55M15j24m03R20k84K6J69r73J009l86j49Q0p71J84N93k11
$$ -315 218 530 421 -334 81 -43 -446 474 190 216 385 -588 421 35 -114 -34 -805 -621 -28 -239
6948b39K25j93j83J29P60m50M71l84O5j41j99k68R06o03K55nk94j98L00j02L06
$$ -239 -14 -207 -390 -261 499 49 520 136 201 60 -139 -407 499 -104 151 146 -148 -346 -46 -148 158
6969A58J17o41L59l88N64J52l61qJ60k45O9M0L62q3j01l30L09l65K87j40n73M95
$$ 158 275 -366 -7 -395 169 321 -40 -48 112 -133 -64 -24 338 255 154 -176 133 -232 55 -85 -658 -163
6991a63M24l79M03m12k5N6k83P67m16M03l27j47rj84K16l51Q45O7j53l91k4k11
$$ -163 261 -118 285 -127 -152 -96 -379 388 -28 375 48 -99 -108 -292 -76 -427 418 485 332 -59 -83 -294
7013b94K89K34l93K86m14K17J49j56J0Q8l81j24J57L08j98j57J076o95Q9J0n75
$$ -294 -5 229 -164 122 -292 -75 74 -82 -72 16 -365 -489 -332 -24 -222 -379 697 2 91 101 -474
7034d74O7J11OP96l49N40j81p03M8J9N6Q6q9q5k18M1p9L96K86j89m57M81k99M43
$$ -474 -407 -296 -290 506 157 697 516 -187 -139 -120 -64 22 -67 -152 -370 -329 -408 -12 274 85 -372 109 -190 253
7058B53k92L35k31J35M85p32p0l13J27M24j59L62k89O53l90o34P4O07o54N21m96
$$ 253 -39 296 65 200 685 -47 -117 -430 -303 121 -38 324 35 688 298 -336 -262 345 -309 212 -284
7079b84J11J32K85M0j23l85n29J530j024K44P1k98j02J09mK93K65r5l47L39n94
$$ -284 -173 -41 244 284 161 -224 -753 777 -247 -3 68 -230 -332 -223 -227 66 331 236 -111 228 -366
7100c66J9M42r4l89J01l92J186j661J270l17J55L49L71o48n7L47p42O79m52J73
$$ -366 -347 95 1 -388 -287 -679 507 -1154 116 -201 -46 303 674 26 -31 316 -426 253 -199 -26
7120b6k34P46m49l12J83N95K3m78O6n17N27k91J06l2K30l99k6n25P00r9L34L8
$$ -26 -260 486 37 -275 -92 503 526 48 114 -403 124 -167 -61 -93 137 -262 -288 -813 -113 -212 122 160
7142A60m61N10r5L56l3j58q38L57J1P0N13p60M79j80k81L37N0j8k98K03n89N74
$$ 160 -301 209 114 470 437 279 -559 -202 -191 -121 392 -368 111 -69 -350 -13 37 19 -279 -76 -665 -91
7164i1L0M88o87L72n61J48j81N00q1N44k62p29N83o19K02k03j05J077L0l35L61
$$ -91 -61 427 -260 112 -449 -301 -482 18 -63 481 219 -510 73 -546 -344 -547 -652 425 455 120 481
7185D81l56j85m49J81N37n61K44k3k86M35m96K66k56K67L97n0P1n03K61m52M17
$$ 481 125 -60 -509 -328 209 -352 -108 -131 -417 18 -478 -212 -468 -201 196 146 217 -286 -25 -477 -60
7206f0N1J79n26K89o9K22K59o65L83k55O7K2L75l9p3j90l36L3K57M00p76K97L30
$$ -60 -9 170 -356 -67 -136 86 345 -320 63 -192 -125 -103 272 233 160 -30 -366 -333 -76 324 -452 -155 175
7229A75J7n38M83k9p91N54L25o39R4O4L10J97n81P6O12o13N66o58M7Q90o88n86
$$ 175 192 -346 137 108 -683 -129 196 -443 -349 -285 25 222 -359 -283 329 -284 282 -376 -329 561 -127 -713
7251g13O29L79o21L99q0K7O85p27K1m32M05Q0l3q8K54p79L16N37k13O01m55K72
$$ -713 -84 295 -326 73 -7 20 705 -22 -1 -433 -28 52 19 -69 185 -594 -278 259 46 647 192 464
7273D64l29j32j09M72p98L8J38J31j39J86n03O13J85L13k38m2k17l42J38j97M39
$$ 464 135 3 -106 366 -432 -394 -256 -125 -264 -78 -581 32 217 530 292 250 33 -309 -171 -368 71
7294G1p1K47Kl20l28n3O32k97J24J34K60j77n08L53j29l66N5M16J30O78p50l45
$$ 71 0 247 249 -71 -399 -452 180 -117 7 141 401 224 -284 69 -60 -426 -371 45 175 853 103 -242
7316b42qK73L57m25o22J056l9J44l81l79P4L03R3j52J74k39N1J39lJ85n49N88
$$ -242 -250 23 380 -45 -667 389 350 494 113 -266 -192 111 204 52 226 -13 38 177 174 359 -190 398
7338C98m61k06l15Q69o12L44m1K12j0l04L60j87M02k97p77J252k69n65m40N2J12
$$ 398 -63 -269 -584 285 -327 17 -24 188 178 -126 234 47 449 152 -625 627 358 -207 -647 -595 -483
7359d83Q89n54J90m87J09J068r65L30k30O63k08q23N22K39p11N02J76n14k47K81
$$ -483 406 -148 42 -445 -336 732 -233 97 -133 530 322 -501 21 260 -451 51 227 -287 -534 -253
7379b53m8L45k43J96pK4L17l06K60q01J016J15p63j13K59n75K03N22l39L79l67
$$ -253 -301 44 -199 -3 -10 14 331 25 285 -516 500 615 -148 -261 -2 -577 -374 148 -191 188 -179
7400a79j64L36o29N78q03Q63l05N60l7M38j181m99J202p64M33M09m78N9p7N97
$$ -179 -343 -7 -636 -58 -861 2 -303 257 220 658 -523 -1022 180 -584 -151 258 -220 -161 -238 359
7420C59p9R1k42j69J17J76j57l28M85j30L43l89R2J38p07K98J97K98m11j04J63
$$ 359 280 371 129 -40 77 253 96 -232 253 123 466 77 169 307 -400 -102 95 393 -18 -122 41
7441D1n27L36n80L61N68j24j32L37j61j13M84n38L13m54L85k21K73P6r9l81m44
$$ 41 -486 -150 -730 -369 199 75 -57 280 119 6 490 -48 265 -189 196 -25 248 324 225 -156 -600
7462f00J073k1j7p61L43j98L47l95k3J16J45j6K09m49K44N57r91Q68p71O21l36
$$ -600 473 452 435 -326 17 -181 166 -229 -252 -136 9 -7 202 -247 -3 554 -437 431 -340 281 -55
7483e5K25K49l2o01j20P57J6m79m63L90j0R36j140NJ048o25k43K6K16j63J47J87
$$ -55 170 419 387 -214 -334 423 439 -40 -503 -113 -123 813 -327 -322 726 101 -142 -116 100 -63 84 271
7505B71m76j08M8O04K46j167J01o3J73M81k93r4K09K53J8m54K00K58o85L04J61
$$ 271 -205 -313 -265 339 585 -582 -481 -544 -371 110 -183 -277 -68 185 203 -251 -51 207 -478 -174 -13
7526a3m72N42k18m56O03J99m59K55L18n73J85K14jk59l1N67k5k98j66k29J76n4
$$ -13 -485 57 -161 -617 -14 185 -274 -19 299 -274 -89 125 124 -135 -166 401 376 78 -88 -317 -141 -195
7548a95J99k39K32k60N25k5o77J84nO00J96p19K02n68J60j09m6M79O8K31j29J79
$$ -195 4 -235 -3 -263 262 237 -440 -256 -261 339 535 -184 18 -550 -390 -499 -545 -66 2 233 104 283
7570B83j78j04J22m46L98j06K38l90J14k6J22j98J5J84L66j94O39r37M44k17J88
$$ 283 105 1 123 -323 75 -31 207 -183 -69 -95 27 -171 -156 28 394 200 839 -98 346 129 317
7591C17q26K52j59P85lm28j26L59J11l16o06P68n76Q37k26l57K60L07j89l13L96
$$ 317 -509 -257 -416 369 366 -62 -188 171 282 -34 -640 128 -448 389 163 -194 66 373 184 -129 267
7612B67n4m66K45k28J88Nj1P8k02K62M67o98Q8O57m39K15p34M94Q8k03L14o86
$$ 267 213 -253 -8 -236 -48 -43 -54 24 -178 84 551 -147 -59 598 159 374 -360 134 222 19 333 -353
7634c53o80J171J14k79j57K08R4k57j58N86n14P08n43l37L44o2r3R08q52N3L9
$$ -353 -1033 138 252 -27 -184 24 118 -139 -297 289 -225 483 -60 -397 -53 -115 -208 700 -152 -99 -60
7655f0j48J92Q6K61j17l29J6P01M85r44n21O9K37M15q37L84J71l84nO1N03l72
$$ -60 -208 -16 70 331 214 -115 -99 602 1087 143 -378 -309 -72 343 -494 -110 61 -323 -328 -267 236 -136
7677a36L26k60M17l50j18O8j2Nk46P62n70j1N56m61k56l2P96o3j83J97o09M51
$$ -136 190 -70 347 -3 -121 -53 -65 -60 -306 456 -114 -125 431 -30 -286 -318 478 415 232 429 -180 271
7699B71p92O21k09O41p11m27R89n5m38N02p96K60N53o44P6N98n23m65L85M4K51
$$ 271 -521 100 -109 532 -179 -606 383 328 -110 392 -404 -144 409 -235 -159 439 -84 -549 -164 -120 131
7720A31R5q10P13P8M4j3k31p27L25K69j17J20q7K30r2o15N04N33n05J09K23k7
$$ 131 226 -584 129 207 251 238 7 -720 -395 -126 -243 -123 -210 20 -72 -687 -183 350 -155 -46 177 150
7742A50n18p4Q58p52O43m05l92J113p64L13l47K65p6l9Jo14K47OK03K79j67R8
$$ 150 -368 -442 416 -336 307 -98 -490 623 -141 172 -175 90 14 -25 -24 -638 -391 -385 -182 97 -70 28
7764B8l15N00l88J26k87N80j77n76K82K17m70L67J81q5N95p40L78r4k29r0j8O18
$$ 28 -287 213 -175 -49 -336 244 67 -509 -227 -10 -480 -113 68 -17 578 -162 216 122 -107 -197 -215 403
7786D03j80j13m59M71J97j42k06j16J75j5n17J53Q60n96K01q61R34m60N41j51
$$ 403 223 110 -349 122 319 177 -29 -145 30 15 -502 -349 511 -85 116 -745 189 -271 270 119
7806A19j39p4L01j05q1j22K29l11j33Q39o24L7m01P61l67o41P13m07J33N86m67
$$ 119 -20 -94 207 102 21 -101 128 -183 -316 523 -101 -64 -465 296 -71 -712 1 -406 -273 313 -154
7827a54j01K0K46M12j25m56j48N77n1J02J52K71n79K12j84j41L27n45JN29l81
$$ -154 -255 -235 11 423 298 -158 -306 271 220 322 474 745 166 378 194 53 380 -165 -164 365 -16
7848a6J52l38o4Q60q65N04Op78L95m8o13R58K76m91r8k97K39N52J70K62m75m10
$$ -16 136 -202 -266 594 -271 233 239 -539 -144 -192 -805 153 429 -62 -160 -457 -218 334 504 766 291 -119
7870a19q8M04l96L08Oj33o80Q17o17P64p35M92J23j31N51q28K64m87L20L6K85
$$ -119 -207 197 -199 109 115 -18 -698 119 -498 266 -469 23 146 15 566 -262 2 -485 -165 -129 156
7891A56k67O7l79P34m56r5M63M30n43k6L6j94J92l0j09N3O2J6j94L81J58r7k87
$$ 156 -111 -44 -423 311 -145 -240 223 653 110 84 120 -74 118 88 -21 32 94 110 -84 297 455 358 71
7914G1J45l93L69q37N42K86J89q0l06M86l81L51q40J13M16L5k37J60l13L42P9
$$ 71 216 -177 192 -645 -103 183 372 292 -14 472 91 442 -398 -285 131 166 -71 89 -224 118 197
7935A97j036R55N71j141N74M8o43N46j88J63N2k65j03m52R97p08N27M07k97L89
$$ 197 -839 116 687 -454 120 168 -475 71 -117 46 98 -167 -270 -722 275 -433 94 501 204 593
7955E93j76o00mJ74p6M6N05n24k2k15L57l73R5L50m85M68n57O70j13k59q2K57
$$ 593 417 -183 -187 -13 -89 -43 462 -62 -84 -299 58 -315 -220 130 -355 113 -444 226 113 -146 -228 29
7977B9J56l59j04j64N39m15Q2J025l78m87k27L73j77m94Q29j69L75q47P28L17
$$ 29 185 -174 -278 -442 97 -318 -236 789 411 -76 -303 70 -107 -601 228 59 434 -413 315 632
7997F32q79O0n8O26m00m2N73j241J68R14o04P01Nj84o56j38J182q72J80k34K03
$$ 632 -247 -187 -245 381 -19 -61 512 -729 -561 353 -251 450 455 271 -385 -523 659 -213 -33 -267 -64
8018f4J50o3k55l5M52j45M34o60N17m93K74q07N93j21l8L63k90k84M5M46M62q62
$$ -64 86 23 -232 -267 185 40 474 -186 331 -162 112 -695 -102 -223 -261 102 -188 -472 -427 19 481 -381
8040c81J6P54l54n1L18o28N55q0r0j65K95J42n06Q90j031L47O2j33P70r52J06
$$ -381 -365 389 35 -16 302 -326 229 149 59 -106 189 331 -175 715 -316 31 93 -40 730 -222 -116
8061a16L71m80K86J99J96k83o00M27j8o90J86O58L54p62K75J53K3n72L74l24j77
$$ -116 255 -225 61 260 456 173 -427 0 -18 -708 -522 136 490 -272 3 156 179 -393 -19 -343 -520
8082e20l26O96l04R9P48o7K48j15j177Q16o19M10N3O67o73k51Q21m87m24M50k58
$$ -520 -846 -150 -454 -355 393 326 574 459 -718 98 -521 -111 -58 609 -64 -315 506 19 -405 45 -213
8103b13K29M18k6k04k75K46k09J62j81m71J47O42m57j60J5L29p0J27J83k7j03
$$ -213 16 434 408 204 -71 175 -34 128 -53 -524 -377 265 -192 -352 -337 -8 -78 49 232 205 102
8124A02o6K22l44k68N0M85m5j25k40L60j50O9J47p09P59k00L67P4r49J18J87M96
$$ 102 36 258 -86 -354 -304 181 136 11 -229 131 -19 50 197 -512 247 47 414 488 -461 -343 -156 340
8146C40k41o9m88qN20l00L9l03M14J84l14L11K04n86J68l78M08K90L46p7p26P2
$$ 340 99 30 -458 -466 54 -246 -207 -510 -96 88 -226 85 289 -297 -129 -507 -99 191 537 460 -266 -194
8168a94k50L62k12q3q4O24j46k75K6Q40l30K92r80P37j55l92M11l07L5k62K11
$$ -194 -444 -82 -294 -377 -461 163 17 -258 -232 608 278 570 -410 327 172 -220 191 -116 -81 -343 -132
8189a32j65k01
$$ -132 -297 -498
8191d98
$$ Imaginary data points
##PAGE= N=2
##DATA TABLE= (X++(I..I)), XYDATA
0@%%%%%%%%%%%%%%%%%%M1q9R6r6R6r6J08j56J92j92K30k78K93l41L95m43N12n67
$$ 0 0 0 0 0 0 0 0 0 0 0 0 0 0 0 0 0 0 0 41 -48 48 -48 48 -48 60 -96 96 -96 134 -144 149 -192 203 -240 272 -295
36b95O33p20Q04q97R98j102J227j359J503j662J827k012K220k446K697k975L276
$$ -295 338 -382 422 -475 523 -579 648 -711 792 -870 957 -1055 1165 -1281 1416 -1559 1717
53A717l610L986m420M908n466O119o887P811q939J0367j2238J4792j8516K4455
$$ 1717 -1893 2093 -2327 2581 -2885 3234 -3653 4158 -4781 5586 -6652 8140 -10376 14079
67A4079l5486O2840k54829n05334J91946K18778L10618M24733K15929j88153k88425
$$ 14079 -21407 41433 -213396 -718730 -526784 -308006 2612 427345 643274 455121 166696
78A66696m01242l60186J271L17761L39287L50627J96201j49502l58057l60300
$$ 166696 -234546 -594732 -593461 -275700 63587 414214 610415 460913 102856 -257444
88b57444l04528j4192L33080L78448K48489J59084q1965l74226l94886k03605
$$ -257444 -561972 -576164 -243084 135364 383853 542937 460972 86746 -308140 -511745
98e11745k257K55532M08688K81768O5588r8353l18277m11304j82947Q2140K08108
$$ -511745 -514002 -258470 150218 431986 497574 399221 80944 -330360 -513307 -431167 -223059
109b23059L39907L32853N4648j86393k66437l37049k37891Q7560K88946K93336
$$ -223059 116848 449701 504349 317956 51519 -285530 -523421 -435861 -146915 146421
119A46421K59033Q4519j90845l04926k80426j91335N7504K93697K99517K10527
$$ 146421 405454 489973 299128 -5798 -286224 -477559 -420055 -126358 173159 383686
129C83686Q2519j71282l44032k64533j14889M2732K59136L34868J82022J1516
$$ 383686 466205 294923 -49109 -313642 -428531 -385799 -126663 208205 390227 401743
139D01743j36178l00016k97575r2808R3818K19906L08914K13156k4575j79991
$$ 401743 265565 -34451 -332026 -424834 -331016 -111110 197804 410960 386385 206394
149B06394k52238k73600j08846J35058K32812K41802K02644M347k12951k56183
$$ 206394 -45844 -319444 -428290 -293232 -60420 181382 384026 388373 175422 -80761
159h0761k16729j12749J16343K70658K31784J47246J0257k01960k79702j81831
$$ -80761 -297490 -410239 -293896 -23238 208546 355792 366049 164089 -115613 -297444
169b97444o7718Q5843K58673K54969J09657j9110j65173k80233k01607k1064J08082
$$ -297444 -365162 -279319 -20646 234323 343980 324870 159697 -120536 -322143 -343207 -235125
180b35125K17967K53601J17032o4340j66478k34393k05635k6504J44322K07215
$$ -235125 -17158 236443 353475 289135 122657 -111736 -317371 -343875 -199553 7662
190G662K15180J27067o6256j99411k12445j68407l8755J49613K27988J81012R8042
$$ 7662 222842 349909 283653 84242 -128203 -296610 -335365 -185752 42236 223248 321290
201C21290m4843k05105k25310j33762j9646J27184K36619J87101N8744n6839j78409
$$ 321290 276447 71342 -153968 -287730 -307376 -180192 56427 243528 302272 245433 67024
212F7024k30801j31665J6351J24793K10030J95085N0761q6686j67335k07416j38798
$$ 67024 -163777 -295442 -279091 -154298 55732 250817 301578 214892 47557 -159859 -298657
223b98657K8581J47473J88462J74087O0797j00992j82340j78893j21154J6937
$$ -298657 -270076 -122603 65859 239946 300743 199751 17411 -161482 -282636 -265699
233b65699J59689J95258J44504N0203r2465j92821j76462r1834K2044J49665K01209
$$ -265699 -106010 89248 233752 283955 191490 -1331 -177793 -269627 -247583 -97918 103291
244A03291J36386K3856q9209j82051j80834p7530M2314J39550J91390J39396P439
$$ 103291 239677 263533 174324 -7727 -188561 -266091 -223777 -84227 107163 246559 253998
255B53998j03467j67781j71156p8524O0087J46540J71049J31753R177j18970j69317
$$ 253998 150531 -17250 -188406 -266930 -206843 -60303 110746 242499 251676 132706 -36611
266c6611j49510p0876N6633J57462J66915J09759N541j16069j74500j40677n3118
$$ -36611 -186121 -256997 -200364 -42902 124013 233772 239313 123244 -51256 -191933 -245051
277b45051N8025J55145J67627R5271p470j12111j72110j37889l8367O7121J47659
$$ -245051 -187026 -31881 135746 231017 223547 111436 -60674 -198563 -236930 -169809 -22150
288b2150J64035R0448k3070j15622j60686j33350l1796P9366J45381J50541Q6288
$$ -22150 141885 232333 209263 93641 -67045 -200395 -232191 -152825 -7444 143097 229385
299B29385k8162j24639j54203j19447k7524Q3038J48448J42298P3896l3359j24250
$$ 229385 201223 76584 -77619 -197066 -224590 -141552 6896 149194 223090 189731 65481
310F5481j53976j10005j6571Q5946J47248J36841O2404m0353j24534j48555j01566
$$ 65481 -88495 -198500 -215071 -129125 18123 154964 217368 177015 52481 -96074 -197640
321a97640p905Q8806J45756J30288N3061m7101j25026j43760r3902J407R3550
$$ -197640 -205545 -116739 29017 159305 212366 165265 40239 -103521 -197423 -196016 -102466
332a02466J40742J22751M5212n2961j25227j38575q4603Q297R5265J40491J15088
$$ -102466 38276 161027 206239 153278 28051 -110524 -195127 -186830 -91565 48926 164014
343A64014L6844n8717j24574j33856p6546J5985R9327J34167J08454K8467o4228
$$ 164014 200858 142141 17567 -116289 -192835 -176850 -77523 56644 165098 193565 129337
354A29337j22901j26770p1069K2058J04678J30719R7737K4267o7471j27144j17976
$$ 129337 6436 -120334 -191403 -169345 -64667 66052 163789 188056 120585 -6559 -124535
365a24535n9991K4697J03815J30711R0431J3649o8340j24595j17316m9457L2998
$$ -124535 -184526 -159829 -56014 74697 165128 178777 110437 -14158 -131474 -180931 -147933
376a47933J01920J27871Q5679K200p2632j17281j14031m6385M4473J02265J18386
$$ -147933 -46013 81858 167537 169737 97105 -20176 -134207 -180592 -136119 -33854 84532
387H4532Q3126j987q1759j15200j03785m1251M8442J06681J11520P1925k032q5647
$$ 84532 167658 165671 83912 -31288 -135073 -176324 -127882 -21201 90319 162244 160212 74565
399G4565j16675r2698l3715M6235J09102J11780O0558r647q1364j17616r0150
$$ 74565 -42110 -134808 -168523 -122288 -13186 98594 159152 149505 68141 -49475 -139625
410a39625k1153M9289J04405J10717N6811k1141q1585j10285q9935j5931N9953
$$ -139625 -160778 -111489 -7084 103633 160444 139303 57718 -52567 -142502 -158433 -98480
421i8480J01080J01433N5875k6884q9142j02865p9129j7192O4501J05865R0998
$$ -98480 2600 104033 159908 133024 43882 -58983 -138112 -155304 -90803 15062 106060
432A06060M7534k3928r3408j06448o6820r587O1057J08436Q9116L4961k7421q7600
$$ 106060 153594 129666 36258 -70190 -137010 -146597 -85540 22896 112012 146973 119552 31952
444C1952j07968o3626K654O0627J01925R1897K8242l8801q2754j01602o5702J1148
$$ 31952 -76016 -139642 -136988 -76361 25564 117461 145703 106902 24148 -77454 -143156 -132008
456a32008P0079R2096Q5913K9739m5633q8252r1160o0885R735P7581R4187P2512
$$ -132008 -61929 30167 116080 145819 100186 11934 -79226 -140111 -130376 -52795 41392 113904
468A13904K6773m4441r4444q8457m6661R515P4680R9012O7815J3984m1231r1670
$$ 113904 140677 96236 1792 -86665 -133326 -123811 -49131 49881 117696 131680 90449 -1221
480a221r2425l8773K0125O8531R6763O9481L758m7760q3302q9948m1244L1347
$$ -1221 -93646 -132419 -112294 -43763 53000 122481 126239 78479 -4823 -94771 -136015 -104668
492a04668P2632Q5947O7989M881n8923q2774p8330l9836L1094Q0918Q1329N6754
$$ -104668 -32036 53911 121900 126781 67858 -14916 -93246 -133082 -101988 -21070 60259 117013
504A17013O459n8331r0944o9995k9645K7010Q0899Q6851M6157k405n1840r0590
$$ 117013 123472 65141 -25803 -95798 -125443 -98433 -17534 69317 115474 113069 61229 -29361
516b9361p4101j7072L3192P1993Q7821M8404j5448n5210q0513p4582j6479M4726
$$ -29361 -103462 -120534 -87342 -15349 72472 120876 105428 50218 -30295 -104877 -121356 -76630
528g6630O9742P7117N1822j8060o5786p3250o5012k2044M8640P8925O7160M1970
$$ -76630 -6888 70229 122051 103991 38205 -35045 -100057 -122101 -73461 5464 72624 114594
540A14594j0967p0084q0331n1872j4869M1762Q3106O9309K9660j5295o3471q3455
$$ 114594 103627 33543 -46788 -98660 -113529 -71767 11339 80648 110308 95013 31542 -51913
552e1913n1772j447M1527P5152P3773K5478k5366o0939p5957n4682K843M9791
$$ -51913 -103685 -105132 -63605 11547 85320 110798 85432 24493 -51464 -106146 -103303 -53512
564e3512O9357O8377K7979l1994o5496o7799m9159j371N6943P2567N5934K5751
$$ -53512 15845 84222 112201 80207 14711 -53088 -102247 -103618 -46675 25892 81826 107577
576A07577k7735p2417o9117l6495J583N0814P8255N4283J3860k6767o8235p2583
$$ 107577 79842 7425 -61692 -98187 -96604 -45790 32465 86748 100608 73841 5606 -66977
588f6977l2419J1454M7508P3698N7578P689l4645o1467o9309l4552J8324N1833
$$ -66977 -99396 -87942 -40434 33264 90842 98531 63886 2419 -66890 -101442 -83118 -31285
600c1285O5502N6278Q472m2487o2363n9958l4593J8520N8620O3293M6721J0059
$$ -31285 34217 90495 98967 56480 -5883 -65841 -100434 -81914 -23294 39999 86720 96779
612I6779m2968o8192n4076k5448J4771N9645O7111L8789K361l7049o8764n7076
$$ 96779 53811 -14381 -68457 -93905 -79134 -19489 47622 86411 88772 51723 -17041 -74117
624g4117j6738J9948N3044O7625L9836o452l8965o2131n8018j5976K8793N1571
$$ -74117 -90855 -70907 -17863 49762 89598 83146 44181 -17950 -75968 -91944 -63151 -11580
636a1580O0932M1153q862m6429n7317n1806j8068L1828N7028N4503L5241n402
$$ -11580 49352 90505 81643 35214 -22103 -73909 -91977 -60149 -3121 51382 86623 81221
648H1221m9753o1714m3272j2884K8532N9013N5396K7294r038m5237o3784m2537
$$ 81221 31468 -30246 -73518 -86402 -57870 1143 56539 83833 74795 29558 -34226 -76763
660g6763m747K9209N5414N7411K4582j7147m3413n8146m5700q77L5479N2026N2545
$$ -76763 -81510 -52301 3113 60524 85106 67959 24546 -33600 -79300 -80177 -44698 7328 59873
673E9873K5679j9990m9855n1568m0749l493L9445N5106M5413K2213j8511n2600
$$ 59873 85552 65562 15707 -35861 -76610 -80103 -40658 14448 59861 82074 63563 10963
685A0963n3052l1573k572L7977N7904M2898J4652j8354m9462n5398k8150L967
$$ 10963 -42089 -73662 -76234 -38257 19647 62545 77197 58843 9381 -46017 -74167 -70200
697g0200L4300N6548M5203J0001k3126m6401n2179l0166J0044L7446N0463M3214
$$ -70200 -35900 20648 65851 75852 52726 6325 -45854 -76020 -65976 -28530 21933 65147
709F5147J1480k9428m7354m6111k8191R674M1885M8942L8105R493k7908n0407
$$ 65147 76627 47199 -155 -46266 -74457 -64783 -22898 26044 64149 73642 45734 -4673
721d673m4206k2967R475M2499N1331L3297M148k6359n0385m5133j7197J3124L9852
$$ -4673 -48879 -71846 -62371 -19872 31459 64756 68904 42545 -7840 -52973 -70170 -57046 -17194
734a7194N0330L3382r4k9405m7074m4431j6309J7963M0551M7184L2128k555l2295
$$ -17194 33136 66518 66424 37019 -10055 -54486 -70795 -52832 -12281 34903 67031 64476 32181
747C2181m5640m0193j5863J9543M2693M4512K8701k668l5108m6140l6083j3073
$$ 32181 -13459 -53652 -69515 -49972 -7279 37233 65934 63266 28158 -17982 -54065 -67138
759f7138J9614M4309M3431K3530l957l4608m6780l4722p692K0744M2278M2957
$$ -67138 -47524 -3215 40216 63746 59789 25181 -21599 -56321 -64013 -43269 -991 41966
771D1966K2035q843l4353m3636l4322n791K4499M0580M0649K1144j1011l6004
$$ 41966 64001 55158 20805 -22831 -57153 -62944 -38445 2135 42784 63928 52917 16913
783A6913m2780l1192m394K6695M0254L8015J8943j2733l5896m2446k7936k364
$$ 16913 -25867 -57059 -61453 -34758 5496 43511 62454 49721 13825 -28621 -56557 -58921
795e8921K6723M1447L6415J4734j3215l6697m1166k5184J09K6873M0603L6143
$$ -58921 -32198 9249 45664 60398 47183 10486 -30680 -55864 -55755 -28882 11721 47864
807D7864J1044j6271l4819m0810k3910L727K8150L9630L3031J0396j7538l7046
$$ 47864 58908 42637 7818 -32992 -56902 -53175 -25025 14605 47636 58032 40494 3448
819C448l8307k1187M972K9612L8647L0484R140j9954l6652l5265k0149O893L0631
$$ 3448 -34859 -56046 -51074 -21462 17185 47669 56809 36855 203 -35062 -55211 -48318 -17687
832a7687L7597K8116O440k0078l6898l4386j7945R211K9720L8024K6676L548k1606
$$ -17687 19910 48026 54466 34388 -2510 -36896 -54841 -45630 -15910 22114 48790 52338 30732
845C0732l5617l3361j5855J1605L0316L6391K4841J400k2464l5561l2776j1766
$$ 30732 -4885 -38246 -54101 -42496 -12180 24211 49052 50452 27988 -7573 -40349 -52115
857e2115J1917L0560L6499K2175j255k3104l5022k9932j0282J3418L0274L4707
$$ -52115 -40198 -9638 26861 49036 47781 24677 -10345 -40277 -50559 -37141 -6867 27840
869B7840K1389l363k4401l4011k9324p895J5287L1349L2816J9191m344k6191l3379
$$ 27840 49229 45866 21465 -12546 -41870 -49765 -34478 -3129 29687 48878 44534 18343 -15036
882a5036k6320o923J5950L1849L1326J6989n909k6175l3336k3978n108J7140L0830
$$ -15036 -41356 -48279 -32329 -480 30846 47835 41926 15751 -17585 -41563 -46671 -29531 1299
895A299L1486J3728p909k4811l2483k3942k654J8188L0866K9200J3319r678k6347
$$ 1299 32785 46513 38604 13793 -18690 -42632 -45286 -27098 3768 32968 46287 36609 10262
908A0262l0660k1886j346K0024K9828K7641J1950j0846k7675k9785j8798j050
$$ 10262 -20398 -42284 -43630 -23606 6222 33863 45813 34967 7292 -22493 -41291 -42341
920d2341K1255L0962K3984J0282j1356k7150l0074j7173K242J9480L1648K3269
$$ -42341 -21086 9876 33860 44142 32786 5636 -24438 -41611 -39369 -19889 11759 35028
932C5028P689j2360k6612l0194j5266M247K0806K9303K3467N750j4732k6039k7186
$$ 35028 42717 30357 3745 -26449 -41715 -37468 -16662 12641 36108 41858 27126 1087 -26099
945b6099j5416N875K2335K7558K1510N149j5484k6387k6152j3566O155K3025K7634
$$ -26099 -41515 -35640 -13305 14253 35763 40912 25428 -959 -27111 -40677 -34522 -11497 16137
958A6137J9744K968j5012k7296k4807j1008P303K2053K8847J7757P1j5008k6740
$$ 16137 35881 38849 23837 -3459 -28266 -39274 -31971 -9918 18929 36686 36757 21749 -4991
971d991k4888q632R150K1712K6864J7767j451j7115k5095k3506q500J1030K3624
$$ -4991 -29879 -38511 -29361 -7649 19215 36982 35531 18416 -6679 -30185 -38685 -27655 -4031
984d031K3454J6606q37j9173k5449k0596p391J0775K3421K4967J3194j775j8614
$$ -4031 19423 36029 35192 16019 -9430 -30026 -37417 -26642 -3221 21746 34940 33165 14551
997A4551k6004j9342m752J0595K3969K3871J2559m494j7940k5301j9573k693J2134
$$ 14551 -11453 -30795 -35547 -24952 -983 22888 35447 30953 13013 -12288 -31861 -34554 -22420
1010b2420K3045K3408J1244o211j8822k3847j7716k412J3512K2659K1210J1084
$$ -22420 625 24033 35277 29066 10244 -13603 -31319 -33731 -20219 2440 23650 34734
1022C4734o658j9944k3116j6334k395J4915K4188K0323P044o122k0038k3080j5194
$$ 34734 28076 8132 -14984 -31318 -33713 -18798 5390 25713 32757 26635 6597 -16483 -31677
1035c1677K09J4329K3339J9817O424p685j9208k3974j3643L397J4156K1828J9267
$$ -31677 -31468 -17139 6200 26017 32441 24756 5548 -18426 -32069 -28672 -14516 7312 26579
1048B6579N822j0561j8841k1436j3245L167J6847J9852J9102M705j0927k0759
$$ 26579 32401 21840 2999 -18437 -31682 -28515 -11668 8184 27286 31991 21064 305
1060C05j9256j2069L332J6942K1601J4626N214j0567k1368j9827q738L578J7274
$$ 305 -18951 -31020 -27688 -10746 10855 25481 30695 20128 -1240 -21067 -29805 -26227 -8953
1073h953K0951J4530K744j0805k0773j9976p814O462J6244K0807J3673M58j1539
$$ -8953 11998 26528 29272 18467 -2306 -22282 -30096 -23634 -7390 13417 27090 27548 16009
1086A6009j9044j8972p078O590J7187J9433J3019N21j3744j9162j6787o656P491
$$ 16009 -3035 -22007 -29085 -22495 -5308 14125 27144 27665 13921 -5241 -22028 -28684 -21193
1099b1193J7428J9636J0535m90j2677k0332j6316m285Q180J6706J9598J0468k836
$$ -21193 -3765 15871 26406 25916 13239 -7093 -23409 -27694 -19514 -2808 16790 27258 24422
1112B4422j3759j8287j5839l087Q696J6425J8568J0689m522j4784j7762j3840
$$ 24422 10663 -7624 -23463 -26550 -17854 -1429 17139 27828 23306 8522 -9240 -23080
1124b3080l647J0302J7028J6151R774l778j5148j7365j3486k649J0207J8130J5839
$$ -23080 -26727 -16425 603 16754 26528 22750 7602 -9763 -23249 -25898 -15691 2439 18278
1137A8278P776m280j5438j7999j1317j963J0924J7386J5291O018m800j4866j7667
$$ 18278 26054 21774 6336 -11663 -22980 -24943 -14019 3367 18658 24676 19876 5010 -12657
1150a2657j1073Q74J0118J7260J4896N144n997j5108j6509j0795J352J1961J5693
$$ -12657 -23730 -22856 -12738 4522 19418 24562 18565 3457 -13052 -23847 -22495 -10534 5159
1163E159J4238N175p262j5183j5622j0007K234J1736J7172J1839L483p205j4958
$$ 5159 19397 24572 17310 2127 -13495 -23502 -21268 -9532 7640 19479 22962 15757 799
1176G99j5931q284K601J2401J5957J2924K164q157j5134j4732p292L606J2118
$$ 799 -15132 -23416 -20815 -8414 7543 20467 22631 14474 -660 -15392 -22684 -19078 -6960
1189f960J5565J1945J720q857j5517j3838o259M130J3127J4619J0920J189r554
$$ -6960 8605 20550 22270 13413 -2104 -15942 -22201 -18071 -4944 9675 20595 21784 12230
1202A2230j5410j3521m581L754J3915J3899R424P76r153j5893j2687l230L816
$$ 12230 -3180 -16701 -21282 -17528 -3613 10286 19710 20486 11333 -4560 -17247 -20477 -16661
1215a6661J3127J5348Q577j247r933j3858j2690l306N721J2816J4384Q555k780
$$ -16661 -3534 11814 20391 19144 9211 -4647 -17337 -20643 -14922 -2106 12278 20833 18053
1228A8053j0131j3891j0829m123P399J3317J1974R017l315j0077j4042j0855k901
$$ 18053 7922 -5969 -16798 -20921 -13522 -205 11769 20786 17471 7394 -6648 -17503 -20404
1241b0404P758J3400J2471O294k285j0757j4690q419k747P850J2608J2730N495
$$ -20404 -12646 754 13225 19519 17234 6477 -8213 -16632 -19379 -11529 1079 13809 19304
1254A9304l967r925j4286q580j082P964J2273J2439M849m037j1869j1784r125
$$ 19304 15337 5412 -8874 -17454 -18536 -10572 1701 14140 18989 14952 3083 -8701 -17826
1267a7826m01R105J2853J0588M504n080j1614j2337o616l53R203J2576R728L772
$$ -17826 -18227 -9122 3731 14319 18823 13743 2129 -10208 -16824 -17177 -7974 4602 14330 18102
1281A8102n192j1007j1975p647J530R346J2146R369L234o023j1456j1834o363
$$ 18102 12910 1903 -10072 -17719 -16189 -6843 5303 14672 17906 11883 427 -11407 -17770
1294a7770K232R275J2344R098J702n420j1487j0883o678K669R796J1868Q238J710
$$ -17770 -15538 -6263 6081 15179 16881 11461 -26 -10909 -17587 -14918 -5122 6746 14984 16694
1308A6694o314j2129r937n055K822R601J2063P890O38p615j0600j0477m193M261
$$ 16694 10380 -1749 -11686 -16741 -13919 -4318 7745 15635 16273 8658 -1942 -12419 -16612 -12351
1322a2351R496J0949P019J16p241j0751j0554k779M718R496J0520O918j306o906
$$ -12351 -2855 8094 15113 15229 7988 -2763 -13317 -16096 -11378 -1882 8638 15556 14250 7344
1336G344j1529q883k899M482J0437J0076O599j166q212j0358r120j661M575J0157
$$ 7344 -4185 -13068 -15967 -11485 -1048 9028 15627 14461 6249 -4109 -13229 -14890 -10315 -158
1350a58R891N284j393q961r870p779k127N964J0296R196L922j784q396r859p373
$$ -158 9733 15017 13624 4663 -5207 -12986 -15113 -9149 1147 10343 14265 12481 4085 -5774 -13147
1365a3147j740O110J0179Q850M116k781q349r801o011j320O159R936Q671K908
$$ -13147 -14887 -8777 1402 10252 14368 11587 3238 -6563 -12574 -13894 -7735 2201 10872 13780
1379A3780k590q280r931o387P68N434R467Q741K290l143q241q743n929k32P115
$$ 13780 11190 2910 -7021 -13408 -12640 -7206 2261 11002 13292 10149 1908 -6835 -12764 -12996 -5881
1394e881Q995P947K816l947q491r130n477P83P138R543P774Q80l838q427q890
$$ -5881 3114 11061 13877 9930 1439 -7691 -13168 -12385 -5247 4296 12070 12950 9112 685 -8205
1409h205m743J179P014R223O784J376m638q011q513m803K831N939R226O683J519
$$ -8205 -12948 -11769 -4755 4468 11252 12628 7990 -21 -8534 -13337 -10506 -4567 4659 11342 12861
1424A2861n663p891q099m293K585P924P820N634N64m814q650o728m254L045P784
$$ 12861 7198 -693 -8792 -13085 -10500 -2576 5244 10878 11442 6628 -2022 -8750 -13004 -9959 -2175
1439b175Q095N576L46n442r427o863k377L183P339Q753M411o89n783p555o888
$$ -2175 5920 11496 11842 6400 -3027 -9890 -12267 -9084 -1745 7008 11419 10730 4947 -2608 -9496
1454i496k094L803O846P945M522r68o059p740o592j831L607P944O823M167n83
$$ -9496 -11590 -7787 -941 7004 11526 10558 4499 -3241 -9833 -11664 -8057 -113 6710 10877 10294
1469A0294o350q191n696j405L520P864P302L240m87o814p379n467q19M237O954
$$ 10294 3944 -4247 -9943 -11348 -7828 36 7338 10578 10091 3277 -4102 -9569 -10388 -6151 803
1484H03O950K961k023n727p903m883j43L958P789N774L105k486o273p836m364
$$ 803 7753 10714 8691 2964 -4939 -9822 -9965 -6007 1782 7556 10661 8175 1902 -5934 -10298
1499a0298L55N132O684O125K513k488p207o182m262p3M753P519O190J403k844
$$ -10298 -9943 -4811 1873 7998 10511 8023 816 -5366 -9628 -9701 -4948 2571 8761 10164 7320
1514G320n952p428l838J222N204O457O106Q51l342o184o489l093O65N035O764
$$ 7320 1368 -6060 -9898 -8676 -3472 2985 9091 9942 6600 416 -6073 -9166 -8501 -3466 3298
1529C298N090O18l498n658o526l652J911N856N631O175O16m139o334n949l071
$$ 3298 8388 9006 5508 -150 -6676 -10328 -8417 -2561 3070 9245 9861 5722 -612 -6561 -9632
1544i632J591O112O724L641M04l575o369n771j527Q89N186P477L088Jl693n876
$$ -9632 -8041 -1929 4795 8436 8840 5265 -1104 -6875 -8402 -7513 -2327 5150 8238 8239 4546 -1330
1560a330o313j335K840M640O147M169p23m500n558n418j788L294N904M426M622
$$ -1330 -7643 -8978 -6138 -1498 4649 8818 8095 3595 -1963 -7381 -9169 -5875 29 4455 9077
1575I077j169m576n491n274j686K501O348N416L217n63m797o161m111o11K706
$$ 9077 7908 3332 -2159 -7433 -9119 -6618 -270 5146 8363 7800 3003 -3158 -7269 -7880 -5174
$$ [...]
8191a18
##END NTUPLES=NMR FID
##END=
