##TITLE=1H_SR146H12VV
 D2O
 48 sc, 
 12.4.2023
##JCAMPDX= 6.0         $$ Bruker NMR JCAMP-DX V2.0
##DATA TYPE= NMR FID
##DATA CLASS= NTUPLES
##ORIGIN= UXNMR, Bruker Analytische Messtechnik GmbH
##OWNER= root
$$ XWIN-NMR		Version 3.5
$$ Wed Apr 12 16:35:58 2023 Russian Standard Time (UT+4h)  she@DPX200
##.OBSERVE FREQUENCY= 200.13135
##.OBSERVE NUCLEUS= ^1H
##.DELAY= (6, 6)
##.ACQUISITION MODE= SIMULTANEOUS
##.ACQUISITION SCHEME= undefined
##.AVERAGES= 48
##.DIGITISER RES= 18
##SPECTROMETER/DATA SYSTEM= spect
##.PULSE SEQUENCE= zg30
##.SOLVENT NAME= DMSO
##.SHIFT REFERENCE= (INTERNAL, DMSO, 0, 15.7039)
##AUDIT TRAIL= $$ (NUMBER, WHEN, WHO, WHERE, WHAT)
$$ ##TITLE= Audit trail, XWIN-NMR		Version 3.5
$$ ##JCAMPDX= 5.01
$$ ##ORIGIN= Bruker BioSpin GmbH
$$ ##OWNER= she
$$ F:/spectra/data/she/nmr/H-F/1/audita.txt
$$ ##AUDIT TRAIL=  $$ (NUMBER, WHEN, WHO, WHERE, WHAT)
(   1,<2023-04-12 16:34:59.07 +0400>,<she>,<DPX200>,
      <continue with go, POWCHK disabled, PULCHK disabled
       configuration hash MD5:
       00 E9 B6 7A A2 85 ED C7 34 08 36 98 17 FE 4E 26
       data hash MD5: 16K
       BD 27 63 3F D1 FB 9C 33 C0 17 CC C1 57 DA 97 CC>)
$$ ##END=
$$ 
$$ hash MD5
$$ A5 88 1C 72 D6 69 ED A2 F0 53 0B 80 5C 91 79 2D
##$RELAX= 
##$RELAX= 
##$RELAX= 
##$RELAX= 
##$RELAX= 
##$RELAX= 
$$ Bruker specific parameters
$$ --------------------------
##$DU= <F:/spectra>
##$EXPNO= 1
##$NAME= <H-F>
##$PROCNO= 1
##$TYPE= <nmr>
##$USER= <she>
##$AMP= (0..31)
100 100 100 100 100 100 100 100 100 100 100 100 100 100 100 100 100 100 
100 100 100 100 100 100 100 100 100 100 100 100 100 100 
##$AQSEQ= 0
##$AQ_mod= 1
##$AUNM= <au_zg>
##$AUTOPOS= <>
##$BF1= 200.13
##$BF2= 200.13
##$BF3= 200.13
##$BF4= 200.13
##$BF5= 200.13
##$BF6= 200.13
##$BF7= 200.13
##$BF8= 200.13
##$BYTORDA= 1
##$CFDGTYP= 0
##$CFRGTYP= 5
##$CHEMSTR= <none>
##$CNST= (0..31)
1 1 145 1 1 1 1 1 1 1 1 1 1 1 1 1 1 1 1 1 1 1 1 1 1 1 1 1 1 1 1 1 
##$CPDPRG= <>
##$CPDPRG1= <>
##$CPDPRG2= <>
##$CPDPRG3= <>
##$CPDPRG4= <mlev>
##$CPDPRG5= <mlev>
##$CPDPRG6= <mlev>
##$CPDPRG7= <mlev>
##$CPDPRG8= <mlev>
##$CPDPRGB= <>
##$CPDPRGT= <>
##$D= (0..31)
0 1.2 0 0 0 0 0 0 0 0.06 0 0.03 0 0 0 0 0.0002 0 0 0 0 0 0 0 0 0 0 0 0 
0 0 0 
##$DATE= 1681302721
##$DBL= (0..7)
120 120 120 120 120 120 120 120 
##$DBP= (0..7)
150 150 150 150 150 150 150 150 
##$DBP07= 0
##$DBPNAM0= <>
##$DBPNAM1= <>
##$DBPNAM2= <>
##$DBPNAM3= <>
##$DBPNAM4= <>
##$DBPNAM5= <>
##$DBPNAM6= <>
##$DBPNAM7= <>
##$DBPOAL= (0..7)
0.5 0.5 0.5 0.5 0.5 0.5 0.5 0.5 
##$DBPOFFS= (0..7)
0 0 0 0 0 0 0 0 
##$DE= 6
##$DECBNUC= <off>
##$DECIM= 32
##$DECNUC= <off>
##$DECSTAT= 4
##$DIGMOD= 1
##$DIGTYP= 9
##$DL= (0..7)
0 120 120 120 120 120 120 120 
##$DP= (0..7)
150 150 150 150 150 150 150 150 
##$DP07= 0
##$DPNAME0= <>
##$DPNAME1= <>
##$DPNAME2= <>
##$DPNAME3= <>
##$DPNAME4= <>
##$DPNAME5= <>
##$DPNAME6= <>
##$DPNAME7= <>
##$DPOAL= (0..7)
0.5 0.5 0.5 0.5 0.5 0.5 0.5 0.5 
##$DPOFFS= (0..7)
0 0 0 0 0 0 0 0 
##$DQDMODE= 0
##$DR= 18
##$DS= 0
##$DSLIST= <SSSSSSSSSSSSSSS>
$$ [...]
##$SUBNAM2= <"">
##$SUBNAM3= <"">
##$SUBNAM4= <"">
##$SUBNAM5= <"">
##$SUBNAM6= <"">
##$SUBNAM7= <"">
##$SUBNAM8= <"">
##$SUBNAM9= <"">
##$SW= 18.05172834244
##$SWIBOX= (0..15)
0 0 2 0 0 0 0 0 0 0 0 0 0 0 0 0 
##$SW_h= 3612.71676300578
##$TD= 16384
##$TD0= 1
##$TE= 0
##$TE2= 300
##$TE3= 300
##$TEG= 300
##$TL= (0..7)
0 120 120 120 120 120 120 120 
##$TP= (0..7)
150 150 150 150 150 150 150 150 
##$TP07= 0
##$TPNAME0= <>
##$TPNAME1= <>
##$TPNAME2= <>
##$TPNAME3= <>
##$TPNAME4= <>
##$TPNAME5= <>
##$TPNAME6= <>
##$TPNAME7= <>
##$TPOAL= (0..7)
0.5 0.5 0.5 0.5 0.5 0.5 0.5 0.5 
##$TPOFFS= (0..7)
0 0 0 0 0 0 0 0 
##$TUNHIN= 0
##$TUNHOUT= 0
##$TUNXOUT= 0
##$USERA1= <user>
##$USERA2= <user>
##$USERA3= <user>
##$USERA4= <user>
##$USERA5= <user>
##$V9= 5
##$VALIST= <valist>
##$VCLIST= <CCCCCCCCCCCCCCC>
##$VD= 0
##$VDLIST= <DDDDDDDDDDDDDDD>
##$VPLIST= <PPPPPPPPPPPPPPP>
##$VTLIST= <TTTTTTTTTTTTTTT>
##$WBST= 1024
##$WBSW= 4
##$XGAIN= (0..3)
0 0 0 0 
##$XL= 0
##$YL= 0
##$YMAX_a= 452813
##$YMIN_a= -593930
##$ZGOPTNS= <>
##$ZL1= 120
##$ZL2= 120
##$ZL3= 120
##$ZL4= 120
##$ABSF1= 10
##$ABSF2= 0
##$ABSG= 5
##$ABSL= 3
##$ALPHA= 0
##$AQORDER= 0
##$ASSFAC= 0
##$ASSFACI= 0
##$ASSFACX= 0
##$ASSWID= 0
##$AUNMP= <proc_1d>
##$AZFE= 0.1
##$AZFW= 0.1
##$BCFW= 1
##$BC_mod= 2
##$BYTORDP= 1
##$COROFFS= 0
##$CY= 11.3945322036743
##$DATMOD= 1
##$DC= 2
##$DFILT= <>
##$DTYPP= 0
##$F1P= 2.36226072786647
##$F2P= -0.459571619588291
##$FCOR= 0.5
##$FTSIZE= 0
##$FT_mod= 4
##$GAMMA= 1
##$GB= 0.15
##$INTBC= 1
##$INTSCL= 1
##$ISEN= 128
##$LB= 0.24
##$LEV0= 0
##$LPBIN= 0
##$MAXI= 10000
##$MC2= 0
##$MEAN= 0
##$ME_mod= 0
##$MI= 1.114404
##$NCOEF= 0
##$NC_proc= 0
##$NLEV= 6
##$NOISF1= 3.799351
##$NOISF2= 2.8
##$NSP= 1
##$NTH_PI= 0
##$NZP= 0
##$OFFSET= 15.70392
##$PC= 1
##$PHC0= -19462.62
##$PHC1= -7.799194
##$PH_mod= 1
##$PKNL= yes
##$PPARMOD= 0
##$PSCAL= 0
##$PSIGN= 0
##$REVERSE= no
##$SF= 200.130013532006
##$SI= 16384
##$SIGF1= 3
##$SIGF2= 2
##$SINO= 400
##$SIOLD= 16384
##$SREGLST= <1H.CDCl3>
##$SSB= 0
##$STSI= 0
##$STSR= 0
##$SW_p= 3612.71676300578
##$SYMM= 0
##$S_DEV= 0
##$TDeff= 0
##$TDoff= 0
##$TI= <>
##$TILT= no
##$TM1= 0
##$TM2= 0
##$TOPLEV= 0
##$USERP1= <user>
##$USERP2= <user>
##$USERP3= <user>
##$USERP4= <user>
##$USERP5= <user>
##$WDW= 1
##$XDIM= 8192
##$YMAX_p= 0
##$YMIN_p= 0
$$ End of Bruker specific parameters
$$ ---------------------------------
##NTUPLES= NMR FID
##VAR_NAME=  TIME,          FID/REAL,        FID/IMAG
##SYMBOL=    X,             R,               I
##VAR_TYPE=  INDEPENDENT,   DEPENDENT,       DEPENDENT
##VAR_FORM=  AFFN,          ASDF,            ASDF
##VAR_DIM=   8192,          8192,            8192
##UNITS=     SECONDS,       ARBITRARY UNITS, ARBITRARY UNITS
##FACTOR=    0.0002768,     1,               1
##FIRST=     0,             0,               0
##LAST=      2.2672688,     0,               0
##MIN=       0,             -593930,         0
##MAX=       2.2672688,     452813,          0
$$ Real data points
##PAGE= N=1
##DATA TABLE= (X++(R..R)), XYDATA
0@%%%%%%%%%%%%%%%Jm9R6r6R6r6J44j92J92k40K88l23L71m32M94n44O27p23Q20
$$ 0 0 0 0 0 0 0 0 0 0 0 0 0 0 0 0 1 -48 48 -48 48 -48 96 -96 96 -144 144 -179 192 -240 254 -290 337 -386 434
34D34r21J054j192J335j493J657j851K066k293K541k817L113l434L787m176M603
$$ 434 -487 567 -625 710 -783 874 -977 1089 -1204 1337 -1480 1633 -1801 1986 -2190 2413
50B413n070N588o160O794p500Q291r188J0220j1412J2794j4440J6441j8925K2109
$$ 2413 -2657 2931 -3229 3565 -3935 4356 -4832 5388 -6024 6770 -7670 8771 -10154 11955
64A1955k6363L2368m1567N7589r3619L45458j09474m67008L9926j38375O7631
$$ 11955 -14408 17960 -23607 33982 -59637 285821 176347 -290661 -250735 -389110 -321479
75c21479L18042K73875O2775P9148k21958l88319j61307L8829K5484K55098L30215
$$ -321479 -3437 270438 333213 412361 190403 -197916 -359223 -320394 -294910 -39812 290403
86B90403J03184o7096j58465l54153k10586R4330J10745J15064L23454K00831
$$ 290403 393587 326491 168026 -186127 -396713 -302383 -191638 -76574 246880 447711
96D47711j33996k25538k32850k42579K0071K32340J67117J83047J96746j12633
$$ 447711 313715 88177 -144673 -387252 -367181 -134841 32276 215323 412069 299436
106B99436k94643j54082j26311j02052J88613K99162J23903P9506R864k70330
$$ 299436 4793 -149289 -275600 -377652 -189039 110123 234026 313532 323396 53066
116E3066k99077n5101L1474Q7734K54697K12983J7405o3221j74856k80712j22255
$$ 53066 -246011 -301112 -269638 -181904 72793 285776 303181 239960 65104 -215608 -337863
127c37863P7952J23283K10114K33658Q770j53313j39325j90654j66137P1077J93099
$$ -337863 -259911 -136628 73486 307144 315914 162601 23276 -167378 -333515 -262438 -69339
138f9339J45730J66695Q9217j48235k19180j41162j15510J3445K17340K02095
$$ -69339 76391 243086 332303 184068 -35112 -176274 -291784 -278339 -60999 141096
148A41096Q4686N0986q1486k40386j71375l6200J3213J47012K49175J13531l5831
$$ 141096 225782 276768 195282 -45104 -216479 -252679 -239466 -92454 156721 270252 234421
159B34421q1894j78846k05026l6950Q8420J19268J85292J47849l6867j26959j38080
$$ 234421 152527 -26319 -231345 -268295 -179875 -60607 124685 272534 235667 108708 -29372
170b9372j76254q2635J13651J61954J34198J29174r30j65400j58809j06976p6595
$$ -29372 -205626 -288261 -174610 -12656 121542 250716 249786 84386 -74423 -181399 -257994
181b57994O7355K00151J46363O4759O670j29510j99841j03300j3734N0913J67770
$$ -257994 -190639 9512 155875 220634 227304 97794 -102047 -205347 -219081 -168168 -398
192c98J78627M4790m0644r3913j75220j36035Q178Q4887J29657J69277P3196p6482
$$ -398 178229 223019 182375 88462 -86758 -222793 -214615 -129728 -71 169206 242402 165920
204A65920j17863j28629j29964j4479J18767J37291J21711P8349n6563j51946
$$ 165920 48057 -80572 -210536 -225015 -106248 31043 152754 231103 174540 22594
214B2594j25632q7691k3777J07166J65022J04337M1584l8098j43429j47770o1576
$$ 22594 -103038 -190729 -214506 -107340 57682 162019 203603 165505 22076 -125694 -187270
225a87270K449Q0409J62449J24115J2315n7800j14566j49997p3918L5871Q9474
$$ -187270 -184821 -104412 58037 182152 194467 136667 22101 -127896 -201814 -165943 -76469
236g6469J29268J27886K0507q6144j14815j19943p9919L2432J15306J19458R9204
$$ -76469 52799 180685 201192 115048 233 -119710 -199629 -167197 -51891 67567 166771
247A66771K9959q4174j34156j05279n7632K3375J17130J29432P8707J6609p2530
$$ 166771 196730 112556 -21600 -126879 -184511 -161136 -44006 85426 164133 180742 108212
258A08212j39761j09598l2095K9291J01524J37998P7177r811p2404j21718j16717
$$ 108212 -31549 -141147 -173242 -143951 -42427 95571 172748 162937 90533 -31185 -147902
269a47902k9790N3753R8096J17782Q3674j4248r0990j09881j01811l6981O0385
$$ -147902 -177692 -123939 -25843 91939 175613 161365 70375 -39506 -141317 -178298 -117913
280a17913J10405J04530O9636r838r4866j17815q5630k5459N4640J14371J06592
$$ -117913 -7508 97022 166658 156820 61954 -55861 -141491 -166950 -112310 2061 108653
291A08653N3504j6949r2063j17936p9310j3002N5148J11020J06917M4310k8778
$$ 108653 162157 145208 53145 -64791 -144101 -157103 -101955 9065 115982 160292 131514
302A31514q6838j13178q0286k824O4112J03834J00254M3062l7239r2468j03203
$$ 131514 44676 -68502 -148788 -151612 -87500 16334 116588 159650 122411 29943 -73260
313g3260p3242k451P2220J05687R0674L4867l8807r5222j02167o2593M991P1059
$$ -73260 -146502 -148953 -76733 28954 119628 154495 115688 20466 -81701 -144294 -139303 -68244
325f8244J04357Q6445K7196m5114r3931r7462n7389J2125P4891J01926P9403J9893
$$ -68244 36113 122558 149754 104640 10709 -86753 -144142 -132017 -57126 44800 124203 144096
337A44096m7649r4485r3401m9748J6208P7439R9566P2666J4563n0433r6366r1199
$$ 144096 96447 1962 -91439 -141187 -124979 -47540 52026 124692 139255 88822 -7544 -98743
349i8743l9492K2836P6187R7984O7154O333n4421r1680q6960l6728L1136P7240
$$ -98743 -138235 -115399 -39212 58772 125926 132259 77838 -13842 -100802 -137530 -106394 -29154
361b9154R2323O5321r13o2656q5578q0118l5222L6722Q1851Q3450N7711J047o5731
$$ -29154 63169 128490 127577 64921 -20657 -100775 -135997 -99275 -17424 66026 123737 124784 59053
374E9053r1417p0892k6330L4540Q5359Q5423M5263n361o1256r3491o8808j3812
$$ 59053 -32364 -103256 -129586 -95046 -9687 75736 120999 115638 54382 -39109 -107917 -121729
386a21729L5390P9959Q8526M0525j8483n8578q6011p1952p571M7325P2639P9108
$$ -121729 -86339 -6380 82146 122671 104188 45610 -40401 -112353 -119924 -72599 40 79148
398G9148M4966k3097o7705p7282o6622j0411N6584P7650O6411M1295k1548p6624
$$ 79148 124114 101017 33312 -43970 -110592 -121003 -64419 13231 79642 120937 99389 22765
410B2765p7765m8634r780M9755Q5955O4654K3622j7750p0866q6149m3178N494
$$ 22765 -55000 -103634 -113414 -63659 22296 86950 110572 92822 21956 -64193 -107371 -101877
422a01877M4386Q0790P0583J5610l0455o1513q1205m9389J5945N3186O8385P0400
$$ -101877 -57491 23299 93882 109492 79037 17524 -63681 -113070 -97125 -43939 24446 94846
434I4846J9357m4263o6903o5753m7501J2146O5199O7515N3135K2481m0269p8530
$$ 94846 114203 69940 3037 -62716 -110217 -98071 -32872 34643 87778 110259 69990 -8540
446h540n9324l2673O120O1690P9317M4546Q176l3218p6202o7544k0087J5222N0787
$$ -8540 -67864 -100537 -94417 -32727 46590 91136 99312 66094 -10108 -77652 -97739 -82517 -31730
459c1730P9534N2267o402m0277o4020o9646k2860L0907N2339O6226N4182o048
$$ -31730 47804 100071 93669 53392 -10628 -80274 -103134 -72227 -19888 46338 100520 94472
471I4472n3943n9942n4289k9317L0746O5651N6278M2404L929n7517p0632m0857
$$ 94472 40529 -19413 -73702 -103019 -72273 -6622 49656 92060 95989 38472 -32160 -73017
483g3017k0670J9845O9421O5990K8094m427m5606p5699m8004k922K4048N8391
$$ -73017 -93687 -73842 -4421 61569 89663 85236 39630 -36069 -84073 -86995 -62947 -4556
495d556P1958K7788k0858m4323o2945n4011r87L7795N1386O1537L5234k5842n4332
$$ -4556 67402 95190 74332 30009 -32936 -86947 -87934 -50139 1247 62784 98018 72176 17844
508A7844n2782m7141r435M6067N8094M6942L3146j6206o5593n6049l2229r290
$$ 17844 -34938 -82079 -91514 -45447 12647 59589 92735 76529 10936 -45113 -77342 -86632
520h6632L8703P1986M5895J1906j3565n5311o7161k8081R451L1152O2378N5188
$$ -86632 -47929 24057 69952 81858 68293 12982 -54179 -82260 -72809 -41657 20721 75909
532G5909O816k7582m4968o0439l6965J5728M2230N0261N2529J3796l6642n2095
$$ 75909 82725 55143 10175 -50264 -87229 -71501 -29271 20990 73519 87315 50673 -1422
544a422m8416l5303J0516N3455N2274L8579J3786l3093o1147m4257k2889Q070
$$ -1422 -49838 -85141 -74625 -21170 31104 69683 83469 50376 -10771 -55028 -77917 -69847
556f9847M8798O0974L0721L405k4612n9365n3414j2315J6424L7947O0818L9382
$$ -69847 -21049 39925 70646 74051 49439 -9926 -63340 -75655 -59231 -21284 39534 78916
568G8916q994l3497m5506n4009j9839K8405M5498M6976L8751l094m5383m7242
$$ 78916 69922 36425 -9081 -63090 -82929 -54524 -9026 37950 76701 73607 28224 -19018
580a9018l8756k1541K2894N5970M4099K6541O66m2277n5474l3345j1177J7672
$$ -19018 -57774 -79315 -56421 -451 43648 70189 70855 28578 -26896 -60241 -71418 -53746
592e3746N4245N1383J7687o958l3882n8193l8178J521K1341M4425N5010J9933
$$ -53746 499 51882 69569 62611 28729 -29464 -67642 -66121 -44780 -355 54655 74588
604G4588k0347l4783m5278m3865l06L6189L9403M2835K8325k0899m8090l8853
$$ 74588 54241 19458 -25820 -69685 -69991 -33802 5601 48436 76761 55862 7772 -31081
616c1081l1161q451L5118N1621L4128J9110j2815n0696m6195k0491k647K8934
$$ -31081 -62242 -70693 -35575 16046 50174 69284 56469 5773 -40422 -60913 -63560 -34626
628c4626N4892L6916O102j4063m1648n1940j9915R078K5255M6943M4907L787k6671
$$ -34626 20266 57182 63284 49221 7573 -44367 -64282 -55204 -29949 16994 61901 65688 39017
641C9017l4780m5692k7577J4663L4985L8495L8777J0807l2751m1949l4225k5090
$$ 39017 4237 -41455 -69032 -54369 -19384 19111 57888 68695 35944 -6005 -40230 -65320
653f5320Q941M2402M2050K6612R310k6298m9675l4350j1915N994L6936M8090K4811
$$ -65320 -56379 -13977 28073 54685 63995 37697 -11978 -46328 -58243 -52249 -15313 32777 57588
666E7588j228k2120m4945m0497p618J3966L0767M6885L0716q959k8582l7166l8855
$$ 57588 56360 34240 -10705 -51202 -58820 -44854 -14087 32798 63514 54555 25973 -11193 -50048
679e0048j2624K2899L4921L5909K9682n002l6131l7976k7881j3942J8137M2539
$$ -50048 -62672 -39773 -4852 31057 60739 55737 19606 -18370 -46251 -60193 -42056 483
691D83L5779J8995k246l3182m2489k5511p338J5130M3015M0106J2462r358k7048
$$ 483 36262 55257 53011 19829 -22660 -48171 -55509 -40379 2636 42742 55204 45846 18798
704A8798m3475k9438L462J8588L3613M1601J5030j7396k9374l4831l0395m58K9038
$$ 18798 -24677 -54115 -50653 -32065 1548 43149 58179 40783 11409 -23422 -53817 -54275 -25237
717b5237L3066L2830J7467j7513l5347l0669k4440l924K8916L9827K6608J1603
$$ -25237 7829 40659 58126 40613 5266 -25403 -49843 -53767 -24851 14976 41584 53187
729E3187j2016l7348l6526j6052O71K3862M2144K7415M203j3623l2158l8613j6929
$$ 53187 41171 3823 -32703 -48755 -48084 -24222 17922 45337 49540 35917 3759 -34854 -51783
742e1783Q624K3290L6895L0137L035k0608k9466l3013k0038J1183K8476L1897
$$ -51783 -43159 -19869 17026 47163 50198 29590 124 -32889 -52927 -41744 -13268 18629
754A8629K6949N494k3411l2898k8723j6928R576L2086L2334K0114M874k0574l6357
$$ 18629 45578 51072 27661 -5237 -33960 -50888 -41312 -9226 23108 43222 48096 27522 -8835
767h835k8387r555Q442K8988L6412J8751k639j8998l4139k9567p573J3199K7577
$$ -8835 -37222 -46777 -38335 -9347 27065 45816 43177 24179 -9960 -39527 -47100 -33901 -6324
780f324L2973J9872l935k3378l1622k6943q467J6871K9441K9061J7626m297k5362
$$ -6324 26649 46521 42586 19208 -12414 -39357 -47824 -30953 -1512 27549 45175 40878 15516
793A5516l1193k3125o784J6055L1979K7479J4285n005k6011l2122k1064k362J4774
$$ 15516 -15677 -38802 -45586 -29531 2448 29927 44212 39207 13196 -18926 -39990 -42352 -27578
806b7578L1003K9246J0929q065k4397l1031k1143n53J8949K8650K7039J0657j1219
$$ -27578 3425 32671 43600 35535 11138 -19893 -41036 -41589 -22640 6010 33049 43706 32487
819C2487k5161k8360j9751J02K0295K9020K4692Q886j1715k5769k8339j6711K304
$$ 32487 7326 -21034 -40785 -40683 -20388 8632 33324 42210 30495 4726 -23613 -40324 -38020
832c8020K0752K9084K3125O870j3027k7206k6549j5456M533K0745K9175K0928
$$ -38020 -17268 11816 34941 41811 28784 1578 -24971 -40427 -35894 -15149 14026 34954
844C4954M899j3986k6178k6723j2602M900K2915K7448J9813K910j4491k6908k5272
$$ 34954 39853 25867 -311 -27034 -39636 -34736 -11821 15627 35440 38350 23859 -3049 -28321
857b8321j1305P120K3125K7692J6878J826j5540k6330k4812q789Q846K2335K6287
$$ -28321 -39626 -32506 -9381 18311 35189 37015 21475 -4855 -29667 -38456 -29610 -7275 19012
870A9012J7417r43j7387k5443k2720p953J1539K3053K3048J6108j096j9463k4880
$$ 19012 36429 35486 18099 -7344 -30064 -38017 -26478 -3425 19623 35731 34635 15172 -9708
883i708j9558p767J1370K4648K3093J2197j529j9516k6126j7934l207R620K4357
$$ -9708 -29266 -37033 -25663 -1015 22078 34275 32746 13230 -12896 -30830 -34037 -24417 -60
896f0K4268J0645n636j7448k5707j8053j978J3944K1699K3794J1192r129j8250
$$ -60 24208 34853 29217 11769 -13938 -31991 -33969 -20025 1674 25468 36660 27531 9281
909I281k3288j8989q38J6630K1420K0268J0730p799k2609k0861j4644k254J6856
$$ 9281 -14007 -32996 -33834 -17204 4216 24484 35214 27415 4806 -16055 -30699 -32953 -16097
922a6097K4421J7690O698o293k2760k2937j1228M15J4555K4782J8807K624p443
$$ -16097 8324 26014 32712 26419 3659 -19278 -30506 -30091 -15536 9246 28053 30677 23234
935B3234j9690k4213j1908N849J4300K1137K0175L183j2681j8338k0465j3271
$$ 23234 3544 -20669 -32577 -26728 -12428 8709 28884 32067 19386 1048 -19417 -32688
947c2688N286J9028J9398J6344N133j3785k1753j7269j0478L498J9704K2299J2011
$$ -32688 -27402 -8374 11024 27368 32501 18716 -3037 -20306 -30784 -27286 -7582 14717 26728
960B6728K993j0555k3790j8766n632M323J6892K4139J2717k212j1094k0537j9821
$$ 26728 29721 19166 -4624 -23390 -29022 -24699 -7807 16332 29049 26837 15743 -4794 -24615
973b4615m330Q259J5705K0385J4630m065j4226j6491j8666p999J1877J8261J6279
$$ -24615 -28945 -20686 -4981 15404 30034 25969 11743 -4748 -23414 -31413 -19536 -1275 15004
986A5004J3673j164j7382j9412j3238p213R437K1202J7060Q883j202j5780k2238
$$ 15004 28677 27513 10131 -9281 -22519 -29732 -20295 907 17967 26850 25648 9868 -12370
999a2370j0878k589O243K0714K0076N638m510j2778k0667j5633J386J0771J5723
$$ -12370 -23248 -25837 -19594 1120 21196 26834 22324 9546 -11121 -26754 -25368 -14597 1126
1012A126J9378Q287q745j4784j5737j5719l86J5137J5946J4432R958p938j9917
$$ 1126 20504 28791 20046 5262 -10475 -26194 -26580 -11443 4503 18935 28893 20955 1038
1025A038j3936r871l068J3248K0589J2656M336m634j8357j8607o647O18R954K1517
$$ 1038 -12898 -22769 -25837 -12589 8000 20656 24992 20358 2001 -16606 -23253 -22635 -12681 8836
1039H836J4630L18o315j4817k0910p385N908J0320J5649J7795J118j1801j3761
$$ 8836 23466 23784 17469 2652 -18258 -25643 -19735 -9415 6234 24029 25147 13346 -415
1052d15j4887j1349O159J5522J3483J3373M217j3531j6540j0901q941K399J7026
$$ -415 -15302 -26651 -20492 -4970 8513 21886 26103 12572 -3968 -14869 -23810 -21411 -4385
1065d385J7279P732K720r310k0004j3306k874L368J3270J9960Q357k751q506j6429
$$ -4385 12894 20626 23346 14036 -5968 -19274 -22148 -18780 -5510 14450 22807 20056 11550 -4879
1079d879j5316k043P094J1075J7205J1816n063j2214j2510j4589m404R951J3183
$$ -4879 -20195 -22238 -15144 -4069 13136 24952 19889 7675 -4835 -19424 -23828 -13877 -694
1092f94J2748J0626q39j4890j5158r674n784Q216J7391J2947O165j518j3081j7461
$$ -694 12054 22680 21841 6951 -8207 -17881 -23665 -15449 1942 14889 21054 19536 6455 -11006
1106a1006q005r12N815J6403J5049L564m033j0608j6361j0728J356Q503J2454
$$ -11006 -19011 -19923 -14108 2295 17344 20908 16875 6267 -10094 -20822 -19466 -10963 1491
1119A491J4964N533o820j1857j3161j1099j1J2115J3968J0665O194o317j5099
$$ 1491 16455 21988 15168 3311 -9850 -20949 -20960 -8845 5123 15788 21982 15665 566
1132E66j1875p658j253J1850J5326R678L018m358j5101j4213m131J027Q474J6395
$$ 566 -11309 -18967 -20220 -8370 6956 16634 19652 15294 193 -14020 -18151 -17124 -8650 7745
1146G745J0477M30n628j1693j5414o129M907R097J2998J2259P95r414j1117j2592
$$ 7745 18222 18652 13024 1331 -14083 -20212 -15305 -6208 6790 19049 19844 10430 -687 -13279
1160a3279p581N232J2159J1340R003K982j0534j3242r246n701K761J3486J3073
$$ -13279 -20860 -15628 -3469 7871 16874 19856 9322 -3920 -13166 -18867 -16106 -2620 10453
1173A0453O302Q52o973j5693j0241k137L497J0859J4160O699k275o661j3850j1394
$$ 10453 16755 17607 10634 -5059 -15300 -17437 -13940 -3081 11079 17778 15503 8842 -5008 -16402
1187a6402j916O636R942J2814P788m314q606j1026j0719k489P197J1554J0555
$$ -16402 -18318 -11682 -1740 11074 18862 14548 5942 -5084 -15803 -18292 -11095 459 11014
1200A1014O891k377j1179j1784q022k751P438J2866R969N011k035j0977j2416
$$ 11014 17905 15528 4349 -7435 -15457 -18208 -10770 2096 12065 17076 15041 4064 -8352
1213h352p147r38O424J2334J0271L707l742r068j2275q211J489P589J0843J0446
$$ -8352 -15499 -16437 -10013 2321 12592 16299 12557 3489 -8786 -16997 -15508 -7919 2924 13370
1227A3370L057m472r967j0664p167M29R351J0588Q665L198m821j1711r152o396
$$ 13370 16427 11955 1988 -8676 -15843 -15414 -6063 4525 13190 16388 11567 -144 -9296 -15692
1241a5692J174Q399J2388P117J688l933j1526j0591m252J972P570J1351Q824L27
$$ -15692 -14518 -6119 6269 13386 15074 11141 -385 -10976 -15228 -13256 -5686 5665 14489 14816
1255A4816n350r641j1146m234L535Q427R264R181K85p164j0114q607m539L129
$$ 14816 9466 -175 -11321 -15555 -12020 -3593 5671 14852 15137 7973 -2141 -10748 -15287 -12158
1269a2158R531R581O885N88p547j0514p899l430L057J0967R556N119m5o793j1644
$$ -12158 -2627 6954 13839 14427 6880 -3634 -11533 -14963 -11906 -939 8617 13736 13691 6898 -4746
1284d746p728j634L999R192R793M681q88o949j0224q179j347N471Q413Q993N831
$$ -4746 -12474 -14108 -10109 -917 8876 13557 12669 5720 -4504 -12683 -14030 -8559 -146 8847 14678
1299A4678k874p213r868o813j407N157Q902Q809M292k373p986r169o776j072N633
$$ 14678 11804 4591 -5277 -12090 -13497 -8340 562 9371 13663 11290 3304 -5865 -12641 -13713 -8080
1314h080R433Q620M371l858p765q600o637n3O309R131P169L078l095q305q656
$$ -8080 1353 9973 14344 10486 2721 -5879 -12516 -12569 -6260 2871 10040 13118 10023 1718 -6938
1329f938n803L28O970R153O735K769l785q349r188n188K295O482Q574O747J994
$$ -6938 -12741 -12413 -5443 3710 10445 13214 9429 1080 -8108 -13296 -11001 -4519 4055 10802 12796
1344A2796m976p793q580m010J947P119Q251O195N82m464p622q488l422K273P167
$$ 12796 7820 27 -8553 -12563 -10616 -3497 4754 10949 11531 7067 -555 -9043 -12465 -10192 -3025
1359c025Q474N345R88n933p779p162k310K127P223Q444N498q80m493q896p048
$$ -3025 5449 10794 11782 5849 -1930 -9092 -11402 -9275 -2052 6392 11890 11010 6517 -2379 -9427
1374i427k446L802P101P314M732m32n323q202o553k451L801P116P921M728j600
$$ -9427 -11873 -8071 -970 6344 11076 10644 5321 -2881 -9434 -11885 -8084 -968 6953 11681 10081
1389A0081o370o799o616k395M927P722O935L704j691o197p386n545r91L162Q038
$$ 10081 3711 -3088 -9704 -12099 -7172 550 7485 11189 9498 3301 -4085 -9630 -10621 -7459 579
1404E79P022L223j625o212p895n505L81L596P081P872K435k814n192q562n090
$$ 579 7601 10824 9199 2987 -4908 -10413 -10032 -6436 645 8517 10952 8138 2946 -5616 -10706
1419a0706N93M875O907O021L563l457o409o512m886k86N797P214M996L016l346
$$ -10706 -10113 -5238 1669 7690 11253 7796 1387 -5125 -10011 -10297 -4500 2714 7710 10726 7380
1434G380o747o968l821M40N243P548N594J578k894p338o673l560J428N297O817
$$ 7380 633 -6335 -10156 -9716 -4473 3075 8669 10247 7353 15 -6658 -10218 -8790 -3493 3324
1449C324N704K55m234m996o990l209K159N105O704N690O63n722n516n126l922
$$ 3324 9028 9283 5049 53 -6937 -10146 -7987 -2882 3822 9512 10175 4453 -1063 -6189 -10111
1464a0111K396O098N804M700R88n106p035m737k886K302O367O563L545p52l252
$$ -10111 -7715 -1617 4187 8887 9875 4769 -2266 -7003 -9889 -7587 -1220 5343 8888 8136 4884
1479D884o537o308j345L011M797O980L627j246l669o375n795j024L237N104O100
$$ 4884 -1653 -7961 -9306 -6295 -1498 5482 9109 7863 4194 -2181 -7976 -9000 -5763 -659 5441
1494E441L883j786m486n238n655j119M149N704M707L266j468m919n498m195j555
$$ 5441 9324 7538 3052 -2186 -7841 -8960 -4811 893 5600 8866 7398 2479 -3019 -7214 -8769
1509h769L689O300M227L177j727m882o149l698j3K613O185N859J502k308m451
$$ -8769 -5080 1220 5447 8624 6897 2015 -4134 -7832 -7845 -5232 953 6812 8314 6006 1555
1524A555o012m172J406L342N273M988K118k592m875n931l665N80M569N077M459
$$ 1555 -4457 -8629 -7223 -3881 1392 6380 8498 5906 1031 -4900 -8565 -7985 -3416 1661 6120
1539F120K146l433m764n170k721L15M723O089L042J104k761m977n939j403Q26
$$ 6120 8266 4833 69 -5101 -7822 -7507 -2784 3305 6347 7451 4690 -287 -6226 -7629 -6803
1554f803L871O116M048k34k310m933n448j840J698L121N713L865O32l891n020
$$ -6803 -2932 3184 7232 6998 4688 -245 -5693 -7533 -5835 -2714 2999 6864 7496 3605 -1415
1569a415m250k079K488M155N119L093M77l352o074m034j169R74N242N458K915
$$ -1415 -5665 -7744 -5256 -1101 4018 7111 7588 4236 -1838 -5872 -7041 -6067 -825 4633 7548
1584G548j094l143n631m220n29K327L721N816K204p98m061m417l562q33K887L474
$$ 7548 6454 3311 -2320 -6540 -7069 -4742 -1021 4795 6999 6201 2140 -2277 -5839 -6672 -3785 -311
1600c11N153K599j609m196m000l834j246L648M244M034K350p71m867m370l176
$$ -311 4842 7441 5832 1636 -2364 -6198 -7444 -3796 448 4482 6832 6061 1194 -3176 -6352
1615f352l51L202M238M323J644j715l751m778l049J048J655N208L813J387j815
$$ -6352 -6703 -3501 737 5060 6704 4989 1238 -3540 -6589 -5541 -3886 1322 5135 6522 4707
1630D707l345n102k827N33L454L833M342J270k700m029m312k761J033L292M777
$$ 4707 1362 -3740 -6567 -6034 -2580 1253 5595 6865 4165 136 -4176 -6937 -5904 -2612 2165
1645B165K850J396k166m684l856j900P22L166M612L068N51k513l885m249j713
$$ 2165 5015 6411 4245 -439 -4295 -6195 -5473 -2307 2305 5373 5924 3411 -474 -4723 -6436
1660f436J535L307M376K595Q43l286l795l765j817J958L470L342L411o09k891
$$ -6436 -4901 -1594 2782 5377 6220 2934 -861 -4626 -6443 -4485 -1015 2327 5738 5129 2238
1675B238l948k953j425J397M207L855K441r51j968m205l384j644K552L547L102
$$ 2238 -1710 -4663 -6088 -4691 -484 3371 5812 4861 2893 -1312 -4696 -6340 -3788 -241 2861
1690B861L152k47l159l909l488o01J782L440L931K263j315k384m318l191n02K558
$$ 2861 6013 5766 2607 -1302 -4790 -5391 -3609 -169 3762 6025 4710 2326 -1992 -5183 -5685 -3127
1706c127L930K987K034r18l660l682k833k29K839L816K782J421q14l393l846j869
$$ -3127 803 3790 5824 4906 1246 -2436 -5269 -5498 -2659 1157 3939 5360 4546 1153 -2693 -4562
1722d562m86K242L349L220J902j964k362m644k113R25K333K915L793M34j675k918
$$ -4562 -5048 -2806 543 3763 5665 3701 1339 -3305 -5418 -4493 -2160 755 4548 4982 3307 389
1738C89l255k529Q22K522L355L337O20j618l693k799k013K61L183L228K469N38
$$ 389 -2866 -5395 -4573 -2051 1304 4641 5261 3643 -50 -2849 -4862 -4601 -1418 1810 4279 4817
1754D817j088m051l405j369R72K912L474K261K86k311k574l668j420J077L095
$$ 4817 3729 -322 -3727 -5096 -4124 -1212 2262 4523 4809 2498 -76 -3744 -5164 -4087 -992
1769i92L339K154o69j266k858l156j506J933K541K693K893j067j684l454k840
$$ -992 2347 4501 3832 2566 -292 -3448 -4954 -3021 -480 2213 5106 4039 2355 -1099 -3939
1784c939n02R62K851L262K178j69k567k824l136o99Q51L669K820J866r96k330
$$ -3939 -4441 -3479 -628 2634 4812 4643 2076 -748 -3884 -4583 -3732 -63 2757 4623 3627 1297
1800A297k922k447k49K008K229K664J605m89k278l328j655j522K448L070K040
$$ 1297 -1625 -4072 -4321 -2313 -84 2580 4185 3696 1418 -1910 -3565 -5087 -2639 431 2471
1815B471K234j315k496k851j845m72J655L470K013P58J34l374k582j844j15K031
$$ 2471 4705 3390 894 -1957 -3802 -4274 -2619 851 2864 3622 3756 382 -2200 -4044 -4159 -2128
1831b128L047K380P02n02l144k801j822M55J712L070K266J048j862k191k561j796
$$ -2128 919 3299 4001 3499 355 -2446 -4268 -3813 -2101 969 3235 4283 2421 230 -2331 -4127
1847d127R83J815K009L339L1j216k767k674j459O11K134K550K904o24j025k558
$$ -4127 -3144 -1329 680 4019 4050 2834 67 -2607 -4066 -3455 -1321 1229 4133 3509 2484 -74
1863g4k786j076J104J841K661J603Q31j801k936k016j624P83L108K171K294j43
$$ -74 -2860 -3936 -2832 -991 1670 3273 4104 2303 -633 -2649 -4273 -3490 -382 1789 4083 3940
1879C940j737l180k002j013P89L085K346K013q56j604k591k849M14L24L190K149
$$ 3940 2203 -977 -2979 -3992 -3203 -118 2228 4241 3385 1781 -810 -3659 -3245 -2921 269 2418
1895B418J049j09k187k861j810pJ151K658K002J224j07k591j168l047o24J475
$$ 2418 3467 3358 1171 -1690 -3500 -3507 -2356 302 2304 3528 3421 830 -338 -3385 -4009 -2534
1911b534L008K244M46M5k565k277j866J49J364K511J479J724j392j299k499j943
$$ -2534 474 2718 3164 3209 644 -1633 -3499 -3350 -1986 525 2004 3728 2336 1037 -1462 -3405
1927c405P48J78L305K103N27r82j721k272k069M96J338K597J756P12r02j710k653
$$ -3405 -2657 -2479 826 2929 3456 2474 753 -1519 -3588 -3092 -1754 843 2599 3311 2409 699 -1954
1944a954j535P73J675J765J208J205r79k184j584j516m27K712K055J807m07j003
$$ -1954 -3489 -2716 -1041 724 1932 3137 2158 -26 -1610 -3126 -3553 -841 1214 3021 2614 1611
1960A611j914j817j138Q22J179K154J811L65j657j719j935j066P33K201J951J559
$$ 1611 -303 -2120 -3258 -2436 -1257 897 2708 3073 1416 -303 -2238 -3304 -2571 -370 1581 3140
1976C140m7j626j855j825q19M43K638J623Q76M08j222k309j577j064J088K329
$$ 3140 3093 1467 -388 -2213 -3032 -2589 49 1672 2548 2956 1734 -575 -2152 -3216 -2128 201
1992B01J553J258m34j609j880j711k21N73K024K949J82l09j419j729k425K05R61
$$ 201 1754 3012 2578 969 -911 -2622 -2843 -2270 -246 2703 2885 2576 1157 -572 -2997 -2792 -1831
2009a831J620K419L88k34j792j316k292l29J209K159J926P39m96j679k079j124
$$ -1831 -211 2208 2596 2362 570 -746 -3038 -3367 -2158 1 1927 2666 2170 491 -1588 -2712
2025b712L47J338J544J852M54q61j648j684j362J58J667Q68K006J207o97k369
$$ -2712 -2365 -1027 517 2369 2823 1962 314 -1370 -2732 -2574 -907 -39 1967 3174 2477 108
2041A08j385j179p1J315J939J151Q65j031j743j325q69R5N58J450J689P87n51
$$ 108 -1277 -2456 -2527 -1212 727 1878 2743 1712 -31 -1356 -2225 -2130 -1572 -122 1567 2354 1803
2058A803j421j949o57N4J309J867J508m37o64j216k556M04m67J372K147J088j82
$$ 1803 382 -1567 -2224 -2170 -861 1006 2514 2077 1413 197 -2359 -1955 -2422 -1050 1097 2185 2003
2075B003l29j900j980o44J169R66J890P32M00j176j538j725p29J395J310J456
$$ 2003 1674 -226 -2206 -2850 -1681 -715 1175 1907 2307 1131 -407 -2132 -2861 -1466 -156 1300
2091A300J281k07k272n39j715K81M95J595J030J237q74j059r61j825p72J247J904
$$ 1300 2581 2374 102 -437 -2152 -1871 -1376 219 1249 2486 1612 553 -408 -2233 -3005 -1758 146
2108A46J276R79n93j266p49j626l67Q47J468J566N30k5j276j680j440P20L02J768
$$ 146 1422 2401 1808 542 -207 -1833 -2200 -1353 115 1681 2211 2186 910 -770 -2210 -1490 -1188 580
2126E80R97L24k05j378j635m67Q3L65K419L94L82k7j666j038r91K05R42J374J782
$$ 580 1577 1901 1696 318 -1317 -1784 -1701 -1336 1083 1477 1859 1832 166 -872 -1863 -1658 -716 658 2440
2145B440Lj045j520r52j348O94J275N12J604K36q36l44j959q22J008L57J188J359
$$ 2440 2443 1398 -122 -1074 -2422 -1728 -453 59 1663 1899 1063 719 -1240 -2062 -1054 -697 491 1850
2163A850N66p82j889j020o10N70J043Q22J192J36j071j560r64o91L53J621J731
$$ 1850 2416 1634 -255 -1275 -1885 -1315 -272 550 1742 1878 807 -753 -1717 -2408 -2055 -434 1297
2180A297M02r3m03j799j082o77N45J290R71J134M02p77j473r56m57o2J592J744
$$ 1297 1699 1606 1203 -596 -1678 -2355 -1810 -520 451 1585 1987 1210 -263 -1219 -1676 -1738 -146 1598
2198A598q4L06q26j563q16m65N92Q08J941K39o03o86j405m85Q4K35J093J228J24
$$ 1598 1514 1820 994 -569 -1385 -1850 -1258 -450 1491 1730 1127 441 -964 -1449 -1365 -1130 -37 1191 1315
2217A315N17r20j781p71J87M26J156J881j33k03j504r34q14J13L19J228J470j36
$$ 1315 1832 912 -869 -1640 -1453 -1027 129 2010 1877 1674 170 -764 -1578 -1465 -1146 82 1552 1416
2235A416j04j173j148n95N11J01J625J133n95J13r85j044j465O33J376P59Q16
$$ 1416 1312 139 -1009 -1604 -1093 -992 633 1766 1171 1284 299 -745 -2210 -1577 -201 558 1374
2252A374K29q07p56r34m96p3N22J370Q00L84m84j137q57p25Q59RQ79J426k82m05
$$ 1374 1603 796 40 -894 -1390 -1463 -941 429 1229 1613 1129 -8 -865 -1590 -731 -722 157 1583 1301 896
2272H96r95j083o88O11R31J278N56J70m41j400j263J2L63Q09J603J26k04m39j468
$$ 896 -99 -1182 -1870 -1259 -328 950 1506 1676 1235 -165 -1428 -1416 -1053 -244 1359 1485 1281 842 -626
2291f26q4o83K57J047P11J213n83n76j207j366M45M20R57J424J85k77p28j140
$$ -626 -710 -1393 -1136 -89 622 1835 1252 676 -531 -1897 -1452 -1032 -75 1349 1534 1257 529 -611
2309f11p25r25J273J546n5J424j034k1j592o72O1K32J654l7J166k18j511m47p52
$$ -611 -1336 -2261 -988 558 503 1927 893 872 -720 -1392 -1331 -1099 555 518 1684 1466 -45 -492 -1244
2328a244r21J673R04P65R1l69q12j041Q1k30L7J203Q09J8k82m71j054q71M56J63
$$ -1244 -2165 -492 412 1177 1268 899 87 -954 -873 -1103 -1066 137 946 964 682 211 -843 -1714 -1258 -1095
2348a095J704N21J05m22j118o17n61P3O18J001J342j33n14q24j129k11J79J071
$$ -1095 609 1130 1235 813 -305 -922 -1483 -1410 -792 209 1551 1418 904 80 -1049 -1260 -1081 -10
2366a0Q12Q28J04j341j060j300M54L09L34J296R45k84j99j305R0q93M7L02J908
$$ -10 802 1630 1734 393 -667 -1967 -1513 -1204 -870 426 1371 1087 888 -417 -327 -1220 -1173 -871 1037
2385A037M63m32l60j310n59M33k44P23Q63M77L04j383n09o00p64J196M87J288
$$ 1037 1500 1068 708 -602 -1161 -728 -972 -249 614 1091 1395 12 -497 -1097 -1861 -665 -178 1110
2403A110J59k78p51q66p77L63j30P62Q86Q73k0j734O53o28q08M76O94O69L74o3
$$ 1110 1269 991 240 -626 -1403 -1040 -1170 -408 478 1351 1331 -403 250 -378 -1186 -710 -16 653 1027 964
2423I64p49o22p26p00P07J602N51L2J23j283j382N9K06J049O04J83J59p8n88r24
$$ 964 215 -407 -1133 -1833 -1126 476 1027 1059 1182 -101 -1483 -1424 -1218 -169 435 618 777 699 111 -813
2443h13l94n77J705L84P03M45o87p96p97NQN13K82J497j19k38r07j057o93Q36
$$ -813 -1207 -1784 -79 305 1008 1453 766 -30 -827 -822 -814 -301 -19 1478 1359 1121 214 -843 -1536 -700
2463g00J4J085Q71j29o31p15p19k65K32Q47N61N36K36j096m23j99n42N3M94O12
$$ -700 -686 399 1270 1141 510 -205 -924 -1189 -957 -110 451 987 1223 127 -296 -495 -1037 -984 -490 122
2483A22Q17J08n38q08p26l78J3J526k30Q14K03l42m94j070K39J80J118o9Q89j026
$$ 122 939 1047 509 -299 -1025 -1403 -1390 136 -94 720 923 581 87 -983 -744 -564 554 485 1374 348
2503C48J16j404k38M62K2O21J278n59L15j434j61m86L59L47M14R54j63J56n70
$$ 348 464 -940 -1178 -716 -694 -73 1205 646 961 -473 -634 -1120 -761 -414 0 954 791 947 377
2522C77o59m40k83K76J402l39L12P88j400o33J56l89L08N76J302j008J36j84j191
$$ 377 -282 -722 -1005 -729 673 334 646 1434 34 -599 -443 -832 -524 52 1354 346 482 298 -893
2541h93K59j51L24J057K24L83k50j674O70j005L50M09R07J39M34q34r9q10m75
$$ -893 -634 -785 -461 596 820 1203 953 -721 -51 -1056 -706 -297 610 749 1183 349 250 -560 -1035
2560a035j10j78J610P26L7k03o22j025k05M27j14J570k86N05q28p57n12n4M98
$$ -1035 -1145 -1323 287 1013 1050 847 225 -800 -1005 -578 -692 878 592 1097 269 -488 -1000 -1054 -556
2579e56K22J067RP02r86n59o20K65N36P4O54n29P54J45j009j629R78j72P3J159
$$ -556 -334 733 742 1444 458 -101 -721 -456 80 154 808 279 1033 1178 169 -1460 -482 -654 -581 578
2599E78P1k21L11n15j326M30k25R65q4O15L25l92j424k25K26P46K32P31M58n13
$$ 578 649 428 739 224 -1102 -672 -897 68 -16 599 924 532 -892 -1117 -891 -145 87 818 1276 763
2619G63q73p3m41J7q0J117l50R51j96r41l4q49M32L73k13J072M08j05r74l75k32
$$ 763 -110 -183 -624 -607 -687 430 80 1031 835 -106 -140 -989 -557 -184 -397 675 1083 978 4 -371 -603
2640f03OP5P2J301j58n4l98l70p76j79O03J69Q84M03l93J77j424j66K77L32J38
$$ -603 -597 -522 -450 851 693 639 241 -129 -905 -1084 -481 -312 572 975 582 759 -665 -831 -554 -222 -84
2661h4J024j46n59m43q5l70K7O21R16r85K76L21r18r1k48Q14l17O58L44K33j015
$$ -84 940 794 235 -208 -293 -663 -636 -15 901 -84 192 513 -405 -496 -744 70 -247 411 755 988 -27
2682b7N7q61J88J28q3L73R54j89n01j01J37j589Q12R80k49N18Q8j163k21j97L17
$$ -27 30 -831 -643 -515 -598 -225 729 540 39 -62 75 -1514 -702 278 29 547 635 -528 -749 -946 -629
2703f29K04M33K41L10K17l58p62J16m30N99P5Q73j72P8j000k13j5k37Q02M25K22
$$ -629 -425 8 249 559 776 418 -344 -228 -658 -59 16 889 717 795 -205 -418 -433 -670 132 557 779
2724G79j65k64k76m77o4j59L68M04l79R13n50l12Q7l35M2K9K79O37M60q54k86
$$ 779 614 350 74 -403 -467 -626 -258 146 -233 680 130 -182 -95 -430 -388 -359 -80 557 1017 163 -123
2745a23k76n53N32J59N6J058k27K3n23o09N50m12OK57Q19m28J33r87n05K15K02
$$ -123 -399 -952 -420 -261 -205 853 626 649 126 -483 67 -345 -339 -82 737 309 442 -545 -1050 -835 -633
2766f33J071n41Q85n43R08j316L50q47Q20n1O4O95m68mj171N78m81j72J50R65
$$ -633 438 -103 782 239 1147 -169 181 -666 154 103 167 862 394 390 -781 -203 -684 -856 -706 259
2786B59L39N30j101J81m14k52L38l57Q91j67M45m32N95j345n60L88N43O33R3l43
$$ 259 598 1128 27 208 -206 -458 -120 -477 414 247 692 260 855 -490 -1050 -662 -119 514 607 264
2806B64k77n3k66j05k22M74J74Q92m28R3p34j57N03j77k78R17k14k44J27o08p68
$$ 264 -13 -66 -332 -437 -659 -185 -11 881 453 546 -188 -345 158 -19 -297 620 406 162 289 -319 -1087
2827a087O44L39J98O13R6k84j93j178N11M9q93Q64l34R20n9R1r76J23L15K01M61
$$ -1087 -443 -104 94 707 803 519 326 -852 -341 -292 -1185 -321 -655 265 206 297 -679 -556 -241 -40 421
2848D21m80P79n62j9n67m17K33O05N61mj37l75L67j87p58m47O85J45N06r6n08
$$ 421 -59 720 158 139 -428 -845 -612 -7 554 550 413 38 405 218 -540 -987 -302 -157 349 253 -255
2869b55K69p5l58q67J014J01N71J07o56M1j34m26O24K26l05M90K58n99m31M42
$$ -255 14 -61 -419 -1286 -272 -171 400 507 -149 -108 -242 -668 -44 182 -123 367 625 26 -405 37
2889C7K49r67O38R68k50q9k83o28M58p03N33m23Q21k15K26m28n01N57q0o36R34
$$ 37 286 -681 -43 925 675 586 303 -325 133 -570 -37 -460 361 146 372 -56 -557 0 -80 -716 218
2910B18L86K41m7j057j72n84Q70j64Q6M47J98j66L21o14k90J29K63j98R2M87k32
$$ 218 604 845 798 -259 -431 -1015 -145 -309 -223 224 422 256 577 -37 -327 -198 65 -133 -41 446 214
2931B14J69r50J65m29P08j98O5N64K70n1r02n99M28P94l57K40q5L90n83J02n03
$$ 214 383 -567 -402 -831 -123 -321 -256 308 578 527 -375 -974 -546 248 -109 131 46 436 -147 -45 -548
2952e48K51J20N62J77l2r84L53L22r02J72M78j96Q31J13o43k60l44J93k40N94
$$ -548 -297 -177 385 562 530 -454 -101 221 -681 -509 -31 -227 604 717 74 -186 -530 -337 -577 17
2972A7p8J40L33o98K13j76m03J63O97l87O88k58j22l6n15n18R21L33j60M75l4
$$ 17 -61 79 412 -286 -73 -249 -652 -489 208 -179 509 251 129 93 -422 -940 -19 314 154 629 595
2993E95K58j154pl70M1J99J245p19J68q00j29J28l07J061m75J026l65k08J55q05
$$ 595 853 -301 -308 -678 -637 -438 807 88 256 -544 -673 -545 -852 209 -266 760 395 187 342 -463
3013d63K35K5J59k08P83l30l10N6J05n00L09p2M10N2K61k64N9p90j30Q51n01N76
$$ -463 -228 -203 -44 -252 531 201 -109 -53 52 -448 -139 -211 199 251 512 248 307 -483 -613 238 -263 313
3035C13K62j39K87o76k67o23p6Q71K62k21M48j210R69k82m37Q77n84K6j16N49
$$ 313 575 436 723 47 -220 -843 -919 -48 214 -7 441 -769 200 -82 -519 358 -226 -200 -316 233
3055B33j36j18m71o5J1J87N85K50%l58n39R2K50K21n49J22Q46l26k8q8k74l02
$$ 233 97 -21 -492 -557 -546 -359 226 476 476 118 -421 -329 -79 142 -407 -285 561 235 207 119 -155 -457
3077d57Q06J99r40K25L69m83L91q79L43J56M42j05M56K55n75l97k37l63P30K07
$$ -457 349 548 -392 -167 202 -281 110 -769 -426 -270 172 67 523 778 203 -194 -431 -794 -64 143
3097A43M25l26N2l26n73l38J171p2p8K74m68Q60n29J34r92J191p99K22L48j26
$$ 143 568 242 294 -32 -605 -943 228 156 78 352 -116 744 215 349 -643 548 -251 -29 319 193
3117A93N9m61J69Qk44o47J444m86J52r6n03k85Q0n2N87k09O93J64m89o1L74j27
$$ 193 252 -209 -40 -32 -276 -923 521 35 187 91 -412 -697 -617 -669 -82 -291 402 566 77 16 390 263
3139B63j96j01k34K54M26j11N3o45O2q0J54k7J77N8P55M5j364L27j13Q25j63N6
$$ 263 67 -34 -268 -14 412 301 354 -291 -229 -309 -155 -182 -5 53 808 853 -511 -184 -297 528 365 421
3161D21L34o22k30M24n47o3M22O7K76k43j40p65Pk77L85J43N06K98K59n29k43
$$ 421 755 133 -97 327 -220 -283 139 206 482 239 99 -666 -659 -936 -551 -408 98 396 655 126 -117
3182a17n65j4N29P4L13K47n55L38m8n60l00K91L41K23n99J069l96l27j08m5K22
$$ -117 -682 -696 -167 -93 220 467 -88 250 202 -358 -658 -367 -26 197 -402 667 271 -56 -164 -209 13
3203A3p7K78l0k08l23L93k66O54l83J71J54m15K54n77j58Q24j81K79l91N16o37
$$ 13 -64 214 184 -24 -347 46 -220 434 51 222 376 -39 215 -362 -520 304 123 402 11 527 -110
3224a10j3L91J77o10k08jL55l85Q50m19N59j167Q46k52j36N14rj66L1j15j57L9
$$ -110 -123 268 445 -165 -373 -374 -19 -404 446 27 586 -581 265 13 -123 391 382 216 247 132 -25 14
3246A4J30n80P06J41o18K91L71k68j35o81M71p1J058p06j58L7j78J27k37P2K16
$$ 14 144 -436 270 411 -207 84 455 187 52 -629 -158 -229 829 123 -35 2 -176 -49 -286 -214 2
3267BO75q2n09j92j45j67N44n74K35K87n9l53J86n0L01k05M89j23K68l73n62M46
$$ 2 677 595 86 -106 -251 -418 126 -448 -213 74 15 -338 -152 -202 99 -106 383 260 528 155 -407 39
3289C9k10Q91j047J32K30p70J531r89L5k83J19N10q02Q25J02j90l55l49N14L4
$$ 39 -171 720 -327 -195 35 -735 796 -193 -158 -441 -322 188 -614 211 313 123 -232 -581 -67 -33
3309c3kJ75p34L98J06j5M89n88q0K49M14J62J00m12K56j48o47P5l4K73O2l70P73
$$ -33 -35 140 -594 -196 -90 -105 384 -204 -284 -35 379 541 641 229 485 337 -310 -235 -269 4 66 -304 469
3332D69q0Nn93K98k64K78L5J36n91nj90K75J20J18J87m59R4K73j82j19j96J26
$$ 469 389 394 -199 99 -165 113 148 284 -307 -312 -502 -227 -107 11 198 -261 -167 106 -76 -195 -391 -265
3354b65L64L50J3K84k13l56n48j11M64J34K6K96l76J57j90l02K1M44m1k73L41
$$ -265 99 449 462 746 533 177 -371 -482 -18 116 142 438 62 219 29 -273 -252 192 151 -122 219
3375B19n04L26L19r55P56n53K35L21n46K65L88o12M70j20q7J5k3k9O7l77L92o54
$$ 219 -285 41 360 -595 161 -392 -157 164 -382 -117 271 -341 129 9 -78 -63 -86 -115 -48 -425 -33 -687
3397f87N07L05k41K41j26M01n23j27l8J95K55j44j40l86Q20l45k7N74k28m25P11
$$ -687 -180 125 -116 125 -1 400 -123 -250 -288 -93 162 18 -122 -508 312 -33 -60 514 286 -139 572
3418E72p75O19j10l63O39r08M9L19L51K22q11P3n78K84J7K39QJ06L39j21j84m3
$$ 572 -203 416 306 -57 582 -326 -277 42 393 615 -196 -123 -701 -417 -400 -161 -153 -47 292 171 -13 -56
3440e6K78Po01M11J64l1k38K1l98R6j67L07P39m25Oj90k44J86n76O52j62k90O85
$$ -56 222 229 -372 39 203 172 -66 -45 -443 -347 -514 -207 532 107 113 -77 -321 -135 -711 -59 -221 -511 174
3463A74n2J56J35%r69K13O71o04P19m82J18J67q43M08K6M1L19Qm0l99j60K67L64
$$ 174 122 278 413 413 -556 -343 328 -276 443 -39 79 246 -597 -189 -163 -122 197 205 165 -234 -394 -127 237
3486B37m56K33L67P6l79j65L29o25L8M11M92l85j96R9Q8K37n58J15M24r55K52
$$ 237 -219 14 381 457 78 -87 242 -383 -345 66 558 173 -23 76 164 401 -157 -42 382 -573 -321
3507c21R94m11L9n34J65k12O96l49k7N42n41K34l25L80l78r3J96J83j72j18Q10
$$ -321 673 262 301 -233 -68 -280 416 67 40 582 41 275 -50 330 -48 -141 55 238 66 -52 758
3528G58o13o1k22k6j40M31M24m68J67l75l62L66R2m15P38p47M44L48o26p8n6K61
$$ 758 145 84 -138 -164 -304 127 551 83 250 -125 -487 -121 -29 -444 294 -453 -9 339 -287 -365 -421 -160
3550a60N72j368J203n32j34L95l01K4K85n00O44M7j9k66j15J98M8K00m66O28l67
$$ -160 412 -956 247 -285 -419 -24 -325 -301 -16 -516 128 175 156 -110 -225 -27 21 221 -245 383 16
3571A6K27j09p61O50k75m65J186k9j59j87J86p31O92k05j55J32l14L64n4j9l18
$$ 16 243 134 -627 23 -252 -717 469 440 281 94 280 -451 241 36 -119 13 -301 63 9 -10 -328
3592c28R86p09J40l08K46j42K59K91j5o60k8O55k49l59P7j67k4L48l27L22k04
$$ -328 658 -51 89 -219 27 -115 144 435 420 -240 -268 387 138 -221 -144 -311 -335 13 -314 8 -196
3613a96O01n90NM09m88J85J82j93L06j60J32j86j37M44R3l7N0k14J63m47L40N60
$$ -196 405 -185 -180 229 -259 -74 108 -85 221 61 193 7 -130 314 407 370 420 206 369 -78 262 822
3635H22r16j37N9k29P92r8L17o27m44R04j47k21K34O5j51L35n37n7K3m13k74O82
$$ 822 -94 -231 -172 -401 391 293 610 -17 -461 443 296 75 309 374 223 558 21 -36 -13 -426 -700 -18
3657a8l06j93J29N76K23j334P47j80K90J40k01J29n0N22j00m30k48P70k20p60
$$ -18 -324 -517 -388 188 411 -923 -176 -356 -66 74 -127 2 -48 474 374 -56 -304 466 246 -514
3677e14N00L13m32J15J29O92p82j50M04q15R10o88M2O3j13M13K98J75n07m93N38
$$ -514 -14 299 -133 -18 111 803 21 -129 275 -540 370 -318 -276 -213 -326 87 385 560 53 -440 98
3698I8J44l87K51o26O62K04j70o2k65j88L38j86J101n97J20l56k4l66l10L36l55
$$ 98 242 -145 106 -520 142 346 176 114 -151 -339 -1 -187 914 317 437 81 57 -309 -619 -283 -638
3719f38N12L15m60k37N95J39N58j116L37j62N28j96L90q46P89R7m56m07M37P6
$$ -638 -126 189 -271 -508 87 226 784 -332 5 -157 371 175 565 -281 508 605 149 -258 179 255
3739B55l36j89M58l45p90J239j90N4o42P22l13J13m6K92J3l52J13J26M93j44o29
$$ 255 -81 -270 188 -157 -947 292 102 156 -486 236 -77 36 -10 282 295 -57 56 182 675 531 -98
3760i8J24kl09O47o08j88L17p12R02m78P57n97n9K20M50l99K2R0K4J98j82R1j13
$$ -98 26 24 -285 362 -246 -434 -117 -829 73 -405 352 -245 -304 -84 366 -33 -11 79 103 301 119 210 97
3783I7K9m71O65k95q3j5q5K63Q9m24K72k0j70p3L3N2L47k43P1M48m51J28L74o61
$$ 97 126 -345 320 25 -58 -73 -158 105 194 -230 42 22 -148 -221 -188 -136 211 -32 39 487 36 164 538 -123
3807a23j15P10P7l96l93M86p78M72o03Q37k90k71N25J71j85p08M77P95n69l5O25
$$ -123 -238 472 549 153 -240 246 -532 -60 -663 174 -116 -387 138 309 124 -584 -107 688 119 84 709
3828G09o86L62k19J37n59J25m93P86K04m6J1K3k92m48N04k28N81j42j6q5j54k10
$$ 709 23 385 166 303 -256 -131 -624 162 366 320 331 354 62 -386 118 -110 471 329 313 228 74 -136
3850a36M6O01r20P55n20O84m62k44K14k86M84P8m35N8j96P9j04K6K15l19M61N4
$$ -136 -90 511 -409 346 -174 510 48 -196 18 -268 216 294 -141 -83 -279 -200 -304 -278 -63 -382 79 133
3872A33L74l00J15j32q7m57j30K92J13L22Q6j11q66N36n60P40j02O8N21j057k0
$$ 133 507 207 322 190 103 -354 -484 -192 -79 243 329 218 -648 -112 -672 68 -34 34 555 -502 -522
3893e22N95o50L08O12l88J5J19P2k01L9M89o13L64k70l73l38J060O7p98k90p1
$$ -522 73 -577 -269 343 -45 -30 89 161 -40 -1 488 -125 239 -31 -404 -742 318 385 -413 -703 -774
3914g74N23L41j27k47L45j71M43p54L27L46k90K6k38J50n01L44L12J57m84L51
$$ -774 -251 90 -37 -284 61 -110 333 -421 -94 252 -38 -12 -250 -100 -601 -257 55 212 -272 79
3934G9N99l98J05o23M32k44K26o47Q32q9L36m08l44M49n87K80N46n41L21K7k61
$$ 79 678 280 385 -238 194 -50 176 -471 361 272 608 200 -144 305 -282 -2 544 3 324 351 90
3955I0L2J01J49p85k89O93N51n47J40l35J69m30J86J97j26R0J62k15L50p02J44
$$ 90 122 223 372 -413 -702 -9 542 -5 135 -200 -31 -461 -275 -78 -204 -114 48 -167 183 -519 -375
3976c75K46L49M05p73M42l96m38J22N30m9k93L19m18Q8M81M01r13J96n42R34O4
$$ -375 -129 220 625 -148 294 -102 -540 -418 112 63 -230 89 -329 -241 240 641 -272 -76 -618 316 380
3997C80P2k70n9O3L62q01j27O43m13o01P72j02q87P09k22K59J85k90M35q4K50
$$ 380 452 182 123 186 548 -253 -380 263 -150 -751 21 -81 -968 -259 -481 -222 -37 -327 108 24 274
4018B74j54l91N4R94q00M51p81N76k50q4L83m71q0L65K62r97O18j0k05L29j2k56
$$ 274 120 -271 -217 777 -23 428 -353 223 -27 -111 272 -199 -279 86 348 -649 -31 -41 -246 83 71 -185
4040a85K02L95l06K69j44j15J18p17Q73r13M25P2J26o8R1l43M78m40P74j36m42
$$ -185 17 412 106 375 231 116 234 -483 390 -523 -98 -26 100 32 123 -220 258 -182 592 456 14
4061A4K53m85J24M7l1r7O81p83L50m40N54J87n04K47j31j61j6J93k75j63P40m42
$$ 14 267 -218 -94 -47 -78 -175 506 -277 73 -367 187 374 -130 117 -14 -175 -191 2 -273 -436 304 -138
4083a38O1M34n57L45J22k11o4m1k05M19j61l97M00p3J07m48M27l2Q0k31N7J63
$$ -138 -77 357 -200 145 267 56 -8 -49 -254 165 4 -393 7 -66 41 -407 20 -12 68 -163 -106 57
4105E7k0m36O55k55J82L11j35J22p32J17J00J64j9j34r9j3L49L11p17J91J39p9
$$ 57 37 -399 256 1 183 494 359 481 -251 -134 -34 130 111 -23 -122 -135 214 525 -192 -1 138 59
4127E9q3J82j91M61R8n13L88l4m93M16m1o29P33P9j92l43l32n0M04K58J68L16
$$ 59 -24 158 -33 428 526 13 401 367 -126 290 249 -380 353 432 240 -103 -435 -485 -81 177 345 661
4149F61q08L86k25KM44p51R97q13R9J07Lk24M20l73J4P3l14q9L80L16j02m10l91
$$ 661 -147 239 14 16 460 -291 706 -107 -8 99 102 -122 298 -75 -61 12 -302 -391 -11 305 203 -207 -598
4172e98J005j51l44l55Q06m04L60k85j07j76P42n20L0L60n15j54J81J09K83k83
$$ -598 407 256 -88 -443 363 -41 319 34 -73 -249 493 -27 3 363 -152 -306 -125 -16 267 -16
4192a6o8J16m77L50j98M05k1Mk23O71m75J23n62P50K56j249R81j76m14p92O81
$$ -16 -84 32 -445 -95 -293 112 91 95 -128 543 68 191 -371 379 635 -614 367 191 -223 -1015 -334
4213c34L16n91M64M11N4m20r4l54M69J15o52O65J27M8m96J55r3K89m50M66m16
$$ -334 -18 -609 -145 266 320 -100 -194 -548 -79 36 -616 49 176 224 -272 -117 -210 79 -371 95 -321
4234c21J59L16J79m45K70J83m78j95M29l35L71l03N81m71j41P48k81j74j65Qj04
$$ -321 -162 154 333 -112 158 341 -137 -332 97 -238 133 -170 411 -60 -201 547 266 92 -73 -65 -169
4255a69L86J10m04j17K09k23O27j51m19J0j96J36l64M26l75M61J99n7l38M29j16
$$ -169 217 327 -77 -194 15 -208 419 268 -151 -141 -337 -201 -565 -139 -514 -53 146 89 -249 180 64
4276F4k18L2K14l23L07Q2n18Q28p32l70K20l16N77K24j84K33L32m6o14j67M75
$$ 64 -154 -122 92 -231 76 158 -360 468 -264 -634 -414 -730 -153 71 -113 120 452 406 -208 -375 100
4297A00p54J040j93j7j23j51k41K79K90j84K10j55J87o87R8k22K18r7L69N50o36
$$ 100 -654 386 193 176 53 -98 -339 -60 230 46 256 101 288 -399 -301 -523 -305 -402 -33 517 -119
4318a19P0N60o25M26j220J238n59J92M43o84j3J95M07k55r8m48P55O8m8l97j6
$$ -119 -49 511 -114 312 -908 330 -229 -37 406 -278 -291 -96 311 56 -42 -490 265 333 285 -112 -128
4339a28j68O38m51J64o28L54r8L2o9k02J81r3J049p46M29l71K05k5j78N2J87j88
$$ -128 -296 342 -109 55 -573 -219 -317 -285 -354 -556 -375 -468 581 -165 264 -107 98 73 -105 -53 134 -54
4361e4M42r68M92l47J65L8P43m69k44K41M63l27J61J56m14q2j96M01M3L36k75
$$ -54 388 -580 -88 -435 -270 -232 511 42 -202 39 502 175 336 492 78 -4 -200 201 244 580 305
4382C05n78P00q46R37j12k0n38j05M51J90o39j93J68j24O94k08j99N57q42M86
$$ 305 -273 427 -419 518 406 386 -152 -257 194 384 -255 -448 -280 -404 290 82 -117 440 -402 84
4402H4l75M53j02J65o01P5K0K94K7k08J10KL3L9n54N73K03l44M56k64K46n09N08
$$ 84 -291 162 60 225 -376 -301 -281 13 40 -168 -58 -56 -23 16 -538 35 238 -106 350 86 332 -177 331
4425C31l79j05q9J150j182L19K8N65o55k47K93j50J69j78k58L76k37l9J037n35
$$ 331 -48 -153 -242 908 -274 45 73 638 -17 -264 29 -121 48 -130 -388 -12 -249 -288 749 214
4445B14l55k1J56k05M98m63M0Qq5Q03o46j36K07p69J313m23K10l48K1l43M39j70
$$ 214 -141 -162 -6 -211 287 -176 -136 -128 -213 590 -56 -192 15 -754 559 136 346 -2 19 -324 115 -55
4467e5mk11J38K87k10j61J00M28r8l4l92J91l8l90N83k02m5k80l05Q53p27K33
$$ -55 -59 -270 -132 155 -55 -216 -116 312 214 180 -212 -21 -59 -449 134 -68 -113 -393 -698 155 -572 -339
4489c39O32L22j081j44O15n33P74L44n70k42k04K15L53M46l10k01j11n11K97K50
$$ -339 293 615 -466 -610 5 -528 246 590 20 -222 -426 -211 142 588 278 77 -34 -545 -248 2
4509Bl36J62qR8M52j83r0L14J63n88k83P84n41L70o14J68K04K85O8j74m56P29
$$ 2 -334 -172 -180 -82 370 187 97 411 574 -14 -297 487 -54 316 -298 -130 74 359 427 253 -203 526
4531E26n55L75m01M84r4j96n77P89J57n89P1m12M48l48j60K36MM26N0l28O42m32
$$ 526 -29 346 -55 429 335 139 -438 351 508 -81 -10 -422 26 -322 -482 -246 -242 184 234 -94 548 116
4553A16j30L94l47L40k25L91n35j55n8P15r63K84K94m29P29r22o8N77K51j91j11
$$ 116 -14 380 33 373 148 539 4 -151 -209 506 -457 -173 121 -308 421 -501 -569 8 259 68 -43
4574d3O5N98p35K26o7m99N08j81K40J15j16j41k89m65R54m25k73O88K1L32o80
$$ -43 22 620 -115 111 44 -455 53 -128 112 227 111 -30 -319 -784 170 -255 -528 160 181 513 -167
4595a67m03N55l35P64j32l59P31p40M06k64j20K36q3j79l72L45j40N43k30j45
$$ -167 -570 -15 -350 414 282 -77 654 -86 320 56 -64 172 89 -90 -462 -117 -257 286 56 -89
4615h9o74Q11n51K78M63K68K02j320O60J34q7r23J104j52Q07r87k94NK70L69m95
$$ -89 -763 48 -503 -225 238 506 708 -612 48 182 95 -828 276 124 931 -56 -350 -345 -75 294 -201
4636b01J68K0k6Pm6l46k20M43O44o24K07j29O99n56n8J04q89M05K21K20o89O6
$$ -201 -33 -13 -39 -32 -78 -424 -644 -201 443 -181 26 -103 596 40 -18 86 -803 -398 -177 43 -646 -580
4658e80K13K90k59J24O36q14K96O26n73k02j15P09q36M24J71o34M46JQ1l50O76
$$ -580 -367 -77 -336 -212 424 -390 -94 532 -41 -243 -358 351 -485 -61 110 -524 -78 -77 4 -346 330
4679C30q3l62L36k15K00N56o79l20J86J60J43o68L53n78Q67j95m72J35N33k32
$$ 330 247 -115 221 6 206 762 83 -237 -51 109 252 -416 -63 -641 226 31 -441 -306 227 -5
4699eL50l04n3l20M76N3k95M38J17l29l07m74O79j2M77l78n67P73r3k72M61j59
$$ -5 345 41 -12 -332 144 197 -98 340 457 128 -179 -653 26 14 491 113 -454 319 226 -46 415 256
4721B56m27K97R0j69l82O96J13oj050O87j57n98J548o78m1M55k63J0k22k79l5
$$ 256 -171 126 216 47 -335 361 474 468 -582 105 -52 -650 898 220 179 634 371 381 159 -120 -155
4742a55k8j00O9n1M3oM24J12j33m9l18L03n04L32J46L27K41p98L13o50J8N46P0
$$ -155 -183 -283 -214 -265 -222 -228 196 308 175 126 -192 111 -393 -61 85 412 653 -145 168 -482 -464 82 152
4765A52n80R6M73o43J92P15o15R19o70q5J10N5q4k96N54J14p51R21l34o35N24
$$ 152 -428 -332 141 -502 -310 405 -210 709 39 -46 64 119 35 -261 293 407 -344 577 243 -392 132
4786A32m89Q31k62m38k84N39L22l40L03k65l3J56n59M21K86K22k38m87K82pP42
$$ 132 -357 474 212 -226 -510 29 351 11 314 49 16 172 -387 34 320 542 304 -183 99 92 834
4807H34p20J12l61L02J44n71r0R04m23q5k59L10m14J22l7J36M4M0J0l4o6N74j23
$$ 834 114 226 -135 167 311 -260 -350 554 131 46 -213 97 -317 -195 -232 -96 -52 -12 -2 -36 -102 472 349
4830C49k1l15k09M95J49k56k92l6j17Q1N74j08k9K49n72J0mj4K66n81N65j33L74
$$ 349 328 13 -196 299 448 192 -100 -136 -253 -172 402 294 265 514 -58 -48 -52 -66 200 -381 184 51 425
4853D25l73j90N16q42O11j42q01P19j46O78n21m40N12j14k52l80K54P9J010m74
$$ 425 52 -138 378 -464 147 5 -796 -77 -223 455 -66 -506 6 -108 -360 -740 -486 -407 603 129
4873A29k61N27m05J49j1k57J21O2p36L09K42N42k24J85p64L73o9P66j095O02l93
$$ 129 -132 395 -10 139 128 -129 -8 54 -682 -373 -131 411 187 372 -392 -19 -88 678 -417 185 -208
4894b08N58r92o4O81m92N26l7N84o05J90L55J07q42M2M32p27P17n59L75l3m17
$$ -208 350 -642 -706 -25 -517 9 -28 556 -49 141 496 603 -239 -197 235 -492 225 -334 41 8 -409
4915d09L98J48m47L3NM99K31m93l75J02M65J09p41K94K13M50j53r1L21n3o01j72
$$ -409 -11 137 -310 -277 -272 227 458 -35 -410 -308 157 266 -475 -181 32 482 329 238 559 506 -95 -267
4937b67j26N89L5K60q08K33N7k13m77O52j70K42n4l00K28l17M89J21m73J88m5
$$ -267 -393 196 231 491 -317 -84 -27 -240 -717 -65 -235 7 -47 -347 -119 -436 53 174 -299 -111 -156
4958a56K93k64l23M18l12J03j04N65k85k04K60M04j069Q84n15J48K15q0J6Q3n29
$$ -156 137 -127 -450 -32 -344 -241 -345 220 -65 -269 -9 395 -674 210 -305 -157 58 -22 -6 77 -452
4979d52L76m2Kk41M40j92L42p06O82q61J056on54P25p04j13N46k55k65N29o31
$$ -452 -76 -118 -116 -357 83 -109 233 -473 209 -652 404 398 -156 569 -135 -248 298 43 -222 307 -324
5000c24M5N5O85j050O98k37K68J7m87M24l17P95o62Q5L31m57M75k30Q8j63M0k95
$$ -324 -279 -224 461 -589 109 -128 140 157 -330 94 -223 572 -90 -5 326 -131 344 114 202 39 79 -216
5022b16L29k37M92P4p00K13k94P21m95M72k58j67q0n45J033J42r9n07J26J01L81
$$ -216 113 -124 368 442 -258 -45 -339 382 -113 359 101 -66 -146 -691 342 484 385 -122 4 105 486
5043D86p67P5P81m63J14j62K51k04j14K14N32q11L62j54p0N1K37k24n84M7L64
$$ 486 -281 -206 575 112 226 64 315 111 -3 211 743 -68 294 140 70 121 358 134 -450 -403 -39
5064c9K99j05j51J74k2o39K74J22L31k88J37J85n55k81M42P7N50k78m0R0J80l74
$$ -39 260 155 4 178 156 -483 -209 -87 244 -44 93 278 -277 -558 -116 -39 511 233 193 283 463 89
5086H9N83m73J55m97J27n19J34L88j02P7L3O8K84l15j20P8j24N20p63P81n26o29
$$ 89 672 199 354 -143 -16 -535 -401 -13 -115 -38 -5 63 347 32 -88 -10 -134 386 -377 404 -122 -751
5108g51J062p04J122p02J77m8Q0n90M44j04L20O78j809N87N70p84J38k06M02n73
$$ -751 311 -393 729 27 204 156 236 -354 90 -14 306 984 -825 -238 332 -452 -314 -520 -118 -691
5128f91O68j30p8O15j13j99P3K02j07m79O09o86N3P17o24L87j39J98p60M31M86
$$ -691 -23 -153 -231 384 271 72 145 347 240 -239 370 -316 -263 454 -170 217 78 276 -484 -53 433
5149D33q24R94r62P71m11j98O02k47j60l13J82K3R05n82L33q05n9M56m2M5k41
$$ 433 -391 603 -359 412 1 -197 405 158 -2 -315 -133 -110 795 213 546 -259 -318 138 96 141 -100
5170a00k74K0L05J41o5M16L46q26O26o43K81k82l41j45N49k83J88P2J52m80M82
$$ -100 -374 -354 -49 92 27 443 789 -37 589 -54 227 -55 -396 -541 8 -275 -87 -15 137 -343 139
5191A39j34J75m37K94K66o45O48q6K20k05j03j64L35L46n74R9R2r7K16l27k18
$$ 139 5 180 -257 37 303 -342 306 220 440 235 132 -32 303 649 75 174 266 169 385 58 -160
5212a60j52M73l42K4m05q6N89o6N61l52K77j08j85l7L24l03L15m96p30P81J77
$$ -160 -312 161 -181 -157 -562 -648 -59 -125 436 84 361 253 68 31 355 52 367 -129 -859 -78 99
5233I9l2K86j12k15l64L31l23K64J12J13N31m83O47q50L86p67K71M48R9l66J82
$$ 99 67 353 241 26 -338 -7 -330 -66 46 159 690 207 854 4 390 -377 -106 342 441 75 257
5254B57l62P9M85r49J54J90K13J94j28j12k91q9j19M28K1o97R69K11n67J65K62
$$ 257 -105 -26 459 -490 -336 -146 67 261 133 21 -270 -359 -478 -50 -29 -726 243 454 -113 52 314
5275C14j32M41Lq27o07J306p32J13L49j75k58M05p29P39p32Q86J73l36j30k35
$$ 314 182 623 626 -201 -808 498 -234 -121 228 53 -205 200 -529 210 -522 364 537 201 71 -164
5295a64M36L93r32M06p63M46o6O71m49l17L16J84m32k64J218n20J0p20Q86p30
$$ -164 272 665 -267 139 -624 -178 -244 427 -22 -339 -23 161 -271 -535 683 163 173 -547 339 -391
5315c91M94r35P03M8L95k12j93j37K64l22j23L25J26k94O2j7M13L60j46m88o64
$$ -391 103 -832 -129 -81 314 102 -91 -228 36 -286 -409 -84 42 -252 -190 -207 206 566 420 -68 -732
5336g32P96L63m01K6l83P47o11P79k14l70o2l58k51J012p90N56m06k87Q80M1n80
$$ -732 64 427 26 52 -331 416 -195 584 370 0 -62 -420 -671 341 -449 107 -299 -586 294 335 -245
5357b45K14O8O76l69j04n23K03M26m59M70j20k19P4l25P71o33o95R19m29M77j14
$$ -245 -31 37 713 344 240 -283 -80 346 -113 357 237 18 92 -233 538 -95 -790 129 -300 177 63
5378F3j54K92L70l87l51J53P3l62L27m02O82P2l69k01o70J276p68M04m04O99N1
$$ 63 -91 201 571 184 -167 -14 59 -303 24 -378 304 376 7 -194 -864 412 -356 48 -356 343 394
5399C94m26lrJ24J07L30p77K78l18L65r88J242l13k17k24K32j45J040l65o81O25
$$ 394 -32 -35 -44 80 187 517 -260 18 -300 65 -923 319 6 -211 -435 -203 -348 692 327 -354 271
5420B71p22J52M61l94J2M23k00Q3k8j67m25N00J92k73K38K61M15q55L64o93Q63
$$ 271 -451 -299 162 -232 -220 203 3 86 58 -109 -534 -34 158 -115 123 384 799 -56 308 -385 478
5441D78j055O18J19J68k13K5k85M51m90K05K52k99M76r47M64n38M46M8p14N41
$$ 478 -577 41 160 328 115 140 -145 306 -184 21 273 -26 450 -497 -33 -571 -125 -77 -791 -250
5461b50m73M40J67N01j79n08k39M80JJ35n56N86j82N37n77r0J81Q4j32l43k8Q12
$$ -250 -723 -283 -116 385 206 -302 -541 -61 -60 75 -481 105 -77 460 -117 -207 -26 58 -74 -417 -445 367
5483C67k26m80L70K06j5k01m37M59j33P4p9M05j73l92P1N6J63l80K25mK57l6k50
$$ 367 141 -339 31 237 222 21 -416 43 -90 -16 -95 310 137 -255 -184 -128 35 -345 -120 -124 133 97 -153
5506a53K57mp79P90n93N38L47L94j062P08o05N2L81j29j50l34K36j35k66Q58N1
$$ -153 104 100 -679 111 -482 56 403 797 -265 443 -162 -110 271 142 -8 -342 -106 -241 -507 351 402
5527D02m18m46O41k38p5K73m1j41l94N09k44J87k33K44j23P11m81m2r4L09Jk15
$$ 402 -16 -462 179 -59 -134 139 98 -43 -437 72 -172 15 -218 26 -97 614 133 91 -3 306 307 92
5549I2J27m78M67q53M67L4K19N64o36p0K49j68J32l44r5M83o30M62k19K08Q46
$$ 92 219 -259 208 -645 -178 -144 75 639 3 -67 182 14 146 -198 -293 190 -440 22 -197 11 857
5570H57n47k66l2Q3j93l99L83L15l33N22o02M85m92L2j15N39q23Q31o66P1P7L61
$$ 857 310 44 12 95 -98 -497 -114 201 -132 390 -212 273 -219 -187 -302 237 -586 245 -421 -350 -273 88
5592H8j39N75n39k7K76l29l57M11N33l69n0m98O0N65k84p50J074n99M46N20m69
$$ 88 -51 524 -15 -42 234 -95 -452 -41 492 123 73 -425 -365 200 -84 -834 240 -359 87 607 138
5613A38J91n61l25J322k49l24k09j55J22j16m90N48M32q3j02o46M93q3Q38n01
$$ 138 329 -232 -557 765 516 192 -17 -172 -50 -166 -656 -108 324 241 139 -507 -14 -97 741 240
5633B40p09J04J58L2P45m51l02O34o95P8q5M36J63o5l34M61r2l84p9P07q02M53
$$ 240 -469 -365 -207 -175 570 119 -183 451 -244 -166 -251 185 348 283 -51 410 318 -66 -145 562 -240 213
5655B13j3k43j7J72o06M28K42j73l06M81l52J25M80r83Q55j67k48L05m99O20o8
$$ 213 200 -43 -60 112 -494 -66 176 3 -303 178 -174 -49 431 -552 303 136 -112 193 -306 314 246
5676B46n01P6N84p0r6o42N34j60n67R86j61l7k03l56L59j6l1j70M88o08N34j37
$$ 246 -255 -179 405 335 239 -403 131 -29 -596 390 229 192 -11 -367 -8 -24 -55 -225 263 -345 189 52
5698E2l65K28M95J96n15j80k84K98m27Q59n36P1K43m21nl09J234o85k99K06K58
$$ 52 -313 -85 410 606 91 -89 -373 -75 -502 357 -179 -108 135 -286 -291 -600 634 -51 -350 -144 114
5719A14k02LJ36K9k22R6M13p53K23K14j92L33Q0L18n65o1O76l76o50O99j53R4
$$ 114 -88 -85 51 80 -142 -46 367 -386 -163 51 -141 192 272 590 25 -36 640 264 -386 313 160 254
5741B54k23%j72k1M27l07L98k24n96N42K64Q3p3N4o85N26m7q6K11j005N81j2k08
$$ 254 31 31 -141 -162 265 -42 356 132 -464 78 342 425 352 406 -279 247 200 114 325 -680 -99 -111 -319
5764c19K7k72R72n83K69m36P71q60l86O23K90L87m73k45N65l36K7q72J077J23
$$ -319 -292 -564 408 -175 94 -342 429 -431 -817 -194 96 483 10 -235 330 -6 21 -851 226 349
5784C49n82l12L83L69j07j62j12J28J51N26j05q1j79m34M48n32K41J73k99J42
$$ 349 -233 -545 -162 207 100 -62 -174 -46 105 631 526 445 266 -168 280 -252 -11 162 -137 5
5804Ek59K16K49J08k13P88p25K21p32N21m63M93n44O66r6O9m85l66O81k20O36
$$ 5 -254 -38 211 319 106 894 169 390 -342 179 -284 209 -335 331 235 304 -181 -547 134 -86 550
5825E50q10L89m63N88r96J462j066J26P2P96m55k71L10q3l65K87o98J079n40J38
$$ 550 -260 129 -334 254 -742 720 -346 -220 -148 648 193 -78 232 149 -216 71 -627 452 -88 50
5845E0l0k21j46K14o34K12P02l23N7L57L6p67%O32m03k85O43j99O76n64j52j22
$$ 50 20 -201 -347 -133 -767 -555 147 -176 -119 238 274 -493 -493 139 -264 -549 94 -105 571 7 -145 -267
5867b67J25j76J98L7P6k12M46k82J033o05n21J66K97m1l72m38K85j67J97K8O7
$$ -267 -142 -318 -120 -83 -7 -219 227 -55 978 373 -148 18 315 274 -98 -536 -251 -418 -221 -193 -126
5888a26J27%k87N15q4l83Kk92P42m99N30n27N60r75O46Q6j43K2M2MJ70k19r2M41
$$ -126 1 1 -286 229 145 -238 -236 -528 214 -285 245 -282 278 -697 -51 35 -108 -86 -44 -40 130 -89 -181 260
5912B60o22N8M76k70l63P75k06m16L29K40j67l7n43R67J67o64m70Q66o01P24q03
$$ 260 -362 -304 172 -98 -461 314 108 -308 21 261 94 57 -486 481 648 -16 -486 380 -221 503 -300
5933c00J35J09M7N47l53J17j21l62P94r98O9N46p11L87L67q09Q08q16L95l73P33
$$ -300 -165 -56 -9 538 185 302 181 -181 613 -385 -316 230 -481 -94 273 -536 272 -544 -149 -522 211
5954B11j39l89P06R7o47J5J89N17o25l69M47K73o2l2j75L85l07n65N94j64L49
$$ 211 72 -317 389 486 -161 -146 43 560 -65 -434 13 286 224 192 17 402 95 -470 124 -40 309
5975C09j49k50M35m42J99J23n5l91J7N37m08l28j30Q8M94L87n31m18l00Q25J72
$$ 309 160 -90 345 -97 102 225 170 -221 -204 333 -75 -403 -533 -445 49 436 -95 -513 -813 12 184
5996A84N43p20K15N9q87R45k47q88Q95l58M57k72j00m0L19k67M02N4m61m75L84
$$ 184 727 7 222 281 -606 339 92 -796 99 -259 198 -74 -174 -214 105 -162 240 294 -167 -642 -258
6017b58K74q3k23L67m93k53J007o60L62j59j66K06N55m39l17P66M9k79k77M5K87
$$ -258 16 -67 -290 77 -416 -669 338 -322 40 -119 -285 -79 476 37 -280 486 535 256 -21 24 311
6038C11q3r8P4p52N02K7J87J12m19J63N17p90K96m46j27N58n38M85K2k32j84n3
$$ 311 228 130 204 -548 -46 -19 168 280 -139 24 541 -249 47 -399 -526 32 -506 -21 1 -231 -415 -468
6060d68J08M15N6K3l36L62j44o55J017m04k20K74o54M83P25n32j84j67r4M3N4
$$ -468 -360 55 111 134 -202 160 16 -639 378 -26 -246 28 -626 -143 582 50 -134 -301 -395 -352 -298
6081b98k43L12r3k39J245n64k77m44M04J77K73K11o94J146q44q9K43N61q75n61
$$ -298 -541 -229 -322 -561 684 120 -157 -601 -197 -20 253 464 -230 916 72 -17 226 787 -88 -649
6101f49J178o13n60Q23q26N13l1j07L67j10K02rm34j9M06o8MM16m96L97j45j29
$$ -649 529 -84 -644 179 -647 -134 -165 -272 95 -15 187 178 -256 -275 131 63 67 483 -13 384 239 110
6123A10M1o7M91l34k45K66j20j45k43j95K99J65l39M26j7j38K99m81J32j63K05
$$ 110 151 84 575 241 -4 262 142 -3 -246 -441 -142 23 -316 110 93 -45 254 -227 -95 -258 -53
6144e3M73j39l4p80M55J97j061P57q4J28l46Q53j48l46J3M83q63K34L56J67m99
$$ -53 420 281 247 -533 -78 119 -942 -185 -269 -141 -487 366 218 -128 -115 368 -495 -261 95 262 -237
6165b37n97J295j78P1k62N78p25j85l09J035r99N35L6m01M89K98n50j75M77j66
$$ -237 -834 461 283 354 92 670 -55 -240 -549 486 -513 22 58 -343 146 444 -106 -281 196 30
6185C0k74p7O32j16n14L5L09m72N94k63K57Q4P9k83L37k40L62o18O2o0j33O55
$$ 30 -244 -321 311 195 -319 -284 25 -447 147 -116 141 225 304 21 358 118 480 -138 -76 -136 -269 386
6207C86o29M01m91P6q4L6L20j49L73KJ28r65Q07j26p80Q83J15l99R88r91r2L53
$$ 386 -243 158 -333 -257 -341 -305 15 -134 239 241 369 -596 211 85 -695 188 303 -96 892 -99 -191 162
6229A62M65l75p06N74m27N93n42J04L70l08K42j54l13N44k88j55L66o98L85M05
$$ 162 627 252 -454 120 -307 286 -256 -152 218 -90 152 -2 -315 229 -59 -214 152 -546 -161 244
6249B44J79M21j068N7L34m14o14J345l52L85p67j2M80k21k01K75j3m94N72M9K04
$$ 244 423 844 -224 -167 167 -247 -861 484 132 517 -250 -262 218 -3 -204 71 58 -436 136 185 389
6270C89k80K33m49J245j147J1K08m40J48K04j51O0j36K13n2l49L70j09K69l10
$$ 389 109 342 -107 1138 -9 2 210 -230 -82 122 -29 31 -105 108 56 -293 77 -32 237 -73
6290g3R4J6K31l82o8K05J83J19m44Q8O21o86J26j38L98mp10L41M68p62k6q8O84
$$ -73 21 37 268 -114 -182 23 206 325 -119 -31 590 -96 30 -108 290 286 -424 -83 385 -377 -403 -491 193
6313A93k66mq9l07O06l35M72j13j53J20K36r00R62J28j22k56m46O77k55l65k02
$$ 193 -73 -77 -166 -473 133 -202 270 157 4 124 360 -540 422 550 428 172 -274 403 148 -217 -419
6334d19O37K6J75o79L11L58o66j19N10n09O66J32k99J17k45K22m72q4J022r17
$$ -419 218 244 419 -260 51 409 -257 -376 134 -375 291 423 124 241 -4 218 -254 -338 684 -233
6354b33J039j312M01M63m61K75J40k72k02j03J08K42N19l99o10O36l36k51Q14
$$ -233 806 -506 -105 358 -103 172 312 40 -162 -265 -157 85 604 205 -405 231 -105 -356 458
6373D58m29K79n94N45q02O10O37o35m63P33m79ON07M04n93l45N49m60n67K81O66
$$ 458 29 308 -286 259 -543 67 704 69 -394 339 -140 -134 373 777 184 -161 388 -72 -639 -358 308
6394C08o63K74R8j6j92Q4J51r0p79N14L36N3k14O01j47n6k26l55L33l33R0k06
$$ 308 -355 -81 17 1 -191 -107 44 -46 -825 -311 25 78 -136 465 318 262 36 -319 14 -319 -229 -435
6416d35R9J167p39q0r5K40n53Q55k57J63J20o98J64j51L12K3l0n07O06l92O67
$$ -435 -336 831 92 12 -83 157 -396 459 202 365 485 -213 -49 -200 112 135 105 -402 204 -188 479
6437D79p64R22n76K87j15j09n0r5j91L51J37q14J07O31n16l8L11J28M10r94J84
$$ 479 -285 637 61 348 233 124 74 -21 -212 139 276 -538 -431 200 -316 -354 -43 85 495 -499 -315
6458c15j46k05R30n77L25J01l0j31L03k75N23n64R4l21Q66o17m97N37k76PQ4j96
$$ -315 -461 -666 264 -313 12 113 83 -48 255 -20 503 -61 33 -288 578 -39 -536 1 -275 -268 -184 -380
6480c80O84j65K29l2m28j64L07k71N90o30P30p39R42p77L08j7l29M74q09J17L3
$$ -380 304 139 368 336 -92 -256 51 -220 370 -260 470 -269 673 -104 204 187 -142 332 -477 -360 -327
6501c27J62O66j267M80K43n21P24pl8J04K70k97r9j28m74O94Nm48l7P33k42LK3
$$ -327 -165 501 -766 -286 -43 -564 160 153 115 219 489 192 93 -35 -509 185 190 -258 -295 438 196 199 222
6524B22k23l0K1q0J61P4j29j09k13O91n73k8K8L76j24l0j27L49M61p62j19l59
$$ 222 -1 -31 -10 -90 71 145 16 -93 -306 385 -188 -216 -188 188 64 34 -93 256 717 -45 -164 -523
6546e23J95p2O23J95k27R0l39L51l62n00J126q97p7L73J59k33m59Q85o14O82k22
$$ -523 -328 -400 223 418 191 281 -58 293 -69 -569 557 -340 -417 -44 115 -118 -577 308 -306 376 154
6567A54m33k30M75P20q73K71L36q63N71j42K07Q3K32m27L72o26K97k69j31j34
$$ 154 -279 -509 -34 686 -187 84 420 -443 128 -14 193 276 508 81 453 -173 124 -145 -276 -410
6587d10K44J83k94J80L50n81R63o64K70m18k5N02m88R56j163q1O17j88L16j73
$$ -410 -166 17 -277 -97 253 -328 635 -29 241 -177 -202 300 -188 768 -395 -476 141 -47 269 96
6607I6k1k42L97j19k55j00M43m22J76L3N16q17L70l62L54j9j4p3p5j32l44P29
$$ 96 75 -167 230 111 -144 -244 199 -223 -47 -14 502 -315 55 -307 47 28 14 -59 -134 -266 -610 119
6629A19o4L0Q5k48k87K99k7L91j46L48n06J84K11m95j56N49o4n73M32l79M33L19
$$ 119 55 85 170 -78 -365 -66 -93 298 152 500 -6 178 389 -106 -262 287 223 -350 82 -297 136 455
6651D55l99K09m32N30k84j7J22l50K20m7k49R09l11m60j12L8P85m61q7j34K9J12
$$ 455 56 265 -167 363 79 62 184 -166 54 7 -242 667 356 -104 -216 -178 607 146 59 -75 -46 66
6673F6L38q61N01K28l52J15o66N74J14n69M23l94L08J58K7L26J7n32L52l64O38
$$ 66 404 -457 44 272 -80 35 -631 -57 57 -512 -89 -483 -175 -17 10 336 353 -179 173 -191 447
6694D47m48k31N69n09M90%l68J15M20p07l9O80k4k37L11m76j41L26p23K62j32
$$ 447 -1 -232 337 -172 318 318 -50 65 485 -222 -261 419 395 158 469 -7 -148 178 -545 -283 -415
6715d15l39Q21L67m76M25K82p90l20L14K23j27K75n4n31J053l90n57m70N31j64
$$ -415 -754 67 434 -42 383 665 -125 -445 -131 92 -35 240 186 -345 708 318 -239 -709 -178 -342
6735c42K92L33q31O03j74M50m53j73L33k91Q97r54J066j175O47K02j88m70N62
$$ -342 -50 283 -548 55 -119 331 -122 -295 38 -253 644 -310 756 -419 228 430 242 -228 334
6754C34J40P1n72j52J21l93R28l5p28j0J13K91o24L03J67m2O6l97R87r15Q04p43
$$ 334 474 545 -27 -179 -58 -451 477 442 -286 -296 -183 108 -516 -213 -46 -88 -22 -419 568 -347 457 -286
6776b86L52j61Q3L24J22k07J26m11O51n9p64M94k39K37m54J15j76O60k03n20N91
$$ -286 66 -95 -12 312 434 227 353 -58 593 534 -230 264 25 262 -192 -77 -253 407 204 -316 275
6797B75j59KJ46n21J57m00o7L13L57K42p9L6q32P19q75L15J50M34L87j203K93
$$ 275 116 118 264 -257 -100 -500 -567 -254 103 345 266 302 -530 189 -686 -371 -221 213 600 -603 -310
6818c10O76j47O41j277N11M26n65K05q85R45o8Q9m13K24k19L05J20k52M22l73
$$ -310 366 219 860 -417 94 520 -45 160 -725 220 152 241 -172 52 -167 138 258 6 428 55
6838E5q86N12L79J93j4n5n76K13j6J96n00L65K28m81Q18n73J42M44l53J03p9J8
$$ 55 -831 -319 60 253 239 184 -392 -179 -195 1 -499 -134 94 -387 431 -142 0 444 91 194 115 133
6860A33l75K84o67O50j98n24N08O71l24l21K21k67k05k89K95N25l96l03N11P1
$$ 133 -242 42 -625 25 -173 -697 -189 482 158 -163 58 -209 -414 -703 -408 117 -279 -582 -71 0
6880@J51j66J27k04K3n5k69K2O33k34K11P2j98L79j173O23n46O50j28L5k22L33
$$ 0 151 -15 112 -92 -69 -124 -393 -371 262 28 239 311 113 492 -681 -58 -604 46 -82 -47 -269 64
6902F4m90J356o97O5m17O22n2p31K95q6L39n77L97q36P51k32K8o69Q89o29J063
$$ 64 -426 930 233 298 -119 503 451 -280 15 -71 268 -309 88 -748 3 -229 -201 -870 19 -610 453
6923D53j69j14K6j02m50L10nl31N82o8O60r42K26k69l80K87L64k79M88r48O93
$$ 453 284 170 196 94 -356 -46 -51 -382 200 132 792 -150 76 -193 -573 -286 78 -201 287 -661 32
6944C2n20O25j48L55l40l12L85J40o66R35k80l94k73K14N07j23M79o42m54K79
$$ 32 -488 137 -11 344 4 -308 77 217 -449 486 206 -188 -461 -247 260 137 616 -26 -480 -201
6964b01j9l02N80j98m61Q10j34j56L47l32O42p76J73N87j009M43J92k79J81p61
$$ -201 -220 -522 58 -140 -601 209 75 -81 266 -66 576 -200 -27 560 -449 -6 186 -93 88 -673
6984f73N87M55m56l05J58K41k6L21j43j9L84n51k23N1L19L08o32P74o78N16J37
$$ -673 -86 369 -87 -392 -234 7 -19 302 159 140 524 -27 -250 -199 120 428 -204 570 -108 408 545
7005E45o38J60K96k9M54j038J102p67K51J82p49L94m73rN55M56n11l34L69J20
$$ 545 -93 67 363 334 788 -250 852 85 336 518 -231 163 -310 -319 236 692 181 -153 216 336
7025C36p96N97j33k62M39k0o31M27l75L45R9j81J66m2L39p96N49M61p25K3M6L8
$$ 336 -460 137 4 -258 181 161 -470 -43 -418 -73 26 -155 11 -31 308 -488 61 522 -203 -180 -134 -96
7047i6L84n34q2K46j4K19j35n19O45J86l74j06r3M35J62o01J36L34o67P51p6r6
$$ -96 288 -246 -328 -82 -96 123 -12 -531 114 300 -74 -180 -273 162 324 -277 -141 193 -474 277 201 105
7069A05J58m56K95l10K53J22n23L53l34j4M8K55K21l18j87K90l25r3M66r7J39
$$ 105 263 -193 102 -208 45 167 -356 -3 -337 -351 -303 -48 173 -145 -332 -42 -367 -460 6 -91 48
7090D8k52L24l0k77j27L05r6O22r69M16M49m03m35N35j47N53r81L14K50L23m12
$$ 48 -204 120 90 -187 -314 -9 -105 517 -452 -36 413 10 -425 110 -37 516 -465 -151 99 422 10
7111A0n2l68J1N79m96L40J81k32o5l08R31q78L53J21k60O7K70J58j96l5m91M27
$$ 10 -42 -410 -399 180 -316 24 205 -27 -92 -400 531 -347 6 127 -133 -66 204 362 166 131 -360 67
7133F7J90m94O74j18j40n8m06M07k15O74q08o9P50o17j66L05M70j79N1J12j104
$$ 67 257 -237 437 319 179 121 -285 122 -93 581 -227 -296 454 -163 -329 -24 446 267 318 430 -674
7154f74Q86j5L57p92J92N73o23m50J013o63KM6M3m19J170j473Q87M04o72J011
$$ -674 212 197 554 -238 -46 527 -96 -546 467 -196 -194 -148 -105 -524 646 -827 60 464 -208 803
7174H03j083M93r8n04L19j78r7R27j029L50L51j46K3n24Q7k0N96l16l32L44J95
$$ 803 -280 213 115 -389 -70 -248 -345 582 -447 -97 254 108 131 -393 -306 -326 270 -46 -378 -34 161
7195A61J34J11l20J35l73l8M11j81j63L75q9p13L83l3j68K05K20m29j52M02M25
$$ 161 295 406 86 221 -152 -190 221 40 -123 252 163 -550 -167 -200 -368 -163 57 -372 -524 -122 303
7216C03K79j132J366p28L40L62n44m53L89m8M20k29o64R0N2Q90l13J84j258K56
$$ 303 582 -550 816 88 428 790 246 -207 182 134 554 325 -339 -249 -197 693 380 564 -694 -438
7236d38M62k57j98O44l5Ol42mL14K48p05Q11m81m91J054m07n61N17K40J6j99l29
$$ -438 24 -233 -431 213 178 184 -158 -162 152 400 -305 506 25 -466 588 181 -380 137 377 393 194 -135
7258a35p3M30l83K71j01K78o57O62m82J47l17Q88p63l28J109m56l53n8L05J86
$$ -135 -208 222 -161 110 9 287 -370 292 -190 -43 -360 528 -235 -563 546 90 -263 -321 -16 170
7278A70j92M49l81l01J46om3N9Q3N88j144P18p52N80J81n23L21p7P88l35L70p14
$$ 170 -22 427 46 -255 -109 -115 -158 -99 -16 572 -572 146 -606 -26 155 -368 -47 -124 664 329 699 -15
7300a5L0k65p0J71N90p53j51j14Q24Jl56M41lj05k67l39O55m39M22l30J83M43
$$ -15 15 -250 -320 -149 441 -312 -463 -577 247 248 -108 333 330 225 -42 -381 274 -165 257 -73 110 553
7322E53o80l61M13K54J06l3j07J65k48o80J207r47k36L21j89O59P3J53n83o11
$$ 553 -127 -488 -75 179 285 252 145 310 62 -618 589 -358 -594 -273 -462 197 270 423 -160 -771
7342g71P64l68m2O9K92L67k11j22J34K90l95k9n01P16Q7n7q62M80L78K59q76j37
$$ -771 -7 -375 -417 -348 -56 311 100 -22 112 402 7 -22 -523 193 280 223 -639 -159 219 478 -398 -535
7364e35L84J90J00k57R19n28k27k87L23QL22J09r00N05K7q54K51l5J01M06J76
$$ -535 -151 39 139 -118 801 273 46 -241 82 90 412 521 -379 126 153 -701 -450 -485 -384 22 198
7385A98j61j24J00L13l5j99l73JM86n04Q39m09M28p21l95P72l22j42J89K13n02
$$ 198 37 -87 13 326 291 92 -281 -280 206 -298 541 132 560 -161 -556 216 -106 -248 -59 154 -348
7406c48P59m96m40K82j91O70J57n48M2k78O36L04k03k66K89m96j21O11l19j93
$$ -348 411 -85 -525 -243 -434 236 393 -155 -113 -391 245 549 346 80 369 -127 -248 363 44 -149
7426a49O75r63O80P7m23m8L61k99N22o81j17N44M5l31J05K63o52R5J50M78k63
$$ -149 526 -437 243 320 -103 -151 210 -89 433 -248 -365 179 224 -107 -2 261 -391 -296 -146 332 69
7447F9N48l95o73L36Rl60l26Q36j56K42o79R09m22k02K76L8p17N06M45Jo99P13
$$ 69 617 222 -451 -115 -106 -466 -792 44 -112 130 -549 360 -62 -264 12 50 -667 -161 284 285 -414 299
7469B99o03o8O56k03l66O9Q08o66P3k66L13j37J16m20k91J94M52j39M99n15J04
$$ 299 -304 -372 284 81 -285 -216 592 -74 -1 -267 46 -91 25 -395 -686 -492 -40 -179 320 -195 -91
7490i1K00m44J5M51Rj31M09m56JM14q81P73l73M2Q60m92m9k93L89n95K47L26k21
$$ -91 109 -335 -320 131 140 9 418 -38 -37 377 -504 269 -104 -62 798 306 257 -36 353 -242 5 331 110
7513A10q5k21L25O02p15K08r77Q40J83k49M3l75K47L56l13L02l8o27L06j53M14
$$ 110 25 -196 129 731 16 224 -753 87 270 21 64 -311 -64 292 -21 281 243 -384 -78 -231 183
7534A83m56P68m83J68j42R9j90j96j48j1K76k31N74p44Q78Q0n83M98o68k41R42
$$ 183 -273 495 12 180 38 137 -53 -249 -397 -408 -132 -363 211 -533 345 425 -158 340 -328 -569 373
7555C73r45J72K4N14J55o76O72j28l59J21M9qlL76q89J255j006O62p01O79l02
$$ 373 -572 -400 -376 138 293 -383 289 161 -198 -77 -28 -36 -39 337 -552 703 -303 359 -342 337 35
7576C5L00l36K58k78O66n2q51R3j53O53o02K16L31K15j51p91O33R6m97Or8O31
$$ 35 335 -1 257 -21 645 593 -258 -165 -318 335 -267 -51 280 495 344 -447 186 282 -215 -209 -307 324
7598C24k91M99m40r7l45R33p77O90r53Q21r07L37P30o78P26q41N5J21m2O22O23
$$ 324 33 532 92 -5 -350 583 -194 496 -457 364 -543 -206 524 -154 572 -269 -214 -93 -135 487 1110
7619A110p72l4o31k52J81O70n98N27j03k28l28O35p6l7j22P28r72K51ql47M61
$$ 1110 338 304 -327 -579 -398 272 -326 201 98 -130 -458 177 101 64 -58 670 -302 -51 -59 -406 55
7640E5J2J19k71R1j03l44O92J56n98o5O61m11R7o10M75k54L33j40j54M52j62k95
$$ 55 67 186 -85 6 -97 -441 251 407 -191 -256 405 -6 91 -519 -44 -298 35 -105 -259 193 31 -264
7662b64L43m66P13n32K96m16L78J09m36L60K28r63O79j08J14k40p0LN26J63j07
$$ -264 79 -387 326 -206 90 -326 52 161 -275 85 313 -650 29 -79 35 -205 -275 -272 254 417 310
7683C10m16K32j61j13K50J04m46j62M96M05m01P1l22J02k93j19R5r8K77P05m80
$$ 310 -106 126 -35 -148 102 206 -240 -402 94 499 98 169 -153 -51 -344 -463 -368 -466 -189 516 36
7704C6l83k8Q30n50L30n92K90L72l99K64n85M58o79M96L83O6q7L68m29r5M34p31
$$ 36 -347 -375 455 -95 235 -357 -67 305 -94 170 -415 43 -636 -140 243 309 222 590 161 66 500 -231
7726b31l86L63J63K66n91K49L2k09J40K28K3P25o05k16K27m08P65q17L30O9K17
$$ -231 -617 -254 -91 175 -416 -167 -135 -344 -204 24 47 772 167 -49 178 -230 535 -282 48 117 334
7747C34n49K92K76n70J71L04m78K52N69p23J09m3R0M5r2R2J22o9R6l46J92O6l47
$$ 334 -215 77 353 -217 -46 258 -220 32 601 -122 -13 -56 34 79 -13 79 201 132 228 -118 74 140 -207
7770b07J84n6n10J069P5o43L91k95M49M90j139K92J10K43l62L29n9k57k15K43
$$ -207 -23 -79 -589 480 555 -88 303 8 457 947 -192 100 210 453 91 420 361 104 -111 132
7790A32O6o92K13MM98J5m02J45k62K55n97O24K8M40K97j230O85j2j21l3j64L15
$$ 132 198 -494 -281 -277 221 236 -166 -21 -283 -28 -625 -1 27 467 764 -466 219 207 86 53 -111 204
7812B04n28J20J62O46n33K44l88j28J09K94J72l91k4k26P06r35K1N91K66m53l1
$$ 204 -324 -204 -42 604 71 315 -73 -201 -92 202 374 -17 -41 -267 439 -496 -475 116 382 -71 -102
7833a02L64r24K45P40pl41j48M50l66M37K47o44K11o25O26m59J85J00k1J27l52
$$ -102 262 -662 -417 323 316 -25 -173 277 -89 348 595 -49 162 -463 163 -296 -111 -11 -32 95 -257
7854b57N03k58k43l32L90J43k59P2O73n70K60M96r47J45K92j56J84l96P37q15
$$ -257 246 -12 -255 -587 -197 -54 -313 -241 432 -138 122 618 -329 -184 108 -48 136 -260 477 -338
7874c38P15n36M12k16j6k08l38L95K92K0o2q39J452p80O84k51k51K68K20n14K58
$$ -338 377 -159 253 37 21 -187 -525 -130 162 182 120 -719 733 -47 637 386 135 403 623 109 367
7895C67J10p81M53m32K2M61j11J9l09J72N96o03P72o86j1k33L47o68K45P29m74
$$ 367 477 -304 149 -283 -261 200 89 108 -201 -29 567 -36 736 50 39 -194 153 -515 -270 459 -15
7916a5M16k51Q93j418k85K33Q1N29k07j97M42J90m85O64l16p10Q98o7J3n01j5
$$ -15 401 150 1043 -375 -660 -427 -346 183 -24 -221 221 411 -74 590 274 -436 462 395 408 -93 -108
7937a08l3O75p18k36P82l63k3j17qk58N56J05n60l87J260q86O90j15j76L93r61
$$ -108 -141 534 -184 -420 362 -1 -24 -141 -149 -407 149 254 -306 -693 567 -319 371 256 80 473 -488
7958d88Q2k02L01O61k99M63m07k45L01r1m25N03J32o66M41L19l38k92o6N8L5L43
$$ -488 -406 -608 -307 354 55 518 111 -134 167 76 -349 154 286 -380 61 380 42 -250 -316 -258 -223 120
7980A20M87m09j58K76l22l18O2k02n4Q13p47J33K70J89J75l65J77J73n74M72l50
$$ 120 607 198 40 316 -6 -324 -262 -464 -518 295 -452 -319 -49 140 315 -50 127 300 -274 198 -152
8001a52k67M25q57J014q31L39k12N61M18j97p0n05O26p84O19k25M39K0n39P57
$$ -152 -419 6 -851 163 -668 -329 -541 20 438 241 171 -334 292 -492 127 -98 341 361 -178 579
8021E79L1p4m30K4j30J00q0k05L55k56M66m17j35J08q35N92L47l34K80k29j11
$$ 579 610 536 106 130 0 100 20 -185 170 -86 380 -37 -172 -64 -899 -307 40 -294 -14 -243 -354
8042c54J86K46k09j51M17k90k57M18p7P15j68j11j19j69J33j56J1K16j3l36j40
$$ -354 -168 78 -131 -282 135 -155 -412 6 -71 644 476 365 246 77 210 54 65 281 268 -68 -208
8063b08P66l87l69M06j97j8l57L14P73o92L40m22n70N23l9J52J79l07l50Q14p41
$$ -208 558 171 -198 208 11 -7 -364 -50 723 31 371 -51 -621 -98 -137 15 194 -113 -463 351 -390
8084c90J53l7K36m04j42L92P54r9K30p91K71n03J66O64no68O14r82N24L02n87
$$ -390 -237 -274 -38 -442 -584 -192 562 463 693 -98 173 -330 -164 500 495 -173 441 -541 -17 285 -302
8105c02K27l7k59mM14J84m32M96j50j77P1J64J36n16K77j54o20M63J27l37J74
$$ -302 -75 -112 -371 -375 39 223 -209 287 137 -40 31 195 331 -185 92 -62 -682 -219 -92 -429 -255
8126b55K79j9j70J64L64o42j20R2Q93o89l3p5K78L75j176K32M66K81l04J61k03
$$ -255 24 5 -165 -1 363 -279 -399 -307 586 -103 -136 -211 67 442 -734 -502 -36 245 -59 102 -101
8147a01K12o5K71n43j91Q60j38k16M77p14L60l78K91k06K7n1N2oN97q19j36J001
$$ -101 111 46 317 -226 -417 443 305 89 566 -148 212 -166 125 -81 -54 -105 -53 -59 538 -281 -417 584
8169E84q61j44O28O0KJ72l62m19M90oO1R7l74K66m28J18L45k78j13Q59r60J34
$$ 584 -277 -421 207 267 269 441 79 -340 150 144 205 302 -72 194 -234 -116 229 -49 -162 697 -263 -129
8191a29
$$ Imaginary data points
##PAGE= N=2
##DATA TABLE= (X++(I..I)), XYDATA
0@%%%%%%%%%%%%%%%%%%%m8R6r6R6r6R6j25J73j92J95k42K87l17L65m07M55n23
$$ 0 0 0 0 0 0 0 0 0 0 0 0 0 0 0 0 0 0 0 0 -48 48 -48 48 -48 48 -77 96 -96 99 -143 144 -173 192 -215 240 -283
36b83N87o45P27q20R15j011J120j238J369j518J671j843K036k238K467k721K999
$$ -283 304 -341 386 -434 481 -530 590 -648 721 -797 874 -969 1067 -1171 1296 -1425 1574
53A574l304L647m039M484n000N593o297P147q183R490j1203J3542j6962K2423
$$ 1574 -1730 1917 -2122 2362 -2638 2955 -3342 3805 -4378 5112 -6091 7451 -9511 12912
67A2912l2554N7573k36167l95694K73969J67943J42507L05223J57101j78588j64657
$$ 12912 -19642 37931 -198236 -593930 -319961 -152018 -9511 295712 452813 274225 109568
78A09568k47513l00529K2886K87225J77691J97846J90475j09812k91076k16072
$$ 109568 -137945 -438474 -415588 -128363 49328 247174 437649 327837 36761 -179311
88a79311k09152k5243K89389K57394Q1445J40814R721l16231l05473r8051p192
$$ -179311 -388463 -413706 -124317 133077 214522 355336 365057 48826 -256647 -354698 -361890
99c61890J93159L34267J44046j0581k0180k29554l33279o2892J01228Q3573K43336
$$ -361890 -168731 165536 309582 299001 278821 49267 -284012 -346904 -245676 -162103 81233
110H1233K71815k0577j53695j30222k55942j99314J29060K30775J48104J74462
$$ 81233 353048 332471 178776 48554 -207388 -406702 -277642 -46867 101237 275699
120B75699P5067j67349k13249j66470j47158M5383K48932K00279J17064O2963
$$ 275699 350766 183417 -29832 -196302 -343460 -298077 -49145 151134 268198 331161
130C31161j49224k73187j36850m3563O162J96828K55416Q1547j2889p1425k31603
$$ 331161 181937 -91250 -228100 -271663 -265501 -68673 186743 268290 255401 183976 -47627
141d7627k19799j6148P8318J37864K39487J39126p4587j23872j49731k06910o3873
$$ -47627 -267426 -283574 -205256 -67392 172095 311221 236634 112762 -36969 -243879 -307752
152c07752J34637J53303J56505J58343k5729j95052j63019j22350p7320J04297
$$ -307752 -173115 -19812 136693 295036 269307 74255 -88764 -211114 -288434 -184137
162a84137K11341J36656P9723N930j62629k03281r6262l4800O0025K07716J81564
$$ -184137 27204 163860 243583 249513 86884 -116397 -212659 -247459 -187434 20282 201846
173B01846L5656l0968j16844k10468j23863K7656P4833J44959J95311O2817q8305
$$ 201846 237502 206534 89690 -120778 -244641 -216985 -142152 2807 198118 260935 172630
184A72630j18078j54991j45698J4192J31561J32604J41233Q4762q3830j60084
$$ 172630 54552 -100439 -246137 -231945 -100384 32220 173453 258215 174385 14301
194A4301j23507j03125k0469J31613J66187J05952O0054n1136j75254j47685n5992
$$ 14301 -109206 -212331 -232800 -101187 65000 170952 231006 179870 4616 -143069 -199061
205a99061k025R7352J79951J17268J1822n1926j39597j66658o0678M1432Q9971
$$ -199061 -201086 -103734 76217 193485 205307 153381 13784 -152874 -213552 -172120 -82149
216h2149J48964J35355O038q9714j19072j39796p9886N4416J15244J20941J16233
$$ -82149 66815 202170 208208 118494 -578 -140374 -220260 -165844 -50600 70341 186574
227A86574K7601j05422j38642j06759o7870L4515J36111J29508P8492K1448q4061
$$ 186574 214175 108753 -29889 -136648 -204518 -170003 -33892 95616 174108 195556 111495
238A11495j55932j09377l2265L2980J18227J44317P2721j0411p6128j38013j20905
$$ 111495 -44437 -153814 -186079 -153099 -34872 109445 182166 171755 95627 -42386 -163291
249a63291k2383N6285J05580J32259P9212k4303q9322j19497j15191k9411P5530
$$ -163291 -185674 -129389 -23809 108450 187662 163359 74037 -45460 -160651 -190062 -114532
260a14532J10908J09707P7416j9630j08338j17791q9707l0160O8574J27239J03501
$$ -114532 -3624 106083 183499 163869 55531 -62260 -151967 -182127 -113553 13686 117187
271A17187N3015j5342j02545j29438p8766r516O0935J22123J11418L9021l1827
$$ 117187 170202 154860 52315 -77123 -155889 -165405 -104470 17653 129071 168092 136265
282A36265r2004j24008q2290L703P1352J10352J05534M0067m3914r7353j11904
$$ 136265 44261 -79747 -162037 -158334 -86982 23370 128904 168971 125057 27704 -84200
293h4200p5445O252P9278J07143R6299L7204m9149j03598j03048o5042O082Q3531
$$ -84200 -159645 -153393 -74115 33028 129327 166531 117382 13784 -89264 -154306 -148224 -64693
305f4693J11159Q4421K6892m8192j04789j03773n2887J4839P9542J10569Q2619
$$ -64693 46466 130887 157779 109587 4798 -98975 -151862 -137023 -57481 53088 135707
316A35707J6548n5090j00029r9901m8816K3751Q3379J03557P6150J1357n8828
$$ 135707 152255 97165 -2864 -102765 -151581 -127830 -44451 59106 135256 146613 87785
327H7785j00893r2979m2694K8600Q4746J01759O9845L567o2625r7834q9234l4039
$$ 87785 -13108 -106087 -148781 -120181 -35435 66324 136169 139736 77111 -20723 -109957 -143996
339a43996L2762Q5522R7687O4599l217o4828r6401q5022l0693M2258Q7025R0645
$$ -143996 -111234 -25712 71975 136574 133357 68529 -27872 -112894 -143587 -101329 -14304 76341
351G6341N7199n954p0226r4292p5645k5811M2663R0368Q7715M8976j0433p1254
$$ 76341 133540 127586 57360 -36932 -112577 -138388 -95725 -5357 82358 131334 120901 49647
363D9647r6416o8254j4615M1583Q8563Q8785L9539j8334o6564r3779p0526n578
$$ 49647 -46769 -115023 -129638 -88055 508 89293 128832 110498 43934 -49845 -120371 -125949
375a25949N0041Q3095Q5529L8075k8583p0876q3319o6614o042N8996Q1290P4295
$$ -125949 -75908 7187 92716 130791 102208 31332 -51987 -118601 -124643 -65647 15643 89938
387H9938L9074k8698p9978q0877n2942o795N9741Q9006O5355K4701k4498p7303
$$ 89938 129012 100314 20336 -60541 -113483 -120278 -60537 28469 93824 118525 94027 16724
399A6724q4849m5060K547N2987R0695O8552J3421l2339o9609q5786m5109J8740
$$ 16724 -68125 -113185 -110638 -57651 33044 101596 115017 82678 13069 -72717 -117826 -99086
411i9086N3864P7147P0953J3393m5983o6497p3598m9056J9628O8185P0242N8099
$$ -99086 -45222 31925 102878 116271 70288 3791 -69807 -118863 -99235 -31050 39192 97291
423I7291J7540m7987p6242o2887l8795J3068P1324P7533M4773J1569l9993q4382
$$ 97291 114831 66844 -9398 -72285 -111080 -98012 -26688 50845 95618 107187 67194 -17188
435a7188o6462k0652J7739O1808Q2453M3889o055l8696p2447p2700j8117L2865
$$ -17188 -83650 -104302 -86563 -24755 57698 101587 95532 56836 -15611 -88311 -106428 -73563
447g3563N4905P2291N2590j0823n2568o3500o3581k4969L9555O4404N8958M7138
$$ -73563 -18658 53633 106223 95400 42832 -20668 -84249 -109218 -69663 -5259 53699 100837
459A00837j870o1569p1849m8280j9751L2553P4158N9544L0039k347n5783p9516
$$ 100837 98967 37398 -34451 -82731 -102482 -69929 4229 63773 93812 91465 35682 -43834
471d3834m3895k735K6593O6212O9499K3227j6527m5851p3871n3882O231L9683
$$ -43834 -87729 -90464 -63871 2341 71840 95067 78540 32689 -41182 -95064 -88833 -49150
483d9150N2148O5780L2857k7635n5060n9488n1642k340N1999N8029N0892L2273
$$ -49150 2998 68778 101635 74000 18940 -40548 -92190 -94530 -42531 15498 66390 98663
495I8663k3310o7708n7259l4890m998M7484O7972M3707J8133j5510o4255o6342
$$ 98663 75353 7645 -49614 -84504 -89502 -42018 25954 69661 87794 72284 8029 -58313
507e8313k5329N172L6846O9049N1857M357k2719n1813o9752l1264K0628L9635
$$ -58313 -83642 -78470 -41624 27425 79282 83639 60920 9107 -60645 -91909 -71281 -31646
519c1646N5997N8546P086m2202m9644n3196l7353J9601N5479M9908M1116J4923
$$ -31646 24351 82897 89983 47781 -1863 -55059 -92412 -72811 -17332 32576 73692 88615
531H8615m0486o1257m4177k5580R705N6010N9939L0889O085l1062o5075n0597
$$ 88615 48129 -13128 -57305 -82885 -73180 -17170 42769 73658 79743 48681 -16394 -66991
543f6991j2382J4850M7107O4565L4256q498l3427n5707n3680j1642K7797M3476
$$ -66991 -79373 -64523 -17416 47149 81405 72907 39480 -16227 -69907 -81549 -53752 -10276
555a0276N4465L8860j2344m3241m5617m7254j9048L2822N2637M3125L3301k711
$$ -10276 44189 83049 70705 27464 -18153 -65407 -84455 -51633 1004 44129 77430 74719
567G4719m9935n5064l2975j3471K2132N9239N1188J6744o342m0072o1170l5566
$$ 74719 24784 -30280 -63255 -76726 -54594 4645 55833 72577 66235 26163 -35007 -70573
579g0573J162K3477M9549N5435J7336j9301l6575n2999m1190M554L3479M2260
$$ -70573 -69411 -45934 3615 59050 76386 57085 20510 -32489 -73679 -69125 -35646 6614
591F614M8745K4623k5167m5435m2558l7300k116M1936M7475L7262K1967j9419
$$ 6614 55359 79982 54815 9380 -33178 -70478 -72594 -30658 16817 54079 76046 56627
603E6627n4898m3965k1345m574L5320N8483L3130P198j3128m7986n3940j8262
$$ 56627 1729 -42236 -63581 -68155 -32835 25648 58778 65976 52848 4862 -49078 -67340
615f7340J0888K7017N1749M3026J310k4839l8946n0679k4725J8495L5116M1319
$$ -67340 -56452 -29435 22314 65340 66650 41811 2865 -47814 -72539 -54044 -18928 22391
627B2391M1171N845l4481m0782l9081k5991J5514M4570L8827K9704J0743l1901
$$ 22391 63562 69407 34926 -5856 -44937 -70928 -55414 -10844 27983 57687 68430 36529
639C6529n1361l2733j5815Q314M4452M6838K1745K216k4239n2120l9150n810J5531
$$ 36529 -14832 -47565 -63380 -55066 -10614 36224 57969 60185 35946 -16174 -55324 -61134 -45603
652d5603L4561M9159K6104r975k6444m2008m2749o880K5656L3976L9635K9085
$$ -45603 -11042 38117 64221 54246 27802 -14206 -56955 -63835 -38179 -4203 35432 64517
664F4517q125l6704l8271l3977j1851K6520M1703L2785K3347l103l9853m4355
$$ 64517 56392 19688 -18583 -52560 -64411 -37891 3812 36597 59944 56841 16988 -27367
676b7367k4430p097J9975M5091L7786J2911o702l3148m6718k6434L995J9630L6964
$$ -27367 -51797 -58894 -38919 6172 43958 56869 50167 17019 -29699 -56133 -52138 -32508 4456
689D456M2177J3204j7484l0253l9632l0377M642K7192L3853L7345J6569k0316
$$ 4456 46633 59837 42353 12100 -27532 -57909 -53267 -26075 7778 45123 61692 41376
701D1376l6459l4159k5735j4L2733L8570K6823J4203j5235m1891l5864j5254L66
$$ 41376 4917 -29242 -54977 -54991 -22258 16312 43135 57338 42103 212 -35652 -50906 -50540
714e0540K7903M2942K8030L965j4921l6583l9595j3928Q784K3546L9815L2383
$$ -50540 -22637 20305 48335 52300 37379 796 -38799 -52727 -43943 -20397 19418 51801
726E1801K43k1784l1497l6498j7995J4093K9059L3019K9214L695k6735l4144k9076
$$ 51801 52044 30260 -1237 -37735 -55730 -41637 -12578 20441 49655 53350 26615 -7529 -36605
739c6605j7448J1466L4697L3014K1941M187k5283l8099k6366j0483Q713L3377
$$ -36605 -54053 -42587 -7890 25124 47065 51252 25969 -12130 -38496 -48979 -40266 -6889
751f889L6662J7512j055k1490l8275k9058o140J3682L0185L5265J9169p413k3321
$$ -6889 29773 47285 46230 24740 -13535 -42593 -48733 -35051 -4866 30399 49568 42155 18834
764A8834l1793l0436o026J8654K9381L1273J9489o264k8645l2388k3329o803J8520
$$ 18834 -12959 -43395 -49421 -30767 -1386 29887 49376 43112 14467 -17921 -41250 -48053 -29533
777b9533L3015K8639J4479o597k7289l3230k1880k780J8508L2359K9615J0958
$$ -29533 3482 32121 46600 40003 12714 -20516 -42396 -45176 -26668 5691 35306 46264
789D6264r089k7342l3035j9827N79J9040L0903K9260R007j2719k5612l1076j9946
$$ 46264 37175 9833 -23202 -43029 -42450 -23410 7493 36753 45760 33041 7429 -23647 -43593
802d3593K736K1747K9514K5781J0260j5755k9042k7358j6453K576K1879L1592
$$ -43593 -40857 -19110 10404 36185 46445 30690 1648 -25710 -42163 -39587 -17708 13884
814A3884K2545P424j4043k9072k8919j3743M866K2985K9864K1944M018j6605k6623
$$ 13884 36429 43853 29810 738 -28181 -41924 -37058 -14073 15791 37735 41753 25148 -1475
827a475k8035j2594P063K3791K9131K0523J451j6265k8127k5968j1495R916K4066
$$ -1475 -29510 -42104 -35041 -11250 17881 38404 39855 23590 -4537 -30505 -42000 -32084 -8018
840h018K7425K0093r02j8505k7197k4192r273R859K4984K7443J6383j388j8870
$$ -8018 19407 39500 38598 20093 -7104 -31296 -40569 -30710 -5726 21717 38100 36712 17842
853A7842k7323k3028o812J1834K3505K6693J5490l137k0374k6041k0741o537J2930
$$ 17842 -9481 -32509 -39321 -27487 -3982 22711 38201 35064 14690 -11351 -32092 -38629 -25699
866b5699K5456K4354J3447l679k1389k6654j8851l987J3522K5397K4479R886m998
$$ -25699 -243 24111 37558 33879 12490 -14164 -33015 -37002 -23480 1917 26396 36282 31284
879C1284j9781k7575j8171j052J3439K4772K4892R394q602j9790k4892j8682J019
$$ 31284 11503 -16072 -34243 -35295 -21856 2916 27808 37202 28600 8810 -16082 -34764 -33745
892c3745J6167K2616K1851J0146j0033k2549k2629j5632k11J8397K4475J8686
$$ -33745 -17578 5038 26889 37035 27002 4453 -18176 -33808 -34019 -15622 8853 27539
904B7539P294r301k3273k2570j1925M77J7222K5712J8360L323r926k1401k4481
$$ 27539 34833 25532 2259 -20311 -32236 -31759 -14537 11175 29535 32858 22932 1531 -22950
917b2950j1001N393J6186K4119J8954J936j2476k0225k1820j2840P533J8648K1165
$$ -22950 -33951 -28558 -12372 11747 30701 32637 20161 -64 -21884 -34724 -27191 -8543 12622
930A2622J7248L085j5347k1362j8091j1661N914K2217K1246J2196L600j4153k4138
$$ 12622 29870 32955 17608 -3754 -21845 -33506 -27592 -5375 15871 28067 31667 17514 -6624
943f624j8001n844M248K0346K4032J2138k131j1344k4352j8969l687P912J7015
$$ -6624 -24625 -30469 -26221 -5875 18157 30295 28164 16820 -7532 -26501 -30188 -22276 -5261
956e261K3912J3434n233j4505j8910j9830n121J2234J7709J8981J3006l035j8320
$$ -5261 18651 32085 26852 12347 -6563 -26393 -31514 -19280 -1571 17410 30416 27381 9061
969I061j9138j5121n418J1232K0936J6965R891j414j9066k1583j0913l000P644
$$ 9061 -10077 -25198 -30616 -19384 1552 18517 28408 26994 7928 -13655 -24568 -27568 -19924
982a9924K3020J9622M584m229j4589k2424j3777J446J0429J8628J9714O943q850
$$ -19924 3096 22718 27302 23073 8484 -13940 -27717 -26271 -15842 2786 22500 29443 20593
995B0593j5001j8950j5028K450J4814J5843J6296Q568q913j8422j6524j1650k177
$$ 20593 5592 -13358 -28386 -25936 -11122 4721 21017 29585 20672 2250 -14274 -25924 -28101
1008b8101J6932J9984J2944N946p163k0804j7425o883L04J2610K1800J2947J654
$$ -28101 -11169 8815 21759 27705 20542 -262 -17687 -24570 -24266 -11656 10144 23091 24745
1021B4745o147j7228k1176o614O284J0823J8591J5785O01j1632j4776j7268r796
$$ 24745 18598 1370 -19806 -26420 -20136 -9313 9278 25063 25664 14032 -744 -18012 -27808
1034b7808P235J4787J5351J4597K052j3978j5849j4013q267M485J9233J4442Q864
$$ -27808 -20573 -5786 9565 24162 26214 12236 -3613 -17626 -25893 -21408 -2175 12267 21131
1047B1131M215j0989k1954j2417k713K459J7196J8535P190j541p989j9506j5016
$$ 21131 25346 14357 -7597 -20014 -22727 -20268 -3072 15463 22653 21112 13123 -6383 -21399
1060b1399j277O587J1440J9888J0670n818j1372j4512j6277l406J1737J3505J4308
$$ -21399 -22676 -16089 -4649 15239 25909 20091 8719 -5793 -22070 -25476 -13739 -234 14074
1073A4074J1229m267j6126j3907j0771m790J0576J7473J1121P755j169j5403j7343
$$ 14074 25303 21036 4910 -8997 -19768 -24558 -13982 3491 14612 22367 21198 5795 -11548
1086a1548p602k420P171J7385J4843L580k927j2593j8102r805K316P766J5279
$$ -11548 -19150 -21570 -14399 2986 17829 21409 18482 5889 -12213 -22018 -19702 -11936 3343
1099C343J6275L305q056j1526j4593j1457L033J1574J2289J2740O671q571j4864
$$ 3343 19618 22923 14867 3341 -11252 -22709 -19676 -8102 4187 16927 23598 15027 163
1112A63j1833q744j15J2908J5499Q838M502n586j6711j3054n600R92J0385J7914
$$ 163 -11670 -20414 -20529 -7621 7878 16716 21218 15632 -1079 -14133 -19733 -18741 -8356 9558
1126I558R680L1n916j3806j5702m439N252Q768J5132J1700j034r831j0342j4090
$$ 9558 19238 19269 13353 -453 -16155 -20594 -15342 -6574 8558 20258 19224 9393 -949 -15039
1140a5039o873O783J1720J2038J0290R79j1451j2374j0456o617M722J4106J2946
$$ -15039 -21912 -15129 -3409 8629 18919 19898 8447 -3927 -14383 -21000 -16278 -2172 10774
1153A0774P091J095r331j6720q698j933K917J3141J4799M785j302q203j4373j1333
$$ 10774 17865 18960 9629 -7091 -15789 -17722 -14805 -1664 13135 17920 16618 8415 -5958 -17291
1167a7291j110O772R977J4359O504l759r536j1367j0920k623R060J0677J0624
$$ -17291 -18401 -11629 -1652 12707 19211 15452 5916 -5451 -16371 -18994 -9934 743 11367
1180A1367Q141m180j0959j1582q541l329Q328J3768J0067M632k138j2592j2148
$$ 11367 19508 15328 4369 -7213 -15754 -19083 -10755 3013 13080 17712 15574 2982 -9166
1193i166p420pO708J4113R618L001l575r795j3446p480J669O857J2654J1137L229
$$ -9166 -16586 -16593 -9885 4228 13846 16847 13272 3477 -9969 -17449 -15780 -8923 3731 14868 18097
1208A8097o781j0002j1190p988K255R570J0523R635L729o782j1661r633n617N40
$$ 18097 11316 1314 -9876 -17864 -15609 -6039 4484 14119 17848 11066 -595 -10228 -15845 -15305
1222a5305R748J1716P704K084m704j2235j0630m914K922Q426J2453P331O42n753
$$ -15305 -5557 6159 13863 15947 11243 -992 -11622 -16536 -13614 -5188 7265 14596 15238 9485
1236I485j0950j0539m203M297P754J2184P903r76p755r476r827m411M858J0181
$$ 9485 -1465 -12004 -16207 -11910 -4156 8028 15931 14955 7200 -2276 -12103 -16514 -11656 -1475
1250a475R685O656L16q216j0869p679m688L969J1064J0973M936o65p373j2271
$$ -1475 8210 14866 15182 6966 -3903 -11582 -16270 -12301 -1237 9736 14672 14007 6634 -5637
1264e637p254k089M587R644J0776M947k194p696j0945p880k62M972R074R896N503
$$ -5637 -12891 -14980 -10393 -749 10027 14974 12780 5084 -5861 -13741 -14003 -9031 43 9939 15442
1279A5442l000q829r486p535j442P422Q811R011M554l255q912r990o364k13O087
$$ 15442 12442 3613 -5873 -13408 -14850 -7428 1383 10394 14948 11693 2781 -7209 -13573 -13786 -7699
1294g699J0079Q632K441k632q586j0175n151K03N965J0583Q231J728m051q466
$$ -7699 2380 11012 13453 10821 2235 -7940 -13091 -12888 -6923 3660 11891 13619 9568 1102
1308A102r103n940J635O799R243Q172J286m383q628q361m829J061P401R225O824
$$ 1102 -8001 -13941 -12306 -5507 3736 11908 13194 8811 183 -8178 -13007 -11946 -4545 4680 11504
1323A1504J692n549p392r065m413K284P363Q593P315O15n555q200q934k769K583
$$ 11504 13196 7647 255 -8810 -13223 -10939 -3576 5017 12332 12947 7392 -808 -9742 -12511 -9928
1338i928O924R034N754P82n812r047p841k807L263P804Q075N566P9o051q285p239
$$ -9928 -3004 6030 11784 12566 6754 -2293 -10134 -12941 -9678 -1874 6201 11767 11846 5795 -2490 -9729
1354i729k419L358P478Q418M605j392n532p884p339j228L502Q283P158M505q90
$$ -9729 -12148 -8790 -1312 7106 11711 10319 4787 -3097 -10436 -11664 -8162 121 7279 11784 10894
1369A0894o423q662o480j251N233P615O632M088j499p051p972n536j014M528Q352
$$ 10894 4471 -4191 -10671 -11922 -6689 926 7558 11646 10147 3096 -4876 -10412 -11426 -6898 1454
1384A454O882L200j311p625p501n834r3N123P711P088J700k131o436p844m212
$$ 1454 8336 11536 10225 2600 -4901 -10735 -10828 -5705 2006 9094 10794 8663 2227 -5617 -9829
1399i829p00N139Q042O072K770l762o862p381l738K14N907P220N712K413l584
$$ -9829 -10529 -5390 2652 8724 11494 7732 870 -6511 -10249 -10035 -4128 3092 8804 11217 7633
1414G633p537n911m340O59N506Q288M485J782l412p701p075k309J263M460Q577
$$ 7633 96 -5815 -10155 -9496 -3990 4298 8783 10565 7153 -548 -7623 -9932 -8669 -4209 4368
1429D368N140j00l269o465p484k562K934M753P277N356l61m801n860o345l452
$$ 4368 9508 9408 6139 -326 -7810 -10372 -7438 -2685 4592 9948 9587 4786 -1074 -7419 -10871
1444a0871L270N873P224L969L30n494n822n482l097K409O897O931K664J42m679
$$ -10871 -7601 -1728 5496 9465 9795 4301 -1521 -7003 -10100 -7691 -794 6137 8801 8943 4264
1459D264o489n965q23K102O022P150L499j479m938o290n757n02L655N091O517
$$ 4264 -2225 -8190 -9013 -6911 -889 6261 9760 8281 3343 -2947 -8704 -9206 -5551 -460 6057
1474F057L978k286m821n910n405j044M092N878N899K695j802n879n142m706m36
$$ 6057 10035 7749 2928 -2982 -8387 -9431 -5339 539 6438 9133 7331 1452 -3690 -8396 -8832
1489h832L758O805M734K847j484o535o685k576O4K749O770O303n4j739m460o328
$$ -8832 -5074 1731 6465 9312 7828 1293 -5392 -7968 -7904 -5155 1615 7918 7864 6125 1665 -4663
1505d663m534R54M448N809N385J673l266m171o360l742P73N048N495M053J929
$$ -4663 -9197 -8243 -3795 2014 7399 9072 5806 1635 -4725 -8467 -7694 -2646 2849 6902 8831
1520H831l545n461n376k693J221M480N667M110Q86k698o126n539j874J402M620
$$ 8831 5286 -175 -5551 -8244 -7023 -2543 3124 7234 8120 5422 -704 -6243 -8117 -6715 -2095
1535b095O555L173o04k213n774n168j899J886L968N831L953J13l793n545m623
$$ -2095 4460 7633 7029 4816 -958 -6126 -8025 -6139 -2171 3660 7613 7726 3933 -1612 -6235
1550f235k330K850M628N145L620k63m284m520m138k477J833N993M770K394l10
$$ -6235 -8565 -5715 -1087 4058 7678 7415 3131 -1389 -5527 -8004 -6171 -178 4592 6986 6676
1565F676l646n704m315m74J997M803N525K226q63l545n078m348m36L498L422N148
$$ 6676 3030 -2674 -6989 -7463 -5466 -663 4862 7088 6225 2680 -2398 -6746 -7182 -3684 -262 4886
1581D886K492j665l476n447l910m02L748M827M564J790j211n084m700k922k75
$$ 4886 7378 5713 2237 -3210 -7120 -7522 -3774 1053 5617 7407 6196 1112 -3588 -6510 -6785
1596f785L109N788L034J606j557m463m061l427N80K465M907M916Q93j874m408
$$ -6785 -3676 2112 5146 6752 5195 732 -3329 -6756 -6176 -3711 1196 6112 7005 5131 723
1611G23n089k588J239L237M543M061Q31k830l831m442k870J001M282L523L723
$$ 723 -4366 -6954 -5715 -2478 2065 6126 6957 4127 296 -4146 -7016 -6015 -1733 1790 5513
1626E513J759l126m318l837k767J348L966L966L351K34j932n243m241q37P76M633
$$ 5513 7272 4146 -172 -4009 -6776 -5428 -1462 2504 5855 6089 4157 -1086 -5327 -6164 -5388 -755
1642g55L555L363O3l087m054m020q91N93M236M644K084J108l907m384l230j324
$$ -755 2800 6163 6226 3139 -915 -4935 -5826 -5233 -997 3647 5731 6839 2932 -1452 -4682 -6006
$$ [...]
8191h2
##END NTUPLES=NMR FID
##END=
