##TITLE=1H_SR146H12
 D2O
 8 sc, 
 11.4.2023
##JCAMPDX= 6.0         $$ Bruker NMR JCAMP-DX V2.0
##DATA TYPE= NMR FID
##DATA CLASS= NTUPLES
##ORIGIN= UXNMR, Bruker Analytische Messtechnik GmbH
##OWNER= root
$$ XWIN-NMR		Version 3.5
$$ Tue Apr 11 14:19:42 2023 Russian Standard Time (UT+4h)  she@DPX200
##.OBSERVE FREQUENCY= 200.13135
##.OBSERVE NUCLEUS= ^1H
##.DELAY= (6, 6)
##.ACQUISITION MODE= SIMULTANEOUS
##.ACQUISITION SCHEME= undefined
##.AVERAGES= 8
##.DIGITISER RES= 18
##SPECTROMETER/DATA SYSTEM= spect
##.PULSE SEQUENCE= zg30
##.SOLVENT NAME= D2O
##.SHIFT REFERENCE= (INTERNAL, D2O, 0, 15.7039)
##AUDIT TRAIL= $$ (NUMBER, WHEN, WHO, WHERE, WHAT)
$$ ##TITLE= Audit trail, XWIN-NMR		Version 3.5
$$ ##JCAMPDX= 5.01
$$ ##ORIGIN= Bruker BioSpin GmbH
$$ ##OWNER= she
$$ F:/spectra/data/she/nmr/H-F/1/audita.txt
$$ ##AUDIT TRAIL=  $$ (NUMBER, WHEN, WHO, WHERE, WHAT)
(   1,<2023-04-11 14:18:39.23 +0400>,<she>,<DPX200>,
      <created by zg, POWCHK disabled, PULCHK disabled
       configuration hash MD5:
       00 E9 B6 7A A2 85 ED C7 34 08 36 98 17 FE 4E 26
       data hash MD5: 16K
       E6 9F E4 68 7F 05 DE 15 51 87 90 5B 34 85 E5 C2>)
$$ ##END=
$$ 
$$ hash MD5
$$ 21 B7 04 0C F2 D3 1F C7 84 4C 3C 0E 38 92 E5 FE
##$RELAX= 
##$RELAX= 
##$RELAX= 
##$RELAX= 
##$RELAX= 
##$RELAX= 
$$ Bruker specific parameters
$$ --------------------------
##$DU= <F:/spectra>
##$EXPNO= 1
##$NAME= <H-F>
##$PROCNO= 1
##$TYPE= <nmr>
##$USER= <she>
##$AMP= (0..31)
100 100 100 100 100 100 100 100 100 100 100 100 100 100 100 100 100 100 
100 100 100 100 100 100 100 100 100 100 100 100 100 100 
##$AQSEQ= 0
##$AQ_mod= 1
##$AUNM= <au_zg>
##$AUTOPOS= <>
##$BF1= 200.13
##$BF2= 200.13
##$BF3= 200.13
##$BF4= 200.13
##$BF5= 200.13
##$BF6= 200.13
##$BF7= 200.13
##$BF8= 200.13
##$BYTORDA= 1
##$CFDGTYP= 0
##$CFRGTYP= 5
##$CHEMSTR= <none>
##$CNST= (0..31)
1 1 145 1 1 1 1 1 1 1 1 1 1 1 1 1 1 1 1 1 1 1 1 1 1 1 1 1 1 1 1 1 
##$CPDPRG= <>
##$CPDPRG1= <>
##$CPDPRG2= <>
##$CPDPRG3= <>
##$CPDPRG4= <mlev>
##$CPDPRG5= <mlev>
##$CPDPRG6= <mlev>
##$CPDPRG7= <mlev>
##$CPDPRG8= <mlev>
##$CPDPRGB= <>
##$CPDPRGT= <>
##$D= (0..31)
0 1.2 0 0 0 0 0 0 0 0.06 0 0.03 0 0 0 0 0.0002 0 0 0 0 0 0 0 0 0 0 0 0 
0 0 0 
##$DATE= 1681208318
##$DBL= (0..7)
120 120 120 120 120 120 120 120 
##$DBP= (0..7)
150 150 150 150 150 150 150 150 
##$DBP07= 0
##$DBPNAM0= <>
##$DBPNAM1= <>
##$DBPNAM2= <>
##$DBPNAM3= <>
##$DBPNAM4= <>
##$DBPNAM5= <>
##$DBPNAM6= <>
##$DBPNAM7= <>
##$DBPOAL= (0..7)
0.5 0.5 0.5 0.5 0.5 0.5 0.5 0.5 
##$DBPOFFS= (0..7)
0 0 0 0 0 0 0 0 
##$DE= 6
##$DECBNUC= <off>
##$DECIM= 32
##$DECNUC= <off>
##$DECSTAT= 4
##$DIGMOD= 1
##$DIGTYP= 9
##$DL= (0..7)
0 120 120 120 120 120 120 120 
##$DP= (0..7)
150 150 150 150 150 150 150 150 
##$DP07= 0
##$DPNAME0= <>
##$DPNAME1= <>
##$DPNAME2= <>
##$DPNAME3= <>
##$DPNAME4= <>
##$DPNAME5= <>
##$DPNAME6= <>
##$DPNAME7= <>
##$DPOAL= (0..7)
0.5 0.5 0.5 0.5 0.5 0.5 0.5 0.5 
##$DPOFFS= (0..7)
0 0 0 0 0 0 0 0 
##$DQDMODE= 0
##$DR= 18
##$DS= 0
##$DSLIST= <SSSSSSSSSSSSSSS>
##$DSPFIRM= 0
$$ [...]
##$SUBNAM2= <"">
##$SUBNAM3= <"">
##$SUBNAM4= <"">
##$SUBNAM5= <"">
##$SUBNAM6= <"">
##$SUBNAM7= <"">
##$SUBNAM8= <"">
##$SUBNAM9= <"">
##$SW= 18.05172834244
##$SWIBOX= (0..15)
0 0 2 0 0 0 0 0 0 0 0 0 0 0 0 0 
##$SW_h= 3612.71676300578
##$TD= 16384
##$TD0= 1
##$TE= 0
##$TE2= 300
##$TE3= 300
##$TEG= 300
##$TL= (0..7)
0 120 120 120 120 120 120 120 
##$TP= (0..7)
150 150 150 150 150 150 150 150 
##$TP07= 0
##$TPNAME0= <>
##$TPNAME1= <>
##$TPNAME2= <>
##$TPNAME3= <>
##$TPNAME4= <>
##$TPNAME5= <>
##$TPNAME6= <>
##$TPNAME7= <>
##$TPOAL= (0..7)
0.5 0.5 0.5 0.5 0.5 0.5 0.5 0.5 
##$TPOFFS= (0..7)
0 0 0 0 0 0 0 0 
##$TUNHIN= 0
##$TUNHOUT= 0
##$TUNXOUT= 0
##$USERA1= <user>
##$USERA2= <user>
##$USERA3= <user>
##$USERA4= <user>
##$USERA5= <user>
##$V9= 5
##$VALIST= <valist>
##$VCLIST= <CCCCCCCCCCCCCCC>
##$VD= 0
##$VDLIST= <DDDDDDDDDDDDDDD>
##$VPLIST= <PPPPPPPPPPPPPPP>
##$VTLIST= <TTTTTTTTTTTTTTT>
##$WBST= 1024
##$WBSW= 4
##$XGAIN= (0..3)
0 0 0 0 
##$XL= 0
##$YL= 0
##$YMAX_a= 94602
##$YMIN_a= -143450
##$ZGOPTNS= <>
##$ZL1= 120
##$ZL2= 120
##$ZL3= 120
##$ZL4= 120
##$ABSF1= 10
##$ABSF2= 0
##$ABSG= 5
##$ABSL= 3
##$ALPHA= 0
##$AQORDER= 0
##$ASSFAC= 0
##$ASSFACI= 0
##$ASSFACX= 0
##$ASSWID= 0
##$AUNMP= <proc_1d>
##$AZFE= 0.1
##$AZFW= 0.1
##$BCFW= 1
##$BC_mod= 2
##$BYTORDP= 1
##$COROFFS= 0
##$CY= 11.3945322036743
##$DATMOD= 1
##$DC= 2
##$DFILT= <>
##$DTYPP= 0
##$F1P= 2.36226072786647
##$F2P= -0.459571619588291
##$FCOR= 0.5
##$FTSIZE= 0
##$FT_mod= 4
##$GAMMA= 1
##$GB= 0.15
##$INTBC= 1
##$INTSCL= 1
##$ISEN= 128
##$LB= 0.24
##$LEV0= 0
##$LPBIN= 0
##$MAXI= 10000
##$MC2= 0
##$MEAN= 0
##$ME_mod= 0
##$MI= 1.114404
##$NCOEF= 0
##$NC_proc= 0
##$NLEV= 6
##$NOISF1= 3.799351
##$NOISF2= 2.8
##$NSP= 1
##$NTH_PI= 0
##$NZP= 0
##$OFFSET= 15.70392
##$PC= 1
##$PHC0= -19470.32
##$PHC1= 4.6008
##$PH_mod= 1
##$PKNL= yes
##$PPARMOD= 0
##$PSCAL= 0
##$PSIGN= 0
##$REVERSE= no
##$SF= 200.130013532006
##$SI= 16384
##$SIGF1= 3
##$SIGF2= 2
##$SINO= 400
##$SIOLD= 16384
##$SREGLST= <1H.CDCl3>
##$SSB= 0
##$STSI= 0
##$STSR= 0
##$SW_p= 3612.71676300578
##$SYMM= 0
##$S_DEV= 0
##$TDeff= 0
##$TDoff= 0
##$TI= <>
##$TILT= no
##$TM1= 0
##$TM2= 0
##$TOPLEV= 0
##$USERP1= <user>
##$USERP2= <user>
##$USERP3= <user>
##$USERP4= <user>
##$USERP5= <user>
##$WDW= 1
##$XDIM= 8192
##$YMAX_p= 0
##$YMIN_p= 0
$$ End of Bruker specific parameters
$$ ---------------------------------
##NTUPLES= NMR FID
##VAR_NAME=  TIME,          FID/REAL,        FID/IMAG
##SYMBOL=    X,             R,               I
##VAR_TYPE=  INDEPENDENT,   DEPENDENT,       DEPENDENT
##VAR_FORM=  AFFN,          ASDF,            ASDF
##VAR_DIM=   8192,          8192,            8192
##UNITS=     SECONDS,       ARBITRARY UNITS, ARBITRARY UNITS
##FACTOR=    0.0002768,     1,               1
##FIRST=     0,             0,               0
##LAST=      2.2672688,     0,               0
##MIN=       0,             -143450,         0
##MAX=       2.2672688,     94602,           0
$$ Real data points
##PAGE= N=1
##DATA TABLE= (X++(R..R)), XYDATA
0@%%%%%%%%%%%%%%qJ6j6J6j6K4l2L2m0M8n6O9p7Q8j04J20j36J54j78K04k29K58
$$ 0 0 0 0 0 0 0 0 0 0 0 0 0 0 0 -8 8 -8 8 -8 16 -16 16 -24 24 -32 37 -40 48 -56 64 -72 82 -96 108 -121 137
36A37k90L26l65M07m54N04n60O22o88P61q41R27j022J126j241J368j507J662j833
$$ 137 -153 173 -192 215 -239 265 -295 327 -361 400 -441 486 -536 590 -651 717 -790 872 -961
55i61K026k248K499k789L128l531M020m625N402o437P894j0118J3963k2488P9371
$$ -961 1065 -1183 1316 -1473 1655 -1876 2144 -2481 2921 -3516 4378 -5740 8223 -14265 65106
70F5106m0899j04759M6533l3928q66P3146M9555j043L2694m3322r1949j7858K0114
$$ 65106 24207 -80552 -34019 -67947 -68813 4333 53888 52845 85539 42217 -49732 -67590 -47476
83d7476j4479M7439P5447J1983j3336k1684p9442l9875L8914J1672J09P5803M9527
$$ -47476 -61955 -14516 60931 72914 59578 37894 -41548 -81423 -42509 -30837 -30728 45075 94602
96I4602l7707m2489l9436n4249J1908N4334J5359K9438N2145k9090o5229j1786
$$ 94602 56895 14406 -25030 -79279 -67371 -13037 2322 31760 83905 54815 -10414 -22200
108b2200j9977l4026M2101O2078P773J7329J5074o0790o0937N331O003M706N0722
$$ -22200 -42177 -76203 -34102 27976 35749 53078 68152 7362 -53575 -48244 -42241 -37535 13187
121A3187L9451k920m900k8800o0316j8512K2129J5272L6734M8739o383l2475j3581
$$ 13187 52638 49718 44818 16018 -44298 -62810 -40681 -25409 11325 60064 53681 21206 7625
134G625l3713l7197J9956L6603J4947L1652K3398l2958m0135j6821k4199p11M6330
$$ 7625 -26088 -63285 -43329 -6726 8221 39873 63271 30313 -9822 -26643 -50842 -51553 -5223
147e223L1774N837J5582j0227m9405k6475q71m535K5231N0167J4269j1425o708
$$ -5223 26551 32388 47970 37743 -11662 -38137 -39008 -43543 -18312 31855 46124 34699 27991
160B7991l0506m0629m86J7630J2976L3182K8415j1815k0461j7067l4781j6214
$$ 27991 -2515 -43144 -43630 -26000 -13024 20158 48573 36758 16297 -770 -35551 -51765
172e1765K6464K5497J6115K6210O97l3113k2079j4238j9254J2435L9013J9160
$$ -51765 -25301 196 16311 42521 43218 10105 -11974 -26212 -45466 -33031 5982 25142
184B5142P437P309k3495l6754j1560j610L955L0815L0287J083m681j0026l2621
$$ 25142 32579 39888 16393 -20361 -31921 -33531 -29576 1239 31526 32609 27928 17902 -14719
197a4719k3567O225J1517J8668L1247J0131j6726j4604j8210k5669p56K2725J8124
$$ -14719 -38286 -32061 -20544 -1876 29371 39502 22776 8172 -10038 -35707 -36463 -13738 4386
210D386J8620J5333j1575k5478j5758j4795o836K0238K7196J2307P201l789k4913
$$ 4386 23006 38339 26764 1286 -14472 -29267 -36103 -15865 11331 23638 30839 27050 2137
223B137k2548o943k097J1830K8969J7884j860o052j6814k5509j0243P441J1089
$$ 2137 -20411 -27354 -29451 -17621 11348 29232 27372 21320 4506 -21003 -31246 -23805 -12716
236a2716K0452K2090K29j4604j4599j8529j4146O843J7968J6554J5910M952j4730
$$ -12716 7736 29826 30055 15451 852 -17677 -31823 -24980 -7012 9542 25452 30404 15674
249A5674j9438j3943j0114K725J9436J8928J0540L818j1559k2496j4199l971K089
$$ 15674 -3764 -17707 -27821 -25096 -5660 13268 23808 27626 16067 -6429 -20628 -24599 -22510
262b2510J5526K2420R995k069r212j8596j8094k479P684J2271J8942J2993m040
$$ -22510 -6984 15436 25431 23362 14150 -4446 -22540 -25019 -17335 -5064 13878 26871 22831
275B2831j3172j4549j5834n677J0239J5056J4424J1299j672j4947j6239j1147
$$ 22831 9659 -4890 -20724 -26401 -16162 -1106 13318 24617 22945 7998 -8241 -19388
287a9388m781P915J7203J4467P416k085j3577j6795j0420j994P414J6330J5270
$$ -19388 -24169 -16254 949 15416 22832 20747 7170 -9625 -20045 -22039 -14625 1705 16975
300A6975N021l634j1899j6491j1176M77Q820J4140J4220N822n698j2163j4413
$$ 16975 21996 18362 6463 -10028 -21204 -20727 -11907 2233 16453 22275 16577 4414 -9999
313i999j0958J94J0783J4277J2244M755n593j3332j3499q798Q27J0030J4280J1634
$$ -9999 -20957 -20763 -9980 4297 16541 21296 15703 2371 -11128 -19926 -19099 -9069 5211 16845
327A6845L511o375j2796j3111p804J918J0333J3804J0410K786o579j2964j2261
$$ 16845 20356 13981 1185 -11926 -19730 -17812 -7479 6325 16735 19521 12942 -22 -12283
340a2283o836K229J1099J3063R754J785p619j2757j1488m975K687R996J3355Q597
$$ -12283 -19119 -16890 -5791 7272 17026 18811 11192 -1565 -13053 -18028 -15341 -5345 8010 16607
354A6607Q76p225j2227j1738m318M408R799J2341Q466n51p967j0786j1026m618
$$ 16607 17483 10258 -1969 -13707 -18025 -13617 -3818 8523 16989 16438 8471 -2315 -13341 -17959
368a7959N529J0354J0465Q053J7r266j1936q291l861M590J1440J0405N611J55
$$ -17959 -12430 -2076 8389 16442 16459 7193 -4743 -13034 -16895 -12305 -865 9540 15151 15306
382A5306q522j2708p482j562L671J0797J1618M259k258o922j1849r004M7N485
$$ 15306 6784 -5924 -13406 -14968 -11297 -500 11118 15377 13119 6197 -5652 -14656 -14609 -9124
396i124Q426J1229N433l861p989r541r217m41P762Q715Q432N769l396j0351p932
$$ -9124 -698 10531 15964 12103 4114 -5427 -14644 -15085 -7323 1392 9824 15593 12197 1846 -6086
411f086o454k156P103J1163O691L528j625j0526j0338l394k74M712J0972Q216
$$ -6086 -12540 -14696 -7593 3570 10261 13789 12164 1638 -8700 -12094 -12368 -7656 3316 11532
425A1532J081k513p506j1189n147K966N116Q482R588J207o197o494q183o601K352
$$ 11532 12613 10100 2594 -8595 -13742 -10776 -5660 2822 12410 13617 7420 926 -7257 -13858 -11506
440a1506Q073O815P204L544o679q939n787m788L85Q505Q874M357K031l745j0127
$$ -11506 -3433 3382 10586 14130 7451 -1488 -7275 -12063 -11678 -3173 5701 10058 12089 8344 -1783
455a783p204k025L94O812J0488M691j614l183p777q891j521L338N172Q950O257
$$ -1783 -8987 -11012 -10618 -3806 6682 11373 9759 6576 -1201 -10092 -11613 -8275 -3103 5847 12104
470A2104k331n633n213p417m245N339O912N476N998J77p837o414m422m348L074
$$ 12104 9773 4140 -1073 -8490 -12735 -7396 -484 4992 10990 11167 3330 -3084 -7506 -11854 -8780
485h780R389O465K421R27o006r248l917p13J530Q069Q620J046k075l388q236o279
$$ -8780 609 7074 9495 10422 4416 -4832 -8749 -9462 -7932 137 8757 9803 7728 4340 -3896 -10175
501a0175J165L558N096P943L266l970m563n323p054k04O102M883N790M427k907
$$ -10175 -9010 -5452 -356 7587 10853 6883 2320 -3003 -10057 -10261 -4159 724 6514 10941 8034
516H034p786m185m400j990O041P713L241J975n21p343p199j324j28K842P840N619
$$ 8034 248 -3937 -8337 -10327 -4286 3427 6668 8643 8122 779 -6420 -7744 -7872 -5030 2810 8429
532H429n40j623m747p940k733K435L121N588O777M00m339m187o032m298K472N571
$$ 8429 7889 6266 1519 -6421 -9154 -6719 -3598 1990 8767 9167 4828 641 -5391 -9689 -7217 -1646
548a646M539M744J575m802n786l889l231R01O324N045K851J710k854p624m505
$$ -1646 2893 7637 9212 4410 -1376 -5265 -8496 -7595 -1271 3774 6625 8335 5481 -2143 -6648
563f648n56K76M609P266L077j662k019n164o692o10L260L404N358M547j422m587
$$ -6648 -7204 -6928 -2319 4947 8024 6362 4343 -821 -7513 -8123 -4863 -1459 3899 8446 7024 2437
579B437l753m672k679L811M972L605L562J24n112m985k888k033J984O260M573
$$ 2437 -1316 -5988 -8667 -4856 116 3721 7283 7407 2295 -2690 -5578 -7611 -5627 633 5206
594E206J369L04m273o264k633l7J176N430N819M28j538k006n858m777J482L010
$$ 5206 6575 6879 2606 -3658 -6291 -6328 -5152 278 6097 6525 4987 2981 -2877 -7654 -6172 -3162
610c162K982N670K435l260l742k893m870m61M690M134L142K561k136n404l086
$$ -3162 -180 5490 7925 4665 923 -1970 -6840 -7301 -2611 1523 4665 7226 5090 -314 -3400
625c400k281j217L864N522K184J348o43n139m753p64m98K255N917L629p80j187
$$ -3400 -5681 -6898 -3034 2488 4672 6020 5377 238 -4515 -5279 -5777 -3522 2395 6024 5244 4057
641D057l216n369j990J777K183M113M681j54l278k705l596l289J766M141L080
$$ 4057 841 -4528 -6518 -4741 -2558 1555 6236 6082 2804 99 -3497 -6786 -5020 -879 2201
656B201K772J523l516m099k371k421L25M588M286J721N17k142m720l324m18L56
$$ 2201 4973 6496 2980 -1119 -3490 -5911 -5586 -998 3288 5009 5526 3384 -1336 -4660 -5078 -4722
672d722L573M751K059j201j579l826m151m03K278K226L831K942j128l013k526
$$ -4722 -1149 3602 5661 4460 2881 -945 -5096 -5499 -3221 -995 2836 5778 4650 1637 -889
687h89l337j960K829L599K602K186J72l798l425j942j435J873M398K817P31K47
$$ -889 -4226 -6186 -3357 242 2844 5030 5202 1404 -2021 -3963 -5398 -3525 873 3690 4421 4668
703D668k953m563j477L14O05L738L828O25j310j730l915l077J012K289K230L319
$$ 4668 1715 -2848 -4325 -4011 -3406 332 4160 4785 3475 1745 -2170 -5247 -4235 -1946 284 3603
719C603J575k096k304k665k866j00K979K715K399J607j077l959k467j683l17K877
$$ 3603 5178 3082 778 -1887 -4753 -4853 -1874 841 3240 4847 3770 -189 -2656 -4339 -4656 -1779
735a779L155J958P64m12l673l179q12J70J640L727K536j57j169k477l450r67P53
$$ -1779 1376 3334 4098 3686 13 -3166 -3978 -3808 -2168 1559 4095 3938 2769 292 -3158 -4125 -3372
752c372J938K780K828J37k124k135l080j407J074K596K543J772O29k166k735k477
$$ -3372 -1434 1346 4174 4311 2187 52 -3028 -4435 -3361 -765 1778 3550 4179 2013 -722 -3199
768c199q80Q12K468K928J354K67j448l136k402m76P45K358K838J398m05j580k774
$$ -3199 -4079 -3267 -799 2129 3483 3750 2302 -834 -3236 -3712 -2967 -609 2229 3627 3222 1642 -1132
785a132k639j2J485K236K208J629k68k348j993k580l88J417K626K059J344m85
$$ -1132 -3771 -3783 -2298 -62 2146 3775 3507 1159 -834 -3414 -3802 -2385 241 2300 3644 3159
801C159k214k494j490n11J367K787J798R01l56j784k841j735K76J231K287K111
$$ 3159 945 -1549 -3039 -3550 -2183 604 2402 3303 2947 1163 -1678 -3413 -3137 -1906 381 2492
817B492Q36p17j902k288j383o4J445K102K206O06j007j968k114j485N21J356K160
$$ 2492 3328 2611 709 -1579 -2962 -3026 -1581 521 2727 3333 2326 358 -1756 -3241 -2720 -1364 796
834G96J647Q24j077k348j700j090J87J552K193J621N42j150k064k061r38M15J555
$$ 796 2443 3267 2190 -158 -1858 -2948 -2761 -1209 984 2605 3147 1997 -67 -2128 -3066 -2651 -1096
851a096K375J184M75j368j769j661j092O07J341K340J306R9r66k231j908k73M06
$$ -1096 1279 2463 2938 1570 -199 -1860 -2952 -2345 -1004 1336 2642 2741 1775 -456 -2364 -2637 -2231
868b231J693J975J361j82j128j900j877m51P17J550J935J137R5j803j433j703
$$ -2231 -538 1437 2798 2616 1488 -412 -2289 -2740 -2023 -473 1462 2599 2694 891 -542 -2245
884b245l99R22J507J614J354k77j523j733j518l70O15K177J569P43k72j486j697
$$ -2245 -2644 -1722 -215 1399 2753 2476 953 -780 -2298 -2668 -2053 124 1693 2436 2164 678 -1019
901a019r57l14P04J666J908M35k78j171k056j322J12J102J342J745P95m96j795
$$ -1019 -1976 -2290 -1586 80 1988 2423 2145 974 -1082 -2404 -2292 -1190 152 1897 2692 2196 401
918D01j287j494J78J330J441R04J052n73j800j385r18l18J482J793P25M82o8j739
$$ 401 -886 -2380 -2202 -872 569 1473 2525 1952 152 -1233 -2151 -2469 -987 806 1531 2013 1945 206
936B06j872l81NQ67J873J152K55o45j073j927p22M90J019J470J574k95r65q30
$$ 206 -1666 -2047 -2042 -1175 698 1850 2105 1460 387 -1540 -2262 -1772 -753 717 2291 1996 1031 201
954B01j379j075M07J590R35J168N91j219j612j132m13R2J499J414P34L06p75j852
$$ 201 -1178 -2253 -1846 -256 679 1847 2438 1219 -393 -1525 -1938 -1846 -347 1067 1801 2107 1332 -520
972e20j155j97J5J374J783N43j04r20j033j693l9M99Q56J571J311n60r78j008
$$ -520 -1675 -1872 -1857 -483 1300 1843 1739 819 -214 -1907 -1946 -1447 -591 980 2291 1731 753 -255
990b55j272p98R76J264R48J045J5j438j066o26o29L74J771J038J42M32j343j473
$$ -255 -1527 -2325 -1349 -85 863 1908 1923 485 -581 -1207 -1836 -1462 309 1347 1489 1921 578 -895
1008h95p20J54J26J155J685M3k11m82j566j165M58N80R14J250P31j131o68p80
$$ -895 -1615 -1461 -1335 -180 1505 1548 1337 855 -711 -1876 -1418 -838 76 1326 2057 926 258 -522
1026e22j199j77J146J044P51R80o80j363q58o98j08J161J014M86N99j80j303j338
$$ -522 -1721 -1898 -752 292 1043 2023 1343 -20 -878 -1576 -1684 -523 491 977 1576 1396 93 -1245
1044a245L3K6L18J746P14o70%l86j727o54Q75L89Q66J238q9p48n57j196p53P26
$$ -1245 -1212 -1186 -868 878 1592 922 922 536 -1191 -1845 -970 -581 285 1523 1434 686 129 -1067 -1820 -1094
1064a094R74N14J043J02r10j203n00m03%J435R81N7L53k42j781k89l81J9J162
$$ -1094 -120 394 1437 1539 629 -574 -1074 -1477 -1477 -42 939 996 1349 1107 -674 -963 -1344 -1325 -163
1083a63J173L51k83k96r53j225J94L20O45J043P91n85o50p03r58o1J011N14L81
$$ -163 1010 1361 1078 782 -171 -1396 -1202 -882 -237 806 1597 1012 362 -341 -1299 -1360 -349 165 546
1102E46R71k00j073o76l86p58P68J162N68J51P3q10j011l88j0J42J121R95J64
$$ 546 1517 1317 244 -432 -818 -1576 -808 354 922 1073 1146 336 -675 -1063 -1073 -931 190 1185 1349
1121A349m84k91j056q36L35K92N82J481r7n75o37l54q70k33R79N52Q66K66l90
$$ 1349 865 574 -482 -1318 -983 -691 -109 1372 1275 700 63 -291 -1161 -1394 -415 137 1003 1269 879
1140H79j105k72m47l60R83Q42M43K81q8j194j025R6r4P07R36N07l34J17n75j044
$$ 879 -226 -498 -945 -1305 -322 520 963 1244 1156 -38 -1063 -967 -1061 -354 582 1089 755 872 297 -747
1160g47j29O3N93N63P68jp01m81n10n86K32Q44K34Q38J39n15p37n71k98k00J041
$$ -747 -876 -813 -220 343 1111 1110 409 -72 -582 -1168 -936 -92 142 980 1119 604 -133 -704 -1002 -1202 -161
1181a61N45O68k9o61o43m25j95n8Q89O84K67m1l22r23p02Q6L08Q22N03M28o09
$$ -161 384 1052 1023 362 -281 -706 -901 -959 -70 614 881 840 518 -405 -1107 -1021 -713 109 612 1040 431
1202D31j17m35m84k41O78K98M17M13n7o59o06l36k56M88P05L63J05j43l64q68
$$ 431 314 -121 -605 -846 -168 130 547 960 903 244 -362 -698 -954 -466 239 602 707 564 200 -668
1222f68r0R3J09M57N66J93r0l82p14n27L28L16N93N37N7m38q0p95l88J53O11O11
$$ -668 -758 -665 -556 -99 467 660 570 188 -526 -1053 -725 -409 184 721 778 340 260 -535 -923 -770 -159 452
1244D52P1L72l45o87l24n28M13L16O40L39k39L7n31o69r7K98K44N61L73l0m91
$$ 452 523 895 550 -137 -461 -989 -576 -260 380 719 480 517 -14 -683 -780 -482 -238 323 696 666 175
1265A75j88o72qL55L74L02K94l5l10k68m45n33L43L57N36M51m8m28o60n27J24
$$ 175 -13 -685 -693 -338 36 338 632 597 287 19 -426 -959 -616 -259 277 728 680 252 -408 -935 -811
1286h11N54J13M79L36J7k88o49m55J33M2N71M76r6R9m04l49l29L8J93K93M14K00
$$ -811 -257 -144 335 671 688 400 -249 -704 -571 -529 42 518 422 521 117 -232 -561 -523 -330 -37 377 577
1308E77k79j8m46k84j48J99Q7O06L41J0p10k92j29q6J32M70K26L64j12n39k21
$$ 577 298 280 -166 -450 -598 -399 -312 294 635 645 -65 -357 -486 -572 -440 30 256 620 508 -31 -252
1329b52p3k26JO25N28J9l34n14m1k33J09K61L32J47K08l31j85l55q7K4L00L04
$$ -252 -325 -551 -550 75 603 622 288 -226 -267 -500 -391 -130 202 349 557 226 41 -314 -401 -377 -77 227
1351B27Q8K09K1o46k91j01q4L49N39R5M3j35k82l51p0MK62K60J34J09j54l33k21
$$ 227 315 524 545 -101 -392 -493 -577 -228 311 406 449 314 32 -319 -389 -385 -123 137 271 380 226 -107 -328
1374c28r9J0J57O21R1j29L4m46l57p2K41L35R1J51L65n69l33jk86M15J28J24J97
$$ -328 -427 -417 -260 361 452 323 357 -89 -446 -518 -277 58 149 300 665 96 -237 -238 -524 -109 19 143 340
1397C40K45n31k29k58K0K47J53J73K31j03r5k55k81N0m4L62K91M1J75m21l30j34
$$ 340 585 54 -175 -433 -413 -166 -13 160 391 288 193 -62 -343 -293 -337 25 316 357 532 111 -219 -353
1419c53r0K25L91J80m2Q3j39o47k36L16o7M02K12JN8j00k41k64j22R7M71K49J46
$$ -353 -443 -218 173 353 311 394 255 -392 -628 -312 -379 23 235 236 294 194 -47 -311 -433 -336 135 384 530
1442E30l67j80l79q3J14K54K47P8n7Kj53n50J47J86rN38k5r8j41m0l73J88j88
$$ 530 163 -17 -396 -479 -365 -111 136 214 157 159 6 -544 -397 -211 -220 318 293 195 54 14 -359 -171 -359
1465c59L24J93N0L0Mj86k89m82M37L82L4K44J9n58K16l61N6P0L5L25J38n6q3l01
$$ -359 -35 158 208 238 242 56 -233 -715 -278 104 138 382 401 -157 59 -302 -246 -176 -141 184 322 266 183 -118
1489a18j52N2l9J93M40j63j81J72k52k48o4L0L13K97q5Kr9j21k59N1J91P7KK81
$$ -118 -270 -218 -257 -64 376 213 32 204 -48 -296 -360 -330 -17 280 195 197 98 -23 -282 -231 -40 37 39 320
1513C20j44j4m31J5k12L89K24n9J18K35m20j86p4l0m3O65r0Jj94m1o1k92J96O2
$$ 320 176 162 -269 -254 -466 -77 147 88 206 441 21 -165 -239 -269 -312 353 263 264 70 29 -32 -324 -128 -66
1537f6O7L54l7m10R8J57n49R5M25m6K8m1J82j60l73P6j39M00j69L10J68n8n20
$$ -66 1 355 318 -92 6 163 -386 -291 134 88 116 75 257 97 -276 -200 -339 61 -108 202 370 312 -208
1560b08j92K02OR8J00N6L1k39J59l31NJ13P9K12L13m51r0Q2j72l5K9L35j6J73
$$ -208 -400 -198 -192 -94 6 62 93 -146 13 -318 -313 -200 -121 91 404 -47 -137 -55 -227 -262 -233 102 86 259
1584B59l6j30m4k25k61K38K82M6m2j1J04j48l92J12R9j87L45N7P7j79k25J73m1
$$ 259 223 93 49 -176 -437 -199 83 129 87 76 180 32 -360 -248 -149 -336 9 66 143 -36 -261 -88 -129
1607a29J7J31O5M6l3j12k50J81l7J73k21p2K84m2L12k08m65J44M02j11j53L62
$$ -129 -112 19 84 130 97 -15 -265 -84 -121 52 -169 -241 43 1 313 105 -360 -216 186 75 -78 284
1629B84j37j01k81j6O3K54j9J18nk35J6k41J55j9O6M6l2J81N0j47j21j94K27N9
$$ 284 147 46 -235 -251 -188 66 47 165 160 -75 -59 -300 -145 -164 -98 -52 -84 97 147 0 -121 -315 -88 -29
1653b9R1J29n9n8P2k79J71k63Q1L50k2j74j23K64l18J29j62K46J9k15J70j01p8
$$ -29 62 191 132 74 146 -133 38 -225 -144 206 184 10 -113 151 -167 -38 -200 46 65 -150 20 -81 -159
1676a59J15j41L30j41p1J96j55J31l29K3O1j80J76L01J84j70n6k34m7r7L1L38
$$ -159 -44 -185 145 4 -67 129 -26 105 -224 -201 -140 -320 -144 157 341 171 115 -119 -166 -263 -232 106
1698A06j7R3j12N1M5j96j16J48l2Q4k22L1J59L2j11Q2k52L14N6K45l93J49l31
$$ 106 89 182 70 121 166 -30 -146 2 -30 54 -168 -137 22 54 -57 25 -227 87 143 388 -5 144 -187
1721a87n5J73J61j93Q3J23j54L97m28n6j53L4K00J63J17J1k21j78J79r0L1J88
$$ -187 -242 -69 92 -101 -18 105 -49 348 -80 -136 -289 -255 -55 108 225 236 15 -163 16 -74 -43 145
1743A45k03J87K6p7k96J47p3K11j93P9L08l74J08k16l7J65P8J72Jp5j20J48k92
$$ 145 -58 129 155 78 -218 -71 -144 67 -126 -47 261 -113 -5 -221 -258 -93 -15 157 158 83 -37 111 -181
1766a81Q0l3J2L02M7k13J19o5m0k66J37K59j76N1K04j35m4J14m44K76L2K31k56
$$ -181 -101 -134 -122 180 227 14 133 68 28 -238 -101 158 -18 33 237 102 58 172 -272 4 36 267 11
1789A1qN4l59J84J74k72K44K03o0J7j2l27K3L73j53k69L04m8j84J45p3j0Q3R8
$$ 11 3 57 -302 -118 56 -216 28 231 171 188 176 -151 -128 245 92 -177 127 79 -105 40 -33 -43 40 138
1813A38l71J95j8m3j7L39j58q6n3m3L51J09m00P9N8m4o1q8mJ93n3J83j18l6j91
$$ 138 -233 -38 -56 -99 -116 223 65 -21 -74 -117 234 343 -57 22 80 36 -25 -113 -117 76 23 206 88 52 -139
1838a39P9Q0n5L23j31j06j0k90J68J07j16J98j47J14N0j63j42K30k39K54l56O2
$$ -139 -60 20 -35 288 157 51 41 -249 -81 26 -90 108 -39 75 125 -38 -180 50 -189 65 -291 -229
1860b29L03n9j79J66K8lj84J74l0j22L15l41n5l4L27J50j80J80ok89K4p4Q7r4
$$ -229 74 15 -164 2 30 27 -157 17 -13 -135 180 -161 -216 -250 77 227 47 227 221 -68 -44 -118 -31 -125
1884a25r5K27n7p4J80P1l05Q4J10P6j50J17Lk58L09P6l07J90j82J91k00L44k42
$$ -125 -220 7 -50 -124 56 127 -178 -94 16 92 -58 59 62 -196 113 189 -118 72 -110 81 -119 225 -17
1907a7l6j17P4O3J53J4j83LJ1J4m9J30p6M0R8j77k2l7K52k44K80j83N2j04j4K7
$$ -17 -53 -170 -96 -33 120 134 -49 -46 -35 -21 -70 60 -16 24 122 -55 -77 -114 138 -106 174 -9 43 -61 -75 -48
1933d8m3K39k55L5rK66k37J57j87J63J94m19J45m3P6j31M6O6R8m77L54j66J61
$$ -48 -91 148 -107 -72 -81 185 -52 105 -82 81 275 -144 1 -42 34 -97 -51 15 113 -364 -10 -176 -15
1956a5J82l12L52o7k28k8N7L8M10m80J54m0j97J89k31L92k89N4J75o9j49K52J8
$$ -15 167 -145 207 140 -88 -116 -59 -21 389 -91 63 23 -174 15 -216 176 -113 -59 116 47 -102 150 168
1979A68k96K45k07J29K1j34n3k2K7J30J29o8J20k27R5k0J18K72k26k88K02O0k53
$$ 168 -128 117 -90 39 60 -74 -127 -149 -122 8 137 69 189 -38 57 37 155 427 201 -87 115 175 -78
2002g8j28J80N4j07P7k44J2L35l2k23K20k42K20J35k3l35j10M50L1l7q1p3k26
$$ -78 -206 -26 28 -79 -2 -246 -234 101 69 -154 66 -176 44 179 156 -179 -289 161 192 155 74 1 -225
2025b25J9K53K58k83N3k47K54k79K34j30q6K87j51Q1P7k64M7J52M4q6j09K88j60
$$ -225 -206 47 305 22 75 -172 82 -197 37 -93 -179 108 -43 38 115 -149 -102 50 94 8 -101 187 27
2048B7J11k05l5J83j22O1k9J66k58J23j47j09K42j9L2k40K40k7k20J70p1J63j86
$$ 27 138 -67 -102 81 -41 20 -9 157 -101 22 -125 -234 8 -11 21 -219 21 -6 -226 -56 -127 36 -150
2071a50P7L1J4O1J7Q1L5l08L9j84K71Q8k59L17J4J20l00Q7l0j94K21j52K64j97
$$ -150 -73 -42 -28 33 50 131 166 -142 -103 -287 -16 72 -187 130 144 264 -36 51 21 -173 48 -104 160 -37
2095c7j31O4J08k6MP2O6Q5p5l17RN1P1O9rn5M3J32k99n1K69J16j85Rj18j32L46
$$ -37 -168 -104 4 -22 -18 54 120 205 130 -187 -178 -127 -56 13 4 -51 -8 124 -175 -226 43 159 -26 -17 -135 -267 79
2122G9k42M85l70K87J4r0j88j32O9J08o7j96J23j17K06R2j28M11m80K37j00L3
$$ 79 -163 322 -48 239 253 163 -25 -157 -88 20 -47 -243 -120 -237 -31 61 -67 344 -136 101 1 34
2144C4J48j55K7j68J72k02R4J41L7Q1k23M7J86j78O5j38M0K00k08J37J03K5k30
$$ 34 182 27 54 -114 58 -144 -50 91 128 209 -14 33 219 41 106 -32 8 208 0 137 240 265 35
2167C5k01M9rK23k74j5K06o8J4J59j60mj74K03N4Qj46mK5J67j35lm5P1K8J61r0
$$ 35 -166 -117 -126 97 -177 -192 14 -54 -40 119 -41 -45 -219 -16 38 46 -100 -104 -79 88 -47 -50 -95 -24 4 165 75
2194G5j65J37J02K7k06Q1j56J79j61L4L57k35n9m8r3J91j64J29j78J35j29K10
$$ 75 -90 47 149 176 -30 51 -105 74 -87 -53 304 69 10 -38 -131 60 -104 25 -153 -18 -147 63
2216F3m7k74J50L57k27l61N52k94J96r0M6K9k25P8Q9n7m1L5j76J75n0J19n2O3
$$ 63 16 -258 -108 249 22 -339 213 -81 115 25 71 100 -125 -47 42 -15 -56 -21 -197 -22 -72 47 -5 58
2240E8n4n5J35r3%J76k22J52k41m5L48l42J52j03K59j46M6q8j52K00k20K04L25
$$ 58 4 -51 84 -9 -9 167 -55 97 -144 -189 159 -183 -31 -134 125 -21 25 -63 -215 -15 -235 -31 294
2263B94m61J38Q9l0p1L69l98l9K73j68j8j79K65j68J27n5j86K80M4J06j51L1L8
$$ 294 -167 -29 60 30 -41 328 -70 -109 164 -4 -22 -201 64 -104 23 -32 -218 62 106 212 61 92 130
2286A30j43jJ26j70P4n1J1oJ15J02K4k12J2M4k03J68k5R0j55R3j7J19j36J68k37
$$ 130 -13 -14 112 -58 16 -35 -24 -30 85 187 211 -1 11 55 -148 20 -5 85 -70 23 6 125 -11 157 -80
2311h0P3r2K5o4N1L71j31J77m46J59Q8l19J14j31K61K2k22Q4K21j27j1k48J24
$$ -80 -7 -99 -74 -138 -87 284 153 330 -116 43 131 -188 -74 -205 56 78 -144 -60 161 34 23 -225 -101
2334a01K48j36J15n7k87M16q4L6p9j36r0P0J60q8n4j4o9K84k30o0J40K38j96k21
$$ -101 147 11 126 69 -218 198 114 150 71 -65 -155 -85 75 -13 -67 -81 -150 134 -96 -156 -16 222 26 -195
2358a95L34k83J62N2k27nN1K62j26Q5o7j0L0j53J26R7l59L12j49k10J88J51j02
$$ -195 139 -144 18 70 -157 -162 -111 151 25 110 43 33 63 -90 36 133 -226 86 -63 -273 -85 66 -36
2381c6L0K3q4J44jj62q3K93k13L23q4m1m8o9O9k7L5j93K81k66K84o5q6K41l49
$$ -36 -6 17 -67 77 76 -86 -169 124 -89 234 150 109 61 -8 61 34 69 -124 157 -109 175 110 24 265 -84
2406h4J87K28k68Q1q7o1R6kk1k42L60r3o9m1k85L13R5k16K12J84l44J09P3r8q4
$$ -84 103 331 63 144 57 -4 92 90 69 -173 187 94 25 -16 -301 12 107 -109 103 287 -57 52 125 27 -57
2431e7kK37j65j84J84o4R6k77N58l83P4j75J19O3Rk27j73M21m7L4J08m3l02J14
$$ -57 -59 178 13 -171 13 -51 45 -232 326 -57 17 -158 -39 24 33 -194 -367 54 7 41 149 106 -196 -82
2455h2J26p1J03j75Q0K2j73M2J48j68K6J75j0j99J41L98n00j6K83j65Mj84K94
$$ -82 44 -27 76 -99 -19 3 -170 -128 20 -148 -122 53 43 -156 -15 383 -117 -133 150 -15 -11 -195 99
2478I9j36J13j91j5N5k45M84l45P2N6j45K90J8j36l8R0j08K18k53J73K37l37j02
$$ 99 -37 76 -115 -130 -75 -320 164 -181 -109 -53 -198 92 110 -26 -64 26 -82 136 -117 56 293 -44 -146
2501a46K31l2j54q4K85q5R9j62J9K70Q1l97L2O3j84J21q7K18j5l09L89k14k8K70
$$ -146 85 53 -101 -185 100 15 114 -48 -29 241 322 -75 -43 20 -164 -43 -130 88 73 -236 153 -61 -89 181
2525A81q9k3j5K40n85J87j36K67j79Q9n5K05j88K17K4j54k3J2qn3J19p2J27j45
$$ 181 92 69 54 294 -291 -104 -240 27 -152 -63 -118 87 -101 116 140 -14 -37 -25 -33 -86 33 -39 88 -57
2549e7K19j77J76o2o6J23j20k24L40O5k98K65p8j39q7J59k15J64r4J5J16j03O0
$$ -57 162 -15 161 99 33 156 36 -188 152 217 -81 184 106 -33 -120 39 -176 -12 -106 -91 25 -78 -18
2572a8M6jj01L6J04J38M1j69r1j36j67J70M10j79j74Q1J92j21j94j48R7L56j58
$$ -18 28 27 -74 -38 66 204 245 76 -15 -151 -318 -148 262 83 -91 -10 182 61 -133 -281 -184 172 14
2595A4j62M22k21M4j82K04j81l9J73K4n4j7J80p1j98M7p4L20k34J70k00L64n78
$$ 14 -148 274 53 97 -85 119 -62 -101 72 96 42 25 205 134 -64 -17 -91 229 -5 165 -35 329 -249
2618b49K36q6K8R4J5K60l90L32k69j46jJ62mj43K21j06K63j83k02J77p1L4j30
$$ -249 -13 -99 -71 23 38 298 -92 240 -29 -175 -176 -14 -18 -161 60 -46 217 34 -168 9 -62 -28 -158
2641a58K37j09j4J6k87J75p5L39j74qp8J98j68L45j77L6j70O4j4m1q1K40k70J02
$$ -158 79 -30 -44 -28 -315 -140 -215 124 -50 -58 -136 62 -106 239 62 98 -72 -8 -22 -63 -144 96 -174 -72
2665g2l7K22J18k21RK5p8k4J5J59j89m6J52j20R5Q2j73O5j68M40l66Q5J71j14
$$ -72 -109 113 231 10 19 44 -34 -58 -43 116 -73 -119 33 -87 8 90 -83 -18 -186 254 -112 -27 144 30
2689C0j7N1K4j3k47J46O8n5L5p7q7P6M8J87l02mK68q3l0O3l5p5j56K69L2k33J91
$$ 30 13 64 88 75 -172 -26 42 -13 22 -55 -142 -66 -18 169 -133 -137 131 48 18 81 46 -29 -185 84 116 -117 74
2716G4K1j33J8j60Q2L26k80J59j71k51L25r9K13k17q3P4J02Q3L3rj92L61l53M6
$$ 74 95 -38 -20 -180 -98 228 -52 107 -64 -315 10 -89 124 -93 -176 -102 0 83 116 107 -85 276 -77 -31
2740c1K4r8O8N7q0n2J24J36j57J21J31o7j09j04l8K49m43J68Q6o3n1J20j76K00
$$ -31 -7 -105 -37 20 -60 -112 12 148 -9 112 243 176 67 -37 -75 174 -269 -101 -15 -78 -129 -9 -185 15
2764A5q6m6J59m7K5L1j38j50P3K7K89j69L3j09j53L42k6N8j97J00P1J3j87j38
$$ 15 -71 -117 42 -5 20 51 -87 -237 -164 -137 152 -17 16 -93 -246 96 70 128 -69 31 102 115 -72 -210
2788b10J77J56j76P1j52J06K50j15j90q2K89j34j27L7J09J26k12J96j40J08j55
$$ -210 -33 123 -53 18 -134 -28 222 107 -83 -165 124 -10 -137 -100 9 135 -77 119 -21 87 -68
2809f8p7L1J48J43k87K4o8K44j95M9L0L8j13J72j32L4K9o1q1K12M9j52o7j5J66
$$ -68 -145 -114 34 177 -110 -86 -154 90 -105 -56 -26 12 -101 71 -61 -27 2 -59 -140 72 121 -31 -98 -113 53
2834E3L0m6o4O6j00K81k16R4j45J16n7J0J78m25J89J59k90K52q5J03N0n7p3M8
$$ 53 83 37 -27 39 -61 220 4 98 -47 69 12 22 200 -225 -36 123 -167 85 0 103 153 96 23 71
2858G1j6j1j62J56L9p6k37K70r1p2J03q3j00L07k59K60l1o3O7j68n7k2K75k43
$$ 71 55 44 -118 38 77 1 -236 34 -57 -129 -26 -109 -209 98 -161 99 68 5 72 -96 -153 -175 100 -143
2882a43R6N0O3j16J22k35J59p2J14n6k61M61m09K29K5J24j6l02K67j61q8J43J02
$$ -143 -47 3 66 -50 72 -163 -4 -76 38 -18 -279 182 -227 2 27 151 135 -167 100 -61 -149 -6 96
2905I6j2Jn1q9Q5l22L64j5J23pLj73M6l4J13Jj06J59l46K82L5m39K44P3j19J78
$$ 96 84 85 34 -55 30 -292 72 57 180 173 176 3 49 15 128 129 23 182 -164 118 153 -286 -42 31 -88 90
2931I0Q4n8j13mJ53m72K66m1L42l29M1K09j4j53k68K28J48k2k32J61j56L73j80
$$ 90 174 116 3 -1 152 -320 -54 -95 247 -82 -41 168 154 1 -267 -39 109 87 -145 16 -140 233 53
2954E3J8j49J58j37J05j09J27J38l2k8r6K04j56j61J26n5j5LM2k52K60j05P1n9
$$ 53 71 -78 80 -57 48 -61 66 204 172 144 48 252 96 -65 61 6 -9 -6 36 -216 44 -61 10 -49
2978d9K27j71m0J76J41l74Lj13Q2J00J66k06JR4k49K40o5p6M5P2o7K65k15p0J44
$$ -49 178 7 -33 143 284 -90 -87 -200 -118 -18 148 -58 -57 37 -212 28 -37 -113 -68 4 -63 202 -13 -83 61
3003F1n6K04k79J0L06N1l42J93j14K21k64j6Ro9K95k46J26R9k14J53o0J18j64
$$ 61 5 209 -70 -60 246 297 -45 148 34 255 -9 -25 -16 -85 210 -36 90 189 -25 128 68 186 22
3026B2j47J31j89M4J53J54j36k5k2j5j88L59K32j51l54J45nM4L9r5L9L1j18l9
$$ 22 -125 6 -183 -139 14 168 32 7 -15 -30 -218 141 373 222 -132 13 8 52 91 -4 35 66 -52 -91
3050i1K19j26k44K43l38L92r8J53k72M2l1J10PK39j02k42L7k7JL8K3q6J32j28
$$ -91 128 2 -242 1 -337 55 -43 110 -162 -120 -151 -41 -34 205 103 -139 -102 -129 -128 -90 -67 -153 -21 -149
3074a49L53k24J45j33j31J46k24L77k59K77j8j90j8Q9r8J46M2j33r2J39k16J15
$$ -149 204 -20 125 -8 -139 7 -217 160 -99 178 160 -30 -48 41 -57 89 131 -2 -94 45 -171 -56
3096e6J06k40K89J6j04j83J96oK8O7r0J28j93L3M7j49K77k23l3L2J21k0k24J11
$$ -56 50 -190 99 115 11 -172 24 18 46 113 23 151 -42 -9 38 -111 166 -57 -90 -58 63 43 -181 -70
3120g0j41J76j37K23J53k42P0N8l15L46q0k39R1J19r6m5J0L07k66L64p2j86Q4
$$ -70 -211 -35 -172 51 204 -38 32 90 -225 121 41 -198 -107 12 -84 -129 -119 188 -78 286 214 28 112
3143A12k62K6O5R6q7J8N5j93L65k68k6N1J0N7j60J40K18l63O1q7j4N2K97j50j76
$$ 112 -150 -124 -59 37 -50 -32 23 -170 195 -73 -99 -48 -38 19 -141 -1 217 -146 -85 -172 -186 -134 163 13 -163
3168a63M70n1m03K04K15n43Q8K30r6qj27j75K83m5K12o2P5p1k09K05l9J69k69
$$ -163 307 256 -147 57 272 -271 -183 47 -49 -57 -184 -359 -76 -121 91 29 104 33 -176 29 -10 159 -110
3191a10lJ97j31jJ26J07j04l1l9j8N2K20k82j48M43j8l68j48L97n7j08J10p8j45
$$ -110 -113 84 -47 -48 78 185 81 50 11 -7 45 265 -17 -165 278 260 -108 -256 141 84 -24 86 8 -137
3215a37q1J90M0k05O3J63o4N7j58Q1o8k0M0K41k60J86k13J20J7J9O0p6J54q1j79
$$ -137 -218 -28 12 -193 -130 33 -31 26 -132 -51 -119 -139 -99 142 -118 68 -145 -25 -8 11 71 -5 149 68 -111
3240a11K10q5JK9L0j02O0j23J54j86J36J74j85N9r9L4j23K55l17N1oL64k15Q6
$$ -111 99 14 15 44 74 -28 32 -91 63 -123 13 187 2 61 -38 -4 -127 128 -189 -138 -144 220 5 91
3264I1l2R8j76r9L48o3K2o5k48K41K3r1m7k46M01k13k3J29k10M13m25K77J0m6
$$ 91 59 157 -19 -118 230 167 189 124 -124 117 140 49 2 -244 157 -56 -79 50 -160 253 -172 105 115 69
3288F9L70k19l37K59m0r0J7j82P6L4J00p0j62P4L26k96OP0R9J20k81K1P1k1k4
$$ 69 439 220 -117 142 102 12 29 -153 -77 -43 57 -13 -175 -101 225 -71 -65 5 104 224 -57 -36 35 14 -10
3313a0p2K00l51L43J41m36L57q2N3m64L72q5o9j9K58j81j20J70k37M00j04l31
$$ -10 -82 118 -233 110 251 -185 172 90 143 -321 51 -34 -103 -122 136 -45 -165 5 -232 168 64 -267
3335b67J61J25N4K12k92O0k35J13J00r5J76j57J53j69N3Llj50J23r8k5O7J45j9
$$ -267 -106 19 73 285 -7 53 -182 -69 31 -64 112 -45 108 -61 -8 -5 -8 -158 -35 -133 -158 -91 54 35
3359C5j1j08J16L2k18J09q0K4J15J74o5K7k73J61j12J10Q0L8m65J18L95k13m1
$$ 35 24 -84 32 64 -154 -45 -125 -101 14 188 123 150 -123 38 -74 36 116 154 -311 -193 202 -11 -52
3382e2O3N8k68K67P2k6q4N7p9k29M96q1p0n9l34K01Kl7R3m6L09j71j14k0q2R3
$$ -52 11 69 -199 68 140 114 30 87 8 -221 275 194 124 65 -269 -68 -66 -103 -10 -56 253 82 -32 -52 -134 -41
3408d1J50j22j07K1l3L2L81m04j54L28j40J29J6L2j62N2J9j70J99J47l29M48k02
$$ -41 109 -13 -120 -99 -132 -100 281 -123 -277 51 -89 40 56 88 -74 -22 -3 -173 26 173 -156 292 90
3431I0j66n1Q5L18k74L1R8l09r2M73k38M4Q8k98K54l3O8q1k0K90l49QjK48r6j19
$$ 90 -76 -127 -42 276 2 33 131 -178 -270 203 -35 9 97 -201 53 20 88 7 -13 277 -72 -64 -65 183 87 -32
3457c2j34k18K80j3K37k04q8K17k38J05K00k63J52J8j7J17Mj88r8J93J48l11J82
$$ -32 -166 -384 -104 -117 120 -84 -172 45 -193 -88 112 -151 1 19 2 119 123 -65 -163 30 178 -133 49
3480D9j29K14j90P6J76m36K71J01r3m9O6j45J51j91J25p4j76M16k59j32J46j3
$$ 49 -80 134 -56 20 196 -240 31 132 39 -10 56 -89 62 -129 -4 -78 -254 162 -97 -229 -83 -96
3502i6j04J16j79K52n8l6N0Q0j38M0O4j98K37l6l50M67m1j39J45j92J26j46n0
$$ -96 -200 -84 -263 -11 -69 -105 -55 25 -113 -73 -9 -207 30 -6 -356 111 70 -69 76 -116 10 -136 -186
3525a86J02r9L20l24Q4O1K1j33J39q6K02k0j57k01J47nK42J07l93K69k49L8J74
$$ -186 -84 -183 137 -187 -103 -42 -21 -154 -15 -101 101 81 -76 -277 -130 -135 107 214 -179 90 -159 -121 53
3548E3j07O3n8J22O3l30M21j71J07j08Rr2J31r9J9J2p1n2K8Q2j96J82k46J44j58
$$ 53 -54 9 -49 73 136 -194 227 56 163 55 64 -28 103 4 23 35 -36 -88 -60 22 -174 8 -238 -94 -252
3573b52L60OM1j50J07l2j38L2q7K05K2j32j38P6Q1j69J58J7L4J8N8k30j28Q2L38
$$ -252 108 114 155 5 112 80 -58 -26 -113 92 114 -18 -156 -80 1 -168 -10 7 41 59 117 -113 -241 -159 179
3598A79k58L28n2k93K34JJ3k11Q9n4M1k35M99m81Q6J89j20N9p1P1J26Qj93m0M74
$$ 179 -79 249 197 -96 138 139 152 -59 30 -24 17 -218 281 -200 -114 75 -45 14 -57 14 140 148 -45 -85 389
3623C89m44k9P0p1J78o4q6Po7J4J80k84L82p7o0l6J1lMo1J17k83J36J51j32J24
$$ 389 -55 -84 -14 -85 93 29 -57 -50 -117 -103 77 -207 175 98 38 2 13 10 14 -47 70 -213 -77 74 -58 66
3649F6lok17K24k7K80m26J60k46J57j1J45R1%m33K49M6q5J93r3r8J08j9p6Jo0
$$ 66 63 57 -160 64 37 317 -109 51 -195 -38 -49 96 187 187 -246 3 49 -36 157 64 -34 74 55 -21 -20 -80
3675h0j02j1J66k18K85j92J27J8k0M1J61k34K58r5k04q2K51J3J93j21k70N9P5
$$ -80 -182 -193 -27 -245 40 -152 -25 -7 -27 14 175 -59 199 104 -100 -182 69 82 275 154 -116 -57 18
3698A8j77K98j36j01r5J07J72M8J19l56P3J73l41K31J23P5pk5k2k95R6o5J00r6
$$ 18 -159 139 3 -98 -193 -86 86 134 253 -103 -30 143 -198 33 156 231 224 199 177 -118 -22 -87 13 -83
3722h3k1K03j04p0N9o5J37M5Oqp9j06QQ9P3Pr3K56j55j94K55l76J21K07n3R0o
$$ -83 -104 99 -5 -75 -16 -81 56 101 107 99 20 -86 -78 11 84 91 -2 254 99 -95 160 -216 -95 112 59 149 143
3749A43k65L33n51K75J95l4J2o1j13m4J7m3j27QL26J19l69J08J92O3r8j31J31
$$ 143 -122 211 -340 -65 130 96 108 47 -66 -110 -93 -136 -263 -255 71 190 -179 -71 121 184 86 -45 86
3772H6j40j36J88L0o7j10M3K5J46j41j13L45k55Q3k52K05K28j95J77l03J31K94
$$ 86 -54 -190 -2 28 -39 -149 -106 -81 65 -76 -189 156 -99 -16 -268 -63 165 -30 147 -156 -25 269
3794B69n03M91l23J07Nq9P4n5L3n2k7l2M0K51k62Q9o8q0P8J23n1j25J90j04J77
$$ 269 -234 257 -66 41 46 -43 31 -24 9 -43 -70 -102 -62 189 -73 16 -52 -132 -54 69 18 -107 83 -21 156
3819A56p2q2n7l5J52k53J36K3J32r5J20l8j81J55k7r4O1Q2J6p9j76K24j90J36
$$ 156 84 2 -55 -90 62 -191 -55 -32 100 5 125 87 -94 61 34 -60 1 83 99 20 -156 68 -122 14
3843A4K63l91j78R6q6K80l57K30Q8lp9OL49j71j1n7N9j72L84l15R9j10j73L33
$$ 14 277 -114 -292 -196 -282 -2 -359 -129 -41 -44 -123 -117 232 61 50 -7 52 -120 264 -51 48 -62 -235 98
3867I8j7N0l1r3J37o1N3o8o1k30M53j84K1J33l04M3K12j41P3m3k2k92K03N3K66
$$ 98 81 131 100 7 144 83 136 68 7 -223 230 46 67 200 -104 -61 151 10 83 40 18 -274 -71 -18 248
3892B48m11J94n8k2L49k28%r6N3J19m6j03J50k72M9Q7j44L85j48J6o7k40L19k74
$$ 248 -163 31 -27 -49 300 72 72 -24 29 148 102 -1 149 -123 -74 13 -131 254 106 122 55 -185 134 -140
3916a40J20J2q1J13p5j21N5J55Q9l2L6j33k8J26k53N24j27l39J07O6k3j14j51
$$ -140 -20 -8 -89 24 -51 -172 -117 38 127 95 131 -2 -30 96 -157 367 240 -99 8 74 51 -63 -214
3939b14L0L57l71K65M8k62r2L58k25p2J71J39o1L5J15l46K10K6j0n1l1J38j59
$$ -214 -184 173 -198 67 115 -147 -239 119 -106 -178 -7 132 71 106 221 -125 85 111 101 50 19 157 -2
3962bK38k38R5r8p0K7J77p9Jj14J38O6j09n2N0j48J69j10J3L6q5K47j14l96O18
$$ -2 236 -2 93 -5 -75 -48 129 50 51 -63 75 141 32 -20 30 -118 51 -59 -46 -10 -95 152 38 -358 260
3987B60m09K27N7k48K47k65jK77K6k85K46k40J1m9M5L95k34O4N8l35L32k46j0
$$ 260 -149 78 135 -113 134 -131 -132 145 171 -114 132 -108 -97 -146 -101 294 60 124 182 -153 179 -67 -77
4010g7L8p3P3qk5L05n67K31K15j89j10M31k46l47L01J15q2J20j50j5j01K60j58
$$ -77 -39 -112 -39 -47 -72 233 -334 -103 112 -77 -187 244 -2 -349 -48 67 -15 105 -45 -60 -161 99 -59
4033e9J17Q5k75N7q0M5J34k06K27r2J36l31L64k30mJ26J24o8l1N5j39J38j32j6
$$ -59 58 143 -132 -75 -155 -110 24 -182 45 -47 89 -242 122 -108 -112 14 138 70 39 94 -45 93 -39 -55
4057e5p1J16K8j00J81n8k50L11j80K3J63j30l1K03l41J85r8L39l31q1L09n2j62
$$ -55 -126 -10 18 -82 99 41 -209 102 -78 -55 108 -22 -53 150 -191 -6 -104 235 -96 -177 132 80 -82
4080h2J37l27K41J14k50L77k68J58k3k69J81j26P7L31l46K10k77P1n3K16k52K96
$$ -82 55 -272 -31 83 -167 210 -58 100 77 -192 -11 -137 -60 271 -75 135 -142 -71 -124 92 -160 136
4102A36K9j09L58j09l02N0j97M69l55J77R9j68m5j51p4K4L69k86M00k47o6J11
$$ 136 165 56 414 305 3 53 -144 325 -30 147 246 78 33 -118 -192 -168 201 -85 315 68 2 113
4124A13j49j57K6J11K02j5k39J96j33n8n2K52k59J48m3j27K26J09j72L4R7l01
$$ 113 -36 -193 -167 -56 146 131 -108 88 -45 -103 -155 97 -162 -14 -57 -184 42 151 -21 13 110 -191
4146a91K23J64j40J00l79L73l51N2J04k31J97J01l9Mj84M06k47R8J55l44J76l6
$$ -191 32 196 56 156 -223 150 -201 -149 -45 -276 -79 22 -17 -13 -197 209 -38 60 215 -129 47 11
4168A1J17l59K86j65L41l79m7K90L5k09J65j27j68M25P3l90J75j46J25L3R1l25
$$ 11 128 -231 55 -110 231 -148 -195 95 130 -79 86 -41 -209 216 289 -101 74 -72 53 86 177 -148
4190a48L25k90K13j38N0P5j37L15k66k21J2L26k11J39l3k5J18j34m9K56j95j19
$$ -148 177 -113 100 -38 12 87 -50 265 -1 -222 -210 116 -95 44 11 -14 104 -30 -79 177 -18 -137
4212a37M01l04M0o6R0N7O8P0j79l7J62J8k31K08k59J89j55Q9k84K31J55J98k64
$$ -137 264 -40 0 -66 24 81 149 219 40 3 165 183 -48 160 -99 90 -65 24 -260 -29 126 324 60
4235F0nJ28k28j26K31j49J66j84R5K17k19J46P5k79p5J55J30p7q9J76j47ln8J5
$$ 60 55 183 -45 -171 60 -89 77 -107 -12 205 -14 132 207 -72 -147 8 138 61 -28 148 1 -2 -60 -45
4259d5l32N41r5p6j84J18K0K64k1m3l37K15j5O8j16p2L21m09R2m3O8k19K30k9
$$ -45 -377 164 69 -7 -191 -73 -53 211 190 147 -190 25 10 78 -38 -110 211 -198 -106 -149 -81 -300 -70 -99
4283i9N7K78k11j1L2L8Pj03RnK09j72j47J5j61L67l24K34O7k2j47Q2J74P1l15
$$ -99 -42 236 25 14 46 84 91 -12 -3 -8 201 29 -118 -103 -264 103 -221 13 80 58 -89 -7 167 238 -77
4308g7O8K2J26J26J15m66J15j08L2J60k24o6Q7K61k81K94r3M3m6k27K04k28M9
$$ -77 -9 13 139 265 380 -86 29 -79 -47 113 -111 -177 -90 171 -110 184 91 134 88 -139 65 -163 -114
4331a14K11J71l79K13M0r5m0k12m7J95qJ14P2O8k04K8j38O0K28j90r9K97k66j0
$$ -114 97 268 -111 102 142 47 7 -205 -252 -57 -65 49 121 189 -15 13 -125 -65 163 -27 -126 171 -95 -105
4355a05L78m23J0K52r5K5j7Qk08J09J10j68L5j9p4J8K85j25m1m0P7R9J07l93K79
$$ -105 273 -150 -140 112 17 42 25 33 -175 -66 44 -124 -89 -108 -182 -164 121 -4 -45 -85 -8 91 198 -195 84
4380H4j8q6l8J42k11j2Q7K12O6l58R4j3K22k8j92k52L79k9o9%J10k75J26K21n3
$$ 84 66 -20 -58 84 -127 -139 -52 160 226 -132 -38 -51 171 143 -49 -301 78 49 -20 -20 90 -185 -59 162 109
4405A09j91J66L6j51J1P3j90K5q6J58k5j8K14O1j3J2l11m4J25m3J72r9R3k2N5
$$ 109 -82 84 120 -31 -20 53 -137 -112 -198 -40 -65 -83 131 192 179 191 -120 -164 -39 -82 90 -9 84 62 117
4430A17k58J68k22K7L65j6k70O4J79j09kj47j07P3QL23n3j26j0L5q5K8J57J6p8
$$ 117 -141 27 -195 -168 197 181 -89 -25 154 45 43 -104 -211 -138 -130 193 140 14 4 39 -46 -18 139 155 77
4455G7j65M1q9J06J12P3j23k00L6K96l59K67j35k34M95j60K9r0L80n30O2J75L3
$$ 77 -88 -47 -136 -30 82 155 32 -168 -132 164 -195 72 -63 -297 198 38 67 -23 357 -173 -111 64 97
4478I7P4l8j08L0K6j60R5J34k94oJ32K5J33k88J42J36o8O8pr3J76j45k28K40l06
$$ 97 171 133 25 55 81 -79 16 150 -144 -150 -18 7 140 -148 -6 130 62 130 123 30 206 61 -167 73 -233
4503b33M22j81n3J14r8q0L67l88J95l9k0K06j35j85J7J7J50pl76J2J31J56nJ32
$$ -233 189 8 -45 69 -29 -109 258 -130 65 26 6 212 77 -108 -91 -74 76 69 -307 -295 -164 -8 -13 119
4527A19k63M5J04J54j93M3rJ31L6p0m21N22j95J77j7k79L2M55m13K09j1k85K68
$$ 119 -144 -99 5 159 -34 9 0 131 167 97 -324 198 3 180 163 -116 -84 371 -42 167 156 -129 139
4550A39l56J16J94j46j0o4m9J30P7K5j83K34j6j50J38J61k00M5K1j03R0q9r4K11
$$ 139 -217 -101 93 -53 -63 -127 -176 -46 31 56 -127 107 91 -59 79 240 40 85 106 3 93 4 -90 121
4574A21j42p5j71J95P1j08P1O7k32J71M0N3m6m3J91m99M78j67o6j11K82Jl50Q3
$$ 121 -21 -96 -267 -72 -1 -109 -38 29 -203 -32 8 61 15 -28 163 -336 142 -25 -91 -202 80 81 -269 -186
4598a86K80m7K6P9p8k36p3J64m2K25j00j68K13R8j12Q0Jl2n1j45N7L1L12k22l3
$$ -186 94 47 73 152 74 -162 -235 -71 -113 112 12 -156 57 155 43 123 124 92 41 -104 -47 -16 296 74 41
4623D1Q8j76J02q6n8J40Q5j68k36L67Qk8q2J16k26o1K36J15j52j56J07K3K35l29
$$ 41 129 -47 55 -31 -89 51 136 -32 -268 99 107 79 -3 113 -113 -174 62 177 25 -131 -24 -1 234 -95
4647i5J29J60k26j60J91j1P5M7q1k69L58k8k64j54M09j05j29J75NK52l62n0l9
$$ -95 34 194 -32 -192 -1 -12 63 110 29 -240 118 90 -174 -328 81 -24 -153 22 27 279 -83 -133 -172
4670a72K23M3Ml9j9O1r5J5m0L0L1j10J68J34j74j34J59Mp0J12j16m4l9NJo0P6
$$ -172 51 94 98 59 40 101 6 21 -19 11 42 -68 100 234 60 -74 85 89 19 131 15 -29 -68 -63 -62 -122 -46
4697d6L31m30J11q3J9J94l34J48K81k61Q4o4J4j43J9J91j01k8J22J0l61M13j65
$$ -46 285 -145 -34 -117 -98 96 -238 -90 191 -70 14 -50 -36 -179 -160 31 -70 -98 24 34 -327 86 -79
4720g9J02j4k02K79j68J99J11l07J16r8K0J16j30j69q9L03j48L31m91M41k66J72
$$ -79 23 9 -193 86 -82 117 228 -79 37 -61 -41 75 -55 -224 -313 -10 -158 173 -318 123 -143 29
4742B9p8J3O0O2J5J47k96K50Mj63N9l50J06Q1k08M34k84K65q2j76M6j8J60k58
$$ 29 -49 -36 24 86 101 248 -48 202 206 43 102 -248 -142 -61 -269 165 -119 146 64 -112 -66 -84 76 -182
4766a82m5K84j82K10J6rk67K09Q7k02J82l5J15j36l7j21J09lj01K71k43O4M1j29
$$ -182 -227 57 -125 85 101 92 -175 34 121 -81 101 66 181 45 8 -113 -4 -7 -108 163 -80 -16 25 -104
4790a04J65j89P5K43n26M14N7j64pj91L13o2r2j04J61J87k76J59j46R1K74j16
$$ -104 61 -128 -53 190 -336 78 135 -29 -36 -227 86 24 -68 -172 -11 176 -100 59 -87 4 278 162
4812A62k35j22p8M09o4k25J33k39L11j08Qo2L07j07k60R1nK55k13J77k68K34j76
$$ 162 -73 -195 -273 136 72 -153 -20 -259 52 -56 -48 -110 197 90 -170 -79 -84 171 -42 135 -133 101 -75
4835g5N3J19j64J33k01k4O6rL7L8Qm8J61q8N1j71K62j58j2M1j23rP7J50k74J97
$$ -75 -22 97 -67 66 -135 -159 -93 -102 -65 -27 -19 -67 94 6 57 -114 148 -10 -22 19 -104 -113 -36 114 -160 37
4861C7j84J07No6RJ03M2r2j13K48p9j11N9N7j19J08n9J73o6N2k64j0K21j8j74
$$ 37 -147 -40 -35 -101 -92 11 53 -39 -152 96 17 -94 -35 22 -97 11 -48 125 59 111 -153 -163 58 40 -134
4886a34J30k12L23k2L6J56l61n9M28m0k65j0j03O9k2K00l19K97j35n0l3l9N16
$$ -134 -4 -216 107 85 121 277 -84 -143 285 245 -20 -30 -133 -64 -86 114 -205 92 -43 -93 -126 -165 351
4909C51l04m5N1j45q2J67j78J37K28l12L7k33O04j54k63l2L60k76l9J68p1MK00
$$ 351 47 2 53 -92 -174 -7 -185 -48 180 -132 -95 -328 276 122 -141 -173 187 -89 -128 40 -31 -27 173
4932A73r8j42N4K13m6j67L0j22mJ95N8k35j15L85j51l9k42O26n66K43o9q2k3J54
$$ 173 75 -67 -13 200 154 -13 17 -105 -109 86 144 -91 -206 179 28 -11 -253 373 -193 50 -19 -101 -124 30
4956C0o9P8L0o5O9k90J84O4J35j14P7p7j42j09M03r9m8j10n6P9J8J62k34M8j9
$$ 30 -39 39 69 4 73 -217 -33 31 166 52 129 52 -90 -199 204 105 57 -53 -109 -30 -12 150 -84 -36 -55
4981e5m6J07J85l00N1J7Mp5J93l63K41o3O0k21K08K39m14N9L31k32K3L51m46R0
$$ -55 -101 6 191 -109 -58 -41 -37 -112 81 -282 -41 -104 -44 -265 -57 182 -232 -173 158 -74 -51 300 -146 -56
5005e6K05j36r0K74k63M02l93K57k53J11j50J08l8j8Q5J44J80l76j07Q5j02J00
$$ -56 149 13 -77 197 -66 336 -57 200 -53 58 -92 16 -22 -40 45 189 369 -7 -114 -29 -131 -31
5027c1J50k84k9L51k06r9JL04m7k22K52Qj6O7j52r6l7L9K01n7j58K8J88k5j47
$$ -31 119 -165 -194 157 -49 -148 -147 157 110 -112 140 148 132 199 47 -49 -86 -47 154 97 -61 -33 155 130 -17
5052a7J35k3n7J35O5k18k27R2l1K35r3k49R1J69J71l92J46j00Q1N6j9N0J82j98
$$ -17 118 95 38 173 238 20 -207 -115 -146 89 -4 -253 -162 7 178 -214 -68 -168 -87 -31 -50 0 182 -16
5076a6K2k8j31Q0k18L33J61j47j46J33JJ58k56K62j95n3P5L6P9k34J99p6Ok43
$$ -16 6 -22 -153 -73 -291 42 203 56 -90 43 44 202 -54 208 13 -40 35 71 150 -84 115 39 45 -198
5100a98K35j24j00K48o7J77j43m9K43k78q4l0K23j38P2K68l87N6M7K37k79R7o1
$$ -198 37 -87 -187 61 -6 171 28 -21 222 -56 -140 -170 53 -85 -13 255 -132 -76 -29 208 -71 26 -35
5123c5n5L53k88J1K4q7l3J72m0O4oj66j28J74J8J19j70j19K80r3o6L33m26L64
$$ -35 -90 263 -25 -14 10 -77 -110 62 22 86 80 -86 -214 -40 -22 97 -73 -192 88 -5 -71 262 -164 200
5147B00k85J41Rn3M4J92r3l30L63l96J60K69j59j80P6J6j06J68p7l7M1lnJ2r3
$$ 200 -85 56 65 12 56 248 155 -175 188 -208 -48 221 62 -118 -42 -26 -132 36 -41 -78 -37 -40 -45 -33 -126
5172a26K76j46OM8j73J34N5k20K05Mo1K35l77J21N5N6l74L29j89K14r5j9P8P0
$$ -126 150 4 10 58 -115 19 74 -146 59 63 2 237 -140 -19 36 92 -282 47 -142 72 -23 -42 36 106
5196A06Rj38j84L28k5k41P2J09J70k62K8n6j29L7JJ72O9j98K58k1j60j25K19M3
$$ 106 115 -23 -207 121 96 -145 -73 36 206 -56 -28 -84 -213 -176 -175 -3 66 -132 126 105 -55 -180 39 82
5220H2o3J08M5j55J68k39J30j1l07J52J15R3l6l0k01PJ79J5k17L55k85P7J77m99
$$ 82 19 127 172 17 185 -54 76 65 -242 -90 25 118 82 52 -149 -142 37 52 -165 190 -95 -18 159 -340
5244c40K86J01q6NJ51mJ85k82R2l33M34j29j2q8P3JL1O5j81j55K86j75j00J40
$$ -340 -54 47 -39 -34 117 113 298 16 108 -225 209 80 68 -20 53 54 85 150 -31 -186 100 -75 -175 -35
5268c5J28j80m7Q6p9Q2J76j73O3L4j4n9j29L3J10J64j25L8Nj93K1J13n7l2r3J67
$$ -35 93 -87 -134 -48 -127 -45 131 -42 21 55 41 -18 -147 -114 -4 160 35 73 78 -115 -94 19 -38 -70 -163 4
5294DJm3J2R8m7J5Q6r8j19J80j02PK1n9J82k17oM4p6k12P1N19q7j54J8Q5j40j24
$$ 4 5 -38 -26 72 25 40 126 28 -91 89 -13 -6 15 -44 138 -79 -85 -41 -117 -329 -258 261 174 20 38 123 -17 -141
5322a41K25K6r7mL2J60l80N1J65m8j05L17K3k57j21K06j12J31P1O7l41P9J75k5
$$ -141 84 110 13 9 41 201 -179 -128 37 -11 -116 201 224 -33 -154 52 -60 71 142 209 -132 -53 122 97
5346I7N9j30M1j78J36J72k1l36L46l21J63j34k09L46k53K09O7j16J01K4Oj4p5
$$ 97 156 26 67 -111 25 197 176 -160 186 -135 28 -106 -315 31 -222 -13 54 -62 39 63 69 55 -20
5369b0Q9j56J27k63K16k1j41J77O0P0j18q9O0j89K07k8M8K2j57j06K47k28K25
$$ -20 69 -87 40 -223 -7 -28 -169 8 68 138 20 -69 -9 -198 9 -19 29 51 -106 -212 35 -193 32
5392C2l9p7j38L19j75J45Kl2j50J53k82L55k54J64k9q0l5K18k56J47k4p0QQ7k7
$$ 32 -7 -84 -222 97 -78 67 69 37 -113 40 -242 113 -141 23 -6 -86 -121 97 -159 -12 -36 -106 -98 -11 -38
5417c8J69k5k41O5j64L30k80J28l6Q6k76K19P1j30K34K1n3n1r1l22M68j87l0J07
$$ -38 131 106 -135 -70 -234 96 -184 -56 -92 -6 -282 -63 8 -122 112 133 80 29 -62 -384 84 -103 -133 -26
5441b6K79j44n7j66J07k76M39p6j18J94l17L0R1J77r0N5K4k82J52j28k2K3l4o
$$ -26 253 109 52 -114 -7 -283 156 80 -38 156 -161 -131 -40 137 47 102 126 -156 -4 -132 -154 -131 -165 -171
5465a71K24q7J02j27K0P5K0K0p6J04o3j15j35K09K52k10j82J87j71Q0J74pjk61
$$ -171 53 -34 68 -59 -39 36 56 76 0 104 41 -74 -209 0 252 42 -140 47 -124 -44 130 123 122 -139
5489a39M8K15l12K77k61R5k5M0nL19k64k0J40K8l65j31L70N5O6k72Q8J10k95K97
$$ -139 -91 124 -188 89 -172 -77 -102 -62 -67 252 -12 -32 108 136 -229 -360 10 65 131 -141 -53 57 -238 59
5513E9j80O9k61M01k18J76q1r2Q0J43j60m7L84n01K90j85J36n9L0N8j78L7KJ47
$$ 59 -121 -52 -313 88 -130 46 -35 -127 -47 96 -64 -111 273 -228 62 -123 13 -46 -16 42 -136 -99 -97 50
5537E0j17J29n0k79Q0L71n1k56L43l50J65k30J49K74k46p3J4J67l05j3M01p4K23
$$ 50 -67 62 12 -267 -187 184 133 -123 220 -130 35 -195 -46 228 -18 -91 -77 90 -215 -228 173 99 322
5560C22k91R9k43J09O0J9k6j03Q5j58J38p9m4l4L08o7M6k79K44k54m4P9OJ48k76
$$ 322 31 130 -113 -4 56 75 49 -54 31 -127 11 -68 -112 -146 162 95 141 -138 106 -148 -192 -113 -107 41 -235
5585b35K3p1n6M58k59n0K57j38L72j53l18L89n3l2k69p2J99J69J21k39j00r3J12
$$ -235 -212 -283 -339 119 -140 -190 67 -71 301 148 -170 219 166 134 -135 -207 -8 161 282 43 -57 -150 -38
5608c8j57K74K1R0k27N7l43L51m0j50K51q8m1j42K00O4j64m8L90l57Q0j73J66
$$ -38 -195 79 100 190 -37 20 -323 28 -12 -162 89 1 -40 -182 18 82 -82 -130 260 -97 -17 -190 -24
5631b4J70k94K4R1L8J75j26j03J83k47J41Q6k93P3O1J01k66J27J63l62J73J08
$$ -24 146 -148 -124 -33 5 180 54 -49 134 -113 28 114 -179 -106 -45 56 -210 -83 80 -282 -109 -1
5653an93N12K20k83J26K57J35p27J68J12L05k9k93K49j55k37J85O9j8l8J80j99
$$ -1 -594 -82 138 -145 -19 238 373 -354 -186 -74 231 202 -91 158 3 -234 -49 20 2 -36 144 -55
5675e5j86K28J29k37Q3K53j60K4j86J98M6l47N8L55k14M1k37J72J39j9l2L8j88
$$ -55 -241 -13 116 -121 -38 215 55 79 -107 91 137 -210 -152 203 -11 30 -207 -35 104 85 53 91 -97
5698i7M6k4j4J25K08k40k15J18J09j49Q4J00M2k90K27q1k9L3pj0O4J42k40j76
$$ -97 -51 -75 -89 36 244 4 -211 -93 16 -133 -49 51 93 -197 30 -51 -80 -47 -54 -64 0 142 -98 -274
5722b74J60L4q4J40l4m1K63m34L23k5K43l43j35K09r1P2L3K29l59m7M25k96J5
$$ -274 -114 -80 -164 -24 -58 -99 164 -270 53 28 271 -72 -207 2 -89 -17 16 245 -114 -161 264 -32 -17
5745a7J58k02J18j5q0L3K33j82m8r9Q3J47j02J51K5l6O1j87J70j79j4l51M21m
$$ -17 141 -61 57 42 -38 -5 228 46 -2 -101 -18 129 27 178 203 167 228 41 211 32 18 -333 88 84
5769H4p9Q%J2N9l7Jj54K79j74K18l54L51j68k35K48p0O6j24kK18j51J87k27J97
$$ 84 5 13 13 25 84 47 48 -106 173 -1 217 -137 214 46 -189 59 -11 55 -69 -71 147 -4 183 -44 153
5794A53l6j80J77p8J6K4j88J72M5j12R0k57R6m5OJ46k09J87K32k99N8j19J21j51
$$ 153 117 -63 114 36 52 76 -112 60 105 -7 83 -174 -78 -123 -117 29 -180 7 239 -60 -2 -121 0 -151
5818a51K50l3n4q5K7K87j54l01K98o0K1J55k44J83l01K99k72M1M2p7L66r1j30
$$ -151 99 66 12 -73 -46 241 87 -214 84 24 45 200 -44 139 -162 137 -135 -94 -52 -129 237 146 16
5841A6j24J38J15j71K27k53k8j3L9J46J7k25m2L53k08j05K46q4l17J67J15K95
$$ 16 -108 30 145 -26 201 -52 -80 -93 -54 92 109 -116 -158 195 -13 -118 128 44 -273 -106 9 304
5863C04k07j46j92K62q5j15J53M2j17L26k17mp9n9L93j26k98J59J96Qj71NK85
$$ 304 97 -49 -241 21 -64 -179 -26 16 -101 225 8 4 -75 -134 259 133 -165 -6 190 198 27 32 317
5886C17k63k92K71l84J17K48qk2L05m19J67j41M0J14Q3j20J75m33L50k19Q0J91
$$ 317 54 -238 33 -351 -234 14 6 -16 289 -130 37 -104 -64 50 133 13 188 -245 105 -114 -34 157
5908A57n4j48k1J40N8j33o2n5N3J66j71J22k07k6J82K30j08j42R3j46J90k42j63
$$ 157 103 -45 -66 74 132 -1 -63 -118 -65 101 -70 52 -155 -181 1 231 123 -19 74 -72 118 -124 -287
5931b87J92P4J87q2j93l3K72k47J80J04M9k51j53L73j64L1j79K06P2p1j21O9j09
$$ -287 -95 -21 166 84 -109 -142 130 -117 63 167 216 -35 -188 185 21 52 -127 79 151 80 -41 28 -81
5954h1K38n6j00j3J92l61K01Qk76M12p2k26J02K13R2k86J60j99J08O7r8r9Q2o3
$$ -81 157 101 1 -12 180 -181 20 28 -248 164 92 -134 -32 181 273 -13 147 -52 56 123 25 -74 8 -55
5978e5j5JK10K48l34K55k55j5j06J54k8M1m13K94l8J33l20J77K23j30j90L5n9
$$ -55 -70 -69 141 389 55 310 55 40 -66 88 60 101 -312 -18 -56 77 -243 -66 157 27 -163 -128 -187
6001a87J96P8J36l34J69o6j13J9K05k68K01K6m3O5J09k12Q7M1k9j42j35J57J6
$$ -187 9 87 223 -111 58 -8 -121 -102 103 -165 36 62 19 84 193 -19 68 109 80 -62 -197 -40 -24
6024b4mK9l2K11k56J22P9q4P3J1Poj44j4R8p2K45k82N1J7J1j53M3J14k7j04L6
$$ -24 -28 1 -31 180 -76 46 125 41 114 125 132 126 -18 -32 66 -6 239 -43 8 25 36 -117 -74 40 13 -91 -55
6051e5Q6J30P8k86J14K6j96J55K0m9l3J11j97K9J31n8p0k1K0J98J70m89j41K42
$$ -55 31 161 239 -47 67 93 -103 52 72 23 -10 101 -96 -67 64 6 -64 -85 -65 133 303 -186 -327 -85
6075h5J53l9J81j25l12K22N0k13N0q0K25J01O4k88M2J88k94J66J05j12J76Kl36
$$ -85 68 29 210 85 -227 -5 45 -168 -118 -198 27 128 192 -96 -54 134 -160 6 111 -1 175 177 -159
6098a59q3K18p0N0l8R5k26K68%K7O2m5k38K30r5j70J51%k21L38n1n9j18M6K03
$$ -159 -242 -24 -94 -44 -82 13 -213 55 55 82 144 99 -139 91 -4 -174 -23 -23 -244 94 43 -16 -134 -88 115
6123A15j9n3l3j60P3K7M5J68l20L6R5k34K92K31k49n9R2n2jK33k67R1l33P8K57
$$ 115 96 43 10 -150 -77 -50 -5 163 -157 -121 -26 -260 32 263 14 -45 47 -5 -6 227 -40 51 -282 -204 53
6148E3j64j88L89J12j27l10K72l8r3k2M1j37L30j53J89j35k13j03L16K61l19J19
$$ 53 -111 -299 90 202 75 -235 37 -1 -94 -116 -75 -212 118 -35 154 19 -194 -297 19 280 -39 80
6170H0k66K1R6J28qj65K32j6k39J63j23K54J09l93K35m8P5J29j58m4j8m4J27r5
$$ 80 -186 -165 -69 59 51 -114 118 102 -137 26 -97 157 266 -127 108 60 135 264 106 62 44 0 127 32
6194C2N0j14K6J16j18M9k71J7k8L17K2j31k6J96j14l07K33J00l51K99q9K53l05
$$ 32 82 -32 -6 110 -8 41 -230 -213 -241 76 98 -33 -59 137 23 -284 -51 49 -302 -3 -92 161 -144
6217a44K27R0lJ21k02r8k18K13M0j0j68K29o5P9n2p4J04p6J00k0j86L25k61J71
$$ -144 83 173 170 291 89 -9 -227 -14 26 16 -152 77 12 91 39 -35 69 -7 93 73 -113 212 -49 122
6241A22r2L7j12J23MJ67k03K7o1J0J90l75J42J5K61l53J45k9k03K10kN8k37q2
$$ 122 30 67 -45 78 82 249 46 73 12 22 212 -163 -21 -6 255 -98 47 18 -185 25 23 81 -156 -238
6265b38K37J17q4Mj41J80J69p2k35J20j8j45R6j68Q6M9J81M0l10K92j40N1J5k26
$$ -238 -1 116 32 36 -105 75 244 172 -63 57 39 -106 -10 -178 -92 -43 138 178 -132 160 20 71 86 -140
6289a40K70j67oj29R3J58l5j05n8K69k28J49k85R4K02o5Ln0J21p9O0M0j03J11
$$ -140 130 -37 -43 -172 -79 79 44 -61 -119 150 -78 71 -214 -120 82 17 20 -30 91 12 72 112 9 120
6313A20j99q7K57k76J33q6K11N7l13L17P7k00j44O8J60l5p4R9j06J18L0n6j4%
$$ 120 -79 -166 91 -185 -52 -138 73 130 -183 134 211 11 -133 -65 95 60 -14 85 -21 97 127 71 57 57
6337E7k20K00r0J87l25J7Q3J19p5J72k48J21J35k53J63K47P4l49K6r3l05L58N2
$$ 57 -163 37 -53 134 -191 -174 -91 28 -47 125 -123 -2 133 -120 43 290 364 15 41 -52 -357 1 53
6360E3RJ25j09q1k6J85k50L61n5l56J98J5k11R0n2M7q5P5o5P2k0n8J50M6n3j63
$$ 53 62 187 78 -3 -29 156 -94 267 212 -144 54 69 -142 -52 -104 -57 -142 -67 -132 -60 -80 -138 12 58 5 -158
6386a58K26j13N6j55J70j57Q2Q2j24L17M8l31M2q9J46m9rK36k39J49pj53k8p8
$$ -158 68 -45 11 -144 26 -131 -49 33 -91 226 274 -57 -15 -104 42 -7 -16 220 -19 130 123 -30 -58 -136
6410a36q1L30Rk99J92J83j50Kk04K47q9n2Q9p2JK5j50M04k49o8p8J59l6j89K48
$$ -136 -217 113 122 -177 15 198 48 50 -154 93 4 -48 41 -31 -30 -5 -155 249 0 -68 -146 13 -23 -212 36
6435C6N8p7np5P5l2J6R4j24j8j08J02q5J67K63m32K96j19k14L62nj01p8k4J10
$$ 36 94 17 12 -63 12 -20 -4 90 -34 -52 -160 -58 -143 24 287 -145 151 32 -182 180 175 74 -4 -28 82
6460H2Q2j71J58j48j69J17j48L67k44J10n5K1Q8m5n6m0j20J1L64m23K75j05N8
$$ 82 164 -7 151 3 -166 -49 -197 170 -74 36 -19 2 90 45 -11 -51 -171 -160 204 -219 56 -49 9
6483Ij19J36j82k7L52j20j11k02J66j23K22K0R7j29k0p8K73k03lk1K14O8k92J80
$$ 9 -110 26 -156 -183 169 49 -62 -264 -98 -221 1 21 118 -11 -31 -109 164 -39 -42 -63 151 219 -73 107
6507A07j64J7J7L9j82J75J02k28J71j25n8K11J75o5k80O7n6M2J4J34JJ24k34N
$$ 107 -57 -40 -23 16 -166 9 111 -117 54 -71 -129 82 257 192 -88 -21 -77 -35 -21 113 114 238 4 9
6531Iq2qJ85p9O1j38M1j7L74n48L81l91J45k6j85J96m3K7O9Q4j52K38J03l01m9
$$ 9 -73 -81 104 25 86 -52 -11 -28 346 -202 179 -212 -67 -93 -278 -82 -125 -98 -29 55 -97 141 244 -57 -106
6556a06l7J98j69J24J74j95O7N3l83J43J05j29K96j22j29q1J41J08j74P6M3o2
$$ -106 -143 55 -114 10 184 -11 56 109 -274 -131 -26 -155 141 19 -110 -191 -50 58 -116 -40 3 -59
6578e9J42k73L15k21K33k38q3K89k83k5n6M54q7K3m0J5j03j73o8J87j6J34qK1
$$ -59 83 -190 125 -96 137 -101 -184 105 -178 -203 -259 195 108 131 91 106 3 -170 -238 -51 -67 67 59 80
6602H0k00J11j56K52j04J94L3k24J24o0M2pr4K50l76L1J55l1q9K18k04O1J62j49
$$ 80 -120 -9 -165 87 -17 177 210 -14 110 50 92 85 -9 241 -135 -104 51 20 -69 149 -55 6 168 19
6626A9k8q4K83k65O0L6J36j26k1Q6q4q3J18J18J6k46K35q0j22q9J60j23K16m08
$$ 19 -9 -93 190 -75 -15 21 157 31 10 96 12 -71 47 165 181 -65 170 90 -32 -121 39 -84 132 -276
6650b76L44n2k57K96q9N4M5o9rj74J78J04j14J33j97m7K32l45L39J5j65r5j00
$$ -276 68 16 -241 55 -34 20 65 -4 -13 -187 -9 95 -19 114 -83 -130 102 -243 96 111 -54 -149 -249
6673b49J63j20O7J00J71q7j59K88l94L41r6j22MM8P0j65j69L60l6k11K54p7R4
$$ -249 -86 -206 -139 -39 132 45 -114 174 -220 121 25 -97 -93 -45 25 -140 -309 51 15 -196 58 -19 75
6696G5k66J99q5p3J14p7L4M4K29j20N4k89p8K67L8k33P7P9J1q4Q5j97K24M0k1
$$ 75 -191 8 -77 -150 -36 -113 -79 -35 194 74 128 -161 -239 28 66 -167 -90 -11 0 -84 1 -196 28 68 47
6721D7O2j34R6j12J28k0j71Pj87K76m01N62N8j76m6k23K21j4j06J89l8j71J68
$$ 47 109 -25 71 -41 87 67 -104 -97 -284 -8 -409 153 211 35 -11 -234 -13 -27 -133 56 18 -153 15
6744A5l4j5m8J37j75J13J76k09K44j64M3M9j18j17L8K31k40K86k31n3J39J30P6
$$ 15 -19 -34 -82 55 -120 -7 169 -40 204 40 83 132 14 -103 -65 166 -74 212 -19 -72 67 197 273
6767B73j92j28N2p8K10j68L11k07J5r9K31m37K05P6m6P8o4o2J35j89J63j26J14
$$ 273 81 -47 5 -73 137 -31 280 73 88 -11 220 -217 -12 64 18 96 32 -30 105 -84 79 -47 67
6790F7M6j39O0J42k28K84j30j96O3NL17j01l50L18j42j61O2k6J78k14K12j3J60
$$ 67 113 -26 34 176 -52 232 102 -94 -31 -26 291 190 -160 158 16 -145 -83 -109 69 -145 67 54 214
6813B14m81L27r3N6J38%j95n6QJ94k59J13J82j25k64J32K05k05K7j08K55k67l9
$$ 214 -267 60 -33 23 161 161 -34 -90 -82 112 -147 -34 148 23 -241 -109 96 -109 -82 -190 65 -202 -241
6836b41L25J93l34Q9j63K08K69k94O9k72J87N9j80K64p5k55k6P3L14j10j65lJ10
$$ -241 84 277 -57 32 -131 77 346 52 121 -151 36 95 -85 179 104 -151 -177 -104 210 100 -65 -68 42
6859D2k66M21J40l26j44K71k73M9r3J33j26m2L23M4l6p4J78J4j96J16k45J69k8
$$ 42 -224 197 337 11 -133 138 -135 -86 -179 -46 -172 -214 109 153 117 43 221 235 39 155 -90 79 51
6882E1J4k3Qm3Pj42K27m00K39J23j94J45M5k05L6L07k93K49k52N0K60j36m5j36
$$ 51 65 42 50 7 14 -128 99 -301 -62 61 -133 12 57 -148 -112 195 -98 151 -101 -51 209 73 28 -108
6906a08J55k67P0K12J31k22Q1Q1L8m09K88j33q8M77m03N2J48j78M8K5p2J37M5
$$ -108 47 -220 -150 62 193 -29 52 133 171 -238 50 -83 -171 306 -97 -45 103 -75 -27 -2 -74 63 108
6929A08m1N8j72K06pj45o4j05M40k41l23M16k79M46l14j27M31j77r8n5J59n5K6
$$ 108 67 125 -47 159 152 7 -57 -162 278 37 -286 130 -149 297 -17 -144 287 110 12 -43 116 61 87
6952H7j81o7j54N23j4l03M6K1R4j15j14L53k07j91K61Jn5J45k99J90Rj0j34K26
$$ 87 -94 -161 -315 208 194 -109 -63 -42 52 -63 -177 176 -31 -222 39 40 -15 130 -169 21 30 20 -114 112
6976A12p0j38j42L77p0J88m7l24K6J21K6j07M0k19J82P3l7n1j57J94M4j04j4K68
$$ 112 42 -96 -238 139 69 257 210 -114 -88 33 59 -48 -8 -227 -45 28 -9 -60 -217 -23 21 -83 -97 171
7000A71n4j84J71p5%L2j65J67l21J35oJ19J87j05r5P9Km9j74M03k41K63k41k98
$$ 171 117 -67 104 29 29 61 -104 63 -258 -123 -129 -10 177 72 -23 56 58 9 -165 238 -3 260 19 -279
7024b79K85O6k02L90l11J77k2k70j00M02l4j76N1J25j14J70j45M6K00l68K13m8
$$ -279 6 72 -130 260 -51 126 104 -166 -266 136 102 -74 -23 102 -12 158 13 59 259 -109 104 56
7046E6R5k87K07j6L0j14J12r2O8p3p6nQ1k24K10J58k67K63n5k06R6j64J00J10
$$ 56 151 -136 71 55 85 -29 83 -9 59 -14 -90 -95 -14 -238 -28 130 -137 126 71 -135 -39 -203 -103 7
7070GnM6o5M2q0K3k0J97NK0r3j91J36J44n9k14p6L10j36j21R4N6on8J64m6j02
$$ 7 2 48 -17 25 -55 -32 -52 145 150 170 77 -114 22 166 107 -107 -183 127 -9 -130 -36 20 14 -44 120 74 -28
7097b8J37j32J08l2r7M3j03J12k02K15O2Q4k03q4J18m7RJ36r4m9j86N62j67j92
$$ -28 109 -23 85 53 -44 -1 -104 8 -194 21 83 167 -36 -120 -2 -49 -40 96 2 -47 -233 329 162 -30
7121c0rQ9lK54k42k82J95j34J49o2N1J00j67j58J22J08q1J89j61K3n2J34o0k5
$$ -30 -39 50 47 301 59 -223 -28 -162 -13 -75 -24 76 -91 -249 -127 -19 -100 89 -72 -49 -101 33 -27 -52
7145e2J4L5M7P4J75j71O1l00K11k07R5n0J34k51K49N9q6N0q8K2K9J08r6K47j50
$$ -52 -38 -3 44 118 293 122 183 -117 94 -113 -18 -68 66 -185 64 123 37 87 -1 21 50 158 62 309 159
7170A59R1j41p4j45J35j54l9K7J42kNj14J25j81J28O7r4J46J60k36J56k01Q0K2
$$ 159 250 109 35 -110 25 -129 -168 -141 1 -1 4 -110 15 -166 -38 29 -65 81 241 5 161 -40 40 62
7194F2k6q4MJ3k35K02N1l9j2j45J90P3p9M0j82K21j11K16l00j36K25LL22j23j69
$$ 62 36 -48 -44 -31 -266 -64 -13 -52 -64 -209 -19 54 -25 15 -167 54 -57 159 -141 -277 -52 -49 273 150 -19
7219a9k45J12O8P3J5N9j16M9j25R5K3p7K76k77p7J57j20k5o5K24K01j95J47k59
$$ -19 -264 -152 -84 -11 4 63 -53 -4 -129 -34 -11 -88 188 -89 -166 -9 -129 -154 -219 5 206 11 158 -101
7243a01L55j58j77q2P1L83m49L02j91k4j4K34k17N8r8q1J00M8n5J26j54K00q7
$$ -101 254 96 -81 -163 -92 291 -158 144 -47 -71 -85 149 -68 -10 -108 -189 -89 -41 -96 30 -124 76 -11
7266a1J43j78j6j33N17l05J41k06J4J47j97K61l31K66K02m78K00j31Q6j10J17
$$ -11 132 -46 -62 -195 322 17 158 -48 -34 113 -84 177 -154 112 314 -164 36 -95 -9 -119 -2
7287bJ73j41J11l14K08j87J61n2K55l12mL46j76j91J41Qr5J54j12P7j6n1O5K7
$$ -2 171 30 141 -173 35 -152 9 -43 212 -100 -104 242 66 -125 16 24 -71 83 -29 48 32 -19 46 73
7311G3J16k94J16j53O7j04K34R9k89L37n2j29J1J07M6m8j47k00K81k25j12J15
$$ 73 189 -105 11 -142 -75 -179 55 154 -135 202 150 21 32 139 185 137 -10 -210 71 -154 -266 -151
7333a51J49R3j15m2j45L01q9J4Q3n9j79K25o2P1j79K33q1m1j51q3K7M0J58j0J23
$$ -151 -2 91 -24 -66 -211 90 1 15 98 39 -140 85 23 94 -85 148 67 26 -125 -208 -181 -141 17 7 130
7358A30P6%m80L34l56J88J80l42L63J74j73P7l04L04Qq7K3N6j75j69ql8J76OJ83
$$ 130 206 206 -274 60 -296 -108 72 -270 93 267 94 171 -133 171 179 92 115 171 -4 -173 -181 -219 -43 -37 146
7383A46j79J26k55L08k5j24k52J44k62J21L06l11K66j09J8K40l52L20j83j12K10
$$ 146 -33 93 -162 146 121 -3 -255 -111 -373 -252 54 -257 9 -100 -82 158 -194 126 -57 -169 41
7404D1M4l9j20L1K28j93J47n9J52j90K1l5m4J27j31J18l48J9J93m1k8J60k67J59
$$ 41 85 46 -74 -43 185 -8 139 80 232 42 63 28 -16 111 -20 98 -250 -231 -38 -79 -107 53 -214 -55
7428e5R9K5J90j87L5J06j60J0o4NK6qo6K01k63O6j01M4K33j51j56J57j62J98k31
$$ -55 44 69 259 72 107 213 53 63 -1 4 30 22 -44 157 -106 -40 -141 -97 136 -15 -171 -14 -176 22 -209
7453b09J60Q8lK5j75J62r2J71j95L9j11K47j67j6Q2j52J00j50J94R6j10L24k4
$$ -209 -49 39 36 61 -114 48 -44 127 -68 -29 -140 107 -60 -76 6 -146 -46 -196 -2 94 -16 308 284
7476B84l79k1K49P7j65k38J41J39j02K7k21K27j17K63l52K78j7j04l2P3N1K29
$$ 284 -95 -116 133 210 45 -193 -52 87 -15 12 -209 18 -99 164 -188 90 73 -31 -63 10 61 290
7498B90k98J7j41Q6K56l34N7m3Q8j74J08j21K72PLL5k78K49l35M8o0K72J29j5
$$ 290 -8 9 -132 -46 210 -124 -67 -110 -22 -196 -88 -209 63 70 73 108 -170 79 -256 -208 -268 4 133 118
7522A18k34N6LJ86n1j2l4Q5o8j24r8K44n2Q1q3k24l8J28K35k39J37P9q5K12k41
$$ 118 -116 -60 -57 129 78 66 32 117 49 -75 -173 71 19 100 17 -207 -245 -117 118 -121 16 95 10 222 -19
7547a9j29K68l21J95K3K01l45L05l02oJ1l0K2J0J30j35K35k11L21l36J82j47Q
$$ -19 -148 120 -201 -6 17 218 -127 178 -124 -130 -119 -149 -127 -117 13 -122 113 -98 223 -113 69 -78 -70
7570g0O1j60n4J47J37l1J11pj14n7J20J74j24j57R6Qr5j06K74j77J10k00J70j71
$$ -70 -9 -169 -223 -76 61 30 141 134 20 -37 83 257 133 -24 72 80 -15 -121 153 -24 86 -114 56 -115
7594a15J26M9K01k67n4K1J13J45k34nk46L76k00k61M67j05j32K01k05M30j38j55
$$ -115 11 60 261 -6 -60 -39 74 219 -15 -20 -266 110 -90 -351 116 11 -121 80 -125 305 167 12
7616A2n9J09l2j3k46K69j55J65j86J48l7o9J00%k2q2K98p6n8j88J42K75k32rl7
$$ 12 -47 62 30 17 -229 40 -115 50 -136 12 -25 -94 6 6 -16 -98 200 124 66 -122 20 295 63 54 17
7641A7j48J55l20L10M5j41k06L06N0l12K53l19J52O7q1K73j53R7j04j33J19K39
$$ 17 -131 24 -296 14 59 -82 -288 18 68 -244 9 -310 -158 -91 -172 101 -52 45 -59 -192 -73 166
7663A66j17j22N4j27J84p6l0j35R3K29k98n9L86j66M61j15l94K62k03p3j0L16
$$ 166 49 -73 -19 -146 38 -38 -68 -203 -110 119 -179 -238 148 -18 443 328 -66 196 -7 -80 -90 226
7685B26o5l47L40j03J31j28j0l0p9J47j07J07J76j50r3N5q2p9J28J21l73N17m05
$$ 226 161 -186 154 51 182 54 44 14 -65 82 -25 82 258 108 15 70 -12 -91 37 158 -215 302 -103
7708a03J23p7Pj66O6J53J98j02n4k71K29R9n0Q8j37O3Q9j44P1PL1O6l56K84r7
$$ -103 20 -57 -50 -216 -150 3 201 99 45 -226 3 102 52 140 3 66 155 11 82 89 120 186 -170 114 17
7733A7N6n6J07P7j81j1l2l8M2J15k95N5J86L2l09L60k5n0j39K43k41J07J96j95
$$ 17 73 17 124 201 20 9 -23 -61 -19 96 -199 -144 42 74 -235 125 100 50 -89 154 -87 20 216 21
7757B1j02J76J15m31K66j62Q7K40k17J19p5k61J25J90p2J9J17l12j37L64m6o5
$$ 21 -81 95 210 -221 45 -117 -30 210 -7 112 37 -224 -99 91 19 38 155 -157 -294 70 24 -41
7779d1j9o0J89J21k71J53j13p2J02j05L70k30n1Q8j54K44j60n9q8Q8J6PK71K1
$$ -41 -60 -120 69 190 -81 72 -41 -113 -11 -116 254 24 -27 61 -93 151 -9 -68 -156 -68 -52 -45 226 247
7803B47j53q9N4R2j83k02K50M8o7j97l3M98l04j56l9L72n6Op8R1q6k45K79J00
$$ 247 94 5 59 151 -32 -234 16 64 -3 -200 -233 265 -39 -195 -234 138 82 88 10 101 15 -230 49 149
7827A49n22N30L8k00p2j05K88q2j01j9K24j60l3R4k06J14K17l62J23K87l68K34
$$ 149 -373 157 195 -5 -77 -182 106 24 -77 -96 128 -32 -65 29 -177 -63 154 -208 -85 202 -166 68
7849F8j00K8j5J02J5k42J05j71K13J4K23k57M3j37j27K32PP9l10K54J59l45r0
$$ 68 -32 -4 -19 83 98 -144 -39 -210 3 17 240 -17 26 -111 -238 -6 1 80 -230 24 183 -162 -252
7872b52K88l3N2j15J54k42J30p5J43j65J07J00l92O8M69l86J00J33J4J9k02K19
$$ -252 36 3 55 -60 94 -148 -18 -93 50 -115 -8 92 -300 -232 237 -149 -49 84 98 117 -85 134
7894A34j64J37q4j27K11l24R3K62j96J35k68J31J03j36J38l5j88K23k35L41n0
$$ 134 -30 107 23 -104 107 -217 -124 138 -58 77 -191 -60 43 -93 45 10 -178 45 -190 151 101
7915A01K00l51K3m0J82j63J51k13J51j79L04N5j50K26k04J30l25J30q9j59K18
$$ 101 301 -50 -27 -67 115 -48 103 -110 41 -138 166 221 71 297 93 223 -102 28 -61 -220 -2
7936bK34l67K16J5J01l46n5K56l58K36k8M7O9k61L55j47J79J87l52O1q3K96Q7
$$ -2 232 -135 81 96 197 -149 -204 52 -306 -70 -98 -51 18 -243 112 -35 144 331 -21 40 -43 253 340
7959C40k51k99N8J93j23K19N5j76j16J60k10M1J87l59L78O1q5k31K64M4k22j35
$$ 340 89 -210 -152 41 -82 137 192 16 -100 60 -150 -109 78 -281 97 158 73 -158 106 150 -72 -207
7981b07K45n4k92L21JM1n3O1r9j73J88R0m5R6Q1k26N8J00O8l63J10p0L15p8j67
$$ -207 38 -16 -308 13 14 55 2 63 -36 -209 -21 69 24 120 201 -25 33 133 201 -162 -52 -122 193 115 -52
8006e2K4J22J13l29Q9L4J34ok05J58p7mn3K01k22J6P0R1p6J38l18K1K12j99N9
$$ -52 -28 94 207 -122 -33 1 135 129 -76 82 5 1 -52 149 -73 -57 13 104 28 166 -152 -131 81 -118 -59
8031e9J30j48J1K33j76k58J71K98k47J59k83O2O1K52j62k03L93k71J88j52J1N7
$$ -59 71 -77 -66 167 -9 -267 -96 202 -45 114 -169 -107 -46 206 44 -159 234 -37 151 -1 10 67
8053F7P9k41J86j98J46j32L8R3Q2N1l44L23j18j48Q7K93J7j03k00NK65k51j5k8
$$ 67 146 -95 91 -107 39 -93 -55 38 120 171 -173 150 32 -116 -29 264 281 178 -22 -17 248 -3 -18 -46
8077d6N7q5J16K7J03r6k02K20l6k25Q8K58l11N3J35p9K40k14J28j01k17J61r9
$$ -46 11 -74 42 69 172 76 -126 94 58 -167 -79 179 -132 -79 56 -23 217 3 131 30 -187 -26 -125
8100a25O7j43L52M8k01j14P3R0J70j03k31l3K2O7J58j34M3j40L9J24k97K61K05
$$ -125 -58 -201 151 199 -2 -116 -43 47 217 114 -117 -150 -128 -61 97 -37 6 -134 -95 29 -268 -7 198
8123A98J59l56R2R7k23L5J01k0k58J65j31J92j19P6j38P6N2K55k68J58j90L1J57
$$ 198 357 1 93 190 -33 2 103 83 -175 -10 -141 51 -68 8 -130 -54 -2 253 -15 143 -47 -16 141
8146A41j2j92O8j42K98p5l0j13K04l32M09p6l8r7k1O2j79J8R0r4J14L7m87N87
$$ 141 129 -63 5 -137 161 86 56 -57 147 -185 224 148 110 13 -8 54 -125 -107 -17 -111 3 40 -447 140
8170A40k59K81j62P2N8j65M10m49J07n6q1J59k64K03J25j85J7J2oK5k6
$$ 140 -119 162 0 72 130 -35 375 -74 33 -23 -104 55 -209 -6 119 -66 -49 -37 -43 -18 -44
8191d4
$$ Imaginary data points
##PAGE= N=2
##DATA TABLE= (X++(I..I)), XYDATA
0@%%%%%%%%%%%%%%%%Pj5J6j6J6j6J6k4L2l2M0m8N3o1P1p9Q8j04J19j31J44j63
$$ 0 0 0 0 0 0 0 0 0 0 0 0 0 0 0 0 0 7 -8 8 -8 8 -8 8 -16 16 -16 24 -24 29 -32 39 -40 48 -56 63 -68 76 -87
38h7J83k01K24k49K74l04L37l73M11m54N02n51O08o71P38q14R00r97J104j232
$$ -87 96 -105 119 -130 144 -160 177 -196 215 -239 263 -288 320 -351 387 -427 473 -524 580 -652
58f52J383j556J766k024K350k780L368m226N608q178J4520n9025r4004R5810L3810
$$ -652 731 -825 941 -1083 1267 -1513 1855 -2371 3237 -4941 9579 -49446 -143450 -47640 -13830
73a3830J496O8649L5842m9062j9044m1000p6379J1755P1151J6022L0530N3249
$$ -13830 -12334 56315 92157 43095 24051 -16949 -93328 -81573 -10422 5600 36130 89379
85H9379k4717o2610l1385m5899r774P2540M3319p341L9502J9359p3783o3169r111
$$ 89379 64662 2052 -29333 -75232 -85006 -12466 30853 23512 63014 82373 8590 -54579 -63690
98f3690o250L8312P2975J4040j0918J2413m4305p4974J840K6048j847M7264O1406
$$ -63690 -69940 -31628 41347 55387 44469 56882 12577 -62397 -60557 -34509 -36356 10908 72314
111G2314j5864l0348q573n4433m6683L8293M5387J2285L4276J9596l5955l5626
$$ 72314 56450 26102 17529 -36904 -83587 -45294 93 12378 46654 66250 30295 -5331
123e331k4454l5851Q783N4464L0169J5981J8357l0589n5180j3720m927q665L8611
$$ -5331 -29785 -65636 -56853 -2389 27780 43761 62118 31529 -23651 -37371 -42298 -50963 -12352
136a2352N0284M517k137k621m5788m2997N039J2340J8401M8335K3673k2071j6120
$$ -12352 37932 42449 40312 37691 -8097 -51094 -46055 -33715 -15314 33021 56694 34623 18503
149A8503j9269m3530j1335L0558K1102K3415L4966p270m0506k1062j7842k0007
$$ 18503 -766 -44296 -55631 -25073 -3971 19444 54410 47140 6634 -14428 -32270 -52277
161e2277K1523L9775J6052J3062O438l1195l5541r452r257N411M1581L0011r37
$$ -52277 -30754 9021 25073 38135 44573 13378 -22163 -31615 -40872 -35461 6120 36131 35194
174C5194j397j5710m0467j8863R189O815K2980L8753O830j9065j3874k5114k8511
$$ 35194 33797 18087 -22380 -41243 -32054 -25239 -2259 36494 43324 24259 10385 -14729 -43240
187d3240O312K4158J6028K4353J7016j8878k6204j3596k0133o515K6125K6526
$$ -43240 -36928 -12770 3258 27611 44627 25749 -455 -14051 -34184 -40699 -14574 11952
199A1952J3155J2763p894l2366k0385n675n049J5004L3415J5917l24n231k2828
$$ 11952 25107 37870 29976 -2390 -22775 -28450 -33499 -18495 14920 30837 30513 25282 2454
212B454k8638o145O942J0472K5890K3668l640j4279j5123k3848j2941J1010J6678
$$ 2454 -26184 -32329 -25387 -14915 10975 34643 31003 16724 1601 -22247 -35188 -24178 -7500
225g500J6544K1277M047k0430j9109j3820j3188N379K3387J7693J1574N727j4539
$$ -7500 9044 30321 34368 13938 -5171 -18991 -32179 -26800 -3413 14280 25854 31581 17042
238A7042k5895j3680m407K666J8952K3269Q970j432j0150k2444j8738n23O996
$$ 17042 -8853 -22533 -26940 -24274 -5322 17947 26917 25485 15335 -7109 -25847 -26370 -19374
251a9374J4224K2238J1902n251j2697j7571j8530l117J2764J4300J5769J3868
$$ -19374 -5150 17088 28990 23739 11042 -6529 -25059 -28176 -15412 -1112 14657 28525
263B8525l873j7559j6031j2913n758J1671J8909J3307Q342j021j6666j9492r025
$$ 28525 24652 7093 -8938 -21851 -27609 -15938 2971 16278 24620 23599 6933 -12559 -21584
276b1584k053P704J9200J5947M034l251j2993j8977j1421J651R255J5600J6069
$$ -21584 -23637 -15933 3267 19214 23248 19997 7004 -11973 -23394 -21743 -12488 3112 19181
289A9181N126p330j2800j6320j1455K136J1270J4494J4266N527q317j4232j3578
$$ 19181 24307 16977 4177 -12143 -23598 -21462 -10192 4302 18568 24095 15778 1546 -12032
302a2032j0137J124J2777J5180J1188M003o992j4997j3736p204J868J0852J5905
$$ -12032 -22169 -21045 -8268 6912 18100 22103 15111 114 -13622 -20826 -18958 -8106 7799
315G799J1301J603p450j3921j3637o304L244J1216J4466J0493J221q405j3625
$$ 7799 19100 20703 13253 -668 -14305 -20609 -17365 -6149 8317 18810 20031 11626 -1999
328a999j2492n504L925J1375J3988R187J08q372j3361j1807m445M119J1952J3320
$$ -1999 -14491 -19995 -16070 -4695 9293 18480 18588 10216 -3145 -14952 -19397 -15278 -3326 9994
342I994Q369o26r104j2563j1275l971O206J1223J1764P880j109r536j2329r735
$$ 9994 18363 17737 8633 -3930 -15205 -19176 -12970 -1747 10017 17897 16788 7252 -5077 -14812
356a4812l639O012J2128J0935O728j356r783j2613q344k124N238J2110J1576M679
$$ -14812 -18451 -12439 -311 10624 17352 15996 6213 -6400 -14744 -16868 -11630 480 12056 16735
370A6735k042q685j3218q877k3O459J0186J1821M261l982q459j0997q942J68P706
$$ 16735 14693 6008 -7210 -16087 -16110 -9651 535 12356 16617 12635 4176 -6821 -15763 -15595 -7889
385g889R506R874N422m709j0174r362p148q61Q304J0884P139M307k582j1488j0343
$$ -7889 1617 11491 16913 12204 2030 -7332 -14480 -15341 -7037 3847 10986 15293 12711 1223 -9120
400i120m982K5O694J2436P483J004k741r388j1462m194K665N381J0296R291M09
$$ -9120 -14102 -14077 -7383 5053 12536 13540 10799 1411 -10051 -14245 -11580 -6199 4097 13388 13797
415A3797n576p112j0182o133L737P628P606Q303K504p129q910o547o226J908R946
$$ 13797 8221 1109 -9073 -15206 -11469 -3841 3765 12068 14572 7443 -1467 -8014 -14240 -12332 -2386
430b386Q257N264K696n901j1049o509k208P48Q354J0308M056m68l680r912q791
$$ -2386 5871 11135 13831 7930 -3119 -9628 -11836 -11088 -2734 7574 11630 11162 7482 -2430 -11221
445a1221o80L211N734R675O313k533n652o668q912k047N486N996P286O995j461
$$ -11221 -11901 -8690 -2956 6719 13032 10499 4847 -1821 -10733 -12780 -7294 -1298 5988 12983 11522
460A1522q386o632n524l583M775Q914N921M023K43p895q904l305j694K107R117
$$ 11522 3136 -3496 -9020 -12603 -7828 1086 7007 11030 11273 3378 -5526 -8831 -10525 -8418 699
475F99Q177J223j225m614r620n320J463K771O207R407K730m512m908o524p164
$$ 699 8876 10099 8874 4260 -5360 -10680 -9217 -6446 -239 9168 11898 7386 2478 -4046 -11210
490a1210R21N939N336O589M244m266p605m339m728j398O413P291L785K992j511
$$ -11210 -10289 -4350 986 7575 11819 7553 -52 -4391 -9119 -10517 -4104 3187 6972 9964 8453
505H453q588n973k040r94M019R043M574J89j049o634q471j972K060K878P731O935
$$ 8453 -135 -6108 -8148 -9142 -5123 3920 8494 8683 7634 1000 -7471 -9443 -7383 -4505 3226 10161
521A0161j242m415l663p104m238L693N045M401N862J476n647n885l666m413J515
$$ 10161 8919 4504 841 -6263 -10501 -6808 -1763 2638 8500 9976 4329 -1556 -5222 -9635 -8120
536h120P344M986L024J856l847p781m138j312N79N844P290K287p08k887o731n267
$$ -8120 -776 4210 7234 9090 5243 -2538 -6676 -7988 -7409 -1565 5725 8012 7304 4417 -2314 -7581
552g581m88K608M170O425L620k168l213m561o258j574M710M074M285M685j220
$$ -7581 -8069 -5461 -1291 5134 8754 6586 3373 -1188 -7446 -9020 -4310 -236 4049 8734 7514
567G514n746m499l583k281L170O803L786K010J30m705o693k430m87J824O151N425
$$ 7514 1768 -2731 -6314 -8595 -5425 1378 5164 7174 7304 2599 -4094 -6524 -7011 -5187 964 6389
583F389N15j203l259o201l716J048K474M278O335J420l369l636m021m894P41M935
$$ 6389 6904 5701 2442 -3759 -7475 -6427 -3953 325 6660 8080 4711 1075 -2946 -7840 -7099 -2164
599b164K875M880K911l677n313k421l336j242M932N686J830J742q88o184m483
$$ -2164 711 5591 8502 4825 -488 -2909 -6245 -7487 -2555 3131 4961 6703 5815 -369 -4852
614d852p03n54K720O410L334p25j065m188n706j481K049K135M945M623q78l257
$$ -4852 -5555 -6109 -3389 3021 6355 5630 4565 377 -5329 -6810 -4761 -2626 2319 6942 6064 2807
630B807k573m704k994K748L438L252M389O31m297m132k333k648J229M852L492
$$ 2807 234 -4470 -7464 -4716 -1278 1974 6363 6994 2697 -1435 -3768 -6416 -5187 -335 3157
645C157K057J362l054n746k451o13L38L839N325J347p27j777m680l760Q7J547
$$ 3157 5214 6576 3522 -2224 -4675 -5288 -4950 -1111 4214 5561 4834 3057 -1623 -5383 -5296 -3749
661c749K650M842K297j156l134k943l723j001K675L081L509K886j105m326k926
$$ -3749 -1099 3743 6040 4884 1750 -1193 -4916 -5917 -3242 -161 3348 6234 5129 803 -2123
676b123k326j470K356M582K448J530r4l378m568j326n56J069M628L793J58q08
$$ -2123 -4449 -5919 -3563 1019 3467 4997 4903 1525 -3043 -4369 -4925 -3856 772 4565 4723 3915
692C915k170m419k650Q87J681L183M001R16k342k017l381l102O60L385K409K541
$$ 3915 1745 -2674 -5324 -4437 -2756 427 4428 5344 3002 985 -2396 -5498 -4838 -1453 956 3497
708C497K073k013l727k227k279l02L483L468J352J210j071l749l238o72OK141
$$ 3497 5570 3557 -170 -2397 -4676 -4978 -1495 1973 3325 4535 3464 -285 -3523 -4195 -4189 -2048
724b048M305K246n10n09l107m006j004J254K022L196K600l2k051k313l287j907
$$ -2048 2257 4503 3993 3484 377 -3629 -4633 -3379 -1357 1839 4439 4407 2356 43 -3244 -5151
740e151J816K572K368K493M93k577k805k107j615J071L175K689J179Q67k438l312
$$ -5151 -3335 -763 1605 4098 4591 2014 -791 -2898 -4513 -3442 -267 2422 3601 4468 2030 -1282
756a282k285n52M99L185L324Q49j4j732l178k817j76J522K402K782J825j078k016
$$ -1282 -3567 -4119 -3620 -435 2889 3738 3724 1992 -1186 -4003 -4179 -2657 -255 2527 4352 3274 1258
773A258k377k370n98J829K566K380J185l72k487k576j829l97J618K885K192O62
$$ 1258 -1119 -3489 -4087 -2258 308 2688 3873 3501 1014 -1562 -3391 -3788 -2170 715 2907 3569
789C569n45k218k838j430j00J504K559K402P26p13k253k587j562J94J885J959
$$ 3569 3024 806 -2032 -3462 -3562 -2058 501 2903 3629 2916 663 -1924 -3486 -3292 -1407 552
805E52K576Q15j261k291k083j920J81K270K105J863P88j295k333k210j099K92
$$ 552 3128 3943 2682 391 -1692 -3612 -3431 -1161 944 2807 3595 2300 -33 -2243 -3342 -3050
821c050J867K453J714K36j019k445k238q18N63J757K311J658m3p76k643k137k97
$$ -3050 -1183 1270 2984 3220 2201 -244 -2482 -3300 -2737 -980 1331 2989 2946 2170 -473 -2610 -2907
838b907L32J967K024J487J8j297j979j929q94O81K292J806J156K19j360k585j446
$$ -2907 -2575 -608 1416 2903 2921 1624 -355 -2284 -3178 -2497 -205 1601 2757 2976 1616 -969 -2415
855b415m60N76J969K051J136k37j308k108j558o31J077J753J688J640n68j519
$$ -2415 -2875 -2299 -330 1721 2857 2620 1312 -796 -2354 -2985 -1908 -155 1533 3173 2605 1086
871A086k084j165o04R09J944J744Q36p6j695k238j097j27Q17J935J990K50j13
$$ 1086 -998 -2163 -2767 -1858 86 1830 2666 2590 895 -1343 -2440 -2567 -1750 185 2175 2425 2312
888B312j306k100j552J78J136J660J806M86p35j524j473j318j33J417J468J608
$$ 2312 1006 -1094 -2646 -2468 -1332 328 2134 2620 1885 361 -1112 -2430 -2563 -1146 322 1930
904A930R98j094k124j046j072RJ603J558J052N91l23k111j376o99MR97J974J236
$$ 1930 2928 1834 -290 -1336 -2408 -2399 -796 762 1814 2405 2082 -29 -1405 -2104 -2100 -1103 871 2107
922B107%p85j460j585n70M27J117J594J472oj309q09j854o37P55J337J079J494
$$ 2107 2107 1322 -138 -1723 -2293 -1866 -749 845 2317 2311 1002 193 -1661 -2298 -1543 -206 873 2367
940B367M4j293j597r55r49R36J304J251O09O39j134j768j235o2l0J708J744L73
$$ 2367 2411 1118 -479 -1434 -2383 -1447 -143 1108 1717 2356 1222 -546 -1781 -1843 -1873 -165 1579 1952
958A952o8q15j616j689J39Q04O91J876R80m88r49j022j552m69J083J071J158R95
$$ 1952 1884 1069 -547 -2236 -2097 -1293 -602 1274 2254 1766 817 -205 -1757 -2226 -1143 -72 1086 2081
976B081j85j246j179j056o48Q52J911Q62M58L4j321j438r54J58M05J474J222L11
$$ 2081 1896 650 -529 -1585 -2233 -1381 530 1392 1850 1884 563 -875 -1829 -1671 -1266 208 1430 1741
994A741l85p86j691q28O61K89R96J718K5o24q16j245r59J59J254O05J261P42r75
$$ 1741 1356 570 -1121 -1949 -1288 -999 -3 1715 1740 1116 300 -945 -1904 -1745 -491 114 1375 2117 1142
1013A142j189p40r59L9J216J484J97P36p13j367r03j85k07P38J657O20k71k74
$$ 1142 -47 -787 -1746 -1707 -491 993 1190 1926 1213 -154 -1057 -1242 -1449 -711 946 1566 1295 1021
1031A021j147j251l30L49Q38J162J157m61p19m23j148r68Q34Q07P74J030%j152
$$ 1021 -126 -1377 -1707 -1358 -520 642 1799 1338 619 196 -952 -1920 -1086 -279 495 1525 1525 373
1049C73r31m18n68J4J386M85Q71L66r46j265n37J02l65J198J592O0m14j24j078
$$ 373 -558 -976 -1544 -1530 -144 341 1212 1578 632 -633 -1170 -1068 -1433 -235 1357 1417 1003 879 -199
1068a99j174rO08M28J441O86o73n90o26j249j60Q79P34Q91N50l09j018n85q13
$$ -199 -1373 -1382 -774 -346 1095 1781 1108 518 -108 -1357 -1517 -638 96 987 1537 1228 210 -375 -1188
1087a188l27Q55J030N44K68M4q88j222k21j67N80J041Q09j27K09o93j355n02N77
$$ -1188 -1515 -660 370 914 1182 1226 338 -884 -1105 -1272 -692 349 1158 1031 1240 547 -808 -1310 -733
1106g33J16R18R39Q1n37m90p91j041M39P09O48Q14L38p41q61m01o83M9R48P20
$$ -733 -617 301 1240 1321 784 294 -497 -1538 -1099 -390 258 1072 1410 669 -192 -593 -1276 -1227 -279 441
1126D41M02K54k62r15p20j61k70P29J191L94j21k41n71j152N2k4M10R75P88j74
$$ 441 843 1097 835 -80 -800 -961 -1231 -502 689 1083 962 721 150 -1002 -950 -974 -564 411 1199 1025
1146A025n39m99p34n53O02M61Q82M18O9p22p69l03m67K71R98L40L78L58q38p99
$$ 1025 486 -13 -747 -1300 -698 -237 645 1063 1132 410 -359 -662 -1129 -858 140 480 858 1216 378 -421
1166d21j6n90L86P69Q86j22j24k12j035l76J39L90J62R42Q8j89k29n67r29L6O92
$$ -421 -437 -1027 -641 128 1014 892 768 556 -479 -855 -716 -326 -164 778 866 677 448 -119 -1048 -1012 -320
1187c20L40M74P37o23l54n66j13n39M62Q98L39N3l8q60m72j57l06O52O10M87K73
$$ -320 20 494 1231 608 254 -312 -425 -964 -502 396 735 788 750 -110 -582 -739 -1045 -393 217 704 977
1208I77o3n47j215l37M82J93P72O55k2m67l84o60o4j38K80Q13L00L19n38n06m17
$$ 977 914 367 -848 -1185 -703 -510 262 917 895 428 44 -616 -680 -818 -538 275 575 894 356 -150 -567
1229e67l85J0Q17N32J12J06j10n11o65k61Q0O68N19K61n0k50m51o99K47j46O01
$$ -567 -952 -942 -125 407 519 625 515 4 -661 -922 -842 -174 345 606 556 306 -145 -844 -597 -743 -142
1250a42L99O45m15p1l71q09q1L58M44M88M40r6p23l85k22k95N26P4M41M87R6o07
$$ -142 257 902 487 416 45 -764 -845 -487 -43 445 885 789 66 -319 -541 -836 -310 -236 205 692 788 181
1272A81l96k88j69J9Q03L35M4O8k88p99l02R7L46O65J64K72k81l34m60n03L12
$$ 181 -215 -503 -672 -653 150 485 529 597 309 -490 -792 -695 -349 316 480 752 471 137 -323 -826 -514
1293e14J72N26J20L93P4p63l52k05K7O9N83K29Q8J34n93l58k88J76O9O99K36k6
$$ -514 -342 184 304 697 771 8 -344 -549 -522 -453 130 359 447 581 -12 -370 -658 -482 -413 286 522 496
1315D96J56o61k72k73P7N65J19J29M05j72o63n83K12j67K11N09M40o3k71j58m37
$$ 496 652 -9 -281 -554 -477 88 207 336 741 569 -94 -677 -465 -632 -421 88 528 465 194 36 -401
1336d01j07mL90J95K63L29m68l86k2m40J12M04M84K91k58j53l30j25j75R8L28
$$ -401 -508 -512 -122 73 336 665 197 -189 -211 -651 -539 -135 349 640 382 229 -101 -226 -401 -303 25
1357B5J91K96l05M3l84k60rp2M92L63O6j67r0j53m25m7K0K75M51L53j54m00l24
$$ 25 216 512 207 250 -134 -394 -403 -475 17 380 446 279 189 36 -389 -436 -416 -141 310 663 509 109 -215
1380b15j09k69N56P5M26j5M1p42pl96J65M79K71K76l39%p7m61n6R1J36K16O11
$$ -215 -324 -593 -37 38 464 449 490 -252 -259 -655 -490 -11 260 536 197 197 120 -341 -397 -306 -170 46 657
1403F57k68q7l22l99M8r1M30J42L53n2p0m89k60M8R5n9N13K00L3K2m67k82j9L9
$$ 657 389 302 -20 -419 -371 -462 -32 110 463 411 341 -148 -408 -360 -265 -324 189 389 422 444 -23 -305 -324 -285
1427b85J34J39L39M9k26j55k0m02mJ74K95M46r5k96k34k16O0J04R3K28K85j6l09
$$ -285 -151 -12 327 376 150 -5 -25 -427 -431 -257 38 484 389 93 -141 -357 -297 -193 -100 128 413 397 88
1450H8k30j98N8q1K14K64K69L2m84K6j28o7m9L13K45K8k63J29m7k68k68L97J5
$$ 88 -142 -340 -282 -363 -149 115 384 416 -68 -42 -170 -237 -286 27 272 300 37 166 119 -149 -417 -20 -5
1473eJ67J53k67L42o05j27K53J8J51J16P0n4k13k26K9l2P7K76OK16k71J7j96l22
$$ -5 162 315 48 390 -215 -342 -89 -71 80 196 266 212 -1 -227 -198 -230 -153 123 129 345 74 91 -105 -427
1497d27j57N00K98j6n8O2j17k52J38k42K25k3M13m9o1j01l14p3p7J77r3P57k63
$$ -427 -584 -84 214 198 140 202 85 -167 -29 -271 -46 -69 344 295 234 133 -181 -254 -331 -154 -247 510 247
1520B47j31n0k91m3Q4J00N8J66K52l03m11j92J47K61J51J0K86j50J24l45m8O4
$$ 247 116 66 -225 -268 -184 -84 -26 140 392 89 -322 -514 -367 -106 45 55 341 191 315 -30 -78 -14
1542a4k90K38L17l22M09j65l15L31l70K01O0j25L83k82K31l16ll9k74L94j39L65
$$ -14 -304 -66 251 -71 338 173 -142 189 -181 20 80 -45 338 56 287 -29 -32 -71 -345 49 -90 275
1564B75j03J26l35j20L4j55L29n7J73J32k42l17J25k0p0L26j38K01rl5j13k02
$$ 275 172 298 -37 -157 -123 -278 51 -6 167 299 57 -260 -135 -155 -225 101 -37 164 155 120 7 -195
1586a95M6J61J9J66m0Q0k74L2l73K13j87K97K24J8oj16R2k21j55K10j25J98K29
$$ -195 -149 12 31 197 157 237 -37 -5 -378 -165 -352 -55 169 187 181 65 157 -64 -219 -9 -134 64 293
1609B93j6k82q8J92m5j19J37J38q9J11o47K69n9J88j11K50PP8L9k37j05j22K46
$$ 293 277 -5 -93 99 54 -65 72 210 121 232 -415 -146 -205 -17 -128 122 129 207 246 9 -96 -218 28
1632B8n3j4J89L7r1K16j76l58J76M4O0n9K50l08MK67l97J73n7M99l96R2R0k67
$$ 28 -25 -39 150 187 96 312 136 -222 -46 -2 58 -1 249 -59 -55 212 -185 -12 -69 430 34 126 216 -51
1656e1o3k1O8K68o0LJ58l18k46J25j54J62J49n0l1K04q0m9k93J12Q2O4J74M3p1
$$ -51 -114 -135 -67 201 141 144 302 -16 -262 -137 -291 -129 20 -30 -61 143 63 14 -279 -167 -85 -21 153 196 125
1681A25j79N1M2l64J64n6M16k1J83l10o43K15K95L6K57N4R1l27R8k8k2p5l2K21
$$ 125 -54 -3 39 -325 -161 -217 199 178 361 51 -592 -377 -82 -46 211 265 356 29 127 99 77 2 -30 191
1705A91k5k04P8J6k13l6M8kL68K1j45nj60k47J54N2o2J26J61J63m46M12l06l27
$$ 191 166 -38 40 56 -157 -193 -145 -147 221 242 97 92 -68 -315 -161 -109 -171 -45 116 279 -167 245 -61 -388
1729c88M69J00o8j96J82K4o8k44o4J21R0J46K0k17L17pk67N2r3J63J97J52l44
$$ -388 81 181 113 -83 99 123 55 -189 -253 -132 -42 104 124 -93 224 217 -50 2 -91 72 269 421 77
1752G7O5k06r8K5Q3J33j24K35k13J80r5l40J18K58j03J30j1J84m57K19j30J62
$$ 77 142 -64 -162 -137 -54 79 -45 190 -23 157 62 -278 -160 98 -5 125 114 298 -159 60 -70 92
1774I2N4k98K28kJ68%m39j21l1K53J03Q9J52P5j44m39k4J91j1j08M21k7l6k94
$$ 92 146 -152 76 74 242 242 -197 -318 -349 -96 7 96 248 323 179 -260 -284 -93 -104 -212 209 182 146 -148
1798a48L42k67j79K98%J0O8k01R9lq9j23J49N6j76K35J09q8r8j43k1L48K0L21
$$ -148 194 -73 -252 46 46 56 124 -77 22 19 -70 -193 -44 12 -164 71 180 92 -6 -149 -170 178 198 519
1822E19n23K08l3k38J34j26N9J36q4k5P7L2k11k99K82r1K28N6q8Q0m7j73K49p7
$$ 519 -4 204 171 -67 67 -59 0 136 52 27 104 136 -75 -374 -92 -183 45 101 13 93 46 -127 122 45
1846D5k63M23o5o7q9J38k97PP7J59nn3Q2p8l6r9J98q6j2l2L6nK92k90p2J52L4
$$ 45 -218 205 140 73 -16 122 -175 -168 -91 68 63 10 92 14 -22 -121 77 -9 -21 -53 -17 -22 270 -20 -92 60 94
1873I4Q7k59P7j8o5j26RJ39l30L58J96j77L0K10j98p0k43L03O2o6l0J29Lk11N
$$ 94 181 -78 -1 -19 -84 -210 -201 -62 -392 -34 162 -15 15 225 27 -43 -286 17 79 13 -17 112 115 -96 -91
1898i1J93j13j29K16pJ61j66m1J11j74K19k7j86j9K38n8J1j95q2K25l23M23j69
$$ -91 102 -11 -140 76 69 230 64 23 134 -40 179 152 -34 -53 185 127 138 -57 -139 86 -237 186 17
1921A7K3J68k97P3j21J31M5P9N4j91J3n4M1j39L16j64K52k0q5j99Q4p6J28oo7
$$ 17 40 208 -89 -16 -137 -6 39 118 172 -19 -6 -60 -19 -158 158 -6 246 226 141 -58 26 -50 78 72 5
1946Ek8L03j77j07o4J62l35J16J14J85m5k48J13N0J82m37L62r8J61j86Kj07l2
$$ 5 -23 280 103 -4 -68 94 -241 -125 -11 174 129 -119 -6 44 226 -211 151 53 214 28 30 -77 -109
1969a09K16j20Jj88M20l09J45k9j35ql4M9n9K19PJ74j88J73j29K10l48o9n6J26
$$ -109 107 -13 -12 -200 220 -89 56 27 -108 -116 -150 -101 -160 59 66 240 52 225 96 306 -42 -111 -167 -41
1993d1K64k55j2L1m1j34K96m2q0K64l35J7J18J3N6j28q1RL44l23Q3k27K12M4m9
$$ -41 223 -32 -44 -13 -54 -188 108 66 -14 250 -85 -68 50 63 119 -9 -90 -81 263 -60 23 -204 8 52 3
2018CK69m7k19Qk18P8K31k4k8Q8j48J05pm7L4k13L36j58m6o1Q1j92J74j20K22
$$ 3 272 225 6 14 -204 -126 105 81 53 141 -7 98 91 44 78 -135 201 43 -3 -64 17 -175 -1 -121 101
2043A01rK38j70m6j92l01O7K93J47r7r8J22j18N4l6j28M3o7L8K16k42o3L63J3
$$ 101 92 330 160 114 -78 -379 -312 -19 128 31 -67 55 -63 -9 -45 -173 -130 -197 -159 57 -185 -248 115 128
2067A28j4j33J02k57K40J48k33Q1j27O4l7J84j81Q8O2j67k8O5l9k7l7K01R9k52
$$ 128 114 -19 83 -174 66 214 -19 62 -65 -1 -38 146 -35 53 115 -52 -80 -15 -54 -81 -118 83 182 -70
2091g0J46k36J38M55m24Q6j53M9J26O3j62r9R2k04J43J08k4q1O7j84J29j83K60
$$ -70 76 -160 -22 433 9 95 -58 -9 117 180 18 -81 11 -193 -50 58 34 -47 20 -164 -35 -218 42
2114D2o6M5M6j85J55m9j0k7J30P8j21k1R3j58j65K15M2j27J71J20l87K82Q6k13
$$ 42 -24 21 67 -118 37 -12 -22 -49 81 159 38 17 110 -48 -213 2 44 -83 88 208 -179 103 189 -24
2138b4J53q7J1k71N04l23j15L40k37O3o4K89m23K38M5k57K78l17J83J07o6j30
$$ -24 129 42 53 -218 286 -37 -152 188 -49 14 -50 239 -184 54 99 -158 120 -197 -14 93 27 -103
2160a03K5J67j5k4j8R5k30J57j5K6j85L94l67OK67k43J25K5n1k54J53j10j3J10
$$ -103 -78 89 74 50 32 127 -103 54 39 65 -120 274 -93 -87 180 -63 62 87 36 -218 -65 -175 -188 -78
2184g8p0K63k3j45J29K5j92L69k14p4j65P6mj0K2O8Q8q9J84k47K13k79j15M29
$$ -78 -148 115 92 -53 76 101 -91 278 64 -10 -175 -99 -103 -113 -91 -23 65 -24 160 -87 126 -153 -268 161
2208A61j32q7L9N5Pm6j37K29o2r5J15R3J44j29q8j0m4r6K56j12P2rj00j32J00
$$ 161 29 -58 -19 36 43 -3 -140 89 27 -68 47 140 284 155 67 57 13 -83 173 61 133 124 24 -108 -8
2233hJ86j28K30l44L97k33j73NJ57o8R5k32P6j5j49l3L29M7l5k10r9K04r6J71
$$ -8 178 50 280 -64 333 100 -73 -68 89 21 116 -116 -40 -55 -204 -237 92 139 104 -106 -205 -1 -97 74
2257G4k70K52j02K11p9j66M6K0L3P9k14J22l8j27O4p9L63j67o9P1j03N7l87N10
$$ 74 -196 56 -46 165 86 -80 -34 -14 19 98 -116 6 -32 -159 -95 -174 189 22 -47 24 -79 -22 -409 101
2281A01k33J45K05l06J03L07j48q9o1j13J63o2kj37J96l19K65N5j1n5l0J08K00
$$ 101 -132 13 218 -88 15 322 174 85 24 -89 74 12 10 -127 69 -250 15 70 59 4 -26 82 282
2304B82m17K21j24j2j9L6R1N0k3kk44K22k06k5J97j68J81O8pk91J90K66l69J6
$$ 282 -135 86 -38 -50 -69 -33 58 108 85 83 -161 61 -145 -170 27 -141 40 108 101 -190 0 266 -103 -87
2328h7L6m7Q5n0J91l31P1L26m11K19j00k7J23J65j55m9j86q4M61l06Q9N9J01j27
$$ -87 -51 -98 -13 -63 128 -203 -132 194 -217 2 -98 -125 -2 163 8 -41 -227 -311 150 -156 -67 -8 93 -34
2352c4Kj08K29J9J21k66J36k12J02J4N5p8j08R1Q7k09Q1j77K08J22k94J40K84
$$ -34 -32 -140 89 108 229 -37 99 -113 -11 3 58 -20 -128 -37 50 -159 -78 -255 -47 75 -219 -79 205
2375B05q7m0%J58n7J8j82k56J4K0J05J52p6J18l06J17J32p2k47M03o3m0J01k2
$$ 205 118 78 78 236 179 197 15 -241 -227 -207 -102 50 -26 92 -214 -97 35 -37 -284 119 56 16 117 95
2399I5N4l00J36Jj93K83k4Q4mk91J92J95l14q2J4J57J84k12M0k72J43J39R3M9
$$ 95 149 -151 -15 -14 -207 76 52 136 132 -159 33 228 -86 -168 -154 3 187 -25 15 -257 -114 25 118 167
2423A67o3j19q9l1K41j67K70m20L52j2j08j18KP0K47j90M2j62J95p6O1j01J73
$$ 167 104 -15 -104 -135 106 -61 209 -211 141 129 21 -97 -95 -25 222 32 74 -88 107 31 92 -9 164
2446A64j41j68L81k46R0K7j58O6n4L5l6K2J85j20l0j16K33q7Q6l42J24Q1p8J12
$$ 164 23 -145 236 -10 80 107 -51 15 -39 -4 -40 -18 167 47 17 -99 134 47 133 -209 -85 -4 -82 30
2470C0J4j93R0O4r7J34k3K2l9j70J77J80l87L24j02j8j20R1o8J78n4J8q7J52k00
$$ 30 44 -149 -59 5 -92 42 19 41 2 -168 9 189 -198 126 24 6 -114 -23 -91 87 33 51 -36 116 -84
2495h4j7K47j71m9j31K64l55K87O3q2N0j93J8lK08J67j60J98k40l5J27k8r8m1
$$ -84 -101 146 -25 -74 -205 59 -296 -9 54 -28 22 -171 -153 -156 52 219 59 257 17 -18 109 81 -17 -58
2519e8n4J10j23J00L1O1m2k0j06L09k04j47Q7q2k5K84j19r3K39k58K2p4L26j67
$$ -58 -112 -2 -125 -25 6 67 25 5 -101 208 4 -143 -56 -138 -163 121 2 -91 148 -110 -88 -162 164 -3
2543cj0J5j86J43J16J20j35M7k97J85K14m1K5k43j8K5R8j9P0O6K4k89J6M0r7J27
$$ -3 -13 2 -184 -41 75 195 60 107 -190 -5 209 168 193 -50 -68 -43 55 36 106 172 196 -93 -77 -37 -134 -7
2569gj06lk2K9J75m9k4%J31j19J30r8qM6L0m7J39j99p1R1j1j96J37J43r9j10J33
$$ -7 -113 -116 -138 -109 66 17 -7 -7 124 5 135 37 29 75 105 58 197 -2 -73 18 7 -189 -52 91 -8 -118 15
2596A5l39M18j3Kj04J80p2J2J10j38J03j32j29O6M9J25n3j74J85N2j43p4q0J59
$$ 15 -324 94 81 83 -21 159 87 99 209 71 174 42 -87 -21 28 153 100 -74 111 163 20 -54 -134 25
2620B5o7P5N0j46Q1O5j80k6K30k48K13k35M30l49o3J2P5M2j53J11L19l29Q5o1
$$ 25 -42 33 83 -63 18 83 -97 -123 107 -141 72 -163 267 -82 -145 -133 -58 -16 -169 -58 261 -68 17 -44
2644d4p9J80J99k68J91R7n2k64PM24n22J48K65o57L57m7J9K26q8k15M40l04O2
$$ -44 -123 57 256 -12 179 276 224 -40 -33 391 -131 17 282 -375 -18 -65 -46 180 92 -123 317 13 75
2667G5j18r7K48j72r4K68q6k6m0K84k23J14l8L5j45p5o6%L59k01l9Q1j52n0J8
$$ 75 -43 -140 108 -64 -158 110 24 -2 -42 242 19 133 95 130 -15 -90 -156 -156 203 2 -37 44 -108 -158 -140
2692a40J59O1k70J73l19M25M9j94O3J49k16K83j90jJ19Jk79P6j06QK74j59k0R3
$$ -140 19 80 -190 -17 -336 89 138 -56 7 156 -60 223 33 32 151 152 -127 -51 -157 -149 125 -34 -54 39
2716C9j11K97l25j9j91J12J31L3q0J74O1k36J02O3P5k18L08j84K46k03K9l27L44
$$ 39 -72 225 -100 -119 -310 -198 -67 -34 -114 60 121 -115 -13 50 125 -93 215 31 277 74 103 -224 120
2739A20K8k24N2l08L79j59J35p2o7L81l42J92j63lPj61L23p4qO0N8k87K31q0N6
$$ 120 148 -76 -24 -332 47 -112 23 -49 -116 265 -77 115 -48 -51 -44 -205 118 44 36 96 154 -133 98 18 74
2764G4k14K45k47R6K9K99j85k49L46Ok68J89k71K06l3m7O0k39K47p5K42n04L25
$$ 74 -140 105 -142 -46 -17 282 97 -152 194 200 -68 121 -150 56 23 -24 36 -203 44 -31 211 -293 32
2787C2l28K59L3mJ28Rj28K07k63L9k2j09K53J6q5m1L5k95L87qj35J50j73N1K52
$$ 32 -296 -37 -4 -8 120 129 1 208 -55 -16 -38 -147 106 122 37 -4 31 -264 123 115 -20 130 -43 8 260
2812B60l9jl09J35j68P1q3K15k22K1P2O0j5q7J83l4k62L53o8j69M0j66J53j94
$$ 260 221 220 -89 46 -122 -51 -134 81 -141 -120 -48 12 -3 -90 93 59 -203 150 82 -87 -47 -213 -60 -254
2836b54K87O1k94jR5J85l7pR6j70k0K12q6J94j40o8m8n5j31l0K23R9o5k5J71l76
$$ -254 33 94 -200 -201 -106 79 42 35 131 -39 -59 153 67 261 121 53 5 -50 -181 -211 12 111 46 21 192 -184
2862a84N22k30N6r5j02J3K47k59Q1o7n2K74l14J20J40J6l40j44L37j96K45J47
$$ -184 338 108 164 69 -33 -20 227 -32 49 -18 -70 204 -110 10 150 166 -174 -318 19 -177 68 215
2884B15k42J02J12j43m4j29m7L43lk01l3K09j84R7K6nP0j55J3O3j33k74L18K11
$$ 215 -27 75 187 44 0 -129 -176 167 164 -37 -70 139 -45 52 78 73 143 -12 1 64 -69 -343 -25 186
2908A86k10K09k09J48j44J73N9k69J21j77L49k23M9pj7n0j40K41j4j29L17j29
$$ 186 -24 185 -24 124 -20 153 212 -57 64 -113 236 13 62 55 38 -12 -152 89 75 -54 263 134
2930A34K18m39o5k11M53nk55K17k90k6K18j40M49m82L34q3N1o1j47J7o9J5Q5J36
$$ 134 352 -87 -152 -363 90 85 -170 47 -243 -269 -51 -191 258 -224 110 27 78 17 -130 -113 -182 -167 -82 54
2954E4K5p2J52j07j69n7K86o7m4J15K1j53m9J27r8L8k44L08j41J23m2O8j76M6
$$ 54 79 7 159 52 -117 -174 112 45 1 116 137 -16 -65 62 -36 2 -242 66 -75 48 6 74 -102 -56
2978e6k2M9pQ7J10k21J63J06j76K58j94j68J44j02N0j26K01k06J77Pr4K27m96
$$ -56 -78 -29 -36 51 161 -60 103 209 33 291 97 -71 73 -29 21 -105 96 -110 67 74 -20 207 -289
3001b89K81l12K63M2m5k7n3J20J18J79k91Q9l5N8j92J37r5%k1J38K9l3k1O8j5
$$ -289 -8 -320 -57 -15 -60 -87 -140 -20 98 277 -14 75 40 98 -94 43 -52 -52 -73 65 94 61 40 108 93
3026I3l3J62l82J35nOJ86l6j96J2j63K03Q4k57L42o0m7j61K67k34J19J74k74J39
$$ 93 60 222 -160 -25 -30 -24 162 126 -70 -58 -221 -18 66 -191 151 91 44 -117 150 -84 35 209 -65 74
3050G4k39J84j9J02J29n45J30J29L3k43K98p6l3n4J03j51j6J44P6n3J12J08k47
$$ 74 -165 19 0 102 231 -314 -184 -55 -22 -265 33 -43 -76 -130 -27 -178 -194 -50 26 -27 85 193 -54
3073e4j23L90q4j65L02p5r8k22N20n20q2L43k77J76Kj67J09j00K9J7L61k72O6
$$ -54 -177 213 129 -36 266 191 93 -129 391 -129 -211 132 -145 31 33 -134 -25 -125 -96 -79 282 10 76
3096G6J55j88K4m05M06k48K57K6k8k86K32M9o8J42k73N0k01L37j09O7K9j82l1
$$ 76 231 43 67 -338 68 -180 77 103 75 -211 21 70 2 144 -129 -79 -280 57 -52 15 44 -138 -169
3119a69N0M62l09J33o1j24ON6l8j4J81l60J37j5L1J35k02K48j41K09n5k43J42
$$ -169 -119 343 34 167 106 -18 -12 44 6 -8 173 -187 -50 -65 -34 101 -101 147 6 215 160 -83 59
3142E9J05j52q7K88L4R1m77M49j77j17R7k50K59j30K4j04J65j67J50Q6j44l0L2
$$ 59 164 12 -75 213 247 338 -139 310 133 16 113 -137 122 -8 16 -88 77 -90 60 146 2 -28 4
3165DR9j55J84j70M3j60K12O0l88K40l7j6P6J03j83j56K43J07l8%k79J8N4L59
$$ 4 103 -52 132 -38 5 -155 57 117 -271 -31 -68 -84 -8 95 -88 -244 -1 106 68 68 -211 -193 -139 220
3189B20k50O6ml1P1k17L32l42J61j68L1J17m53K11K10K23j99j11J44J33r7j24
$$ 220 -30 36 32 1 72 -145 187 -155 6 -162 -131 -14 -467 -256 -46 177 -22 -133 11 144 47 -77
3211g7Q3j0j19J82Lm5P6m8L9j05q8r5L46j31PK25m43N6J40l7N1r0N2l8q6K93k81
$$ -77 6 -4 -123 59 62 17 93 45 84 -21 -109 -204 142 11 18 243 -200 -144 -4 -41 10 -80 -28 -66 -152 141 -140
3238a40J40J41K7k13K32ol0o0K4j18p0j07K42j71J22n8J86k64J4J10l1K01j76
$$ -140 0 141 168 -45 187 181 151 91 115 -3 -73 -180 62 -109 13 -45 141 -123 -109 1 -30 171 -5
3261eJ1j50L52l06l0J38K9k93L45j53k35K47J83j10Q3k03%Jj91L55p0K2k7o4l
$$ -5 6 -144 208 -98 -128 10 39 -254 91 -62 -297 -50 133 23 106 -97 -97 -96 -287 68 -2 20 -7 -71 -74
3286g4o4p1M41k09j07J04P3k77L36o6j8M4M3l22N8J21r5k6K50k06M1J41l08K75
$$ -74 -138 -209 232 23 -84 20 93 -184 152 86 68 112 155 -167 -109 12 -83 -109 141 -65 -24 117 -191 84
3310H4j36L09l21K24Q0j61r1l5oJ98q3j77L60l15k3J03J15l76K47Q5Qj55L2j73
$$ 84 -52 257 -64 160 240 79 -12 -47 -53 145 62 -115 245 -70 -93 10 125 -251 -4 81 89 -66 -34 -207
3334b07J29RQ7J4q9L0J60j69L25j65j01J00j44j1K50k60R0k74K26MLk78Q8J83
$$ -207 -78 -69 18 32 -57 -27 133 -36 289 124 23 123 -21 -32 218 -42 48 -226 0 4 7 -271 -183 0
3358@l0J37k05K10j01J31J11j66k12J15J13j49J23o1j61N5L7k24J94j02J8oK18
$$ 0 -30 107 -98 112 11 142 253 87 -125 -10 103 -46 77 16 -145 -90 -53 -277 -83 -185 -167 -173 45
3381D5K6R6k17J73k26j78K43J63m5K32k87j43L25l28J68k89M16j6J00l85k08N33
$$ 45 71 167 -50 123 -103 -281 -38 125 80 312 25 -118 207 -121 47 -242 174 158 258 -127 -335 198
3403A98k20J65MMj47m1J64n1m4k24K59j34J78M0j04j9j97J53j08J75j52l0l4J77
$$ 198 -22 143 147 151 4 -37 127 76 32 -192 67 -67 111 151 47 28 -169 -16 -124 51 -101 -131 -165 12
3427A2m1q8J0J50N5l25L70q8K6l6j93K14j36J14j17J20r4M1J6N2K50m94K31M4
$$ 12 -29 -117 -107 43 98 -227 143 55 81 45 -148 66 -70 44 -73 47 -47 -6 10 62 312 -182 49 93
3451I3k78j36O7K13J05k42J59K58l22q7J04P8p3kO7K29k31R8r1K20n8r0p5J99
$$ 93 -185 -321 -254 -41 64 -178 -19 239 -83 -170 -66 12 -61 -63 4 233 2 100 9 229 171 81 6 205
3475B05k9l43j79N47l95M24k96m8q2M39j41l8m5j52M03l76K89j25j55J56j42J51
$$ 205 176 -167 -346 201 -194 230 -66 -114 -196 243 102 64 19 -133 270 -106 183 58 -97 59 -83 68
3497F8J05k18k00J80J69p4Q0O3l03K24M0l17OK67Q6L2j46j25J6M5R0k08m0K44
$$ 68 173 -45 -245 -65 104 30 110 173 -130 94 134 -183 -177 90 176 208 62 -63 -47 -2 88 -120 -160 84
3521H4m1j48K51k53J0R9l1j08o5L73k55K12m3j3J9k04J20q9J80j39O8l5j71J26
$$ 84 43 -105 146 -107 -97 2 -29 -137 -202 171 -84 128 85 72 91 -113 7 -82 98 -41 27 -8 -179 -53
3545e3k32M88j36k12J37J87o2j48j70J73N1J31k2m81J89j07K41R6k20K47n3J19
$$ -53 -285 203 67 -145 -8 179 117 -31 -201 -28 23 154 132 -349 -160 -267 -26 70 -150 97 44 163
3567A63K1j35PR6p4p8J79j87roj00O1J47o7j34R2L0O3k77KK96P4l26M11k31L0
$$ 163 184 49 56 152 78 0 179 -8 -17 -23 -123 -62 85 18 -116 -24 6 69 -208 -206 90 164 -162 249 18 48
3593D8J91k74p1j30J91L4j14J87k26J83k63K36N7k39K0J74MO9O3j3P9k97NJ12
$$ 48 239 -35 -106 -236 -45 -11 -125 62 -164 19 -244 -8 49 -190 -170 4 8 77 140 127 206 -91 -86 26
3617B6M1k63K67j63J17J21k17P2J64p7m7j28J48k8j88Q8q3K18j51O4l30K93J69
$$ 26 67 -196 71 -92 25 146 -71 1 165 88 41 -87 61 33 -155 -67 -150 68 -83 -19 -349 -56 113
3640A13Kj95L40m03K0K41j95K74Qj98m4K03j11L6P3J27m99K77J95j92R9J04l97
$$ 113 115 -80 260 -143 -123 118 -77 197 205 7 -37 166 55 91 164 291 -208 69 264 72 171 275 -122
3663a22J35q7%K26k68J14L5o5K21m63K60L13k11k01J41p4j02K70l60J34NJ49O1
$$ -122 13 -74 -74 152 -116 -2 33 -32 189 -274 -14 299 88 -113 28 -46 -148 122 -238 -104 -99 50 111
3686A11k11J45j24K65l64L8N4K99k15R3o9j66K65l74L35r6lQ4r5J97m92L45p3
$$ 111 -100 45 -79 186 -178 -140 -86 213 -2 91 22 -144 121 -253 82 -14 -17 67 -28 169 -323 22 -51
3709e1M3m7M12m30J38K3j38j33K04o4q7Rp9M74o8l70RJ23k25J46J02L7J8j19J12
$$ -51 -8 -55 357 -73 65 88 -50 -183 21 -43 -130 -121 -200 274 206 -164 -155 -32 -257 -111 -9 28 46 -73 39
3734C9J57j84J14J1n0oK20j22J43k59N4j43L2j20M7P5r6J11j26J06r7Q2J60j16
$$ 39 196 12 126 137 87 81 301 179 322 63 117 -26 6 -114 -67 8 -88 23 -103 3 -94 -12 148 32
3758C2J25q7j36qR1J02m1K21k37m4j4l3k7j28L11j05J48j48r9q0K55n9j72L51
$$ 32 157 70 -66 -74 17 119 78 299 62 18 4 -29 -56 -184 127 22 170 22 -77 -157 98 39 -133 218
3782B18N7r4l18K15R4j04nm7L6J44j94R9j91Q4j78P3Q1r7J38l15M34l56O4J50
$$ 218 275 181 -137 78 172 68 63 16 52 196 2 101 -90 -6 -184 -111 -30 -127 11 -304 130 -226 -162 -12
3806a2qm7NMO4R4j42J12L2k65L04k36J01K1j55J73J17j06N8k00J40j54j22J16
$$ -12 -20 -67 -62 -58 6 100 -42 70 102 -163 141 -95 6 27 -128 45 162 56 114 -86 54 -100 -222 -106
3830a06N6LJ26Qj70Q3p6O5j22K08j93P4R3r4M0o1K26k6M6m75M65k05N1oj72J83
$$ -106 -50 -47 79 87 -83 0 -76 -11 -133 75 -118 -44 49 -45 -5 -66 160 134 180 -295 170 -35 16 10 -162 21
$$ [...]
8191e4
##END NTUPLES=NMR FID
##END=
