##TITLE=1H_SR146H
 D2O
 8 sc, 
 24.3.2023
##JCAMPDX= 6.0         $$ Bruker NMR JCAMP-DX V2.0
##DATA TYPE= NMR FID
##DATA CLASS= NTUPLES
##ORIGIN= UXNMR, Bruker Analytische Messtechnik GmbH
##OWNER= root
$$ XWIN-NMR		Version 3.5
$$ Fri Mar 24 15:33:04 2023 Russian Standard Time (UT+4h)  she@DPX200
##.OBSERVE FREQUENCY= 200.13135
##.OBSERVE NUCLEUS= ^1H
##.DELAY= (6, 6)
##.ACQUISITION MODE= SIMULTANEOUS
##.ACQUISITION SCHEME= undefined
##.AVERAGES= 8
##.DIGITISER RES= 18
##SPECTROMETER/DATA SYSTEM= spect
##.PULSE SEQUENCE= zg30
##.SOLVENT NAME= D2O
##.SHIFT REFERENCE= (INTERNAL, D2O, 0, 15.7039)
##AUDIT TRAIL= $$ (NUMBER, WHEN, WHO, WHERE, WHAT)
$$ ##TITLE= Audit trail, XWIN-NMR		Version 3.5
$$ ##JCAMPDX= 5.01
$$ ##ORIGIN= Bruker BioSpin GmbH
$$ ##OWNER= she
$$ F:/spectra/data/she/nmr/H-F/1/audita.txt
$$ ##AUDIT TRAIL=  $$ (NUMBER, WHEN, WHO, WHERE, WHAT)
(   1,<2023-03-24 15:32:08.12 +0400>,<she>,<DPX200>,
      <created by zg, POWCHK disabled, PULCHK disabled
       configuration hash MD5:
       00 E9 B6 7A A2 85 ED C7 34 08 36 98 17 FE 4E 26
       data hash MD5: 16K
       9F EF 7E 8B 88 A7 E6 AD 95 0B FC 22 E1 24 5E 8B>)
$$ ##END=
$$ 
$$ hash MD5
$$ 99 31 2A 73 A7 75 4D 4F 6D BC E7 60 E8 22 CE 5A
##$RELAX= 
##$RELAX= 
##$RELAX= 
##$RELAX= 
##$RELAX= 
##$RELAX= 
$$ Bruker specific parameters
$$ --------------------------
##$DU= <F:/spectra>
##$EXPNO= 1
##$NAME= <H-F>
##$PROCNO= 1
##$TYPE= <nmr>
##$USER= <she>
##$AMP= (0..31)
100 100 100 100 100 100 100 100 100 100 100 100 100 100 100 100 100 100 
100 100 100 100 100 100 100 100 100 100 100 100 100 100 
##$AQSEQ= 0
##$AQ_mod= 1
##$AUNM= <au_zg>
##$AUTOPOS= <>
##$BF1= 200.13
##$BF2= 200.13
##$BF3= 200.13
##$BF4= 200.13
##$BF5= 200.13
##$BF6= 200.13
##$BF7= 200.13
##$BF8= 200.13
##$BYTORDA= 1
##$CFDGTYP= 0
##$CFRGTYP= 5
##$CHEMSTR= <none>
##$CNST= (0..31)
1 1 145 1 1 1 1 1 1 1 1 1 1 1 1 1 1 1 1 1 1 1 1 1 1 1 1 1 1 1 1 1 
##$CPDPRG= <>
##$CPDPRG1= <>
##$CPDPRG2= <>
##$CPDPRG3= <>
##$CPDPRG4= <mlev>
##$CPDPRG5= <mlev>
##$CPDPRG6= <mlev>
##$CPDPRG7= <mlev>
##$CPDPRG8= <mlev>
##$CPDPRGB= <>
##$CPDPRGT= <>
##$D= (0..31)
0 1.2 0 0 0 0 0 0 0 0.06 0 0.03 0 0 0 0 0.0002 0 0 0 0 0 0 0 0 0 0 0 0 
0 0 0 
##$DATE= 1679657527
##$DBL= (0..7)
120 120 120 120 120 120 120 120 
##$DBP= (0..7)
150 150 150 150 150 150 150 150 
##$DBP07= 0
##$DBPNAM0= <>
##$DBPNAM1= <>
##$DBPNAM2= <>
##$DBPNAM3= <>
##$DBPNAM4= <>
##$DBPNAM5= <>
##$DBPNAM6= <>
##$DBPNAM7= <>
##$DBPOAL= (0..7)
0.5 0.5 0.5 0.5 0.5 0.5 0.5 0.5 
##$DBPOFFS= (0..7)
0 0 0 0 0 0 0 0 
##$DE= 6
##$DECBNUC= <off>
##$DECIM= 32
##$DECNUC= <off>
##$DECSTAT= 4
##$DIGMOD= 1
##$DIGTYP= 9
##$DL= (0..7)
0 120 120 120 120 120 120 120 
##$DP= (0..7)
150 150 150 150 150 150 150 150 
##$DP07= 0
##$DPNAME0= <>
##$DPNAME1= <>
##$DPNAME2= <>
##$DPNAME3= <>
##$DPNAME4= <>
##$DPNAME5= <>
##$DPNAME6= <>
##$DPNAME7= <>
##$DPOAL= (0..7)
0.5 0.5 0.5 0.5 0.5 0.5 0.5 0.5 
##$DPOFFS= (0..7)
0 0 0 0 0 0 0 0 
##$DQDMODE= 0
##$DR= 18
##$DS= 0
##$DSLIST= <SSSSSSSSSSSSSSS>
##$DSPFIRM= 0
$$ [...]
##$SUBNAM2= <"">
##$SUBNAM3= <"">
##$SUBNAM4= <"">
##$SUBNAM5= <"">
##$SUBNAM6= <"">
##$SUBNAM7= <"">
##$SUBNAM8= <"">
##$SUBNAM9= <"">
##$SW= 18.05172834244
##$SWIBOX= (0..15)
0 0 2 0 0 0 0 0 0 0 0 0 0 0 0 0 
##$SW_h= 3612.71676300578
##$TD= 16384
##$TD0= 1
##$TE= 0
##$TE2= 300
##$TE3= 300
##$TEG= 300
##$TL= (0..7)
0 120 120 120 120 120 120 120 
##$TP= (0..7)
150 150 150 150 150 150 150 150 
##$TP07= 0
##$TPNAME0= <>
##$TPNAME1= <>
##$TPNAME2= <>
##$TPNAME3= <>
##$TPNAME4= <>
##$TPNAME5= <>
##$TPNAME6= <>
##$TPNAME7= <>
##$TPOAL= (0..7)
0.5 0.5 0.5 0.5 0.5 0.5 0.5 0.5 
##$TPOFFS= (0..7)
0 0 0 0 0 0 0 0 
##$TUNHIN= 0
##$TUNHOUT= 0
##$TUNXOUT= 0
##$USERA1= <user>
##$USERA2= <user>
##$USERA3= <user>
##$USERA4= <user>
##$USERA5= <user>
##$V9= 5
##$VALIST= <valist>
##$VCLIST= <CCCCCCCCCCCCCCC>
##$VD= 0
##$VDLIST= <DDDDDDDDDDDDDDD>
##$VPLIST= <PPPPPPPPPPPPPPP>
##$VTLIST= <TTTTTTTTTTTTTTT>
##$WBST= 1024
##$WBSW= 4
##$XGAIN= (0..3)
0 0 0 0 
##$XL= 0
##$YL= 0
##$YMAX_a= 99827
##$YMIN_a= -165479
##$ZGOPTNS= <>
##$ZL1= 120
##$ZL2= 120
##$ZL3= 120
##$ZL4= 120
##$ABSF1= 10
##$ABSF2= 0
##$ABSG= 5
##$ABSL= 3
##$ALPHA= 0
##$AQORDER= 0
##$ASSFAC= 0
##$ASSFACI= 0
##$ASSFACX= 0
##$ASSWID= 0
##$AUNMP= <proc_1d>
##$AZFE= 0.1
##$AZFW= 0.1
##$BCFW= 1
##$BC_mod= 2
##$BYTORDP= 1
##$COROFFS= 0
##$CY= 11.3945322036743
##$DATMOD= 1
##$DC= 2
##$DFILT= <>
##$DTYPP= 0
##$F1P= 2.36226072786647
##$F2P= -0.459571619588291
##$FCOR= 0.5
##$FTSIZE= 0
##$FT_mod= 4
##$GAMMA= 1
##$GB= 0.15
##$INTBC= 1
##$INTSCL= 1
##$ISEN= 128
##$LB= 0.24
##$LEV0= 0
##$LPBIN= 0
##$MAXI= 10000
##$MC2= 0
##$MEAN= 0
##$ME_mod= 0
##$MI= 1.114404
##$NCOEF= 0
##$NC_proc= 0
##$NLEV= 6
##$NOISF1= 3.799351
##$NOISF2= 2.8
##$NSP= 1
##$NTH_PI= 0
##$NZP= 0
##$OFFSET= 15.70392
##$PC= 1
##$PHC0= -19112.59
##$PHC1= 15.60079
##$PH_mod= 1
##$PKNL= yes
##$PPARMOD= 0
##$PSCAL= 0
##$PSIGN= 0
##$REVERSE= no
##$SF= 200.130013532006
##$SI= 16384
##$SIGF1= 3
##$SIGF2= 2
##$SINO= 400
##$SIOLD= 16384
##$SREGLST= <1H.CDCl3>
##$SSB= 0
##$STSI= 0
##$STSR= 0
##$SW_p= 3612.71676300578
##$SYMM= 0
##$S_DEV= 0
##$TDeff= 0
##$TDoff= 0
##$TI= <>
##$TILT= no
##$TM1= 0
##$TM2= 0
##$TOPLEV= 0
##$USERP1= <user>
##$USERP2= <user>
##$USERP3= <user>
##$USERP4= <user>
##$USERP5= <user>
##$WDW= 1
##$XDIM= 8192
##$YMAX_p= 0
##$YMIN_p= 0
$$ End of Bruker specific parameters
$$ ---------------------------------
##NTUPLES= NMR FID
##VAR_NAME=  TIME,          FID/REAL,        FID/IMAG
##SYMBOL=    X,             R,               I
##VAR_TYPE=  INDEPENDENT,   DEPENDENT,       DEPENDENT
##VAR_FORM=  AFFN,          ASDF,            ASDF
##VAR_DIM=   8192,          8192,            8192
##UNITS=     SECONDS,       ARBITRARY UNITS, ARBITRARY UNITS
##FACTOR=    0.0002768,     1,               1
##FIRST=     0,             0,               0
##LAST=      2.2672688,     0,               0
##MIN=       0,             -165479,         0
##MAX=       2.2672688,     99827,           0
$$ Real data points
##PAGE= N=1
##DATA TABLE= (X++(R..R)), XYDATA
$$ [...]
1792G1OP6l54K34O4o2o2J72l01K00j18K42q9k55K80j06m4J80J72k18j23n08N66
1815B3n0P8l56J44M73k63k35mL55j95J64j14m5n8J84J78l37R2L8k53qL04R9m5
1839A69j77J02j45j3j00Q7j29L77j72K07r1k34L08j60l8j91K07Q0j62J17j1N7
1861H8k86L85k61j13L36n0n6k06O6J77n7o4J04m9j13K13N1k09o1L88k79N1k6k93
1885b64M04K2m1j02K3l12L70n2L6l35L12n3J56k48p9K37j17j38l8J87J5k8j24
1908a69J27j15J58n6k1O5P7l9p2J35m9j07k9K88j22k03K62j38O0j62J55qo8O8
1932C7Q3l60J58J72o6j2P5k59k4J97m2j25K49p0m6j7R1K77j65l09M2R5j57J50
1956b6J59k03O3R2Lq1l38M90j05J09L3j2k53J36q8k70J19K84k98K28j10J82k72
$$ y = [71, 77, 153, -201, 33, 97, 35, -27, 145, -156, 44, -74, 168, 79, -176, 104, -2, -46, 134, 306, 88, -35, -543, 23, -27, 51, -305, -161, 312, 49, -186, -190, 165, -30, 134, 20, -25, -83, 101, 279, -58, 34, 72, -181, -189, 115, 214, 169, -8, 94, -51, -64, -164, -77, -206, 171, -1, 206, 115, -119, 189, 29, -9, -200, 7, 87, -75, 42, 31, 88, -198, 187, -74, -187, 149, 99, 43, -163, -97, 80, 23, -41, 63, 14, -99, 114, 165, -44, -105, 283, 4, 55, 29, -264, 140, 162, 121, 19, 42, -270, 100, 48, 84, -251, 61, 8, 164, -84, -163, 74, -43, -181, -219, -32, -17, -45, -169, -42, -157, 1, -55, -76, -11, 66, 27, -45, 90, 41, -66, -95, 193, 71, -132, 130, -8, 52, -110, 45, 37, -31, 37, 120, -240, -82, 90, 24, 12, 87, -172, -196, 1, -41, -166, 83, 13, -33, -50, 41, 318, 153, -156, -114, -19, -176, -26, 133, -70, -7, 85, 88, 7, -331, 159, 54, 163, 196, 184, -69, 67, -21, -291, -172, 112, -186, 42, -68, 114, -158]
1979a58L23Q7k08j49L00l46L03J1j56j02K70k97P9j62R6K79k9Rj84J95r8J23k32
2002d6K29j40p3Q2M0l8l8J75p8j57J62K4j56j18M7J7K1pj11K99k10K23j01j12
2026f6l9l8j17J54M0J49p0J6l3j13J87k53P1m0J30J5N9N9k31Q8j27K63l4J00j33
2051C7k75K81M2m10L26J93j01l50N66l69L7J04J21j08k99M78l20J59j45j39K9
2072a43J57j11K84j42j90R7o6K58oj59j44K56j36r5J23J59l36j1L4J18k6j21K24
2095B4r2R0J5P8l12K20p6J16R6j29r1j10M50o1m5k29J50Q9j88K4j64J32m9L08
2119B46l82L92k49K58n44K31J67j71L0J13M7k28o2K84j29o4K42j25k7K13j80O3
2141A25mO7n7k12K7J04k02J82j1p3k3J38j06m9N2P4P0j82q0L47l72K81k35K46
$$ y = [-158, 165, 252, 44, -105, 195, -151, 152, 163, 7, -95, 175, -122, -43, -205, -109, 170, 141, 150, -34, 161, 63, 186, -46, 183, 43, -30, 52, 92, 54, 16, 191, 113, -44, 118, 142, -14, -132, -85, -68, -47, -54, -165, 134, -76, 147, 46, -66, -105, -143, -260, -106, -66, 83, 13, 29, -4, -117, 70, -183, -112, -152, -22, -7, 52, 111, -120, -32, -159, 104, 70, 170, 37, -238, 43, 85, -325, 1, 194, 93, -257, 309, -60, -23, 81, 202, 94, -205, 273, -47, 112, -33, -172, -143, 14, -97, 187, 45, -145, -48, -114, 144, 138, -21, -165, 91, -45, -140, -17, 142, -194, -205, -171, -53, -79, -200, 24, -68, 22, 37, 115, -197, 23, -53, 63, 159, 30, -61, -171, 279, 218, 173, -56, 94, 183, -5, 19, -145, -13, -62, 246, -136, 256, 7, 265, -279, -48, 119, -52, -22, 91, 138, -90, -152, 132, 3, -61, 181, 56, 29, 242, 62, 125, 121, 188, 131, -81, -54, 50, -152, 30, 19, -54, -77, 61, -45, -94, -42, 32, 102, -80, -160, 187, -185, 96, -139, 107]
2165A07j10j92M95j80j30K0j62K4m8J66j9k23J53m8L37q9k3j3k60L38k38J2j64
2188b47L17k85l2K88r9M3J28J73l27Q6N2K1J4n9q1j4m9N8j36J78J68m4lj96j24
2213a70nP0J38k3J42j18j96L00J83n44Q2J02l1J28L32k26l20rk7K12o3K67k40
2236a6J08j53m2J93k95K97p8Q8q1k32J24L37j54m7k4n0L2K6nQ1j27Q6j76Q0k39
2261b67L26J30m79M60j38k40K62J59j12k16J61k41j42K66K36k80L04k32o0L59
2281B56k70J66p1J66l20P8J74k67p7q6K41k66L70j02N8r5Nj58K09q2q8L48J3l39
2305a37P5%J28N5m5J5k07k08L95J49l73p0N39j87k03L9M2k0j05N7K35l72K46J55
2329B03k84j20J59p9L39j48m3k32J43m6PK22k01K26p9j39J86k8q4J05l93L86k34
$$ y = [107, -3, -195, 300, 120, -10, 10, -152, -128, -176, -10, -29, -252, -99, -147, 190, 101, 78, 65, -195, 143, -95, -83, -247, 70, -215, -247, 41, -58, -15, 113, 286, -41, 45, 97, 118, 132, 73, -8, -22, -71, -13, -149, 29, 197, 153, 150, -46, -170, -175, -105, 33, 10, 152, 34, -162, 138, 321, -223, -141, -39, -70, 58, 390, 164, -156, -165, -192, 20, -43, 224, -16, 92, -61, -103, 90, -205, 92, 14, 102, 21, -211, -87, 250, 96, 49, 25, -25, 7, 33, 28, 109, -18, 68, -108, -28, -267, 59, 189, -290, 170, 32, -208, 54, 213, 101, -115, 46, -195, -337, -71, 165, -115, 189, -43, -103, 256, -14, 152, 81, 247, -73, 5, 179, -88, -165, -251, -10, -276, 94, -8, 50, -45, -40, -198, 11, -71, -159, 189, 202, -137, -62, -62, 66, 121, 76, 91, -116, -324, 71, 220, -153, -223, 316, 129, -74, -35, 7, -13, -118, -61, 174, -198, 48, 203, -81, -201, -42, -121, 218, 70, 27, -205, -62, -108, -101, 121, -80, 146, 67, -72, 114, 86, 2, 107, -286, 100, -134]
2352a34P6J94qj40J29j73l8J3l9l8K26j80K98j88K2m2n9J30J56k97J52j82j9J65
2376B4J39k87J1Q7j87K83j63N5O1p5R7M1k57L08j16k98L98k18K61j46j92M5K12
2399H3k2j57N78l78l92M99j73o2j15L1J55J06k99Q6O6P9l5N8J5j79J87k45R3K07
2423A86p5j88Q6M1k33K12J37j36k18L05p7K48o10M49n9O1%l41N80l25p7O0j72
2446a46q4J3J78j61J8J59J16pl5j88J96J04k21L42n10K30j21K43m56M34J4K8l04
2469a58K92o2j01J60j24r7L3J02J41l2j73L0J25j53jK34j81J24k17q5pj7J96K00
2493B29m62N52m47K6J81o2n6J4L3m7R6j24j25J65L4j0q9J3q4pL13p2r8j22J68
2518A9j61oJ0K91j05J0k18KM45j76j0Q8k89J97K8k1j68J18O8j58j41L8J26K1J25
$$ y = [-134, -58, 136, 128, -12, 117, -56, -94, -81, -120, -158, 68, -112, 186, -2, 20, -22, -81, 49, 205, -92, 60, -122, -141, 24, 163, -124, -113, -26, -213, 70, -93, -38, 23, -52, 45, 86, -171, 137, 21, -277, 121, -97, 164, 18, -174, -129, 83, 61, -96, 482, 104, -288, 211, 38, -24, -139, -108, 47, 153, -146, -60, 6, 85, 50, 108, 123, -56, 131, -114, -21, 186, 111, -77, 9, 50, -183, 29, 166, 30, -188, 117, 40, 288, -322, 127, 68, 129, 129, -212, 368, 43, -34, 26, -146, -230, -217, -39, -200, -182, -23, 93, 86, 51, -137, 59, 163, -58, 284, -226, 4, -117, 126, -330, 104, 118, 146, -158, 134, 72, -29, 131, 7, -90, -57, 45, 186, 154, -19, 11, 136, -17, -18, 216, 35, 159, -58, -143, -150, -167, 29, 229, -233, 319, -128, -102, 79, 17, -39, -25, 8, -39, 57, -67, -192, -27, 7, -3, -92, -79, -163, -170, 143, 71, -27, -149, 19, -142, -148, -138, 153, 48, 58, -160, -158, 287, 111, 101, 189, -100, 97, 125, 104, -64, 54, 122, -36, -177, -139, -13, 8, 133]
2543A33Mj94P6P3Q4l83J88K11j67P3j08Jk17K56J03r8J43l15O5N2O8K49m96K15
2567A6M3n0j09K24m63K95J99m17K99L3kO9j25L5k20p8L98j50N0k18L44j01j62
2590i0J4rl8L00p0J4j47J39l27J12J22l5R6j2m5r5J99o2L4j51J15o3l0O1k28N2
2616a44J37J09j28J06Q1j81n1l5j22L07N4k69K33k56J36K30L1l93J86k07Q6K20
2638A30p7Ok77L74j79l9l0j54N45j86k27R4J07q5m6NJ9P1j70J92j59K39p6O9j59
2663a3j95M63j17j21k42L03M7j26j04M5r3K05J2j36L42k32m13L75j34J85r6n7
2685a02K33o1j17O5j36N2l9j16L29K3j05k38K55J87j63K4k19K1J12q2J80j2J4
2708A05n5j24J73l81M3J74J09K5J54j22j31J25j26J55k12K64m48L12j47J05J71
$$ y = [133, 137, -57, 19, 92, 176, -207, -19, 192, 25, 98, -10, -9, -226, 30, 133, 35, 178, -137, -72, -20, 48, 297, -199, 16, 59, 9, -100, 124, -339, -44, 155, -262, 37, 70, 68, 137, 12, 47, -173, -251, 147, -3, 47, -171, 173, 72, -90, -76, -85, -123, 177, 107, 121, -26, 113, -214, -102, 20, -15, 81, 69, 24, -71, 128, 66, 100, -51, 64, 1, -29, 32, -196, -144, -7, 102, -26, 80, 161, -20, -71, -106, -228, 79, 133, -136, 97, -159, -23, 207, 238, -155, 31, -176, -90, 130, 53, 59, -218, 156, -23, -62, -92, -246, 299, 113, -114, -20, 87, 2, -44, -39, -20, 51, -119, 73, -86, 153, 77, 146, -13, -208, 255, 138, 17, -225, 78, 125, -1, -105, -60, -153, 52, 64, -72, 270, 38, -375, 0, -134, 51, -45, -102, 131, 70, -47, 18, -118, -66, -105, -221, 108, 131, 26, -212, 43, 230, 67, 91, -128, -107, 5, -77, 103, 91, 105, 50, -74, 99, -282, -239, -65, 44, 69, 223, 101, -30, 95, -31, 124, -88, 176, -272, 40, -107, -2, 169]
2729A69j89l5rj29J20L20m03J06mK81k35j40J60k0j44j39L76j23P9k9n9R4j64
2752a17L9m0j0P4J37J35q9l7j89oM0Q0R4m7Ml4j13j6J72M9j50k1K38l04Q7j84
2778b08K12J26j42j4J2k1L40j62n7K92n00J95k69J71J68j23J01lm22K32J69m9
2800D8O8l1O2j53l1oP4j06K87j52J35j63R9k29J10n8O3j65L3p0j95M08k8J85l0
2825A55j58k0K04l03K80j60K78q4J0k63J12k16L18j00j28J41j83K81O1k78p6K46
2847A17n8k61K67o5L2k43J07o2J99rJ2O5l17K28J22k37Q1J05r8k65L79M2k49K3
2871h5J58k32L27l23K08k47J50J56j24l50K30J61o8k05J26J57KKl7k5k36J63m1
2894a33K44l33R7K52j10qj4m7K58j25j76j34L92m76L20j5N8q6J20Kq8N7n3R3n9
$$ y = [169, -20, -55, -64, -193, -73, 247, -156, -50, -54, 227, -8, -148, 12, -8, -152, -291, 85, -38, 41, 12, -47, 47, -117, -78, -118, -128, -54, 83, 218, 129, 92, -97, -103, -63, 17, 111, 64, 68, 34, -79, -95, 77, 126, -24, -45, 193, -111, -24, -208, 4, 130, -12, -26, -14, -35, 305, 143, 86, 378, -122, 73, -196, -25, 143, 20, 121, 118, -304, -72, 97, 48, 116, 85, 147, -6, -37, -43, 31, -75, 212, 60, 195, 32, 131, -98, 12, -46, 17, -148, -115, -185, -380, 28, 0, 185, 155, -3, -23, 181, -122, 158, -2, 276, 192, 202, -61, 51, -165, 153, 53, -75, 66, -117, 164, 225, -53, -129, 117, 59, -202, 65, 0, 32, -211, -104, -166, 33, 24, 36, 101, -216, 12, 134, -103, -22, 83, -15, -280, 99, 141, -108, -85, 73, -159, 168, -155, 53, -194, -44, 112, -12, -362, -132, 29, -39, -244, -118, 39, 41, 43, 6, -19, -255, -92, -133, 111, -222, -125, 127, 17, 9, -5, -52, 206, 81, -95, -229, 163, -313, 7, -8, 50, -36, 84, 86, -2, 55, 2, 95, 36]
2919C6k00J79R2l43J15P7Q9N3j30M0J60j37J35k06L73n21M9J33J15J39r1k68L5
2942g6j27j1l6K20K8p5j04L10o1o1j48O6K97l84M13j75L0j9k7k86M26m68L28R
2966F9j59J15j43J98J43k51j77M78j3m62J81M5j37K66l97M4L94m58L68k16K33
2987A21l47P8K46r3q6L0N7j51l3J88RR9O0N4k84l1Lk55M86J79n78N00k16N2j21
3012c3J66N9j81J8k67J92M3o6K64j72Mj53J0J8N1l2K8J66L4kj25k10L7K95k26
3037h2R8j15K5J3j06L87N1k31l32K97J10j13j11P7J56m2K40k29j59k8n7P6L8l4
3061g1J72ln4r9K26k47m5K1J13k16K52j56O9K86o5k79l5J57l14M76j55k40RJ83
3085a5j56L54j92J9l1J80j93j84K52P5N7m9J60j95j61k29J65K59j58K0J33j05
$$ y = [36, -164, 15, 107, -236, -121, -44, 45, 98, -32, 8, 168, 31, 166, -40, 333, -188, -139, -6, 109, 248, 157, -111, -76, -203, -214, -250, -30, -2, -77, -181, 129, 68, 7, -141, -75, 222, -162, 251, 76, 106, 87, 60, -226, 200, -268, 60, 69, -90, 25, -118, 80, 223, -28, -205, 273, 260, -202, -21, 24, -113, 153, -244, -200, 194, -264, 104, -112, 121, -226, -148, 98, 5, -81, -51, 6, -145, -178, 10, 19, 118, 178, 232, -52, -83, -80, -335, 151, 330, -248, 252, 36, 88, -33, 133, 192, 11, 29, -238, -46, -3, -69, 195, 23, 27, -126, -116, -98, -47, -79, -51, 115, 149, 147, 22, -188, -151, 144, -82, 16, -99, -74, -61, -167, 220, 271, 40, -292, 5, 115, 2, -109, -32, 124, 82, 322, 93, -66, -94, -151, -75, -37, -71, 101, 98, 44, -55, 171, -76, -121, -100, 13, -203, 49, -107, -38, 248, 183, -96, -131, 26, -288, 188, 33, -207, -198, -15, -171, 183, -9, 10, -21, 159, -34, -218, 34, 109, 166, 117, 277, 82, -79, -308, -143, 116, -42, -22, 111, 6]
3107FM6j45L7qJ47O8j8r9J8J11j03j22P0K2J45k7j79J29N6o1k59L64o9l03K75
3132A01q4j11J11J3N5l36J41rk63L52R4k04L15j55J24k22J26k39R3J38j62N7j80
3155b45j6L90j39J45k20L5R0k29J77l56L30J76J2j83J84M2k43J51J27k94oJ36
3177F4J9J5l19j20J68J64K10l39K49k56k3K42m9j66K08o0J08k90L04k77K81j22
3199A1P7j07k31K20J97k59L51J02m67J21l00N88l56j0j9J82l06L45O3j34M2k52
3221a42J27L0J85j99j18j62J50N2J59r4o9r7rK23j8K68j79k7J07k45j07L52q9
3244I8n4M0l93L12k83L41j25J22Jk9k77K62j42J61j60J68k68M61n85N43m11N4
3266a64J73q5L74l89K33k22j62K42j15J65o3K53k55n9o7j7J50J57j96R8j16l7
$$ y = [6, 52, -93, -56, -64, 83, 151, 133, 34, 52, 163, 60, -62, 8, 30, 175, 148, -31, 98, 154, 93, -166, 198, 129, -174, 101, 17, -94, 17, 30, 85, -251, -110, -119, -382, -30, 64, -140, 175, 20, 144, -78, 48, -191, -98, 40, -122, -65, -245, -261, 129, -10, 135, -85, -50, 40, -189, -12, -368, -38, 138, 150, -33, 151, 193, -50, 101, 228, -66, -72, 64, 83, 98, -221, -341, -173, -9, 201, -138, 111, -145, -168, 74, 25, -141, 67, 7, 115, -175, 129, -148, 133, 11, 88, -19, -250, -30, 167, -92, 259, 361, -106, 15, -285, 303, -53, -63, -82, 100, -206, 139, 202, 68, 110, -142, -15, 15, 200, 1, -117, -279, -129, -77, 82, -12, -81, -178, -187, 36, 18, 286, 107, 80, 187, -58, -165, 187, 98, 44, 84, -309, 3, -280, 61, -64, 58, 59, 30, -247, 15, -127, 34, -126, 42, -226, 235, -350, 193, -218, -164, 9, -76, 298, -91, 142, -80, -242, 0, -115, 50, -13, 240, -15, -74, -141, -158, -8, 149, -47, 51, -65, -102]
3288a02N6L9J6K73j50l05M3K19j45J09ok42K15M9Lj3k28Q8p9K46M5k66J83J20
3312A68p5n6r3K09l17N9L04j94j13K53j35J87j01k05M05n99L42j44J89k8J02j89
3334c1n2J84j82R3j48J25K1L9L6l2j08k3J79l67K66p8K71k28R6L6j08O2R7k88
3358a40L03j62j12J89k93K98l44L49j69k9k09M58l80L91k47J9m9k03pN16q3j24
3380b8K37k74Q7lk56K78j07j55M49k70J52j82r2K29l5j20K49J5j40L7p4k66L54
3403H5O1m3k83J91p2L91o10J26J82j89K83j84J55o1m7K30k11p8O1k17R5J75q6
3426d6k00L80j39Q7R6J2m55K10o8m3K76R7K1L8k29j59Q7Q6n3M9K6P6j64r4R2j94
3452b11J08N4K92k04m55M37pj10J49kP1r4k13L32L4r8j37J9l6K93k10j68J44J4
$$ y = [-102, -46, -7, 9, 282, 132, -173, -130, 89, -56, 53, 47, -195, 20, 69, 72, 59, -169, -81, -160, 86, 131, -135, 48, 168, 93, 37, -56, 153, -164, -105, 199, 5, -108, 145, 10, 197, 96, -109, 296, -303, 39, -105, 84, 56, 158, -31, -83, 101, -81, 12, -136, -11, 10, 49, 85, 53, -55, -78, 101, -266, 0, -78, 193, -35, 61, 97, -11, 51, 148, -140, 163, 1, -111, 78, -215, 83, -261, 88, -81, -110, -319, 139, -241, 150, -97, -78, -127, -330, -337, 179, 96, -28, 209, -65, 22, 19, -237, 41, -66, -221, 228, -42, 110, -72, -164, 65, 30, -90, 159, 174, 34, 71, -3, -269, 85, 146, 103, -180, 11, -61, 330, -280, -154, 28, -161, 122, -62, 93, 32, -15, 215, 4, -74, -13, -230, -135, 40, -46, -246, 134, -5, 82, 178, 190, -265, -55, -123, -166, 110, 207, 228, 266, 37, -122, -35, 51, -2, 47, 73, 149, -15, -109, -17, -211, -103, -49, 243, 39, -416, 21, 14, -96, 53, 51, 122, 28, -185, 147, 181, 83, -54, -35, -71, 222, 12, -156, -12, 2]
3476BK4Q4j47n6J47M1m9nJ93r1l04L16j71o9J68k82K48n1l32L95J07j90K09k6
3500A61l8k64L4J48Pk92M26k72R2K57m7k70J08q8j5J31j52qK23k51O1J13j58J43
3524D9o7M%k48N58l02O2J83o04J68kR4P9K02k59L8nK0j08J58n1J50J81j44j23
3549C3k95L05J8L4r2PR3j89J66p6n5J40j88J50k4k14J85J11m6oL05l58MN7j20
3574e5m2P4J30j95M20k59Rk01K4O8J39O2k37L46m47O6K91l92L79j75R7M8j71k69
3598b90M14k50r0q2K33L51k35j86L34r0L6j73K15l99K04k8J27J6j83K02k37j24
3620b35N9L41j36K52k69j51J71J03l04n0L20k56J80N1j09Nq3J99no7j64K30L0
3643A12r0o1l3O6L2k09K65J16k52J83j67P5J6J31j02j96K52j74K10l18J74K9k12
$$ y = [2, 26, 110, -37, -93, 54, 95, 46, 41, 234, 143, -161, 155, -16, -85, 83, -199, 49, -2, -334, 61, 168, -22, 187, 161, 123, -141, -107, 41, 48, -244, 182, -90, 2, 259, 212, -58, 50, -38, -53, 78, -74, -82, 141, -110, -49, 64, -94, 49, -18, -14, -14, -262, 296, -6, 56, 239, -365, -197, -199, -105, -26, 176, -83, -45, -50, -30, -138, 20, -31, 119, 300, 156, 33, -262, 43, 61, 95, 3, 10, 103, -86, 80, 4, -51, 89, -99, 51, 27, -187, -2, 109, 63, 57, 362, 4, 8, 65, -55, -97, -23, 107, -88, 332, 73, 82, -119, -95, -27, 112, 174, -63, 283, -164, -98, 193, -199, 180, 5, 102, 150, -21, -290, 124, -126, -216, -298, -65, 286, 51, -135, 199, 109, 145, -28, 187, -212, -8, -36, 91, 107, -76, 126, -111, -235, -176, 165, 29, 281, 12, -139, 32, 135, -169, -219, 101, -155, 25, 76, -33, -28, -111, 88, 83, 16, -148, 82, 112, 22, -39, -72, -6, 26, -183, 82, 198, -54, 129, -38, 37, 53, 184, 82, -114, 138, -36, 174, -144, 30, 59, -153]
3666a53P0J00j10J18K53m22J11j67L45j13J57j3k80K72n2R6m19J82N1k5k18r6
3688c13J22J82m1K35j72P6l27R0j25M35O9l47P8J3L27l26J88m73L21j2k0Q0p5
3711a5J40p0k3j80K87L5k52K16l96K59j30J61k0Oo4m2K51k17o4J78j09k20K77
3734HM7J14l6k09j65K63M9O1r2j8J54j76KN0j31o2K91m20K10p7R1m4m8K79k14
3759g3L0k55M58l14L93l55j4J79%K2n7j60%J18L1k14J97q5j51J63n0J43r0K27
3783A43q6L3j4J0l2j03K79j82J03o6J4j83J60Q6k03L15l06q9L71m60K86o4O0k52
3807a80M6K29J95l17M8J00k4P6k06N2j81P2K02N0j75k26K13L6K4J90k10j21K08
3830A01m7k2j91J08J57j15l7J8J11l5K95m63R1J34r1L2Q5j7k95P4N0K49m09M21
$$ y = [-153, -83, 17, -93, 25, 278, -144, -33, -200, 145, 32, 189, 176, -104, 168, 116, 212, -207, -25, 26, 1, -217, -313, -191, -9, -50, 185, 13, 89, -238, -148, -273, 162, 231, -116, -38, -25, 302, -24, 164, -309, 12, 0, -20, 60, -15, 125, 55, 32, -148, 139, 174, -78, 138, -258, 1, -129, 32, 12, 18, -46, -88, 163, -54, -118, 60, -49, -269, 8, 55, 169, 133, -76, -241, 22, 71, 132, 40, 22, 176, 0, 2, 52, -79, -141, 150, -270, -60, -137, -46, -90, -138, 141, -73, -43, -298, 160, -154, 239, -116, -130, 49, 49, 71, 14, -146, -146, -28, 3, -211, -14, -99, -250, -87, -137, 6, -84, 143, 57, 90, 76, 86, 54, -49, 230, 48, 151, 85, 99, -84, 76, 162, -41, 274, -32, -121, 250, -210, 76, 12, 72, -180, -134, 95, 290, -27, 21, 121, 97, 173, -33, 19, -162, -90, 112, 162, -13, -239, -26, 10, 34, 224, 14, -107, 101, 54, 32, -159, -51, 106, -9, -46, -28, 83, 48, 343, -120, -29, 105, 14, 46, 131, 114, -181, -107, -57, 192, -217, 204]
3854B04k54OP8l03N68l94k38J36J50m6mJ43K2K72l71k20K99O2j23L13l00J80k05
3877b5P2J50n8j05J5P0l01J26L02l08Q9k20L55q0n9M2j62R0p3J62j6j31Jq4J84
3902C6l72M17j11P7N0k53M83k06k98O2N9q0K83j26K11J7j67k02J47j92J71J35
3924A41o2k19J29nl4K67j68j08J73k19J4K0m6J85R4m7m3j48k62K15J08jQ2k1j47
3949a02J22P2J0j23J01m9l7r3K31j25J31j12J57j29j03J87j05j51L77l50J48J32
3971A89O1l23O6L9J65l67J18J75l02K53l68L39m0j23R0J45N9j46Q1q5l5k7m2k8
3995a06J57m03J59L23K5j02j9mJ18r7l6m4J51l0j98R2R8M1q0M4l36N9L30p4j04
4020c6j15K05J10j17j53J12k52L22n9Lj70n6L1R4J69j65J18ON6p4K37kj94J22
$$ y = [204, -50, -44, 34, -269, 299, -95, -333, -197, -47, -93, -97, 46, 68, 340, -31, -251, 48, 110, -13, 300, 0, 180, -25, 47, 197, 139, 34, 49, 119, -182, -56, 246, -62, 27, -193, 162, 82, 23, 65, -97, -7, -80, 82, 66, -65, -64, -148, 36, -336, 81, -30, 47, 97, -156, 327, 121, -177, -115, -56, -136, 147, 21, 232, 249, 82, -120, 27, -165, 6, 141, 79, -140, -11, -16, -50, 217, 49, -59, 114, -105, -91, -71, -117, 68, 162, 115, 72, -76, -338, -123, -15, -16, 66, 45, -102, 20, 92, 102, -21, 80, 31, -6, -99, 132, 7, 138, 26, 183, 54, -49, 138, 33, -118, 259, -91, 57, 189, 250, -73, -7, 32, 197, -170, -52, 123, -179, 74, -294, 45, 5, -118, -28, 117, 176, 30, 111, 26, -9, -36, -78, -106, 51, -352, -193, 130, 155, 53, 34, 30, 148, 51, 15, -29, 122, 92, -106, -14, 84, 125, 45, 89, -247, -188, 142, 68, -36, -151, 54, 164, 47, -106, 6, -246, 76, 17, 20, -150, -206, -175, -81, 88, -77, 41, 47, 103, 29, 266, 264, 70, 192]
4044A92l43k5n8K63j74J02n1K6L16j13P7j85j49J53J14m98J14J32J36J07j09j40
4066a13N5J6m3J1K8J37j18K20j46p0J51k81K84J1j26q2k6k0J71j06j25K95j21
4089Br7J81O9j89J72k59M4n3m8J96p8K7J93j27k46K14P7Lj20J57j46n5J05j79
4113a57K1J87n2k2m6o8j3p0K93k2j82J94j75L17r3P7k03p1J59k19k6J23o5N9n
4138e9J3l0K6o0P6n9m1J48K95j76m7r8k8J2k36N37k68M8l40N1K85Q3j26r7o4K20
4164F5R1l52M41j59j93K01j92K28k2o4k35M5L05l08L54l01K65k85N23n3l39Q8
4186A03J6r9O7l58K58J04k22k11M76k93J62j03J00L6k15J94j79M88l79Q1n5N2
4208B3m2N2KP3N2j68O1k47J75J41p8j72lK35Q9k94r6J95j49K73k72M1L8R5l4J35
$$ y = [192, -151, -176, -234, 29, -145, -43, -94, -68, 248, 135, 212, 27, -122, 31, 145, -353, -239, -107, 29, 136, 27, -113, -58, -42, -85, -74, -46, 91, -27, 193, 47, -23, 128, -153, 131, 142, 16, -66, -92, -112, 59, -47, -172, 123, 2, -95, 86, 155, -34, 138, -121, -77, -130, -178, 18, -60, -33, 160, 33, -213, 1, 78, 81, -39, 118, -28, -83, 22, -157, -136, 51, -1, -23, -69, -137, -150, -220, 73, 51, -131, 63, -112, 205, 112, 189, -14, -85, 74, -145, -171, -48, -113, -54, -59, -46, -76, -50, -110, -34, -93, -134, 14, 309, 133, 86, -12, -40, -28, -264, 273, 5, 53, -287, -236, 49, 132, 6, -91, -155, 65, 156, -196, 245, 86, -107, 94, -98, 130, 108, 44, -191, -146, 159, -149, 205, -96, 169, -116, 407, 354, 15, 103, 119, 20, 87, -271, -13, 91, -131, -342, 134, -159, 3, -100, 0, 36, -179, 15, -164, 324, -55, 26, -29, 23, -19, 33, 35, 108, 160, -8, 53, -194, -19, 122, 44, -128, -131, 104, 193, -101, -197, -2, -151, 122, -150, -109, -71, 24, -10, 125]
4234A25J36l63J00p8J32p5j91J98mm9J38p2j19K72k36KK35k51j12J02J16K53j75
4257H4kp7k8L8kl2j53J04k23L56n8m5r9J84j36J33j54K98j16J10k61J55j6r0k38
4282b68N7M06n58N30m6j24j80L80Qk44j40K66J88k97J18r1R0j09j47J16J78j0
4304A23k63Q5j00L10l9k7K17m50M63l42j31J07l7k14L89q5L10n02M97l55j04M7
4326a01R6J6k75L27P1M0j15P1q9l0l4j18j1K40o1ml21K78j36K05l7K00j41L8l35
4351b26L14k85J28K31o1J1k07N1m7L29p8k15K96m1q2j07k35J76O6j10L38l69J86
4374F3pr1J71k53R8P1k17N9M40l96k0k90K41l4K09K22n02J97J91p9k02J76J57
4397B04j97k39J60q8L24j16p9L2j65J12J05k38J94J8J93l28j3K87j28l9J84q8
$$ y = [125, 261, -102, -2, -80, 52, -23, -214, -16, -20, -69, 69, -3, -122, 150, -86, -84, 151, -100, -212, -110, 6, 259, 84, 82, 5, -23, 15, 13, -19, -172, -68, -291, 65, 7, -38, -137, 47, -89, 44, -110, 188, 72, 182, -79, 76, 60, -30, -268, -211, 195, -363, 167, 121, -3, -183, 197, 205, -39, -179, 87, 275, -22, 96, 5, 95, -14, -161, -45, 133, 123, -140, -55, -155, 155, 116, 89, 306, -144, 319, -23, -154, -47, -84, -298, 91, 6, 316, -186, 311, -44, -148, -101, -5, 11, -264, 63, 134, 174, 59, 130, 41, 11, -23, -141, -152, 88, 27, 23, -298, -20, -156, 49, 12, 212, 71, 109, -226, 88, -197, -69, 162, 101, 112, -95, -44, -91, 238, 160, -55, 241, 200, 118, 11, -224, -48, 18, -92, 246, -123, 63, 56, -35, 136, -117, -19, 52, -165, -106, 334, -62, -82, -372, -131, -165, 44, 266, -236, -39, 152, 73, -129, 47, 204, 7, -232, -72, -160, 164, 48, -31, 1, -164, -52, 53, -185, 9, 27, 220, -108, -121, 166, 38, -1, 183, 95]
4419I5k66J95%j39J77L1k38J87j48rJ32K1j34J23Qo2K45l03J6J16q9J02M5j44
4443c9j11J94r2k34L34j70K13Rl69M06j39k89K91m5K28l28j41J19j1L28j52J86
4465A88j06J60J2n19L86J20j30j82j05J59O1k4q8Q7K4Mr7J00J03j01j91j48K82
4488eO6k41J23n3J30n6J56j55J58o3j17P1o1K07j03R5j18L1nJ27k99n6J53J36
4512A21j99L1J15O5j75j77L93k12J90k60o5K67m6O0p8J0J14l54J95L4J13Pk41
4535i2M22j97lJ30k39R4J58l07K59k84l4L5mJ23j65N3J08j83P5J41l0J03k18m1
4559i6O2J25k85L56l0j42l6J68k95J76M00n66M2J03O8k39J30L92n90M44k97lj77
4582b90L39K47k36J2r3J19J54j69j5j89K7J32p7nK14j91N4L4j00J10m34L54Q5
$$ y = [95, -171, 24, 24, -115, 62, 93, -145, 42, -106, -115, 17, 38, -96, 27, 35, -27, 218, -85, -69, 47, -42, 60, 105, -39, -150, 44, -48, -282, 52, -118, 95, 104, -265, 141, 2, -287, 4, -41, 187, -141, -282, -163, -174, 154, 2, 188, 82, 242, 254, -265, 121, 241, 111, -71, -176, -17, 44, 20, -68, 19, 43, 47, -50, 50, 153, 52, -139, -287, -5, 61, -180, -57, -110, 20, -36, 120, -35, 123, 60, -57, 14, -47, 160, 57, 152, 34, 65, 60, 187, -112, -168, -15, 121, -78, -47, 68, 133, -42, -219, 174, -38, 152, -108, -173, 94, 48, 108, 30, 40, 154, -200, -5, 29, 142, 149, -92, 330, 133, 130, 260, 21, 115, 273, -34, 225, -59, -93, -58, -62, 61, -104, -51, 57, -126, -51, 90, 60, 163, -55, -96, -34, 91, -194, 162, 132, -10, -46, 122, -173, 3, 403, -163, -121, -18, 50, -189, -59, 333, -257, 187, -110, -113, -290, 49, 296, 60, 72, -21, 98, 252, 83, 68, -121, -94, 38, -39, -44, 170, -21, 33, 67, -33, 77, -357, -3, 82]
4605H2j74o1R0j01J78k07J01L5K06l56J56K0j31M21k06N3Lj29J03k93l9L80K0
4628A51J58n95K70j16M50r0k37J64k31M8J91k16J26jj03k66N1J23M13j46o7r5
4650a8M9k75K53Rl22J98j8J13J51j98J36k33M55k73o5P8k5j2q5M3J0o9j42N33
4674B93j57q2j59j01J62M5J66k45J75j83J37J45j83Q9l01J38q0K72l9q9l64L41
4696b0L74l42J62j53K4K5j12R0N4j35K85k27N8J55j91j43M8L33k42M6K8l6j87
4719a06N9Q0j66j3K18k44K15K27m08J16J30j35K19k63j57J75K5J94l29K49j54
4740f8j47K07K6J33j62K76k66P1r1j32K98p5Q9j62j27l4l3m5L25J56l75L02K4
4763A90k55j88J21J85r0N5j64J98p7J45k02J37j36J61j38K98l65K40L7k96O6L37
$$ y = [82, -92, -153, -63, -164, 14, -193, -92, -57, 149, -207, -51, -31, -162, 259, 53, 106, 109, -20, 83, -210, -249, 131, 151, 309, -286, -16, -132, 318, 228, -9, 155, -76, -28, 163, -53, 73, 72, -31, -297, -246, -123, 290, 144, 77, -18, 31, -244, 9, 18, -304, -106, -124, -11, 140, -58, 78, -155, 300, 27, -38, 40, 15, 3, -82, -39, -29, -98, -240, 293, 136, 54, -105, -206, -44, 1, 167, -78, 97, -86, 51, 196, 13, 102, -199, -61, -141, 131, 92, 3, -361, -20, 354, 12, 174, 21, 45, 70, -42, 48, 102, -33, 252, 25, 83, 238, 47, -96, -48, 285, 43, 89, 117, 81, -106, -47, 33, -133, -146, 72, -172, 43, 270, -138, -22, 108, -27, 192, -71, -228, -53, -28, 166, -163, 86, -68, -215, -8, 18, 151, -11, 265, -1, 70, -21, -153, 145, 70, 159, -3, -130, -164, -197, -242, 83, 239, -136, 166, 190, -65, -253, -132, 53, -37, 18, -146, 52, -25, 120, -82, 55, -81, 80, -58, 240, -125, 115, 152, -144, -78, 259]
4785B59k88J77k31M32k87k55J38J84k58J95J56m88L37Q1m08R9O8P2m2j39L76k9
4807A49k12K02j81rJ20k00J16k22J40J57j19J14j0K60n20p8K77J14n1J24kl15
4829a46MJ81o1k9K84k18k1O5J3P0j36J91j77j9K16k20m8J39N5M7l32K18K2j25
4853b7r3J97k24J11N0P0j41O2o9j89L75k83J97k93L07P8q2J61m22J87J88l05n8
4876b03K06R6k30l3p0K19R6j02N2r7Om2j2J67n5j54K90k25j72L25kk35J47J67
4900A39k19K12l79L68N9l62K63M3j87J07J61l40J23K2j08K4K09q6q1q6J07j3Q6
4923F2N8R1j72j39J53k10kL97k37p2J69j3O3l17k4J53j08r4J95L75k34j0j86J54
4947E2j02o2J35L8k46J28O9j1q5K28j99j2J83j35P3j24J01j14J85k61K21J40l35
$$ y = [259, -29, 148, -83, 349, 62, -193, -55, 129, -129, 66, 222, -266, 71, 152, -256, -157, -89, -17, -59, -198, 178, 149, -63, 139, -42, -51, 69, -131, -15, -237, -97, 60, -59, 55, 45, 305, -215, -293, -16, 98, 47, 171, 169, -146, -142, 39, -22, -51, 233, 15, -6, 59, 72, 142, 6, 197, 20, 1, 217, -3, -51, 88, 143, 190, -142, 76, 98, -27, -120, 77, -147, -36, 14, 84, -57, 5, -64, -253, 122, -161, 36, -257, 50, 128, 46, 207, -215, -28, 160, -145, -203, 3, 99, -131, -164, -234, -15, 81, -21, 31, -66, -60, -102, -114, 53, -2, -156, 134, -91, -263, 62, 60, -175, -28, 139, -80, 132, -247, 121, 180, -182, 81, 124, -63, 44, 205, -135, -12, 10, -98, -74, 135, 49, -32, -118, -11, -24, 62, 120, 211, 39, -100, 53, -157, -159, 238, 1, -71, 98, 85, 148, -169, -193, -40, -148, -242, -47, 328, 94, 84, -102, 52, -50, -112, 23, 61, -185, -57, 12, 1, -84, 144, -55, -67, 116, -19, 54, -70, 31, -83, 102, -159, 62, 202, -133]
4970a33M49l32r8j17J32J16lJ65j44J8j01K2j20K76j50j25K86R3j21k73M8j27
4992b39R5m9L1QK08k18J88J82l60K08q3L9K56m23N8K75k46m8L0J18J54L1K31l11
5016A35q7K4j72r8K53k22J05K0j82K25L6J99n51M33m5L0k6l13J62J78k31K44k50
5039a33J81Pk2p5r5L68j12k5M6J18k65R8j00J59l4r6Nj6j51J54nJ7l6j8k6J4K23
5066A81j31K9O4l26J53l9m8J63K8p8p6J09N1o8O0j70K9n0J28l8N1p7m7P3j13k5
5092a67O4J40o3q2K2K20k82J99M2jL28o97R5m8L15k48J42j15J10R7p9qJ34j38
5116b0Q1Qk90J50J97l7n8J13n9m2j14K22j15J86k86m0L1rL52l03J95k15J32j54
5140g5L4n9O1J1Q4j30r5J94j64J30M9p0n3jj44K21L1Q7K6j20J30l52M6M06l49
$$ y = [-133, 316, -16, -114, -231, -99, 17, 14, 179, 35, 53, -48, -26, -146, 130, -20, -145, 141, 234, 113, -160, -112, -239, -144, -193, -162, -154, 54, -164, 24, 206, -154, 54, -29, 10, 266, -157, -99, 176, -70, -118, -88, 30, 184, 215, 446, 135, 48, 72, -100, -198, 55, -167, -62, -42, -224, 1, 37, 236, -315, 118, 73, 103, 77, -236, -74, 104, -127, 117, -133, 48, 55, 33, -42, -137, 231, 119, 94, 140, 258, -7, 91, -9, 150, 116, 20, 25, 9, -142, 12, 7, 24, -12, -30, -56, -42, 181, 50, 79, 143, -183, -30, -69, -117, 46, 74, -4, -80, 29, 80, 12, 72, -98, -69, -119, 9, -29, 22, -55, -102, -29, -142, -167, -103, 37, -26, -108, -86, 134, -148, 51, 93, 92, 420, -277, -182, -230, 85, -163, -21, -136, -26, 71, -8, -16, 118, -20, 61, 69, -221, -71, 126, 89, 31, 144, 85, 43, -71, 151, 36, 222, -64, -104, -73, -82, 270, -33, 162, -53, 79, -75, -41, -100, -39, -28, 56, -74, -169, 25, -139, -9, 40, -30, -83, -84, -228, -7, 24, 111, 137, 17, 147, -205, -159, 247, -102]
5165a02K72o2P6j69NJ5k76K64K13l37J59N7k02K16j23Q3k38J58n1j4L10m37L26
5188A43l43P0K3J26m1j15O0nPK61q8n3J15k94K83j43m5q1K33k64M6J48R2j01q1
5213d7P9o9j19J36j13J81j09j80L01J14j24R2o6J62j53l98J95k05M85j31j3J26
5235A44J8l93J74j7N1j6J41K76k38k8r1K07k34q4K52k76N9O2nN1L2p9kk7j36J09
5261e0L2P8J8j17R7j90MJ06o2J03r9Q8j4P1M6k05r8K58pp4J6M9J05j63R4r8J87
5288A75l90J38j29J79K0K98j34Kl77J83m7M2o8J18j5j4P0Q2k66J99J86l05j31
5311a84J61K8p4j47K28J09k61J57j93K65p8k18K13K83l24m3%N2K69r8MP9j69j84
5335a25J27N7m9J80j07k39KL03j42l04K52P9j41R7J42m64J07L38j69N1j18P0j51
$$ y = [-102, 170, 108, 184, 15, 20, 35, -241, 23, 236, -101, 58, 115, -87, 129, 6, 89, -149, 9, -42, -56, 254, -183, 143, -200, -130, -107, 19, -22, -137, -77, -82, -75, 186, 98, 45, 160, -134, 149, 6, -39, -120, 113, -151, -105, 43, 135, 34, -47, 32, -37, -156, -20, -133, 48, -61, -241, 60, 174, 50, 142, 76, 238, 85, -313, -118, -323, 162, 31, 18, 144, 162, -231, -57, -74, -23, -39, 102, 378, 140, 112, 21, 228, -6, -90, 162, -114, -55, 7, 2, 53, 85, 6, 4, -23, -159, -50, -18, 60, 78, -39, 58, -132, -128, -22, -84, 19, -80, 8, -6, 65, 111, -94, -192, 66, 59, -15, 1, 50, 155, -8, 86, -12, 175, -215, -77, -206, -27, -7, 291, 157, 159, -218, -35, -82, -40, -108, 10, -5, -19, 51, 133, -133, 66, 252, -53, -184, -23, 5, -69, -216, 12, 121, -140, 17, -176, 89, 11, -207, 6, 289, -35, -78, -78, -26, 243, 145, 149, 228, 59, -125, 2, 59, 10, 190, 83, -156, -154, 149, 7, -297, -45, 34, -107, -10, 132, -332, -225, 113, -56, -5, -123, -53, -204]
5358b04K86k34J53k04L63om23L32K3j65j62J82p5J62j51K95j59K1P9j56J04j74
5380a13J64q3lj83J25L2J63j64J67k17j56N23j55j15Q0j27M1L5K3l07J75O7N2
5403B4k85K76p7j54K20K4J11P9r8o7J02q2j16k8L1j58K31j44R1pJ2Nq7J6R1L8
5429D8j85m2K3K72K02k88k22L75n9m36K98O9k60L38l16K58k56K05Ll5J44l77L08
5452F7r5J23j15rR3l79K14R3o0J4Q7J04j50rj00j05M4J26J7J94j37J41q5J41k10
5477Dl2K84Jm92K02L4Q1r7n4L57m47J40J06l11L19l59K98j34J01j09K06j3r7N2
5501D0k90L17M0q5n3j4K58k44j40n9K95j34K16l76Q3J23q9K94j00j31Q7J00k43
5524a05k8K93l12J8L70l63K31j74M4N6j90J59K30k77k5J03j34J04K6J85k97j57
$$ y = [-204, 82, -152, 1, -203, 160, 154, -269, 63, 86, -79, -241, -59, -134, 28, -123, 172, 13, 34, 113, -43, 61, -113, 51, -32, -35, -218, -93, -61, 102, -62, 105, -112, -268, 255, 100, -15, 65, -62, -21, 14, 37, -270, -95, -28, 24, -261, 15, -62, -216, 4, 28, 139, 218, 120, 53, 155, 73, -43, -71, -40, -198, 33, -111, -20, -27, -15, -10, -97, -81, 10, 48, -137, -179, -156, 116, 318, 30, -192, 183, 124, -312, -14, 55, -205, 133, -183, 75, -181, 24, 27, -8, 136, -241, 67, -28, 95, -20, -29, 64, -315, -101, -8, -68, -54, 33, 137, -13, -22, -122, -227, -183, -57, -40, 154, 17, 158, 73, 214, 4, -28, 256, 257, -235, -33, 1, 82, -15, -69, 288, -159, -19, 87, -224, 95, -264, 34, -100, 1, -108, 98, 85, -12, 40, -250, 67, 107, 22, -31, -45, 213, -31, -171, -230, 65, -69, 147, -229, -146, -23, -112, 182, 82, -49, 38, 138, -105, -133, 160, -152, -134, 236, -127, 104, -70, -26, 30, -160, -1, 229, -48, -73, 30, -104, 0, 26, 211, -86, -243]
5546b43M91l15J5Q0k24K65j62k90M55K8k90L8L23j68o1J09j18K13k19J04J89l14
5568i4m9L4j59K24J72o9k15L03r3M2k54j23O06m42M0j55p0K59J01l6n2l9O2J0
5592CJ27j09j74L17j89J01j07K73l07J8J11l6n5o2K60k25K78l63l8J40O0L2j52
5615i7K91l02o2J62J86l98N41l38o7Q7k21L20N3m0kmj92J78j78L6N1L3p3J73m86
5640c49J06N6K33Nj92K36Q8k08R1m5j24j5r7J95j16J11P6j78J81k3J62j02L7k11
5664h3K8J29J8r1L14k08j42q5J39r8L1K27l48j49J18J60P8j61J62R3m8j0K5k25
5688a26L01K4k58R4J51l18K19p4mj39k7K38k02k26N70k49k70N10PN2l62j78M60
5711A93j49j25J11l1J36j14J10n5m5J06j08n3K5O3J19r9M7l9j26K01o6Q1j16L9
$$ y = [-243, 248, -67, -52, 28, -196, 69, -93, -383, 72, 100, -190, -152, 171, 3, -58, 51, -67, 146, -73, 31, 220, -94, -143, -109, -268, -44, 128, 59, -156, 147, 54, 96, -158, -281, 325, -117, -77, -232, -302, -43, 58, 22, -30, -69, -7, 3, 130, 21, -153, 164, -25, 76, -31, 242, -65, -47, 64, 28, -27, -89, 171, -54, 224, -139, -177, -37, 23, 55, -97, 194, -108, -170, -8, 178, -220, 321, -17, -84, 3, -218, 102, 155, 115, 113, 109, -83, 95, -83, -47, 4, 37, -36, 137, -349, -243, -187, 46, 51, -141, 95, 183, -25, 66, 21, -103, -118, -215, -20, -136, -25, 51, -127, 54, 31, 193, 91, 128, -83, -55, 74, 92, 1, 315, 107, -35, -120, 19, -79, -48, 179, -169, -318, -200, -40, 38, -123, 39, 132, 84, 74, 99, -126, 175, 199, -59, 35, 186, -132, 87, 13, 9, -130, -157, 81, -121, -347, 223, -26, -296, 214, 221, 273, -89, -267, 193, 44, -81, 30, -1, 135, 21, 131, 76, 31, 137, 29, -24, 1, 64, 183, 84, 131, 92, -34, 167, 101, 182, 66, 105]
5735A05K6k23J81m8j79J15q9J06mN5j63k2L34k12l1j2r3J08r3J94p6k03J85q7
5759a26L2K20n8r6l93L69J59k92K01r7K53k07Pj5j9K29m84N34j95Jr8J01O7P2
5783A65l78L15p0P1k52Q0M5j44j1J93j37J40K42l06P4J42p3l71L52l26K40Or1
5806i4K48j13N7l53J64lL5O8q9R9j16j08M04k52J70j86J86j00n2J25r1l2m0P6
5830Ck44K26j47Q3J10n8k13J83L78m69P2n6K02J42k8p7n9J78k04o9j86J89K92
5853B48l06N3J00j44j23J35N8PQ1N1j53j98J52l3kj61K68P0l76J63K00q9P0k90
5877b19J54P6J67k31J33J55j94J24j19P9j57k1p6J07N2j0R1j6M5j88J9n1L20k89
5901d9J6j18J02N5J60l67K01k52J73l0N4L15j60j31j40J16k79K45n9K94j10j48
$$ y = [105, 131, -92, 89, 41, -138, -23, -112, -6, -10, 45, -118, -140, 194, -18, -49, -61, -154, -46, -139, 55, -21, -224, -39, -126, -94, 126, 68, -28, -421, -52, 107, -185, 16, -81, 172, -35, -28, -43, -62, 167, -317, 217, 22, 23, -75, 26, 93, 165, -213, 102, 32, 103, -149, -69, -24, -168, -179, 14, -123, 17, 259, -47, 27, 169, 96, -275, 77, -249, -9, -3, -94, 154, 41, 98, -255, -91, -94, -59, 9, -80, 19, -97, -205, 199, -53, 117, -69, 117, 17, -35, 90, -1, -33, -73, 3, -241, -15, -162, -79, 31, -27, -240, -57, 321, -148, -76, -132, 70, 212, 184, 107, 48, 226, 22, -47, -233, -44, 248, -58, -5, 95, -49, -172, -37, 21, 28, 109, 160, 7, -191, -39, -72, -74, -235, 33, 103, -273, -110, 90, 1, 71, -219, -65, 11, 178, -53, 80, 235, 41, 165, 46, 125, -32, -53, -129, -22, 30, 20, 111, 95, 140, -48, -29, -80, 240, -49, -33, -151, -49, 6, 166, -201, 0, -252, -79, -109, -55, 260, 100, -31, -171, -55, -334, -89, -148, 146, 36, -112]
5923a12K0rj80N57k58PPk23K44j5K10k31j93K81k42J40j20n5n0J68J49l30J54
5946h1J05nk05J17k20RJ36K98q0L5j40q7K27o5j67r4Q8K54R6l12J08K14j60K4
5970I5Nk4k5j23j28K51n7J04J97k11J32k91J4p5M66m55r0q4M17l52K48j22P1K05
5994A68k33M6j25M8JJ55l3L3k5j10J64m1K5k95L29j38L0j73J02J08l64K37J93
6017A02j88k1L3j04K29j98K6R6J0j4J90j31k18j6M01qk22L5K82j67k77L73k66
6040e3Q6k7j52%Q1L6m5J26om9j63N50k44n3J9jk27L31N6j28rq4r9P0j88M36j90
6067G3l3M4l3R4o9j45o7N6JM1p3J68l43N04j73j40K85o6l2m9o8J70p3j04P4M7
6093H9k1lN5J48k31k93J78J0J94p9k25J58Pk6M8j86K25q4k4M6O0mJ64j58J98k95
$$ y = [-112, -92, -101, -281, 276, 18, 25, 32, -191, 53, 38, 248, 17, -176, 105, -137, 3, -117, -172, -222, -54, 95, -235, -81, 24, 19, -186, -69, -289, -280, -144, 154, 74, 109, -31, -118, 109, 44, -123, -217, -129, 125, 221, -91, 17, 231, 71, 95, 100, 76, 51, -72, -200, 51, -6, 98, 295, 84, 216, -75, -61, -136, 330, -125, -215, -299, 118, -234, 14, -108, -37, 168, -65, -19, -144, -96, -95, 60, 27, 60, 35, -75, 89, 48, 73, -222, 107, -31, -1, -174, -72, 36, -328, -91, 102, -86, -107, -74, -178, 51, -147, -121, -25, -15, -29, 161, 30, -188, -204, 197, 189, -33, 2, 284, 117, -160, 213, -53, 33, 6, -146, -146, -65, -29, -74, 52, 46, -3, -166, 384, 140, 87, 106, 105, -122, 209, 265, 137, 128, 44, -55, 15, -173, 263, 73, 40, 84, 51, 145, 76, -69, -136, -80, -79, -38, -111, 57, -286, 218, 45, -95, 190, 124, 92, 43, -25, 145, 72, -32, 42, 89, 68, 65, 120, 268, 37, -256, -78, -68, 126, 47, -178, -20, -13, -39, 9, -177, 48, -36, -60, -14, 46, 42, 206, 48, 246, -49]
6119d9K76k01K61j77l34L13K4k01LR3j93L3K84k84K56k40J17j03K0J18%j05K07
6142A18n15O76n12K98o2J17P7l14K35j17J60j79J4L6J84j87J09j99K20J05k93
6163b9M7J45o1J54k81P6m86M00m4K06r5k51L53l06L73k5M3p2o8j92j8J8J62K18
6187B67l54jn7K17j98K75m3j92R7%j74J41k76J22M60m22J96J65N7j9l58Mm9K57
6211A15j66J05m4L4j19R8k39J69J80j92l05K75J58p4J20q9K00k14q1n7P4J36j15
6234c1j37O7K01j71J11k61L26n1J0K47l42k33L54l07L68o4m8o8j89K09J35l12
6256a86j65O19l56K26Mk54J48N9l04J44o1K08j54O7OJ73r9R6j79J42jq2j07J3
6280d3J20q7J26L3j42p9o9L96n3j32j18J08oL1k20O9J34k17p9L7L27k85K11k6
$$ y = [-49, 227, 26, 287, 110, -224, 89, 113, -88, -85, 8, -185, -152, 132, -152, 104, -136, -19, -122, -102, 16, 16, -89, 118, -397, 279, -233, 65, 3, 120, 197, -117, 118, 1, 161, -18, -4, 32, 216, 29, 138, -61, 159, 264, -29, 18, 163, 102, 256, -25, 51, -435, -35, -79, 127, 32, -219, 134, -172, 201, 176, 219, 147, 79, -113, -131, -113, 49, 267, -87, -88, -145, 72, -126, 149, 106, -86, 11, 11, -163, -22, -298, -176, 284, -138, 58, 223, 280, 261, -97, -93, -142, 115, -51, 54, 10, 44, -75, 23, -216, -47, 133, -59, -364, -89, 69, -5, 115, 26, 226, 12, -69, -126, -52, 84, -31, -168, -101, 100, -71, 40, -221, 105, 54, 64, 311, -31, -264, 90, -217, 151, 87, 39, -29, -218, -9, 126, -186, -351, 268, -88, 138, 142, -112, 36, 95, -209, -65, -126, 82, -72, -5, 1, 174, 75, 171, -8, 134, 133, 51, -56, -43, 77, -10, 116, 149, 7, -72, -141, 255, 202, 70, -48, 60, 54, 85, -135, -66, 68, -149, -228, -191, 136, -149, 62, 36]
6304C6j2j39J16J66l24k5j21L65O9n47L90K08pm45J5J35kJ02O3j32O5Qr7K39j34
6329hJ84j69j15R9j61K6J47Lj94n1L49l05L17j20j63P9p5k8M8J65k41M0J80J76
6353A83k93R8q5J5NJ31j02J22j70Q5K78j72Qo2j79m6K8J00r7L26q3k35p3J23m3
6378a38L02k9l34J12j59N14j15k23J12K22n72L27p1r2K29j91K06l07J97k41K45
6399fNJ98J8j38n1n1o5K6P2j70L88k52n9M5J03j07R5p6J76n77M51j22J68l5K0
6424E6k9j23J3j01K50j15R9m0J06k72L86l10J42N5j18J86l93J02P2j29l5K17j12
6447i3J51n5k80Q0ML10l6m4k07j7M06k38j4N8J96k72J7l6j68N19k71J22j83n5
6471a06J07K10l14M4M43l99M0l5r6J05j39r0J48L53k60K17l48n6K50q4L4j55K30
$$ y = [36, 24, -115, 1, 167, -157, -182, -303, 62, 131, -416, -26, 182, 175, -270, -255, -120, -122, -20, 43, -89, -24, -16, -113, 126, -8, 176, 7, -108, -9, -170, -144, 3, 6, -188, -239, 110, -195, 122, 2, -161, -82, -157, -185, -137, 28, -213, -173, 7, 183, -110, -12, -97, -82, -77, 54, -48, 74, -96, -11, 267, 95, 103, 41, -138, -184, -156, -56, -153, 173, 90, -145, -218, -95, -138, 164, 135, -199, -87, -246, 268, 153, -70, 42, 264, -308, 19, -52, -144, 85, -106, 100, -207, -10, -251, -6, -1, 197, 215, 77, 26, -25, -90, -64, 8, -162, 226, -26, -85, -40, 63, -44, 51, -25, 151, -426, 25, -97, 71, 36, 56, 27, -96, -83, -184, 66, -49, 50, 10, 116, -156, 230, -80, 62, 117, -1, 185, -208, -106, -34, -163, -198, 19, -93, 58, 3, -277, -197, -193, 117, 81, 37, -170, -187, 219, -19, -33, 25, 221, -51, -34, -70, -238, 281, 10, 132, -51, -106, 1, 211, -103, -59, 384, -15, 25, -10, -106, -1, -140, -230, -82, 271, 11, 228, -120, -176, 74, -10, 24, -131, 99]
6494I9k06R6k04L69o9m9k09J15KO3j39j81J11K24k6jp9L88k42k75L98k25L7J60
6518A57l12J38k61J93M5nJ03k12K32r6P7J69L9n37L36r4J06p7oj54J84r9n4J59
6542C1l00L58J98k67J0Q6J95l45L0n5k64M15k94K43PQ0J34o8k74J16P6k32J25
6565Ej46N3K08k19K9K88m2o26O48l0j9l22M6K13k24Q8Q7o9j64L25j49n4k10K20
6589f4K98j47k96J58K8m4J33k21J16o2J56l9j35K10j21K25m5j56J94o4j46j57
6611a79K10J3j41K03J9j16l3mM6O8r3J27j0j87K24J6j44j02j02J51m5J5K4J02
6635F2j19J04N6o6j13J2J11P8j90J06k60L71k02J48J32l91j5K29R7p5k4L2r7m5
6659e9J00j98M24n40K79n0j8K81j55l1Q6j3l20j4M69j99K5K8N8p6j23j42K0J34
$$ y = [99, -107, -11, -215, 154, 85, 36, -173, -58, -56, 7, -132, -313, -202, 22, -4, -5, -84, 304, 62, -213, 185, -40, -3, 157, -155, -17, -278, -85, -40, -45, 58, -154, 78, -18, 59, 228, 267, -270, 66, -28, 78, 1, -5, -159, 25, -74, -128, 31, -269, 89, 287, 20, 30, 116, 311, -34, -4, -59, -323, 92, -202, 41, 48, 128, 262, 194, -80, 36, 112, -120, 5, -141, -88, 120, -99, -70, 218, 176, -450, 198, 168, 149, -173, -127, 86, -138, -50, 37, -32, -196, 129, -20, -74, -284, -64, 234, 87, -209, -51, -23, -67, 66, -155, -39, -101, 55, 16, -119, 91, -30, 195, 150, -6, 188, 124, -22, -179, 31, 44, -97, 106, 125, 9, -24, -28, 18, 86, -7, 120, 110, -77, 147, 163, 19, -83, -185, -34, -79, -64, -40, 62, -57, 47, 103, 37, -76, -64, 47, 125, -65, 41, -219, 152, -50, 98, 230, -161, -176, 53, 150, 75, 51, 83, -14, -59, 41, -157, 267, -273, 6, -44, -62, 219, 64, 33, 119, 106, -214, -228, 241, 42, 67, 95, 153, 77, -46, -188, -168, -34]
6683c4O4l6jj4j05J31j21L00j5l59K34K23j90J31j39j86J72k41J18q8n1K66o3
6706dJ56m37M00q8j22J73j76M5J23M6j08j0N0Rk5j08rR5O5P3j86K91k80r4K6K81
6732A86j33J16k77K15j06R7l6J91k5l09K44j11J19l61K36j19R3J38k45J0J07j64
6754a34j29L60j78J91j91K71rk93J35J40k38J88l1J30j56p3J26j35k49L04l44
6775c15K90j03OJ3Q4j16J70o5mJ5j91K84j70K90k45K66k13j19K40k01M7n0R1J6
6799B0j06K49k33J47j58K19j13j28M49l21K3J13k94K37j16J51l2j32J47p2K11
6820B61m97K01O6j99N1oK47k06r1J54l7j42J92L18n66K21P1LJK00k08j94R4J00
6844C4L7m5j28N03j96k85r0P4L59o6Q7l65kJ01J90k85P6M55l75j9L8K2k08OP1
$$ y = [-34, 30, -6, -7, -21, -126, 5, -116, 184, 169, -190, 44, 267, 77, 208, 69, -117, 55, -186, -68, -156, -207, 59, -4, 152, -285, 115, 27, -95, 78, -98, -53, 70, 116, 8, -2, 48, 57, 32, -76, -85, 10, 75, 148, -38, 253, -27, -121, -95, 186, 53, 169, -108, 107, 1, 98, 62, 253, 228, -81, 163, 52, 171, -190, 46, -73, 20, 158, -87, -77, 30, -134, -263, 97, -81, 110, -81, 190, 181, -112, 23, 163, -75, 113, 82, 212, 56, -17, 109, -26, -275, 29, -315, -25, -128, -122, -109, -25, -141, 29, -36, -40, -25, -216, 68, -102, 188, -57, 209, -4, -123, 117, -84, -37, -87, 4, 20, -86, 163, -70, 77, -81, 138, 25, -103, 346, 25, 48, 161, -133, 104, -12, 139, 107, -25, 122, 50, 261, -236, -35, 31, -168, -117, -123, 124, -82, -173, -19, -56, -198, -6, 312, -254, -33, 38, 41, 42, 242, 34, -160, -66, 34, 71, 26, -102, 401, 205, -80, -170, -96, 263, 197, 284, -81, -83, 18, 208, -77, -1, 454, 79, 60, 98, 120, -88, -82, -11]
6869a1M6j3j08P1o4R1K11m82J64L17k78j30Q4J42K7n0n9m5R7J36j59k4J40m01
6893b98K84K25k16j39k06N04j88o8J71l16L89j34o5K4n0L2j68J13R6J71k2k84
6915a45M92m01K00m3m7k02lM78m16o6L59k70r8J55n0j55J43N9KK24k68%O0j12
6939a04K02j18j32J52O1k7LnJ6Q0k62J50J35l8k34p0M01l6j07k62L16l9j42J82
6963A22j97k6K16m9j46J2L2n4O7j58J83j41J05jj73K00J86j13k28Q6J67mk59K64
6987I1r4j07K16k18LJ51Q3J6k81J11p2J17K59l98O2J07q9J29j05q2J68j3l7JJ
7012A9O9j20k6J20O8k8q7L8j67L51j84N5o9l66L87q3J7N7M5j73J71N2pJ33k05
7037F7j59M4j18P2J32J75k47j94N1L11n6l07Q2K70k02k5K91j3j16N8j9k55K65
$$ y = [-11, 35, 22, -86, -15, -79, 12, 223, -259, -95, 222, -56, -186, -102, 40, 67, 17, -42, -87, 10, 146, -13, -37, 103, -298, -14, 211, -5, -144, -350, 154, -34, -102, 69, -247, 142, 8, -57, -33, -83, -51, -219, -106, -10, 161, 139, -145, 347, -54, 146, 103, 56, -146, -149, 329, -87, -153, 206, -64, -162, -7, -57, -212, -69, -10, -8, 216, -52, -52, 8, -104, 98, -20, -152, 0, 61, 34, 37, 32, 48, 128, -134, 16, 151, 113, -121, -191, 210, 174, 67, -195, 121, 82, -60, 122, -75, -101, 115, 66, -80, -68, -36, -90, -23, -181, 2, -139, -34, -35, -208, -8, 178, 65, -163, -77, 90, 86, -173, 91, -3, -110, 106, -112, -109, 42, 125, 141, -140, -29, -101, 16, 275, -123, -61, 46, -43, 86, -19, -101, 67, 54, 17, 18, 19, 88, -32, -58, 62, 130, 102, 15, 53, -114, 237, 53, 108, 39, -327, 60, -23, -6, 51, 96, -77, 94, 146, 139, 272, 67, -92, -48, -166, -94, 38, 213, -34, -228, -177, 134, 78, -229, -147, 123, -79, -104, 187, 174, 58, 116, 97, -158, 107]
7060A07l17K98j6QL8j57N7q3K59q3K25l34j93J32L2k02K71r5j24L29N5l62K28
7083G3p4o5k5O4j12o9L47N6j09j17o6K61k34J55o1n9j04K37j09j54K82j14n5p2
7107a24P2N8K01l43L17m1k97R4j2O5J14l1L0o0q4K69l82J19J18k45o3L57m41L21
7131A2n4Jk3QJ43l02O8j07J54K92j86J40l7j51k5j7l9j36L3L35q4J99Q1k48k04
7156a47J47m2n8J95m9J47q3r8Q2J5l11J40l56N66q5k7J0j60J96n7K1l19N25j12
7180A40j78J17k20J23m5Q8J79r8m2N5k48P6nRk19K54J71k91O4L5Q3k97K30j5K01
7205A67l01J54r1j57J41NK3J57n1o4P7P6k99J70j9N2mK8l25M02MR0k80N9N3K8
7231I5q1L59m34K24k08K81l18J50M0j31J88j57k20m7M39l82J48J71j29J82j41
$$ y = [107, -210, 88, 72, 80, 118, -39, 18, -65, 194, 111, 336, 2, -191, -59, -27, -229, 42, -53, -177, 152, 207, -155, 73, -1, -66, -91, -27, -139, -208, 139, 195, 86, -31, -97, 164, -70, 85, 24, -35, -139, 98, -11, -165, 117, 3, -52, -124, -52, 6, 207, -136, 181, 140, -157, -63, -75, -10, 104, 73, 103, 43, -41, 228, -154, -35, 83, -162, -225, 132, -309, 12, -42, -41, -64, -56, 87, -215, -147, -254, -100, 192, 6, 146, 109, -42, -67, -84, -123, -259, -226, 109, 25, 224, 305, 57, -147, 0, -42, -100, 95, 46, 193, 110, 12, 94, 109, -202, -62, -418, 148, 63, 36, 46, -114, 82, 25, 46, -273, 252, 140, -38, 79, -141, -18, -63, 25, 204, 106, 64, 119, -129, -53, -58, -49, -268, -14, 157, -134, -70, -35, 48, -249, -19, -34, 167, -134, 20, -71, -228, -87, -82, -59, 98, 47, -17, 60, 136, -163, 7, -12, 40, 36, 64, -261, 141, 145, 235, -45, 14, 67, 95, 14, 373, -61, 163, -45, 236, -82, 68, 108, -23, 165, 8, -212, -259, 180, -202, -54, 117, -12, 170, 29]
7252B9K80l70J69Kk56M37k7r5j67k7R4J73p8L3j04K02k73K34l83j66K36J9K14
7275A76j09J78l35j26M09k60J39L6j84J45J42n0r3J60k25nK57j09k03J09o3R7
7297H6j81RL51k57k98L23M8M1O3j07j45J50J36l88J35Q6l2n6j20J43O9j33K60
7320A83m8mo4k9N6N6j62R3j08P3J98J05k65k17n9K88l3J11k50O0r2J3J32p7k52
7345b92M56k17J10n9j64P3O6j48p7L99k52j05L21J53k80k0n1n7J18j98N46q2k77
7368c7lR0j01K64k41M0R3n6n3R1q2k45L07RO9n9p8P5j24N4l4o2K55m1l02K80p3
7395C6p8r2J17O3j12J92j68l2J33Ol14M19k21QJ65j11J84l40J41p0J48k81J20
7418h7J37j46j62J72j27L71p2k72K05p4mk3R4Jq5j03L68l85K27J7k1l2J83q9k09
$$ y = [29, 309, -61, 108, 110, -146, 291, 264, 169, 2, -25, 69, 242, 164, 197, 93, 295, 22, 256, -127, -293, -57, -38, 176, 67, 245, -90, -216, 193, -67, 72, 108, -76, 69, 211, 161, 68, 228, 3, -2, 255, 146, -57, 52, -11, 86, -95, -86, 265, 8, -290, 33, 81, 122, 185, 78, -67, 83, 219, -169, -34, 52, 20, -36, -156, -13, 56, -77, 183, 135, 131, 67, 38, 94, 150, -12, 81, -27, 46, 244, 349, 84, -133, -192, 96, 63, 174, -76, -16, -108, -95, 37, -40, -292, 164, -53, 57, -2, -166, -93, -27, -175, -252, 147, -105, -210, 111, 264, -16, -36, -87, -144, -26, -224, 322, 240, -37, -40, 50, -51, 213, -28, 12, 105, 49, -4, 87, 5, -240, 67, 76, 145, 86, 8, 83, -41, 13, -21, -83, 172, 131, -171, 109, 36, -42, -134, -17, 46, -66, 126, -42, -74, 59, 65, -249, 170, -51, -43, 122, 11, 195, -145, -4, -74, 74, -207, -87, 50, -96, -258, -86, -213, 158, 86, -186, 19, -55, -59, -82, 12, 13, -72, -175, 193, -192, 35, 52, 31, -1, 182, 93, -116]
7443a16O2J13j31L31m19J8K68n7O2k50J3J84K1l80K37j49N6J53m2J30Q3k66p8
7466a57M22o1l21m2L3J23J1J17k6j31K13m50R8j0K83p7Qrj19q2K11m3N5P4l5J21
7492B06l01j4J34J72j15K02j99j4j36k1K45N8k80j52L35k65j3J80p1L2L48m36
7514a05j16R9J58J22q3P4k14M41l00j21o9o6J37j9J97L4k03j45L41k00J10p7N9
7537E4j87M22o5m91P9K07J10m7j61J49rk1o4o9j5q5L29j89LJ63k08J10%j12L06
7562B09L1n6p6j91R7N0m59M88l0mn3j00K92o3k05M4j45J58N5o6p1L5k6k71J66
7587a91O9J3l44L59J20j07P0j7Rr6J76J65l18oJ60k6m4j54N88j50j48l0J94r4
7611A98n9Lk16M0j38L31k36J62n0J7r5K34R3k28o9k2q8J3J89k21J21j0j06J12
$$ y = [-116, -54, 59, -72, 259, -160, -142, 126, 69, 131, -119, -106, 78, 99, -281, -44, -193, -137, 16, -26, 104, 187, -79, -157, 265, 204, -117, -159, -126, -3, 8, 125, 99, -32, 181, -269, -171, -181, 102, 25, 33, 24, -95, -177, 34, -9, 46, 120, 85, 206, -95, -109, 25, 197, 82, 284, 85, 71, -65, -86, 159, 217, -63, -215, 120, -145, -158, 22, -49, -17, 331, -105, -221, -122, 36, 158, 75, 149, -65, 376, 76, -45, -114, -180, -43, -62, 135, 169, -34, -179, 162, -38, 72, -5, 54, -133, 289, 224, -267, -188, 19, 129, 82, -79, 70, 61, 40, -24, -93, -108, -193, 136, -53, -50, 113, -95, 15, 15, -97, 209, 240, 184, 108, -83, 14, 64, -395, 93, 63, 59, 6, -94, 198, 135, -70, -26, -171, -13, 42, -24, -95, -60, -86, -357, -191, -122, -109, -453, -94, 26, -81, -11, -28, -19, -115, 61, 226, -92, -98, 62, 36, -8, -162, 426, 276, 128, 98, 292, 198, 139, 142, -74, -34, -172, 159, -77, 85, 35, 52, -43, 191, 284, 56, -13, -35, -123, -110, 79, -142, -21, -31, -137, -25]
7635b5K25r0j03j64J25k19K32j28M6P5N3k83K83J83k03Q8k27J82J15k81k7J64
7657B1l3j02k11N10k59M4Qj61k12K88K74j75M4M6j81Q0J84k27J20k26o3J23L1
7680g7L03j67j70L8j15J79q9K8J59N5j93N7j26J7j32M63k27P6L3j61j19K15k08
7703a61LJ73K74j83r0l22K27J53kN1j32r8R4j26N8j10J72m8n5J26k24J50P9p7
7727f8J36K8mK08n06M3J98k8pO4J18m87K9K59J67R1l22M6J36j67J91J05k60o8
7751i8J34l19J20k63N06j75K21j89J15J06j46J50j70j8j83N42n00J18o2P7pJ82
7773A41l24P3l7J4N8k4J28O5N4k61j6L28k36O9j44j52L31j68N5L14m03K66j40
7796iNj43M01l77q2J35M9k77L69j99L08k40R9N0M9k82J86j20rK43j14j15K30l14
$$ y = [-25, 200, 110, 7, -157, -32, -251, -19, -147, -101, -26, 27, -256, 27, 210, 7, 95, -132, 50, 165, -116, -143, 21, -12, -114, -325, 185, -74, -30, -22, -183, -395, -107, 167, -8, 36, 82, -99, -19, 165, -62, 58, -168, -231, -108, -77, 226, 59, -111, -73, -188, -9, -98, -70, 89, 144, -49, 8, -118, -101, -233, 230, 3, 79, 112, -49, -168, 47, -161, -158, 15, 289, 106, 16, -306, -79, 74, 72, 123, -9, -107, -13, -139, -81, -191, -19, -67, -122, 4, -220, -70, 9, -68, 68, 96, 92, 300, -206, -163, 35, 7, 0, 64, 182, -305, -276, -17, 150, 241, -81, -35, 101, -66, 125, 230, -30, -98, 36, -283, -163, -426, 80, -95, 126, -63, 52, 158, 12, 162, -8, -26, -209, 333, -167, -49, -111, -34, -41, 141, -183, -110, -147, -133, -75, -99, 29, 94, 148, -113, -129, 199, -37, 32, -112, -264, 67, -101, -46, 268, -135, 131, -9, -4, -147, 254, -123, -205, -70, -21, -298, 71, -128, 180, -60, 39, 89, 138, -144, 42, -78, -87, 156, 42, -73, 157, -157]
7820a57M0J80j2Q7L28l01R7k55j16K19k2j2j31N8K32j93O9K8r2l0j28rJ48j29
7844a01K30Mk43N4Q0n2K83k96K27k00K8n2O5P9j96q5RK78K43q1l72l5K4K08k92
7869a93J57J13J56l1j04j04K41k0j7m13L20r4Rr3j21N1J44J67o1k88J57M0J8J90
7893B24m35J62N1Q7m0J19o7N1k60n2pL17j74K22j60j38L2K98k02nL6J5l74K90
7917a0L3l32K22j4n2J15j86K22j47J39J12k01R2m4J73l8q6k51M95k42j90L9K19
7940F8k55K66k05K6K37m53K71O4J10k32K41k31J40m6k3j10J80l67L74j20J59L37
7962D31l33J93k30J6j76m8J31r5N5K69k96L03J59n47l1L00J3j23j48K42o2j38
7984a15K33m39M32MJ30l46j10K83k73K14K52o3k67M7Q6l6K26r3j37N9J49o9n2
$$ y = [-157, -117, 63, 51, 138, 466, 165, 262, 7, -109, 110, 88, 76, -55, 3, 235, 42, 111, 139, 47, 17, -111, -120, 28, -101, 129, 133, -110, -56, 24, -28, 255, -41, 186, -14, 14, -38, 27, 106, -90, -175, -166, 112, 355, 274, -98, -133, -109, 99, -193, -36, 77, 233, 202, 98, -6, 235, 215, 198, -215, 105, 11, 20, -73, -194, -143, 1, 168, 107, -181, -24, 16, 34, 224, -211, -49, 2, 89, 49, 168, 101, 152, -108, -160, -167, 150, -24, 198, 38, -100, -68, 230, 28, 23, 59, 74, -300, -10, 23, -309, -87, -101, -153, -38, -224, -2, -149, -10, 102, -99, -7, -51, 122, 84, -2, -253, 242, 0, -190, -151, 68, -187, 79, -126, -100, 137, -316, -45, 19, 129, -103, 138, -93, 47, 1, -22, -132, 48, -319, 55, -65, 94, 431, 98, 291, 61, 77, -99, -147, -16, -111, -56, 213, -83, 220, 379, -168, -199, 101, 114, -9, -157, 85, 23, -115, 118, -321, 111, 115, 245, -101, -211, 72, -201, 13, 265, 202, -65, -18, 68, 32, 258, 165, 28, 87, 236, 167, 115]
8007A15pj67M3J16j15P3k42K36j70K21m4j71j42L57NM1l9n5l1L8j52J82Jr3j48
8032a48J14J89m4o1k39O1K20p0J13j23j18J71QL5J42l74jm2N95n23j02K92j09
8055a4K37l49J64O2n3j3k99N65j30j23K13m03J28Q5j10q9j8J11L7p7Q7mo9Q9M2
8080F9m55L91K81m50M2K00k14R1J13j33J26Qj13J46j34Qk51K13L18j2j74r3k1
8103d4l2L67l63J99l12N9Q8J7J45j92r8J08j19J95p9J27q6J59n9j8Q6l04J89J39
8127A72k18j10q2L19j22l7J63Q2p8o09O69K95o07J38N5j07p3J29o9J18n6P5m8
8150aJ89m30P7N7m14O90j72q4L41k05p5L0L37l80k47M01K5k81R7Q9j2J57l4k0
8174A35k87j57L63r6j69L07k07k5Q3j27J65J4M5K29k60J03j0
$$ y = [115, 108, -59, -16, 100, -15, 58, -184, 52, -118, 103, 59, -112, -254, 103, 108, 149, 110, 55, 24, 62, -90, 92, 93, 0, -148, -34, 155, 111, 50, -189, -128, 92, 22, 135, 12, -106, 65, 73, 108, 250, -124, -125, -167, 428, -95, -197, 95, -14, 223, -126, 38, 100, 47, 34, -265, 300, 170, 47, 260, -143, -15, 70, -40, -129, -147, -36, 1, -76, 11, 7, -62, 27, 69, -386, 5, 286, -164, -122, 78, -136, -45, 68, -65, 61, 69, -44, 102, -32, -24, -275, -62, 256, 244, 70, -23, -44, -76, 291, -72, 127, -185, -126, -38, -21, 124, -68, -166, -58, -177, 18, -61, 66, -20, 139, 80, 62, 148, -156, 33, 172, -46, -156, -238, 81, -41, -78, 85, 167, 89, -520, 149, 444, -163, -25, 30, -77, -150, -21, -90, 28, -28, 47, -1, 188, -242, -165, -108, -522, 168, -4, -88, 253, 48, -27, 3, 340, -40, -287, 114, 139, -142, -45, 44, 32, 189, 155, 135, -152, -309, 54, -42, -211, 96, -111, -136, -53, -180, -15, -1, 44, 273, 13, 116, 106]
8191A06
$$ Imaginary data points
##PAGE= N=2
##DATA TABLE= (X++(I..I)), XYDATA
0@%%%%%%%%%%%%%%%%Oj4J6j6J6j6J6k4L2l2L8m6M9n7O9p7Q8j02J11j22J38j57
38h4J78j96K15k39K68k97L27l61L97m37M82n31N86o46P10p84Q67r60J069j192
58f28J334j507J714j968K293k721L313m186N604q278J4974o0993j14430J16805
72d8674L8532j3768Q1933L5978o1579N21k9784r7661Q275P5155J135L7012P2752
85I9827l2100o5507k0137n5055j7103Q2227L3296j9866N6348L0345p9598n7458
97d4781j2361k2291M2956P9609K992p099K4107m9264p1936J2359J2972j5023N3270
110E510N9990j6413j4335p081o4734m1687L9414L1815J2944L8457J3994k9276
122B8598k1940k9769l9593J1360M3489K3306K6373J9219l3676m3465j0598j3777
$$ y = [0, 0, 0, 0, 0, 0, 0, 0, 0, 0, 0, 0, 0, 0, 0, 0, 0, 6, -8, 8, -8, 8, -8, 8, -16, 16, -16, 22, -24, 25, -32, 37, -40, 48, -54, 57, -65, 73, -84, 94, -102, 113, -126, 142, -155, 172, -189, 208, -229, 253, -278, 308, -338, 372, -412, 455, -505, 564, -628, 706, -801, 913, -1055, 1238, -1483, 1830, -2356, 3248, -5030, 9944, -51049, -165479, -48674, -10142, -23910, 58023, 94001, 32422, 32943, 3159, -94502, -86227, -11072, -9937, 27075, 99827, 67727, 2220, -17917, -72972, -90075, -7848, 25448, 5582, 61930, 92275, 12677, -44781, -57142, -79433, -36477, 43132, 46124, 39025, 63132, 13868, -58068, -45709, -32737, -47760, 5510, 65500, 49087, 34752, 27671, -37063, -78750, -39336, -7521, 5423, 43880, 57874, 28598, 6658, -23111, -62704, -51344, -7855, 15451, 41824, 61043, 27367, -16098, -26696, -40473]
134d0473p058L6474L6999O061R199k704m2682l5208j771M329K0815M3928J7910
147D5819j3991j0138k0589l7308q556J9689J5143K4559L1776n134l0386j7951
159g067k0449j8284J8104L2003J3648J4603O494k5397k7497j0253j2452L646L5271
172B370K4867J738L143j4043l5628j4554N532J894K0302L3816M414j2842p321
185A3688k3506k5975N655J6878J1654K3953J4747j6620j7589j0284k1131n613
197c4143K2128J7778J1724J5150o972k6278j3753p409r001J4734K7689J0135K394
210B4176j169k0596k1929k989L02O390K4240J7690l378o338j2320k2213q344P905
224a8573Q596J5292J9724O55j4338j1024j4202j2917O293J5983J2252J2997N364
$$ y = [-40473, -47531, -11057, 25942, 32003, 41202, 38498, -4184, -39392, -41163, -36834, -16019, 27909, 45819, 31828, 21690, 1101, -36207, -44763, -25074, -9931, 14628, 46404, 41270, 10884, -7067, -27516, -45800, -27696, 4307, 17955, 32558, 39052, 13655, -13842, -24095, -36547, -32901, 2370, 27237, 28975, 32118, 18075, -17553, -32107, -26575, -24681, -4379, 29437, 33851, 21009, 13688, -9818, -35793, -30138, -13260, -1606, 22347, 37094, 20474, 2885, -7399, -28530, -34143, -12015, 5763, 17487, 32637, 25665, -613, -14366, -21775, -30776, -16042, 11647, 21782, 24176, 23007, 2411, -19518, -22507, -22205, -15815, 8425, 26115, 22737, 16399, 4079, -18134, -26478, -18573, -9977, 5315, 25039, 25694, 11356, 332, -13870, -26787, -20494, -4511, 7741, 20738, 26102]
237B6102j3705j7471r417p174J252J6097J5791P149K892q207j8576j1926k237
250a9430K116J2409J7298P777j974p201j5443j3901j136O438R100J4773J0469
263B1295l955j0573j1025j2236l894R047J1276J0134Q703j072j2425j1944q237
276a4906l605N963J4381J0469M651r22j0648j3926p041k20N237J1934J1717L444
290A6528l262r158j2468p758J022O822J0443J0883L478n158q834j0269p741P99
304a4673Q302R762Q763L613n005j0151r077n997P74P838J0719P230K235m364r890
319G9r195m755J521P523J0020P257J260n287r281q574l835K059P655R081O546
334A2074N91n304q765q137l331K699P526Q984N162K81n500q756p348k298L160
$$ y = [26102, 12397, -5074, -14491, -21665, -20413, -4316, 11475, 18624, 21516, 13309, -5267, -17193, -19430, -17314, -4905, 12393, 20170, 18196, 10995, -4448, -18349, -19485, -13047, -3947, 10826, 21295, 17340, 6767, -4258, -16494, -20388, -11341, -65, 10069, 18772, 17700, 5275, -6669, -14906, -18511, -12548, 1833, 12302, 16953, 16031, 5383, -8543, -15584, -15804, -10567, 1367, 13084, 16528, 13266, 4108, -8360, -16118, -15096, -8274, 2169, 13052, 16530, 11372, 2538, -7731, -15472, -14673, -6371, 3391, 12154, 15767, 10762, 611, -8466, -14463, -13689, -5851, 4868, 12098, 14333, 9969, 79, -9116, -13871, -12350, -4827, 5193, 12450, 13710, 8423, -858, -9432, -13267, -11208, -3553, 5528, 12074, 12665, 7361, -1404, -9541, -12872, -10173, -2647, 6337, 11499, 11780, 6280, -2476, -9824, -12122, -8962]
349h962P042Q267N334n76n827p962p048k335M158O942P430M886j049o142p221
364c063n980k265L810P868O726L722j181o239p917m494j022L249P175O834K872
379A0095j648n219p699n448N45L603O628O866K450l011n167o002n377P1N119N633
395A439N489L429l146o825n312l663m14N231O746L803K171j803p262n666k019
410g802j75L812P578M346j17j373n355p128k155K215K587O253N795q33l383l958
426C07n852l501L088M353L942M940J024m934m447l607l457J365O363L827K823
441F234J853m094o376k938j134q4N403O122J209q6k000o211m504M51J266L302
457a587O340K222k220j799m082n510j39K927L390M307L817k694l695k776l904
$$ y = [-8962, -1920, 6347, 11681, 11105, 5278, -2684, -9732, -12067, -7909, -967, 6463, 11349, 10300, 4158, -3063, -9043, -11308, -7498, 370, 7096, 10818, 9637, 3398, -4519, -9013, -10035, -6786, 389, 7223, 10095, 8447, 3228, -4471, -9919, -9374, -5771, 857, 7723, 10173, 7162, 1995, -4007, -9384, -9313, -4194, 1439, 6928, 10357, 7211, 386, -4926, -8589, -9003, -3772, 2974, 6777, 8948, 7145, -117, -5783, -7802, -7977, -4165, 3413, 7759, 7642, 6269, 914, -6214, -8369, -6154, -3567, 2686, 8481, 7648, 4265, 307, -5545, -9046, -5958, -1605, 2337, 7277, 8301, 3367, -1080, -4687, -8144, -6779, -416, 3411, 6234, 8087, 3993, -2383, -5321, -6455, -6539, -1136, 4986, 6195, 6109, 4109, -2102, -6606, -6155, -4889, -1587, 4753, 6975, 4755, 2956, -1126, -6636, -6775, -3848, -458, 3849, 7666, 4972, 1277, -1499, -5403]
472e403j598L731M091K512K927k73m955l759k108j610K286O148K745N32n21l438
488A307m927j567M23J002M558M332K63j401k723m452k599J122K345L361L661J143
504E848k551k773l130l021O54L211L575K785J081k287m281k526j349K72K842M100
520B450J653M31q38l295m384j304J133K447M053K624m53k503k316k951j789J552
536c490K539K576L255K76l334l326k126j358J447L703K726M67P50j551l946k289
552c681o09L25L863L693L44o72j103m024k706J284Q45J585L829J644j718j492
568A407j890m003L4L252J557J642K446j161l133j213k119j349K559L139J200J716
584D084q1l741k954j95p06J518L647J291P9Q0j881l780n46L98J30L778K641p20
$$ y = [-5403, -7001, -3270, 821, 3333, 6260, 5987, 1032, -2727, -4835, -6445, -4159, 1989, 4734, 5266, 4745, 1307, -3620, -5187, -4764, -3762, 796, 5128, 5391, 3990, 1267, -3185, -5784, -4662, -2317, 1044, 4705, 5848, 3297, 524, -2606, -5627, -4973, -1762, 1813, 4598, 5679, 3392, -889, -3415, -4764, -4492, -1650, 2450, 4103, 4534, 3696, 401, -3983, -5287, -4154, -1707, 2346, 4970, 4517, 2014, -302, -3253, -5042, -3490, -951, 1625, 4880, 5156, 1822, -1504, -3630, -4988, -3541, 162, 2888, 3355, 4105, 2554, -1392, -3681, -4290, -3965, -102, 3591, 3935, 3263, 2160, -1864, -4570, -3286, -2441, -856, 2973, 4617, 2899, 1407, -483, -4486, -4452, -1200, 357, 1999, 4445, 3284, 151, -1062, -3181, -4530, -1971, 1168, 2368, 4084, 4003, 262, -2692, -2887, -3593, -2075, 1572, 2863, 2942, 3022, 1141, -2639, -3185, -2787, -2657, 1121, 3762, 3042]
602C042j163q47l256j975J927J443R62L021P54k249j398j701k748J067K770J631
618A280J402Q41j913k340p92j327l01K692J729J311P07j068l000j619k52j66K157
635f59K757N45o01j32j999k286o49Q40J642K148J781j095j542j304j732o35J124
652a797J842J339J153J26j505k138j346o82J203K056J763L63l32j058k086j300
668b399J48N89K080J428P81p95j115j543j870L59J197J567R30J367r06j557j241
685i80j249j75J280J843J045P69l68k103j737l13J21P47J980P85L7J46j477j967
703a616l89K90O67J650J366po59j019j856m32N99P02J247J320N60j471q28j474
721a350j063Q24J321O70J364M17j182j396o86p69k0J785J160K69M30o86j723p24
$$ y = [3042, 1879, 1032, -2224, -4199, -2272, -829, 133, 3154, 3908, 1659, 261, -1440, -4188, -3121, -351, 1280, 2682, 3523, 1610, -730, -1522, -2849, -3150, -458, 1271, 2582, 3289, 2221, -779, -2398, -2650, -2816, -659, 2098, 2643, 2042, 1910, -89, -2375, -3024, -2184, -542, 1606, 3387, 2292, 750, -554, -2286, -2921, -1797, 45, 1384, 2537, 2663, 1158, -980, -2326, -3008, -1805, 251, 2014, 2377, 2045, 987, -1099, -2399, -2251, -1662, 418, 1846, 2627, 1832, 717, -826, -2696, -2337, -1140, 427, 1357, 2724, 1818, 261, -980, -2229, -2404, -1124, 719, 1764, 2533, 2165, 62, -1675, -1988, -1867, -1120, 860, 1645, 1682, 1828, 351, -1616, -2005, -1715, -1048, 602, 1968, 1961, 1302, 283, -1573, -2005, -1406, -704, 543, 1863, 2423, 952, 124, -1350, -2413, -1589, -268, 402, 1766, 2183, 1001, -395, -1081, -1850, -1870, -85, 1075, 1344, 1774, 1088, -635, -1359]
739a359j30k41R49J842O49k91m94j183j385j08O01R02J168R81m78q93p64j376
757a610L7M36J035P41J130m76r88p69r21m80J199N51J074M31M1j135j022m97l35
776a558O36J109J242J03l75q39r13r70J06P75Q79R97K93m65q56q21o38k02R39
795e58O47R13K75l49r70m59p64K07O69P08R06M9k89r66o91p23J74P30R57Q31p5
816A222l64r69j038j35J39O29Q79N28J97n50p31o27l72J85Q52M18P46J27n35r29
836c28o14o5K2R76L65Q28m4m60j047m06k54L43N53P10K84J98q17o26m59j38l3
857a012R66M19O12J48q04p10m37j27MQ58P51K66j2o79m84n03q9M63N64J65M91
878H50l25n80l64m22J31L67K37Q26K35j80n95q81l3qL61O43M40L94l91n53r13
$$ y = [-1359, -1489, -1730, -781, 1061, 1710, 1419, 925, -258, -1643, -1751, -1150, -248, 920, 1901, 1423, 530, -234, -1610, -1573, -1137, -102, 639, 1769, 1293, 305, -464, -1385, -1865, -666, -115, 959, 1390, 1431, 296, -726, -1223, -1558, -922, 187, 1429, 1532, 1157, 318, -595, -1565, -1459, -684, 195, 1192, 1485, 1020, 164, -657, -1295, -1497, -558, 89, 1002, 1277, 928, -42, -501, -1265, -1058, -389, 319, 1225, 1274, 985, 19, -672, -1395, -1221, -491, 466, 1297, 1222, 858, -111, -1149, -1284, -1145, -516, 363, 891, 1088, 538, -193, -820, -1192, -1007, -155, 263, 1009, 1136, 601, -328, -942, -1007, -985, -9, 356, 1184, 1140, 680, -367, -773, -1027, -684, -131, 579, 863, 1061, 244, -382, -841, -979, -1012, -46, 373, 985, 1133, 329, -381, -818, -945, -941, -83, 668, 934, 922, 243, -241, -744, -833, -370, 194, 359, 850, 525, -55, -419, -841, -710, -343, -106, 720, 955, 775, 180, -701, -734, -742, -381, 262, 702, 1096, 705, 152, -761]
899g61k76L13L06O38O12l7n37r1o70l05K11K06R38O8L6l41k88n64k55L12N08k1
921BQ65j58m13m12m69j23J70L65L50J24K52j1n89n03K5q3N39N94m8J5q1n45j78
944c12k37M13N1M93L64j78j89j08r51j33N44j63Q65M10j77p40j78k04k17M29J94
965b4J60J73L31l85m05k56k44R3N52M27Q4J11l38p60j01J73K04K41L62k07L66
986E57k30n20k90Q2M27P6L55J31m73J61n37m98K47J72M83K34j2K0q25K71j79q8
1008d36q4O90K91M8L3l81n39k57M21L3K93K28J60l7l37k99k46j47M91L24J20j13
1030B56k60L6k93j93L58k54L71M42J97k29o29N1m1m11L65M97K25k71o6l17l04
1051d70J50j44K59M13K93m96L6k78j08J28N9J80kL84k29j15Nl86j26K15L04J98
$$ y = [-761, -1037, -724, -418, 220, 832, 795, 258, 167, -503, -808, -597, -391, 547, 615, 651, 310, 22, -542, -797, -485, 23, 2, 867, 709, 296, -116, -585, -708, -538, -173, 177, 301, 553, 542, -47, -550, -525, -608, -69, 525, 477, 492, 411, -134, -312, -549, -136, -85, 408, 772, 594, 405, 297, -654, -787, -243, -406, 459, 869, 692, -48, -226, -430, -647, -218, -24, 136, 309, 640, 255, -150, -406, -650, -557, -5, 422, 506, 617, 279, -481, -582, -409, -205, 36, 398, 191, 557, 327, -193, -483, -401, 26, 102, 457, 588, 115, 276, -261, -759, -512, -340, 143, 377, 365, 385, -440, -169, -348, -436, -520, 170, 461, 509, 542, 161, -378, -635, -214, -181, 112, 340, 500, 463, 126, -173, -419, -566, -75, 249, 369, 256, -4, 32, -261, -454, -96, -350, 21, 463, 660, 431, -198, -147, -188, -599, -234, 263, 488, 217, 151, -166, -470, -320, -464, -205, 208, 501, 5, 41, -237, -345, -217, -158, 22, 20, 404, 175, 60, 65, -321, -447, -232, 72, 270]
1073B70R5j38m16L3j19OJ32K16K55rJ79k17m25m77M35J6K44o9K96q7N6n16l45
1096e85O95l68R2N88j8j78m21j98K14m3L79J00P3m7J1k66rk14k74M00K35o0J60
1119B66l81j23J53j78L1k2L38J75L34j32l94m74J67J35L8K03J7J75j41j49nm88
1141d55N52k95J44J00J68n9k87q2J04k47N10m7m5J69l17j1q0o1o9L10P3K95j74
1164A96j34k02k23J69J18P4K18O3j86q9l07j38K48J86L5O2j01J20j2j33k87J58
1186a65J48k0K50j61J00r2k25j66J30J55M25J7j08p6j88k86P3o3Q3O5K75J8r1
1209I8N5k22q2k4J32J49Q5N2J77m38l84N13q4q5K15l2J47k01q7m9m1m1nK16J31
1234A95k60L29k24l59N20l99K31m8L11k13L9m2j52l64L55J07M60j85l27Q2l55
$$ y = [270, 365, 227, -189, -156, -275, -269, -137, 79, 334, 325, 504, 287, -138, -615, -180, -164, 80, 11, 307, 220, 276, -240, -585, 110, -258, -166, 422, 404, 226, -195, -393, -179, -222, 157, 257, 330, 283, 294, 28, 19, -195, -469, -69, 166, 106, 266, -115, -238, -85, -263, -232, -254, 84, 259, 593, 461, 67, -407, -240, -105, -67, 136, 153, 328, 187, 38, 33, -455, 97, -198, -54, 46, 214, 155, -132, -214, -110, -357, 153, 106, 61, 230, -87, -98, -178, -239, -308, 2, 75, 370, 196, 62, -140, -363, -194, -76, -2, 216, 279, 93, 4, -303, -441, -193, -7, 28, 90, -11, 109, 97, -36, -323, -165, -17, -37, 213, 52, 152, 60, -165, -331, -201, -46, 379, 396, 288, 212, 24, -262, -189, -252, -169, -104, 171, 189, 98, 153, -69, -151, -175, -43, 106, 191, 243, 420, -18, -402, 111, 27, -58, 157, 125, 272, 71, -16, -65, -106, -147, -152, 64, 195, -65, 264, 40, -319, 201, -198, 33, -15, 296, 83, 122, 80, -72, -436, -81, 26, 486, 301, -26, 56, -299]
1255b99J74p1J28K28l4L8K1Kj42J38k60N4q6M97k77oJ56n96m4K33N0M87l35Q6
1279A42o3J56j87j01p9L07k47N1K14k19m8P1N9k36J80L11k59K07k93J53k01j44
1301b26J02L7K55m5M0j09K74k18k73k34K79O6J82K5j29k06k86O66j08k21L15j3
1323A73J97j99j42J29k08j68K6K05L03j13j96J5l97K03P0m0K86l8O0Q0k45j19
1345a18J15Q1l32L08K03k08k72L34j22P2j88J91o3N1p9P1k85J66k5j53K63l5J1
1368a4M96n86L5k58M7J98J78J1j02Q7L3l09K47k29m0J80L18k12r1r5o3L70l48
1391a47K21O4m4Pk1n3n4P2j58N6K0K14j22J79m03N8N8K9k49K88N7l8mK08k44L6
1417C0P3r4J67r4P1k00K11k46K34m38J72K06j35L01j77j06k5J51OMj79JK26k0
$$ y = [-299, -125, -196, -68, 160, 126, 164, 185, 187, 45, 183, -77, -23, -109, 388, 111, 105, 261, -335, -379, -146, -96, 391, 56, 142, 79, 235, 48, -53, -132, 175, -72, -21, 193, -26, -74, -3, 56, -180, 0, 311, 52, 259, -34, 119, -82, -226, -124, -87, 168, 123, 163, 54, 328, 110, -163, -397, -118, -52, 130, 155, 26, -180, -466, 200, 92, -129, 186, 173, 370, 171, 29, 158, -50, -218, -192, 13, 316, 203, 7, 22, -375, -172, -102, -142, 144, 106, 166, 246, 1, -118, -3, 78, -254, 54, 257, 49, -223, 111, -11, 61, -127, 64, 1, 52, -27, 44, -241, -75, -100, -253, 10, -25, -14, 482, -104, -69, -327, -280, -82, 96, 107, 5, 92, 125, -184, 63, -166, -206, -26, 292, 80, -11, -106, -169, 201, -147, 74, 138, 94, 101, 80, 27, -27, 45, -113, -57, -37, 177, 55, 234, -169, -111, -53, -24, -273, 15, 72, 34, 30, 238, -6, 30, 103, 9, 176, 82, 153, -47, 164, -82, 152, -286, -114, 92, -43, 258, 81, -25, -50, 101, 107, 111, -68, -67, 159, 139]
1441A39q0k8N6n7k01L79j54rr9o5K96k76J39k8n0J9J91j86m8o2J07n7j8L13P9
1466C00m11L76l76l16L51K4j2j22L64R0k00j21J68p1k31K05j4J20j8j45J46l52
1488b45J15O6O9k19L06J68l10M6q2K3q0L02J79k05o4k73L57k59J56j05J98j12
1510C1j75L17k65P7j44L17m79N09k02j93K72p9j62J96m54L71K29j30Q6k3K5L3
1532A57j94r3j25J29J39r4J23n2r8k16L80k53K63N4j87j2M0k06J33L3J67j82J15
1555B1K42l27K16j99J10j75J69m8Pj23Q9J43N3j73p1R3J5J21j70j31J00K51l00
1578h7O9n9J9m2J19k30R6m2R9J47m55K4M29j17J17J14j97j92J16O7j47L2K16r2
1602Dr7L30r8j61o6M7J40PN4l47j75N18j43J64j58k11K40j42J7J73j75J39k30
$$ y = [139, 59, 31, 87, 30, -171, 208, 54, 45, -54, -119, 177, -99, 40, 12, -38, -19, 172, -14, -62, -124, -17, -74, -92, 221, 300, -111, 265, -111, -427, -76, -52, -64, -186, 178, 268, 68, -53, 115, 44, -187, 18, 4, 124, 106, -39, 107, -245, -130, -64, 5, -214, 92, 260, -50, -4, -86, -63, -143, 159, 338, 133, 69, -204, 153, -106, 50, -55, 143, 31, -144, 173, -92, -15, -159, 158, -321, 188, -14, -207, 65, -14, -176, 20, -434, -63, 166, 36, 122, 99, 124, 157, -37, -130, -255, -126, 13, -81, 42, -10, -108, -324, 56, -197, 66, 120, -67, -79, -39, -245, -112, -79, 88, -94, 21, 263, -64, 152, -47, 63, -112, 57, 9, 16, -107, -18, 125, 178, 5, -66, 27, 42, 163, -7, -138, -38, 213, -87, -18, -77, -58, -100, 19, -211, -115, -157, -58, 89, -366, -342, 87, -30, 87, 201, 4, -188, -72, -5, -152, -120, 96, 4, -93, 237, 139, -22, -88, -41, 99, 106, 160, -187, -362, 156, 13, 177, 19, -192, 48, -94, -77, 96, -79, 60, -170]
1625a70P5J72j39K03j26K7l13K15J33K01k69m9j4k8L27m52L34k06q6L23q4j68
1647i4J93k36l7m3K66N6j88J76J9k14K09j33M0K0M4O1k36J94j55K60j25j40K33
1670A70k31j71J67M05p5j94P8k32J27L8l28J9M9M36l45J96nj79K89l47J48n3j47
1693a85K21j04J10K12k17j23j71J56Q0l9R7k15k24M89m9j0q8Q3j46p5J79o2J16
1716C5j41N7J38j68J21j38l6J56L8p1j70M0J36K3p2k7J32o4k90M36Jk28K35k41
1740i8J61q1J57p1p9r7j50L54j28J69j16J27l5l28K55j89J33m3l9r6K47j42M2
1763d7M6j95J20P7j91P8J03L2m4K15k02j29J57k10K21j09J90l53M37k44j04J51
1785aJ06j93K2o8j7J13Ml3J89j59K00p9k07N9j8M6j90M35j13k09L24K4l83O5P7
$$ y = [-170, -95, 77, -62, 141, 15, 42, -271, -56, 77, 278, 9, -40, -54, -82, 245, -207, 127, -79, -165, 158, 74, -94, 99, -137, -174, -217, 49, 105, -83, 93, 112, -102, 107, -26, 14, 34, 78, 139, -97, 97, -58, 202, 77, -63, 170, -61, -232, -65, 340, 265, 71, 149, -83, 44, 82, -246, -227, -178, 258, -87, 109, 104, -75, 214, -133, 15, -38, -185, 36, -68, 42, 254, 37, -86, -257, -101, -21, -60, 37, -178, -402, 87, 38, 28, -60, 23, -123, -198, -19, -81, 35, -106, -49, 89, -79, 42, -96, -132, 24, 62, -9, -179, -139, -3, 20, -52, -79, 53, -11, -301, 135, 136, -92, 143, -98, 63, -18, 139, 68, -11, -108, -258, 96, -32, 137, 21, 148, 113, -215, 40, -149, -16, -59, -98, -194, 53, -89, -47, -1, -196, -76, 1, -190, -112, -9, 23, -21, 194, -8, -137, 20, -190, 31, -78, 112, -241, 196, -48, -152, -1, 105, -88, -66, -134, -151, -38, -34, -67, 122, -37, 163, 84, -123, -64, -82, -36, -226, 209, 96, -113, 211, 235, -148, -83, -6]
1810fj83j27L48M8N4p7J47k65j92K61k71J06L6L03k55r8N2K30l19P9pjJ06K5j49
1835a55J42j29J56j11l3J66Pm2j31K91m66L23k64L72k48J32J64l00M8J01j15R1
1857aj23L12r0j11K07m17J78J94k61L0r2K20q2J26n2k91M71j06o7j85N8L0L0r
1881c1j4K2qlK59m75K64J28j06n4J36k8k85K59l7m8P4K06k29j14K2p2J74l3J91
1906A98k02QMm7k16P6K45k3K84k88k4L3L4k99J23r6K8L13l20j09J94K44j4o4k2
1931F0k2O6p9j67K5k4J8K49j83k0J5M0O3j65J70j44K25m8J93l47P0j77L08Jl03
1956a76K74k18O9j78L17j97n0J00J08j05J26R7l09J91K4k0j42o6M6n1L24J73j26
1979B11j15j56l6K76n4L4j34Q6l6j68J00Q7k08L7kO5J30q8j08j55L88k92J69J4
$$ y = [-6, -189, -316, 32, 80, 134, 57, 204, -61, -253, 8, -263, -157, -121, 182, -73, -171, -119, 111, -208, -129, -136, -137, -31, -6, -155, -13, -142, 14, -97, -130, 36, 43, 1, -130, 161, -305, 18, -246, 126, -122, 10, 174, -126, -78, 23, -92, -1, -124, 188, 98, -13, 194, -223, -45, 149, -112, -82, -174, 46, -36, 90, 38, -253, 218, 112, 45, -140, -82, -52, -22, -31, -45, -23, -31, -34, 225, -250, 14, 142, 36, -18, 118, 90, -195, 64, 27, -21, 53, 259, 30, -84, -62, -134, 40, 7, 198, -4, 4, 8, -39, -255, -179, 66, 43, 327, 39, 15, 48, 82, -217, -94, -190, -162, 151, -169, -278, -84, 160, 146, 82, 60, 38, 104, 25, -142, -117, -141, -123, 126, -57, -77, -62, -22, 41, -124, 46, -98, 127, 79, 272, -75, -5, -182, 126, 127, -176, 98, -120, -51, -229, 88, -109, -159, -59, 49, -56, 70, 167, -142, 49, 73, 53, -89, -155, -109, -160, 164, 337, 211, 96, -60, -96, 180, 126, 160, 26, 112, 76, -92, 8, 95, -113, -76, -78, -13, 117, 29, -79, -234, 154, -138, 31, 45]
2003D5j83J98Q3p2j26J82q9J01j77MM5J04j67l37K33J12k9p1J43J14k10j51J72
2026g6j18K19o0K61j02O2m81L39J36l14K91k45J53J61k16NJ9j20j03K96L3j16
2048B4j23j01K57r1K55j14k00O2L2K9L4K1N7j47l2J3L11o00M27n8j13n0l1Q4L64
2073C10k10k17J9J42N5r0k18K01P1O0l55J28J76J64m22J29J71j45QL1o7j92L17
2096F6K52n04O5P7m3J54k97K94p7oj56J53O8J2p1k1l28K93J1L5M4J16j4J6k18
2121g9pj3L26l93K56o7j08L7R4k8j43M6J36k77M70l12J94j77J99k8r0l1n1K19
2145A73l10J55k31J32J8R9N2j62N0J07j52N0P3j10J29k55Q1K9j68N20j51j02Q1
2168A08J30o7Q6m43K08R8k67J45K3r2O0loJ05l5j17m4K04j22k85K85N0L44l81
$$ y = [45, -138, 60, 143, 71, -55, 127, 38, 139, -38, -34, 11, 115, -52, -389, -156, -44, -73, -144, -1, 113, -97, -248, -76, -194, 25, -35, 226, 124, 186, -295, 44, 180, -134, 157, -88, 65, 226, 10, 15, 34, -86, -189, 107, 140, 24, -99, -200, 57, -34, 221, 107, -93, -31, 1, 30, 64, 85, 142, -5, -37, -24, 287, -313, 114, 56, -57, -107, -138, -54, 310, 100, -117, -98, 44, 99, 9, -209, -8, 63, 123, -232, -104, 72, 236, -186, -57, 114, -31, -23, 8, -59, -251, 66, 318, -186, -121, -44, -87, 67, -230, 64, -13, -19, -175, -22, 46, 58, -13, -34, -362, -69, -58, -23, 21, 137, 123, 139, -79, -86, -99, 227, -166, 90, 23, -85, -48, 46, 18, -125, -79, 57, -220, 250, -62, 132, -45, 154, 126, 36, 5, -46, 173, -137, 18, -213, -81, -63, 36, 88, -74, -24, 83, -69, -19, 54, -56, 73, -182, -101, -72, -240, 280, 129, 27, 108, 238, 171, 257, -186, 22, 120, -147, -2, 21, -71, -11, -14, -20, 85, 50, -67, -111, 93, -29, -314, -29, 21, 365, -16]
2192a6J43j54K59n08K81j5j23K33k5J97k23l4j8l50K00K9P7K27qr0k36J66j49
2215a37L07j17o3O9J7m67L71j5N8J49j95K38j07o6j7k33K61k12P4J50o8K42k58
2238a9K5j76K56o7K6n1K7NJ47j88j61K60kk43M9K80l01N17l27l63R9QJ49n2J6
2263h6K33j77R2j98M26l43k6P5n5k6J64j80N0K12j25r7K15O1k36J8j1j63j5K89
2287I7m2o0j61N10m21J34k07K68o0p0k59K13j66J23L04j5k83K2k69M37M4k05m6
2310a12j38K50Q9k19J57j7L3j11J46n7r5k52L73J51k22P2L9j27j59K63k04P5j43
2333b08L24m0Q1l6k20K12Q3k96M7J36j32K2j6J12o8k55L40m1n2Q1o9J61k87L36
2357B15n20J41J73q9L2J75k96K47j83j32NL77j36K16j64j13J2K04k16J8mQ8p4
$$ y = [-16, 127, -27, 232, -276, 5, -10, -133, 100, 75, 272, 49, 15, -3, -353, -153, -124, -47, 180, 172, 82, -154, 12, -137, 170, 53, -10, 59, 76, -391, -20, -35, 23, 172, -23, 215, 108, 42, 25, -208, 53, -159, -85, 65, -3, 239, -19, 6, -170, 86, 19, 45, -6, 21, 26, 173, -15, -176, 84, 82, -161, -112, 168, -133, 384, 57, -306, -207, -199, -50, -102, -86, 147, -30, 62, -136, 290, -53, -79, -4, -59, -85, 79, -101, -51, 161, 36, -61, 154, 215, -21, -3, -14, -177, -192, 97, 55, -5, -166, 344, -77, 57, -150, 118, 58, -12, -271, -58, -224, -101, 203, 188, -95, -73, -342, 95, 139, -66, -112, -250, 0, 89, -130, 27, 10, 43, -68, 78, 21, -74, -326, 47, 198, -24, 48, 87, -40, -199, 64, -140, -65, -208, 116, 76, 157, 121, -99, 113, 196, -100, -53, 83, -49, -27, -43, 69, 1, -254, 86, 45, -7, 74, 5, 166, -121, 215, -305, -164, 9, -80, -48, 127, -169, 78, -105, -237, -232, 145, 9, 225, 61, -52, -40, 164, -52, -34, -38, 50, -24]
2380b4N36n06l8r0K31j77P3r6jo0L14j48J43l09J49k4k1N8N3j67P4J60j62J37
2404A05n6L6k96J56M0J53jj03j58K19k9j08k03L80j31k54L00n6p5K40k05J45k58
2427a59PJ77k93J60J51Pp2O3J78l11Q8J5Q3k40J32J35j19j69j02n2M34J5l34R5
2451a11M14m46K41k47M9PL91l48l4J52M2j34K15j11n0M7j28J58j80J24k15J77
2473A3k73L77lj41l4l1n8J31K99r7n2m06L26Oo4jQ0k0J4j07j32pJ23P9K8J1j04
2500d3j09K88j78j48j7M02k75o1L72j10j08P5n7k02R4O8J67p4n9j78L51k23P7
2523E2K7j06J30n6l71O24l55J42l0n1k23K42O0k37K71N9J05l46m0J32O8k63M86
2546C20m74j7J49K1J98j21o0j06N7N3k20M05j3l80K47J4p0m9p6P9r1j34M05j23
$$ y = [-24, 512, 6, -32, -122, 109, -68, 5, -91, -92, -152, 162, 14, 157, -152, -3, -27, -48, 10, 63, -104, -30, 130, -32, 105, 49, 85, -211, -55, -15, 138, 137, 34, -124, 95, 66, -42, -245, 135, 4, -250, 50, -6, -81, 159, -46, 99, -159, -152, 25, -268, -108, 43, 50, -22, 41, 219, -92, -4, 11, 94, -146, -14, 121, 2, -167, -269, -321, 113, 128, -206, -111, 303, -143, 98, -149, -100, -93, 298, -50, -84, 68, 110, -24, 191, 80, 30, 77, -51, 107, -73, 51, -164, 13, -260, 117, 114, -27, -61, -92, -150, -19, 280, 183, 131, -275, 51, 57, -7, -8, 72, 52, 66, -41, -173, -180, -57, 22, 50, 61, -43, -152, 136, -42, -190, -207, 195, -80, -141, 231, 121, 13, 88, 31, -171, -77, -9, 158, 84, 25, -153, 198, -25, 52, 79, -27, 103, 47, -324, 300, -55, 87, 57, 6, -217, 25, 85, -152, 119, 178, 283, -63, -103, 29, 97, -166, 320, -154, -171, -22, -1, 197, 76, 16, -90, -33, 20, -200, 205, 192, -188, 59, 73, 3, -46, -122, -43, -134, -268, 137, 14]
2570A4J37j19q8J2O9k68J01k3n5M21k01rK02j94J28J68k98R8N2N3n9k00M5j99
2594b13L88j15K5o8j87M18j47k60J41q5J87k46J58J7L16k82j95Q5J93n1j50J83
2616A12J74k23n1j17J64o3L4Q0j84J24l4j57J53Q2J96k2l86J84k37M12j25l4l18
2639b36K51Pn6n6K33r3k7J27j72K03J4m06L07j47r6K14J19j45j22K48j86n0Q1
2662A2j11j40L37K9J0j80J69j2K5l09J63J63k03J79j00R3k5j03M1m4j08K98m53
2685b69K74M7J34r8Q0k63R1k3q2K68k20P0j41K14k05j3J35l23L05J21l3J0j6P2
2709A35j57j82L23RJ40o5r9Q1j13j25J53qM8j8l36K78K8l38J02L63l9r1k9j87
2733a27q5K67O1o8K9j89J70o8J29l60M84n47J46K29k22K26MLj60p2K82k23J23
$$ y = [14, 151, 32, -56, -44, 25, -243, -142, -165, -220, 201, 0, -9, 193, -1, 127, 295, -3, 95, 147, 200, 141, -59, -14, -213, 175, 60, 85, 17, -170, 248, 101, -159, -18, -103, 84, -162, -4, 13, 329, 47, -148, -63, 130, 79, -71, 112, 286, 63, 12, -105, 59, -4, 30, 110, -74, 50, 16, -141, 12, 94, 290, 268, -118, 66, -171, 241, 116, 82, -236, 15, 22, -34, -90, 143, 50, 23, 150, -22, 181, 195, -211, 96, -51, -147, 67, 186, 41, -81, 167, -19, -69, 12, -99, -239, 98, 127, 137, -43, 126, 114, 139, -170, -7, 156, -47, 132, 32, 125, 100, -3, 38, -6, -114, 184, -269, 5, 52, 186, 88, 168, -95, -4, -27, -109, 159, -61, 9, -132, 82, -123, -136, -1, -324, -19, 102, 69, 79, 63, 135, -22, -204, 119, 128, 268, 203, 104, 185, 72, -53, 100, 92, 140, 122, -214, 64, 92, -246, -144, 219, 180, 89, 60, -127, -212, 55, 116, 48, 77, -112, 58, -10, 119, -241, 243, -304, -158, 71, -151, 75, 79, 82, -78, -150, 132, -91, 32]
2756C2j77j93N33m13n6M18j94j50J89r5J6J02l7j7Q8j85L47m34K75J44m59N07
2778B41m12J44L53m10O3q6J30j02k91K81M8j35K05j42L13k21j72l6R7K14k30K30
2800H2r4J59m07L11j28J67J56j74O7k49M7L%J58j68j20j34L12Q6m4k65K40M4M7
2824I6l7j87n5L22k08K36j79k41M14k94K61k37K64K0l3N6k36K9p3R5O0j55K19
2847A37r5n8Q3L5j45L6M21l20j13j60J90Q5j94Q7J1q6l9K32k13j52L62k5K4k94
2871a91K87%J01m26L46j59L59j95Q4O8n89J18P9J05J21j45P8j81l3L18o3n2j87
2894a57J27P0m2j57J90k09r2M18j19q5L24m49j13q6N56j61J47o0o3n1m2Nk29J17
2918a61O0J46J77k35r2J34j31M7O2J74j25j66R8j94J76qk06K12j9qL01l53J97
$$ y = [32, -145, -338, 195, -218, -274, 144, -50, -200, -11, -106, -90, 12, -25, -42, 46, -139, 208, -226, 49, 193, -266, 241, -171, -27, 326, -84, -21, -107, 23, -79, -370, -89, -41, -176, 29, -113, 200, -21, -193, -229, -132, 82, -148, 82, -12, 147, -260, 51, -77, 90, 246, 72, 139, -110, -63, -60, -60, 98, -70, -190, -324, -12, 74, 30, -235, 5, 49, 96, 59, -128, -183, 139, -69, 167, -12, -253, 161, -133, 128, -109, 155, 175, 142, 198, -38, -9, -82, 13, 73, -82, 137, 42, -16, 67, 102, -43, -7, 414, 94, -19, -179, 11, 96, -98, -11, 0, -86, -125, 107, -106, -258, 104, 79, 103, -191, 96, 96, 197, -229, 117, -42, 317, 122, 206, 274, -315, -197, -118, -13, 108, -37, 41, -140, -173, 145, 82, 30, -157, -30, 40, -2, -159, 31, -178, -270, 148, 29, -56, 268, -181, -294, -380, 176, 15, 162, 102, 39, -12, -54, -49, -278, -161, -101, 45, 222, -13, -105, 29, -102, -55, 7, 181, 56, -110, -12, -206, -30, -38, -244, -32, -51, -59, 242, -111, 86]
2941H6nk21oN18l13j13m5m8K79j11J22l33J23lL09l00P9j75j16J69K91j82J1p0
2965e4J97k73K24j24J27k46K07k06J99k84L76k50J59m8j28K07j21j91J79P6j34
2986a08R2j27K99j28o4q1OR5k43L12n7l07K22L93m45O2J25J29o0j81J60m11J52
3009a65K03k15k3L32l8P0m9j7k81K0L76o3k00l7j59J65L5Q5M2R6k42K36j42o7
3033c8O5N7q1r9J11K08l3j46pj90L7r4K59j16K57n9j32J51m71K95j08J21r6M9
3057f0J36J24j26l44K32j71L51m36L47j7j61J38J1R8j09j19K2K11j65q3P7m5J46
3080E7m5m1M89n53M1r7K45r3Jj0N5k05K63j76J36j52J26j49j15K24J09q3j18J9
3104g2m0J22j24J75p0J08j32N8n6%P0J9L3M1l03J83q0J81J14j73j0J6j44J70p8
$$ y = [86, 81, -140, -146, 372, 59, -54, -99, -147, 132, 21, 143, -190, -67, -70, 239, -61, 18, -157, -273, -104, 187, 5, 16, -54, 143, -130, 94, -30, 97, -149, 58, -148, 51, -233, 143, -107, 52, 4, -124, 83, -38, -229, -50, 26, -108, -16, -143, 156, 28, -36, -117, -111, -16, -259, 53, -4, -311, -89, 304, -141, -79, 46, 175, 115, -66, 94, -317, -165, 38, -177, -200, 132, 94, 164, 115, 98, -183, -163, 213, 150, -50, -87, -246, -81, -46, 39, 81, 177, -65, 171, 29, -38, 27, 84, 3, -96, 15, 223, 190, 44, 37, -153, -116, -210, 49, -67, 190, 131, -1, 150, -321, -26, -134, -13, -109, -60, 76, 200, 74, -270, -38, -209, 142, -294, 53, 36, -125, 13, 24, 122, 13, -106, -84, 127, -38, -121, -44, -89, 57, 12, -29, 460, -93, -52, -149, 96, 3, 4, -6, 49, -156, 107, -69, 67, -85, 41, -108, -223, 1, 110, 27, -91, -72, -112, 10, -114, 61, -9, 99, -33, 25, -31, -31, 39, 58, 91, 132, -171, 12, -68, 113, 227, 54, 44, 60, -84, 86, 8]
3129Hn3K1k68K20J24k84J35L62k63j94M99l49J17l00K18J24J41l44L3P6j11j34
3151b22L01L4j52Qp7OK00j96J23Q4l47K34P4J9l16K01kr1j21L50J64j73j33O9
3175C7M8l2L7k53L8K04k24L40j90k7K70l61K61j50j9M2k39O9MK26J38k41r4J48
3199C2o0j9q0J05j70J0kM18k61m9j03j11J34J2j0kK9J31K9n9j24L03j12o7j03
3224a29o8J89j50K65k12L25m18J95J15K0k21J55J06k91J1K16n8%k25K45o0J7K0
3247D7Q8o0l41L36j37q3n7J58J97O0l12J81pO1k13j20J63K8M7r4J5J65k27n7Q0
3272h2Q4M8j66J05m5J02jQo2J2J5K38k70J48k66q6M18j95j03J86j23Q1k27K37
3296E6pj19O9J92j55K1l07J89L2k35L27p0L06m78K56j56J15lJ79k99J3K40j73
$$ y = [8, -45, -24, -292, -72, 52, -232, -97, 265, 2, -192, 307, -42, 75, -225, -7, 117, 258, -86, -53, 23, -88, -222, 79, 113, -39, -31, -108, -102, 98, -98, 25, 109, -238, -4, 70, 89, -227, -26, -28, -119, -240, 110, 274, 101, -32, 37, 85, 53, 90, -163, -125, 79, -145, 195, 5, -22, 248, -113, 148, -2, -21, 21, -218, -149, -145, 81, 219, -22, -116, 32, -28, -47, -127, -22, -192, -182, -184, 234, -27, -76, -179, -290, -156, -144, -154, -156, -127, 4, 33, -26, -150, 153, 41, -26, -129, -197, -8, -158, 107, -105, 220, -198, -3, 112, 132, -89, 66, 172, -119, -108, 108, 50, 50, -175, 70, 10, 27, 47, 135, 75, -266, 70, -67, -150, -207, -49, 148, 208, -104, 77, 70, 131, -82, -202, -39, -11, 36, -58, -43, 122, -105, -162, -82, 2, 50, -116, -11, -56, 46, 45, 53, -9, 3, 18, 256, -14, 134, -132, -218, 200, 5, -98, 88, -35, 46, -181, 56, 49, -70, -1, 191, 36, 57, -250, -61, -29, -264, 63, -7, 299, -179, 77, -79, 36, 33, 212, -87, -74, 166, -7]
3319gJ19j90J46J1m1M7k04N2Q4J37k69J22J97j85NP8l08K59J75k27j22L4OJ75
3343I4j1o1Q8j03K6k59N27k85k15K03m2L06k04p6J88k03K8j35JK16J7M0k00J36
3367G6j98M4J33p7J89j98J26k4j45J84k52Q0j26J69lo7j65K40o1J31k41J14k0
3390i1O5l3J37J8m3j33m7L27j56r6J89m03L74j05j06k8J74K05r9j35mJ15k81o2
3414b18J61j54K64K22k67p5O9M08l60q5K26j99J63l00P2O6J43k42J54J02k70J59
3436C9Q3J10k3j37j63k09K58N2L6M5k23N2J3j72N12k64j54J21O2K34k12k69M6
3459a63K66l3k52K58j84J25L3q0L57m81J14J41J73j03l29K30rq3R7j94K2L52q4
3482A73o9J7k24J56l69L39k7j24J01Rj7nJ5J83K17m76K22k05k97L78K10j53j49
$$ y = [-7, 112, -78, 68, 79, 38, 85, -119, -67, 17, 154, -115, 7, 204, 19, 24, 102, -206, 53, 228, 1, -121, -87, -81, 94, 83, 22, 110, 7, 33, -226, 301, 16, -199, 4, -38, 268, 64, -12, 176, -27, 1, -134, -133, 83, 100, 140, -60, 76, -122, -78, 55, -22, 167, -31, 95, 71, -74, 110, -142, -62, -188, -19, -22, -89, -254, -14, -75, 56, -185, -71, -91, -26, -59, 78, 96, 53, -80, -127, 200, 44, -52, 137, -266, 108, 3, -103, -131, 43, 248, 149, 14, 10, 125, -156, -218, -57, -211, 53, 275, 8, -67, 2, 410, 50, -35, 191, -8, 155, -145, -73, -7, 136, -106, 48, 150, -120, 39, 122, 232, 209, 72, -91, -300, -42, 10, 46, 91, -132, -80, -67, -239, 273, 9, -145, -24, 38, 272, 60, -209, -163, 103, 70, -182, 76, -108, 17, 50, -30, 327, -154, -40, 101, 274, 171, -158, 72, 63, -20, 77, -117, -95, 257, 173, 104, 121, -103, 53, -316, 23, -4, -128, -27, -18, -35, -40, -25, 158, 375, -101, 121, -84, -381, -3, 207, 54, -95]
3505i5Q7J32J00l59J62n2k3L15m51M54j64j93k90K53J59K8k84L64k61l1J88k00
3527a61J71K7Q0R9p1l90L36L0k42J82k09K70k08p1L42j55m13R7L6%K79k16J94
3550Gq7o4J88%j26K03j98R2j79J15L1k00J47N3R0J93m05Q2l9Q7J5j19J70p6N3
3575C3p6Q4Oq1rR4K45j53Q6k28K82l13m7J68j80L7o9M2P7J2M4j14P9J42nj51J74
3602A79k92K04l5J86l66o3J76K31k57j47J93J21k61L18l8j57l9j9L9J19j78K75
3624A89m4k50J44k47K86k14L82n42N66k93J11k00r5L53l52l3R7P0J6n0J62k09
3646a53L77j80J02j53k6J21j6j76J44m3M1J73k93Q3PK7j00Q2J37k56J49o9M7j39
3670a14K9K62n0l36P3j23K31J91k6k90j0J70K9Pj2p8r0K85j95J07j99L96l00r1
$$ y = [-95, -8, 124, 224, -135, 27, -25, -48, 267, -184, 270, 106, -87, -377, -124, 35, 63, -221, 143, -118, -149, 39, -161, 10, 37, 117, 216, 145, -245, 91, 121, -121, 61, -148, 122, -86, -157, 185, 30, -383, -286, -250, -250, 29, -187, 7, -80, -144, 44, 44, -82, 121, -77, 15, -164, -49, -18, -218, -71, -18, 72, 265, -140, -58, -97, -10, 5, -114, 56, -20, 33, -43, 41, 47, -34, -43, 51, 296, 143, 229, 1, 283, -30, -77, 91, -89, -52, -121, -79, -2, 10, 54, -60, 19, 161, 156, 5, 179, -113, 91, 56, 242, -124, -187, -11, 220, -37, -184, 9, 130, -131, 187, 149, -8, -47, -66, -27, 92, -86, 189, 145, -105, 39, -208, 78, -136, 246, -296, 270, -23, 88, -112, -207, 146, -206, -239, -142, -72, -56, -106, 56, -153, 224, 44, 146, -7, -33, 88, 72, -104, 40, -3, 38, 211, -82, 1, 8, 35, -65, 17, 154, -102, 47, -22, 25, -114, -85, 177, 127, -209, -136, -259, -28, 163, 137, -153, -163, 7, 36, 43, 31, -47, -137, 148, -47, 60, -139, 257, -43, -134]
3694a34M07l05l01L00m4O2PK00j93m3K71j7l02K07j02J41p2n8j30K94J09k73O0
3717H4k46j02J30N7o5R9q1M6J94k81j39P04l97J17J8l2p9j13M3J70n30K75J22
3740fM6J4n2j24K21mk8j48L26j31j20j7P3o8K83m59J72m2J77j1L1j60k25j16L26
3765d2l2K00O1l54K92k82QJ13K9J04k37p9J96K8N1oj39j29J2J72K40k51L51k14
3789I2j20%m2J54j33j17J64J9k59M00J97n32J79oq7qN27k06k73K53k27M2q7J58
3813H8O4j50o6q9Q9j86M05j96n6J50j16j45J62K41N5k64n1J96l09J48O1L0k1j52
3837a12J94j41J91k76K69j07J05J6j09r4n0J70J06o5p0k22N1J88n2K32k97N8J04
3860H9j78j16L66k41p9K3J78K5m8j31q3m6K54j79L87p0l26R4k9J67j97j5k9N07
$$ y = [-134, 273, -32, -333, -33, -77, -15, -8, 192, -1, -44, 227, 210, -92, 115, 13, 154, 82, 24, -106, 188, 297, 24, 84, -162, -264, -134, -77, -142, -43, -124, -78, 116, -165, -304, 400, 3, 120, 138, 106, 27, -86, -43, 127, -403, -128, -6, 40, 54, 2, -122, 99, 95, 67, -81, 245, 114, -6, -23, 50, -18, 265, -194, -22, -64, 113, 102, 133, -27, -252, -368, -42, -74, 126, 187, -167, 125, -157, -149, -36, -7, 97, -140, -219, -23, 5, 56, 50, -89, -218, -206, -34, 206, -45, 306, 92, -28, -28, -70, 84, -49, -166, -2, 17, -242, 158, 355, -177, 2, -4, -91, -99, 428, 222, -51, 202, -25, 17, -70, 88, 152, 2, -64, -153, -64, -250, 155, -41, -97, 53, -63, -208, -46, 195, 250, -14, -65, 131, -178, -30, 31, 61, 40, -112, 82, -59, 132, -144, 125, 18, 123, 139, 30, -64, -114, 56, 162, 97, 27, -195, -144, 44, -8, 224, -73, -15, 89, -89, -205, 161, -80, -159, -136, 42, 67, 19, -112, -195, -241, 13, -166, 221, 151, -175, -81, -110, 57, -140, -155, -184, 323]
3884C23r6l76R1o3RJ40k07j34K36J53p6K90j39K2k31j38M96j77Q8rk06J91k2l66
3908b01L62j04l1j40L63l58k28J84J83p5j9o3M3K34k99K21m7j13K47m12K31m3
3930f5K0k74K68K35n71L84J56M7l82M9K95j43m7q3N5N3L4Mp8j57K08j33J72j72
3954a25J47J23k11J04k5K09l19R9K63j35j56L8J44j26N7j52M2R9N3P3j59L9j6
3977F6j03P1p8J99k80L2j11k8K64j64o4J9L17j76r7J69j99J37K3p3J60l12MJ99
4001b5j25J68J20Q4j02n8m6R4N7j74j5J21k71L07j19l7J18q5l46N21k20J72j41
4024bL08m26K17j2j52M08m26K06R5k9k53oK09J73j97j65r7M6J13j37L47J0r4k06
4048g0j43J14j3mq1K30M3k48J89K13k80m9J96k8k0n2R3j98K22J53J12n65M00l2
$$ y = [323, 227, -149, -58, -121, -112, 28, -179, -313, -77, 76, 0, 290, 151, 173, -58, -196, 300, 123, 211, 202, -4, 187, 165, -201, 161, 57, 26, -114, 249, -109, -337, -153, 30, -45, -64, -127, -84, 150, -149, 72, 25, -88, 159, -253, -22, -65, -45, -319, -51, 184, -387, -3, 153, 200, -182, -133, 162, 19, -28, -111, -56, -3, 31, 35, -43, -200, 8, -125, 47, -125, 22, 145, -66, 38, 13, 222, -97, 2, 265, 130, -26, 12, 156, 30, 87, -65, -23, 76, 129, 202, 43, 82, 66, -37, 34, -44, 155, -125, -93, -204, -232, 32, -132, -196, -177, 140, -36, -133, 36, -163, -26, -3, -76, 84, -228, -224, -25, -150, 18, 138, 222, 120, 62, 16, 110, 167, -7, -22, 99, -172, 135, 16, -21, 97, 12, -334, 187, -33, 139, -2, 306, -120, 97, 85, -67, 341, -85, 121, 216, 187, -66, -72, 137, 310, 113, -52, -149, -103, 10, -127, 220, 230, 136, -70, -213, -99, -112, -116, -197, 33, 76, -172, 17, 230, -50, -99, 97, 69, 49, -3, 90, -108, 114, 267, 379, -186, 214, 182]
4072A82j59n0O1r3k26K59N8k19J88L4O4j94J50j28Q8l2R6k15K18n3k40J08K61
4095A58k08%J62J11j93K60M7m93K10l62M52k10k28K38j62J38l0j6K9lm9J41k27
4118b35J75J43R4k63M6J27k24P2K5J55k56Q9m5K40P2j01l8Q3k02J27l00J3j53
4141c56J03J15N4K05n1R7J7M1k18j3J79j23J02j50j6lj32K27j73rL7l1L68j06
4165A64m14L95l82L42LK35m34K5M2J41Qr0lj4l1j57J57j05O6JJ08n03P02j69k2
4190F5P3l34N7K19r4r3J8M9J99n9j51L62m69J78K63k37M5p2ql6J47K7k93J57j58
4215a45K18O0l13QR3L80n84M67j07m0q3QJ47l9j3K13k31o6j35J71k49K56K23n20
4239b81K47R5qj75m4L85r6k49o1J78q5j8K42q5J8j78N9J56j78j41K22p5O9K3O1
$$ y = [182, 23, -27, 34, -59, -285, -26, 32, -187, 1, 35, 99, -95, 55, -73, 15, -17, 79, -136, 82, 29, -211, -103, 158, -50, -50, 112, 223, 30, 290, 337, -156, 54, -308, 144, -66, -294, -56, -218, -80, -110, -126, -97, -100, -149, -8, -235, -60, 83, 177, -86, -40, 87, -137, -65, -40, 115, -141, -52, -97, 143, 215, 114, 76, 159, -43, 84, -216, -203, -356, -253, -138, -84, 121, 70, 167, 184, 225, 7, -6, 173, 50, 152, 2, -14, -17, -149, 78, -95, -104, -67, -98, 270, 164, -250, 145, -237, 105, 108, 343, -91, -66, -24, 117, 125, 35, 32, 18, -13, -170, -13, -118, -52, -51, 57, -446, 256, 87, 65, 138, -196, -139, 80, -14, -107, -89, -40, 159, 100, -51, 311, -158, 20, 283, 46, 91, 19, 11, -25, 122, 149, -144, 13, -145, 73, 133, -180, -172, -79, 301, -283, 184, 77, 37, -46, -38, 109, 70, 57, 270, 39, -27, -162, 9, -240, 16, 239, -281, -34, 61, 53, -122, -166, 219, 123, -126, -187, -9, -94, -112, 130, 45, 63, -115, -56, 100, -78, -219, 3, -72, -3, 20, 81]
4264H1p6k33J10K28j22k28J68J63j40N8r7J09Pr6Q5j53J41R7j48J81O1l38K11
4287F9k47J63q3k7K22n0j32jl4l1J57R5j3j53J27p3r7lR2K84P0n57L19J14j33
4312G8pLJ57j46J65j42n0rk26Q2n2j26J22R9K0P4o8O5k73m4J96M9r5j2J04J22
4338H6k98J86j43K38rj66L0J2q9P4J59N2l9n5N8r8j1J20j3r8j08j42l3K17R0o9
4364d9m1J28l47J75J22J57j81R5k88L05j77J80j26J4k33L47q3K04k12j76J55O1
4386C0J03k32L20k05j74J24oMJ56j26m27N84r0O0L05l77L39m72P7k48J85J20k6
4409B4l65N21q0jj18J33Q4l05j36L29r6O4L6J1r6l29M14j68k7R8M6j90K28J85
4433B62n0k37L28m20p8K41k34K25L1m72L61K05k89j6K36j2j3j08q2o0K02o0PJ99
$$ y = [81, 5, -228, -118, 110, -12, -240, -72, 91, -49, 9, -88, 21, 28, -68, 17, -136, 5, 102, -46, 135, 196, -142, 69, -178, -15, -98, -125, 97, 47, -85, -86, -120, -151, 6, 101, 88, -65, 62, -11, -108, -111, -19, 265, 335, -222, 97, 211, 78, 71, 74, 231, 85, 250, 108, 58, 49, -177, -95, -147, -273, -151, -52, -32, 42, -26, 39, -234, -278, -82, -33, -128, -140, -36, 86, -212, -26, -169, 69, 60, -106, -76, -64, -153, -79, 80, 132, 93, 38, 96, -2, -13, 107, 94, -4, -112, -254, -287, -70, 20, -49, -90, 38, -309, -134, -12, 145, -36, 59, -229, 76, -101, 79, -47, -33, -266, 81, -2, 202, -10, -186, -31, 30, 133, -99, 221, 16, -158, -34, -40, -36, 120, -6, -433, 151, 61, 121, 426, 49, 388, -84, -7, -255, -70, 50, 24, -341, 180, 100, 99, -19, 114, 198, -107, -243, 86, -10, 54, 90, 101, 5, -324, 90, -78, -105, -7, 39, -151, 77, 262, 212, -25, 303, -117, -195, 46, -188, 37, 68, -404, -43, 162, -127, -143, 93, 81, 68, -40, -122, -182, 20, -40, -33, 166]
4457A66l7N3k26m2k7O7K8O7j42M8J18k86M71l66K50k40J50j40J28j52Q7j5q5J63
4481C8lM7J01k66J58j43K03j15j12l4l6J58r8k3J32M7K20k29M0J60j69k14K00
4504F2N3l74K28l29M61k71P7J57Q8k0k04P4j38L39j19j29M3P1J89k75K21N0j56
4527I8l05K25Q3k26K49l00J84N2j2N2Q2q5o2R1p3K4k52K5J74j08R2r2k8J22p6
4552f6P5p7R0k6l7J55j32L10l75J46m1j77J95O4Q0k63L80l03J65r5j00l5m2K74
4576A65j51l00K11k17J59j49L43o0j87M64k39J15l18K17l10L24R2j13JJ87m52
4597b18Q0K06k79P1J68j18n4K62k79P0k30M29l06P4Q3Q2Mo1p3L4K2P7J78k73k80
4622c31L63K87m09K54j07P2N9k06K29j81l01K45o2m3R6j25J9l4J42Lj9j17P6K31
$$ y = [166, 129, 182, -44, -86, -113, -46, -18, 49, -93, -45, 73, -213, 258, -108, 142, -98, 52, -88, 40, -112, -25, -40, -125, 38, 35, 82, 183, -83, 75, -68, 135, 20, -92, -126, -162, -4, -102, -125, 7, 54, 274, 45, 85, 245, 76, -138, 62, 115, -259, -31, -360, 101, -170, -93, 64, 152, 132, -72, 2, -136, 203, 84, -45, -2, 69, 258, -17, 204, 254, 98, -207, 18, 101, -125, 124, -176, 8, 60, 48, 100, 182, 97, 35, 126, 53, 77, -175, -150, 24, -84, 8, -84, -112, 10, -66, 9, -68, 22, -4, -41, 114, -18, 292, -83, 63, 22, -155, 40, 104, 184, -79, 301, -2, 163, 68, -32, -67, -109, 165, 14, -286, -75, -292, -133, -282, 61, 1, -186, 278, 39, 154, -164, 53, -257, 67, 159, 46, 47, 234, -218, -138, 68, -211, -140, 28, -90, -144, 118, -161, -91, -321, 108, -198, -124, -41, 41, 45, -16, -89, -55, -33, 44, 222, -51, -331, 32, 319, -90, 164, 57, 129, 188, -18, 211, 30, -271, -26, -88, -131, -35, -160, -141, -175, -33, -30, -49, -166, -90, 141]
4646A41j36K59l00K0O6j08M6J51j29l9k40K21K82m12J54k51J68j54J51J58j5j75
4668a42kL05k37oO4n5O9L25j36j86K30k40Q9r9j46K23J54n0j81K0p1j48J22N18
4692D20j86j73k1M0o1J29l11J26J75p0j20J77k59J53k3K3L1k45M35k52o6j1O5
4715b4p1J89k40J60Pj26K39k43J41J56k29k2nM3k53L72k80M4L17P6k35o4k3K55
4739A84j86l29J53k7L34k39N5j55L02j38J78l24L16j54oj19K06l82J02K76K4q3
4761a2k2P5k2r8L57l97J03L64j34k22J08N0k36J34l3J44l1j57N6j52K01k01K07
4784H2j11m2J32k18K31k87lK57j26j1J89l07L00o5j44K83q8o5M2m5j31K98o1k8
4808H2j60o3J17j10K53J20j60mj04N6k74K98j57L2N1n9J2M3Q7k32o8K56j16K07
$$ y = [141, 5, 264, -36, -16, 50, -58, -12, 139, 10, -29, -269, -48, 234, -178, -24, -275, -107, -261, -110, 48, 33, -142, -144, 161, -76, -82, -18, -73, -4, 321, 185, -1, 229, -11, 78, -21, -167, 56, 210, 160, -21, -1, -72, -220, -98, 420, 234, 61, 40, 80, 19, 148, -163, -37, 138, 68, -52, 125, -134, 19, -4, 19, 50, -195, 240, -12, -78, -89, -24, -95, 94, -146, 14, 21, -105, 134, -109, 32, 188, -41, -63, -68, -25, -278, 94, -186, -142, 175, 251, 16, -48, -71, 184, -2, -331, -178, -205, 129, -110, -55, -210, 92, -46, 132, -192, 124, -30, -36, -155, 51, -331, -229, 47, 71, -12, -34, 41, 19, -79, 278, -119, -16, 348, 214, -8, 100, 150, -86, 48, 15, 159, 128, -29, 27, -125, 76, -125, 82, -29, -71, 61, -157, 74, -213, -216, 41, -85, -96, 93, -214, 86, 21, -123, 160, 72, 7, 49, 4, -127, 171, 110, 82, -78, -141, -24, -134, 119, 239, 79, 75, -29, 27, -247, 51, -106, -74, -23, -82, -70, -27, 60, -172, -240, 16, -100, 107]
4832A07L6j81m2p6k46L26J99k02J74j47j8r2K53L1j84M2o7L46j38k9P3l19k6J68
4856a2P2k73M76l01l0K81l91R2pR1j48L64j58k29M10j68R6l09L12N0r3l3Mj41
4880d5R8L1j13n5jJ62k26J26K0n3k7q2K44q4j08J30j65L90l2j80k7j34K12r3K44
4905B32p6o4j06J9J91j74p2k91K89j35N3J21j43J14J3J5R4l26K01oL7K45l18R1
4929Dk13K39l66K51J17j49J67k11J35j3J6k81Q1L4L45j82P3m63M56j33j02L63
4951A68j33k32J28k2O1J40K09m25J39L5j01J1j64M58j39K37l63J14j93k80M98
4972A46M2r4j54J26Q7j60J79K3o3j28K3q0O3J21m4Kp3oJ15P9k40K26k58J24m4
4997A2r6j25qL57k16n3o1J27J12j35O5l1j8j34K40N1o6J18k29K13j87k4OK88k33
$$ y = [107, 143, -38, -80, -156, -402, -76, 123, -79, 95, -52, -70, -162, 91, 122, -62, -20, -87, 259, 121, 92, 165, -154, -180, -12, 60, -213, 263, -38, -68, 213, -178, -86, -93, -2, -150, 214, 56, -173, 237, 69, 165, -144, 168, 218, 125, 92, 96, -45, 53, 84, -29, -84, -85, 77, -149, -23, -3, -56, -83, -165, 79, -5, -113, 17, -148, 242, 210, 30, 3, -131, 81, -12, 232, 156, 92, -14, 5, 196, 22, -50, -341, -52, -187, -134, -13, -156, -42, -29, -14, 80, -246, -45, -51, -14, 231, -87, 4, -209, 30, -336, -85, 32, -117, 50, -161, -26, -39, -23, -304, -223, -189, 156, -26, 47, -416, 40, -93, -195, 168, 35, -197, -69, -91, -30, 110, 319, -106, 33, 68, -33, -22, -186, 272, 133, 370, 7, 121, -72, -352, 146, 188, 94, -60, 66, 153, -7, 172, 195, 132, 4, 27, -53, 10, 131, 87, 89, 16, 10, 125, 204, -36, 190, -68, 56, 12, -84, -209, -217, 140, -76, -129, -190, -63, 49, -86, -21, -52, -70, -204, 36, 87, 21, 139, -90, 123, -64, -88, -82, 206, -27]
5022b7R8j20J96j15k02J19J96P2r8j67j15N8j75j0L74j15KJ05l2j01n1j09K74
5045E7k79J97J3J26K34l15P8l1J10j64J46j50K54j31L6jj05m7P5m7m4j7J44l47
5069b08K28M02m05J03ql7j33j8K61j03j00J50l51J91M2q8M2Kl7K6on6J49j42J93
5094I7J17j87M9N3k27J74J3k06J32J51l21RK86k11n6K63l60L82j81K43j23j30
5116c3J0JJ92p6k04o1l4J11ML8J02l6r3K01j5K8p2M0k98J87M7k02K02K84n66M17
5142A74j79q2Q6J84l4n3j14K60L2k06l70L29J2k23K19jL7j06l8o3Q9p6J11j83
5166a95L60k11n2P6p4L28j16k19N3L11k15n8l9j15J64J80k34J68Oj69%O6p3J16
5190E8J61k51J77J3j91R8o4L1K43p3j0O1j24j20j38K26j51L16j39j55N9l0M9q7
$$ y = [-27, 71, -49, 147, 32, -170, -51, 145, 217, 119, -48, -163, -105, -280, -290, 84, -31, -29, 76, 44, -57, -108, -217, 57, -222, -25, -12, 114, 348, 33, 111, 80, 190, 26, 172, 22, 276, 145, 181, 180, 75, 28, 103, 56, 12, -5, 139, -208, 20, 422, 17, 120, 112, 75, -58, -76, 185, 82, -18, 132, -219, -28, 14, -74, -32, -30, -67, -41, -47, -103, 46, -96, 97, 214, 27, 76, 129, -98, 76, 89, -117, 15, 166, -155, -146, 140, -71, -127, 136, -224, 158, -23, 220, 97, -33, -23, -22, 170, 94, -110, -171, -205, -94, -90, -52, 50, 14, -79, 122, 107, 135, 63, 103, -195, -8, 39, -163, 39, 323, -243, 174, -5, -87, -1, 183, 149, 96, -18, 242, 274, 68, -302, 27, 39, -184, 35, 34, 71, -35, -73, -136, -47, -123, -12, -195, 165, -46, -98, -22, -96, 232, 116, -103, -50, 261, 46, -12, -51, -166, -2, 178, -56, 112, 118, -51, -51, 15, -58, 58, 219, -32, 145, 158, -33, 65, 1, 32, 275, 202, 192, 253, 129, 9, -129, 97, -54, 262, 123, -32, 27, -3, 46, -41]
5214d1j14J00p3P8J44k7p0j28P6J55q4j56R4j84L24k01kj59J68K18q3L5J38j29
5238G9k85K39k57M51l28k0N4O8Q6J7p8j7k6K34k46k9K46P6m33oJ02K64k56J15
5262E0k14J8R6L03l2r2j90K09q6k19L7L06l34j32L49n7J44o7p3J3N2k04J74r6
5286d5j04P4K21j15R3k54K15j62J73K6k60Q2j89L99k73n0K87k29j54J79K73j9
5308A68k68L06l10K71J76k19j82l5M4K5K3j89J33j2k37K91O4r9j56K20k41M11
5330A84j36k74L46j80J16k45K00j80K96k91p5J97L7K3r8J84k4M7O2j16k80k9K47
5353A1J98M5l83J34l3K3l6R7L62n29M6K6R8R4m4j76l2N3J21K22k72j23K71j52
5377B1K8j89J16Q9k11J27J69M4k52J38L7n2J20j77k14J56Q1k17K06J28k11Q4m5
$$ y = [-41, -155, -55, -128, -50, 94, 67, -3, -131, -55, 100, 16, -140, -46, -230, 94, -107, -109, -268, -100, 118, 35, 70, 208, 79, -206, 33, -224, 227, -101, -121, -67, 1, 87, 104, 26, 9, -17, 217, -29, -58, 188, 264, -169, -175, -73, 191, -65, 50, -164, -146, -50, 253, 221, 129, -61, 148, 62, -157, -120, 186, -148, -280, 69, 12, 156, 89, 16, 29, 81, -123, 51, -45, -149, -75, 146, 31, 124, -130, 85, -77, 96, 122, -138, -56, -245, 154, -119, -169, 118, -111, -265, -86, 187, 168, -100, 206, -104, 167, 343, 124, -58, -93, -49, -24, -1, -190, -57, -69, -306, -15, 49, -50, -206, 14, -227, 184, 48, -226, 120, -60, 56, -189, 11, -169, 127, -164, -239, -42, -5, 18, -80, 104, 80, 127, 189, 73, -207, -236, 11, 209, 254, -129, 5, -28, -5, -41, 56, 418, -111, -65, -39, 59, 153, 109, -67, -99, -46, 75, 297, 25, -98, 173, 21, 49, -140, -24, 65, -146, -19, 150, 194, -58, 80, 117, 65, 185, 8, -206, -50, 31, -186, 20, 148, -63, 21, -24]
5400b4l3J72J2J0l16M69l37k32K78j13R3J20j76J25R1k01O1R7j88O9Pn8K31j40
5424A7J14k05R3Q9l75J64o8k3P9K98l12J74n4K5P1k12P4j05O7J35J67j48j52N9
5448b8l8J00J37j06k97J83o2J55N3l62K79J35l70O5K59k34j33K07L48l53J53j07
5470a6N9l14J76K17j89p1K32j03k8j38J48J07k25J61L8k49K27j17K6o8J20j00
5492a07R4m3J21o5k91K11J07J30n8n1ok8n0J15j47K65k70M8J65k13m6j87K94J64
5516A52j80l5O8r2J40r0P9q2O3j6l6J40j51l3L22l01j0J85P7l10K08q0R6l8o7
5541Im1J13p2l4kM6Nj29N2L1j03j9J39k5PJ00jk34L14Mj12n4Q0l3o5k17K75J02
5569A36k34M4j18P3n8J9NM1R8L3j22J11J99l30N0K31k52ML15n61L66l9L0L1K10
$$ y = [-24, -57, 115, 127, 137, -179, 290, -47, -279, -1, -114, -21, 99, -77, 48, 139, -62, -1, 96, -92, -23, -16, -74, 157, 17, 131, -74, 19, 108, -267, -103, -171, -194, -115, 183, -129, 45, -9, 16, 87, -125, -51, -156, -89, 46, 213, 65, -87, -28, -66, 34, 171, 65, -232, -49, -111, 44, 97, -265, 14, 149, -221, -156, 103, -131, -264, -57, 291, -62, 91, -16, 43, -271, -95, 122, -67, -138, 94, -9, -37, -175, -27, 80, -145, 16, 54, -195, 32, -85, -59, -127, -7, -107, -13, -56, 65, 0, -291, -80, 27, 157, 99, 48, 42, 14, -36, 79, -68, 197, -73, -25, 140, -73, -119, -306, -12, 152, -28, -63, 5, -87, 53, -37, 42, -40, 23, 7, -29, 111, -40, -73, 249, -52, -62, 123, 200, -110, 98, 18, 114, 76, 9, -32, 81, 9, -25, -27, 19, 24, -105, -53, -22, -125, -144, -5, -30, -23, 77, 76, -158, 156, 160, 48, -6, 74, 41, -24, -241, 34, 136, -98, -54, -172, -99, -157, -138, -133, -92, 6, 39, -83, 28, 227, -103, -53, 178, -74, -70, 245, -316, 50, 11, 41, 72, 282]
5594B82n20J58K55j49K85k38L4K7j46J97k62J51j73K74k35j7J73j73J02j55L02
5615A72j42q7K38q6M2o8j36j08L41j38J6j24p8m9K76j93J7m0J84j32j7N23n08
5638i7J77j63q4R2J38Jj17M9j42J63M7L3L1j50P1j14J7j3M0k16L47o3l71K07q
5663a25J80j33J04n2K3k19K56k16J42l6r0L69k32j83N1K09l8p4Mp3J80N1j33Q0
5687D5K4J4k77M14k23J8j84J79N8q8J45j55k6K9Q4J70k39LK98l23K29j10k58K34
5711F1N5o7j66L92n21K41Oj04O9J69J14k95j5K02m15L28q3O6L15k62K8k81P8J52
5735F7j00LJ2R6l1j00K89j99k24K00q5j6L07j98q4Q8j54R8k5j11K14n2j66J50
5759b1O9p7K00J6j66P1k52K87o6k47K93J13j96N5k5O2j39n0JK60p7J3o3j44J11
$$ y = [282, -238, -80, 175, 26, 311, 73, 107, 134, -12, 185, -77, 74, -99, 175, -60, -77, 96, -77, 25, -130, 172, 30, -57, 181, 95, 137, 69, -67, -175, 166, 28, 44, -80, -158, -207, 69, -124, -107, -147, 37, -95, -112, 411, -97, 80, -83, -167, -75, 63, 64, -53, -4, -146, 17, 64, 97, 128, -22, 49, -65, -48, -61, -21, -237, 110, 47, -324, -117, -125, 55, -78, 26, -26, -3, -222, 34, -182, -40, -76, -166, 203, -29, -212, -161, 48, 10, -64, -60, -133, 47, 98, -35, 45, 69, 83, -194, 220, -3, 15, -169, 10, 68, -20, 125, -30, -56, -27, 57, 227, -12, -9, 289, -34, 195, 85, -173, 61, 116, 49, -117, 275, -246, -5, 1, -103, -34, 135, 249, -46, -61, 141, -274, 54, -29, 37, 352, 90, 118, -163, -85, 67, -33, -30, -18, 78, 47, -53, 236, 37, -187, 13, -72, -88, 219, 21, -63, 25, -129, -31, -56, -167, 47, -5, -171, -21, 48, -29, 171, 187, 21, 92, -160, 127, 61, -186, 107, 220, 24, 79, 54, 116, -23, -73, -72, 188, 111, 124, 61, -83, 28]
5784B8J4p4j82K74j22o1L41m38L10M0P5m5l29J31j49M95l13J61k60L13l34L65
5806B40k46K46j14j28k17K98k19qJ23L6K4k39J24P9J77m3j42J02P4k54L37k52
5828bQQ6n3j06K10k75J80O7J27m03J11m9J13J21k70L13q0J66n2m53K02J46l10
5851b03L65j27J06j4j79J64k62L87n15L69J41m35K47O9j04J0oj40J46q2K80j80
5873C7j41N0k73K52J41r4N3l23L06j98P0n9M9K64l5j21K22k56K5J3j1J84k47Q8
5897dj16j65M62j94%k25K24j27J09NP5N4j62J40j92RJ56j4m4j99M11j91k30K78
5921F0j78K34k99K26l02K20M8k47M41j92l02J18R3j19N8J92J62m43L60l10R6P3
5943a1j01L29k79J8l9K30j27J51j43o4K09q5q5k96M25kk96L36l09J69J12l79K02
$$ y = [28, 42, -32, -214, 60, -62, -123, 218, -220, 90, 130, 205, 160, -169, -38, -187, 308, -5, 156, -104, 209, -125, 240, -6, 240, 126, -2, -219, 79, -140, -148, -25, 11, 35, -204, -80, -1, 176, 133, -9, 93, 167, -87, 250, -2, 6, 92, 39, -67, 143, -132, 48, 115, 242, -161, -50, -99, 14, 135, -135, 178, 98, 264, 212, -241, -39, 107, -203, 162, 35, 141, 127, -52, 112, -150, 237, -278, 91, 232, -203, 44, 113, 9, 19, 13, -127, 19, -63, 217, 37, -104, -54, -327, -75, 66, -28, 25, -298, 8, -190, -120, -179, -130, 134, 99, -22, 200, -56, -31, -18, -29, 155, -92, -4, -120, -285, 177, -17, -17, -242, -18, -145, -36, -31, 44, 98, -64, 76, -116, -107, 49, 35, -9, -208, 203, 12, -218, 60, -118, 116, -183, 43, -259, -39, 9, -238, 203, 11, -291, -173, -80, -199, -141, 51, 213, -230, 130, -180, -84, -11, -112, 217, -62, -44, -83, 147, 20, 171, 28, -36, 173, 88, 3, -293, 132, 130, -166, 170, -139, 30, 142, -237, -35]
5966c5J04j03J56m00L98J4n10K52N1K06j43p6K44k49L9L17k37k33R2Q1m6j56J61
5989g3K07j22J38k85L31l82L65j41o3K5L07l81N2J77j58K00j27QJ2K8k83K23o5
6012gj99K06N1R5n5k01L71l42J20M1m4l36J78K5J6K58k24k7J16j07K34J0k07m7
6036g5k04J29L1K47o9j14m9J77j35LN0J1K26k57q5K80j50l58K97P8J17q9N0Q4
6060A95m40K71Nl55L47k60R9K57k25K54L0l5m28L63p5m40K07N22k94k1k7k79K06
6083a23O6J85p2n3j45K15l0O3nj46pJ54K0J7j9j60j10N1j29K68Q0k64O4l1k09
6108c20J43N10m73K10j41L5j60K26J35N1l52K92j80j63J24K15j93J6O6l87L24
6129b2r6M9k6O1K03r2q1m1O6K66k15j93RN7J28k88L36q7j91L02l6j78k10M4L62
$$ y = [-35, 69, -34, 122, -278, 120, 134, -376, -124, -73, 133, -10, -86, 158, -91, -52, 265, 28, -205, -113, -32, -78, -234, -73, 134, 12, 150, -135, 196, -186, 179, 38, -25, 0, 307, -74, -22, 155, -3, 197, 70, 78, 90, 118, -165, 58, -7, -206, 0, 51, 146, 91, -110, 261, -81, 39, 80, 36, -300, -122, -97, -81, 177, -47, -74, 42, -65, 169, 179, -28, -75, -279, -150, -119, 128, 59, -55, -104, 73, -62, -59, -9, 2, 228, -29, -114, 166, 16, -342, -45, 33, 150, 61, 111, 195, -245, 26, 31, -324, 23, -237, -138, 119, -106, 148, 178, 143, -285, 78, 3, -437, -230, 292, -2, -23, -50, -329, -123, -57, 128, 56, 3, -142, 73, 43, 106, 101, -45, -52, 102, 122, 139, 120, -40, -150, -99, -228, 40, 120, -144, -80, -111, -320, -177, 333, -140, 70, -71, -36, -196, 30, 165, 216, -136, 156, -24, -187, -63, 152, -41, -25, 41, -346, -22, -118, -69, -95, -34, 169, 77, -4, -45, 21, 287, 72, -121, -112, -55, 73, -215, 121, 34, -157, 145, 109, -69, -279, -235, 127]
6154A27l99J15K16N8j41k0J58k15L05k56J37R5k08Q4j8j90K74Q2k03K52k44n6
6176d7K19j98Mm1j74J93n7J21J78j73o8o5K69k14j36K13J41m71K32M5p8J59J73
6199B25l56K89k57M0q0M28n1m54K73l2l13K68J20oj74j70K86J83j37R6j46K57
6221B89l22j6K60l89K46j62k5K23j72N8K21r7l06O2J34l2J72k39K69j60l2j02
6243a20R3P6K48k80K9lp7J17K3l36O5K03Qq7l9J02J63k90J33OR0j2M0k31qJ56
6269F9R1j37K93j73k50L44l13M3j5j25J72Oj60O5k4J23J00k89K49k21M5O80o41
$$ y = [127, -272, -157, 59, 117, -24, -44, 114, -101, 204, -52, 85, 180, -28, 56, 38, -152, 122, 204, 1, 253, 9, -47, 172, -26, -22, -63, -237, -44, -101, 20, 198, 25, -43, -108, 161, -53, -189, 24, 165, -306, -74, -29, -107, 52, 225, -131, 158, -99, -59, -139, 289, 238, -216, 57, 25, -288, -20, 100, 94, -80, -250, 36, 219, 82, 178, 32, 289, -33, -49, 211, -178, 68, -94, -119, 104, -68, -10, 211, 114, -192, -130, 4, -28, 144, -95, 174, 14, -18, -120, -27, 49, 297, 17, 46, 43, -34, 83, 106, -230, -165, 38, 46, -41, -80, 22, 185, -105, 28, 34, 124, 112, 152, -79, -87, 69, 160, 23, 316, 143, -107, 237, -76, -33, -48, -173, -1, 5, -155, -90, -114, 9, 109, -180, 69, -152, -107, 573, -68]
$$ [...]
8191B4
##END NTUPLES=NMR FID
##END=
