##TITLE=1H_SR145-CDCl3TFA
 CDCl3
 8 sc, 
 22.11.2022
##JCAMPDX= 6.0         $$ Bruker NMR JCAMP-DX V2.0
##DATA TYPE= NMR FID
##DATA CLASS= NTUPLES
##ORIGIN= UXNMR, Bruker Analytische Messtechnik GmbH
##OWNER= root
$$ XWIN-NMR		Version 3.5
$$ Tue Nov 22 16:03:32 2022 Russian Standard Time (UT+4h)  she@DPX200
##.OBSERVE FREQUENCY= 200.1313499994
##.OBSERVE NUCLEUS= ^1H
##.DELAY= (6, 6)
##.ACQUISITION MODE= SIMULTANEOUS
##.ACQUISITION SCHEME= undefined
##.AVERAGES= 8
##.DIGITISER RES= 18
##SPECTROMETER/DATA SYSTEM= spect
##.PULSE SEQUENCE= zg30
##.SOLVENT NAME= CDCl3
##.SHIFT REFERENCE= (INTERNAL, CDCl3, 0, 15.7039)
##AUDIT TRAIL= $$ (NUMBER, WHEN, WHO, WHERE, WHAT)
$$ ##TITLE= Audit trail, XWIN-NMR		Version 3.5
$$ ##JCAMPDX= 5.01
$$ ##ORIGIN= Bruker BioSpin GmbH
$$ ##OWNER= she
$$ F:/spectra/data/she/nmr/H-F/1/audita.txt
$$ ##AUDIT TRAIL=  $$ (NUMBER, WHEN, WHO, WHERE, WHAT)
(   1,<2022-11-22 16:02:13.71 +0400>,<she>,<DPX200>,
      <created by zg, POWCHK disabled, PULCHK disabled
       configuration hash MD5:
       00 E9 B6 7A A2 85 ED C7 34 08 36 98 17 FE 4E 26
       data hash MD5: 16K
       9E F5 26 B2 AF AC 7D 71 00 02 E1 1E 38 5A 0D 04>)
$$ ##END=
$$ 
$$ hash MD5
$$ 77 98 B7 6E 0A 5A 99 93 AE 83 FC 6E 98 8B 57 89
##$RELAX= 
##$RELAX= 
##$RELAX= 
##$RELAX= 
##$RELAX= 
##$RELAX= 
$$ Bruker specific parameters
$$ --------------------------
##$DU= <F:/spectra>
##$EXPNO= 1
##$NAME= <H-F>
##$PROCNO= 1
##$TYPE= <nmr>
##$USER= <she>
##$AMP= (0..31)
100 100 100 100 100 100 100 100 100 100 100 100 100 100 100 100 100 100 
100 100 100 100 100 100 100 100 100 100 100 100 100 100 
##$AQSEQ= 0
##$AQ_mod= 1
##$AUNM= <au_zg>
##$AUTOPOS= <>
##$BF1= 200.13
##$BF2= 200.13
##$BF3= 200.13
##$BF4= 200.13
##$BF5= 200.13
##$BF6= 200.13
##$BF7= 200.13
##$BF8= 200.13
##$BYTORDA= 1
##$CFDGTYP= 0
##$CFRGTYP= 5
##$CHEMSTR= <none>
##$CNST= (0..31)
1 1 145 1 1 1 1 1 1 1 1 1 1 1 1 1 1 1 1 1 1 1 1 1 1 1 1 1 1 1 1 1 
##$CPDPRG= <>
##$CPDPRG1= <>
##$CPDPRG2= <>
##$CPDPRG3= <>
##$CPDPRG4= <mlev>
##$CPDPRG5= <mlev>
##$CPDPRG6= <mlev>
##$CPDPRG7= <mlev>
##$CPDPRG8= <mlev>
##$CPDPRGB= <>
##$CPDPRGT= <>
##$D= (0..31)
0 1.2 0 0 0 0 0 0 0 0.06 0 0.03 0 0 0 0 0.0002 0 0 0 0 0 0 0 0 0 0 0 0 
0 0 0 
##$DATE= 1669118533
##$DBL= (0..7)
120 120 120 120 120 120 120 120 
##$DBP= (0..7)
150 150 150 150 150 150 150 150 
##$DBP07= 0
##$DBPNAM0= <>
##$DBPNAM1= <>
##$DBPNAM2= <>
##$DBPNAM3= <>
##$DBPNAM4= <>
##$DBPNAM5= <>
##$DBPNAM6= <>
##$DBPNAM7= <>
##$DBPOAL= (0..7)
0.5 0.5 0.5 0.5 0.5 0.5 0.5 0.5 
##$DBPOFFS= (0..7)
0 0 0 0 0 0 0 0 
##$DE= 6
##$DECBNUC= <off>
##$DECIM= 32
##$DECNUC= <off>
##$DECSTAT= 4
##$DIGMOD= 1
##$DIGTYP= 9
##$DL= (0..7)
0 120 120 120 120 120 120 120 
##$DP= (0..7)
150 150 150 150 150 150 150 150 
##$DP07= 0
##$DPNAME0= <>
##$DPNAME1= <>
##$DPNAME2= <>
##$DPNAME3= <>
##$DPNAME4= <>
##$DPNAME5= <>
##$DPNAME6= <>
##$DPNAME7= <>
##$DPOAL= (0..7)
0.5 0.5 0.5 0.5 0.5 0.5 0.5 0.5 
##$DPOFFS= (0..7)
0 0 0 0 0 0 0 0 
##$DQDMODE= 0
##$DR= 18
##$DS= 0
$$ [...]
##$SUBNAM2= <"">
##$SUBNAM3= <"">
##$SUBNAM4= <"">
##$SUBNAM5= <"">
##$SUBNAM6= <"">
##$SUBNAM7= <"">
##$SUBNAM8= <"">
##$SUBNAM9= <"">
##$SW= 18.0517283424941
##$SWIBOX= (0..15)
0 0 2 0 0 0 0 0 0 0 0 0 0 0 0 0 
##$SW_h= 3612.71676300578
##$TD= 16384
##$TD0= 1
##$TE= 0
##$TE2= 300
##$TE3= 300
##$TEG= 300
##$TL= (0..7)
0 120 120 120 120 120 120 120 
##$TP= (0..7)
150 150 150 150 150 150 150 150 
##$TP07= 0
##$TPNAME0= <>
##$TPNAME1= <>
##$TPNAME2= <>
##$TPNAME3= <>
##$TPNAME4= <>
##$TPNAME5= <>
##$TPNAME6= <>
##$TPNAME7= <>
##$TPOAL= (0..7)
0.5 0.5 0.5 0.5 0.5 0.5 0.5 0.5 
##$TPOFFS= (0..7)
0 0 0 0 0 0 0 0 
##$TUNHIN= 0
##$TUNHOUT= 0
##$TUNXOUT= 0
##$USERA1= <user>
##$USERA2= <user>
##$USERA3= <user>
##$USERA4= <user>
##$USERA5= <user>
##$V9= 5
##$VALIST= <valist>
##$VCLIST= <CCCCCCCCCCCCCCC>
##$VD= 0
##$VDLIST= <DDDDDDDDDDDDDDD>
##$VPLIST= <PPPPPPPPPPPPPPP>
##$VTLIST= <TTTTTTTTTTTTTTT>
##$WBST= 1024
##$WBSW= 4
##$XGAIN= (0..3)
0 0 0 0 
##$XL= 0
##$YL= 0
##$YMAX_a= 287689
##$YMIN_a= -249982
##$ZGOPTNS= <>
##$ZL1= 120
##$ZL2= 120
##$ZL3= 120
##$ZL4= 120
##$ABSF1= 10
##$ABSF2= 0
##$ABSG= 5
##$ABSL= 3
##$ALPHA= 0
##$AQORDER= 0
##$ASSFAC= 0
##$ASSFACI= 0
##$ASSFACX= 0
##$ASSWID= 0
##$AUNMP= <proc_1d>
##$AZFE= 0.1
##$AZFW= 0.1
##$BCFW= 1
##$BC_mod= 2
##$BYTORDP= 1
##$COROFFS= 0
##$CY= 11.3945322036743
##$DATMOD= 1
##$DC= 2
##$DFILT= <>
##$DTYPP= 0
##$F1P= 2.36226072786647
##$F2P= -0.459571619588291
##$FCOR= 0.5
##$FTSIZE= 0
##$FT_mod= 4
##$GAMMA= 1
##$GB= 0.15
##$INTBC= 1
##$INTSCL= 1
##$ISEN= 128
##$LB= 0.24
##$LEV0= 0
##$LPBIN= 0
##$MAXI= 10000
##$MC2= 0
##$MEAN= 0
##$ME_mod= 0
##$MI= 1.114404
##$NCOEF= 0
##$NC_proc= 0
##$NLEV= 6
##$NOISF1= 3.799351
##$NOISF2= 2.8
##$NSP= 1
##$NTH_PI= 0
##$NZP= 0
##$OFFSET= 15.70392
##$PC= 1
##$PHC0= -18030.28
##$PHC1= 8.200715
##$PH_mod= 1
##$PKNL= yes
##$PPARMOD= 0
##$PSCAL= 0
##$PSIGN= 0
##$REVERSE= no
##$SF= 200.130013532006
##$SI= 16384
##$SIGF1= 3
##$SIGF2= 2
##$SINO= 400
##$SIOLD= 16384
##$SREGLST= <1H.CDCl3>
##$SSB= 0
##$STSI= 0
##$STSR= 0
##$SW_p= 3612.71676300578
##$SYMM= 0
##$S_DEV= 0
##$TDeff= 0
##$TDoff= 0
##$TI= <>
##$TILT= no
##$TM1= 0
##$TM2= 0
##$TOPLEV= 0
##$USERP1= <user>
##$USERP2= <user>
##$USERP3= <user>
##$USERP4= <user>
##$USERP5= <user>
##$WDW= 1
##$XDIM= 8192
##$YMAX_p= 0
##$YMIN_p= 0
$$ End of Bruker specific parameters
$$ ---------------------------------
##NTUPLES= NMR FID
##VAR_NAME=  TIME,          FID/REAL,        FID/IMAG
##SYMBOL=    X,             R,               I
##VAR_TYPE=  INDEPENDENT,   DEPENDENT,       DEPENDENT
##VAR_FORM=  AFFN,          ASDF,            ASDF
##VAR_DIM=   8192,          8192,            8192
##UNITS=     SECONDS,       ARBITRARY UNITS, ARBITRARY UNITS
##FACTOR=    0.0002768,     1,               1
##FIRST=     0,             0,               0
##LAST=      2.2672688,     0,               0
##MIN=       0,             -249982,         0
##MAX=       2.2672688,     287689,          0
$$ Real data points
##PAGE= N=1
##DATA TABLE= (X++(R..R)), XYDATA
0@%%%%%%%%%%%Qj6J6j6K4l2L2m0M8n6P2q8J04j20J40j64J92k23K55k92L32l77
$$ 0 0 0 0 0 0 0 0 0 0 0 0 8 -8 8 -8 16 -16 16 -24 24 -32 40 -48 56 -64 76 -88 104 -119 136 -156 176 -201
33b01M29m84N46o16O90p72Q62r59J068j186J313j454J606j772J957k158K374k613
$$ -201 228 -256 290 -326 364 -408 454 -505 563 -623 690 -764 842 -930 1027 -1131 1243 -1370
51a370K882l178L506l871M281m749N284n900O624p489Q541r856J1550j3828J7080
$$ -1370 1512 -1666 1840 -2031 2250 -2499 2785 -3115 3509 -3980 4561 -5295 6255 -7573 9507
66I507k2135L1142n2102J94141J09654k95642j42668o9051J78826K60789Q2400
$$ 9507 -12628 18514 -33588 160553 270207 -25435 -168103 -237154 -58328 202461 284861
77B84861k00184k20948j13711R9651K39744J56689j08936k20642j49303L1194
$$ 284861 84677 -136271 -249982 -150331 89413 246102 137166 -83476 -232779 -201585
87b01585J88125K01558M478j83959j90054k0200J48729J96254P6206j14110k11308
$$ -201585 -13460 188098 192576 8617 -181437 -201637 -52908 143346 219552 105442 -105866
98a05866r3350J03915J81143J11191l1956j78155j66968K6126J71131J32535J0025
$$ -105866 -199216 -95301 85842 197033 165077 -13078 -180046 -153920 17211 149746 159771
109A59771j26186j80271m5376J35432J51360N2017o4899j59772j11555P5739J68208
$$ 159771 33585 -146686 -192062 -56630 94730 146747 81848 -77924 -189479 -113740 54468
120E4468R0245k8459j24701j34460L088J44473J29630J3278r5579j37932n7400
$$ 54468 144713 116254 -8447 -142907 -139819 4654 134284 147562 51983 -85949 -143349
131a43349Q7659J41168N9153o4384j28804q5208L5544J23258R6071j8983j13519
$$ -143349 -55690 85478 144631 80247 -48557 -133765 -98221 25037 121108 102125 -11394
142a1394j04561p529R4918J18356L0751q8799j13080l5672N8942J10576P3867
$$ -11394 -115955 -123484 -28566 89790 120541 31742 -81338 -117010 -58068 52508 126375
153A26375m4631j18924o8941K7391R0590R1303L124r9487r3758n346O7571R1117
$$ 126375 81744 -37180 -106121 -78730 11860 103163 106287 6800 -86958 -92304 -24733 66384
165F6384L9701o5610j05971l7199M8116Q6166O2906k3825r7184o8784K0233P9259
$$ 66384 106085 40475 -65496 -102695 -54579 31587 94493 70668 -26516 -95300 -75067 4192
177D192P4577Q355p2809q5205j5461O1390Q1287L4320m4518q5541m6657L4556
$$ 4192 78769 87124 14315 -70890 -86351 -24961 56326 90646 46128 -39413 -86070 -51514
189e1514P8842N1034j8899p0964o3531K374O9756O8451M751n6021o7724k4845
$$ -51514 27328 78362 59463 -11501 -75032 -72658 -2902 65549 70300 14279 -53445 -78290
201g8290M7155P7068K9926l7425o4518m2938J8328P0299N2425j5613n9255n2384
$$ -78290 -31135 45933 75859 38434 -26084 -69022 -50694 19605 72030 56417 -2838 -55222
213e5222o393N1078O2962R652m6440n6722k2723L1021O2772L2012k9316n7320
$$ -55222 -61615 -10537 52425 62077 15637 -41085 -63808 -32787 29985 61997 32681 -24639
225b4639l5293J3455N4417M8584n097n0721m7930m409M1593N2886J6195l5530
$$ -24639 -59932 -46477 7940 56524 51427 706 -47224 -51633 -10040 42846 59041 23511
237B3511n3520k2846K5563N0350L1521j6838n0499l7187R031M2526L8717K203
$$ 23511 -30009 -52855 -27292 23058 54579 37741 -12758 -49945 -40914 1612 40329 42532
249D2532l9289m5539p545L4962M3659J6927k4152m5694k4472K0892M3659K8398
$$ 42532 3243 -42296 -49841 -14879 28780 45707 21555 -24139 -48611 -27719 15940 44338
261D4338q052l9726l5505L815L7236L5027M540k9178l9992j3495K6807L7857J5281
$$ 44338 36286 -3440 -38945 -35130 2106 37133 41673 12495 -27497 -40992 -14185 23672 38953
274C8953j8307l7311k4807J2787L7392K5976o620l2283l1844j715L1622L4423
$$ 38953 20646 -16665 -41472 -28685 8707 34683 28063 -4220 -36064 -37779 -6157 28266
286B8266P066k3505l3099j4517J9058L5101J8520j3817l1485k2105O070L0422
$$ 28266 35332 11827 -21272 -35789 -16731 18370 36890 23073 -8412 -30517 -24447 5975
298E975K6433k895k8047k6568m214K1757K9520Q794k1110k9582j2379J3696K9368
$$ 5975 32408 29513 1466 -25102 -29316 -7559 21961 30755 9645 -19937 -32316 -18620 10748
311A0748J9681j0036k9215k0210M303K4298K5134K399k3575k4918l882J7700K5433
$$ 10748 30429 20393 -8822 -29032 -24729 -431 24703 27102 3527 -21391 -25273 -7573 17860
324A7860J1575j5018k7346j2894J0853K3666J7387n708k4655j9991K812K1077
$$ 17860 29435 14417 -12929 -25823 -14970 8696 26083 20375 -4280 -24271 -21459 -382
336c82K0349M076j8553k4796o401J5434K2379J0882r638k2630j4541P711K1563
$$ -382 19967 24043 5490 -19306 -25707 -10273 12106 22988 13350 -9280 -23821 -16110 5453
349E453J5439l069j8584j8725j077J9005J8960L209j3558j9580q818J1968K1348
$$ 5453 20892 17823 -761 -19486 -20563 -1558 17402 20611 7053 -12527 -21345 -9377 11971
362A1971R458q792j8524j4334L878J9733J5352j811j5506j6460l838J3641J8702
$$ 11971 21429 12637 -5887 -20221 -16343 3390 18742 16931 1425 -15035 -18873 -5232 13470
375A3470M535j2575j5938p756P468J7684J0861o669j6134j1652K064J5389J4911
$$ 13470 18005 5430 -10508 -18264 -10796 6888 17749 11080 -5054 -16706 -14642 747 15658
388A5658k30j4360j3848k428J0305J6240O735r750j5675p634O101J3876J0204
$$ 15658 15428 1068 -12780 -15208 -4903 11337 18072 8322 -7353 -14987 -8886 4990 15194
401A5194l264j4569j0919J585J1641J1650K080j1260j4096k754R500J2249N912
$$ 15194 11930 -2639 -13558 -11973 -332 11318 13398 2138 -11958 -14712 -5212 7037 12949
414A2949n627j4043q092O176J2430Q663j247j1208j1472L86J0914J0389K508p254
$$ 12949 7322 -6721 -14813 -8637 3793 12456 11209 1 -11471 -11085 -171 10218 12726 5472
428E472j2368m938P713J0705N187m695j0168q895K818J0938Q269j571q781r608
$$ 5472 -6896 -11834 -4121 6584 11771 7076 -3092 -11987 -9169 1769 10038 8467 -314 -9922
442i922k027Q877J0160K672o547r202n161M464J1134O818m031q715o455N18Q063
$$ -9922 -11949 -3072 7088 9760 3213 -5989 -11150 -6686 4448 11266 7235 -1480 -7935 -7417 646
457F46Q969p4q397p573j786N883R319L418o490r072m183L021Q551O858k269r297
$$ 646 9615 9541 1144 -6429 -8215 -2332 6987 10405 3915 -5157 -9340 -6319 2232 9090 6821 -2476
473b476o574O46O727Q130K065o539q244k251M933P742M421l477q165m401K739
$$ -2476 -9050 -8404 -1677 6453 8518 1979 -6265 -8516 -3583 4159 8580 5103 -3062 -7463 -4724
488d724P147N489o27p014p248J16O337O592J913n307p782k803L738P080L995k092
$$ -4724 2423 7912 7285 271 -6977 -6861 -524 6068 7981 2674 -5108 -7911 -4173 2907 6902 4810
504D810p574m984J790O503N163l10n106o163r15N359O302J583l788o483k804L642
$$ 4810 -2764 -7748 -5958 545 5708 5398 292 -5871 -6786 -1427 4875 6458 2670 -3813 -6617 -2975
520b975O502L245j765n995n139Q84O690M642n78m253n311k151M165O212J322l338
$$ -2975 3527 6772 5007 -988 -6127 -5243 1447 6089 5511 1258 -4053 -6204 -2039 4173 5495 2157
536B157n385k655J759O085L602k470m928l373q0M559N846L62n192m297n56K353
$$ 2157 -3228 -5883 -4124 1961 5563 3093 -1835 -5208 -5288 -729 5117 5479 287 -4010 -4566 -2213
552b213N274L307k920n430j852J227L483M648q72n139l106N30K212L339K335l503
$$ -2213 3061 6368 3448 -1982 -3834 -2607 876 5524 4652 -487 -3593 -3063 -851 2488 4823 1320
568A320n473k79K716L054K037j178m890k468K091L617K656L62l387m054J87L891
$$ 1320 -4153 -4432 -1716 1338 3375 2197 -2693 -5161 -3070 547 3203 3565 178 -3876 -3689 202
584B02K805R05j311l688k655K131M665J200j810k786k831k03L873L183j114k322
$$ 202 3007 3912 2601 -1087 -3742 -1611 3054 4254 2444 -342 -3173 -3376 497 3680 2566 244
600B44l255j639K540M480J71j921k094k081J7L999K665j123k103j681m81K044
$$ 244 -3011 -4650 -2110 2370 2541 620 -1474 -3555 -3538 461 3126 2003 -100 -1781 -2262 -218
616b18L553m3k239k146r61J275L368J430k253k954j591M66K502K581m39l189k691
$$ -218 3335 3292 1053 -1093 -2054 -779 2589 4019 1766 -1188 -2779 -2313 189 2770 2331 -858 -3549
633c549J89K342K534Q28j768l153q85J693K582J924m76l184j781J282K574J256
$$ -3549 -3360 -1018 1516 2344 576 -2577 -3462 -1769 813 2737 2261 -923 -2704 -1422 1152 2408
649B408P37k149k838n1K161J781R88j378l021j685J993J716R91J62k343k778R14
$$ 2408 3145 996 -1842 -1893 268 2049 3037 1659 -1362 -3047 -1054 662 1653 1815 -528 -3306 -2392
666b392K618Q07K70j199k503p25K508K075O08r32k144j508J237K782J164j044
$$ -2392 226 1033 1303 104 -2399 -3124 -616 1459 2067 1135 -1009 -2517 -1280 1502 2666 1622
682A622j199j886k49J780K417l39j484j706n20N97J803R36j589j422m21M3J471
$$ 1622 423 -1463 -1712 68 2485 2146 662 -1044 -1564 -967 836 1772 183 -1239 -1660 -1617 -146
699a46J785p33k211n65N55O67J787R62k021j675M69O52J234J376l68k317n13L84
$$ -146 1639 906 -1305 -1870 -1315 -648 1139 2101 80 -1595 -1126 -474 760 2136 1768 -549 -1062 -678
717f78J068J558o6j917j391N05R33P33Q40j026j823n01J127R08P18j96j452j120
$$ -678 390 1948 1882 -35 -1426 -921 12 745 1585 559 -1264 -1765 -638 270 988 792 -660 -1780
735a780M11J308Q81K42o09j350n40J316J140J01l01p86q52L60J475N33m31r37
$$ -1780 -1369 -61 820 1062 453 -897 -1437 -121 1019 1120 819 33 -819 -459 1016 1549 1118 181
753A81j072k09J397J394o56j061o50r65L92J721P99j201o46r33o7J285J294l80
$$ 181 -891 -1100 297 1691 1035 -26 -676 -1641 -1249 472 1271 70 -576 -1509 -1576 -291 1003 623
771F23j053n9n89L94J841J96p36o17k31j10J107R34p37j356k72M07L59R93j92
$$ 623 -430 -489 -1078 -684 1157 1353 617 0 -231 -341 766 1700 963 -393 -665 -258 101 1094 902
790I02r74r44Q1L37Q43N48n02j654l4P12O99N11j26q82p64N28R06O66L19m26j221
$$ 902 -72 -1016 -935 -598 245 793 291 -1363 -1397 -685 14 525 399 -483 -1247 -719 187 853 1172 746 -475
811d75k85J295K49K39P5j109p67N97P57N6l44j94p56n00R19N88m27n3p03k44K85
$$ -475 -760 535 784 1023 1098 -11 -778 -181 576 632 288 94 -662 -1162 -243 345 -82 -135 -838 -1082 -797
832g97J113J0k68m60m85O1J537K52k6r15j28k33M07R50Q5n24m89k14k39P93O26
$$ -797 316 326 58 -402 -887 -826 711 963 937 22 -106 -339 68 1018 1103 579 90 -124 -363 430 1056
853A056q48p96J51m54M95O53J9j021k82O72n9J23Q37n01r71M54N21r7Q29j08p50
$$ 1056 208 -588 -437 -891 -396 257 276 -745 -1027 -355 -414 -291 546 45 -926 -472 49 -48 781 673 -77
874g7j07M48L06l4L01l14r19O8O50k0J87K57j172l21J75N21J01J11k31j153M43
$$ -77 -184 264 570 536 837 523 -396 -328 322 302 489 746 -426 -747 -572 -51 50 161 -70 -1223 -780
895g80N24L91k55M00n34o29K98Q77J51q7j00k99j87M43N83o04M96m46n85L34Q78
$$ -780 -256 135 -120 280 -254 -883 -585 292 443 356 256 -43 -230 213 796 192 688 242 -343 -9 869
916H69l93n85m9l71K0P73J12l06k95l7o29N60L82k05r5j67m5K27L80L85k87m92
$$ 869 476 -109 -158 -529 -509 264 376 70 -225 -262 -891 -331 51 -154 -249 -416 -461 -234 146 531 244 -248
938b48L0N14p6N10jm13m73M85j66j7N79l99p31q3O46p57O29L14j072j20P26J18
$$ -248 -218 296 220 730 729 316 -157 328 162 145 724 325 -406 -489 157 -600 29 343 -729 -849 -123 -5
960ek32Q22p34n65M94K42l04L04M44p47l9O86j47J09J68m49j05J90J05K25j81
$$ -5 -237 585 -149 -714 -220 22 -282 22 466 -281 -320 366 219 328 496 47 -58 132 237 462 281
981B81j04l48j72J66L51%n14k28N2j72K29O69m89j69J74J18k84Q95M5o92J21L23
$$ 281 177 -171 -343 -177 174 174 -340 -568 -516 -688 -459 210 -279 -448 -274 -156 -440 455 500 -192 -71 252
1003B52k99N57M60o87l86M26k16k25Q01n28k06k44K98k02JL54m04k21K06j24K21
$$ 252 -47 510 970 283 -103 323 107 -118 683 155 -51 -295 3 -199 -198 156 -248 -469 -263 -387 -166
1024a66K99n81j5J12L27K81j68kj60Q4j44L11J29r6l2J8j71J63K38j7n07L01l36
$$ -166 133 -448 -463 -351 -24 257 89 87 -73 11 -133 178 307 211 179 197 26 189 427 410 -97 204 -132
1047a32j47L84Q0l10J08n2n83J52P18k57j5j81k74p1Q40l54R9L88n16o4L91O4
$$ -132 -279 105 185 -125 -17 -69 -652 -500 218 -39 -54 -235 -509 -580 260 -94 5 393 -123 -187 204 268
1069B68r1lOk75L71o3J57l08L42m30l04M90K5L8j63j46j49Q9Q9j21K05k26j4K57
$$ 268 177 174 180 -95 276 213 370 62 404 -26 -330 160 185 223 60 -86 -235 -146 -57 -178 27 -199 -213 44
1093D4k25l5K85j22j45N64k96Q2M04l63k01M83j24k27l4N41p84j46M99k52J87
$$ 44 -181 -216 69 -53 -198 366 70 152 556 193 -8 475 351 124 90 631 -153 -299 200 -52 135
1114A35p5k20p8L9l5L3j45L17k04p9J29J31K03j85k19K79J3N9J84r9p9j45L54
$$ 135 60 -160 -238 -199 -234 -201 -346 -29 -233 -312 -183 -52 151 -34 -253 26 39 98 282 183 104 -41 313
1137C13j36R9J39j47l14L23k00PJ58m65q3J00j41m3K90J15m18J19o1J82M2K65
$$ 313 177 276 415 268 -46 277 77 84 242 -223 -306 -206 -347 -390 -100 15 -403 -284 -345 -163 -121 144
1159A44l62J49J0j03K10N52m44Q0J77j90m4J55Qk31J36j93k73M09k08k51n1J97
$$ 144 -218 -69 -59 -162 48 600 156 236 413 223 179 334 342 111 247 54 -219 190 -18 -269 -320 -123
1181a23J05l79J46K58k63m8J72j10K76J70n6k42j5J25M02k06J75k26j2J11r6m
$$ -123 -18 -397 -251 7 -256 -304 -132 -242 34 204 148 -94 -109 16 418 212 387 161 149 260 164 160
1203A60JK81n76rL66m23O3O9Jnj72L2K2O0q1l82L51K87k9k37J27j3PK67P9k84
$$ 160 161 442 -134 -143 223 -200 -137 -68 -67 -72 -244 -212 -190 -130 -211 -593 -242 45 16 -221 -94 -107 -100 167 246 -38
1229c8L39J5j94O7QK22k16j87R3L8k37L36r3k58j42K58l78J72L03l73K1K29m33
$$ -38 301 316 122 189 197 419 203 16 109 147 -90 246 153 -105 -247 11 -367 -195 108 -265 -244 -15 -448
1252d48K68k6o1q3M11J03l28K58J35j02M7J65m59J56J80L21o09J73j11J42K02
$$ -448 -180 -206 -267 -350 61 164 -164 94 229 127 174 339 -120 36 216 537 -72 101 -10 132 334
1273C34k15ql18K45l23M6K70p5k92L8L04k17N3M2O9q5P1k1j9J52R5mN6J97j47
$$ 334 119 111 -207 38 -285 -239 31 -44 -336 -298 6 -211 -158 -116 -47 -132 -61 -82 -101 51 146 142 198 395 248
1298B48l87K37L25l64O1j23j8j99K03J65q9n3j91J85k61J49j5l21L91r9m6J82
$$ 248 -139 98 423 59 120 -3 -21 -220 -17 148 59 6 -185 0 -261 -112 -127 -448 -57 -156 -202 -20
1320b0m1j3l8L99O5k82P4K8q6O8J22j17J84k17k36L01j69j96K9O5K8j54P6j19
$$ -20 -61 -74 -112 287 352 70 144 172 86 154 276 159 343 126 -110 191 22 -174 -145 -80 -52 -206 -130 -249
1344b49Q3j07L8K1K01n8l8j10K39j08j6J89J10j82j25L86k28K57k29l9L81l58
$$ -249 -166 -273 -235 -214 -13 -71 -109 -219 20 -88 -104 85 195 13 -112 274 46 303 74 35 416 58
1366E8l4J24J9j74k49K59J72j9l00J32k28Q5P5k68L79j18j73L37j06p4N6n0rR2
$$ 58 24 148 167 -7 -256 3 175 156 -144 -12 -240 -155 -80 -348 31 -87 -260 77 -29 -103 -47 -97 -106 -14
1390a4k09O43q7j00l29K34j08N4J29j82L40k97q0j44J79r8r0L1p7J63j85J56J04
$$ -14 -223 420 333 233 -96 138 30 84 213 31 371 74 -6 -150 29 -69 -159 -128 -205 -42 -227 -71 33
1413C3j94N6k33M61j57J11j4J12n7j39J92O1J74k91j91N0lkj00oK45k77j97N43
$$ 33 -161 -105 -338 123 -34 77 63 175 118 -21 171 232 406 115 -76 -26 -29 -31 -131 -137 108 -169 -366 177
1437A77l05r8J81J33o8k28m9J17m2J77r9J84N6j90J13O0r9j19r0L36N7j30J95
$$ 177 -128 -226 -45 88 20 -208 -257 -140 -182 -5 -104 80 136 -54 59 119 20 -99 -189 147 204 74 269
1460B69k43J88j85L4l2Q6m8k62L15q3J36l29J07l2j3N1m6j08j90L84j97J51j1
$$ 269 26 214 29 63 31 117 69 -193 122 39 175 -154 -47 -79 -92 -41 -87 -195 -385 -1 -198 -47 -58
1483e8Q2j59K94J20l50K75Q1j66j80J94k9K1j58j22K78k63Q1j29o2O8Q4j45k8
$$ -58 24 -135 159 279 -71 204 285 119 -61 133 104 125 -33 -155 123 -140 -59 -188 -250 -182 -98 -243 -271
1506b71m4l2J9R1M7K21k92J08j15M17k06K13j61K58J5j91L11k93J47j09K05k98
$$ -271 -315 -347 -328 -237 -190 31 -261 -153 -268 149 -57 156 -5 253 268 77 388 95 242 133 338 40
1528D0Q4J05l55L73k12j77J21J07p1k00Lp3K17r4J48N5j9P4j06J1K96m06L51r5
$$ 40 124 229 -126 247 35 -142 -21 86 15 -185 -182 -255 -38 -132 16 71 52 126 20 31 327 -79 272 177
1552A77j01k28K03J54L3l29K88j10l0j1j34J32j39j67L03m04L80l42J15J85j77
$$ 177 76 -152 51 205 238 -91 197 87 57 46 -88 44 -95 -262 41 -363 17 -325 -210 -25 -202
1573b02K83n56M76j06j55K20M21k53r2K3J28k34J34L8m2k6J21J31j19k42K17j67
$$ -202 81 -475 1 -105 -260 -40 381 128 36 59 187 -47 87 125 83 57 178 309 190 -52 165 -2
1595bOr0p6R1j47M0Q7r9o4K80l0k07K53k77K55k41L3kM1K56j43O9l5J18j02K57
$$ -2 4 -86 -162 -71 -218 -178 -91 -190 -254 26 -4 -211 42 -235 20 -221 -188 -190 -149 107 -36 33 -2 116 14 271
1621B71k54n2N5J54r2k05j06l17L11j52J37n7j19J80J84k25L22j42J35k15J5J21
$$ 271 17 -35 20 174 82 -123 -229 -546 -235 -387 -250 -307 -426 -246 -62 -287 35 -107 28 -187 -172 -51
1643e1n0P5m8K89j66J86j12k4L7N0j0k4n7k02J82j80MK88O5j67l03P6J11j87J74
$$ -51 -101 -26 -74 215 49 235 123 99 136 186 176 152 95 -107 75 -105 -101 187 252 85 -218 -142 -31 -218 -44
1668d4r9J23kQ7J3n4J24l96J12L34j90Q6j08Q0n6J87k56O7J23k08J08L56j85k
$$ -44 -143 -20 -22 65 78 24 148 -248 -136 198 8 94 -14 66 10 197 -59 8 131 -77 31 387 202 200
1692B00k53r4K57p2k0j30O3P1o3J05j59m4J34K03l66M7J57j57J47o1k2O3L27k32
$$ 200 -53 -147 110 38 18 -112 -49 22 -41 64 -95 -139 -5 198 -168 -121 36 -121 26 -35 -57 6 333 101
1716A01N4l29K89j68J49k54K11j34M2J82p9o7k41L44j71J49j94L8J1N6m28K81
$$ 101 155 -174 115 -53 96 -158 53 -81 -39 143 64 -3 -244 100 -71 78 -116 -78 -67 -11 -439 -158
1738a58KR1J77j03K62r4j99J99k58J14M4k0M4K09n15L33j18Q1k7j58m7j7j29O3
$$ -158 -156 -65 112 9 271 177 -22 177 -81 33 77 57 101 310 -205 128 10 91 64 -94 -141 -158 -287 -224
1762b24K01j63K84j08j38K4L88l75k1J36q5k82P44k70k74K36J59M0j71j66J64
$$ -224 -23 -186 98 -10 -148 -124 264 -111 -132 4 -81 -363 381 111 -163 73 232 272 101 -65 99
1783I9l5L2O4k65J52m9j64K46l05K02j19J06k8J26m00J66j04K2J38J45k26J22
$$ 99 64 96 160 -105 47 -2 -166 80 -225 -23 -142 -36 -64 62 -338 -172 -276 -254 -116 29 -197 -75
1805g5J78j75L84m32K83n6Q0k43j36M24J5m17K25J87q8k72j81K26J92j2k62J37
$$ -75 103 -72 312 -120 163 107 187 -56 -192 232 247 -170 55 242 154 -118 -299 -73 119 107 -155 -18
1827a8k5k3j57R9k9Q6N2Oo9J7R3r3K32l37K84j15L4N3oq3j38PJJ89M0j90j11N36
$$ -18 -43 -66 -223 -124 -153 -67 -15 -9 -78 -61 32 -61 171 -166 118 3 37 90 84 1 -137 -130 -129 60 100 -90 -201 335
1855C35m93j37J79Q4n8Q4n3j84J27j48Q0J79K12l75K43r0Q0k36K47J02j41R3J18
$$ 335 -158 -295 -116 -32 -90 -6 -59 -243 -116 -264 -184 -5 207 -168 75 -15 65 -171 76 178 37 130 248
1878B48j76Q4r2Q9j12l8J18k49R2J72k69K29M8q2k2j35k8j7J00J54k19J04j4r1
$$ 248 72 156 64 153 41 3 121 -128 -36 136 -133 96 144 62 40 -95 -123 -140 -40 114 -105 -1 -15 -106
1902a06jJ15L27l44K45k33J65om1n4j5P5j17q4R9K2LK10k30J7N5j10J5n8n0Q6
$$ -106 -107 8 335 -9 236 3 168 162 121 67 52 127 10 -74 25 47 50 260 30 47 102 -8 7 -51 -101 -15
1928a5r9K12j10k63L64j35m7J99Q2k48l1o8L82k41j88J59r9L20k09JQ9L7J10k24
$$ -15 -114 98 -12 -275 89 -46 -93 106 188 -60 -91 -159 223 -18 -206 -47 -146 174 -35 -34 55 92 202 -22
1952b2O3j69O3L1K8j39N1J37j60Q5j64L27k2q9N9j64J93j37J55LqN5or8P4oj01
$$ -22 41 -128 -65 -34 -6 -145 -94 43 -117 -32 -196 131 109 20 79 -85 108 -29 126 129 121 176 170 72 146 140 39
1979C9m4J72j18j2m6m5J47k97J65j28M6qJ47k35J23j09M4P3P4k01K58Mj90M6J28
$$ 39 -5 167 49 37 -9 -54 93 -204 -39 -167 -121 -129 18 -217 -94 -203 -159 -86 -12 -213 45 49 -141 -95 33
2004C3j05K55mj4k21j15L03q6m8j56NN7k29J97J08q5L51k58j94J14r6M8R5K86
$$ 33 -72 183 179 165 -56 -171 132 46 -2 -158 -153 -96 -325 -128 -20 -105 246 -12 -206 -92 -188 -140 -45 241
2028B41l68K95k07j6L96l13K9l52L65K19m37J59L18k90M8K31k92L2J80l19R6m8
$$ 241 -127 168 -39 -55 341 28 57 -295 70 289 -148 11 329 39 87 318 26 58 238 -81 15 -33
2050c3j2K8j25J90k95K17K9J07l49K75J19k28L1Q4k5O9J5q7K71j73k67K62N9j26
$$ -33 -45 -17 -142 48 -247 -30 -1 106 -243 32 151 -77 -46 38 13 82 97 10 281 108 -159 103 162 36
2074C6j15O0R4k12m6K05m0k27L78j54k4K34j64j14l7j68L18j4r4M36m43J66J64
$$ 36 -79 -19 75 -137 -183 22 -18 -245 133 -21 -45 189 25 -89 -126 -294 24 10 -84 352 -91 75 239
2097B39j27j25J39k79J59J94k19j24J93m0r5j5K39j60j72oP4J01N3r0Pr4L43k77
$$ 239 112 -13 126 -153 6 200 -19 -143 50 10 -85 -100 139 -21 -193 -199 -125 -24 29 -61 -54 -148 195 -82
2121h2N4K47q5j28j31Q5pj1j03M24l2k57M8r0J01K12N2j74j67J24L1K2q7J20j89
$$ -82 -28 219 134 6 -125 -40 -47 -58 -161 263 231 -26 22 -68 33 245 297 123 -44 80 111 133 46 166 -23
2146b3L7J15j02On7j53K11P8M5k0n5n9l6k2k03L28l39J41P9n8J29M4k55N1L1J92
$$ -23 14 129 27 33 -24 -177 34 112 157 137 82 23 -13 -35 -238 90 -249 -108 -29 -87 42 86 -169 -118 -87 105
2172A05M5q1N5nl8q6L4j59k9o3J48J25l6j72J37O3Q6o4j58k7J84K6q7oK35k30
$$ 105 150 69 124 119 81 -5 29 -130 -159 -222 -74 51 15 -157 -20 43 129 65 -93 -120 64 90 3 -3 232 2
2198Bk8M2j13L0L4K71k14N9M3j27j61Q5m9R9J49k16K7J4K50j98m2j86J20J46j35
$$ 2 -26 16 -97 -67 -33 238 24 83 126 -1 -162 -77 -126 -27 122 -94 -67 -53 197 -1 -43 -229 -109 37 -98
2223i8P1J69j51J53o5j70j67L81m4J52j33j43J39J3J17ll43M6K25l52L05qlJ35
$$ -98 -27 142 -9 144 79 -91 -258 123 79 231 98 -45 94 107 224 221 -122 -76 149 -203 102 94 91 226
2247B26q5l40J5K25R7k8o3k12K99j63k19M68l23J72K7R8k42pj75K50J46L5l59
$$ 226 141 -199 -184 41 138 110 47 -165 134 -29 -248 220 -103 69 96 194 -48 -55 -230 20 166 201 -158
2270a58J31r1M5j10J36J22r6Q2k70J88k46K51k03J47N6k28K47o7J45r8m7n0K38
$$ -158 -27 -118 -73 -183 -47 75 -21 61 -209 -21 -267 -16 -219 -72 -16 -244 3 -64 81 -17 -64 -114 124
2293A24L7k77N1K1R9k45L26j35q7K20j83J14M9q7K8k04R3K5j43L9K53r0j46J37
$$ 124 161 -116 -65 -44 55 -190 136 1 -86 134 -49 65 114 27 55 -149 -56 -31 -174 -135 118 28 -118 19
2317A9j35j47J87k09K15J0O3j23K50l18J14J77O9j64l3N7j26J22M8R6R1l84J52
$$ 19 -116 -263 -76 -285 -70 -60 3 -120 130 -188 -74 103 172 8 -25 32 -94 28 76 172 263 -121 31
2340C1J69j95j75o6K12J65l6j57Q7k67L45j14l4Qm7rQ6j31K26M6j14J63R0j85
$$ 31 200 5 -170 -236 -24 141 105 -52 35 -232 113 -1 -35 -27 -74 -83 3 -128 98 144 30 193 283 98
2364I8KK21l27J85P7k69J07m1j2m7l1J68l3j62oK26p7L7j55J74l88M72N1l31J76
$$ 98 100 321 -6 179 256 -13 94 53 41 -6 -37 131 98 -64 -70 156 79 116 -39 135 -253 219 270 -61 115
2389A15j07J35q8N1k5j33K11k45J18J36n5M2j43Q3m87L15M7j57K33l5j63m2J22
$$ 115 8 143 55 106 81 -52 159 -86 32 168 113 155 12 95 -392 -77 -30 -187 46 11 -152 -194 -72
2412g2M0n1o4L28k82PQ8L8j91L90Oj99K7j81J93J45o9k76J58M4K5p8j3j43K87
$$ -72 -32 -83 -147 181 -101 -94 -6 32 -159 231 237 38 65 -116 77 222 153 -123 35 79 104 26 13 -130 157
2437A57Kl61L70k10j61J19O6J0q8J80k78J76J37j84K75k47J88j92L0N2Q5Oj09
$$ 157 159 -202 168 -42 -203 -84 -18 -8 -96 84 -194 -18 119 -65 210 -37 151 -41 -11 41 126 132 23
2460B3j9NJ72k88J89j09J20j93l9J54l35M70k58P5J04l27J11J95R1l13M09j51
$$ 23 4 9 181 -107 82 -27 93 -100 -139 15 -320 150 -108 -33 71 -256 -145 50 141 -172 237 86
2482H6n0J02M8qj31k09J38J44k27n5M19k01K7J07m09K60%P0n4q8J57k28O1J68
$$ 86 36 138 186 178 47 -162 -24 120 -107 -162 257 56 83 190 -219 41 41 111 57 -31 126 -102 -41 127
2506A27n1l59L89q8m4L1K92l23p8p9L90J41o05M86k41j43K78l34L36K0p2P9l08
$$ 127 76 -283 106 18 -26 5 297 -26 -104 -183 207 348 -257 229 -12 -155 123 -211 125 145 73 152 -156
2529a56R2N8M9J18j97j90K90k7m1LQ9j24n6j16K28L0m03K90m3L84l55MJ75P1j95
$$ -156 -64 -6 43 161 -36 -226 64 37 -4 -1 88 -36 -92 -208 20 50 -353 -63 -106 278 -77 -73 102 173 -22
2554b2n0J00Q2J96l28J95l90M46j64k98j68N89l75K58j31j43J6J95J9k15J99P8
$$ -22 -72 28 110 306 -22 173 -217 229 65 -233 -401 188 -187 71 -60 -203 -187 8 27 -188 11 89
2576H9k9k27K57Lq0N4j55j51J27R6J16j12k8k0k86O12r0k06J90j59J9j3l36M48
$$ 89 60 -167 90 93 13 67 -88 -239 -112 -16 100 -12 -40 -60 -346 266 176 -30 160 1 20 7 -329 119
2600A19Q9k82M5m9p6K02r1J30J7K7j65K57j65m2lN8j47R2q0j3P0P5j32l2K77Q8
$$ 119 208 -74 -29 -78 -154 48 -43 87 104 131 -34 223 58 16 13 71 -76 16 -64 -77 -7 68 -64 -96 181 269
2626B69j05j86J07j26O9P7l53L42j92K13K21k91J10k93K30M9k18K35j78JoQJ57
$$ 269 164 -22 85 -41 28 105 -248 94 -98 115 336 45 155 -138 92 141 -77 158 -20 -19 -25 -17 140
2649A40k10k48K07qK91k93J19J64k82J46J08r0l8j61L83k21j0j74J77L6j65M4
$$ 140 -70 -318 -111 -119 172 -121 -2 162 -120 26 134 44 6 -155 228 7 -3 -177 0 36 -129 -85
2671h5j14O5K37k06J07j24M5K29j82K85l50k2K60l45M71o2l84R9J81l80K20P4
$$ -85 -199 -134 103 -103 4 -120 -75 154 -28 257 -93 -115 145 -200 271 209 -175 -76 105 -275 -55 19
2693A9j97L51j46J29j19j53J91J63k64N9K7ml8J46k06J1k61M59j07K4k00k1mL03
$$ 19 -178 173 27 156 37 -116 75 238 -26 33 60 56 18 164 -42 -31 -292 167 60 84 -116 -137 -141 162
2717A62k30J51j91o6L1J99j00J58pj06K4J86k49J19q5n0J31l91L91j79M0J06k08
$$ 162 -68 83 -108 -174 -143 56 -44 114 107 1 25 211 -38 81 -4 -54 77 -314 77 -102 -62 44 -164
2740a64J28J21k37k0J30N5P2J00j96K90j94k65K55p6m3k4J31q4Q4Km02L64K2n7
$$ -164 -36 85 -152 -172 -42 13 85 185 -11 279 85 -180 75 -1 -44 -68 63 -21 63 65 -337 27 49 -8
2764hj53P8J31j59N8m3Q7k56L78k33J52J28k54R2Jj03R2r1J10J27k07J72L8j25
$$ -8 -161 -83 48 -111 -53 -96 -9 -265 113 -120 32 160 -94 -2 -1 -104 -12 -103 7 134 -73 99 137 12
2788A2J22r3j4j10K11p3j00O3j61M8K11Q3k50q9L62j33j07j29j38M71j58J8j8
$$ 12 134 41 27 -83 128 55 -45 18 -143 -95 116 199 -51 -140 222 89 -18 -147 -285 186 28 46 28
2811B8r7O7j32K11J53m03J66J43K62k94j35n8j64J99j4K2J85r0m0m2k34L01m1
$$ 28 -69 -2 -134 77 230 -173 -7 136 398 104 -31 -89 -253 -54 -68 -46 139 49 9 -33 -267 34 -7
2834gj16Q7kJ79l08R5R3P7p9j1j10L40k19j52K24p3Q4J24k78J18k2N3m4k85L55
$$ -7 -123 -36 -38 141 -167 -72 21 98 19 8 -102 238 19 -133 91 18 102 226 -52 66 44 97 53 -232 123
2859A23J7k49K10R8m09J72J9Lk49J5M28J8l1l58k2k0K19J16P5r9m1j45q6K92l53
$$ 123 140 -109 101 199 -210 -38 -19 -16 -265 -250 178 196 165 -193 -215 -235 -16 100 175 76 35 -110 -196 96 -257
2884b57J45M4k9K4n9O5r2K45m1j5J48j66L22m65M3K2N0j9K25m0L5O5j82Q8j60
$$ -257 -112 -68 -97 -73 -132 -67 -159 86 45 30 178 12 334 -131 -88 -66 -16 -35 190 150 185 250 68 156 -4
2909dR3j22j23K68r8R5P6j90p5J14P0j14J00r2j1o7J3J29j7q0J38p6j52J75j20
$$ -4 89 -33 -156 112 14 109 185 -5 -80 34 104 -10 90 -2 -13 -80 -67 62 45 -35 103 27 -125 50 -70
2934g0M0L5n7K07j55q4J94jM3l56K8j6J87J38p2j35J96k04J4J59j20p3K85j02
$$ -70 -30 5 -52 155 0 -84 110 109 152 -204 -176 -192 -5 133 61 -74 122 -82 -68 91 -29 -102 183 81
2958H1n6o2k49M46k89L02l06J65O0n8M0k0m9j36N4p5K10k2m4J23j30K43r9n7j58
$$ 81 25 -37 -286 160 -129 173 -133 32 92 34 74 54 5 -131 -77 -152 58 36 -8 115 -15 228 129 72 -86
2983h6P4J83j26r4j9m8Q7JJ43n3k64K08l1j13j68L59L4j80j64K21M2q5K41q2j83
$$ -86 -12 171 45 -49 -68 -116 -29 -28 115 62 -202 6 -25 -138 -306 53 87 -93 -257 -36 6 -79 162 80 -103
3008a03J26j40J46N7l00L42k37O3J84k79K10j88J76o6j82Q1p2K83k81J57L4K79
$$ -103 23 -117 29 86 -214 128 -109 -46 138 -141 69 -119 57 -9 -191 -110 -182 101 -180 -23 11 290
3030B90k04k59J03M2L1l6J81m24N9J66J9L39k90p0j11J43J43p6j57K35k57J26
$$ 290 86 -173 -70 -28 3 -33 148 -276 -217 -51 -32 307 17 -53 -164 -21 122 46 -111 124 -133 -7
3052gJ57j88j7K24k89J2Q1j85L41k57L04o7O6L8q0r2k4O9j48R3p9N9QQ3k36K43
$$ -7 150 -38 -55 169 -120 -108 -27 -212 129 -128 176 109 175 213 133 41 17 86 -62 31 -48 11 19 102 -134 109
3078A09j00j64m5J01J97K1k40N2K0R2J06j74Q4J55j69K1Q3l33K19J03j46J40J0
$$ 109 9 -155 -200 -99 98 119 -121 -69 -49 43 149 -25 59 214 45 66 149 -184 35 138 -8 132 142
3101A42l59K08Q7j30K5J8j31J55j2k50J21k3L46j64k6J63j12n2l6q2K27j6j46
$$ 142 -217 -9 78 -52 -27 -9 -140 15 3 -247 -126 -149 197 33 7 170 58 6 -30 -112 115 99 -47
3124d7r4J80R4o2j51J66J35k91J79n1J71j74j13m3L70l89J79j9j9R6R1j79p4J21
$$ -47 -141 39 133 71 -80 86 221 -70 109 58 229 55 -58 -101 269 -120 59 40 21 117 208 29 -45 76
3148G6j27j52Q4j12K80j7nQ9j54j28q6K34M9J29R7m23J38l6J0K0K1K24k94J18
$$ 76 -51 -203 -119 -231 49 32 27 116 -38 -166 -252 -18 31 160 257 -166 -28 -64 -54 -34 -13 211 -83 35
3172C5M4l25M6M1K37J0m66L45J67l18L08%r1p9K02k37J4J07r9J89L9q1l33J68
$$ 35 79 -246 -200 -159 78 88 -378 -33 134 -184 124 124 33 -46 156 -81 -67 40 -59 130 169 88 -245 -77
3196g7l0O3r6J46R9k70L82l27K29J85j72q9k78P6J57M0k33J63j94J99L03m10p6
$$ -77 -107 -44 -140 6 105 -165 217 -110 119 304 132 43 -235 -159 -2 38 -195 -32 -226 -27 276 -134 -210
3219b10K49j50j60L56J13q9j88L1L31l34l4L19l40M7J22j04M4j85M6R3J14J68
$$ -210 39 -111 -271 85 198 109 -79 -48 283 -51 -85 234 -106 -59 63 -41 3 -182 -136 -43 71 239
3241B39l81K70j05k54Q6K00N1J8l80L11Q1j13J5j94q3J59J59o2K49k01q1J62m32
$$ 239 -142 128 23 -231 -145 55 106 124 -256 55 136 23 38 -156 -239 -80 79 17 266 65 -16 146 -286
3264b86K02K08L0k17M0m6j6r0K75r6m6L2j27J02o5J41p9K69l46k4J53p1R5j59
$$ -286 -84 124 154 -63 -23 -69 -85 -175 100 4 -42 -10 -137 -35 -100 41 -38 231 -115 -139 14 -57 38 -121
3288a21J74p7j08J72j33J99qk29P8J61l35J35o9kO8J77N3P3l53Q7J59p4lp8O8
$$ -121 53 -24 -132 40 -93 106 98 -131 -53 108 -227 -92 -161 -163 -95 82 135 208 -145 -58 101 27 24 -54 14
3313A4r0O8j84Q7L09l04K68j66O0P0j93K95l20K70l7l82L7J82m9J83j38o6N6R3
$$ 14 -76 -8 -192 -105 204 -100 168 2 62 132 -61 234 -86 184 147 -235 -198 -16 -65 118 -20 -86 -30 63
3337F3J67m02J93J41k40J12l4q5j17K29k09K58n3p1P7j28J62l01L87k1l18K23
$$ 63 230 -172 21 162 -78 34 0 -85 -202 27 -182 76 23 -48 29 -99 63 -238 149 128 -190 33
3359C3J3K0J02l37K75N8Q4l7k32j81L11l15L13j52J5J78o9m6l09J71R8J8o4J9
$$ 33 46 66 168 -169 106 164 248 211 -21 -202 109 -206 107 -45 -30 148 79 33 -276 -105 -7 11 -53 -34
3383c4j27K4J48J32j70K55j71lp1K42l30J77k68K47j47n0K00J8m5K36k69j4J27
$$ -34 -161 -137 11 143 -27 228 57 54 -17 225 -105 72 -196 51 -96 -146 54 72 27 263 -6 -20 107
3406A07k01J38r6lJ4O5j05L14m11K73M4pr7j4j19K32k24r1J97N9k0J3rj22Q1j19
$$ 107 -94 44 -52 -55 -41 24 -81 233 -178 95 139 132 35 21 -98 134 -90 -181 16 75 55 68 59 -63 18 -101
3432a01J63j91J16j4Oj56K57j56K9K5p6J09q4J54k47P8J38k18M23o05M20O6J27
$$ -101 62 -129 -13 -27 -21 -177 80 -76 -47 -22 -98 11 -73 81 -166 -88 50 -168 255 -350 70 136 263
3455B63k86M2p7J89j09O2m0k26P8R5J13k60j82M05j65N0l3J82k9r5M1j36q7K24
$$ 263 -23 19 -58 131 22 84 44 -182 -104 -9 104 -156 -338 67 -98 -48 -81 101 72 -23 18 -118 -205 19
3479A9l8J20j45P7n3P2j02N6M8j24O5j23K14jJ9j34R7n5J88k2k13M8mK93l47o7
$$ 19 -19 101 -44 33 -20 52 -50 6 54 -70 -5 -128 86 85 104 -30 67 12 200 178 -35 13 9 302 -45 -112
3505a12K53r8j34K80k57j37M30q6O5j93k1j30K02j65J39j81J23J21j01n5K17j39
$$ -112 141 43 -91 189 -68 -205 225 139 204 11 -10 -140 62 -103 36 -145 -22 99 -2 -57 160 21
3527B1q7J34K05l19J33j7j21J45k76J71l9N3no9j80K33n6J0j44J37p2K00k91Q1
$$ 21 -66 68 273 -46 87 70 -51 94 -182 -11 -50 3 -2 -71 -251 -18 -74 -64 -208 -71 -143 57 -234 -153
3551a53L52j76j80L4l6J90m13M22j92K20r6Ml8K24j33l7k57L03p9j08J85J52k53
$$ -153 199 23 -157 -123 -159 31 -382 40 -152 68 -28 -24 -62 162 29 -8 -265 38 -41 -149 36 188 -65
3574f5j17J41J48n4l0Kj74L00j59K34k50K33l13k9K23oO6j08Lm2m6j21J01J22
$$ -65 -182 -41 107 53 23 25 -149 151 -8 226 -24 209 -104 -133 90 84 150 42 45 3 -43 -164 -63 59
3598E9m8k3J5J00M3j95k5N8J19j55J59p1k24K52n4p4j28K49j58LK06k09L2K89
$$ 59 11 -12 3 103 146 -49 -74 -16 103 -52 107 36 -188 64 10 -64 -192 57 -101 -98 108 -101 -69 220
3622B20l24K34J40k38J11n2k20L6J18j95L11l44Q0K95j88J26n8j69J17k7j09K62
$$ 220 -104 130 270 32 143 91 -129 -93 25 -170 141 -203 -123 172 -16 110 52 -117 0 -27 -136 126
3644A26o7j13J13J44j88p5L7j37Q1J09p6J71j63O7P8j44l6j33K47O0j0j5J81l82
$$ 126 59 -54 59 203 15 -60 -23 -160 -79 30 -46 125 -38 29 107 -37 -73 -206 41 101 91 76 257 -125
3668a25K38Qj73K3k19J58K00j92LK97m70L59J2r9Q2j94J87j07Q3j5j12R1Q1o8
$$ -125 113 121 -52 -29 -248 -90 110 -82 -79 218 -252 107 119 20 102 -92 95 -12 71 56 -56 35 116 48
3692D8K9Ok6q7j13J46L1j68K17N1p9j71J3M0k90K84R1K37k22j14k9L06j40M5N8
$$ 48 77 83 57 -30 -143 3 34 -134 83 134 55 -116 -103 -63 -353 -69 22 259 37 -77 -106 200 60 105 163
3717A63M4j78J50j47j24j08M69j77j89p2K05L5j94N8j23K6J17P7R5k14K7k0qJ52
$$ 163 207 29 179 32 -92 -200 269 92 -97 -169 36 71 -123 -65 -188 -162 -45 32 127 -87 -60 -80 -88 64
3741F4J57j16k14J95j45J1R2P0r0R8l30J27NJ95k21K57j03k22J09J73k81K19q8
$$ 64 221 105 -109 86 -59 -48 44 114 24 122 -208 -81 -76 119 -102 155 52 -170 -61 112 -169 50 -38
3764c8n0j8j24N36m91L06m9r8K91l66j48M2J01J59qK37j65j33j29R0R1Q9j5p9
$$ -38 -88 -106 -230 306 -185 121 72 -26 265 -101 -249 -207 -106 53 45 282 117 -16 -145 -55 36 125 110 31
3788C1J22j48o2j82K54k9N4j42L45j93j38P4J01k75J99m9J70j19o6lJ6j05J97
$$ 31 153 5 -57 -239 15 -14 40 -102 243 50 -88 -14 87 -188 11 -38 132 13 -53 -56 -40 -145 52
3811E2r8j2P9n9N7Qj95J50J10ok1m19L80M0l7j26J4k7J86j89p2M01k60J8k0Q1
$$ 52 -46 -58 21 -38 19 27 -168 -18 92 86 65 -354 26 66 29 -97 -83 -110 76 -113 -185 216 -44 -26 -46 35
3837C5j5O3l0J24r4o4k33J84Q3j62N2Q2J14l35N0J24M4P7Lqk45J53l9j99K14j23
$$ 35 20 83 53 177 83 19 -214 -30 53 -109 -57 25 139 -196 -146 -22 22 99 102 94 -151 2 -37 -236 -22 -145
3863a45J09M15l92m1K0n0R1O0j35K98l95J08QL18k03l28J8M06o8j22O7Q3k30J2
$$ -145 -36 379 -13 -54 -34 -84 7 67 -68 230 -165 -57 -49 269 66 -262 -244 162 94 -28 39 122 -108 -96
3887i6k14K47o3J15r2q4K05j50L63m32K21o6J1J20M1J14k09k07K20K03k9k82M8
$$ -96 -310 -63 -126 -11 -103 -187 18 -132 231 -201 20 -46 -35 85 126 240 31 -176 44 247 218 -64 -16
3910a6j67J24PL03j71L1l15J80J54n21L40p0L82j85k40J0P2M29n26K79j71K26
$$ -16 -183 -59 -52 251 80 111 -204 -24 130 -391 -51 -121 261 76 -164 -154 -82 347 -179 100 -71 155
3932A55m8k8o7j06O4J00M9j36J15M3j35j34j04P4K22j09k28K66r9Q1P2j01m8M6
$$ 155 107 79 12 -94 -30 70 119 -17 98 141 6 -128 -232 -158 64 -45 -273 -7 -106 -25 47 -54 -102 -56
3956e6K93k82m7J10J8j21m5J8r8R8R1J03k45L71k44M11n92L28Q3l09J24J79k66
$$ -56 237 -45 -92 18 36 -85 -130 -112 -210 -112 -21 82 -163 208 -36 375 -217 111 194 -115 9 188 -78
3979g8l5J71k06L90k58j23J26k68K59j33J32p7n0l8L98r1l61M03j1o1j80r3P9
$$ -78 -113 58 -148 242 -16 -139 -13 -281 -22 -155 -23 -100 -150 -188 210 119 -242 161 150 89 -91 -184 -105
4002a05J25o5j60K28j20K20j71K24j73J49K3k44R7R7L4j29M1J71m88K21Kj51J49
$$ -105 20 -45 -205 23 -97 123 -48 176 3 152 175 -69 28 125 159 30 71 242 -246 -25 -23 -174 -25
4025b5n8k7qK11r8J60j62J50j44J02K8j36j69K33%r5J69j85J19Q6j87j70R7J07
$$ -25 -83 -110 -118 93 -5 155 -7 143 -1 101 129 -7 -176 57 57 -38 131 -54 65 151 -36 -206 -109 -2
4049bl09K63J90j12j89L64k00j65M8P4L54p0l14Q6Q1j73J73n7j17L69k10j23P2
$$ -2 -311 -48 142 30 -159 205 5 -160 -112 -38 316 246 -68 18 99 -74 99 42 -75 294 84 -39 33
4072C3p2N9Q3m6j30j46J06j24M23r2j47J23j46K41k75j97J93R7J49k44K53j42
$$ 33 -39 20 103 57 -73 -219 -113 -237 186 94 -53 70 -76 165 -110 -307 -114 -17 132 -112 141 -1
4094aP8j57j60L90j13P7j16PJ3l24N49r0k44K8j09J73Ql54M37o9J70j88L0j13
$$ -1 77 -80 -240 150 37 114 -2 5 18 -306 243 153 -91 -63 -172 1 9 -345 92 23 193 5 35 -78
4118g8L03l04J06ml88N03j75p4o7K79j55j4j7R2j51K34M4j0J0j05l9M1K8k54L06
$$ -78 225 -79 27 23 -365 138 -37 -111 -178 101 -54 -68 -85 7 -144 90 134 124 134 29 -10 31 59 -195 111
4143A11j10l8J2k8q5K17p4p1J33jJ20k33K26k16L07n25J82m5K09M0l30J63M22
$$ 111 1 -37 -25 -53 -138 79 5 -66 67 66 186 -47 179 -37 270 -255 -73 -118 91 131 -199 -36 386
4166C86k91r5r1J03MJ35K7k59J6J43p0J76L5j84m7r3J33K75l25%K07q8k7q5r4
$$ 386 95 0 -91 12 16 151 178 -81 -65 78 8 184 219 35 -12 -105 28 303 -22 -22 185 97 70 -15 -109
4191a09K8K02pL4m2p9k4Lk5j37L49j35L0j48k19J61K25j49N8N9M1q6M3k17K15
$$ -109 -81 121 114 148 106 27 3 6 -19 -156 193 58 88 -60 -279 -118 107 -42 16 75 116 30 73 -144 71
4216G1m8J08L3l95M51l36J93K8p0r6J26j26R5l30L39R8k45J21j56J60J7K16l87
$$ 71 23 131 164 -231 220 -116 77 105 35 -61 65 -61 34 -296 43 141 -104 17 -139 21 38 254 -133
4239a33J30L1q1j48K38k08K06rj8k8k2P0k71L60N0Q0k28j94J96K08m01J16K52
$$ -133 -3 28 -53 -201 37 -171 35 26 8 -20 -42 28 -243 117 167 247 19 -175 21 229 -172 -56 196
4262A96q1l7Kk64J58N5K0j55j0J20l58J11K92k38l9J69K08k67K15L08n64J68j26
$$ 196 115 78 80 -184 -26 29 49 -106 -116 4 -354 -243 49 -189 -228 -59 149 -118 97 405 -159 9 -117
4285a17K23m3j13R2J39j86l0mj18Q2L3K1j35L58l30K65j60j58o2J44J34j15M6
$$ -117 106 63 -50 42 181 -5 -35 -39 -157 -75 -42 -21 -156 202 -128 137 -23 -181 -243 -99 35 -80 -34
4308c4k58K75R2k35L31j57Nj02P9J66k99mJ21K26k24q5n2J60N9k19j33K97Qj44
$$ -34 -292 -17 75 -160 171 14 19 -83 -4 162 -137 -141 -20 206 -18 -103 -155 5 64 -155 -288 9 17 -127
4332a27N05l32J80k73k33J98KL19k34j37j8P7K12j62mJ29n0n3L6J08j43K4Q5J4
$$ -127 378 46 226 -47 -280 -82 -80 239 5 -132 -150 -73 139 -23 -27 102 52 -1 35 143 0 24 109 123
4356A23k13M9K05m68L06q7R7jp3Q0j46J04p9O1J01k76J43J35j46M0j36P3l3K75
$$ 123 -90 -41 164 -304 2 -85 12 11 -62 18 -128 -24 -103 -42 59 -217 -74 61 -85 -45 -181 -108 -141 134
4380A34j12k84M45k95K06j47K27k24J15j97K33O7q0k96K07k3k7m7L6p8P8P7kn
$$ 134 22 -262 183 -112 94 -53 174 -50 65 -132 101 168 88 -208 -1 -24 -51 -98 -62 -140 -62 15 13 8
4404HK13Jl55K15N8k50OK10j22P9j4K4k95M8JL35l41K29j53j71N17j95j4M0k0
$$ 8 221 222 -133 82 140 -110 -104 106 -16 63 49 73 -222 -174 -173 162 -179 50 -103 -274 243 48 34 74 54
4429E4l5q3J88j72J41p4Q6M7l71K06k4O8qj86K01j40K0M8l9J51k57k9L54j79J19
$$ 54 19 -64 124 -48 93 19 105 152 -219 -13 -37 31 23 -163 38 -102 -82 -34 -73 78 -179 -208 146 -33 86
4454H6j19m1K62j15k50R3K31l28J90Q7j40J04j3k63L44j67Q1J8j17P2M2p7O1l7
$$ 86 -33 -74 188 73 -177 -84 147 -181 9 96 -44 60 47 -216 128 -39 42 60 -57 15 57 -20 41 4
4478DK2J17o8k83M06L2l65R5N7k1m7Ro7R7j67K24J44l24N7J84j73Q1j1j89L21
$$ 4 26 143 75 -208 198 230 -135 -40 17 -4 -51 -42 -109 -12 -179 45 189 -135 -78 106 -67 14 3 -186 135
4503A35j57O7k8q9J27o4n9o2Q0q0P9N2j78J0J81m2j84J85M1J18k81k0N7J15o0
$$ 135 -22 45 17 -72 55 -9 -68 -130 -50 -130 -51 1 -177 -167 14 -28 -212 -27 14 132 -149 -169 -112 3 -57
4528e7j12K61j79q3K12k04K88k8k80L10j43K43k03l6j60J57m9o0J8K8K9L4j19
$$ -57 -169 92 -87 -170 42 -162 126 98 -182 128 -15 228 25 -11 -171 -14 -63 -123 -105 -77 -48 -14 -133
4551a33J31L05n59J19J1K76j58J54k8j77P1K19j87k6J71k29L2Q5k53K88j27j6
$$ -133 -2 303 -256 -137 -126 150 -8 146 118 -59 12 231 44 18 189 -40 -8 77 -176 112 -15 -31
4573c1J7P8K33k83J34j57n2O0j80K51j47m8J20nO5l8j60K58l03J25J86k05J02
$$ -31 -14 64 297 14 148 -9 -61 -1 -181 70 -77 -125 -5 -10 55 17 -143 115 -188 -63 123 -82 20
4596B0QL1K6N8m42M66lj80J00j56O4P8r4J30m5k03K87l32L34k06J34l8J17N2k13
$$ 20 28 59 85 143 -299 167 164 -16 84 -72 -8 70 -24 106 61 -142 145 -187 147 -59 75 37 154 206 -7
4621go5J0L0r1K37M6l88K69l70M04k31l5K76j35Qk43l1K62rK41j80j81R8p4J98
$$ -7 -72 -62 -32 -123 114 160 -228 41 -329 75 -156 -191 85 -50 -42 -285 -316 -54 -63 178 -2 -183 -85 -159 39
4646C9R8k81L59q8J06m3K5j69J37K7O6m5j4j10l03L63k40R6J32k08J52j49N9l20
$$ 39 137 -144 215 127 233 190 215 46 183 210 276 231 217 107 -196 167 -73 23 155 -53 99 -50 9 -311
4670c11L06J02J6k8k92K11p4J76J1Rj57p3K66j52M9K8l98K36P5qj65K7J18o8Q6
$$ -311 -5 97 113 85 -207 4 -70 106 117 126 -31 -104 162 10 59 87 -311 -75 0 -8 -173 -146 -28 -96 -10
4695a0R7j7k43K72j18l7R1r7K07j80k1J9k62K26J52J1j76J61K64j26l29j09J44
$$ -10 87 70 -173 99 -19 -56 35 -62 145 -35 -56 -37 -299 -73 79 90 -86 75 339 213 -116 -225 -81
4718h1j09K49r5M5l2K02k52L05o3k35q1K34j89O9J36l75J05J05J29P9j29rn1m5
$$ -81 -190 59 -36 9 -23 179 -73 232 169 -66 -147 87 -102 -33 103 -272 -167 -62 67 146 17 8 -43 -88
4742h8J30j38M42l68n9P7j28j2K33m0k16Q1Q9J93k27r9J32p9pL05j03q0J38k65
$$ -88 42 -96 346 -22 -81 -4 -132 -144 89 49 -167 -86 3 196 -31 -130 2 -77 -84 221 118 38 176 -89
4766h9K28p3j33n2J38j53P8K4k2n9J48l1J62j4k81K37k41n1Q7j45K1K83o4l3r7
$$ -89 139 66 -67 -119 19 -134 -56 -32 -54 -113 35 4 166 152 -129 108 -133 -184 -97 -242 -221 62 -2 -35 -132
4791a32n5K25K1k04L11k12J09q3j01K39j67J2R6J19k93M6j14P4J09P7k62J04l7
$$ -132 -187 38 59 -145 166 -46 63 -20 -121 118 -49 -37 59 178 -115 -69 -183 -109 0 77 -185 -81 -118
4814a18K52l8M3k37P8K51j09k77j59M35R0k08j39R5m8j96K82P8n34J78M45O9j20
$$ -118 134 96 139 -98 -20 231 122 -155 -314 121 211 3 -136 -41 -89 -285 -3 75 -459 -281 164 233 113
4837A13kk92L23q1p9Q9l81L87l28L65j47jK37m98J25K20m7R5j27P8O8l5J1K6j10
$$ 113 111 -181 142 61 -18 71 -310 77 -251 114 -33 -34 203 -295 -170 50 3 98 -29 49 117 82 93 119 9
4862IO6j51j7K08j63p5K59k95J91Q6k18J18k42R6M5R1K01R8l91j44M33j71L8m4
$$ 9 75 -76 -93 115 -48 -123 136 -159 32 118 -100 18 -224 -128 -83 8 209 307 -84 -228 205 34 72 28
4886B8Nj40L92l07J23j78l0K88k5l4J93k94j03J46n7J95k0j8k02J66j26R6j06
$$ 28 33 -107 285 -22 101 -77 -107 181 156 122 315 21 -82 64 7 202 182 164 -38 128 2 98 -8
4909hj79K38q7L62l97K08j51P9k57J76q5K42Q3l13J03j69J21o1J27j20J23O3p0
$$ -8 -187 51 -36 326 -71 137 -14 65 -192 -16 -101 141 224 -89 14 -155 -34 -95 32 -88 35 98 28
4932B8k16J0L54k22j60J87P7n0K23j03P6j43k22L15m08M80j62m3j2J2q9J06R2
$$ 28 -188 -178 176 -46 -206 -19 58 8 231 128 204 61 -161 154 -254 226 64 21 9 21 -68 38 130
4955A30q4O7k27p1j6j03M01n1j06M57l30j71K32k6j88K41j66j15K29j97L12j52
$$ 130 46 113 -114 -185 -201 -304 97 46 -60 397 67 -104 128 102 -86 155 -11 -126 103 -94 218 66
4977F6j07m8J49j83J19Q3J19j93r0J49k99M04J15k57j45k49L91J89k06L4o8J86
$$ 66 -41 -89 60 -123 -4 79 198 5 -85 64 -235 169 284 27 -118 -367 24 213 7 41 -27 159
4999A59qj09j42Q7k13L67n2j27R6n7k79J80L5J92j41L8K5k14J78j55J89j60J70
$$ 159 151 42 -100 -13 -226 141 89 -38 58 1 -278 -98 -63 129 -12 26 51 -163 15 -140 49 -111 59
5022E9j79J36j88J94l2M3j04O6k9J17J33k29j03K28K4pj21L7j28J62r8Q9p6J07
$$ 59 -120 16 -172 22 -10 33 -71 -5 -34 83 216 -13 -116 112 136 129 8 45 -83 79 -19 70 -6 101
5046A01m0j24j31R3J36j55M6m7J69J64n79L86J22p6o2O3l9k7N7j08J65p1l5J2
$$ 101 61 -63 -194 -101 35 -120 -74 -121 48 212 -367 19 141 65 3 66 27 0 57 -51 114 43 8 20
5070B0r1j00K67k20J05j35K26J5n6j93J12P6j74Q8J66J18j70l8j20j2J14J40M5
$$ 20 -71 -171 96 -124 -19 -154 72 87 31 -162 -50 26 -148 -60 106 224 54 16 -104 -116 -2 138 183
5093A83j56lK55j36N7j25j42R2o7J30l51K44M4P8j70R9j20J49m30M39k21J41O0
$$ 183 27 24 279 143 200 75 -67 25 -42 88 -263 -19 25 103 -67 32 -88 61 -369 70 -151 -10 50
5116E0L2j23K31l59J35L21m01L19Nj38m22L23K18k15Q3N7k5J79l43J52k12M08
$$ 50 82 -41 190 -169 -34 287 -114 205 210 72 -350 -27 191 -24 59 116 91 270 -73 79 -133 275
5138B75j04j44Rj86P6L0J78l21K43J30Nj42k01J49q7Q1M3l22J26J73j07J78k73
$$ 275 171 27 36 -150 -74 -44 134 -187 56 186 191 49 -152 -3 -90 -9 34 -288 -162 11 -96 82 -191
5161a91J96n9J77j27k76L36j22J62j82N9LJ6L4P8j49J30j23k4L9R5o8N9Q7r9r0
$$ -191 5 -54 123 -4 -280 56 -66 96 -86 -27 -24 -8 26 104 -45 85 -38 -62 -23 72 4 63 150 51 -39
5186c9j49m8J99N6m5j5K21k51k11K16q6K30k52K07J4k6j20J92j40l7L3K86k97
$$ -39 -188 -236 -37 19 -26 -41 180 -71 -282 -66 -152 78 -174 33 47 21 -99 93 -47 -84 -51 235 -62
5209f2k6o2K23l0J4P7j08N5j57L01r1j21j7P3o8r8R7m0%m4M14m08l6J08Nn9j11
$$ -62 -88 -150 73 43 57 134 26 81 -76 225 134 13 -4 69 1 -97 0 -40 -40 -84 330 -78 -114 -6 -1 -60 -171
5236a71q2K30K39j50o2J0K73m01n6R6K58m8k08L69l05j03K0j13K67K1R0j02k25
$$ -171 -253 -23 216 66 4 14 287 -114 -170 -74 184 136 -72 297 -8 -111 -91 -204 63 84 174 72 -153
5259a53L29o9J35l67J58j2K8J57l73M63l81j65M63k38L6J44j68p6J52j44o6J31
$$ -153 176 107 242 -125 33 21 49 206 -167 296 -85 -250 213 -25 11 155 -13 -89 63 -81 -147 -16
5281a6J1m0k80L52M2J22k29o7Q8J16J12k33J05n9j74J86J16l18o9J6K57l9J2m1
$$ -16 -5 -45 -325 27 69 191 -38 -105 -17 99 211 -22 83 24 -150 36 152 -166 -235 -219 38 -1 11 -30
5305c0l7P9Qr5k7N4jJ29j9j60J56m2J33l52m3K5J8J23J60j04L5Pr6J21j43J68
$$ -30 -67 12 20 -75 -102 -48 -49 80 61 -99 57 15 148 -204 -247 -222 -204 -81 79 -25 10 17 -79 42 -101 67
5331F7Jk82J93L32k33q2j06j7L02j94p9k71O42M4m57J60K1J64p5k65K4n1K14k6
$$ 67 68 -214 -21 311 78 -4 -110 -127 175 -19 -98 -369 273 317 -140 20 41 205 130 -135 -111 -162 52 26
5355B6O7N4l32J96N4q7o8J19PL9l6l94M09j72j14J22n4J54J05k21J84k0o1k52
$$ 26 93 147 -185 11 65 -22 -90 29 36 75 39 -355 54 -118 -232 -110 -164 -10 95 -126 58 38 -23 -275
5379b75M10j65k4J59k90N0R8J55k66J33K12j86P4k80J37j12J80O3J1R7O7m52K34
$$ -275 135 -30 -54 105 -185 -135 -37 118 -148 -15 197 11 85 -195 -58 -170 10 73 84 181 248 -204 30
5402C0J20k85L06l63K40J07m1j05l7J61m36L31O1q1k4K52k36K00j34l00L75o2
$$ 30 150 -135 171 -192 48 155 114 9 -28 133 -303 28 89 8 -16 236 0 200 66 -234 141 79
5424G9o9J00p7m6j2PO9l02L92j53K06l29K58k85l2K01J81k03p3R7m7kL5O9Pj66
$$ 79 10 110 33 -13 -25 -18 51 -251 141 -12 194 -135 123 -162 -194 7 188 -15 -88 9 -38 -40 -5 64 71 -95
5450i5kj54M27k93N1j3m3L46k09n6J88m1j56o5K95k13K6L3J50j73m1K7kk29K34
$$ -95 -97 -251 176 -117 -66 -79 -122 224 15 -41 147 106 -50 -115 180 -33 -7 26 176 3 -38 -11 -13 -242 -8
5475hj01J48O9k07JK15J69j02k34J17Q2j70L4K7J4j58n1J57j56J78j19p8M31l05
$$ -8 -109 39 108 -99 -98 117 286 184 -50 67 149 -21 13 40 54 -104 -155 2 -154 24 -95 -173 258 -47
5499d7J61J23k61J82K6k59N4r1P3J22j19J71l90L53L3k74J11L5l55K74J48q5K18
$$ -47 114 237 -24 158 184 -75 -21 -112 -39 83 -36 135 -255 98 131 -143 -32 3 -352 -78 70 -15 203
5522B03j28j93J44j46J6k96O01j74o2P9o3J31k64%Q2qm2K0K42o9j7N1N1m92K35
$$ 203 75 -118 26 -120 -104 -400 201 27 -35 44 -19 112 -152 -152 -70 -78 -120 -100 142 73 56 107 158 -334 -99
5547i9l2O6Q6JK03m41K97N0k34J34k39K43j35J55k63L45j14j44J49J6k87J91r6
$$ -99 -131 -65 21 22 225 -216 81 131 -103 31 -208 35 -100 55 -208 137 23 -121 28 44 -243 -52 -148
5570a48QL3K44j13k20K78k09Q4O5K6p6n0J05J00m35J86J45J15k45J17j39M01j54
$$ -148 -140 -107 137 24 -196 82 -127 -43 22 48 -28 -78 27 127 -308 -122 23 138 -107 10 -129 272 118
5593A18K1P2k39jP9M4q1j51o6K20j27J2J20j1J53j16K0k9j81J6K47L3j83K10j57
$$ 118 139 211 -28 -29 50 94 13 -138 -204 16 -111 -99 21 10 163 47 67 38 -143 -127 120 153 -30 180 23
5618B3j7j1j34JM33l24M6L8k38J96n5J7J27k37K37Jj07L88k94k73K35j10J07K0
$$ 23 6 -5 -139 -138 295 -29 17 55 -183 13 -42 -25 102 -135 102 103 -4 384 90 -183 52 -58 49 69
5642F9rj3K7P8j33o7N8N6j67j1J73l3o9j03J09J33M4q5j38K29j93Q5j2J84k87
$$ 69 60 47 74 152 19 -48 10 66 -101 -112 61 28 -41 -144 -35 98 142 57 -81 148 -45 40 28 212 -75
5667g5oP0j1l0MJ03j02j32K43Q0k47J28o4n1oK83k32K89l53J06j03N0j44J18n2
$$ -75 -81 -11 -22 -52 -48 55 -47 -179 64 144 -103 25 -39 -90 -96 187 -45 244 -109 -3 -106 -56 -200 -82 -134
5692a34K84M3j54J34l77M14j98j20K35j73N4M3o0p2p8L73k25M8k57K35k13M26
$$ -134 150 193 39 173 -204 210 12 -108 127 -46 8 51 -9 -81 -159 214 -11 37 -220 15 -198 228
5714B28k05J67j05J78k64J99l3K3j38l33K04K78r8l8k9K2M0j8j66l2K41p8q3Q1
$$ 228 23 190 85 263 -1 198 165 188 50 -283 -79 199 101 63 34 56 96 78 -88 -120 121 43 -40 41
5738D1J65k8k43K35j32m2j30J74J8k09L71l13Q2l6Q6l60L80P6N4l39L21l38J52
$$ 41 206 178 -65 170 38 -4 -134 40 58 -151 220 -93 -11 -47 39 -321 59 135 189 -150 171 -167 -15
5761a5J61j12k2%k20L82j07j31J42k12K09j17J45j43J14K09j65m22K72K03o8K2
$$ -15 146 34 12 12 -208 174 67 -64 78 -134 75 -42 103 -40 74 283 118 -304 -32 171 103 125
5783A25l28N23l52K5kj69K20j22L38l02%K42l54l0J84J06l22K79J89m15K71j67
$$ 125 -203 320 -32 -7 -9 -178 42 -80 258 -44 -44 198 -156 -186 -2 104 -218 61 250 -165 106 -61
5805f1k30J77K12o8L04m31QJ2K19k25J88j22M3M0j72J63j60J63N9j91l0j1J50
$$ -61 -291 -114 98 30 334 -97 -89 -77 142 -83 105 -17 26 66 -106 57 -103 60 119 -72 -102 -113 37
5828C7n8j66n4Q2R4N8K0j88K41m4Lj13J92n1l2j70l2K27j1k3K1J8j62K68j29j56
$$ 37 -21 -187 -241 -159 -65 -7 13 -175 66 22 25 -88 104 53 21 -149 -181 46 35 12 33 51 -111 157 28 -128
5854a28N5M07k45k21J73j18R6j15oK76pk07M45k34l07j05N66m21J58k7q4J87j58
$$ -128 -73 334 89 -132 41 -77 19 -96 -102 174 167 -40 405 171 -136 -241 325 -96 62 35 -49 138 -20
5877b0L0K0j73L7K96k14j9J90j46K4P9l3j74K23k05K25o5L6k2P1j57j52L08m29
$$ -20 10 30 -143 -106 190 -24 -43 147 1 25 104 71 -103 120 -85 140 75 111 89 160 3 -149 159 -270
5901b70K44o0Q2K3j92K48RK8k57O9J10j25q9J08K1k16L78l30K00k13J06l8J91
$$ -270 -26 -86 -4 19 -173 75 84 112 -145 -76 34 -91 -180 -72 -51 -267 111 -219 -19 -232 -126 -164 27
5924B7N3j84L1O0n9pK04k13K40o0k36r2K07RO3k95M19k31J63k47L16q4l44K98
$$ 27 80 -104 -73 -13 -72 -79 125 -88 152 92 -144 -236 -29 -20 43 -252 167 -64 99 -148 168 84 -260 38
5948C8p6q2L7N29o59L31k25r7R2L5K9K0J20L4kk87J69l42J32K37j31Q0J29j82
$$ 38 -38 -120 -83 446 -213 118 -107 -204 -112 -77 -48 -28 92 126 124 -163 6 -336 -204 33 -98 -18 111 -71
5972g1k1K9n4q6n1J97n8K47l21L68M7k80L01l20Q4l21L85q9K7K54Mk91K00m00
$$ -71 -92 -63 -117 -203 -254 -57 -115 132 -189 179 226 -54 247 -73 11 -310 75 -14 13 267 271 -20 180 -220
5996b20K41J09p1qj74J02K7MJ28k67K51j69j24J27j5J81j89k1o6N9K2K26n5k48
$$ -220 21 130 59 51 -123 -21 6 10 138 -129 122 -47 -171 -44 -59 122 -67 -88 -154 -95 -73 153 98 -150
6020a50J99O6o4M8k15J66k0P2k48L07k62m7J83k42RK17J30p5P4n7j24j62L32l57
$$ -150 49 115 51 99 -116 50 30 102 -146 161 -101 -148 35 -207 -198 19 149 74 148 91 -33 -195 137 -220
6044b20K80K40l19K50j69J09j71j47O6R1p0K5q0J08K2O9m2j32O5J68k02J90P1
$$ -220 60 300 -19 231 62 171 0 -147 -81 10 -60 -35 -115 -7 15 84 42 -90 -25 143 -59 131 202
6067B02q1r4J37j20J96p2l9m9j62K39k19j9J65J20n1k48R6Q9r0J2k37K04Q2J27
$$ 202 121 27 164 44 240 168 129 80 -82 157 -62 -81 84 204 153 -95 1 90 0 12 -225 -21 61 188
6091A88k76K72j95L3K3r2j06J07Q0k32J76j07O2J04j03Q3o9O9O3j40J71j29l3
$$ 188 -88 184 -11 22 45 -47 -153 -46 34 -198 -22 -129 -67 37 -66 17 -52 17 80 -60 111 -18 -51
6114e1K09r8k56R2J35l6J62k23N8q0Q1R0qq0L2j23j65R6J66q2J27k25K03M7j45
$$ -51 158 60 -196 -104 31 -5 157 -66 -8 -88 -7 83 75 -5 27 -96 -261 -165 1 -81 46 -179 24 71 -74
6139g4J26j35L5k0j02J05j85J35rJ11J55l3j03m5K08k30N7J27j5J12k22j06M1
$$ -74 52 -83 -48 -68 -170 -65 -250 -115 -124 -13 142 109 6 -39 169 -61 -4 123 108 220 -2 -108 -67
6162f7k9L30j20j20QN8j16M1j15K45l6J54j49O6j69j01J87M0M07m86J49j15m5
$$ -67 -96 234 114 -6 2 60 -56 -15 -130 115 79 233 84 150 -19 -120 67 107 514 28 177 62 17
6185A7j20Q3K6k7r8L31l38J23k8o6J06j73L2L16k55K84j37l21K25R1j08o4J76
$$ 17 -103 -20 6 -21 -119 212 -126 -3 -31 -97 9 -164 -132 184 -71 213 76 -245 -20 71 -37 -101 75
6208G5O4P4l27J32J11j29k3P8q2P2m5K2K52k92k62J04J59m0j5O1l46L76O3q4m9
$$ 75 139 213 -114 18 129 0 -23 55 -27 45 0 22 274 -18 -280 -176 -17 -57 -72 -11 -357 19 82 -2 -51
6233e1j42Q3J17J07j3n9l51K65j5l7j39P1K62j45k9N9J09q9J4m1j85L17K4l11
$$ -51 -193 -110 7 114 101 42 -309 -44 -59 -96 -235 -164 98 -47 -76 -17 92 3 17 -24 -209 108 132 -179
6257a79K6J19J74m5r9k38j2J27L6j35J1K54k0k74J31k9J85j36j12K07j36L43l21
$$ -179 -153 -34 140 95 -4 -242 -254 -127 -91 -226 -215 39 19 -255 -124 -153 32 -104 -216 -9 -145 198 -123
6280a23L16j94P2j45j01J26J7K25j01l09K16j6N8n8r6K15l13M4L02o5r1n1J1R0
$$ -123 193 -1 71 -74 -175 -49 -32 193 92 -217 -1 -17 41 -17 -113 102 -211 -167 135 70 -21 -72 -61 29
6304B9J8j44K25qJ78J5k46R2k47J40j33J23k34L53M9j21j77L81n8k43J8J29j82
$$ 29 47 -97 128 120 298 313 67 159 -88 52 -81 42 -192 161 210 89 -88 293 235 -8 10 139 -43
6327d3J57k3nJ8r9R2j75K49k70r1J63k38N2r8K72k2K00j25j41MQ7N8k44K7K25
$$ -43 114 91 86 104 5 97 -78 171 -99 -190 -27 -265 -213 -311 -39 -61 139 14 -127 -123 -36 22 -222 -195 30
6352C0l6j29J03j13J48J11k92M3J45j02R9k85M04j95k86L07J31j7o8j32J68j4
$$ 30 -6 -135 -32 -145 3 114 -178 -135 10 -92 7 -278 126 -69 -355 -48 83 66 -2 -134 34 20
6374B0K2j74J40J78l81L01j49j13K72k20j5J02J7O6Q5k99oL03j45R3m0j49N0J72
$$ 20 42 -132 8 186 -195 106 -43 -156 116 -104 -119 -17 0 66 151 -148 -154 149 4 97 57 -92 -42 130
6398A30k15J18l7lK2P5M4k8K29l39R7k05MK33k11q3Q7r1M70n63J46J79j24Q7J81
$$ 130 -85 33 -4 -7 15 90 134 106 335 -4 93 -112 -108 125 -86 -169 -82 -173 297 -266 -120 59 -65 22 203
6423B03j60m7J65M5j75n1j23L51k60O5k5K62j49J8j39j03J68j51J0J43jk62K38
$$ 203 43 -4 161 206 31 -20 -143 208 -52 13 -12 250 101 119 -20 -123 45 -106 -96 47 46 -216 22
6446B2rL2m2n8J72m4J03j30N8j23k1m9K2RQ0J11j26M8m4j34M1K03k44K75j26k2
$$ 22 13 45 3 -55 117 73 176 46 104 -19 -40 -89 -67 -58 22 133 7 55 11 -123 -82 121 -123 152 26 4
6472DJ34j58p4O1J55k01J69q7J51k09P0K27k01j62K72l41J16J1J13J2j9j73Q3
$$ 4 138 -20 -94 -33 122 -79 90 3 154 -55 15 242 41 -121 151 -190 -74 -63 50 62 43 -130 -47
6495d7L99l07O9l65M17l49K09J6j27J6n3J91n9J56j63p4n6Lj94L63P9j86Q2j21
$$ -47 352 45 114 -251 166 -183 26 42 -85 -69 -122 69 10 166 3 -71 -127 -124 -318 45 124 -62 20 -101
6519a01l9K46j41N2L6J7j23M7N5j12N9J01n1q1J81k70R3j95J82K1n2L04j98K4
$$ -101 -140 106 -35 17 53 70 -53 -6 49 -63 -4 97 46 -35 146 -124 -31 -226 -44 -23 -75 229 31 55
6543E5Nj87J52J41j02J77l68J86l8Rk09L71J66j67k20k9P0n3m8N0N4l7K87Lk49
$$ 55 60 -127 25 166 64 241 -127 59 21 30 -179 192 358 191 -29 -58 12 -41 -89 -39 15 -22 265 268 19
6568A9j37k58K77m6K41k51R0N2J70R1k27J4j55L9J22l19J79j6j08K59l7K4n2j39
$$ 19 -118 -376 -99 -145 96 -155 -65 -13 157 248 21 35 -120 -81 41 -278 -99 -115 -223 36 -1 23 -29 -168
6592a68P7K41o7j20OQ8k24O3L4M5l2j69K91j38n3K65k53J3J15P8K5j31q3K08Q7
$$ -168 -91 150 83 -37 -31 57 -167 -104 -70 -25 -57 -226 65 -73 -126 139 -114 -101 14 92 117 -14 -97 111 198
6617A98q0j85K25r4J14k99o9J02J15j65j16N2j43M68j45K61N3m22K20k95K54Q2
$$ 198 118 -67 158 64 178 -121 -190 -88 27 -138 -254 -202 -345 123 -22 239 292 -130 90 -205 49 131
6639A31k54K42j57j12K92k13J07j97n3K20k5K78l37j72K59R6j11j42J07m5J25
$$ 131 -123 119 -38 -150 142 -71 36 -161 -214 6 -19 259 -78 -250 9 105 -6 -148 -41 -86 39
6660C9k38M27o1j78K19j60j35j41L84k18N3J04r1Q7r2jJ31q5Q2j36J26j6q7km0
$$ 39 -199 228 167 -11 208 48 -87 -228 156 -62 -9 95 4 91 -1 -2 129 44 126 -10 116 100 13 11 -29
6685b9r2K62j18K76j56N1L0k15j48K49l78R7J73K49n39K30nK61j95l8j39L58k62
$$ -29 -121 141 23 299 143 194 224 9 -139 110 -268 -171 2 251 -288 -58 -63 198 3 -35 -174 184 -78
6708g8P3mr3N3o0K16k55O0P9l6L2j69Q2N7J20P5l2J4k28J5r5n4J86M8k47M42j22
$$ -78 -5 -9 -102 -49 -109 107 -148 -88 -9 -45 -13 -182 -100 -43 77 152 120 134 -94 -79 -174 -228 -42 6 -241 201 79
6735G9m2M3M1j00l8J15L1k45J88k07R3L30o5l05pQ4j83J76n5M7K00k34j79J13
$$ 79 37 80 121 21 -17 98 129 -116 72 -135 -42 288 223 -82 -89 -5 -188 -12 -67 -20 180 -54 -233 -120
6759a20M8K31l43J10J86j02L8J47j32K10k59j76J89K2L2k02L28j77J99k44P6l3
$$ -120 -72 159 -184 -74 112 10 48 195 63 273 14 -162 27 49 81 -121 207 30 229 -15 61 28
6781B8M3k06j02J30P0j31L69j6k25K71k78lK12j34OR0j82J58k65K79n9J37n5Q9
$$ 28 71 -135 -237 -107 -37 -168 201 185 -40 231 -47 -50 162 28 34 124 -58 100 -165 114 55 192 137 226
6805B26p2k14J09j54J04K32l25J54q5J41l03K24j8K8j81qJ18J98k71J80k57r8
$$ 226 154 -60 49 -105 -1 231 -94 60 -25 116 -187 37 19 47 -134 -142 -24 174 -97 83 -174 -272
6827b72J95K64n8j69J4r0R5P7j86J76j19J45m2L04m12O7K1q1K07q7j73J62P3k41
$$ -272 -77 187 129 -40 -26 -116 -21 56 -130 46 -73 72 30 334 -78 -11 10 -71 136 49 -124 38 111 -130
6851a30J16j1L7L9L5m14L32p1Kj40l1P3L35k15O7K1L1Q8j93j45J87q1p9J61J6
$$ -130 -14 -25 12 51 86 -328 4 -67 -65 -205 -236 -163 172 -43 24 45 76 164 -29 -174 13 -68 -147 14 30
6876C0M5r7J63%M6j07j38j14K69J14k37J03m4O5j15l5m5J77K24m92J25n0K36k43
$$ 30 75 -22 141 141 187 80 -58 -172 97 211 -26 77 33 98 -17 -52 -97 80 304 -188 -63 -113 123 -120
6900a20J3K56J00l70J09J29k26L08n13L14l2J73j71j72M04j41P8j9o2o1oK04n9
$$ -120 -107 149 249 -121 -12 117 -109 199 -314 0 -32 141 -30 -202 202 61 139 120 58 -3 -9 195 136
6923A36j88nk7L29k65J87j85l32M62j21m2p1l7q7J68J08l2j77J45K15k69j73J11
$$ 136 -52 -57 -84 245 -20 167 -18 -350 112 -9 -51 -122 -159 -246 -78 30 -2 -179 -34 181 -88 -261 -150
6946a50O4o3L45Qj92J16j00J3j92J26Q3j33q5J56j88K72J71l44k16J04PK05k28
$$ -150 -86 -149 196 204 12 128 28 41 -151 -25 58 -75 -160 -4 -192 80 251 -93 -309 -205 -198 7 -221
6969b21K38N1k23L92m20m0K32j02k11K86k8M6J70j01m8o4P9l1K68k79R1p3k14
$$ -221 17 68 -155 237 -183 -223 9 -93 -304 -18 -46 0 170 69 21 -43 36 5 273 -6 85 12 -202
6992b02J70J67j45O6l8k33J61j01K82q6r9r7J35j91K79q1k46j09M04n9Q9k29Q9
$$ -202 -32 135 -10 56 18 -215 -54 -155 127 41 -58 -155 -20 -211 68 -13 -259 -368 36 -23 66 -163 -74
7015g4k00M49j0j07K41l14M0l4L9k18J12p7mK75k82L05j36j79J53j3K08j36l51
$$ -74 -274 175 165 58 299 -15 25 -9 30 -188 -76 -153 -157 118 -164 141 5 -174 -21 -34 174 38 -313
7038c13K30L59k08K56j13j18j88J49j51L9j62P6K87l53L57j67NJ42l66K38L7j52
$$ -313 -83 276 68 324 211 93 -95 54 -97 -58 -220 -144 143 -210 147 -20 -15 127 -239 -1 36 -116
7060a16K20j16J45k08N3N2o2j66L7K42m3j14L63k13j07r6K75k83L24j31j84K91
$$ -116 104 -12 133 -75 -22 30 -32 -198 -161 81 38 -76 287 74 -33 -129 146 -137 187 56 -128 163
7082A63r5K24l00Q9m4J58j17k03Q2N5j34N7pJ50J58j88Lj71M1K7J4L2O1L6j39
$$ 163 68 292 -8 81 37 195 78 -125 -43 12 -122 -65 -72 78 236 48 51 -120 -79 -52 -38 -6 55 91 -48
7107d8J77k07m7J68P8jo9n4j75J89m8K54j84L3k2O0M8r9o6k71M61O0k60qL3o0
$$ -48 129 -78 -125 43 121 120 51 -3 -178 11 -37 217 33 66 44 104 152 53 -13 -284 177 237 -23 -31 2 -58
7133e8J69r6j78J01N9j76J47p6R0l0j24R2J49j52k10jM98l02o2R0Q5J61j56j21
$$ -58 111 15 -163 -62 -3 -179 -32 -108 -18 -48 -172 -80 69 -83 -293 -294 204 -98 -160 -70 15 176 20 -101
7157a01Q5j72N8J56q9J24k3m3K8P2k36J49K26j60l70K41n5K43j79O4j05J08M0
$$ -101 -16 -188 -130 26 -63 61 38 -5 23 95 -141 8 234 74 -296 -55 -110 133 -46 18 -87 21 61
7180F1l03K68P5j56O6j82q7r3L99l9m0j06P5j61J02K41j53j52L00M0j80l1l6n8
$$ 61 -242 26 101 -55 11 -171 -258 -351 48 9 -31 -137 -62 -223 -121 120 -33 -185 115 155 -25 -56 -92 -150
7204a50j4L72j54l6J70l38K26j68l6j28L31k83K76R6m03J02K61J34l27L9L3Mq7
$$ -150 -164 208 54 18 188 -150 76 -92 -128 -256 75 -208 68 164 -239 -137 124 258 -69 -30 3 7 -80
7227h0J19j87Q1J43j22J45J06l18O5J88q6p0K44l82p1K5J87lj1M7j02p0J74j06
$$ -80 39 -148 -67 76 -46 99 205 -113 -48 140 54 -16 228 -154 -225 -200 -13 -16 -27 20 -82 -152 22 -84
7251h4Q8J34Q9o0j29j30J20J59m07K11M3j06J80p4m8P0R3q3m5J90n36L34q7p1
$$ -84 4 138 227 167 38 -92 28 187 -220 -9 34 -72 108 34 -14 56 149 66 21 211 -325 9 -78 -149
7275a49M08j92r5l9l8K40j38K3M9K03l31K53l18J71K8k05K77l82J75M0J09J44
$$ -149 259 67 -28 -67 -105 135 -3 20 69 272 -59 194 -124 47 75 -130 147 -235 -60 -20 89 233
7297B33k08j48lJ74l29K25Q5j21N0L75m65N6N0K32l87K6K33l03J42Q8k8lQq7J84
$$ 233 25 -123 -126 48 -281 -56 29 -92 -42 333 -132 -76 -26 206 -181 -155 78 -225 -83 5 -23 -26 -18 -105 79
7322G9K9k37J86j83M8K60j52r9K4j64P8K24k37L35k65p8K05p0J31L9l73J63R9
$$ 79 108 -129 57 -126 -78 182 30 -69 -45 -209 -131 93 -144 191 -74 -152 53 -17 114 153 -220 -57 42
7345D2j13O8j23L11j28j73L7L8j00J31k84J87L30k87K18j13n9K24j71j52j36J59
$$ 42 -71 -3 -126 185 57 -116 -79 -41 -141 -10 -294 -107 223 -64 154 41 -18 206 35 -117 -253 -94
7367i4J10K06l06J95k26K70q8k42%P4J37P7j39l9Q7m1O1J21j57j33K95k25K83
$$ -94 16 222 -84 111 -115 155 67 -175 -175 -101 36 113 -26 -65 22 -19 42 163 6 -127 168 -57 226
7390B26j00p0k90M22l07P3j36K7P9L5o1J04NK64L2k37k11j10M64j16J35k29Jo9
$$ 226 126 56 -234 188 -119 -46 -182 -155 -76 -41 -102 2 7 271 303 66 -145 -255 209 93 228 -1 0 -69
7414f9J79p0j06K01j54M7L44m37oJ75j13P7k62L34Kk29J65k45K59O9l38J08Kj54
$$ -69 110 40 -66 135 -19 28 372 -65 -71 104 -9 68 -194 140 142 -87 78 -167 92 161 -177 -69 -67 -221
7438b21L58l9k86L19k74L09j43n0j29J48j49l00N35l44K68LK22k82R6j22K37l38
$$ -221 137 98 -188 131 -143 166 23 -27 -156 -8 -157 -457 78 -266 2 5 227 -55 41 -81 156 -182
7460a82qL38j9k80O0J48j11N4O3k18K99o9K46m48K56r6L2l6O7k30K22k0k62M2
$$ -182 -190 148 129 -151 -91 57 -54 0 63 -155 144 75 321 -127 129 33 65 29 96 -134 88 68 -194 -152
7484a52M07l30K20qK0m6J2j38q6j6J30j5J98k41o8J46J10p3m1j3Q5M5j81L1K3
$$ -152 255 -75 145 137 157 111 123 -15 -101 -117 13 -2 196 -45 -113 33 143 70 29 16 101 146 -35 -4 19
7509A9K3k01J02J31j25Q1K03j36J97j86j07J31j66J63o5k2j46J58Kl25P6K37j29
$$ 19 42 -159 -57 74 -51 30 233 97 294 108 1 132 -34 129 64 42 -104 54 56 -269 -193 44 -85
7532h5j23J26R1k45L27j16j82K59j75K94q6K3j98J69j6J14r3l6r6J03l7m8J69
$$ -85 -208 -82 9 -236 91 -25 -207 52 -123 171 85 108 -90 79 63 177 84 48 -48 55 18 -30 139
7555A39J20l4k56N4j9p3P2J55j75pJ35j68j84J49N3J36l73P69n97P4Q9k41R4k8
$$ 139 259 225 -31 23 4 -69 3 158 -17 -24 111 -57 -241 -92 -39 97 -276 493 -104 -30 59 -182 -88 -116
7579a16M6J85j9j46O6N5j98M1j2K30J06K1q4j82j83J85o1j5O2j72K57k94L65l7
$$ -116 -70 115 96 -50 16 71 -127 -86 -98 132 238 259 175 -7 -190 -5 -66 -81 -19 -191 66 -228 137 100
7603A00n5j49k5J25K01j19k98K36J8K6q8K14j73J37k19N6J22k27R5j1olJ55j65
$$ 100 45 -104 -129 -4 197 78 -220 16 34 60 -28 186 13 150 -69 -13 109 -118 -23 -34 -40 -43 112 -53
7627e3J6j56L96p2j21p9K00k14J93m9j92J25l1j58K32j6j60J38M8J00o6j55L5
$$ -53 -37 -193 203 131 10 -69 131 -83 110 61 -131 -6 -37 -195 37 21 -139 -1 47 147 81 -74 -39
7650c9k34K0K51k46K01l5j02K8K53J1p1O9r9O8r8J13M1Oj82j4q3Q9J11lo7L23
$$ -39 -273 -253 -2 -248 -47 -82 -184 -156 97 108 37 106 7 75 -23 90 131 137 -45 -59 -142 -53 58 55 -12 311
7676C11k68O4k1j23M8K2j40j25L14p8j78L20j64o4K44j17R1j64j97K65J48j65
$$ 311 43 107 86 -37 11 33 -107 -232 82 4 -174 146 -18 -82 162 45 136 -28 -225 40 188 23
7698B3m5Q3k25J88J56p6J00n7j57Q6j41m2o5J88j33J36J4k39J93n3M8J53K9j85
$$ 23 -22 61 -164 24 180 104 204 147 -10 76 -65 -107 -172 16 -117 19 33 -206 -13 -66 -18 135 164 -21
7722b1K02k38j5Q6j3J47j14j64J0n2L88k45pk83L79j40p5L19l05K30j01p3q9R1
$$ -21 181 -57 -72 14 1 148 34 -130 -120 -172 216 -29 -36 -319 60 -80 -155 164 -141 89 -12 -85 -174 -83
7746h3L5j7N4L4n8M3N2m1k57L32q6R2K5r0Q7j37j02n7M9q7J69J98k30N3L3j07
$$ -83 -48 -65 -11 23 -35 8 60 19 -238 94 8 100 125 35 122 -15 -117 -174 -125 -212 -43 155 -75 -22 11 -96
7772i6J54J11k29J07j40N1%M9p3p8K04j13o8k3K62l72O1j42M99j57J09k26J01
$$ -96 58 169 -60 47 -93 -42 -42 7 -66 -144 60 -53 -121 -144 118 -254 -193 -335 164 7 116 -110 -9
7795iJ34j11j85K29O0P1j51q1jk1n4J11j6oP8k2j15J16O4q3J48Kk09L32l46J27
$$ -9 125 14 -171 58 118 189 38 -43 -44 -65 -119 -8 -24 -30 48 26 -89 27 91 8 156 158 -51 281 -65 62
7821F2N3k55J78q2n7J86Q1O7l8j67M9j33L2r5J3J5J02j35K11j55M1L6J16mn8J3
$$ 62 115 -140 38 -44 -101 85 166 233 195 28 77 -56 -24 -119 -106 -91 11 -124 87 -68 -27 9 125 121 63 76
7847G6k51J78JJ95p9j26O8j43K24k39J57J4j31J60j28K8l92O50l29RK17k27L5
$$ 76 -175 3 4 199 120 -6 62 -81 143 -96 61 75 -56 104 -24 4 -388 262 -67 -58 159 -68 -33
7870c3kJ29j83L24j24m6j22J86m23L69j9J15q2P9k38K09l5r4L2j63k9K95o3j27
$$ -33 -35 94 -89 235 111 65 -57 129 -294 75 56 171 89 168 -70 139 104 10 42 -121 -150 145 82 -45
7894d5m8R9M5N1j8K1k8k48J06j30K26q1J36o9l4M7k76L97jj85L02j21k12K95l01
$$ -45 -93 6 51 102 84 105 77 -171 -65 -195 31 -50 86 17 -17 30 -246 151 150 -35 267 146 -66 229 -72
7919g2J60m4j9O1P0k28l7J40K5L4l89M35j47K81l54O5P1k10J14Lj32j02M44M0
$$ -72 88 44 25 86 156 -72 -109 31 56 90 -299 136 -11 270 -84 -19 52 -158 -44 -41 -173 -275 169 209
7943B09j56k6l01J86P4j8J90j98j32R9R2j11K36k59J44j69L5K76j43l6j74J71
$$ 209 53 27 -274 -88 -14 -32 158 -40 -172 -73 19 -92 144 -115 29 -140 -105 171 28 -8 -182 -11
7965a1J66j52Q0o2j97K67n8j62Q7O0L7k13K33J30k39J22n2l0J28l09K63j63K1
$$ -11 155 3 83 21 -176 91 33 -129 -42 18 55 -158 75 205 -34 88 36 6 134 -175 88 -75 -54
7988e4OJ11k1k9n4j14k9J89Rj35K91j07Q4j17J6n0j44P7J59k24L29l15R8K48k91
$$ -54 -48 63 42 13 -41 -155 -184 5 14 -121 170 63 147 30 46 -4 -148 -71 88 -136 193 -122 -24 224 -67
8013f7K47J9l43J94l2j07L01k56j42J36L2l2J42M1j52n9l1N7O6J97j86q4L56l32
$$ -67 180 199 -144 50 18 -89 212 -44 -186 -50 -18 -50 92 133 -19 -78 -109 -52 14 211 25 -59 297 -35
8037c5K95l50L4K76p2n8J14l11M1r5j76O77m24M12n46J29J37k34J18J89r6pLj50
$$ -35 260 -90 -56 220 148 90 204 -107 -66 -161 -337 340 -84 328 -218 -89 48 -186 -68 121 25 18 21 -129
8061a29R9j6L3K12j33j38j90J73K9O5R0j99M6J46J50o5k13J56j24K39j76j82J6
$$ -129 -30 -46 -13 199 66 -72 -262 -89 -60 5 95 -104 -58 88 238 173 -40 116 -8 231 55 -127 -111
8084a11O2J31k3K7j9j58m4J44j22N1K50o4n8j60K38j31o7OJ29Q9j82M3J49j47
$$ -111 -49 82 59 86 67 -91 -135 9 -113 -62 188 124 66 -94 144 13 -54 -48 81 170 -12 31 180 33
8108C3Q6k6L4q6j65J77j27J4L9m4Rr0J91P0l02K90o9J3j00j9R7J44m07J57J93
$$ 33 119 93 127 41 -124 53 -74 -60 -21 -65 -56 -146 45 115 -187 103 34 47 -53 -72 25 169 -238 -81 112
8133A12J10m29R7j04K61J93l39j01J71r7K94k45J32n8o0l8R2Nj42J84n7J27l22
$$ 112 222 -207 -110 -214 47 240 -99 -200 -29 -126 168 -77 55 -3 -63 -101 -9 -4 -146 38 -19 108 -214
8156b14M00l23J34Q3l2L8o7j50M74n28K04q9N4J7j35K92K2M1m85L37r5J23j68
$$ -214 186 -137 -3 80 48 86 19 -131 343 -185 19 -70 -16 1 -134 158 180 221 -264 73 -22 101 -67
8179f7J5O8k6L2p6J70k44J71k4k74L46m9
$$ -67 -52 16 -10 22 -54 116 -128 43 19 -255 91 42
8191D2
$$ Imaginary data points
##PAGE= N=2
##DATA TABLE= (X++(I..I)), XYDATA
0@%%%%%%%%%%%%%lLqJ6j6J6k4L2l2M0m8N5o3P2q7R9j10J28j49J66j87K12k39K71
$$ 0 0 0 0 0 0 0 0 0 0 0 0 0 0 -3 0 -8 8 -8 8 -16 16 -16 24 -24 31 -32 40 -47 52 -58 70 -79 87 -100 112 -127 144
37A44l04L39l80M22m68N23n78O37p07P82q63R52j046J151j269J398j545J708j886
$$ 144 -160 179 -201 221 -247 276 -302 335 -372 410 -453 499 -547 604 -665 733 -812 896 -990
56i90K089k324K592k906L282l736M300n022N986p342R402j2937K0593o5007J13330
$$ -990 1099 -1225 1367 -1539 1743 -1993 2307 -2715 3271 -4071 5331 -7606 12987 -52020 61310
71F1310K26379j20545k73075j29687R5996J91935J95787j2735k28729k02142N729
$$ 61310 287689 167144 -105931 -235618 -139622 52313 248100 235365 6636 -195506 -189777
82a89777J57640K04914P0879j58772k40023p7696J21730K01899J16020p0999k11483
$$ -189777 -32137 172777 243656 84884 -155139 -232835 -111105 90794 206814 135815 -75668
93g5668j54810M7322J96824J55370l872j49097j78274l7179J63551J91460L5185
$$ -75668 -230478 -183156 13668 169038 165166 16069 -162205 -199384 -35833 155627 190812
104A90812j12186j61493r9226Q1102J95756R9503o7266j48183j35034K468J68421
$$ 190812 78626 -82867 -182093 -100991 94765 194268 127002 -21181 -156215 -153747 14674
115A4674J46587k3068j28237j33220n2172J06034J71313M9141r6182j33143p7539
$$ 14674 161261 138193 9956 -123264 -175436 -69402 101911 151052 54870 -78273 -155812
126a55812N0973J54286J01875m7960j30754r9978R195J21025J27399J1885j09238
$$ -155812 -104839 49447 151322 103362 -27392 -127370 -118175 2850 130249 142134 32896
137C2896j26924l4936Q4105J26594N5664o7455j29527p0715M5915J11658Q4589
$$ 32896 -94028 -128964 -44859 81735 137399 69944 -59583 -130298 -84383 27275 111864
148A11864j3621j12006j04548J0037R7667R2590K4292p2778j14287l4276P5588
$$ 111864 98243 -13763 -118311 -108274 -10607 81983 106275 33497 -80790 -115066 -39478
159c9478R9821M9280l6811j07350p4207L7755R6644O7441l839q1637r4735p313
$$ -39478 60343 109623 72812 -34538 -108745 -70990 25654 93095 89256 7619 -87116 -94429
171i4429Q1685Q1573K0253n3918r1893m3354N0703Q9129M6659k8804q0714o2173
$$ -94429 -12744 68829 89082 35164 -56729 -100083 -49380 39749 86408 57604 -23110 -85283
183h5283J6871P9656O6371l012o5841p2605j5084N7668P9160K5438m8967p4392
$$ -85283 -68412 11244 77615 74603 8762 -63843 -78927 -21259 57901 83339 34372 -40020
195d0020l6747K8770P2630N0636k3420o9505n0606O164N8110O4570N917n8839
$$ -40020 -76767 -47997 24633 75269 51849 -17656 -68262 -62098 -3988 60582 66499 7660
207G660o0148j1847M0380O4589L1804l7520o6559l1028K3042N8550M7562j1856
$$ 7660 -52488 -64335 -23955 40634 72438 34918 -31641 -62669 -39627 18923 66485 54629
219E4629o1853m9258K398M6115N4103J3337m4420n8080j7279L3196N3411K8966
$$ 54629 -7224 -56482 -54084 -7969 46134 59471 15051 -43029 -60308 -27112 26299 55265
231E5265k2522n5343l4616J6710N0627M0413m259m5159m5732k245M1746M6715
$$ 55265 32743 -22600 -57216 -40506 10121 50534 46275 1116 -44616 -46861 -5115 41600
243D1600J1789l2428n0027k2189K6999M8906K5189j6939m5256l5418P323M3802
$$ 41600 53389 20961 -29066 -51255 -24256 24650 49839 32900 -12356 -47774 -40451 3351
255C351L6670k535l6326l9830q523L3758M3634J2352k5390m0010k2096J9292M3865
$$ 3351 40021 37486 1160 -38670 -47193 -13435 30199 42551 17161 -22849 -44945 -25653 18212
268A8212K6417j3276l7164l0831K912L6469L5953J294l1319l5455j1849K3915
$$ 18212 44629 31353 -5811 -36642 -33730 2739 38692 39986 8667 -26788 -38637 -14722
280a4722L7661J5092k0353l5700j9874J1730L4596K5619q227l2902k6996J395
$$ -14722 22939 38031 17678 -18022 -37896 -26166 8430 34049 25822 -7080 -34076 -32681
292c2681K8475L2073O100k5788l1520r590J9368L2758J7121j4453l3011j9943
$$ -32681 -4206 27867 33967 8179 -23341 -32931 -13563 19195 36316 21863 -11148 -31091
304c1091R479K8077K3799j838k7365k6872j193K2287K5533P457j9315k9421j0784
$$ -31091 -21612 6465 30264 28426 1061 -25811 -27004 -4717 20816 28273 8958 -20463 -31247
317c1247J6690K6680J5000q720k7384k0245P308K5251K0126Q76k1428k4411l848
$$ -31247 -14557 12123 27123 18403 -8981 -29226 -21918 3333 23459 24335 2907 -21504 -25352
330b5352J9831K3887P881j3604k4429j3330J1255K4139J3521o986k1021j8151
$$ -25352 -5521 18366 26247 12643 -11786 -25116 -13861 10278 23799 16813 -4208 -22359
342b2359K588K1296J9324p5j7553k0859o222J5045K2565Q476j2213j9959j1928
$$ -22359 -19771 1525 20849 20774 3221 -17638 -23860 -8815 13750 22226 10013 -9946 -21874
355b1874O616K0877J5456n085j8674j4990k67J5539J8745L162j5088j6899n226
$$ -21874 -15258 5619 21075 15990 -2684 -17674 -17941 -2402 16343 19505 4417 -12482 -17708
368a7708R850J8714R793j0146j8247j0207N125J6065J4904j683j7454j4390p87
$$ -17708 -7858 10856 20649 10503 -7744 -17951 -12826 3239 18143 16460 -994 -15384 -16171
381a6171J2528J5659N466j1990j7060n660Q104J5125R967n199j6147j0896M250
$$ -16171 -3643 12016 17482 5492 -11568 -17228 -9124 6001 15968 10769 -5378 -16274 -12024
394a2024J3883J1553L21j2657j3919j868J2064J4080M744q241j5208p964P691
$$ -12024 1859 13412 13733 1076 -12843 -14711 -2647 11433 16177 7936 -7272 -15236 -7545
407g545J3581Q184l117j2439j2392J013J3082J0849P5r162j2543m426R369J3126
$$ -7545 6036 14220 11103 -1336 -13728 -12715 367 11216 11291 2129 -10414 -14840 -5471 7655
421G655M111o576j1264p862M985J3451Q160l139j0340r453r31J0591J2054R83
$$ 7655 11766 5190 -6074 -13936 -8951 4500 12660 9521 -819 -10272 -11203 -612 11442 12425
435A2425q937r671m994O283J1690N620n661j0958o898K593R885Q663j739r833
$$ 12425 3488 -6183 -11177 -4894 6796 12416 6755 -4203 -11101 -8508 1377 10040 8301 -1532
449a532q243k62P498R688L121p450j0763k786N675R684O120l089j0178o555K503
$$ -1532 -9775 -10037 -2539 7149 10270 2820 -7943 -10729 -5054 4630 10750 7661 -2517 -9072 -6569
464f569P995P582P18p965q912p06O313P795K686m809r283m393N069P658M308j869
$$ -6569 1426 9008 9726 1761 -7151 -7857 -1544 6251 8937 4128 -5155 -9548 -4479 3179 7487 5618
480E618q402o450J811P503O444O48n906p723j897N882P512K830l784o860m295
$$ 5618 -2784 -9234 -7423 80 6524 7172 1266 -6457 -8354 -2472 5040 7870 4086 -2774 -7069
495g069K604P348M975k058o557n239K42O088N765L07m766o422k773M602P214K397
$$ -7069 -4465 2883 7858 5800 -757 -5996 -5754 334 6099 6406 1640 -4782 -7555 -2953 4261 6658
511F658l551o216l898J438O209N366j008n486n058p79N012O244O17l956m797k399
$$ 6658 3107 -3109 -7007 -5569 640 6006 4998 -488 -5546 -6325 -1313 4931 5548 1592 -3205 -5604
527e604K683O091L718l098n607l069P99M813N227l09n013m843p70L078N088K582
$$ -5604 -2921 3170 6888 3790 -1817 -4886 -4087 726 5953 5644 631 -4212 -4982 -1904 3184 5766
543E766l345n699k127K131L838L454P4n813l705J630L643L266J458l510n467j18
$$ 5766 2421 -3278 -5405 -3274 564 4018 4092 -1721 -5426 -3796 -153 3113 4571 1061 -4406 -4524
559d524L789L827K074j388n717l439L180M591K130J4m036m920n8M576L251N63
$$ -4524 -735 3092 5166 3778 -1939 -5378 -2198 2393 4523 4537 501 -4419 -4477 99 3350 3913
575C913k415m509k667L101M280J725j787l479k787M86M795L345j047l080k553
$$ 3913 1498 -3011 -5678 -2577 1703 3428 1641 -1838 -4625 -4139 656 4001 2954 -126 -2679
590b679q93K621M572J340l465l212n86R54L495K586k075l767j672L15K282L636
$$ -2679 -3572 -951 3621 4961 1496 -1716 -2302 -1348 2147 4733 2658 -1109 -2781 -2466 -184 3452
606C452m6m594k581N42J525L416J722k825l744r86J822K968K710p65l243k062
$$ 3452 3406 -1188 -3769 -3227 -1702 1714 3436 611 -3133 -4119 -2297 671 3381 2616 -627 -2689
622b689P39K195K808Q16k564l040m76K158K223R28j239k911j650R33K711J264
$$ -2689 -1950 245 3053 3869 1305 -1735 -2211 -53 2170 3098 1859 -1052 -2702 -1769 942 2206
638B206p55k130k318p6K833J846L4j412k452j203J959K941Q59j300j486j456M62
$$ 2206 1451 -679 -2997 -3073 -240 1606 1640 228 -2224 -3427 -1468 1473 2332 1032 -454 -1910 -1448
655a448K703J471q33j208k185o26K385K275m43j220j540j411M84K658J273j463
$$ -1448 1255 2726 1893 685 -1500 -2126 259 2534 2091 871 -669 -2080 -1596 1062 2335 872
671H72j776j305o05K340K000m19j700j189m99J041K665N45j549j476l15O73J651
$$ 872 -904 -2209 -2814 -474 1526 1107 -593 -1782 -2281 -1240 1425 1970 421 -1055 -1370 -697 954
688I54J720n76k291j407O08J115J785Q54j994k348q4Q51J661J014m80k586j267
$$ 954 2674 2098 -193 -1600 -992 123 1908 2762 768 -1580 -1664 -813 848 1862 1382 -1204 -2471
705b471R85J020J177P95j641k110N24J438R14O40l86j934q33J617J274M02M29
$$ -2471 -1486 -466 711 1506 -135 -2245 -1721 -283 631 1271 885 -1049 -1882 -265 1009 1411 1840
722A840j909j590Q87J806R26l71j001j865l74J579J249N6o42j443j004N79K050
$$ 1840 -69 -1659 -772 1034 1960 1589 588 -1277 -1651 -72 1177 1233 591 -852 -1856 -1277 773
739G73K61o29j213r97j56J573J810j62j555o10l46M68J862O83q80r49n66j36J005
$$ 773 1034 405 -808 -1805 -1961 -388 1422 1260 -295 -905 -1251 -783 1079 1762 882 -67 -633 -769 236
758B36J369o38j205k18%K56J410K1j417j124K53M95Q76O31q27j192o01P35P04
$$ 236 1605 967 -238 -456 -456 -200 1210 1231 -186 -1310 -1057 -562 314 945 118 -1074 -1675 -940 -236
777b36R74L19j404j041O69O61J019M53n47j310rN50N68N90J61j420o78M38P28
$$ -236 738 1057 -347 -1388 -719 -58 961 1414 867 -443 -452 98 666 1256 1417 -3 -681 -243 485
796D85k2J54l92j263k38Q27R50l05k87o75o36M37J327N6l82q5p92q3J456M27n57
$$ 485 463 617 225 -1038 -1276 -449 501 196 -91 -766 -1402 -965 362 418 36 -49 -841 -924 532 959 402
817D02Oo44k00P32J076P0q80n11m84j13J047P22o11p69n23m38N23J005J16j174
$$ 402 408 -236 -436 296 1372 1442 562 51 -433 -546 501 1223 612 -157 -680 -1118 -595 410 526 -648
837f48j16k28K76K68R04m17p16J25M41J05O48M86j082m52N22j3M53Q00p13j004
$$ -648 -764 -992 -716 -448 456 39 -677 -552 -111 -6 642 1128 46 -406 116 103 556 1356 643 -361
857c61M9M74J55M89k23q70p21O69K60m9P02o79q25J29M78KM75J64q89k47N51O76
$$ -361 -312 162 317 806 583 -287 -1008 -339 -79 -128 574 -105 -930 -801 -323 -321 154 318 -571 -818 -267 409
879D09P4M2j06p13r6Q04L38R4k60n75k42M13L00n2j64l16n45P6N92M07p55m05
$$ 409 483 525 419 -294 -390 414 752 846 586 11 -231 182 482 430 266 -50 -595 -519 73 480 -275 -680
901f80K01m41M65R84j89o67j59Q0j92R68L70n07j62N7l32L43L75K18n00j8o8P
$$ -680 -479 -920 -455 529 340 -327 -486 -406 -598 370 740 233 71 128 -204 139 514 732 232 214 146 153
923A53M5M11m84n81M40l18J17L71j97n80j75M03J96L10rj77l24k21N65L10R6j8
$$ 153 198 609 125 -456 -16 -334 -217 154 -43 -623 -798 -395 -199 111 102 -75 -399 -620 -55 255 351 333
945C33k95m44M64O94m70L78j81p00J29O93P4n04J75n48l27N31K57l06j5pn82J52
$$ 333 38 -406 58 752 282 660 479 -221 -92 601 675 171 346 -202 -529 2 259 -47 -62 -69 -651 -499
967d99O39k83j70L84n00l40P77L98j63j59j86O6P6K83L35l47l31J4K67O9J40j84
$$ -499 140 -143 -313 71 -429 -769 8 406 243 84 -102 -36 40 323 658 311 -20 -6 261 330 470 286
989B86l27j85M59n38j6M73l72l07M8J50j99M94J48n31J4M35j91K09M74m04m71
$$ 286 -41 -226 233 -305 -321 152 -220 -527 -479 -329 -528 -34 114 -417 -403 32 -159 50 524 120 -351
1010c51L75L22m69N66J55l86Pj6l44N44O5n02j25J99k86O8K87m16l10K38lj30
$$ -351 24 346 -123 443 598 212 219 203 -141 403 468 -34 -159 40 -246 -178 109 -307 -617 -379 -382 -512
1032e12L59n8m8j64j19L53N72j26j12k18LQ1M43q8m30M16m27q6N67J05k42l80
$$ -512 -153 -211 -259 -423 -542 -189 383 257 145 -73 -70 11 454 366 -64 352 -75 -161 406 511 269 -111
1054a11J12l37N4L34n0k58L9l86K40M92l71k36L8L74k77L49M18m82j20M83j89
$$ -111 1 -336 -282 52 2 -256 -217 -603 -363 129 -242 -478 -440 -66 -343 6 424 -58 -178 305 116
1075A16J97K80n88j30K79j35J37M21k48k0l67l42L28L03j86O9j95l81K62n0J2
$$ 116 313 593 5 -125 154 19 156 577 329 309 -58 -400 -72 231 45 114 -81 -462 -200 -250 -238
1096b38r8J90l50J8R1N13l82K96M05o91J74K29j11O6L42o3l50K03J9k9J95j49
$$ -238 -336 -146 -496 -478 -387 126 -256 40 445 -246 -72 157 46 112 454 391 41 244 263 234 429 280
1118B80j94N6Pj68Qj1k29K0J11j54m4R6j91J62L25m68L67k43K68l7J88R4q3Q8
$$ 280 86 142 149 -19 -11 -22 -251 -231 -120 -274 -318 -222 -413 -251 74 -394 -27 -270 -2 -39 149 243 160 248
1142B48l7n2J70J65k41K74k05k65M6J73l40N0rq9J4j77k88M28J72m97K3K56k16
$$ 248 211 159 329 494 253 527 322 57 103 276 -64 -14 -23 -112 -98 -275 -563 -135 37 -460 -437 -181 -397
1165c97N8K96J35l23K43j45J40K89N0l32Q8J5N8J6K98k73k57K04l06M3K61j60
$$ -397 -339 -43 92 -231 12 -133 7 296 346 14 102 117 175 191 489 216 -41 163 -143 -100 161 1
1187Ak56r5K65%j50q3J00n5l8P5J31j58J33J64r9K23M9j64M5P8K37j99J47J6k29
$$ 1 -255 -350 -85 -85 -235 -318 -218 -273 -311 -236 -105 -263 -130 34 -65 158 207 43 88 166 403 204 351 367 138
1212A38R0J0m00J51N15r59M05R2k32l1M91l36l70K56l64J23K89J0R7n2L9q6j42
$$ 138 228 238 -162 -11 504 -455 -50 42 -190 -221 270 -66 -436 -180 -544 -421 -132 -122 -25 -77 -38 -124 -266
1235b66M92o1j4m8K46J42m70L56k91k41L50j35J06j82J01k29j63K0J18J5K57j27
$$ -266 226 165 151 103 349 491 21 377 86 -155 195 60 166 -16 85 -144 -307 -287 -169 -154 103 -24
1257b4j63l3q3P5K04M3l8j12N4N0R9K37k07J63J56k99L12l32p1Kj95K98m4M4o0
$$ -24 -187 -220 -303 -228 -24 19 -19 -131 -77 -27 72 309 102 265 421 122 434 102 31 33 -162 136 92 136 76
1282G6J77k09r2J5j52M8n3j85J55P6N6k9J49j84K1J28j77K89J07k89J80J42k26
$$ 76 253 44 -48 -33 -185 -137 -190 -375 -220 -144 -88 -117 32 -152 -131 -3 -180 109 216 -73 107 249 23
1305B3k4K62r9j20J9J16j74J61l23J18K76k63j02K38M3k97j28L13m4k82K10j6
$$ 23 -1 261 162 42 61 177 3 164 -159 -41 235 -28 -130 108 151 -146 -274 39 -5 -287 -77 -93
1327i3j53K68P9J58m29M99l49L9L24J22l22l6L05m31J5m8K8K57q1j3k78K42l62
$$ -93 -246 22 101 259 -170 329 -20 19 343 465 143 107 412 -19 -4 -52 -24 233 152 139 -139 103 -259
1350b59J53k0j25o7J48j03L59l39K17J93k47o9K02n1J23j74J89j07O2L93m53j14
$$ -259 -106 -126 -251 -318 -170 -273 86 -253 -36 157 -90 -159 43 -8 115 -59 130 23 85 478 25 -89
1372h9K89j74M9J08J13k27k01L35n65M09j56K06m61R7KO2L03L0k37l9K33k02M2
$$ -89 200 26 75 183 296 69 -132 203 -362 47 -109 97 -364 -267 -265 -203 100 130 -107 -146 87 -115 -73
1395g3j30N01l82M56l33N6j34L14j83J75J05k12J23k35mN2k15K76j98j04J28L4
$$ -73 -203 298 -84 372 39 95 -39 275 92 267 372 160 283 48 44 96 -119 157 -41 -145 -17 17
1417A7r4j18Q7m9k20Q0J85R8l4k45K89K33l87M7L04k19Q4K41l52K48k90K63R5
$$ 17 -77 -195 -108 -157 -377 -297 -112 -14 -48 -293 -4 229 -158 -111 193 -26 58 299 -53 195 -95 168 263
1440B63k04K62j87J28m76J85l32L00lj27j8RJ38R8l30M79k17J67j6lr6J9J79l8
$$ 263 59 321 134 262 -214 -29 -361 -61 -64 -191 -209 -200 -62 36 -294 185 -32 135 119 116 20 39 218 180
1464A80J78q3j05q8O0j85J57J5J31k65J21n4j55N0l8l38J17L08j58J30m23K64
$$ 180 358 275 170 82 142 -43 114 129 260 -5 116 62 -93 -43 -81 -419 -302 6 -152 -22 -445 -181
1486a81OO1nJ55k15J64kj61K14J0j74R8L03j18j32J50p7q1M4j06P1J06k85J10
$$ -181 -175 -114 -119 36 -179 -15 -17 -178 36 46 -128 -30 273 155 23 173 96 15 59 -47 24 130 -155 -45
1510d5p5K26k94Q4o9j63K36j55K75m6n9J4m3K78Mk61l6L47M7n5n3K35l33J42l6
$$ -45 -120 106 -188 -104 -173 -336 -100 -255 20 -26 -85 -71 -114 164 168 -93 -129 218 265 210 157 392 59 201 165
1535A65q1J48k31j92J01L18j94J2j39n3q1L8P4J78k20j39K10L4p6K71m11J72J40
$$ 165 84 232 1 -191 -90 228 34 46 -93 -146 -227 -189 -115 63 -157 -296 -86 -52 -128 143 -268 -96 44
1558D4J9O6k7j13K12k3j62J34j20k30J59r9JJ05K56j65o2L9j22J99j67n9RJ06
$$ 44 63 129 102 -11 201 178 16 150 30 -200 -41 -140 -139 -34 222 57 -5 34 -88 111 -56 -115 -106 0
1582@k3q6n7L01k10j97K50L19m89M15k17J0K61Oj20J81n07K82k02j25J82j48J82
$$ 0 -23 -109 -166 135 -75 -272 -22 297 -192 223 6 16 277 283 163 344 -163 119 -83 -208 -26 -174 8
1605HK1LP7j66Q3mq0J16j89l3J63p0n6K4P6j40R0K17J2j27k5P8J3J22m8j21L03
$$ 8 29 32 109 -57 26 22 -58 58 -131 -164 -1 -71 -127 -103 -27 -167 -77 140 152 25 0 78 91 213 165 44 347
1632C47l69Q3Q6q2k34J06k03J37j28M95m23J3Q6J03m7P7q8m6K12j17j69K42l2
$$ 347 -22 61 147 65 -169 -63 -266 -129 -257 238 -185 -172 -86 17 -30 47 -41 -87 125 8 -161 81 49
1655D9j41O1N6O8k77J38K52j89k02M27l67J10J43j29J06m6k57J22K18r8j67PK0
$$ 49 -92 -31 25 93 -184 -46 206 17 -185 242 -125 -15 128 -1 105 59 -198 -76 142 44 -123 -116 -96
1678i6q5r1l2L00r0J26J78j39j44K03m0k31QL36K2m83L62K09m95J89j7K16n6R
$$ -96 -181 -272 -304 -4 -94 32 210 71 -73 130 90 -141 -133 203 225 -258 104 313 -182 7 -10 206 150 159
1702A59j84J06j55J65J08k82J45j51J16n4k81Q7Q9K13l13J67J36r6J9j05O7j97
$$ 159 -25 81 -74 91 199 -83 62 -89 27 -27 -308 -221 -132 81 -232 -65 71 -25 -6 -111 -44 -241
1724b41M79q8N7k06k56J77J33j13N8r5J60j61N9k0m0p5J18j42K3J64j71J17J5
$$ -241 238 150 207 1 -255 -78 55 -58 0 -95 65 -96 -37 -57 -97 -172 -54 -196 -173 -9 -180 -63 -48
1747d8O4J60j45J9o4k47K83P0r6R3K12l28j98M19j59k53K65j91k5K00j44p6J51
$$ -48 16 176 31 50 -14 -261 22 92 -4 89 301 -27 -225 194 35 -218 47 -144 -169 31 -113 -189 -38
1770c8j31J84l73L54k20J08M9n4L9k43o4O62l72P8K85j73Q1k58J65n3L3N8J01
$$ -38 -169 15 -358 -4 -224 -116 -67 -121 -82 -325 -389 273 -99 -21 264 91 172 -86 79 26 59 117 218
1793B18N4j21j19j3n9K11l55L04k10J7J0J37k03JO0q9J75r9j21J02M45n02o5M79
$$ 218 272 151 32 19 -40 171 -184 120 -90 -73 -63 74 -129 -128 -68 -157 18 -81 -202 -100 345 -157 -222 257
1817B57n32K72%K1M9m3Mj19J12J48k09K2k6Q0k82L23L0j16J24MN5k96%M7l3p6
$$ 257 -275 -3 -3 18 67 24 28 -91 21 169 -40 -18 -44 36 -246 77 107 -9 115 119 174 -122 -122 -75 -108 -184
1843a84L86j16k85J22R6k6L20m69K57k07K49kJ10k30kq4J32l14K44P2n8j7q1m5
$$ -184 202 86 -199 -77 19 -7 313 -156 101 -106 143 141 251 21 19 -65 67 -247 -3 69 11 -6 -87 -132
1867a32j5M40l07P2k87J08Q3l4J83k1N7j00n8L21k00k57L11L0j22q7J46k69K22
$$ -132 -147 293 -14 58 -229 -121 -38 -72 111 90 147 47 -11 310 110 -147 164 194 72 -15 131 -138 84
1890H4O6l60K27O4j17j39N30n85J43J9m0Nj24J71J30p3J50l30K04k55K19L6k5
$$ 84 150 -210 17 81 -36 -175 355 -230 -87 -68 -108 -103 -227 -56 74 1 151 -179 25 -230 -11 25 0
1913@Q4l3l34N0K24J49M2Nj16j83Q9o7k66K25O4M4j70m9M1N0J79j50k3n2J18m4
$$ 0 84 51 -283 -233 -9 140 182 187 71 -112 -23 -90 -356 -131 -67 -23 -193 -242 -201 -151 28 -122 -145 -197 -79 -123
1939a23j28J61L17j87k01J26jQ7L3J00N6n5l54K93j20o1J12j18qK17k24K46k13
$$ -123 -251 -90 227 40 -161 -35 -36 51 84 184 240 185 -169 124 4 -57 55 -63 -71 146 -78 168 -45
1962d5j55J04K4J87k12N4K06l99Q9L6l4K63l5L31l36p1J08j28R3Ok21K07N7n2
$$ -45 -200 -96 -72 115 -97 -43 163 -236 -147 -111 -145 118 83 414 78 7 115 -13 80 86 -135 72 129 77
1986G7K9j53Q7j14k7N4K7j29K6P3N3j07O3K21l16m0J65K53m65K62j15K9K20m8
$$ 77 106 -47 40 -74 -101 -47 -20 -149 -123 -50 3 -104 -41 180 -136 -176 -11 242 -223 39 -76 -47 173 125
2010A25j96K20j67J8J80k10O0l75N78j53j69K44j15r2k8Q3k02J61N6j32K1J29
$$ 125 -71 149 -18 0 180 -30 30 -345 233 80 -89 155 40 -52 -80 3 -199 -38 18 -114 -93 36
2032C6m7L1K1k89J85Q3K3rp3P1J26r3j3j55J52J03Q0k33k73L76o9K93k28J58l11
$$ 36 -11 20 41 -248 -63 20 43 34 -39 32 158 65 52 -103 49 152 232 -1 -274 102 33 326 98 256 -55
2057e5n8m2K3n6J18m0J6J87m6j54k26J65j6L5K13k2r6o4J98R3O8N3j83o3K5k92
$$ -55 -113 -155 -132 -188 -70 -110 -94 93 47 -107 -333 -168 -184 -149 64 42 -54 -118 80 173 241 294 111 48 73 -219
2083b19J36J25M0J4k06O2j76L69j92L4K2j63J07n3O0P0j98K75K2n0j06J22j76
$$ -219 -83 42 82 96 -110 -48 -224 145 -47 -13 9 -154 -47 -100 -40 30 -168 107 129 79 -27 95 -81
2106h1q1K33k17J16O5j48K49n9j65J10P2q0J32k16O3o6J45Mj15j41o0L03J2l0
$$ -81 -162 71 -146 -30 35 -113 136 77 -88 22 94 14 146 -70 -7 -73 72 76 -39 -180 -240 63 75 45
2130D5O6j71LM6k1J95k20k7O6J49l0J99k43K6OL6l93N5L56J33k55kK76l09q8R
$$ 45 111 -60 -57 -11 -32 163 -57 -84 -18 131 101 300 57 83 89 125 -268 -213 143 276 21 19 295 -14 -102 -93
2156i3K17Rk76o3k1o8J81l6J35r9J04R4q0qO3N4pq9K1J24j5k28M3K68n84K71N6
$$ -93 124 133 -143 -206 -227 -295 -114 -150 -15 -114 -10 84 4 -4 59 113 106 17 38 162 147 -81 -38 230 -354 -83 -27
2183b7j72N77k41l9M0p7k16K53j57L38j53m04K78q6K01p2Q5k06l5p7K40m52M92
$$ -27 -199 378 137 98 138 61 -155 98 -59 279 126 -278 0 -86 115 43 128 -78 -113 -190 50 -402 90
2206I0p1J3J45j37K55p1j69j33K66k78K20j88k33J93N4J03m5n5Q8j91MQ4j09K38
$$ 90 19 32 177 40 295 224 55 -78 188 -90 130 -58 -291 -98 -44 59 14 -41 47 -144 -140 -56 -165 73
2230G3LJ0L6l19J74P2M7J55k71k6l0J25mJ23k8K7k7j62J46j54M3J19j90J21l5
$$ 73 76 86 122 -197 -23 49 96 251 -20 -46 -76 49 45 168 140 167 140 -22 124 -30 13 132 -58 63 28
2255B8J2J28k45J3k8k7J2r5J05J13j49K07J02k47p5J07J26P2j95J45l21L80j16
$$ 28 40 168 -77 -64 -92 -119 -107 -202 -97 16 -133 74 176 -71 -146 -39 87 159 -36 109 -212 168 52
2278E2J30l82J58J11k62M48j04o1R2l97R7p3J29L9j36J47r5N9N5o5l3J19p5M7
$$ 52 182 -200 -42 69 -193 255 151 90 182 -215 -118 -191 -62 -23 -159 -12 -107 -48 7 -58 -91 28 -47 0
2302@M9J5J87j42J8p7k22P0R2R4j04o8L3Q9j7k24O3r2J99qQ1J30m07K06J85l69
$$ 0 49 64 251 109 127 50 -172 -102 -10 84 -20 -88 -55 34 17 -207 -144 -236 -37 -45 36 166 -241 -35 150 -219
2328b19L9L53o2j64K6j48l0L07j92P5J76k50J21j10N0O3R7j12J14q1j60J1J04
$$ -219 -180 173 111 -53 -27 -175 -205 102 -90 -15 161 -89 32 -78 -28 35 132 20 134 53 -107 -96 8
2351Hm3K0P1n2L0j33L20m10L17j69K32k20j07N6Q6K46l4l17J01K0k16J92j77K77
$$ 8 -35 -15 56 4 34 -99 221 -189 128 -41 191 -29 -136 -80 6 252 218 -99 2 22 -194 -2 -179 98
2375I8K55k69k20K61J07r8k3n04M41j16q6L12k89K27P6J27l49j44K45k02K28J66
$$ 98 353 84 -136 125 232 134 111 -393 48 -68 -154 158 -131 96 172 299 -50 -194 51 -151 77 243
2397B43l7j89r2R1o4J82k87nJ31J49Q3J3k67O3P5j26k26L52o8J00j26k8M2O0m2
$$ 243 206 17 -75 16 -48 134 -153 -158 -27 122 205 218 -49 14 89 -37 -263 89 21 121 -5 -33 9 69 27
2422B7j45n0J14J62j59J10j99J7j13K64N3k46L7K76r3J84k08K62k12M4m9kk44
$$ 27 -118 -168 -54 108 -51 59 -140 -123 -236 28 81 -165 -128 148 55 239 31 293 81 125 76 74 -170
2445a70L8J66j46J64j39j92N97m87J35j02J05o5J23L8k61K73j66K24Nj2j39L82
$$ -170 -132 34 -112 52 -87 -279 318 -169 -34 -136 -31 -96 27 65 -196 77 -89 135 140 128 -11 371
2467C71j84o1m3Q4n6M3k16J23J92l27j7J14q1K4J13p3Q4j01k78K90Pl8J40j85
$$ 371 187 126 83 167 111 154 -62 61 253 -74 -91 23 -58 -34 79 6 90 -11 -289 1 8 -30 110 -75
2491g5q3j75M48j93N5R0n2M1k1Q5J17j09n7j79j41M04m56M58k64L2J15j44J44
$$ -75 -158 -333 115 -78 -23 67 15 56 35 120 237 128 71 -108 -249 155 -301 157 -107 -75 40 -104 40
2514D0j92J64kk68j42M52l05K62r9L12j50j69K40k44k71L14L87m15P9J41j68m4
$$ 40 -152 12 10 -258 -400 52 -253 9 -90 222 72 -97 143 -101 -372 -58 329 -86 -7 134 -34 -78
2536g8M9J3j92J12Mj47L31o3O6j72Q6o7K0k18J47J0J02N3j30j93K85P1JJ1O9j60
$$ -78 -29 -16 -208 -96 -92 -239 92 29 95 -77 9 -58 -38 -256 -109 -99 3 56 -74 -267 18 89 90 101 170 10
2562A0R5J6L4k81J48J78j64j32L47j81M0N9l6j23R0j15J73n8j22P4k92J10J6J21
$$ 10 105 121 155 -126 22 200 36 -96 251 70 110 169 133 10 100 -15 158 100 -22 52 -240 -130 -114 7
2586Gn6J38P2r3P8p2J26q9roN1P8N0j20l69pJ56j02L04o4k89L18k91K31L4j45
$$ 7 -49 89 161 68 146 74 200 111 102 96 147 225 275 155 -214 -221 -65 -167 137 73 -216 102 -189 42 76 -69
2612f9q8K6J67j13J26j70J82J72k05j66K44p8N5k70L47j98R7lP5r9J6Q6k76N8
$$ -69 -157 -131 36 -77 49 -121 61 233 28 -138 106 28 83 -187 160 -38 59 56 131 32 48 134 -142 -84
2636h4N4J96m02J79m7J20QO4j67K44j72q5J98l24J50J65k39K1K81j30Op9J1Q2
$$ -84 -30 166 -236 -57 -104 16 24 88 -79 165 -7 -92 106 -218 -68 97 -142 -121 160 30 36 -43 -32 50
2660E0n1q5J07kq2J5N7%j57J11K74l39J55l1j5O9m3k11J56J16k91J76Q4q3n6J86
$$ 50 -1 -86 21 19 -63 -48 9 9 -148 -37 237 -102 53 22 7 76 33 -178 -22 94 -197 -21 63 -20 -76 110
2686A10j84M6r2J72o9J01L7k00j57L17j38J26j37p2L41l04L33l85K61j24J69q1
$$ 110 -74 -28 -120 52 -17 84 121 -79 -236 81 -57 69 -68 -140 201 -103 230 -155 106 -18 151 70
2708G0j13J43l87L92O4j31J52l93J41j1l4J9J25J35j28N2jkK14k30j52K06Q6j43
$$ 70 -43 100 -287 105 169 38 190 -203 -62 -73 -107 -88 37 172 44 96 95 93 307 77 -75 131 217 74
2732G4J42j42j83J33J16m5J54k12k72J71k93M96J4K9j62QL5o0N9k21l8K14M9J18
$$ 74 216 74 -109 24 140 95 249 37 -235 -64 -357 139 153 182 20 28 63 3 62 -159 -197 17 66 184
2756A84j04p2K34k46K99l67j18N52l77k2J41R3l25J81j49K5O0J09p4m8J08j09
$$ 184 80 8 242 -4 295 -72 -190 362 -15 -37 104 197 -128 53 -96 -71 -11 98 24 -24 84 -25
2778b5J47k9o3N0n0j60L52j90j53O2J10k05K31r5J73j5J36l27J46k70J08R9j86
$$ -25 122 93 30 80 30 -130 222 32 -121 -59 51 -154 77 -18 155 140 276 -51 95 -175 -67 32 -154
2801a54J72j49N3J71o4J23j24m1j78Q6J2J30j7j88J72j4jQ2J7j09J41j90j07L12
$$ -154 18 -131 -78 93 29 152 28 -13 -191 -105 -93 37 20 -168 4 -10 -11 71 88 -21 120 -70 -177 135
2825A35O1m07K71j12R4J18j4l28J62J96k15m1Q8J3o7rn0l7K29Q0m13L01M4Q2l61
$$ 135 196 -211 60 -52 42 160 146 -182 -20 176 -39 -80 8 21 -46 -55 -105 -142 87 167 -246 55 99 181 -180
2850a80L8O0N1J66mk3j6r4k58L12j92J93j34k3P7l2j73Q1K15m9k1P0L0j21J15
$$ -180 -142 -82 -31 135 131 108 92 -2 -260 52 -140 53 -81 -104 -27 -59 -232 -151 64 15 -6 64 94 -27 88
2875H8n37N13j21o6j00K31p0J12j36J4N7P9j78K28j27N7Q1j66M11m28Q3n4p5m9
$$ 88 -449 64 -57 -123 -223 8 -62 50 -86 -72 -15 64 -114 114 -13 44 125 -41 370 -58 25 -29 -104 -153
2899a53R4r9K42J46k39N3q4Q3M2q8o6j28J85p3M2K6K04j26j49J61K22k31k46K38
$$ -153 -59 -158 84 230 -9 44 -40 43 85 -3 -69 -197 -12 -85 -43 -17 187 61 -88 73 295 64 -182 56
2923E6l4k00R8J45k5j57Q1O1o0l0P7J73k45J61j07P4j86K15K2r5k3n6J43j62K75
$$ 56 22 -178 -80 65 40 -117 -36 25 -35 -65 12 185 -60 101 -6 68 -118 97 119 24 1 -55 88 -74 201
2948B01l63J48J27j20J50j14p8J51k6j28NJ56j56q5j10O6o6L22k4j18J1P6n6Q7
$$ 201 -162 -14 113 -7 143 29 -49 102 76 -52 -47 109 -47 -132 -242 -176 -242 80 56 -62 -51 25 -31 56
2972E6k32%Q4N0M7k57L12l1j9J12P0j1j25j23R5J27k10j45J01O0P6N9K39l69M0
$$ 56 -176 -176 -92 -42 5 -252 60 29 10 122 192 181 56 -67 28 155 -55 -200 -99 -39 37 96 335 -34 6
2997Fm01L31J8J80j42J70j83j15J31K6J12k5q9QN0j69l3N2L6Q5n6P0j29J9J25
$$ 6 -395 -64 -46 134 -8 162 -21 -136 -5 21 133 108 19 27 77 -92 -125 -73 -37 48 -8 62 -67 -48 77
3022G7rk00R2J60k47J43l85L80r4K58L1j79O8j4o8M1j76M7K5J93j5j56L1J93n6
$$ 77 68 -132 -40 120 -127 16 -369 11 -83 175 206 27 95 81 13 54 -122 -75 -50 143 128 -28 3 196 140
3047A40N7j02M7m3R7j22r8j57R1P1k83K87J51k09J9j15J22k0L3Q9m6j88R0N1p3
$$ 140 197 95 142 99 196 74 -24 -181 -90 -19 -302 -15 136 -73 -54 -169 -47 -67 -34 55 9 -179 -89 -38 -111
3072a11M4L09m30l1L89k55J8K3J3j81L49k12M5R6K12j69j85N1N2j25NL63j83m5
$$ -111 -67 242 -188 -219 170 -85 -67 -44 -31 -212 137 -75 -30 66 278 109 -76 -25 27 -98 -93 270 87 42
3096D2J51j39K17m38L34j13J26j55J47l9j0k3p2L2r3J72m05M14k59P1J61j62K03
$$ 42 193 54 271 -167 167 54 180 25 172 133 123 100 28 60 -33 139 -266 148 -111 -40 121 -41 162
3119A62Jr4k56J74J11k61J72M8l2k25J01j19L33k24r4K30k20P2K51k79k4J48j09
$$ 162 163 69 -187 -13 98 -163 9 57 25 -200 -99 -218 115 -109 -203 27 -193 -121 130 -149 -173 -25 -134
3142a34J51k32M96k31j45J17O1k68L09r5J5k4l71L38l2o2J16L3j26L8M9J4j58
$$ -134 17 -215 281 50 -95 22 83 -185 124 29 44 20 -351 -13 -45 -107 9 42 -84 -46 3 17 -141
3165a41K87j86RP0r8J99o1j21k29L93k8j38J77j15J02k03k91M71j65P8k7K9K3
$$ -141 146 -40 -31 39 -59 140 79 -42 -271 122 94 -44 133 18 120 -83 -374 97 -68 10 -17 12 35
3188C5j63J89R5r0J40l0j57r9k2R7J0r5R8K7j39k83K23j8N03N9l29N9q4j78K27
$$ 35 -128 61 156 66 206 176 19 -80 -102 -5 5 -90 8 35 -104 -387 -164 -182 321 380 51 110 26 -152 75
3213G5k16P4J35J00j04qL6l09J06K9P3R3j34J58K5k88K42k8N1k19J21l5m6N5k74
$$ 75 -141 -67 68 168 64 56 92 -217 -111 -82 -9 84 -50 108 133 -155 87 59 110 -109 12 -23 -69 -14 -288
3238b88M47l42O1n8J58P2l56L10m8J76l07R4J46P2j56%q9J96p5j04RM6K80k80
$$ -288 159 -183 -122 -180 -22 50 -306 4 -44 132 -175 -81 65 137 -19 -19 -108 88 13 -91 -82 -36 244 -36
3262c6k0j98J22%K73j07l2%J5j71K90j06L7J3j49j18m3M34j61J04m8n4O4j58N0
$$ -36 -56 -254 -132 -132 141 34 2 2 17 -154 136 30 67 80 -69 -187 -230 204 43 147 99 45 109 -49 1
3287Ak9k00m5K57q6j83M03j95J11j71K09K01j85j27J17p0j99J27N1j8k0j10J86
$$ 1 -28 -228 -273 -16 -102 -285 118 -77 34 -137 72 273 88 -39 78 8 -191 -64 -13 -31 -51 -161 25
3310B5On0L5%J88j44M8Q2k72K83j69o3J10o8Nj0j19J04J24l9k51L59j19o6n6K35
$$ 25 31 -19 16 16 204 60 108 190 -82 201 32 -31 79 11 16 6 -113 -9 115 76 -175 184 65 -1 -57 178
3336A78k37M5j16J2K37l38J58R0k32J85K2m8L05n0l20O1R1p3J61nj98j44K25L6
$$ 178 -59 -14 -130 -118 119 -219 -61 29 -203 -18 4 -44 261 211 -109 -48 43 -30 131 126 -72 -216 9 45
3360D5M0J55k73o7L00o4o4k72K38n6R1r3J4j13K01N9M2M0j84L3j7N2J06k7l08
$$ 45 85 240 -33 -100 200 136 72 -200 38 -18 73 -20 -6 -119 82 141 183 223 39 72 55 107 213 186 -122
3385a22K12r3J83j51p2p6J02o2J49o4J22j16k46J63P9Pj10K03j07p2m5J71j74
$$ -122 90 -3 180 29 -43 -119 -17 -79 70 6 128 12 -234 -71 8 15 -95 108 1 -71 -116 55 -119
3408a19R5J46l18Q7QM01l89K7J0j5M7K06j69J49k22L05l19n3M85n40K30k7j84
$$ -119 -24 122 -196 -109 -101 300 -89 -62 -52 -67 -20 186 17 166 -56 249 -70 -123 362 -178 52 25 -159
3431a59K25k89K95j24O3O3j30j19K06J09j77o6J75k62L80l08P1p6L65k90R2k95
$$ -159 66 -223 72 -52 11 74 -56 -175 31 140 -37 -103 72 -190 190 -118 -47 -123 242 -48 44 -251
3453b51K91j84K2j5P0K49k37P1NK25l00j26L15l5k04K54q3Mq4J13j39lP1J85j73
$$ -251 40 -144 -122 -137 -67 182 -55 16 21 246 -54 -180 135 100 -104 150 67 71 -13 100 -39 -42 29 214 41
3478D1K90l49J5k34L04%k9m2J24l61K09J01l35K70N2J17l24J38n3J42q0P7j47
$$ 41 331 -18 -3 -237 67 67 38 -4 120 -241 -32 69 -266 4 56 173 -151 -13 -66 76 -4 73 -74
3501g4J73J60k76k21K31J24j24J41J9j49K0j54j3J41j06K88j05j38K66r0j02p5
$$ -74 99 259 -17 -238 -7 117 -7 134 153 4 24 -130 -143 -2 -108 180 75 -63 203 113 11 -64
3523f4O8j71J64J43j93J7p5Q6N4O7M2O3pk24N9m6J31j78J93k61j20L53PJ54l98
$$ -64 4 -167 -3 140 -53 -36 -111 -25 29 96 138 201 194 -30 29 -17 114 -64 129 -132 -252 101 108 262 -136
3548a36K43rq4l50L39m0K34m39J11J59j85L12l03K25qn3O6j33P0k9j37J60q7K87
$$ -136 107 98 14 -336 3 -37 197 -242 -131 28 -157 155 -148 77 69 16 82 -51 19 -10 -147 13 -74 213
3572B13j59q1k47M01Q7l00O2J50j65J24j71K50k30L24j01k55K23P7L5k65L0q4
$$ 213 54 -27 -274 127 214 -86 -24 126 -39 85 -86 164 -66 258 157 -98 125 202 237 -28 2 -82
3594h2Q1l5J07l29K05k8K39j58J16Nk24K36q6J42k07P9j6p5kR9j33j29L49j84
$$ -82 -1 -36 71 -258 -53 -81 158 0 116 121 -103 133 47 189 -18 61 45 -30 -32 67 -66 -195 154 -30
3618c0j8J94o9j05J03k6n6o0P7j29Q1K60j90j76J2O3Q9l41L16J63m65L78j0M8
$$ -30 -48 146 77 -28 75 49 -7 -67 10 -119 -38 222 32 -144 -132 -69 20 -321 -5 158 -307 71 61 109
3642A09p7l8j10R8K11L0m75L80j85K7rN9L56l14j12J90M5j60j00L9k24M03k06
$$ 109 32 -6 -116 -18 193 223 -252 128 -57 -30 -39 20 376 62 -50 140 185 25 -75 -36 -260 143 -63
3665f3J22j87J37P7m58K48M6p1M3J80L3j6j9j45Ol6n2L03j59p1Q9Qj08M7L1K82
$$ -63 59 -128 9 86 -372 -124 -78 -149 -106 74 107 91 72 -73 -67 -103 -155 148 -11 -82 7 15 -93 -46 -15 267
3691B67k56L8j10J34j94J54J70k16n4J77l6k82J99j7j51J71j84J34Q1j69J13N
$$ 267 11 49 -61 73 -121 33 203 -13 -67 110 74 -208 -9 -26 -177 -6 -190 -56 25 -144 -31 -26
3713b6r0J77n2l8K09j73M9j46K48j09j58J02K61j90j12j11K36J2j38Qj0k0L2j24
$$ -26 -116 61 9 -29 180 7 56 -90 158 49 -109 -7 254 64 -48 -159 77 89 -49 -41 -51 -71 -39 -163
3737a63N6K98k93J54j74J42M7k2j03L5N6q1J88j6j1j28J88r8n7L7K1l65p7L12
$$ -163 -107 191 -102 52 -122 20 67 45 -58 -23 33 -48 140 124 113 -15 173 75 18 55 76 -289 -366 -54
3761e4k65K45k6J59K94l45k28J51J47j81J30J6j9k15J75j2R2l51Q0N72m79R8M8
$$ -54 -319 -74 -100 59 353 8 -220 -69 78 -103 27 43 24 -191 -16 -28 64 -287 -207 365 -114 -16 32
3784C2j72K17j65j35K10J90n58J08K64j00J83l8q3r0K89l51L64p8J05k51J18m1
$$ 32 -140 77 -88 -223 -13 177 -381 -273 -9 -109 74 36 -47 -137 152 -199 165 87 192 -59 59 18
3806A8j5RJ44l4l22J43j97J08J54n6K34k84O6J1r8K11j99J42J22pk00J07o9Q6
$$ 18 3 12 156 122 -200 -57 -254 -146 8 -48 186 -98 -32 -21 -119 92 -107 35 157 150 -50 57 -12 74
3830G4k96O2L2J62Mk76J27J7N9J92j74j05J34q4m7K35j37J8r6j79J52K16q1q4
$$ 74 -222 -160 -128 34 38 -238 -111 -94 -35 157 -17 -122 12 -72 -119 116 -21 -3 -99 -278 -126 90 9 -75
3854g5j6J37J2n0q2O6rj91M24m98K24Q2m1m16M87j3lR0p9j14k31K79p3Lp6K20
$$ -75 -91 46 58 8 -74 -8 -17 -208 216 -282 -58 24 -17 -433 54 41 38 128 49 -65 -296 -17 -90 -87 -163 57
3880E7j61K6J18j60k68O43k94j03K02r8K36j81J09k3j41Q2j63j0J52K13l04N1
$$ 57 -104 -78 40 -120 -388 255 -39 -142 60 -38 198 17 126 103 -38 44 -119 -129 23 236 -68 -17
3902a7R2j94J71j98M24k13j83J93j15J81k41K31k89K27j75P4po0j26J0N5n3R6
$$ -17 75 -119 52 -146 278 65 -118 75 -40 141 -100 131 -158 69 -106 -32 -39 -99 -225 -215 -160 -213 -117
3925a17N9L3M9k5n5J21q5K45k12m14M18J71o8k23K51k28K38R0k51O1o7m5Q7n2
$$ -117 -58 -25 24 -1 -56 65 -20 225 13 -401 17 188 120 -103 148 -80 158 248 -3 58 -9 -54 33 -19
3949a9K18o5j0j44j8K13p4j99r0P7P9J20j78p0L21j32j22L3N1j0L9O3J7PJ32l46
$$ -19 199 134 124 -20 -38 175 101 -98 -188 -111 -32 88 -90 -160 161 29 -93 -60 -9 -19 20 83 100 107 239 -107
3975a07Q8L13k11l7R6r1J12m47L37k8j59L03k88J77k23M9q9J14j0K41l69K42j15
$$ -107 -19 294 83 46 142 51 163 -284 53 25 -134 169 -119 58 -165 -116 -205 -91 -101 140 -229 13 -102
3998a02K1r3K69j00P8j43k35L99j65L0j1J1J06k03L33j70r1J40mm6J28l56J39
$$ -102 -81 -174 95 -5 73 -70 -305 94 -71 -41 -52 -41 65 -138 195 25 -66 74 70 24 152 -204 -65
$$ [...]
8191G9
##END NTUPLES=NMR FID
##END=
