##TITLE=1H_SR141rek
 CDCl3
 8 sc, 
 17.10.2022
##JCAMPDX= 6.0         $$ Bruker NMR JCAMP-DX V2.0
##DATA TYPE= NMR FID
##DATA CLASS= NTUPLES
##ORIGIN= UXNMR, Bruker Analytische Messtechnik GmbH
##OWNER= root
$$ XWIN-NMR		Version 3.5
$$ Mon Oct 17 16:51:26 2022 Russian Standard Time (UT+4h)  she@DPX200
##.OBSERVE FREQUENCY= 200.1313499994
##.OBSERVE NUCLEUS= ^1H
##.DELAY= (6, 6)
##.ACQUISITION MODE= SIMULTANEOUS
##.ACQUISITION SCHEME= undefined
##.AVERAGES= 8
##.DIGITISER RES= 18
##SPECTROMETER/DATA SYSTEM= spect
##.PULSE SEQUENCE= zg30
##.SOLVENT NAME= CDCl3
##.SHIFT REFERENCE= (INTERNAL, CDCl3, 0, 15.7039)
##AUDIT TRAIL= $$ (NUMBER, WHEN, WHO, WHERE, WHAT)
$$ ##TITLE= Audit trail, XWIN-NMR		Version 3.5
$$ ##JCAMPDX= 5.01
$$ ##ORIGIN= Bruker BioSpin GmbH
$$ ##OWNER= she
$$ F:/spectra/data/she/nmr/H-F/1/audita.txt
$$ ##AUDIT TRAIL=  $$ (NUMBER, WHEN, WHO, WHERE, WHAT)
(   1,<2022-10-17 16:50:37.04 +0400>,<she>,<DPX200>,
      <created by zg, POWCHK disabled, PULCHK disabled
       configuration hash MD5:
       00 E9 B6 7A A2 85 ED C7 34 08 36 98 17 FE 4E 26
       data hash MD5: 16K
       71 B1 CE AF E9 B7 31 C3 33 C8 B2 F6 C9 A1 F9 52>)
$$ ##END=
$$ 
$$ hash MD5
$$ 41 02 44 A9 87 6B 2F F6 FE 83 20 8A 5F 4A 97 68
##$RELAX= 
##$RELAX= 
##$RELAX= 
##$RELAX= 
##$RELAX= 
##$RELAX= 
$$ Bruker specific parameters
$$ --------------------------
##$DU= <F:/spectra>
##$EXPNO= 1
##$NAME= <H-F>
##$PROCNO= 1
##$TYPE= <nmr>
##$USER= <she>
##$AMP= (0..31)
100 100 100 100 100 100 100 100 100 100 100 100 100 100 100 100 100 100 
100 100 100 100 100 100 100 100 100 100 100 100 100 100 
##$AQSEQ= 0
##$AQ_mod= 1
##$AUNM= <au_zg>
##$AUTOPOS= <>
##$BF1= 200.13
##$BF2= 200.13
##$BF3= 200.13
##$BF4= 200.13
##$BF5= 200.13
##$BF6= 200.13
##$BF7= 200.13
##$BF8= 200.13
##$BYTORDA= 1
##$CFDGTYP= 0
##$CFRGTYP= 5
##$CHEMSTR= <none>
##$CNST= (0..31)
1 1 145 1 1 1 1 1 1 1 1 1 1 1 1 1 1 1 1 1 1 1 1 1 1 1 1 1 1 1 1 1 
##$CPDPRG= <>
##$CPDPRG1= <>
##$CPDPRG2= <>
##$CPDPRG3= <>
##$CPDPRG4= <mlev>
##$CPDPRG5= <mlev>
##$CPDPRG6= <mlev>
##$CPDPRG7= <mlev>
##$CPDPRG8= <mlev>
##$CPDPRGB= <>
##$CPDPRGT= <>
##$D= (0..31)
0 1.2 0 0 0 0 0 0 0 0.06 0 0.03 0 0 0 0 0.0002 0 0 0 0 0 0 0 0 0 0 0 0 
0 0 0 
##$DATE= 1666011036
##$DBL= (0..7)
120 120 120 120 120 120 120 120 
##$DBP= (0..7)
150 150 150 150 150 150 150 150 
##$DBP07= 0
##$DBPNAM0= <>
##$DBPNAM1= <>
##$DBPNAM2= <>
##$DBPNAM3= <>
##$DBPNAM4= <>
##$DBPNAM5= <>
##$DBPNAM6= <>
##$DBPNAM7= <>
##$DBPOAL= (0..7)
0.5 0.5 0.5 0.5 0.5 0.5 0.5 0.5 
##$DBPOFFS= (0..7)
0 0 0 0 0 0 0 0 
##$DE= 6
##$DECBNUC= <off>
##$DECIM= 32
##$DECNUC= <off>
##$DECSTAT= 4
##$DIGMOD= 1
##$DIGTYP= 9
##$DL= (0..7)
0 120 120 120 120 120 120 120 
##$DP= (0..7)
150 150 150 150 150 150 150 150 
##$DP07= 0
##$DPNAME0= <>
##$DPNAME1= <>
##$DPNAME2= <>
##$DPNAME3= <>
##$DPNAME4= <>
##$DPNAME5= <>
##$DPNAME6= <>
##$DPNAME7= <>
##$DPOAL= (0..7)
0.5 0.5 0.5 0.5 0.5 0.5 0.5 0.5 
##$DPOFFS= (0..7)
0 0 0 0 0 0 0 0 
##$DQDMODE= 0
##$DR= 18
##$DS= 0
##$DSLIST= <SSSSSSSSSSSSSSS>
$$ [...]
##$SUBNAM2= <"">
##$SUBNAM3= <"">
##$SUBNAM4= <"">
##$SUBNAM5= <"">
##$SUBNAM6= <"">
##$SUBNAM7= <"">
##$SUBNAM8= <"">
##$SUBNAM9= <"">
##$SW= 18.0517283424941
##$SWIBOX= (0..15)
0 0 2 0 0 0 0 0 0 0 0 0 0 0 0 0 
##$SW_h= 3612.71676300578
##$TD= 16384
##$TD0= 1
##$TE= 0
##$TE2= 300
##$TE3= 300
##$TEG= 300
##$TL= (0..7)
0 120 120 120 120 120 120 120 
##$TP= (0..7)
150 150 150 150 150 150 150 150 
##$TP07= 0
##$TPNAME0= <>
##$TPNAME1= <>
##$TPNAME2= <>
##$TPNAME3= <>
##$TPNAME4= <>
##$TPNAME5= <>
##$TPNAME6= <>
##$TPNAME7= <>
##$TPOAL= (0..7)
0.5 0.5 0.5 0.5 0.5 0.5 0.5 0.5 
##$TPOFFS= (0..7)
0 0 0 0 0 0 0 0 
##$TUNHIN= 0
##$TUNHOUT= 0
##$TUNXOUT= 0
##$USERA1= <user>
##$USERA2= <user>
##$USERA3= <user>
##$USERA4= <user>
##$USERA5= <user>
##$V9= 5
##$VALIST= <valist>
##$VCLIST= <CCCCCCCCCCCCCCC>
##$VD= 0
##$VDLIST= <DDDDDDDDDDDDDDD>
##$VPLIST= <PPPPPPPPPPPPPPP>
##$VTLIST= <TTTTTTTTTTTTTTT>
##$WBST= 1024
##$WBSW= 4
##$XGAIN= (0..3)
0 0 0 0 
##$XL= 0
##$YL= 0
##$YMAX_a= 167992
##$YMIN_a= -145668
##$ZGOPTNS= <>
##$ZL1= 120
##$ZL2= 120
##$ZL3= 120
##$ZL4= 120
##$ABSF1= 10
##$ABSF2= 0
##$ABSG= 5
##$ABSL= 3
##$ALPHA= 0
##$AQORDER= 0
##$ASSFAC= 0
##$ASSFACI= 0
##$ASSFACX= 0
##$ASSWID= 0
##$AUNMP= <proc_1d>
##$AZFE= 0.1
##$AZFW= 0.1
##$BCFW= 1
##$BC_mod= 2
##$BYTORDP= 1
##$COROFFS= 0
##$CY= 11.3945322036743
##$DATMOD= 1
##$DC= 2
##$DFILT= <>
##$DTYPP= 0
##$F1P= 2.36226072786647
##$F2P= -0.459571619588291
##$FCOR= 0.5
##$FTSIZE= 0
##$FT_mod= 4
##$GAMMA= 1
##$GB= 0.15
##$INTBC= 1
##$INTSCL= 1
##$ISEN= 128
##$LB= 0.24
##$LEV0= 0
##$LPBIN= 0
##$MAXI= 10000
##$MC2= 0
##$MEAN= 0
##$ME_mod= 0
##$MI= 1.114404
##$NCOEF= 0
##$NC_proc= 0
##$NLEV= 6
##$NOISF1= 3.799351
##$NOISF2= 2.8
##$NSP= 1
##$NTH_PI= 0
##$NZP= 0
##$OFFSET= 15.70392
##$PC= 1
##$PHC0= -18032.66
##$PHC1= 9.600691
##$PH_mod= 1
##$PKNL= yes
##$PPARMOD= 0
##$PSCAL= 0
##$PSIGN= 0
##$REVERSE= no
##$SF= 200.130013532006
##$SI= 16384
##$SIGF1= 3
##$SIGF2= 2
##$SINO= 400
##$SIOLD= 16384
##$SREGLST= <1H.CDCl3>
##$SSB= 0
##$STSI= 0
##$STSR= 0
##$SW_p= 3612.71676300578
##$SYMM= 0
##$S_DEV= 0
##$TDeff= 0
##$TDoff= 0
##$TI= <>
##$TILT= no
##$TM1= 0
##$TM2= 0
##$TOPLEV= 0
##$USERP1= <user>
##$USERP2= <user>
##$USERP3= <user>
##$USERP4= <user>
##$USERP5= <user>
##$WDW= 1
##$XDIM= 8192
##$YMAX_p= 0
##$YMIN_p= 0
$$ End of Bruker specific parameters
$$ ---------------------------------
##NTUPLES= NMR FID
##VAR_NAME=  TIME,          FID/REAL,        FID/IMAG
##SYMBOL=    X,             R,               I
##VAR_TYPE=  INDEPENDENT,   DEPENDENT,       DEPENDENT
##VAR_FORM=  AFFN,          ASDF,            ASDF
##VAR_DIM=   8192,          8192,            8192
##UNITS=     SECONDS,       ARBITRARY UNITS, ARBITRARY UNITS
##FACTOR=    0.0002768,     1,               1
##FIRST=     0,             0,               0
##LAST=      2.2672688,     0,               0
##MIN=       0,             -145668,         0
##MAX=       2.2672688,     167992,          0
$$ Real data points
##PAGE= N=1
##DATA TABLE= (X++(R..R)), XYDATA
$$ [...]
$$ plain form
1817 45 331 152 -90 200 154 6 -464 -233 -59 -83 -210 -276 -283 -316 -342 -323 -30 -303 -287 -43 88 -52 9 253
1841 253 72 226 153 247 157 241 316 282 368 386 137 146 147 -15 -265 -166 -411 -18 -83 -159 -140 -228 -251 -249 -208 -172 -102 144
1869 144 -21 188 54 63 -3 4 269 167 203 321 16 389 245 233 165 84 294 84 9 -47 -203 -429 -250 -87
1893 -87 -287 -393 -116 -301 -282 -457 -273 18 199 -141 101 49 8 215 269 182 241 259 137 76 435 293 -42
1916 -42 27 -195 59 -314 -231 -275 -270 -53 -250 -155 -335 -540 -367 -281 -173 -194 -69 215 70 -143 149 173 337
1939 337 292 216 46 290 370 -13 333 284 347 -90 -83 -186 -67 -75 -93 -341 -222 -115 -158 -382 -355 -206 -318 -292
1963 -292 -497 -88 30 240 295 158 238 82 71 442 288 330 460 318 271 197 136 -66 113 52 148 218 -165
1986 -165 -113 -254 -188 -7 -303 -482 -188 -142 1 -221 -419 50 -223 -40 80 -13 134 323 215 331 211
$$ packed form
1817D5K86j79k42K90m6j48m70K31J74k4j27o6pl3k6J9K93k73J6K44J31j40O1K44
1841B53j81J54p3R4r0Q4P5l4Q6J8k49RJj62k50R9k45L93o5p6J9q8k3KM1L6P0K46
1869A44j65K09j34Ro6PK65j02L6J18l05L73j44j2o8q1K10k10p5n6j56k26J79J63
1893h7k00j06K77j85J9j75J84K91J81l40K42n2m1K07N4q7N9J8j22o1L59j42l35
1916d2O9k22K54l73Q3m4NK17j97R5j80k05J73Q6J08k1J25K84j45k13K92K4J64
1939C37m5p6j70K44Q0l83L46m9O3m37Pj03J19qj8k48J19J07m3k24K7J49j12K6
1963b92k05M09J18K10N5j37Q0j56j1L71j54M2J30j42m7p4o1k02J79o1R6P0l83
1986a65N2j41O6J81k96j79K94M6J43k22j98M69k73J83J20r3J47J89j08J16j20
$$ plain form
2007 211 93 387 221 203 196 -94 194 -30 -173 -123 -139 -188 -328 -345 -372 -208 -84 -208 -69 -110 -261 -101 15
2030 15 -255 84 -46 73 -45 241 50 84 250 451 281 84 277 182 77 -83 84 125 32 -84 -49 -265
2052 -265 -269 -203 -170 -76 -131 -272 -429 157 -301 -157 -192 -13 51 191 166 220 205 -37 284 -75 428 112 39 165
2076 165 -46 44 144 -13 -185 -248 10 -105 -231 -340 -59 -340 -272 -131 -87 -237 6 -111 20 62 30 235
2098 235 48 472 159 1 542 227 61 275 108 372 226 -192 -145 -56 123 34 34 -326 -380 -325 -216 -149 -206
2121 -206 -212 -237 -282 -170 -35 381 -6 -63 335 -5 -123 371 45 74 346 170 205 156 7 -103 -81 34 -49
2144 -49 -83 -100 -165 -107 -178 -184 -218 28 -147 -261 -28 -45 -294 -138 250 125 217 47 -45 49 103 186 244 66 102 495
2170 495 282 47 -21 175 183 -164 -94 83 -351 -244 -428 27 -83 -111 -287 -400 -253 -259 -154 -212 -58 -31 128
$$ packed form
2007B11j18K94j66j8pk90K88k24j43N0j6m9j40j7k7J64J24j24J39m1j51J60J16
2030A5k70L39j30J19j18K86j91L4J66K01j70j97J93r5j05j60J67M1r3j16L5k16
2052b65mO6L3R4n5j41j57N86m58J44l5J79O4J40k5N4j5k42L21l59N03l16p3J26
2076A65k11R0J00j57j72o3K58j15j26j09K81k81O8J41M4j50K43j17J31M2l2K05
2098B35j87M24l13j58N41l15j66K14j67K64j46m18M7Q9J79q9%l60n4N5J09O7n7
2121b06ok5m5J12J35M16l87n7L98l40j18M94l26K9K72j76L5m9j49j10K2J15q3
2144d9l4j7o5N8p1ol4K46j75j14K33j7k49J56L88j25R2j70r2R4N4Q3N8j78L6L93
2170D95k13k35o8J96Ql47P0J77m34J07j84M55j10k8j76j13J47oJ05n8J54K7J59
$$ plain form
2193 128 161 125 336 -24 492 -68 19 282 310 209 62 78 -114 -154 -229 -63 -13 -184 71 44 44 -24 -208 -180
2217 -180 -146 -333 -261 -4 -116 -166 125 110 218 219 108 59 246 189 235 244 55 285 76 240 -68 76 -91 -40
2241 -40 -556 36 -133 -466 -227 -228 -75 -170 -80 -214 -99 -83 -112 -277 248 -105 -129 282 66 -160 266 -92 40
2264 40 195 372 194 210 89 -202 162 -90 295 -162 -183 117 -211 -48 -183 -184 -258 -382 -252 -43 -59 16 -198
2287 -198 40 -23 74 -6 182 167 282 42 401 200 76 186 386 258 72 32 -270 8 117 -32 -88 -51
2309 -51 -212 -204 -303 -337 -378 -63 -111 -83 -97 6 -35 259 10 -86 107 49 237 4 -26 401 172 255 31 105 203
2334 203 141 -74 -9 41 -12 92 -251 -65 -160 -151 44 -123 21 -60 -311 -198 41 2 -217 -9 186 61 67 146
2358 146 -31 138 110 428 240 175 254 274 208 -110 -40 -149 -114 46 -108 -85 -253 -36 -107 -250 -36 -264 39
$$ packed form
2193A28L3l6K11l60N16n60Q7K63K8j01j47J6j92m0p5J66N0j71K55k7%o8j84K8
2217a80L4j87P2K57j12n0K91j5J08Jj11m9J87n7M6Rj89K30k09J64l08J44j67N1
2241d0n16N92j69l33K39jJ53r5R0j34J15J6k9j65N25l53k4M11k16k26M26l58J32
2264D0J55J77j78J6j21k91L64k52L85m57k1L00l28J63j35jp4j24J30K09j6P5k14
2287a98K38o3R7q0J88j5J15k40L59k01j24J10K00j28j86m0l02K78J09j49n6L7
2309e1j61Qr9l4m1L15m8K8j4J03m1K94k49r6J93n8J88k33l0M27k29Q3k24P4R8
2334B03o2k15O5N0n3J04l43J86r5RJ95j67J44q1k51J13K39l9k19K08J95j25OP9
2358A46j77J69k8L18j88o5P9K0o6l18P0j09L5J60j54K3j68K17p1j43K14k28L03
$$ plain form
2381 39 -22 -167 9 -118 -140 118 141 -56 160 308 36 -165 295 -78 30 30 -77 262 171 162 -47 -144 -148 105
2405 105 246 -236 -81 -81 -173 -226 -146 -88 123 -83 -313 30 -141 -213 58 204 220 -125 -103 219 131 387 132
2428 132 333 -14 -83 133 -14 165 -146 95 -96 -345 -224 -88 -148 -219 -50 -189 -247 -2 76 -110 -151 -337
2450 -337 51 31 4 32 154 3 -249 80 71 27 371 -188 176 60 -30 -128 -112 97 -177 -66 -157 -310 -26
2473 -26 -24 -87 80 -177 7 55 -40 -32 173 -122 -111 116 -86 62 87 -55 -228 26 150 19 -97 12 338
2496 338 121 43 -18 129 -21 106 -22 -38 -267 -125 -150 -14 -134 -94 -235 -157 20 -150 133 -4 -33 -125 65
2519 65 150 46 274 25 97 361 186 -54 -61 115 19 223 124 -7 -30 -191 -3 -155 -203 -193 -219 -276 -254 -98
2543 -98 225 233 -129 182 125 -164 -97 152 241 -170 -167 13 146 110 92 -47 -198 85 66 189 -167 -188 -240 -99
$$ packed form
2381C9o1j45J76j27k2K58K3j97K16J48k72k01M60l73J08%j07L39r1rk09r7mK53
2405A05J41m82J55%r2n3Q0N8K11k06k30L43j71p2K71J46J6l45K2L22q8K56k55
2428A32K01l47o9K16j47J79l11K41j91k49J21J36o0p1J69j39n8K45P8j86m1j86
2450c37L88k0k7K8J22j51k52L29rm4L44n59L64j16r0r8J6K09k74J11r1j53K84
2473b6Ko3J67k57J84M8r5QK05k95J1K27k02J48K5j42j73K54J24j31j16J09L26
2496C38k17p8o1J47j50J27j28j6k29J42k5J36j20M0j41P8J77j70K83j37k9r2J90
2519F5Q5j04K28k49P2K64j75k40pJ76r6K04r9j31k3j61J88j52m8J0k6n7K2J56
2543i8L23Ql62L11n7k89O7K49Q9m11LJ80J33l6j8j39j51K83j9J23l56k1n2J41
$$ plain form
2567 -99 50 -94 -171 -127 83 -32 -125 -100 -187 -66 50 -192 365 36 260 -38 -53 187 306 106 236 -24
2589 -24 44 256 46 52 100 405 55 79 203 -68 -63 -354 -230 71 -118 -249 23 121 -3 81 -40 49 -186 42
2613 42 85 -88 360 51 137 144 9 445 81 126 -29 107 26 -41 99 -182 -168 93 174 -55 -68 -382 -30 -228
2637 -228 -288 162 19 136 260 111 -176 346 56 -116 34 180 109 115 30 -28 153 207 103 42 190 162 143
2660 143 236 -144 -254 -177 218 -175 -81 -173 -177 83 170 -51 -35 -235 279 -67 142 160 -212 5 340 81 -48
2683 -48 -84 -9 175 -25 -74 47 160 313 194 71 14 219 -23 42 3 -73 10 -335 54 -104 -222 -201 -110 40
2707 40 172 -80 231 50 21 -5 231 470 236 -77 117 239 201 58 -215 145 89 107 -324 101 -78 -18
2729 -18 50 -6 82 116 -217 -153 -298 -252 -125 -38 -125 173 -158 -139 57 -142 -80 -80 132 15 129 162 -101 -101 33
$$ packed form
2567i9J49j44p7M4K10j15r3K5q7J21J16k42N57l29K24k98j5K40J19k00J30k60
2589b4O8K12k10OM8L05l50K4J24k71Nk91J24L01j89j31K72R8j24Q4j21Q9k35K28
2613D2M3j73M48l09Q6Pj35M36l64M5j55J36q1o7J40k81J4K61Q1k29j3l14L52j98
2637b28o0M50j43J17J24j49k87N22k90j72J50J46p1Oq5n8J81N4j04o1J48k8j9
2660A43R3l80j10P7L95l93R4r2mK60Q7k21J6k00N14l46K09J8l72K17L35k59j29
2683d8l6P5J84k00m9J21J13J53j19j23n7K05k42O5l9p6Q3l45L89j58j18K1R1J50
2707D0J32k52L11j81k9k6K36K39k34l13J94J22l8j43k73L60n6J8m31M25j79O0
2729a8O8n6Q8L4l33O4j45M6J27Q7q7K98l31J9J96j99O2%K12j17J14L3k63%J34
$$ plain form
2754 33 -1 115 -42 158 -28 -119 60 -57 -94 -166 -201 98 -81 -32 -143 27 -75 230 16 -70 328 57 6
2777 6 -130 -76 124 -129 55 -11 -47 -66 28 -64 144 214 135 125 135 -231 -21 195 -29 131 -142 -132 -38 -122 -173
2802 -173 -259 101 -75 -167 -99 210 120 176 -92 209 -57 164 35 -14 130 171 168 -97 -75 -56 61 7 -213 83
2826 83 -220 -73 37 -42 52 29 -56 -177 36 129 -275 -162 -44 -221 240 -116 140 298 -117 -2 -17 -86 102
2849 102 50 156 224 -74 44 87 273 -111 39 -64 22 -155 -72 110 82 -54 -180 -243 163 -167 23 -211
2871 -211 -6 23 36 57 2 357 126 146 158 131 -88 143 -11 42 8 -13 -53 104 -174 -227 -56 47 94 -2 -4
2896 -4 -274 -79 8 59 70 -418 -12 -275 84 33 167 -167 -172 145 66 165 108 -67 182 87 77 -6 -185 150 60
2921 60 -11 15 -144 -350 -199 28 -69 120 35 -93 -362 -105 53 8 -149 -47 1 260 -17 105 -151 4
$$ packed form
2754C3l4J16j57K00j86r1J79j17l7p2l5K99j79M9j11J70j02L05k14q6L98k71n1
2777Fj36N4K00k53J84o6l6j9R4r2K08P0p9j0J0l66K10K16k24J60k73J0R4q4n1
2802a73q6L60j76r2O8L09r0N6k68L01k66K21j29m9J44M1lk65K2J9J17n4k20K96
2826H3l03J47J10p9R4k3q5j21K13R3m04J13J18j77M61l56K56J58m15J15j5o9J88
2849A02n2J06O8k98J18M3J86l84J50j03Q6j77Q3J82k8j36j26o3M06l30J90k34
2871b11K05K9J3K1n5L55k31K0J2k7k19K31j54N3l4k1m0J57k78n3J71J03M7r6k
2896dk70J95Q7N1J1m88M06k63L59n1J34l34nL17p9R9n7j75K49r5j0q3j79L35r0
2921F0p1K6j59k06J51K27r7J89q5j28k69K57J58m5j57J02M8K59k77J22k56J55
$$ plain form
2943 4 -73 174 168 -161 67 -62 58 -173 71 -133 -36 99 83 18 82 -185 -110 98 -43 -72 -141 60 68 -33 -249
2968 -249 114 -157 73 -213 4 149 66 203 39 77 33 159 120 49 -87 -87 63 -42 118 -2 -139 -11
2990 -11 -69 -210 -155 103 -21 99 -22 -29 58 185 206 213 -141 -65 43 0 -17 249 103 116 314 15 37 -252 137
3015 137 -32 59 -85 -32 133 83 25 -175 -4 -265 2 -139 2 79 -130 -51 -49 -50 -39 24 71 279 -206 29
3039 29 -58 -169 158 17 71 110 267 246 173 -187 112 68 -152 35 -35 26 -68 -74 -21 -84 -100 -178 -25 -250 -215 179
3065 179 311 48 -100 -19 -182 77 67 -81 86 415 126 164 -27 -180 -49 -252 -61 -21 -240 -289 -123 190
3087 190 -227 28 156 -57 15 -70 -398 -89 265 -15 -10 -187 -35 72 263 260 -49 -246 -103 107 -304 129
3109 129 217 42 110 -7 -163 2 -83 -59 7 91 -187 -53 279 -159 -240 10 -1 -70 -147 -41 -143 87 211
$$ packed form
2943Dp7K47ol29K28j29J20k31K44k04R7J35j6o5O4k67P5K08j41k9o9K01Qj01k16
2968b49L63k71K30k86K17J45q3J37j64L8m4J26l9p1j36%J50j05J60j20j37J28
2990a1n8j41N5K58j24J20j21pQ7J27K1Pl54P6J08m3j7K66j46J3J98k99K2k89L89
3015A37j69R1j44N3J65n0n8k00J71k61K67j41J41P7k09P9KjJ1O3M7K08m85K35
3039B9q7j11L27j41N4L9J57k1p3l60K99m4k20J87p0O1r4oN3o3j6p8J53k25L5L94
3065A79J32k63j48Q1j63K59j0j48J67L29k89L8j91j53J31k03J91M0k19m9J66L13
3087A90m17K55J28k13P2q5l28L09L54k80Nj77J52J07J91ll09j97J43K10m11M33
3109A29Q8j75O8j17j56J65q5K4O6Q4k78J34L32m38q1K50j1o9p7J06j02K30J24
$$ plain form
3132 211 -42 160 108 30 173 -106 -17 -62 100 73 -90 -71 210 186 -250 161 -36 -83 7 -119 71 183 82
3155 82 -209 -340 57 -152 -1 24 0 372 -22 53 72 46 200 -126 7 79 -103 223 95 113 130 -63 274
3178 274 -43 39 203 -94 17 46 77 -91 -52 -157 -120 -172 150 -84 -100 -223 -46 10 -19 -74 123 29 -46 172
3202 172 90 -173 -23 -182 175 48 77 -39 -13 14 39 4 10 98 -46 11 115 -134 -50 -150 -102 48 -106 256
3226 256 49 59 -74 58 44 59 22 49 200 -162 -229 -81 -117 -34 52 55 -115 17 -42 -14 46 69 82 -31 -109 -69
3252 -69 114 -159 18 81 -43 -31 174 145 182 -259 253 259 23 127 91 -318 108 -142 -13 130 69 92 -295
3275 -295 -31 -96 138 -76 -56 160 -1 79 84 -214 -17 59 -198 151 -91 188 -95 284 137 19 5 35 -36
3298 -36 32 119 -89 69 73 -12 115 89 79 338 87 107 -367 -147 -144 -57 -271 -223 136 -64 -179 -153 -74 200 77
$$ packed form
3132B11k53K02n2p8J43k79Q9m5J62k7j63J9K81k4m36M11j97m7R0j26J90J12j01
3155H2k91j31L97k09J51K5k4L72l94P5J9k6J54l26J33P2j82L26j28J8J7j93L37
3178B74l17Q2J64k97J11K9L1j68L9j05L7n2L22k34j6j23J77N6k9n5J97r4p5K18
3202A72q2k63J50j59L57j27K9j16K6K7K5l5OQ8j44N7J04k49Q4j00M8J50j54L62
3226B56k07J0j33J32j4J5l7K7J51l62o7J48l6Q3Q6Lj70J32n9K8O0K3J3j13p8M0
3252f9J83k73J77O3j24J2K05k9L7m41N12Ok36J04l6m09M26k50J29J43o1K3l87
3275b95K64o5K34k14K0K16j61Q0Nk98J97P6k57L49k42K79k83L79j47j18j4L0p1
3298c6O8Q7k08J58Mq5J27k6j0K59k51K0m74K20LQ7k14M8L59k00j15K6P9K74j23
$$ plain form
3323 77 7 44 -52 -57 64 -121 19 29 -73 20 136 -22 -92 104 -79 232 -208 27 188 -70 -46 -97 19 7
3347 7 -320 154 -285 -12 164 27 -103 89 -155 -232 -90 24 153 -156 -45 268 -82 -50 96 -151 -282
3368 -282 -63 103 145 155 20 159 15 96 -5 44 -51 44 -94 -239 -8 -86 -101 -108 65 11 -19 -99 159 -176
3392 -176 -152 98 187 -145 42 230 -189 -121 -22 138 109 280 21 80 62 71 1 218 199 129 -115 102 98 -291 65
3417 65 -272 133 53 -61 134 61 171 48 -254 1 -38 65 92 -54 -54 -72 2 118 49 62 -58 -6 147 141 -24
3442 -24 -81 -88 -32 147 -274 -30 -28 -16 244 135 -67 -25 -32 -107 -24 196 10 -172 -81 213 7 67 45 206 240 150
3468 150 14 170 -147 85 47 51 -90 230 51 -35 13 59 -78 -81 194 -204 214 60 271 -81 82 -133 -214
3491 -214 -22 -169 31 45 -23 60 -80 179 -22 -12 39 42 -121 159 -124 138 235 80 265 105 -99 -149 -256
$$ packed form
3323G7p0L7r6nJ21j85J40J0j02R3J16j58p0J96j83L11m40K35J61k58K4n1J16j2
3347Gl27M74m39K73J76j37j30J92k44p7J42J14J29l09J11L13l50L2J46k47j31
3368b82K19J66M2J0j35J39j44Q1j01M9r5R5j38j45K31p8j5pJ73n4l0q0K58l35
3392a76K4K50Q9l32J87J88m19O8R9J60k9J71k59N9j8Rp0K17j9p0k44K17ml89L56
3417F5l37M05q0j14J95p3J10j23l02K55l9J03K7j46%j8P4J16o9J3j20N2J53oj65
3442b4n7pN6J79m21K44KJ2K60j09k02M2pp5Q3K20j86j82R1K94k06O0k2J61L4r0
3468A50j36J56l17K32l8Mj41L20j79q6M8M6j37lK75l98M18j54K11l52J63k15q1
3491b14J92j47K00J4o8Q3j40K59k01J0N1Lj63K80k83K62R7j55J85j60k04n0j07
$$ plain form
3514 -256 -108 13 -124 -80 115 -165 -287 -244 122 133 20 153 -109 53 -139 175 156 90 91 32 0 -177 233
3537 233 23 36 -172 -89 -168 143 19 -150 -72 64 36 17 249 -120 -36 -4 -46 18 9 130 115 70 85 -74 162
3562 162 -1 69 71 42 -189 167 195 -26 99 144 -7 -149 -65 -94 214 174 -65 -80 75 -8 7 -71 -83 123 38
3587 38 159 -166 109 75 141 398 168 205 31 -69 17 43 108 -81 94 225 -196 42 107 -252 -35 -124 66
3610 66 -234 -70 -41 -45 140 -167 -17 138 1 -31 -116 -34 46 -68 -162 116 15 88 64 -133 70 2 32 115 -95
3635 -95 7 177 38 -43 -100 -133 -153 -66 -4 13 38 -199 -322 -94 92 112 -61 -158 228 26 -40 166 39 -43
3659 -43 41 335 42 121 101 91 -151 -189 -194 258 -81 -148 98 -35 5 227 -91 61 62 13 -43 21 121 312 216
3684 216 140 42 200 -117 -221 -3 0 87 157 61 81 -126 69 192 -232 72 103 81 61 28 -167 98 9 -238
$$ packed form
3514b56J48J21j37M4J95k80j22M3L66J1j13J33k62J62j92L14j9o6Jn9l2j77M10
3537B33k10J3k08Q3p9L11j24j69P8J36k8j9K32l69Q4L2m2O4rJ21j5m5J5j59K36
3562A62j63P0Kk9k31L56K8k21J25M5j51j42Q4k9L08m0k39j5J55q3J5p8j2K06q5
3587C8J21l25K75l4O6K57k30L7j74j00Q6K6O5j89J75J31m21K38O5l59K17q9J90
3610F6l00J64K9mJ85l07J50J55j37l2q5Q2Q0j14r4K78j01P3k4j97K03o8L0Q3k10
3635i5J02J70j39q1n7l3k0Q7O2J7K5k37j23K28J86K0j73r7L86k02o6K06j27q2
3659d3Q4K94k93P9k0j0k42l8nM52l39o7K46j33M0K22l18J52Jm9n6O4J00J91r6
3684B16p6r8J58l17j04K18LQ7P0r6K0k07J95J23m24L04L1k2k0l3j95K65q9k47
$$ plain form
3708 -238 77 27 208 96 -131 19 20 -68 20 -62 121 95 340 -46 41 130 14 75 -218 22 19 78 -42 -86 -243
3733 -243 190 52 -109 156 -50 -107 146 134 3 214 3 -111 181 69 -161 -155 37 135 -21 -20 -28 -414 63
3756 63 93 83 -207 163 58 38 -59 91 -170 126 253 262 -176 -248 36 101 -370 -169 -257 -280 30 194 -145 -71
3780 -71 -34 53 209 92 -41 190 -135 -12 226 -6 0 -87 -156 -52 72 -111 129 -85 -80 319 -299 -4 -211
3803 -211 -58 -58 -254 98 -19 286 -89 -64 64 44 22 -104 -151 16 40 -74 -61 -53 61 17 -14 -86 149 -18
3827 -18 226 170 13 -152 14 -116 112 -60 -36 26 2 -121 365 26 84 -80 -40 -60 -109 -29 -86 -40 63 190
3851 190 -18 -96 157 10 -127 -125 -291 -83 166 -155 340 114 13 -19 -78 -45 -52 226 -233 152 56 94 261
3874 261 130 35 22 -107 158 45 88 165 286 64 16 36 103 21 215 -108 38 -83 32 -157 -61 -94 -101 163
$$ packed form
3708b38L15n0J81j12k27J50Jq8Q8q2J83k6K45l86Q7Q9j16O1k93K40lN9j20m4j57
3733b43M33j38j61K65k06n7K53j2j31K11k11j14K92j12k30OJ92R8j56Jql86M77
3756F3L0j0k90L70j05k0r7J50k61K96J27Rm38p2K84O5m71K01q8k3L10J64l39P4
3780g1L7Q7J56j17j33K31l25J23K38k32Oq7o9J04J24j83K40k14NL99o18K95k07
3803b11J53%j96L52j17L05l75K5J28k0k2j26m7J67K4j14J3QJ14m4l1p2K35j67
3827a8K44n6j57j65J66j30K28j72K4O2k4j23M86l39N8j64M0k0m9Q0n7M6J03J27
3851A90k08p8K53j47j37Kj66K08K49l21M95k26j01l2n9L3pK78m59L85r6L8J67
3874B61j31r5j3j29K65j13M3P7J21k22m8K0O7q2J94l23J46j21J15j89R6l3pK64
$$ plain form
3898 163 23 142 -264 -76 18 -24 54 29 -166 -208 100 -20 187 34 205 178 99 64 117 43 141 256 226 176
3922 176 -53 10 -18 210 189 -39 -140 106 -221 173 244 206 -123 -26 -188 41 -140 -8 -200 91 -104 158
3944 158 -90 -104 97 -142 153 -175 -61 195 5 -83 -229 -157 7 -280 79 -11 -142 172 -7 1 -61 12 -30
3967 -30 11 102 -38 -74 91 28 15 220 -118 70 -38 390 -199 -210 149 257 -201 31 68 -185 184 159 50
3990 50 -180 16 -1 -70 -130 54 -124 88 229 46 -92 -112 96 -179 -70 225 72 82 82 135 -247 18 248
4013 248 -75 -130 252 -223 -60 203 21 49 377 -19 43 40 59 -42 74 -208 -289 8 137 -5 -214 277
4035 277 14 -51 -157 -33 -159 63 0 -244 114 49 -55 -11 228 -194 41 -40 7 46 140 26 -41 187 -19
4058 -19 -144 64 11 -83 -100 -27 -159 -128 152 -108 -258 279 -132 -65 281 -103 2 -103 -120 -98 59 -71 116
$$ packed form
3898A63j40J19m06J88R4m2P8k5j95m2L08j20K07j53J71k7p9l5N3p4R8J15l0n0
3922A76k29O3k8K28k1k28j01K46l27L94P1l8l29R7j62K29j81J32j92K91j95K62
3944A58k48j4K01k39K95l28J14K56j90q8j46P2J64k87L59r0j31L14j79Qo2P3m2
3967c0M1R1j40l6J65o3j3K05l38J88j08M28n89j1L59J08m58K32L7k53L69k5j09
3990E0k30J96j7o9o0J84j78K12J41j83j38k0K08k75J09K95j53J0%N3l82K65K30
4013B48l23n5L82m75J63K63j82K8L28l96O2lJ9j01J16k82q1K97J29j42k09M91
4035B77k63o5j06J24j26K22o3k44L58o5j04M4K39m22K35q1M7L9R4j14o7K28k06
4058a9j25K08n3r4j7P3j32L1K80k60j50N37m11O7L46l84J05j05j7K2J57j30J87
$$ plain form
4081 116 -73 -164 1 85 125 34 -80 282 -194 -139 136 250 83 4 -49 182 -45 119 -276 -141 -80 -181 -11
4104 -11 43 103 152 50 -149 56 147 83 130 -219 47 -90 -193 15 -227 -94 -150 -8 5 229 -11 -35 -34 -31 -70
4129 -70 8 -37 274 49 -10 103 11 45 -116 -16 65 85 248 -15 174 -4 1 -50 126 218 -83 -1 104 -129
4153 -129 65 7 88 41 -18 -44 -83 -56 -92 43 -67 86 8 -36 173 -118 63 -35 86 81 66 -48 -43 149 68 -204
4179 -204 147 -15 336 119 13 73 74 121 -54 -150 -85 -602 110 42 125 -87 70 -59 -9 17 -17 82 3 -7 -14
4204 -14 -223 70 33 -181 152 0 -249 0 -98 -1 76 282 -62 -225 -87 164 -51 46 -232 82 -94 -32
4226 -32 113 -11 26 -103 6 -212 -57 -188 183 -134 121 179 283 -127 -10 -80 361 -219 146 85 65 65 -116
4249 -116 -61 106 -261 6 -169 -164 351 -35 95 196 -173 62 -149 -119 17 -196 5 40 -116 92 66 17
$$ packed form
4081A16j89r1J65Q4M0r1j14L62m76N5K75J14j67p9n3K31k27J64l95J35O1j01J70
4104a1N4O0M9j02j99K05R1o4M7l49K66j37j03K08k42J33n6J42J3K24k40k4JLl9
4129g0P8m5L11k25n9J13r2L4j61J00Q1K0J63k63J89j78Nn1J76R2l01Q2J05k33
4153a29J94n8Q1m7n9k6l9K7l6J35j10J53p8m4K09k91J81r8J21nj5j14NJ92q1k72
4179b04L51j62L51k17j06O0JM7j75r6O5n17P12o8Q3k12J57j29N0K6l4R9p9j0p
4204a4k09K93l7k14L33j52k49K49r8R7P7K06l44j63J38K51k15R7k78L14j76O2
4226c2J45j24L7j29J09k18J55j31L71l17K55N8J04m10J17p0M41n80L65o1k0%j81
4249a16N5J67l67K67j75NN15l86J30J01l69K35k11L0J36k13K01L5j56K08k6m9
$$ plain form
4271 17 207 -23 -114 -85 95 87 295 -125 36 109 -82 160 96 -246 67 -205 104 13 27 59 -117 164 206 -189
4295 -189 88 -51 31 -60 -35 -166 -12 -56 22 87 -144 51 192 -13 88 162 163 59 -175 -42 -36 -70 -23 128
4319 128 -54 266 29 -108 140 -95 18 1 -32 -106 -229 -27 128 6 -78 -161 -25 -29 186 -49 56 61 169
4342 169 139 -189 110 105 -104 152 235 -199 -83 112 -24 99 -75 -179 -64 -254 99 -6 -27 135 25 31
4364 31 63 184 -9 63 -123 -1 183 -171 196 206 10 83 44 77 100 -19 85 -194 -27 -144 54 70 -51
4387 -51 80 -199 45 -12 -69 146 -150 -205 288 -54 -70 20 93 149 48 73 -92 -197 97 32 -71 105 -119
4410 -119 -337 -106 328 92 -33 -216 13 91 -42 -308 -129 32 -38 -1 -87 -175 -3 96 210 -15 39 74 -117
4433 -117 -220 46 35 138 341 55 -35 63 123 -104 -24 -267 154 102 -106 -222 -78 -134 17 -73 -96 146 113
$$ packed form
4271A7J90k30r1K9J80qK08m20J61P3j91K42o4l42L13k72L09r1J4L2j76K81M2l95
4295a89K77j39Q2r1K5j31J54m4P8O5k31J95J41k05J01P4Jj04k34J33Ol4M7J51
4319A28j82L20k37j37K48k35J13j7l3p4j23K02J55j22q4q3J36mK15k35J05NJ08
4342A69l0l28K99nk09K56Q3m34J16J95j36J23j74j04J15j90L53j05k1J62j10O
4364C1L2J21j93P2j86J22J84l54L67J0j96P3l9L3K3j19J04k79J67j17J98J6j21
4387e1J31k79K44n7n7K15k96n5M93l42j6R0P3N6j01K5j65j05K94o5j03J76k24
4410a19k18K31M34k36j25j83K29P8j33k66J79J61p0L7q6q8J72R9J14k25N4L5j91
4433a17j03K66j1J03K03k86r0R8O0k27Q0k43M21n2k08j16J44n6J51r0k3K42l3
$$ plain form
4456 113 -192 -306 10 -3 63 -125 -172 -123 75 96 -126 142 -160 -84 -356 43 -34 45 166 -193 -237 79 -65
4479 -65 220 46 -138 -199 -148 167 6 -49 -32 -140 -144 51 256 190 -75 71 111 -67 133 -189 10 110 110 -72
4503 -72 -31 173 -239 129 83 17 231 142 142 182 -29 90 168 -82 106 31 -14 -11 139 -165 -19 -79 -90 264 -27
4528 -27 261 94 76 25 -123 -90 192 139 -74 337 -82 19 297 -22 90 74 -158 -37 180 72 393 -121
4550 -121 7 133 -103 118 36 -277 -59 102 -150 -31 42 -103 102 -62 124 -71 -78 29 -13 -87 -61 -215
4572 -215 118 -113 -17 115 -21 164 131 77 -213 -22 23 11 -341 -50 130 168 -254 -141 177 -119 117 -147
4594 -147 -89 -123 -267 69 -31 -104 10 135 229 -6 -129 76 -22 -24 -134 153 -83 175 -7 -41 -187 28 -8
4617 -8 -5 86 186 -33 7 77 -87 14 -21 -165 -228 -51 148 56 111 4 206 -358 38 -15 139 169 161 -11 -134
$$ packed form
4456A13l05j14L16j3O6j88m7M9J98K1k22K68l02P6k72L99p7P9J21l59m4L16j44
4479f5K85j74j84o1N1L15j61n5J7j08mJ95K05o6k65J46M0j78K00l22J99J00%j82
4503g2M1K04m12L68m6o6K14q9%M0k11J19P8k50J88p5m5LJ50l04J46o0j1L54k91
4528b7K88j67j8n1j48L3K82n3k13M11m19J01K78l19J12j6k32J21K17j08L21n14
4550a21J28J26k36K21q2l13K18J61k52J19P3j45K05j64J86j95pJ07m2p4K6j54
4572b15L33k31R6J32j36J85l3n4k90J91M5j2l52K91J80L8m22J13L18k96K36k64
4594a47N8l4j44L36j00p3J14J25R4k35j23K05r8kj10K87k36K58j82l4j46K15l6
4617hLR1J00k19M0P0j64J01l5j44o3J77J99r2N5j07K02n64L96n3J54L0qj72j23
$$ plain form
4642 -134 -215 204 2 -178 34 -19 81 34 -7 31 125 -127 -16 -23 98 -71 10 -151 92 23 -127 -103 -72 -17
4666 -17 -140 60 -88 -81 -35 23 175 123 -103 18 -273 -135 -88 -156 261 -52 127 14 -91 41 -54 86 -40
4689 -40 221 38 215 -120 173 45 -121 -64 196 185 182 126 21 51 123 -4 287 -1 -131 -213 -72 -273 -78
4712 -78 -97 116 -50 -30 95 -101 31 -123 67 -149 26 -22 50 91 155 -76 -1 158 150 118 -8 168 21 -189
4736 -189 117 -67 36 -89 -92 83 -84 148 -44 149 -127 51 27 -187 76 20 -164 49 44 58 -125 244
4758 244 43 -26 -132 -172 100 -70 -69 107 31 -105 -159 186 -36 -51 137 -28 138 -23 173 -58 205 40
4780 40 252 -249 73 -170 -228 79 -136 38 12 -48 105 43 24 169 36 -25 101 18 22 83 88 69 -82 43 -35
4805 -35 -7 91 45 118 137 -181 -38 69 -132 7 -166 -259 -10 10 -87 -89 128 -91 93 -104 -33 190 111 132 -124
$$ packed form
4642a34q1M19k02j80K12n3J00m7m1L8R4k52J11pJ21j69Q1j61K43o9j50K4L1N5
4666a7j23K00j48PM6N8J52n2k26J21k91J38M7o8M17l13J79j13j05J32r5J40j26
4689d0K61j83J77l35K93j28j66N7K60j1ln6j05L0P2j27K91k88j30q2J41k01J95
4712g8j9K13j66K0J25j96J32j54J90k16J75m8P2M1O4k31P5J59ql2j26J76j47k10
4736a89L06j84J03j25lJ75j67K32j92J93k76J78k4k14K63n6j84K13nJ4j83L69
4758B44k01o9j06m0K72j70JJ76p6j36n4L45k22j5J88j65J66j61J96k31K63j65
4780D0K12n01L22k43n8L07k15J74k6o0J53o2j9J45j33o1J26q3MO1Nj9j51J25p8
4805c5K8R8m6P3J9l18J43J07k01J39j73r3K49K0r7kK17k19J84j97P1K23p9K1k56
$$ plain form
4830 -124 214 -91 15 -72 28 86 -84 2 32 32 -366 -85 26 -298 -55 203 -69 -178 -18 -15 -16 46 132 23
4854 23 -149 96 -153 18 134 217 161 84 -66 184 92 -29 -122 7 -170 63 -293 193 138 -78 82 90 -100
4877 -100 66 18 73 -18 -213 0 18 -10 -146 -101 118 -82 232 17 319 303 -40 60 238 -157 -84 117 42
4900 42 69 -68 50 -241 147 95 -104 -169 84 31 -111 105 -143 -26 -24 -36 -11 -219 188 -123 -19 119 182
4923 182 186 -46 -261 40 331 -88 93 59 289 -128 -128 -105 171 -134 157 142 -136 111 66 -26 -314 -60 -100
4946 -100 258 59 4 205 67 0 -143 -33 -58 342 -40 -12 -153 -27 12 -71 226 -17 -30 -10 87 63 -91
4969 -91 220 28 126 -209 -29 152 -95 -27 -45 -13 -74 11 -29 -50 -71 260 17 -161 -229 -50 86 65 245 -105
4993 -105 110 78 14 -134 -43 76 -38 -16 63 49 6 55 -267 18 -201 -104 51 310 -102 -51 -181 -366 150
$$ packed form
4830a24L38l05J06q7J00N8j70Q6L0%l98K81J11l24K43K58k72j09J60LjO2Q6j09
4854B3j72K45k49J71J16Q3n6p7j50K50r2j21r3J29j77K33l56M86n5k16J60Qj90
4877a00J66m8N5r1j95K13J8k8j36M5K19k00L14k15L02j6l43J00J78l95P3K01p5
4900D2K7j37J18k91L88n2j99o5K53n3j42K16k48J17Kj2K5k08M07l11J04J38O3
4923A82Mk32k15L01K91m19J81l4K30m17%K3K76l05K91j5k78K47m5r2k88K54m0
4946a00L58j99n5K01j38o7j43J10k5M00l82K8j41J26L9q3K97k43j3K0R7k4j54
4969i1L11j92R8l35J80J81k47O8j8L2o1Q5m0k1k1L31k43j78o8J79J36k1J80l50
4993a05K15l2o4j48R1J19j14K2P9j4m3M9l22K85k19R7J55K59m12N1j30j85N16
$$ plain form
5016 150 71 38 -6 -41 1 230 160 -41 87 7 18 38 147 207 -46 -12 -33 -64 67 -119 -21 35 100 106 -131 -25
5042 -25 -27 -233 83 241 236 300 -149 219 91 -179 2 22 84 190 -186 102 -158 109 123 -111 227 152 -57
5065 -57 174 -185 35 41 -17 156 98 -26 -122 37 91 -78 146 131 -37 142 -129 253 -143 35 191 56 63
5088 63 113 65 97 34 12 216 15 110 -239 -118 -28 151 105 332 -81 -41 201 181 116 -5 168 3 -65 241
5112 241 -107 37 -150 -54 -72 -29 -90 -104 -107 -221 -249 43 -176 -126 91 45 -275 57 65 3 116 -127 -91 -98 47
5137 47 146 -33 304 -79 79 11 179 124 131 -23 -253 287 -172 -55 53 35 119 47 82 202 43 -175 92
5160 92 -59 -264 171 -50 50 247 -172 137 -78 171 -59 -62 -1 30 146 40 142 -123 32 90 -12 179
5182 179 146 -164 -30 75 59 206 173 -45 180 -122 -31 82 -57 -99 119 -13 69 13 -164 -217 -19 222 254
$$ packed form
5016A50p9l3m4l5M2K29p0k01J28q0J1K0J09O0k53L4k1l1J31j86R8N6O5Ok37J06
5042b5kk06L16J58nO4m49L68j28k70J81K0O2J06l76K88k60K67J4k34L38p5k09
5065e7K31l59K20On8J73n8j24r6J59N4j69K24j5j68J79k71L82l96J78J56j35P
5088F3N0m8L2o3k2K04k01R5l49J21R0J79m6K27m13M0K42k0o5j21J73j65o8L06
5112B41l48J44j87R6j8M3o1j4lj14k8K92k19N0K17m6l20L32Qo2J13k43L6pJ45
5137D7R9j79L37l83J58o8J68n5Pj54k30N40m59J17J08j8Q4p2L5J20j59k18K67
5160I2j51k05M35k21J00J97m19L09k15K49k30lO1L1J16j06J02k65J55N8j02J91
5182A79l3l10J34J05j6J47l3k18K25l02R1J13j39m2K18j32Q2n6j77n3J98K41L2
$$ plain form
5205 254 67 -281 -54 -140 52 209 -200 -80 -9 -74 -2 -225 -183 77 -55 -127 -148 183 -77 195 72 320
5227 320 203 94 229 193 -81 -100 -104 -232 126 -271 -130 -81 64 73 -67 -42 -172 -119 -38 81 93 13 42 -193
5251 -193 69 -21 19 -148 106 -22 188 0 -83 151 24 -58 180 -77 -18 10 -165 -147 -49 54 -10 55 -154
5274 -154 46 278 143 -113 30 -127 -14 115 -72 -58 140 -225 73 -46 -96 35 -46 -117 -316 106 53 -146
5296 -146 158 -58 0 112 78 -1 -179 -135 44 18 -35 90 62 -86 142 58 -32 -224 103 -1 -28 357 72
5319 72 -198 -19 223 267 -159 44 -113 -126 -84 -20 172 28 167 -86 58 8 -75 -154 48 97 225 109 -157
5342 -157 -462 73 235 -181 51 283 -232 -181 231 189 143 -20 -277 87 54 -39 27 -10 189 111 -372 -151 -55
5365 -55 7 -42 125 333 129 155 -28 22 90 -137 -24 -1 193 11 -39 -6 47 -228 292 -135 83 111 -337 25
$$ packed form
5205B54j87l48K27q6J92J57m09J20P1o5P2k23M2K60j32p2k1L31k60K72j23K48
5227C20j17j09J35l6k74j9mj28L58l97J41M9J45Rj40K5j30N3Q1J19J2q0K9k35
5251a93K62r0M0j67K54j28K10j88q3K34j27q2K38k57N9K8j75J8R8J03o4O5k09
5274a54K00K32j35k56J43j57J13J29j87J4J98l65K98j19n0J31q1p1j99M22n3j99
5296a46L04k16N8J12l4p9j78M4J79k6n3J25k8j48K28q4r0j92L27j04k7L85k85
5319G2k70J79K42M4m26K03j57j3M2O4J92j44J39k53J44n0q3p9K02M9J28j16k66
5342a57l05N35J62m16K32K32n15N1M12m2m6j63k57L64l3r3O6l7J99p8m83K21R6
5365e5O2m9J67K08k04K6j83N0O8k27J13K3J94j82n0L3N3k75N20m27K18K8m48L62
$$ plain form
5389 25 19 91 22 -142 10 -201 154 179 36 -74 82 279 63 -124 39 108 29 100 -27 102 232 -257 -44
5412 -44 -134 80 13 46 4 -72 132 -77 -182 -17 149 -128 109 -146 -9 18 -26 -228 -77 239 49 -18 146
5435 146 144 178 -73 -128 -89 43 90 130 -142 30 99 -29 -104 -24 109 -69 -26 -60 504 -138 1 -38 -323 90
5459 90 -160 -119 -118 163 -11 -93 -14 271 67 -90 93 -64 -66 179 99 -110 -272 -33 -60 33 84 274 -265 -142
5483 -142 143 191 14 83 190 29 102 28 5 96 -28 2 118 -127 -221 -62 -123 23 174 -38 71 -85 -167
5506 -167 -92 96 -183 239 -27 24 -1 18 5 47 109 -189 -3 113 -206 150 -218 -113 73 -257 67 -68
5528 -68 -107 317 104 -132 -85 -118 -85 -46 143 149 189 -212 218 109 163 -124 -102 -5 235 -251 -13 -67 -205 51
5552 51 -304 -113 -149 -53 -80 173 116 187 76 -6 166 0 -50 63 39 -10 -60 300 -13 -82 68 38 224 9
$$ packed form
5389B5oP2o9j64J52k11L55K5j43j10J56J97k16j87J63O9p9P1j27J29J30m89K13
5412d4r0K14o7L3m2p6K04k09j05J65J66k77K37k55J37K7m4k02J51L16j90o7J64
5435A46kL4k51n5L9J32M7M0k72J72O9j28p5Q0J33j78M3l4N64o42J39l9k85M13
5459I0k50M1JK81j74q2P9K85k04j57J83j57kK45q0k09j62K39k7R3N1J90n39J23
5483a42K85M8j77O9J07j61P3p4k3R1j24L0J16k45r4J59o1J46J51k12J09j56q2
5506a67P5J88k79M22k66N1k5J9j3M2O2k98J86J16l19L56l68J05J86l30L24j35
5528f8l9M24k13k36M7l3L3L9J89OM0m01M30j09N4k87K2R7K40m86K38n4j38K56
5552E1l55J91l6R6k7K53n7P1j11q2J72j66n0J13k4m9n0L60l13o9J50l0J86k15
$$ plain form
5576 9 -90 135 106 -6 -20 -116 -187 -2 306 2 10 26 15 -408 144 122 -79 1 -253 -92 145 85 -109 85 -338
5601 -338 68 189 -317 161 -174 -138 -31 -47 44 -58 125 -48 176 -40 -56 41 -69 227 -100 -50 -86 -396
5623 -396 -56 2 -151 -146 -5 -242 10 32 140 102 -11 -63 -140 28 -27 -172 48 84 -64 58 282 -204 143
5646 143 52 -71 13 238 -137 68 2 64 -144 134 -141 -47 -24 -214 -45 54 -36 114 59 116 200 40 161 -100
5670 -100 -107 165 -71 -86 -14 -3 -18 160 43 -59 340 37 44 46 -28 -52 112 32 301 122 -267 -115 64 64 -169
5695 -169 -211 2 -34 27 -47 -58 66 189 -146 225 236 -72 97 -13 -33 73 139 38 87 107 -60 -167 119
5718 119 -59 -32 103 48 -132 -106 64 6 -77 46 91 62 21 -29 -67 203 -304 -69 53 179 -26 -95 -81 123
5742 123 77 145 15 -102 164 -168 -11 45 -207 158 -73 18 119 -45 72 -56 137 -234 -32 -141 -142 154
$$ packed form
5576Ir9K25k9j12j4r6p1J85L08l04QJ6j1m23N52k2k01Q0k54J61K37o0j94J94m23
5601c38M06J21n06M78l35L6J07j6R1j02J83j73K24k16j6R7j10K96l27N0l6l10
5623c96L40N8j53NJ41k37K52K2J08l8j13n2p7J68n5j45K20L6j48J22K24m86L47
5646A43r1j23Q4K25l75K05o6O2k08K78k75R4K3j90J69R9r0J50n5N7Q4j60J21k61
5670a00pK72k36j5P2J1j5J78j17j02L99l03PKp4k4J64q0K69j79l89J52J79%k33
5695a69m2K13l6O1p4j1J24J23l35L71J1l08J69j10k0J06O6j01M9K0j67j07K86
5718A19j78K7J35n5j80K6J70n8q3J23M5k9m1n0l8K70n07K35J22J26k05o9J4K04
5742A23m6O8j30j17K66l32J57N6k52L65k31R1J01j64J17j28J93l71K02j09jK96
$$ plain form
5764 154 -180 -10 -7 39 -109 31 -252 202 178 -34 6 42 -26 37 -208 46 -131 -7 -142 -5 -150 -46 193
5787 193 79 124 116 24 23 84 -6 177 -268 145 136 179 -214 -82 -73 130 28 -223 -102 13 -93 107 83 -7 -210
5812 -210 -38 302 102 -2 258 -43 -196 -150 126 -218 66 -11 127 -145 -230 -12 89 197 18 145 88
5833 88 175 270 143 -148 -63 50 267 -110 26 -72 36 11 -76 -77 -209 -250 55 -185 15 -183 -11 -78 293 -52
5857 -52 63 148 -236 -41 31 -61 -11 36 -49 149 -81 66 256 -171 -190 -95 -71 -54 109 -79 -69 152 -169 -35
5881 -35 129 78 -211 102 -59 -104 -129 135 46 -61 178 -156 -49 182 202 46 -47 250 139 -196 69 124 346
5904 346 -188 -129 137 -360 53 -27 -141 42 -56 -77 73 55 -191 -252 141 -52 -64 -7 8 -93 110 -128 -187
5927 -187 44 -191 -165 96 -198 174 -67 4 -97 205 226 -114 -193 114 -244 -45 125 -4 29 152 -41 70
$$ packed form
5764A54l34J70LM6j48J40k83M54k4k12M0L6o8O3k45K54j77J24j35J37j45J04K39
5787A93j14M5qr2jO1r0J83m45M13rM3l93J32RK03j02k51J21J15j06K00k4r0k03
5812b10J72L40k00j04K60l01j53M6K76l44K84p7J38k72q5K18J01J08j79J27n7
5833H8Q7R5j27k91Q5J13K17l77J36r8J08k5q7jj32m1L05k40K00j98J72o7L71l45
5857e2J15Q5l84J95P2r2N0M7q5J98k30J47J90m27j9R5K4J7J63j88J0K21l21J34
5881c5J64n1k89L13j61m5k5K64q9j07K39l34J07K31K0j56r3K97j11l35K65N5K22
5904C46n34N9K66m97M13q0j14J83r8k1J50j8k46o1L93j93j2N7J5j01K03k38n9
5927a87K31k35K6K61k94L72k41P1j01L02K1l40p9L07l58J99J70j29L3J23j93J11
$$ plain form
5949 70 82 100 -119 -325 -86 -12 -99 -76 -120 303 -118 -48 40 -26 130 -52 147 98 50 206 -178 164 -61 17
5973 17 0 4 76 -57 44 -50 -92 83 -128 -228 0 136 -172 -39 243 -141 196 -12 -82 141 148 48 -64
5996 -64 -50 -218 52 139 94 76 -81 17 -151 68 45 -144 -33 157 -49 -132 -139 62 -41 16 -286 -47 -90 -76
6020 -76 -70 -134 -314 -134 217 223 -343 200 -90 51 -12 -9 148 -216 -44 207 -18 12 64 11 -35 -218 16 -95
6044 -95 11 245 -141 11 -2 53 84 -138 -6 219 -215 -142 -146 1 191 229 -30 25 172 -164 70 147 -22
6067 -22 -364 60 333 -113 -94 224 85 108 99 7 28 49 147 75 176 -40 -146 77 -16 -74 -11 119 9 281
6091 281 126 91 -110 -41 217 -151 96 -344 258 95 -31 93 81 -39 0 2 -64 -91 235 88 -161 163 -11
6114 -11 89 237 57 -27 46 42 71 91 -3 -30 -73 130 80 -37 80 0 90 -89 -110 -68 -149 -77 75 -85 -100 -138
$$ packed form
5949G0J2J8k19k06K39P4q7K3m4M23m21P0Q8o6J56j82J99m9m8J56l84L42k25P8
5973A7j7MP2j33J01r4m2J75k11j00K28J36l08J33K82l84L37k08p0K23Pj00j12
5996f4J4j68K70Q7m5j8j57R8j68K19k3j89J11J90k06q3pK01j03N7l02K39m3J4
6020g6Oo4j80J80L51On66N43k90J41o3LJ57l64J72K51k25L0N2n3m6j83K34j11
6044i5J06K34l86J52j3N5L1k22J32K25m34P3mJ47J90L8k59N5J47l36K34P7j69
6067b2l42M24K73m46J9L18j39K3rr2K1K1R8p2J01k16j06K23r3n8O3J30j10K72
6091B81j55l5k01O9K58l68K47m40O02j63j26J24j2j20L9Ko6k7L26j47k49L24j74
6114a1J00J48j80q4P3mK9K0r4k7m3K03n0j17J17q0R0j79k1M2q1P2J52j60j5l8
$$ plain form
6140 -138 -25 -138 158 71 -194 -210 47 -10 201 92 -90 -34 98 18 90 -17 65 -62 75 189 -27 -30 -105
6163 -105 39 -47 -15 144 77 130 -136 -27 197 -74 -180 88 -4 -183 64 -8 -47 108 -193 -104 -94 301 40
6186 40 -58 -71 -162 56 158 65 41 93 15 154 9 -42 149 -50 -205 -37 -183 115 90 159 -114 158 80 -139
6210 -139 -286 101 32 110 -264 -333 -43 -274 -5 -7 156 -56 -42 42 -152 -78 -112 -27 74 -24 87 -92 168 -13
6234 -13 -218 -198 74 -31 -93 279 -142 -148 -174 -192 32 -89 73 -132 -76 -166 -177 -114 23 64 -146 -364 65 161
6258 161 81 -82 107 67 20 142 -13 -85 -134 -47 -126 -316 42 65 -380 115 -154 -95 -7 78 -108 359 46 228
6282 228 -173 -323 101 -83 -227 183 125 147 -173 -93 -65 -243 180 109 172 -202 -76 -21 -73 -34 94 98 25 -12
6306 -12 189 -277 -83 53 0 -17 -10 151 -22 88 344 68 -197 -11 180 -78 236 12 -320 -87 154 136
$$ packed form
6140a38J13j13K96q7k65j6K57n7K11j09j82N6J32q0P2j07Q2j27J37J14k16lp5
6163a05J44q6L2J59o7N3k66J09K24k71j06K68r2j79K47p2l9J55l01Q9J0L95k61
6186D0r8j3r1K18J02r3k4N2p8J39j45n1J91j99j55J68j46K98k5O9k73K72p8k19
6210a39j47L87o9P8l74o9K90k31K69kJ63k12J4Q4j94P4l4Q5J01r8J11j79K60j81
6234a3k05K0K72j05o2L72m21ok6j8K24j21J62k05N6r0j1O3J37M1k10k18M29R6
6258A61q0j63J89m0m7J22j55p2m9Q7p9j90L58K3m45M95k69N9Q8Q5j86M67l13J82
6282B28m01j50M24j84j44M10n8K2l20Q0K8j78M23p1O3l74J26N5n2L9J28Mp3l7
6306a2K01m66J94J36n3j7PJ61j73J10K56k76k65J86J91k58L14k24l32K33K41j8
$$ plain form
6328 136 5 -110 120 20 58 206 -100 25 -37 122 -144 284 -20 331 -81 -194 -52 163 -230 -60 40
6349 40 92 143 94 192 50 -191 143 34 -3 125 -113 42 139 -48 106 -57 -15 197 -330 39 69 63 -263 19
6373 19 -87 80 203 59 161 -189 6 45 107 16 -137 4 -71 99 -206 -129 -65 15 67 -248 -38 63 -102
6396 -102 -116 -35 163 -95 145 -28 -382 -106 -13 45 -311 37 154 196 -91 11 -102 394 -16 55 171 56
6418 56 -30 -146 12 -66 -186 -252 162 240 82 50 -153 -102 -213 283 55 -259 57 -28 48 -40 50 -167 75 63
6442 63 -98 41 124 222 -72 73 -26 166 185 40 102 119 239 130 17 29 -16 -9 13 -212 -149 -194 60 -78 38
6467 38 -185 117 346 -101 -48 -100 120 -6 48 -15 78 -10 -90 292 -112 10 267 -153 84 -25 -73 74 277
6490 277 14 94 -110 13 26 307 12 -285 -139 -24 -180 -133 169 190 -12 -104 -65 62 -106 251 -111 -153
$$ packed form
6328A36j31j15K30j00L8J48l06J25o2J59k66M28l04L51m12j13J42K15l93J70J00
6349D0N2N1m9R8j42k41L34j09l7J28k38J55R7j87J54j63M2K12n27L69L0ol26K82
6373A9j06J67J23j44J02l50J95L9O2r1j53J41p5J70l05P7O4Q0N2l15K10J01j65
6396a02j4Q1J98k58K40j73l54K76R3N8l56L48J17M2k87J02j13M96m10P1J16j15
6418E6q6j16J58p8j20o6M14P8j58l2k03N1j11M96k28l14L16q5P6q8R0k17K42j2
6442F3j61J39Q3R8k94J45r9J92J9j45O2J7J20j09j13J2m5PK2k25O3m5K54j38J16
6467C8k23L02K29m47N3n2K20j26N4o3R3q8q0L82m04J22K57m20K37j09m8J47K03
6490B77k63Q0k04J23J3K81k95k97J46J15j56M7L02K1k02r2L9J27j68L57l62m2
$$ plain form
6512 -153 -139 17 -120 -15 34 -34 -29 117 -70 11 -63 75 73 -113 129 12 -192 75 -107 -16 -121 257 22
6535 22 -55 -3 17 -34 224 161 -283 170 42 -6 -122 172 21 -153 -129 29 50 30 -32 27 -37 70 -25 1 92
6560 92 241 -135 26 39 -214 -145 -190 -188 -192 -211 9 93 47 -81 112 266 225 -254 123 -258 -38 362 138 -106
6584 -106 83 -261 43 101 153 -94 -56 26 135 -150 -115 -242 -52 -154 -130 -67 -182 -67 -142 -51 197 44 90
6607 90 62 -34 184 22 -93 214 182 58 29 -184 -127 78 58 -213 -157 -267 -80 -43 121 -233 -75 -243 -28
6630 -28 81 -153 135 -57 -65 -140 -78 -19 -79 72 192 -32 140 -120 -17 35 2 74 16 -74 -26 -42 56 19 -159
6655 -159 235 -77 -48 -268 -167 -22 -39 -69 152 -208 11 -77 23 -69 85 39 -239 153 -153 160 88 -128
6677 -128 -3 22 -40 99 -18 -161 22 -81 -228 20 -190 103 -24 -177 -121 -9 -194 56 -121 -36 -179
$$ packed form
6512a53J4J56j37J05M9o8NJ46j87Q1p4J38kj86K42j17k04K67j82R1j05L78k35
6535B2p7N2K0n1K58o3m44M53j28m8j16K94j51j74K4J58K1k0o2N9o4J07r5K6R1
6560I2J49l76J61J3k53O9m5Kmj9K20Q4m6j28J93J54m1m79L77l81K20M00k24k44
6584a06J89l44L04N8N2k47L8Q2J09k85L5j27J90j02K4O3j15J15p5R1K48j53M6
6607I0k8r6K18j62j15L07l2j24k9k13N7K05k0k71N6j10J87L7J64l54J58j68K15
6630b8J09k34K88j92qp5O2N9o0J51J20k24J72k60J03N2l3P2n8r0M8j6R8l7j78
6655a59L94l12K9k20J01J45j7l0K21l60K19q8J00r2J54m6k78L92l06L13p2k16
6677a28J25K5o2J39j17j43J83j03j47K48k10K93j27j53N6J12j85K50j77Q5j43
$$ plain form
6698 -179 -17 2 177 326 193 193 -117 -15 19 129 126 177 202 10 6 139 69 -298 58 -85 -121 -136 -23 -198
6722 -198 11 -89 -56 -38 -32 -99 -182 -62 -252 -53 -110 136 19 70 3 -84 46 19 28 -41 180 -19 261 43 362
6747 362 83 13 165 117 67 -117 -126 -264 -93 210 140 -299 -99 -115 43 102 252 -174 -49 192 6 131 -82
6770 -82 -55 178 105 -145 -253 30 -2 8 -374 125 92 -5 39 -155 279 -195 -20 -190 -116 -230 -13 -1 -1 -44
6794 -44 201 78 -26 -122 -79 -65 -303 -121 -202 301 14 -55 -26 320 270 104 30 -78 34 -115 -68 64 -103
6817 -103 -84 -26 -138 79 -270 110 -7 -65 -33 114 118 -150 84 89 20 -123 124 183 -233 -15 85 15 210 -92
6841 -92 42 -94 -217 -18 -224 42 -79 19 -140 46 40 -19 218 64 -90 -151 -62 190 -33 69 -9 62 146
6864 146 -121 94 220 34 175 151 -134 105 40 -408 107 112 -48 64 34 19 -35 75 320 164 -18 111
$$ packed form
6698a79J62J9J75J49j33%l10J02L4J10lN1K5j92mJ33p0l67L56j43l6j5J13j75
6722a98K09j00L3J8Oo7q3J20j90J99n7K46j17N1o7q7J30k7Ro9K21j99K80k18L19
6747C62k79p0J52m8n0j84rj38J71L03p0m39K00j6J58N9J50m26J25K41j86J25k13
6770h2K7K33p3k50j08K83l2J0l82M99l3r7M4j94M34m74J75j70P4j14K17J2%m3
6794d4K45j23j04r6M3J4k38J82q1N03k87o9K9L46n0j66p4j08J12j49M7J32j67
6817a03J9N8j12K17l49L80j17n8L2J47Mk68K34No9j43K47N9m16K18J00p0J95l02
6841i2J34j36j23J99k06K66j21R8j59J86on9K37j54j54o1Q9K52k23J02p8P1Q4
6864A46k67K15J26j86J41k4k85K39o5m48N15Nj60J12l0j5n4J10K45j56j82J29
$$ plain form
6886 111 22 69 -143 317 -65 41 142 -174 -54 54 60 -25 48 -165 108 -157 -131 107 120 -36 -40 -26 -142 -67
6910 -67 -146 -144 71 -335 -75 7 -27 22 -297 -88 110 169 -53 -53 116 200 227 -259 -66 -62 65 -81 -57 -10 176
6935 176 82 83 13 -120 -204 -50 38 57 305 266 6 96 -126 19 -199 99 -61 -24 -108 -326 -244 64 -79 -90
6959 -90 -98 10 123 268 42 -37 -52 -45 69 -167 -3 -53 68 180 -68 10 27 123 6 -33 -90 -61 -293 -194 -83
6984 -83 131 -205 -109 2 165 136 294 -37 117 -245 -78 -11 15 -86 -68 -37 188 265 -38 -86 93 81 12 231
7008 231 -55 -194 -81 107 152 213 69 -8 -225 -191 3 117 -19 6 -191 -85 -343 141 -80 -57 -9 32 163
7031 163 63 14 44 113 191 58 99 -34 35 44 -5 -164 -262 65 -150 206 -361 122 -226 194 20 -5 29 -286
7055 -286 244 -187 -72 -22 148 -70 123 -42 55 -139 -93 241 55 -129 79 7 -50 98 96 -225 203 11
$$ packed form
6886A11q9M7k12M60l82J06J01l16J20J08Oq5P3k13K73k65K6K38J3j56mJ4j16P5
6910f7p9KK15m06K60Q2l4M9l19K09J98N9k22%J69Q4K7m86J93MJ27j46K4M7J86
6935A76r4Jp0j33q4J54Q8J9K48l9k60R0k22J45k18K98j60L7q4k18Q2L08j43j1
6959i0qJ08J13J45k26p9j5PJ14k36J64n0J21J12k48P8J7R6j17l9n7K9k32R9J11
6984h3K14l36R6J11J63k9J58l31J54l62J67O7K6j01J8L1K25P7l03m8J79j2o9K19
7008B31k86j39J13J88M5O1j44p7k17L4J94J14j36K5j97J06k58M84k21K3M8M1J31
7031A63j00m9L0O9P8j33M1j33O9Rm9j59r8L27k15L56n67M83l48M20j74k5L4l15
7055b86N30m31J15N0J70k18J93j65R7j94M6L34j86j84K08p2n7J48kl21M28j92
$$ plain form
7077 11 -221 3 -136 -75 -62 -286 150 -84 -263 -292 82 57 -143 137 -87 349 218 33 85 195 -2 -129
7099 -129 -113 374 -33 75 -244 -40 -77 -227 94 119 39 -167 -131 123 -308 241 -56 -171 71 -25 90 -167
7121 -167 -174 55 -171 174 -122 53 154 97 181 -90 -163 -68 49 -18 96 -136 64 -43 183 -64 -31 39 -71
7144 -71 165 53 21 -21 114 134 -15 96 29 -120 78 -143 -29 -77 -92 -10 72 210 -64 60 146 71 -197 -68
7168 -68 121 -114 -52 -124 42 -49 -1 1 -157 37 188 -45 -85 -106 204 216 148 -132 -155 50 136 25 176 3
7192 3 -179 -4 -55 -136 -122 -169 306 -144 21 212 100 -198 136 7 -262 138 -134 -50 -50 -38 24 154 105 101 18
7217 18 -118 66 -76 163 -31 -95 -80 -26 -104 -263 2 -120 -45 -167 124 85 75 111 48 -58 210 74 -80
7240 -80 -114 15 -289 84 35 160 -66 146 192 -1 66 -104 -436 11 205 444 -139 182 117 66 15 338 140
$$ packed form
7077A1k32K24j39O1J3k24M36k34j79k9L74k5k00K80k24M36j31j85N2J10j97j27
7099a29J6M87m07J08l19K04l7j50L21K5q0k06L6K54m31N49k97j15K42r6J15k57
7121a67pK29k26L45k96J75J01n7Q4k71p3R5J17o7J14k32K00j07K26k47L3P0j10
7144g1K36j12l2m2J35K0j49J11o7j49J98k21J14m8j5Q2Q2J38k74J24Q6p5k68J29
7168f8J89k35O2p2J66r1M8Kj58J94J51k33m0k1L10J2o8k80k3K05Q6j11J51j73
7192Cj82J75n1q1J4m7M75m50J65J91j12k98L34j29k69M00k72Q4%J2O2J30m9mq3
7217A8j36J84j42K39j94o4J5N4p8j59K65j22P5j22K91l9j0L6o3j06K68j36j54
7240h0l4J29l04L73m9J25k26K12M6j93O7j70l32M47J94K39n83L21o5n1n1L23j98
$$ plain form
7263 140 18 90 155 96 -266 -228 -171 -243 -38 -63 -90 68 -186 -155 145 -76 -48 -105 -39 16 -96 91 -127 -65 140
7288 140 -12 -17 351 -268 -52 -213 52 147 -27 -43 -74 -97 1 31 -162 47 141 -94 51 182 -7 41 58 -265
7312 -265 20 108 98 166 -119 -13 172 -15 -107 62 -229 -14 159 -334 323 147 -228 195 76 -227 -348
7333 -348 59 -171 -62 -112 -67 -174 7 153 -50 -60 -3 30 -132 -158 -61 92 369 19 50 -139 205 -228 44
7356 44 52 124 92 -241 -89 -112 -142 -274 -138 15 -97 -154 -60 161 120 205 17 21 0 77 36 40 28 198 -159 -71 -23
7383 -23 -197 -131 28 12 -216 -118 -118 -161 220 29 103 -152 -1 -92 -183 36 189 13 -87 69 1 -148 -298 -143
7407 -143 -249 60 122 210 -13 -82 -4 77 22 -118 20 25 -9 -200 -48 76 -255 -91 -51 3 66 -107 -50 -174
7431 -174 -104 -105 24 -99 -83 -3 21 13 5 194 -103 4 -152 31 48 49 327 28 -11 -15 323 11 -207 -153 -20 -304
$$ packed form
7263A40j22P2O5n9l62L8N7p2K05k5k7J58k54L1L00k21K8n7O6N5j12J87k18O2K05
7288A40j52nL68o19K16j61K65R5j74j6l1k3R8L0j93K09R4k35J45J31j89M8J7l23
7312b65K85Q8j0O8k85J06J85j87r2J69k91K15J73m93O57j76l75M23j19l03j21
7333c48M07k30J09n0M5j07J81J46k03j0N7L3j62k6R7J53K77l50L1j89L44m33K72
7356D4QP2l2l33J52k3l0j32J36J53j12n7R4K21m1Q5j88Mk1P7m1Mj2J70l57Q8M8
7383b3j74O6J59j6k28R8%m3L81j91P4k55J51r1r1K19J53j76j00J56o8j49j50J55
7407a43j06L09O2Q8k23o9P8Q1n5j40J38Nl4j91J52J24l31J64M0N4O3j73N7j24
7431a74P0jJ29j23J6Q0K4qqJ89k97J07j56J83J7JK78k99l9mL38l12k18N4J33k84
$$ plain form
7457 -304 -99 276 -54 14 -122 194 -73 -119 107 141 40 -190 -113 0 73 75 166 126 88 48 104 -37 313 20
7481 20 -239 9 76 18 -167 163 -5 -28 -134 61 157 -85 216 116 -69 23 13 -53 -251 -37 -197 -49 -15
7504 -15 -37 12 -23 83 111 62 -220 -67 -132 69 150 171 109 -13 -139 11 6 226 -62 4 -82 -37 -73 107 -63
7529 -63 -190 -76 228 11 -77 -15 -93 149 -228 -33 7 -7 126 57 65 -158 -69 -66 210 -102 -8 117 -20 -29 -294
7554 -294 163 67 -66 190 48 -151 -118 -249 20 39 -128 -201 -5 -64 236 27 -75 228 61 9 -89 -25 76
7577 76 96 12 137 -195 52 -234 138 -158 58 -257 -266 -146 172 34 -251 83 73 -114 -171 204 14 -124
7599 -124 -228 -181 -154 -196 37 17 148 -95 151 -201 -190 -87 -17 119 -146 100 -83 248 -28 34 -245 -318 -106
7622 -106 268 101 217 159 143 -229 -345 199 -194 -35 -184 -44 -151 -106 -98 -2 327 -160 35 -18 213 81
$$ packed form
7457c04K05L75l30O8j36L16k67m6K26L4j01k30P7J13P3KR1m0l8m0N6j41L50k93
7481B0k59K48O7n8j85L30j68k3j06J95R6k42L01j00j85R2j0o6j98K14j60J48L4
7504a5k2M9l5J06K8m9k82J53o5K01Q1K1o2j22j26J50nK20k88O6q6M5l6J80j70
7529f3j27J14L04k17q8O2p8K42l77J95M0j4J33o9Qk23Q9LK76l12R4J25j37rk65
7554b94M57r6j33K56j42j99L3j31K69J9j67p3J96n9L00k09j02L03j67n2r8O4J01
7577G6K0q4J25l32K47k86L72k96K16l15rJ20L18j38k85L34j0j87n7L75j90j38
7599a24j04M7K7m2K33k0J31k43K46l52J1J03P0J36k65K46j83L31k76O2k79p3K12
7622a06L74j67J16n8j6l72j16N44l93J59j49J40j07M5QR6L29m87J95n3K31j32
$$ plain form
7644 81 -108 263 -13 -137 -187 -27 120 114 -146 25 -49 -43 -134 -53 -216 -159 -45 -101 -175 46 -99 0 -48 -59 54
7669 54 286 138 28 -110 248 -24 -82 -125 -164 78 -63 -20 212 -52 -176 42 17 -109 -137 93 -213 44
7691 44 -41 -222 41 -126 65 -45 21 -143 -27 32 311 45 132 -139 47 2 176 -92 -56 205 171 -351 203
7714 203 42 47 82 -84 90 -35 -353 -88 -140 -126 -47 -26 -54 -205 11 -108 120 15 158 108 -25 36 117 -17
7738 -17 357 12 -117 6 4 -152 -3 23 287 138 20 145 54 -239 0 -123 -37 1 77 -56 26 73 -59
7761 -59 125 168 239 79 101 -102 50 -156 -145 53 -46 -20 240 -190 -182 214 -81 -347 278 53 212 -100 196
7784 196 267 -193 -47 -72 -87 165 -47 -42 -94 -360 141 210 170 87 183 -106 207 260 -217 -107 57 -89 186 -126
7808 -126 141 -308 -71 -192 16 54 -11 -33 -25 -63 -72 -111 30 338 260 -209 24 -209 -51 23 -25 -174 -33 -172
$$ packed form
7644H1j89L71k76j24n0J60J47ok60J71p4Or1Q1j63N7J14n6p4K21j45R9m8j1J13
7669E4K32j48j10j38L58k72n8m3l9K42j41M3K32k64j24K18k5j26k8K30l06K57
7691D4q5j81K63j67J91j10O6j64J16N9K79k66Q7k71J86m5J74k68L6K61l4n22N54
7714B03j61NL5j66J74j25l18K65n2J4P9K1k8j51K16j19K28j05J43n0j33O1Q1j34
7738a7L74l45j29J23kj56J49K6K64j49j18J25r1k93K39j23Q6L8P6j33Q2M7j32
7761e9J84M3P1j60K2k03J52k06J1J98r9K6K60m30QL96k95k66O25k25J59l12K96
7784A96P1m60J46k5j5K52k12Nn2k66N01O9m0q3R6k89L13N3m77J10J64j46K75l12
7808a26K67m49K37j21K08L8o5k2Ql8rl9J41L08p8m69K33k33J58P4m8j49J41j39
$$ plain form
7832 -172 36 -157 -30 -58 127 7 123 227 49 -11 -67 162 -29 -103 -52 150 -57 -131 -96 -39 -142 -217 2
7855 2 -312 -4 1 -269 84 49 -58 -34 208 -41 99 78 -37 16 154 -179 18 76 84 -97 87 125 -50 9
7879 9 -144 37 -33 -52 -5 -53 128 -45 31 -1 -176 -100 135 -133 -223 -40 -328 86 -10 -54 -78 159 88 -219 58
7904 58 2 122 -101 26 154 -22 32 -92 -34 -118 -172 12 -4 169 -74 -29 -93 0 -88 21 243 -167 -65 119
7928 119 139 -41 52 1 75 -194 -49 -26 132 -85 -52 -66 113 45 9 33 -43 84 -41 -165 292 -58 178 -65
7952 -65 69 127 233 -5 -146 251 111 -168 -27 -85 -13 154 31 137 -41 -73 180 36 63 -104 -240 -156
7974 -156 166 -209 -324 70 -307 23 53 75 -305 -94 255 82 183 -169 1 -6 -229 -149 355 -271 -167 -131
7996 -131 -108 83 107 -201 -84 179 -66 -75 -73 325 -74 32 42 124 41 213 -49 -60 47 288 -54 -15 36 -21
$$ packed form
7832a72K08j93J27k8J85j20J16J04j78o0n6K29j91p4N1K02k07p4L5N7j03p5K19
7855Bl14L08Nk70L53l5j07K4K42k49J40k1j15N3J38l33J97N8Qj81J84L8j75N9
7879Ij53J81p0j9M7m8J81j73P6l2j75P6K35k68r0J83k88M14r6m4k4K37p1l07K77
7904E8n6J20k23J27J28j76N4j24N8q4n4J84j6J73k43M5o4R3q8J09K22m10J02J84
7928A19K0j80R3n1P4k69J45K3J58k17L3j4J79o8l6K4p6J27j25j24M57l50K36k43
7952f5J34N8J06k38j41L97j40k79J41n8P2J67j23J06j78l2K53j44K7j67j36Q4
7974a56L22l75j15L94l77L30L0K2l80K11L49j73J01l52J70pk23Q0N04o26J04L6
7996a31K3J91K4l08J17K63k45rKL98l99J06J0Q2q3J72k62j1J07K41l42L9N1n7
$$ plain form
8020 -21 323 -5 -80 -16 14 -129 11 69 -95 -32 37 40 -50 -41 197 -103 -63 116 22 83 158 -245 11 48 -9 -35
8046 -35 -327 -165 -15 33 -105 -130 -156 -118 -13 -65 30 218 165 -26 31 99 43 -11 131 47 -102 160 79 -17 173
8071 173 -29 -89 -131 -110 189 79 -57 -32 -73 -74 -160 -40 -181 54 -84 -33 172 -188 -155 77 26 65 74 -37 104
8096 104 -16 -153 189 78 -49 -14 -153 399 137 163 -125 -238 -63 83 -179 -62 -3 -159 21 -4 169
8117 169 -1 60 73 94 -115 -263 -91 130 -105 -90 -104 94 51 35 -33 108 27 -97 107 81 246 45 -30 69
8141 69 -1 156 -215 114 -125 -139 -13 53 7 -46 158 -105 9 -12 54 130 89 -211 -88 24 -73 -128 306 107
8165 107 -14 151 12 77 -101 -147 26 55 -13 -207 -149 27 -49 -110 207 9 26 107 66 -5 41 -137 -206 -31
8189 -31 -60 52
$$ packed form
8020b1L44l28p5O4L0j43J40N8j64O3O9Lr0RK38l00M0J79r4O1P5m03K56L7n7k6
8046c5k92J62J50M8j38k5k6L8J05n2R5J88n3j91N7O8n6n4J42q4j49K62q1r6J90
8071A73k02o0m2K1K99j10j36K5m1jq6J20j41K35j38N1K05l60L3K32n1L9Rj11J41
8096A04j20j37L42j11j27L5j39N52k62K6k88j13J75J46k62J17N9j56J80k5J73
8117A69j70O1J3K1k09j48J72K21k35J5j4J98m3j6o8J41q1j24K04k6J65k01p5R9
8141F9p0J57l71L29k39j4J26O6m6n3K04k63J14k1O6P6m1l00J23J12r7n5M34j99
8165A07j21J65j39O5j78m6J73K9o8j94N8J76p6o1L17j98J7Q1m1p1M6j78o9J75
8189c1k9J12
8191E2
$$ Imaginary data points
##PAGE= N=2
##DATA TABLE= (X++(I..I)), XYDATA
$$ plain form
0 0 0 0 0 0 0 0 0 0 0 0 0 0 0 0 0 0 8 -8 8 -8 8 -8 16 -16 16 -24 24 -31 32 -40 45 -48 56 -64 72 -81 93 -103
38 -103 117 -128 143 -160 176 -196 219 -237 264 -292 321 -355 391 -431 473 -523 577 -640 710 -791
58 -791 885 -994 1126 -1291 1495 -1762 2125 -2649 3485 -5021 8761 -37045 3902 143074
72 143074 116302 -11249 -107484 -95269 -11094 116293 163477 81737 -36436 -84814 -66864
83 -66864 17126 112597 118106 24171 -63656 -101030 -76560 15004 99677 72877 -29402 -105354
95 -105354 -115931 -59148 42096 93970 46665 -36660 -86495 -81343 -8893 81287 97328 32452
107 32452 -38707 -70453 -45161 32483 94030 78914 16096 -45297 -77009 -44208 38459 82131
119 82131 46201 -22136 -74461 -79043 -18392 54862 66063 19565 -35603 -71941 -58786 5277
$$ packed form
0@%%%%%%%%%%%%%%%%Qj6J6j6J6j6K4l2L2m0M8n5O3p2Q5r3J04j20J36j53J74j96
38a03K20k45K71l03L36l72M15m56N01n56O13o76P46q22R04r96J100j217J350j501
58g91J676j879K120k417K786l257L887m774O134q506J3782m5806M0947J39172
72A43074k6772j27551r6235J2215Q4175J27387M7184q1740j18173m8378J7950
83f6864Q3990R5471N509r3935q7827l7374K4470R1564Q4673k6800j02279p5952
95a05354j0577N6783J01244N1874m7305q3325m9835N152P2450R0180J6041o4876
107C2452p1159l1746K5292P7644O1547j5116o2818o1393l1712L2801Q2667M3672
119H2131l5930o8337n2325m582O0651P3254J1201m6498n5168l6338J3155O4063
$$ plain form
131 5277 60894 61854 22972 -30381 -63515 -35457 34508 72700 52080 1742 -47126 -58960 -14960
144 -14960 41799 57582 31196 -15184 -56162 -55176 -6627 38848 43797 14145 -31275 -60772 -39876
157 -39876 13407 46422 40855 6885 -35923 -51533 -19478 27118 48043 35750 -238 -37221
169 -37221 -38366 -1050 35488 44087 24520 -13437 -42168 -31016 6057 34398 36988 12418 -25440
182 -25440 -42755 -22316 12477 31708 26028 -3063 -34689 -38327 -12158 17907 30872 19506
194 19506 -10594 -34861 -29566 -1777 23770 31364 14644 -14961 -29629 -15375 11364 30738
206 30738 30153 7953 -18533 -24935 -7661 15974 29596 22522 -2995 -25052 -24397 -5619 14692
219 14692 22359 9337 -16050 -30035 -22445 -1941 16253 19037 2668 -18880 -25614 -13361 7489
$$ packed form
131E277N5617R60l8882n3353l3134K8058O9965L8192k0620n0338m8868j1834M4000
144a4960N6759J5783k6386m6380m0978R86M8549M5475M949k9652m5420k9497K0896
157c9876N3283L3015n567l3970m2808j5610L2055M6596K0925j2293l5988l6983
169c7221j145L7316L6538Q599j9567l7957k8731J1152L7073K8341K590k4570l7858
182b5440j7315K0439L4793J9231n680k9091l1626l638K6169L0065J2965j1366
194A9506l0100k4267N295K7789K5547P594j6720k9605j4668J4254K6739J9374
206C0738n85k2200k6486o402J7274K3635J3622p074k5517k2057O55J8778K0311
219A4692P667j3022k5387j3985P590K0504J8194K784j6369k1548o734J2253K0850
$$ plain form
232 7489 22340 20415 1866 -15783 -16072 -1167 17223 26192 17088 -2375 -16430 -13492 1677
245 1677 17484 20713 7651 -11708 -20955 -15065 611 13153 12104 -2629 -18342 -21566 -10543
258 -10543 5762 15485 10843 -4259 -16094 -15147 -2040 12679 18302 10597 -3593 -11836 -7943 4674
272 4674 16535 17307 5194 -8780 -14374 -7414 5147 13871 11037 -1770 -13647 -14919 -6070 4749
286 4749 10053 5162 -6586 -14414 -12036 -1637 9644 12297 4980 -6273 -11666 -6947 4040 12331
300 12331 12035 2798 -6761 -8689 -2252 7431 12445 8949 -1182 -9717 -9650 -2261 6218 9778 4349
315 4349 -4997 -11223 -8872 -168 6609 6833 74 -8041 -11059 -5951 2670 9080 7489 181 -6709
330 -6709 -7565 -2110 5824 9408 6526 -1195 -6220 -4632 2066 8376 9195 3530 -3553 -7420 -5379 1610
$$ packed form
232G489J4851j925j8549j7649k89J4905J8390Q969r104j9463j4055K938J5169
245A677J5807L229j3062j9359r247N890J5676J2542j049j4733j5713l224J1023
258a0543J6305R723m642j5102j1835R47J3107J4719N623p705j4190q243L893J2617
272D674J1861P72j2113j3974n594O960J2561Q724k834j2807j1877j272Q849J0819
286D749N304m891j1748p828K378J0399J1281K653p317j1253n393M719J0987Q291
300A2331k96r237r559j928O437R683N014l496j0131q535O7P389Q479L560n429
315D349r346o226K351Q704O777K24o759q115l018N108Q621O410j591p308o890
330f709q56N455P934L584k882p721n025J588O698O310Q19n665p083l867K041O989
$$ plain form
346 1610 6482 5577 -516 -6297 -7915 -4129 1744 5321 2884 -3145 -8142 -7896 -2570 4038 6522 3162
362 3162 -2433 -5525 -3540 2114 6649 6972 2736 -2299 -3997 -1242 4117 7668 6155 920 -4037
377 -4037 -5374 -2126 2429 4509 1680 -3357 -6628 -5864 -1706 2325 3121 63 -4504 -6463 -4350 659
393 659 4209 4468 1331 -2313 -2817 -324 3828 6170 4985 797 -2450 -2151 933 4461 5415 2886
409 2886 -1805 -4211 -3394 -540 2217 1916 -1177 -4290 -5438 -3574 -528 2379 1866 -1135 -4307 -3894
425 -3894 -1287 2313 4256 2897 29 -1573 -721 1500 4141 4934 2272 -976 -2070 -1442 1064 3515
441 3515 2985 -652 -2993 -3243 -2521 -176 1799 315 -2481 -3646 -3710 -1971 977 2768 757 -1690
457 -1690 -2574 -1491 503 3538 3573 1406 80 -589 -265 2120 4489 3034 582 -862 -1884 -912 1596
$$ packed form
346A610M872r05o093n781j618L786N873L577k437o029m997K46N326O608K484l360
362C162n595l092J985N654M535L23m236n035j698K755N359L551j513n235m957
377d037j337L248M555K080k829n037l271P64M158M031P96l058m567j959K113N009
393F59L550K59l137l644n04K493M152K342j185m188l247K99L084L528R54k529
409B886m691k406Q17K854K757l01l093l113j148J864L046K907n13l001l172M13
425c894K607L600J943j359k868j602Q52K221K641P93k662l248j094O28K506K451
441C515n30l637k341k50P22K345J975j484k796j165o4J739K948J791k011k447
457a690q84J083J994L035L5k167j326o69L24K385K369j455k452j444j022R72K508
$$ plain form
474 1596 2528 416 -1315 -2382 -3205 -2063 624 350 -1548 -2180 -3260 -3333 -256 1751 1385 -277 -662
491 -662 -1594 -688 2173 3263 1838 1562 901 -359 1006 3742 3138 1589 787 -888 -1503 326 1746
508 1746 160 -589 -1314 -2884 -2963 -542 -304 -1389 -1700 -2548 -3289 -1561 468 444 -58 159 -754 -860 1403
527 1403 2323 2290 2248 1186 0 989 3054 2903 2160 1229 -537 -1591 -5 791 4 41 -846 -2863 -2970
546 -2970 -1208 -593 -1112 -648 -2276 -3466 -2038 238 166 377 641 -438 -863 1072 1912 1809 2476 1982
564 1982 27 40 1757 2105 1756 1954 144 -1483 -942 -10 -410 -552 -295 -2186 -3114 -1518 -1096 -1083 -216
583 -216 -427 -1949 -1781 -455 -34 839 1790 630 -125 329 1300 1390 2262 2364 896 -133 543 330 354
602 354 966 431 -743 -1178 -948 -1195 -726 -512 -1308 -2013 -1576 -1084 -826 -392 -142 -233 -527 -20 223 579
$$ packed form
474A596R32k112j731j067q23J142K687k74j898o32j080p3L077K007l66j662l85
491f62r32R06K861J090j425k76o61j260J365K736o04j549q02j675o15J829J420
508A746j586p49p25j570p9K421K38j085l11q48p41J728K029k4n02K17r13j06K263
527A403R20l3m2j062j186R89K065j51p43r31j766j054J586P96p87L7q87k017j07
546b970J762O15n19M64j628j190J428K276p2K11K64j079m25J935Q40j03O67m94
564A982j955J3J717L48l49J98j810j627N41R32m00j42K57j891r28J596M22J3Q67
583b16k11j522J68J326M21Q73R51j160p55M54R71R0Q72J02j468j029O76k13K4
602C54O12n35j174m35K30k47M69K14p96p05M37M92K58M34K50r1k94N07K43L56
$$ plain form
622 579 1400 1187 534 879 1314 1232 1796 1931 834 87 226 5 -81 178 59 -1045 -924 -1065 -1130 -825 -742
643 -742 -1443 -1670 -1335 -1050 -947 -304 128 -253 -168 -94 519 797 1251 1285 821 740 1011 1284 1467 1760 689
664 689 51 186 -83 4 597 131 -1033 -1213 -1117 -1333 -805 -462 -930 -1295 -1239 -1356 -1133 -483 397 4 -322
685 -322 212 -97 720 1335 1418 935 1069 767 676 946 1844 1161 428 255 25 -427 79 -69 -687 -1218 -1064
706 -1064 -1347 -1304 -792 -801 -898 -950 -961 -1230 -602 122 341 217 271 506 444 918 1116 1222 1263 1176 765 830 1015 843
730 843 492 325 178 -248 -432 -438 -536 -1029 -941 -1148 -1266 -1198 -903 -874 -917 -675 -970 -312 99 353 470 639 764
753 764 647 1001 940 1187 1133 1168 1061 733 625 671 309 277 -348 -528 -530 -761 -739 -832 -1065 -1340 -1158 -910 -684
776 -684 -741 -656 -396 -907 -464 397 503 588 891 834 968 1092 1044 1081 854 1157 599 593 603 543 241 -5 -328 -855
$$ packed form
622E79Q21k13o53L45M35q2N64J35j097p47J39k21q6K59j19j104J21j41o5L05Q3
643g42p01k27L35K85J03O43M32l81Q5P4O13K78M54L4m64q1K71K73J83K93j071
664F89o38J35k69Q7N93m66j164j80R6k16N28L43m68l65N6j17K23O50Q80l93l26
685c22N34l09Q17O15Q3m83J34l02r1K70Q98o83p33j73k30m52N06j48o18n31J54
706a064k83M3N12rr7n2j1k69O28P24K19j24N4K35o2M74J98J06M1q7m11O5J85j72
730H43l51j67j47m26j84or8m93Q8k07j18O8K95K9m3K42k95O58M11K54J17J69J25
753G64j17L54o1K47n4L5j07l28j08M6l62l2o25j80kk31K2r3k33k75J82K48K26
776f84n7Q5K60n11M43Q61J06Q5L03n7J34J24m8L7k27L03n58oJ0o0l02k46l23n27
$$ plain form
800 -855 -762 -539 -1123 -1180 -1091 -1163 -1076 -970 -738 -441 -323 -125 -522 -154 95 399 511 764 913 998 954 1017 1078
823 1078 1024 991 581 420 244 -16 -261 175 -97 -799 -849 -849 -884 -1033 -882 -1211 -1377 -810 -665 -589 -191 28
845 28 19 287 540 569 469 974 985 975 812 1022 1101 759 921 298 202 147 -150 -105 -468 -457 -402 -910 -843 -1079 -745
870 -745 -841 -994 -910 -1015 -603 -564 -86 229 112 229 777 591 656 905 702 1004 1074 1036 840 659 649 399 279
893 279 144 -286 -511 -295 -518 -575 -903 -649 -834 -840 -586 -794 -683 -558 -598 -490 -158 186 -31 127 676 634
915 634 439 1047 882 799 890 681 674 801 1048 610 219 117 -177 -596 -475 -528 -968 -874 -697 -828 -903 -826 -660
938 -660 -675 -193 -229 -445 48 408 197 345 911 620 793 914 655 619 882 727 593 753 674 73 331 116
960 116 -95 -583 -466 -664 -874 -1039 -701 -731 -951 -541 -679 -434 -286 -247 -12 78 336 362 567 637 675 919
$$ packed form
800h55R3K23n84n7Q9p2Q7J06K32K97J18J98l97L68K49L04J12K53J49Q5m4O3O1
823A078n4l3m10j61j76k60k45M36k72p02n0%l5j49J51l29j66N67J45P6L98K19
845B8rK68K53K9j00N05J1j0j63K10P9l42J62o23r6n5k97M5l63J1N5n08O7k36L34
870g45r6j53Q4j05M12L9M78L15j17J17N48j86O5K49k03L02P0l8j96j81j0k50j20
893B79j35m30k25K16k23n7l28K54j85oK54k08J11J25m0J08L32L44k17J58N49m2
915F34j95O08j65q3R1k09pJ27K47m38l91j02k94m19J21n3m40R4J77j31p5P7J66
938f60j5M82l6k16M93L60k11J48N66k91J73J21k59l6K63j55j34J60p9o01K58k15
960A16k11m88J17j98k10j65L38l0k20M10j38K45J48L9K35R0K58K6K05P0L8K44
$$ plain form
982 919 1043 733 827 736 498 213 748 300 -166 75 61 -459 -977 -448 -576 -1181 -810 -799 -947 -739 -297 -394
1004 -394 -612 37 -113 0 549 648 228 622 1053 586 614 956 1052 618 687 714 103 107 157 -229 -285 -18 -485
1027 -485 -768 -791 -675 -835 -803 -606 -598 -552 -235 -605 -380 167 36 132 507 692 204 645 860 1038 558 971
1049 971 614 394 221 365 354 -96 -133 -387 -237 -357 -634 -775 -409 -656 -509 -1033 -462 -629 -377 52 -405
1070 -405 -155 271 213 -119 540 755 514 829 906 901 437 1132 656 607 535 373 -4 -39 -65 -347 -509 -467 -446
1093 -446 -722 -686 -835 -688 -587 -384 -741 -590 -159 -198 -357 271 327 466 431 501 376 693 1071 618 434 784
1115 784 328 183 539 262 -99 -263 -88 -585 -628 -511 -584 -594 -525 -672 -724 -716 -349 -368 -359 -83 -54 -50 441 425 300
1140 300 534 859 585 715 766 425 590 1066 270 133 319 339 -202 -23 -125 -582 -601 -604 -644 -650 -689 -740 -795 -424
$$ packed form
982I19J24l10R4r1k38k85N35m48m66K41j4n20n18N29j28o05L71J1j48K08M42r7
1004c94k18O49j50J13N49R9m20L94M31m67K8L42R6m34O9K7o11MN0l86n6K67m67
1027d85k83k3J16j60L2J97QM6L17l70K25N47j31R6L75J85m88M41K15J78m80M13
1049I71l57k20j73J44j1m50l7k54J50j20k77j41L66k47J47n24N71j67K52M29m57
1070d05K50M26n8l32O59K15k41L15P7nm64O95m76m9p2j62l77l5k6k82j62M2K1
1093d46k76L6j49J47J01K03l57J51M31l9j59O28N6J39l5P0j25L17L78m53j84L50
1115G84m56j45L56k77l61j64J75m97m3J17p3j0O9j47n2QL67j9RK76K9MM91j6j25
1140C00K34L25k74J30N1l41J65M76p96j37J86K0n41J79j02m57j9lm0ol9n1n5L71
$$ plain form
1164 -424 -663 -421 9 -4 -5 88 617 417 579 688 981 737 472 989 477 281 401 230 344 425 87 -303
1186 -303 -331 -77 -603 -814 -643 -907 -687 -696 -550 -602 -297 -175 34 -76 -16 281 416 553 240 551 574 711
1208 711 365 675 626 412 253 173 -32 1 -129 88 -456 -195 -520 -649 -621 -390 -568 -568 -477 -663 -173 -384
1230 -384 -27 -339 93 170 327 39 237 387 487 436 660 570 554 575 196 594 374 95 -54 -98 -354 -462
1252 -462 -244 -229 -592 -642 -745 -659 -334 -580 -438 -354 -325 -39 -234 -32 140 180 550 266 271 632 571 594 563 571
1276 571 465 420 123 125 173 186 45 -2 -465 -354 -577 -548 -489 -424 -438 -668 -258 -429 -112 -191 -212 -41 276 -266
1300 -266 314 494 291 481 552 638 711 737 400 334 301 151 176 4 -64 -206 -655 -473 -628 -897 -368 -563 -527
1323 -527 -633 -385 -132 116 -226 -27 -218 6 84 280 412 236 543 528 711 546 355 444 394 141 220 78
$$ packed form
1164d24k39K42M30j3jR3N29k00J62J09K93k44k65N17n12j96J20j71J14Q1l38l90
1186c03k8K54n26k11J71k64K20rJ46n2L05J22K09j10O0K97J35J37l13L11K3J37
1208G11l46L10m9k14j59q0k05L3j30K17n44K61l25j29K8K31j78%R1j86M90k11
1230c84L57l12M32P7J57k88J98J50J00n1K24r0j6K1l79L98k20k79j49m4k56j08
1252d62K18J5l63n0j03Q6L25k46J42Q4K9K86j95K02J72M0L70k84NL61o1K3l1Q
1276E71j06m5k97KM8J3j41m7m63J11k23K9N9O5j4k30M10j71L17p9k1J71L17n42
1300b66N80J80k03J90P1Q6P3K6l37o6l3j50K5j72o8j42m49J82j55k69N29j95L6
1323e27j06K48K53K48l42J99j91K24P8J96J32j76L07j5J83j65j91Q9n0k53P9j42
$$ plain form
1345 78 -98 -234 -240 -234 -277 -346 -306 -460 -462 -578 -457 -628 -370 0 -87 -107 -55 231 6 336 431 445 453 609 575 406
1371 406 427 646 499 455 331 92 -10 -186 -283 -195 -396 -623 -472 -588 -500 -545 -675 -251 -325 -461 -21 215
1393 215 46 63 221 227 125 332 105 303 296 531 513 137 584 624 345 39 -49 -140 -268 -109 -190 -422 -750
1416 -750 -621 -433 -503 -283 -540 -212 -197 -6 -65 -134 -117 179 47 369 221 444 673 771 306 298 650 484 140
1439 140 196 352 89 -264 -214 -315 -446 -356 -458 -339 -444 -513 -477 -593 -289 -431 -283 -431 -174 -12 331 144
1461 144 218 397 485 412 451 459 574 533 198 344 615 40 147 23 -26 -111 -216 -42 -53 -557 -285 -260 -388 -234
1485 -234 -538 -362 -295 -391 -179 -204 14 32 -11 543 311 565 521 441 498 714 112 230 347 419 47 -87 -138
1508 -138 -166 -286 -236 -584 -497 -324 -314 -347 -506 -60 -326 -324 -185 -81 -146 2 266 309 425 248 319 315 400 761
$$ packed form
1345G8j76j36oOm3o9M0j54kj16J21j71K58L70q7k0N2K86k25L30R5J4QJ56l4j69
1371D06K1K19j47m4j24k39j02j76r7Q8k01k27J51j16Q8m5j30M24p4j36M40K36
1393B15j69J7J58Oj02K07k27J98pK35j8l76M47M0k79l06q8r1j28J59q1k32l28
1416g50J29J88p0K20k57L28J5J91n9o9J7K96j32L22j48K23K29R8m65qL52j66l44
1439A40N6J56k63l53N0j01j31R0j02J19j05o9L6j16L04j42J48j48K57J62L43j87
1461A44P4J79Q8p3L9QJ15m1l35J46K71n75J07j24m9q5j05J74j1n04K72K5j28J54
1485b34l04J76O7r6K12k5K18J8m3N54k32K54m4q0N7K16o02J18J17P2l72j34n1
1508a38k8j20N0l48Q7J73J0l3j59M46k66KJ39J04o5J48K64M3J16j77P1mQ5L61
$$ plain form
1532 761 497 404 190 -74 128 177 -28 -245 -146 26 -415 -397 -470 -269 -562 -129 -378 -410 -434 -225 -367 236
1554 236 36 -110 71 139 253 296 407 535 212 361 421 325 -29 278 262 -68 173 -97 -123 12 -220 -233
1576 -233 10 -222 -463 -476 -317 -303 -346 -279 -402 -34 29 -160 77 138 233 97 479 494 63 384 462 201 149
1599 149 27 140 226 27 88 -296 -196 -359 -343 48 -353 -185 -431 -414 -254 -418 -602 -138 -233 -134 -54 196
1621 196 -87 -21 315 284 384 304 327 325 430 358 -7 228 463 32 -168 161 -237 -286 -246 -244 -332 -215 -244 -507
1645 -507 -143 -431 42 -175 -162 -7 39 -10 110 42 151 460 231 458 134 273 379 246 130 202 -9 -98
1667 -98 52 22 -66 -504 -104 -254 -393 -313 -363 -149 -474 -463 -302 -23 -106 -164 20 65 62 199 177 316 178 462
1691 462 355 279 221 215 239 143 221 232 -133 -153 -405 -24 -228 -245 -163 -177 -358 -360 -220 -403 -268 -214 -163 -56 -163
$$ packed form
1532G61k64r3k14k64K02M9k05k17R9J72m41J8p3K01k93M33k49l2k4K09j42O03
1554B36k00j46J81O8J14M3J11J28l23J49O0r6l54L07j6l30K41k70k6J35k32j3
1576b33K43k32k41j3J59J4m3O7j23L68O3j89K37O1R5j36L82J5m31L21P8k61n2
1599A49j22J13Q6j99O1l84J00j63J6L91m01J68k46J7J60j64j84M64r5R9Q0K50
1621A96k83O6L36l1J00q0K3kJ05p2l65K35K35m31k00L29l98m9M0Kq8J17k9k63
1645e07L64k88M73k17J3J55M6m9J20o8J09L09k29K27l24J39J06j33j16P2k11q9
1667i8J50l0q8m38M00j50j39Q0n0K14l25J1J61K79q3n8J84M5lJ37k2J39j38K84
1691D62j07p6n8oK4r6P8J1l65k0k52L81k04j7Q2j4j81kJ40j83J35N4N1J07j07
$$ plain form
1716 -163 -113 -8 -161 17 312 399 179 212 303 250 284 174 243 187 178 169 19 -88 -31 -81 -248 -327 -257 -254 -217 -399
1742 -399 -180 -25 -170 -141 -81 -60 163 19 42 134 276 480 235 292 443 251 315 334 301 326 238 113 209 12
1766 12 132 -182 -151 -432 -338 -144 -314 -323 -346 -329 -239 -114 -185 -152 98 2 -99 339 157 340 436 261 166 42
1790 42 99 226 334 321 379 151 -69 -11 -57 -168 -119 -72 -122 -515 -362 -174 -93 -308 -147 -272 -388 -84 -50 -160
1814 -160 -79 201 249 3 56 591 242 181 455 378 297 494 383 154 -14 68 107 -162 -89 -84 -103 -448 -299 -217
1838 -217 -22 -329 -266 -366 -77 -74 -95 -44 337 241 -21 50 75 145 520 246 268 125 17 213 191 194 -40 -32 -16
1863 -16 -298 30 -25 -58 11 -409 -365 -267 -397 -157 -175 -324 -223 -259 19 81 193 -27 245 319 346 249 455 295
1887 295 141 337 148 269 64 59 55 51 31 -264 -127 -331 64 -470 -193 -159 -418 -85 -109 -296 -41 9 -157
$$ packed form
1716a63N0J05j53J78K95Q7k20L3R1n3L4j10O9n6rrj50j07N7n0j67p9P0LL7j82
1742c99K19J55j45K9O0K1K23j44K3R2J42K04k45N7J51j92O4J9l3K5q8j25R6j97
1766A2J20l14L1k81R4J94j70rk3J7R0J25p1L3K50r6j01M38j82J83R6j75r5j24
1790D2N7J27J08j3N8k28k20N8m6j11M9M7n0l93J53J88Q1k15J61j25j16L04L4j10
1814a60Q1K80M8k46N3N35l49o1K74p7q1J97j11k29j68Q2L9k69P3Nj9l45J49Q2
1838b17J95l07O3j00K89Lk1N1L81r6k62P1K5P0L75k74K2j43j08J96k2Lk34QJ6
1863a6k82L28n5l3O9m20M4R8j30K40j8j49J01l6K78O2J12k20K72P4K7r7K06j60
1887B95j54J96j89J21k05nmmk0k95J37k04L95n34K77L4k59L33k4j87K55N0j66
$$ plain form
1910 -157 -68 78 233 218 184 304 -64 167 138 214 298 301 68 376 -91 75 185 -146 -143 -114 87 -408 -117 -486
1934 -486 -423 -559 42 -232 -192 -18 -268 243 142 391 -133 121 238 265 381 67 562 -19 94 279 172
1955 172 114 -84 65 107 -264 1 -271 -521 -209 -268 -162 -422 -287 -153 -465 -158 -231 -282 -315 89 94 254 227
1978 227 287 485 182 216 262 192 121 201 470 112 104 33 -16 9 -206 -100 -177 -129 -436 -324 -76 -63 -210 -254 -435
2003 -435 -52 -49 -360 -74 14 -80 276 106 263 315 155 264 129 225 77 405 202 117 234 -169 -83 -7 21
2026 21 -220 -121 -90 -183 -248 -32 -115 -227 -177 -210 11 -329 -134 73 -107 -135 54 28 39 192 424 103 128 19
2050 19 196 360 345 74 7 82 43 17 -141 -135 -372 -229 30 -341 -308 -305 -322 -372 -132 -271 -57 23 -79 82 -25
2075 -25 138 285 289 170 311 197 297 246 50 33 -127 -138 -112 -116 -231 36 -43 -279 -21 -224 -83 -138 -299 -105
$$ packed form
1910a57Q9J46J55j5l4J20l68K31k9P6Q4Lk33L08m67J66J10l31LK9K01m95K91l69
1934d86O3j36O01k74M0J74k50N11j01K49n24K54J17K7J16l14M95n81J13J85j07
1955A72n8j98J49M2l71K65k72k50L12n9J06k60J35J34l12L07p3n1l3M04NJ60k7
1978B27O0J98l03L4M6p0p1Q0K69l58qp1m9K5k15J06p7M8l07J12K48J3j47m4j81
2003d35L83Ll11K86Q8r4L56j70J57N2j60J09j35R6j48L28k03q5J17m03Q6P6K8
2026B1k41R9L1r3o5K16q3j12N0l3K21l40J95K07j80k8J89k6J1J53K32l21K5j09
2050A9J77J64j5k71o7P5l9k6j58Ok37J43K59l71L3Lj7n0K40j39K14Q0j02J61j07
2075b5J63J47Mj19J41j14J00n1j96j7j60j1K6mj15K67p9k36K58k03J41n5j61J94
$$ plain form
2099 -105 -78 2 59 92 43 71 55 213 286 183 130 272 315 191 206 201 178 285 -195 223 -191 14 121 -88 -188
2124 -188 -242 -301 -77 -34 -276 33 -40 -265 -247 -33 83 -36 -126 71 143 288 269 225 230 108 434 205 308 60
2148 60 -17 115 146 -13 -74 -199 92 -33 -299 -230 -85 -144 -122 -201 16 13 -49 -437 -36 -77 17 51 290 -130 -2
2173 -2 258 -82 243 364 355 -284 195 215 262 83 -110 50 264 141 -282 -175 -196 20 -126 28 1 -217 -93
2196 -93 -25 -184 2 180 51 315 -7 -38 -19 167 178 360 138 123 -18 201 100 -104 -6 127 -4 -70 60
2219 60 68 -182 -247 5 -293 -247 -9 -212 -278 74 -94 -72 129 -270 118 187 -68 341 371 140 309 247 46
2242 46 57 169 243 249 115 99 -215 14 15 -57 -248 -114 -289 -155 -89 -135 -21 79 -53 -359 -3 -166 52 65
2266 65 44 5 -39 122 225 97 314 143 132 85 38 10 28 -8 147 -140 -101 -99 -70 -169 103 -201 -400 -179 -133
$$ packed form
2099a05K7Q0N7L3m9K8j6J58P3j03n3J42M3j24J5nk3J07m80M18m14K05J07k09j00
2124a88n4n9K24M3k42L09p3k25J8K14J16j19r0J97P2J45j9m4Nj22L26k29J03k48
2148F0p7J32L1j59o1j25K91j25k66O9J45n9K2p9K17lo2l88M01m1R4L4K39m20J28
2173bK60l40L25J21ro39M79K0M7j79j93J60K14j23m23J07k1K16j46J54k7k18J24
2196i3O8j59J86J78j29K64l22l1J9J86J1J82k22j5j41K19j01k04R8J33j31o6J30
2219F0Qk50o5K52k98M6K38k03o6L52j68K2K01l99L88O9k55M09L0k31J69o2k01
2242D6J1J12P4Oj34j6l14K29Jp2j91J34j75J34O6m6J14J00j32l06L56j63K18J3
2266F5k1l9m4J61J03j28K17j71j1m7m7k8J8l6J55k87L9KK9r9K72l04j99K21M6
$$ plain form
2291 -133 -337 -43 -34 197 -62 -76 -170 -172 -35 238 -181 104 209 94 129 66 208 312 13 24 137 -161 -40
2314 -40 24 -65 -65 -212 135 16 87 -64 -246 -450 -139 -72 54 -96 -127 180 -52 -69 -223 -19 184 348 102
2337 102 159 342 30 -27 56 311 42 -24 -65 7 -73 -148 -251 -151 57 -136 -169 51 -14 -201 -289 105 -171 61
2361 61 -104 360 204 35 471 -126 92 141 84 318 -246 298 -72 -5 223 81 170 -201 -46 -142 -431 -320
2383 -320 -68 -4 -50 -58 66 -86 28 -172 -38 55 97 -40 150 127 307 124 188 60 123 212 48 217 273 -2
2407 -2 154 -15 154 -175 91 32 100 89 -61 -309 -100 57 72 -248 -171 -135 144 -111 -108 -99 -19 201 -199 -142 247
2432 247 155 -55 52 109 -61 162 379 32 174 -45 84 -468 -82 81 -104 -160 -102 -2 -186 -79 242
2453 242 -167 65 -1 156 -30 -35 -18 46 41 342 63 -55 16 431 279 70 86 -9 -24 118 375 -83 113 -35
$$ packed form
2291a33k04K94RK31k59j4r4kJ37K73m19K85J05j15L5o3J42J04k99J1J13k98J21
2314d0O4q9%j47L47j19P1j51j82k04L11O7J26j50l1L07k32j7j54K04K03J64k46
2337A02N7J83l12n7Q3K55k69o6m1P2q0p5j03J00K08j93l3K20o5j87q8L94k76K32
2361F1j65M64j56j69M36n97K18M9n7K34n64N44l70O7K28j42Q9l71J55r6k89J11
2383c20K52O4m6qJ24j52J14k00J34R3M2j37J90k3J80j83O4j28O3Q9j64J69N6k75
2407bJ56j69J69l29K66n9O8j1j50k48K09J57J5l20P7L6K79k55LRQ0K20m00N7L89
2432B47r2k10J07N7j70K23K17l47J42k19J29n52L86J63j85n6N8J00j84J07L21
2453B42m09K32o6J57j86nJ7O4nL01k79j18P1M15j52k09J6r5j5J42K57m58J96j48
$$ plain form
2477 -35 -102 -154 127 -11 -73 -258 -317 9 49 -129 -310 -77 -385 -15 -137 -6 40 241 -51 217 -109 108
2499 108 52 235 65 115 125 207 130 208 -42 -26 18 -169 -69 -172 -128 -131 -170 -273 -146 -207 -168 -126 -131 35 -332 171
2525 171 179 119 -18 -1 164 209 -23 64 17 -71 222 -300 -43 -63 78 147 108 119 48 -333 -297 -48 48 -206 -282
2550 -282 141 201 -121 -328 -190 -172 164 130 301 81 267 8 115 163 222 122 254 177 274 -201 -89 36
2572 36 -66 -55 -32 40 -328 90 39 -229 -20 104 14 -308 -55 51 -122 -131 32 -75 52 -27 49 52 -20 269
2596 269 126 189 170 204 19 87 -25 -20 -76 -19 -330 207 22 -73 -397 -143 -169 122 -137 114 -55 -77 -240 -68
2620 -68 -198 -103 192 -264 92 -11 13 -98 -122 300 245 -78 -253 -205 -124 8 -21 41 -46 83 -130 -188 39 -137
2644 -137 61 -99 -223 -91 -231 -114 30 124 118 99 -220 104 -37 56 173 77 251 174 324 368 -227 -46 193
$$ packed form
2477c5o7n2K81j38o2j85n9L26M0j78j81K33l08L70j22J31M6K01k92K68l26K17
2499A08n6J83j70N0J0Q2p7P8k50J6M4j87J00j03M4ll9j03J27o1L9M2nJ66l67N03
2525A71Qo0j37J7J65M5k32Q7m7q8K93n22K57k0J41O9l9J1p1l81L6K49R6k54p6
2550b82M23O0l22k07J38J8L36l4J71k20J86k59J07M8N9j00J32p7R7m75J12J25
2572C6j02J1K3P2l68M18n1k68K09J24r0l22K53J06j73rJ63j07J27p9P6Lp2K89
2596B69j43O3j9L4j85O8j12Nn6N7l11N37j85r5l24K54k6K91k59K51j69k2j63J72
2620f8j30R5K95m56L56j03K4j11k4M22n5l23j75M8Q1J32k9O2q7J29k13n8K27j76
2644a37J98j60j24J32j40J17J44R4oj9l19L24j41R3J17r6J74p7J50M4n95J81K39
$$ plain form
2667 193 252 34 310 -107 72 -24 -65 167 -37 4 -432 -107 -83 65 14 11 -173 3 105 82 91 -113 95 87
2691 87 54 94 162 121 -38 145 -76 159 78 -297 -81 18 -201 -10 -73 -7 57 -202 -279 -240 4 24 -145 -206 4
2716 4 -46 -7 -9 72 -13 -235 157 39 12 100 147 193 -3 -121 26 240 197 -63 277 141 -57 -95 -202 -156 163
2741 163 -286 -77 -223 85 -159 64 170 -64 -91 -119 -220 46 -82 64 115 134 8 95 109 75 390 25
2763 25 124 202 79 -223 170 -51 -129 -183 -84 -228 -210 -158 -306 44 -67 -89 293 -25 70 -179 -56 34 207 77
2787 77 243 20 152 149 -42 143 101 -81 -58 -91 40 -16 56 149 -80 -231 74 -133 -479 118 -51 -138 -50 184
2811 184 63 56 -1 -11 84 234 100 142 361 113 116 144 104 18 64 -66 113 -89 -307 122 -54 -204 -71 17
2835 17 -3 121 -223 173 -59 -43 -93 -89 -2 -39 -160 -10 -86 -99 189 90 7 28 233 154 94 292 209 111 30 219
$$ packed form
2667A93N9k18K76m17J79r6m1K32k04M1m36L25K4J48n1lj84J76J02k3Rk04K08q
2691H7l3M0O8m1j59J83k21K35q1l75K16R9k19J91o3O6O4k59p7L9K44K0j69o1K10
2716Dn0L9kQ1q5k22L92j18k7Q8M7M6j96j18J47K14m3k60L40j36j98l8j07M6L19
2741A63m49K09j46L08k44K23J06k34k7k8j01K66j28J46N1J9j26Q7J4l4L15l65
2763B5R9P8j23l02L93k21p8n4R9j44J8N2j48L50j11k2L82l18R5k49J23R0J73j30
2787G7J66k23J32lj91J85m2j82K3l3J31n6P2R3k29j51L05k07l46N97j69q7Q8K34
2811A84j21pn7j0R5J50j34M2K19k48LK8m0q6M6j30J79k02k18M29j76j50J33Q8
2835A7k0J24l44L96k32J6n0MQ7l7j21J50p6j3K88r9q3K1K05p9o0J98q3r8q1J89
$$ plain form
2861 219 -181 -280 159 174 -91 200 -231 13 -153 -154 -42 -318 -7 -147 -80 -133 -330 -55 -67 -126 -50 -146 70
2884 70 -175 18 7 146 45 193 86 -65 -23 5 -182 -38 84 -337 15 226 -81 -241 -1 122 -142
2905 -142 -141 189 63 235 -60 153 -126 36 -215 -211 -20 -51 -46 177 148 117 127 140 182 -70 91 253 283 -179
2929 -179 0 -53 -22 66 -38 -111 -109 -60 6 -85 84 3 -218 -96 125 -115 67 -15 289 -73 136 50 220 91
2953 91 67 49 -73 12 -17 -189 -29 276 342 132 -130 -245 48 54 5 7 176 -291 11 66 -260 -59 -46 -80 205
2978 205 -72 -9 -56 29 -42 -73 227 94 -17 -25 98 101 54 -297 -147 -84 -233 90 147 -270 123 72 1 41 23
3003 23 -159 -174 10 217 21 136 -204 44 -83 207 -136 -64 -84 -58 79 -75 63 -219 101 -181 122 -41
3025 -41 -25 -9 -48 73 93 105 -86 71 -205 214 -112 -134 110 -115 -183 36 210 -249 36 91 251 69 154
$$ packed form
2861B19m00r9M39J5k65K91m31K44j66jJ12k76L11j40O7n3j97K75j2n9P6r6K16
2884G0k45J93j1J39j01J48j07j51M2K8j87J44J22m21L52K11l07j60K40J23k64
2905a42JL30j26J72k95K13k79J62k51MJ91l1NK23k9l1J0J3M2k52J61J62L0m62
2929a79J79n3L1Q8j04p3KM9O6r1J69q1k21J22K21k40J82q2L04l62K09q6J70j29
2953I1k4j8j22Q5k9j72J60L05O6k10k62j15K93Om9KJ69m67L02N5l26K01J3l4K85
2978B05k77O3m7Q5p1l1L00j33j11qJ23Lm7l51J50O3j49L23N7m17L93n1p1M0j8
3003B3j82j5J84K07j96J15l40K48j27K90l43P2k0K6J37j54J38k82L20k82L03j63
3025d1J6J6l9J21K0J2j91J57k76M19l26k2K44k25o8K19J74m59K85N5J60j82Q5
$$ plain form
3048 154 228 23 -122 -24 240 -29 192 -143 82 -110 122 78 -282 -110 -49 -57 126 28 -33 -109 -6 -180 -88
3071 -88 130 34 140 -79 -82 81 328 35 352 -13 81 -25 51 -94 -98 310 232 118 -101 79 -50 -25 126
3094 126 8 172 -135 15 100 -117 -83 -38 58 -27 67 -32 -127 145 -85 -77 -44 190 -110 142 10 -1 142 17
3118 17 33 106 -209 62 -9 -101 164 220 -114 -6 -58 -199 37 50 100 -135 -161 133 203 -33 116 102 62 -235
3142 -235 -105 16 171 128 -276 -248 88 -184 -6 -43 126 -44 -279 84 223 -4 149 -70 173 297 -151
3163 -151 1 -388 -42 50 263 -61 96 -131 128 238 40 96 119 -40 36 69 11 -10 125 -78 -46 -136 94
3186 94 219 -112 76 115 255 10 34 -30 -163 -47 -112 23 29 -246 -95 -135 82 -8 -37 -67 20 -65 -84 -39 203
3211 203 145 -67 153 81 111 -176 19 65 -115 -170 -109 64 -126 -163 -83 -76 60 -76 -144 -7 -73 73 51 73 -261
$$ packed form
3048A54P4k05j45R8K64k69K21l35K25j92K32m4l60J72O1qJ83r8o1p6J03j74R2
3071h8K18r6J06k19lJ63K47k93L17l65R4j06P6j45mM08p8j14k19J80j29K5J51
3094A26j18J64l07J50Q5k17L4M5R6q5R4r9r5K72k30QL3K34l00K52j32j1J43j25
3118A7J6P3l15K71p1r2K65N6l34J08n2j41K36J3N0k35k6K94P0k36J49j4m0k97
3142b35J30J21J55m3m04K8L36k72J78l7J69j70k35L63J39k27J53k19K43J24m48
3163a51J52l89L46R2K13l24J57k27K59J10j98N6K3j59P6L3n8k1J35k03L2r0K30
3186I4J25l31J88L9J40k45K4o4j33J16o5J35Ok75J51m0K17r0k9l0Q7q5j9M5K42
3211B03n8k12K20p2L0k87J95M6j80n5O1J73j90l7Q0PJ36j36o8J37o6J46k2K2l34
$$ plain form
3236 -261 -86 28 -131 69 377 113 220 4 21 -10 37 28 23 25 173 184 47 -71 -186 73 195 -187 -25
3259 -25 -158 -212 181 -35 135 -331 -19 271 -11 245 -140 132 -150 84 172 -40 -6 129 54 141 -18 -87
3281 -87 52 199 152 43 -23 -25 63 -143 176 -37 -155 46 -5 124 -209 -8 -265 -27 -214 -79 -129 -7 -229
3304 -229 101 12 -205 17 -159 -96 151 198 -152 289 -153 -142 -189 155 -124 -129 56 -170 71 -101 -14 96 -86
3327 -86 -13 -119 306 -31 -215 -54 322 162 25 -179 305 -81 168 49 -22 392 93 239 -66 308 -176
3348 -176 -150 31 80 -150 73 -164 49 106 -319 14 -64 -11 308 38 46 -129 -49 -43 -157 -181 158 -18 -68 173
3372 173 224 -191 -253 -20 187 -87 -37 -211 -37 -168 -35 47 123 208 -222 -24 191 29 -2 -48 104 28 -48
3395 -48 41 -126 -63 -94 -96 -39 -53 50 154 101 296 194 67 244 174 -124 54 145 165 45 -154 -62 -36 71 188
$$ packed form
3236b61J75J14j59K00L08k64J07k16J7l1M7rnKJ48J1j37j18j15K59J22l82J62
3259b5j33n4L93k16J70m66L12K90k82K56l85K72k82K34Q8k12L4J35p5Q7j59o9
3281h7J39J47m7j09o6kQ8k06L19k13j18K01n1J29l33K01k57K38j87J35n0J22k22
3304b29L30q9k17K22j76O3K47M7l50M41m42J1m7L44k79nJ85k26K41j72Q7J10j82
3327h6P3j06M25l37j84J61L76j60j37k04M84l86K49j19p1M14k99J46l05L74m84
3348a76K6J81M9k30K23k37K13N7m25L33p8N3L19k70Qj75Q0Oj14k4L39j76n0K41
3372A73N1m15o2K33K07k74N0j74J74j31J33Q2P6Q5m30J98K15j62l1m6J52p6p6
3395d8Q9j67O3l1kN7j4J03J04n3J95j02j27J77p0k98J78R1K0j20j99R2K6J07J17
$$ plain form
3420 188 -63 -24 27 -354 -30 -106 -113 -62 -9 -44 -104 13 47 -17 -224 -332 -186 5 207 -202 -39 -153 -326 0
3444 0 269 55 -161 -119 -175 195 -69 -55 -60 104 -82 101 130 -97 -119 -222 -41 29 -50 41 242 63 147 114 -97
3469 -97 -184 -115 -130 75 148 -7 60 154 73 147 -30 86 84 38 -223 97 16 -15 57 129 97 -168 -150 -71 112 -62
3495 -62 -57 27 -79 30 -175 39 58 -141 260 56 -41 25 6 1 95 266 -224 -51 73 -118 49 -8 34 41 -94
3520 -94 -356 -94 250 -120 39 -239 -4 -143 -47 -219 257 245 148 5 -169 42 201 81 -65 113 -57
3541 -57 -115 3 -35 194 209 -209 102 -64 -102 -80 -117 -269 -52 172 -11 14 32 -48 247 -87 53 -120 -97 85
3565 85 33 150 15 306 -222 -185 -217 21 -41 122 -14 30 -60 85 212 -24 -156 -116 20 -135 -213 300 136
3588 136 -52 -274 -86 15 -336 -2 -6 -156 12 59 120 166 32 -79 -83 -34 -149 -33 25 -177 -32 69 -50
$$ packed form
3420A88k51L9N1l81L24p6pN1N3l5o0J17L4o4k07j08J46J91K02m09J63j14j73L26
3444@K69k14k16M2n6L70k64J4nJ64j86J83K9k27k2j03J81P0p9R1K01j79Q4l3k11
3469i7q7O9j5K05P3j55O7R4q1P4j77J16km6k61L20q1l1P2P2l2k65J8P9J83j74
3495f2NQ4j06J09k05K14J9j99M01k04r7O6j9nR4J71m90J73J24j91J67n7M2Pj35
3520i4k62K62L44l70J59k78K35j39R6j72M76j2r7j43j74K11J59j20j46J78j70
3541e7n8J18l8K29J5m18L11j66l8K2l7j52K17K24j83K5J8q0K95l34J40j73K3J82
3565H5n2J17j35K91n28L7l2K38o2J63j36M4r0J45J27k36j32M0J36j55p8N13j64
3588A36j88k22J88J01l51L34mj50J68M7O1M6j34j11mM9j15J16N8k02J45J01j19
$$ plain form
3611 -50 -36 57 167 263 -238 52 -57 -69 -82 -151 -143 -273 -9 -101 -18 -301 78 -221 234 -22 156 -209 146 132
3635 132 -170 83 327 24 -37 77 -336 91 -249 -158 -98 -181 18 -127 -84 108 -14 255 -18 -223 -139 -74
3657 -74 190 117 -151 -237 -166 -31 46 11 -24 41 171 -82 -73 -285 253 -108 -103 31 -77 121 -98 -8 -71 155 89
3682 89 84 -124 -142 -224 11 -69 -26 46 202 31 86 183 106 44 -145 -169 -29 141 57 18 25 326 -109 220 -42 -72
3708 -72 46 -146 1 -50 -138 111 -61 -24 201 -97 47 -108 -224 75 121 29 63 95 -12 -91 -119 -194 -33 -72
3732 -72 71 179 -53 -72 8 314 186 -10 -25 8 -245 99 -6 -75 -74 212 -91 -233 -487 -226 -348 -56 153
3755 153 -44 73 -302 2 3 145 120 55 96 45 -51 -2 216 133 9 84 147 7 131 -59 -30 -110 99 59 34
3780 34 10 -257 350 -41 -162 -47 -100 -108 28 10 139 -20 -73 148 -215 -228 210 -217 9 222 69 22 -51
$$ packed form
3611e0J4R3J10R6n01K90j09j2j3o9Qj30K64r2Q3k83L79k99M55k56J78l65L55j4
3635A32l02K53K44l03o1J14m13M27l40R1O0q3J99j45M3J92j22K69k73k05Q4O5
3657g4K64p3k68q6P1J35P7l5l5O5J30k53Rk12N38l61NJ34j08J98k19R0o3K26o6
3682H9nk08j8q2K35q0M3P2J56j71N5R7p7o2j89k4J40J70q4l9PL01m35L29k62l0
3708g2J18j92J47n1q8K49j72L7K25k98J44j55j16K99M6r2L4L2j07p9k8p5J61l9
3732g2J43J08k32j9Q0L06j28j96j5L3k53L44j05o9JK86l03j42k54K61j22K92K09
3755A53j97J17l75L04JJ42k5o5M1n1r6M9K18q3j24P5O3j40J24j90K9q0K09m0k5
3780C4k4k67O07l91j21J15n3qJ36j8J29j59n3K21l63j3M38m27K26K13j53m7p3
$$ plain form
3803 -51 -217 -97 161 -10 -43 204 -87 -142 -38 -117 -25 8 -194 38 -146 112 31 22 42 118 -160 -2 238 -145
3827 -145 1 152 -22 1 -144 197 -54 -1 -7 16 74 378 -166 -30 -142 -32 133 -73 -161 167 187 99 21
3850 21 23 103 46 11 -81 47 83 54 79 119 -162 49 40 -4 34 -61 -33 39 -204 54 215 109 70 87 -56 29 -63
3877 -63 137 -17 -154 65 -56 -122 87 134 173 24 28 80 -108 -123 109 -149 69 183 -63 -369 174 -50 -75
3900 -75 69 57 -137 -14 -186 78 31 78 -163 49 -64 4 -34 -62 -50 15 61 -182 107 -31 219 -93 -32 89
3924 89 -183 -93 -119 243 -124 7 -201 -249 24 -109 -137 215 21 -103 9 -230 45 -8 83 205 -270 10
3946 10 -109 -3 -125 -91 -96 142 211 -41 30 28 105 94 -37 82 64 0 67 -37 107 168 106 37 -133 29 62 5
3972 5 -90 -156 -199 -37 -89 79 228 -278 -84 249 -90 -71 167 -177 -105 -113 113 -70 125 151 -22 -154 -43 91
$$ packed form
3803e1j66J20K58j71l3K47k91n5J04p9R2L3k02K32j84K58q1rK0P6k78J58K40l83
3827a45J46J51j74K3j45L41k51N3oK3N8L04n44J36j12J10J65k06q8L28K0q8p8
3850B1KQ0n7l5r2J28L6k9K5M0k81K11rm4L8r5K8P2k43K58J61j06l9J7j43Q5r2
3877f3K00j54j37K19j21o6K09M7L9j49MN2j88j5K32k58K18J14k46l06N43k24k5
3900g5J44j2j94J23j72K64m7M7k41K12j13O8l8k8J2O5M6k43K89j38K50l12O1J21
3924H9k72R0k6L62l67J31k08m8K73j33k8L52j94j24J12k39K75n3R1J22m75K80
3946A0j19J06j22L4nK38O9k52P1kP7j1j31J19j8o4O7j04J44O1o2o9j70J62L3n7
3972Er5o6m3J62n2J68J49n06J94L33l39J9K38l44P2qK26j83J95K6j73j32J11J34
$$ plain form
3996 91 -17 -96 -63 231 -289 165 184 -152 50 17 -42 10 -187 105 142 -107 65 -8 123 -18 71 42 -66 -173
4020 -173 -99 260 9 11 -60 24 251 -7 -23 11 183 106 -50 175 -86 -7 19 -149 137 -96 -89 -62 1 59 -59
4045 -59 -60 -140 48 216 -14 -144 168 -77 445 22 209 -20 -122 9 -56 -22 127 31 -60 30 6 -62 135 -30
4069 -30 -176 13 -212 -63 -170 34 228 128 -32 56 -124 4 -42 145 57 -30 -23 -325 159 -104 -136 211 -5
4092 -5 -14 -41 -25 78 228 34 -23 75 -180 124 -213 184 -125 315 131 34 9 -65 241 -78 123 -176 89 -1
4116 -1 67 -169 170 112 46 -35 23 77 -33 -98 -161 -55 -33 -77 49 -82 99 -35 -74 110 251 -30 -91 -148 -2
4141 -2 -191 46 348 66 -38 -102 -57 -7 -29 156 112 -140 100 111 24 253 -8 -104 -60 21 116 290 120 -99
4165 -99 -85 -236 117 -127 -19 306 -166 248 0 -240 320 92 274 308 63 -233 130 208 -85 291 129
$$ packed form
3996I1j08p9L3K94n20M54J9l36K02l3n9N2j97K92L7k49J72p3J31j41Q9k9j08j07
4020a73P4L59k51Kp1Q4K27k58j6L4J72p7j56K25k61P9K6j68K86k33PK7O3N8j18
4045e9jq0J88J68k30j30L12k45N22m23J87k29j02J31o5L4J49r6r1R0k4o8J97j65
4069c0j46J89k25J49j07K04J94j00j60Q8j80J28m6J87q8q7Pl02M84k63l2L47k16
4092erk7J6J03J50j94n7R8k55L04l37L97l09M40j84r7k5p4L06l19K01k99K65r0
4116aO8k36L39n8o6q1N8N4j10o5o3J06K2m4J26j31J81j34l9J84J41k81o1n7J46
4141bj89K37L02k82j04o4M5N0k2J85m4k52K40J1q7K29k61r6M4Q1R5J74j70k19
4165i9J4j51L53k44J08L25m72M14k48k40N60k28J82L4k45k96L63P8k93L76j62
$$ plain form
4186 129 -109 -1 -84 -152 -217 -27 58 -165 -327 -23 28 -84 26 6 32 -153 30 83 -72 209 -81 -300 135
4209 135 182 214 377 98 -44 129 -180 -234 -7 29 0 -72 -33 211 -104 7 47 -201 -64 -44 85 -184 -93
4232 -93 122 -236 157 187 72 37 -119 -224 101 104 -179 -50 308 58 19 -66 50 -63 18 345 -81 -181 -82
4255 -82 -75 -128 2 50 -230 -17 -28 -58 -171 -34 0 -302 -22 -45 34 -181 -91 -295 102 62 123 -83 -34 -135 -14
4280 -14 -11 83 59 4 -11 -24 -221 -66 -93 -181 -44 169 66 -152 -31 181 40 -161 261 -41 -37 370 -70 -256
4304 -256 104 -100 148 -25 70 20 327 235 59 105 -160 88 56 -223 -90 -387 -68 238 30 136 -186 -39
4326 -39 274 41 -68 -27 78 -75 -122 48 -63 -37 214 72 59 208 -11 -159 128 -116 23 51 -180 103
4348 103 -184 -72 -15 -189 190 -14 88 7 18 43 52 50 -30 -247 72 210 -213 -13 -98 -66 4 89 -6 -188 -154
$$ packed form
4186A29k38J08q3o8o5J90Q5k23j62L04N1j12J10k0K6j85J83N3j55K81k90k19M35
4209A35M7L2J63k79j42J73l09n4K27L6k9p2L9K44l15J11M0k48J37K0J29k69R1
4232i3K15l58L93L0j15l5j56j05L25Lk83J29L58k50l9q5J16j13Q1L27m26j00R9
4255h2Pn3J30M8k80K13j1l0j13J37L4l02K80k3P9k15R0k04L97m0O1k06M9j01J21
4280a4LR4k4n5j5j3j97J55k7q8J37K13j03k18J21K12j41k01M22l02MM07m40j86
4304b56L60k04K48j73R5n0L07r2j76M6k65K48l2k79J33k97L19L06k08J06l22J47
4326c9L13k33j09M1J05j53m7J70j11K6K51j42j3J49k19j48K87k44J39K8k31K83
4348A03k87J12N7j74L79k04J02q1J1K5Rkq0k17L19J38m23K00q5L2P0Q5r5j82L4
$$ plain form
4373 -154 77 -230 310 -29 14 -295 -185 -134 105 -6 18 58 159 74 112 -8 -60 -25 46 -16 -58 -130 -246 -275
4397 -275 -78 -118 69 -210 111 33 -132 223 -193 110 -191 189 -78 -98 257 152 49 -90 -25 -117 -52 196
4419 196 183 10 -60 92 202 -102 -17 72 -111 108 -42 -139 3 136 52 -40 74 53 -75 -111 -227 -246 50
4442 50 58 362 4 93 -134 -74 -113 14 117 222 -122 109 66 214 -92 126 151 -291 263 -285 60 168 -38
4465 -38 -88 -147 -210 -155 131 7 48 -159 -57 72 -176 -200 124 131 -343 -50 -147 64 -32 -106 -87 -304 122 58 9
4490 9 13 127 -304 -137 -124 -12 -68 -32 216 66 -209 -6 -140 220 107 -19 324 129 103 -108 -31 71 -183
4513 -183 18 153 90 -109 187 -70 86 18 -3 -82 -163 130 131 -111 -24 66 32 -66 -45 -31 -120 -108 66 75 96 -141
4539 -141 78 293 181 284 147 -159 69 -269 -123 -171 184 159 86 -135 240 -75 173 4 -62 126 157 -96
$$ packed form
4373a54K31l07N40l39M3l09J10N1K39j11K4M0J01q5L8j20n2L5P1o2m2p2j16k9
4397b75J97m0J87k79L21p8j65L55m16L03l01L80k67k0L55j05j03j39O5r2O5K48
4419A96j3j73p0J52J10l04Q5Q9j83K19j50r7J42J33q4r2J14k1j28l6j16j9K96
4442E0QL04l58Q9k27O0l9J27J03J05l44K31m3J48l06K18K5m42N54n48L45J08k06
4465c8n0n9o3N5K86j24M1k07J02J29k48k4L24Pm74K93r7K11r6p4J9k17M26o4m9
4490IMJ14m31J67J3J12n6L6K48j50k75K03j34L60j13j26L43j95k6k11P7J02k54
4513a83K01J35o3j99K96k57J56o8k1p9q1K93Jk42Q7R0l4r8K1J4q9J2J74RK1k37
4539a41K19K15j12J03j37l06K28l38J46m8L55k5p3k21L75l15K48j69o6J88L1k53
$$ plain form
4561 -96 -204 6 75 -176 -194 -77 -82 52 163 -147 91 -108 6 -60 -118 61 72 -141 -125 47 46 173 86 126
4585 126 -220 -178 25 -196 117 101 -93 75 140 -377 -154 40 -87 40 109 -72 -232 -62 106 174 73 -74
4607 -74 -180 -79 -111 8 -65 -195 -61 3 69 -74 230 -33 158 -206 -58 26 80 -203 17 27 160 173 -129
4630 -129 21 -99 225 -56 93 60 -224 -34 85 250 118 24 93 182 208 137 57 14 -144 12 -86 -32 376
4653 376 -228 -206 -42 -324 -66 42 -73 -126 162 2 -98 -315 -67 44 82 -6 198 -165 -32 9 -80 -77 362
4676 362 127 199 -154 -290 123 109 -34 -87 -21 -87 -13 -73 38 63 -117 -300 -46 -7 -258 146 -166 -33 223
4699 223 91 154 136 -228 -66 355 -8 -66 140 -145 -117 -145 110 -57 -32 -115 216 -5 -43 28 127 138 25 -215
4723 -215 -12 12 -23 76 85 -245 194 123 -30 -48 -321 262 -20 -96 17 -32 181 122 74 -117 75 -164 289 49
$$ packed form
4561i6j08K10O9k51j8J17nJ34J11l10K38j99J14o6n8J79J1k13J6J72jJ27q7M0
4585A26l46M2K03k21L13j6j94J68O5n17K23J94j27J27O9j81j60J70J68O8j01j47
4607g4j06J01l2J19p3j30J34O4O6j43L04k63J91l64J48Q4N4k83K20J0J33J3l02
4630a29J50j20L24k81J49l3k84J90J19J65j32r4O9Q9K6p1q0m3j58J56r8N4M08
4653C76o04K2J64k82K58J08j15n3K88j60j00k17K48J11L8q8K04l63J33M1q9LM39
4676C62k35P2l53j36M13j4j43n3O6o6P4o0J11K5j80j83K54L9k51M04l12J33K56
4699B23j32O3j8l64J62M21l63n8K06k85K8k8K55j67K5q3L31k21l8P1R9J1j13k40
4723b15K03K4l5R9Rl30M39p1j53j8k73N83k82p6J13m9K13n9m8j91J92k39M53k40
$$ plain form
4747 49 -5 -99 -248 17 341 -143 113 14 88 82 178 -328 78 32 100 185 -71 -147 177 -77 164 64 74 368
4771 368 68 4 -40 57 -68 315 32 -57 -34 20 -49 161 -27 -121 -255 80 191 69 -187 -85 25 189 -180
4794 -180 42 -241 24 33 64 -95 -62 6 -42 39 -71 68 80 102 -2 197 -16 232 14 38 -46 15 -86 -4
4818 -4 -54 1 -75 136 -261 292 95 163 10 -15 -45 -229 149 -148 22 130 -98 -201 -75 -203 -145 70 -264
4841 -264 156 -72 253 -86 -32 -90 269 -1 45 -52 59 222 146 -175 -83 84 -52 59 -99 52 3 165
4863 165 168 8 73 -76 15 -2 157 128 -14 62 -87 -107 37 -62 51 -118 117 40 135 151 223 -50 126 -123
4887 -123 -89 195 38 -213 102 32 -136 -90 58 146 -102 -123 -133 -57 -27 -38 -40 61 117 -165 -49 2 -29 2 310
4912 310 73 193 219 165 -15 -323 153 20 -45 158 -112 80 75 121 226 -206 -90 -209 141 214 15 48 81
$$ packed form
4747D9n4r4j49K65L24m84K56r9P4oR6n06M06m6O8Q5k56p6L24k54K41j00J0K94
4771C68l00o4m4R7j25L83k83q9K3N4o9K10j88r4j34L35J11j22k56J02J10J64l69
4794a80K22k83K65RL1j59L3O8m8Q1j10J39J2K2j04J99k13K48k18K4q4O1j01Q2
4818dn0N5p6K11l97N53j97O8j53k5l0j84L78k97J70J08k28j03J26j28N8K15l34
4841b64M20k28L25l39N4n8L59k70M6r7J11J63p6l21R2J67j36J11j58J51m9J62
4863A65Lj60O5j49R1j7J59k9j42P6j49k0J44r9J13j69K35p7R5J6P2k73J76k49
4887a23L4K84j57k51L15p0j68M6J48Q8k48k1j0P6L0j1kJ01N6k82J16N1l1L1L08
4912C10k37J20K6n4j80l08M76j33o5K03k70J92nM6J05m32J16j19L50P3j99L3L3
$$ plain form
4935 81 190 111 80 14 119 -148 -168 -40 -13 -313 138 221 -66 103 -152 -119 226 14 191 -143 -64 106 102 -115
4959 -115 -108 -75 -169 245 112 54 84 -417 53 -40 264 41 82 8 -99 -234 87 64 146 -102 237 50 -23 98
4983 98 -97 94 33 149 -52 41 -33 146 85 -51 -155 66 -54 -46 96 -77 74 147 -130 146 -65 -66 -131 123
5007 123 -77 8 -107 -29 50 25 -255 312 12 -54 -158 -54 -90 75 12 -31 100 77 225 -107 94 285 69
5030 69 74 -198 107 212 12 93 -78 -263 -68 22 15 76 -169 141 58 103 1 57 27 36 -99 21 89 -20 -300
5055 -300 33 -49 -54 207 27 52 -32 173 51 1 -128 9 -152 -332 -137 103 172 -217 -78 -96 -46 42 -8 134
5079 134 -108 71 73 178 1 119 -159 -68 46 -108 84 234 -134 33 118 -6 -71 239 1 120 -68 44
5101 44 109 95 36 -116 -21 -149 33 149 72 -38 -29 3 81 220 114 -98 -118 233 -156 102 10 26 141 50 -8
$$ packed form
4935H1J09p9l1o6J05k67k0J28K7l00M51Q3k87J69k55L3L45k12J77l34P9J70mk17
4959a15PL3r4M14j33n8L0n01M70r3L04k23M1p4j07j35L21k3Q2k48L39j87p3J21
4983I8j95J91o1J16k01R3p4J79o1j36j04K21j20QJ42j73J51P3k77K76k11jo5K54
5007A23k00Q5j15P8P9k5k80N67l00o6j04J04l6J65o3m3J31k3J48l32K01J91k16
5030F9Nk72L05J05k00Q1j71j85J95R0pO1k45L10q3M5j02N6l0Rj35J20O8j09k80
5055c00L33q2nK61j80K5q4K05j22n0j29J37j61j80J95K40O9l89J39j8N0Q8n0J42
5079A34k42J79KJ05j77J18k78R1J14j54J92J50l68J67Q5j24o5L10k38J19j88J12
5101D4O5j4n9j52R5j28J82J16p7j10RL2P8J39j06k12k0L51l89K58r2J6J15r1n8
$$ plain form
5126 -8 147 -73 175 14 15 94 -206 -32 -47 46 -40 73 -256 -128 -157 -49 3 -183 -202 48 206 -57 65 -122
5150 -122 -88 51 51 0 113 111 -9 -76 -36 -195 216 101 -82 80 108 -138 -37 -170 109 104 145 -95 -180 148
5174 148 241 -97 -190 27 -253 109 355 -58 -198 111 19 -17 -66 83 124 -31 109 -98 -194 101 -24 -36 -183
5197 -183 104 142 -38 5 -76 -219 33 62 -152 43 -36 -36 -94 59 159 -136 58 4 -161 -118 -10 -7 234 -115
5221 -115 122 53 140 59 31 91 -183 -97 36 -60 -271 213 -144 -17 32 70 166 -44 -68 225 54 -103 -160 -89
5245 -89 112 -63 61 211 -64 63 -149 95 -32 210 78 -119 71 80 66 74 2 49 61 105 -212 280 26
5268 26 -333 205 -177 121 -34 -85 40 44 -25 12 68 105 -18 22 -174 -29 -138 -188 -131 45 211 68 122 62
5292 62 230 -73 -266 -232 -86 102 -74 -229 -169 160 23 70 14 -80 -101 -243 -42 305 -60 -67 96 -177 -40
$$ packed form
5126hJ55k20K48j61JP9l00J74j5R3q6J13l29J28k9J08N2j86j9K50J58k63J22j87
5150a22L4J39%n1J13kj20o7M0j59M11j15j83J62K8k46J01j33K79nM1k40q5L28
5174A48R3l38r3K17k80L62K46m13j40L09r2l6m9J49M1j55J40k07r6K95j25j2j47
5197a83K87L8j80M3q1j43K52K9k14J95p9%n8J53J00k95J94n4j65M3J08LK41l49
5221a15K37o9Q7q1k8O0k74Q6J33r6k11M84l57J27M9L8R6k10k4K93j71j57n7P1
5245h9K01j75J24J50k75J27k12K44j27K42j32j97J90Rj4Qp2M7J2M4l17M92k54
5268B6l59N38l82K98j55n1J25Mo9L7N6L7j23M0j96J45j09n0N7J76J66j43N4o0
5292F2J68l03j93L4J46J88j76j55O0L29j37M7n6r4k1j42K01L47l65pJ63k73J37
$$ plain form
5315 -40 -2 1 -54 159 -12 -255 233 100 -188 103 195 -23 -67 -13 -135 -70 100 40 -50 187 277 20 80 -153
5339 -153 135 244 76 26 -75 78 -169 20 9 -16 -24 94 -48 -154 236 217 -168 -36 203 -43 259 -31
5361 -31 226 -213 63 -42 -223 96 65 209 100 24 -48 44 -110 -61 -22 196 106 201 -73 15 -10 136 -22 -63
5385 -63 85 169 -130 22 93 -53 32 141 9 282 16 -67 140 -77 96 173 -99 -221 312 285 -11 -167
5407 -167 2 -113 -74 -1 53 89 71 -223 299 -268 177 32 181 -88 45 11 -106 86 11 90 -121 -18 14
5430 14 79 123 43 135 321 -10 -3 -254 113 253 142 -73 -11 -11 -10 -63 59 55 -110 -2 107 32 58 -106 -262 -68
5456 -68 39 -55 -27 49 -219 106 -102 5 45 176 -73 -79 -142 92 -61 -124 -169 -188 -115 -169 94 116 161 193 -186
5481 -186 105 260 42 145 294 163 97 215 5 56 -70 27 -208 -79 57 -56 -115 -142 107 -182 -83 17
$$ packed form
5315d0L8Ln5K13j71k43M88j33k88K91R2k18m4N4j22O5J70o0r0K37R0k57O0k33
5339a53K88J09j68n0j01J53k47J89j1k5qJ18j42j06L90j9l85J32K39k46L02k90
5361c1K57m39K76j05j81L19l1J44j09p6p2R2j54M9L9K18r0R5k74Q8k5J46j58m1
5385f3J48Q4k99J52P1j46Q5J09j32K73k66q3K07k17J73P7k72j22N33k7k96j56
5407a67J69j15L9P3N4L6j8k94N22n67M45j45J49k69J33l4j17J92p5P9k11J03L2
5430A4O5M4q0R2J86l31Pk51L67J40j11k15O2%Jn3J22mj65J08J09p5K6j64j56J94
5456f8J07r4K8P6k68L25k08J07M0J31k49oo3K34j53o3m5j9P3n4K63K2M5L2l79
5481a86K91J55k18J03J49j31o6J18k10N1j26R7k35J29J36j13n9k7K49k89R9J00
$$ plain form
5503 17 -130 190 -280 -207 -11 -252 -37 60 29 38 19 -7 21 397 299 -55 38 158 -146 -196 7 222 -5 -24
5527 -24 83 48 -138 -159 122 -199 74 -94 -78 -20 -7 112 -44 26 86 159 163 164 19 279 180 -191 109 -210 -6
5552 -6 142 -123 242 85 -311 107 -100 -24 -28 -84 -199 148 94 7 41 -147 -84 -148 -79 -128 159 -128 75 -94
5576 -94 -59 26 85 -156 9 202 43 48 -147 31 -52 89 256 163 -26 -51 -46 -27 105 -161 -101 201 -62 -117 196
5601 196 156 212 -65 143 -158 103 -155 38 9 208 -255 174 -221 277 -234 -68 -60 -155 -46 -157 -16 -44
5623 -44 6 207 259 -71 0 166 206 -30 -86 110 162 58 -26 -82 191 65 142 -111 87 73 -131 39 46 -158
5647 -158 -50 4 51 -137 -25 -65 197 132 62 -60 47 31 -39 8 59 10 95 -12 -86 -7 -143 -224 -78 387 -157
5672 -157 -146 -206 243 -14 208 32 -136 138 89 81 -149 130 -148 65 129 -69 66 51 94 69 -204 -13 -20 42
$$ packed form
5503A7j47L20m70P3J96k41K15R7l1Rj9k6K8L76r8l54R3J20l04n0K03K15k27j9
5527b4J07l5j86k1K81l21K73j68J6N8J3J19j56P0O0P3MJj45K60r9l71L00l19K04
5552fJ48k65L65j57l96M18k07P6mn6j15L47n4q7L4j88O3o4O9m9K87k87K03j69
5576i4L5Q5N9k41J65J93j59Nj95J78q3J41J67r3j89k5NJ9J32k66O0L02k63n5L13
5601A96m0N6k77K08l01K61k58J93k9J99m63M29l95M98n11J66Qr5J09j11J41k8
5623d4N0K01N2l30P1J66M0k36n6J96N2j04q4n6K73j26P7k53J98j4k04J70Pk04
5647a58J08N4M7j88J12m0K62o5p0j22J07j6p0M7N1m9Q5j07p4P9j36q1J46M65n44
5672a57J1o0M49k57K22j76j68K74m9qk30K79k78K13O4j98J35j5M3k5k73J91pO2
$$ plain form
5696 42 73 167 -74 35 1 -146 98 200 102 -41 -137 -82 -116 -88 -8 -11 177 8 46 163 -4 -131 18 2 31
5721 31 -40 158 45 -95 223 -104 -250 -241 26 -80 60 -32 -147 -25 -135 -41 -177 -18 198 -49 206 -10
5743 -10 48 -12 307 103 -70 -36 230 -60 -4 -73 34 -20 87 -29 -83 -209 -102 -111 -60 185 -99 -36 79 -107
5767 -107 140 -194 -72 114 28 -17 5 110 116 -138 27 182 135 8 8 52 281 135 3 239 157 285 327 336
5791 336 -46 -153 -232 6 -115 -48 -81 -3 24 60 -47 86 149 11 -38 4 41 32 -40 55 153 -102 100 -371 6
5816 6 37 -63 115 67 -192 -184 -54 -20 71 166 -98 -57 -119 -203 -124 315 -24 115 -61 95 -37 -287 -2 55 -23
5841 -23 124 -121 186 -97 104 87 -92 81 144 -87 -62 113 -55 42 106 137 -93 -14 -150 1 -324 36 -142
5864 -142 -39 -27 -30 65 106 268 9 -61 -80 79 -48 248 -149 57 -6 -85 -147 35 -95 81 -104 -111 -24 112
$$ packed form
5696D2L1R4k41J09l4j47K44J02r8j43r6N5l4K8Q0lJ88j69L8J17j67j27J49j6K9
5721C1p1J98j13j40L18l27j46RK67j06J40r2j15J22j10R4j36J59K16k47K55k16
5743a0N8o0L19k04j73L4K66k90N6o9J07n4J07j16n4j26J07rN1K45k84O3J15j86
5767a07K47l34J22J86q6m5K2J05Ok54J65J55m7j27%M4K29j46j32K36q2J28M2R
5791C36l82j07p9K38j21O7l3P8K7L6j07J33O3j38m9M2L7rp2R5R8k55K02m71L77
5816FL1j00J78m8k59QJ30L4R1R5k64M1o2q4P9M39l39J39j76J56j32k50K85N7p8
5841b3J47k45L07k83K01j7j79J73O3k31K5J75j68R7O4L1k30P9j36J51l25L60j78
5864a42J03J2lR5M1J62k59p0j9J59j27K96l97K06o3p9o2J82j30J76j85pQ7J36
$$ plain form
5888 112 -105 -18 -72 -206 367 88 -179 -131 105 90 22 119 -270 52 -165 240 230 -404 133 134 -53 293 -165
5911 -165 -208 -127 -110 137 -21 12 -112 -232 -133 -63 107 -90 73 6 -3 134 -28 101 79 -156 -132 167 -85 -70
5935 -70 127 -93 108 354 -175 69 126 -24 183 -111 -141 45 108 -48 80 -43 139 5 164 -47 164
5956 164 52 -86 -239 -254 -146 47 64 -239 -136 39 44 -32 144 86 -70 -195 31 23 104 138 144 -136 59 44
5980 44 -97 -21 -27 -101 24 -173 100 59 -117 192 21 39 -23 -126 -90 -76 -119 267 113 7 243 24 163 -59
6004 -59 179 -57 2 29 -5 128 -53 -9 -236 -67 105 -110 -8 -89 -12 -73 -26 53 76 256 -197 54 -61 -53
6028 -53 7 120 -22 -71 5 -294 216 5 247 186 -76 153 60 -173 -64 -70 60 123 39 -74 1 -1 -250 59
6052 59 -225 1 113 -168 160 -60 219 -87 -158 -65 -101 73 78 -115 100 68 101 -57 -89 115 37 193 4
$$ packed form
5888A12k17Q7n4j34N73k79k67M8K36j5o8R7l89L22k17M05j0o34N37Jj87L46m58
5911a65m3Q1J7K47j58L3j24j20R9P0J70j97J63o7rJ37j62J29k2k35K4K99k52J5
5935g0J97k20K01K46n29K44N7j50K07k94l0J86O3j56J28j23J82j34J59k11K11
5956A64j12j38j53j5J08J93J7l03J03J75Np6J76n8j56j25K26qQ1L4Ok80J95j5
5980D4j41P6op4J25j97K73m1j76L09j71J8o2j03L6J4m3L86j54j06K36k19J39k22
6004e9K38k36N9K7l4J33j81M4k27J69J72k15J02q1P7o1M7P9K3J80m53K51j15Q
6028e3O0J13j42m9P6k99N10k11K42o1k62K29r3k33J09oJ30O3q4j13P5kk49L09
6052E9k84K26J12k81L28k20K79l06p1R3l6J74Nj93K15l2L3j58l2K04p8J56j89
$$ plain form
6075 4 65 -128 199 -27 84 -46 -6 -19 2 -26 27 -287 -156 -320 152 230 -173 -72 -185 -327 -104 150 271
6098 271 103 177 138 -204 -48 33 -39 154 83 77 59 55 213 -151 -84 -47 40 -13 -85 113 -114 -35 315 -65 114
6123 114 -41 -146 186 72 53 157 2 -86 -141 -24 60 -123 46 105 36 -287 -233 16 -105 25 -326 48
6145 48 22 -22 272 114 33 -111 -42 43 73 140 21 -114 -177 43 -6 -66 -150 -88 -9 -102 -178 -128 54 53 -160 229
6171 229 130 -300 90 78 148 -117 -113 -59 63 142 306 267 -288 -1 -56 230 -45 74 37 -121 54 -22 -75 -54
6195 -54 58 -164 259 213 186 -74 -6 8 151 366 -115 -1 157 -193 -65 -442 -49 -60 -189 149 -121 207
6217 207 -130 193 95 -30 -13 -165 36 157 306 4 -34 121 -181 218 160 38 189 -95 73 17 138 -173
6239 -173 39 241 340 -7 4 12 -96 -72 259 -174 -18 -40 80 -204 -17 116 -35 -173 288 -48 74 -138
$$ packed form
6075DO1j93L27k26J11j30M0j3K1k8N3l14J31j64M72P8m03J01j13j42K23K54J21
6098B71j68P4l9l42J56Q1p2J93p1oj8mJ58l64O7L7Q7n3p2J98k27P9L50l80J79
6123A14j55j05L32j14j9J04j55q8n5J17Q4j83J69N9o9l23N4K49j21J30l51L74
6145D8k6m4K94j58q1j44O9Q5L0O7j19j35o3K20m9o0q4O2P9r3p6N0J82jk13L89
6171B29r9m30L90j2P0k65MN4J22P9J64l9n55K87n5K86k75J19l7j58J75p6n3K1
6195e4J12k22M23m6k7k60O8J4J43K15m81J14J58l50J28l77L93j1j29L38k70L28
6217B07l37L23r8j25J7j52K01J21J49l02l8J55l02L99n8j22J51k84J68n6J21l11
6239a73K12K02R9l47J1Qj08K4L31m33J56k2J20k84J87J33j51j38M61l36J22k12
$$ plain form
6261 -138 -5 173 -19 -202 -257 256 175 6 170 -71 -91 78 105 286 141 216 104 -90 -81 44 -32 -46 -74
6284 -74 -127 36 61 71 -33 -229 283 -94 53 140 -58 182 -101 112 182 -15 50 68 -82 -65 -16 26 -43 -149
6308 -149 -266 42 235 183 87 -42 -205 -265 -145 31 -158 76 -196 -6 284 -92 -79 -121 128 -10 -121 16
$$ packed form
6261a38J33J78j92j83n5N13q1j69J64k41k0J69K7J81j45P5j12j94RJ25p6j4k8
6284g4n3J63K5J0j04j96N12l77J47Q7j98K40k83K13P0j97O5J8j50J7M9M2o9j06
6308a49j17L08J93n2r6j29j63o0J20J76j89K34k72J90K90l76J3m2K49j38j11J37
$$ [...]
8191a16
##END NTUPLES=NMR FID
##END=
