##TITLE=1H_SR141_oil
 DMSO-d6
 8 sc, 
 19.09.2022
##JCAMPDX= 6.0         $$ Bruker NMR JCAMP-DX V2.0
##DATA TYPE= NMR FID
##DATA CLASS= NTUPLES
##ORIGIN= UXNMR, Bruker Analytische Messtechnik GmbH
##OWNER= root
$$ XWIN-NMR		Version 3.5
$$ Mon Sep 19 15:49:08 2022 Russian Standard Time (UT+4h)  she@DPX200
##.OBSERVE FREQUENCY= 200.1313499994
##.OBSERVE NUCLEUS= ^1H
##.DELAY= (6, 6)
##.ACQUISITION MODE= SIMULTANEOUS
##.ACQUISITION SCHEME= undefined
##.AVERAGES= 8
##.DIGITISER RES= 18
##SPECTROMETER/DATA SYSTEM= spect
##.PULSE SEQUENCE= zg30
##.SOLVENT NAME= DMSO
##.SHIFT REFERENCE= (INTERNAL, DMSO, 0, 15.7039)
##AUDIT TRAIL= $$ (NUMBER, WHEN, WHO, WHERE, WHAT)
$$ ##TITLE= Audit trail, XWIN-NMR		Version 3.5
$$ ##JCAMPDX= 5.01
$$ ##ORIGIN= Bruker BioSpin GmbH
$$ ##OWNER= she
$$ F:/spectra/data/she/nmr/H-F/1/audita.txt
$$ ##AUDIT TRAIL=  $$ (NUMBER, WHEN, WHO, WHERE, WHAT)
(   1,<2022-09-19 15:47:51.14 +0400>,<she>,<DPX200>,
      <created by zg, POWCHK disabled, PULCHK disabled
       configuration hash MD5:
       00 E9 B6 7A A2 85 ED C7 34 08 36 98 17 FE 4E 26
       data hash MD5: 16K
       F8 E4 0C DF 78 DD 50 4C FA 22 F3 49 74 E1 8E 1D>)
$$ ##END=
$$ 
$$ hash MD5
$$ DB 98 4C 58 77 AA D0 8B 05 5F 0F 65 5B 92 43 D0
##$RELAX= 
##$RELAX= 
##$RELAX= 
##$RELAX= 
##$RELAX= 
##$RELAX= 
$$ Bruker specific parameters
$$ --------------------------
##$DU= <F:/spectra>
##$EXPNO= 1
##$NAME= <H-F>
##$PROCNO= 1
##$TYPE= <nmr>
##$USER= <she>
##$AMP= (0..31)
100 100 100 100 100 100 100 100 100 100 100 100 100 100 100 100 100 100 
100 100 100 100 100 100 100 100 100 100 100 100 100 100 
##$AQSEQ= 0
##$AQ_mod= 1
##$AUNM= <au_zg>
##$AUTOPOS= <>
##$BF1= 200.13
##$BF2= 200.13
##$BF3= 200.13
##$BF4= 200.13
##$BF5= 200.13
##$BF6= 200.13
##$BF7= 200.13
##$BF8= 200.13
##$BYTORDA= 1
##$CFDGTYP= 0
##$CFRGTYP= 5
##$CHEMSTR= <none>
##$CNST= (0..31)
1 1 145 1 1 1 1 1 1 1 1 1 1 1 1 1 1 1 1 1 1 1 1 1 1 1 1 1 1 1 1 1 
##$CPDPRG= <>
##$CPDPRG1= <>
##$CPDPRG2= <>
##$CPDPRG3= <>
##$CPDPRG4= <mlev>
##$CPDPRG5= <mlev>
##$CPDPRG6= <mlev>
##$CPDPRG7= <mlev>
##$CPDPRG8= <mlev>
##$CPDPRGB= <>
##$CPDPRGT= <>
##$D= (0..31)
0 1.2 0 0 0 0 0 0 0 0.06 0 0.03 0 0 0 0 0.0002 0 0 0 0 0 0 0 0 0 0 0 0 
0 0 0 
##$DATE= 1663588070
##$DBL= (0..7)
120 120 120 120 120 120 120 120 
##$DBP= (0..7)
150 150 150 150 150 150 150 150 
##$DBP07= 0
##$DBPNAM0= <>
##$DBPNAM1= <>
##$DBPNAM2= <>
##$DBPNAM3= <>
##$DBPNAM4= <>
##$DBPNAM5= <>
##$DBPNAM6= <>
##$DBPNAM7= <>
##$DBPOAL= (0..7)
0.5 0.5 0.5 0.5 0.5 0.5 0.5 0.5 
##$DBPOFFS= (0..7)
0 0 0 0 0 0 0 0 
##$DE= 6
##$DECBNUC= <off>
##$DECIM= 32
##$DECNUC= <off>
##$DECSTAT= 4
##$DIGMOD= 1
##$DIGTYP= 9
##$DL= (0..7)
0 120 120 120 120 120 120 120 
##$DP= (0..7)
150 150 150 150 150 150 150 150 
##$DP07= 0
##$DPNAME0= <>
##$DPNAME1= <>
##$DPNAME2= <>
##$DPNAME3= <>
##$DPNAME4= <>
##$DPNAME5= <>
##$DPNAME6= <>
##$DPNAME7= <>
##$DPOAL= (0..7)
0.5 0.5 0.5 0.5 0.5 0.5 0.5 0.5 
##$DPOFFS= (0..7)
0 0 0 0 0 0 0 0 
##$DQDMODE= 0
##$DR= 18
##$DS= 0
##$DSLIST= <SSSSSSSSSSSSSSS>
$$ [...]
##$SUBNAM2= <"">
##$SUBNAM3= <"">
##$SUBNAM4= <"">
##$SUBNAM5= <"">
##$SUBNAM6= <"">
##$SUBNAM7= <"">
##$SUBNAM8= <"">
##$SUBNAM9= <"">
##$SW= 18.0517283424941
##$SWIBOX= (0..15)
0 0 2 0 0 0 0 0 0 0 0 0 0 0 0 0 
##$SW_h= 3612.71676300578
##$TD= 16384
##$TD0= 1
##$TE= 0
##$TE2= 300
##$TE3= 300
##$TEG= 300
##$TL= (0..7)
0 120 120 120 120 120 120 120 
##$TP= (0..7)
150 150 150 150 150 150 150 150 
##$TP07= 0
##$TPNAME0= <>
##$TPNAME1= <>
##$TPNAME2= <>
##$TPNAME3= <>
##$TPNAME4= <>
##$TPNAME5= <>
##$TPNAME6= <>
##$TPNAME7= <>
##$TPOAL= (0..7)
0.5 0.5 0.5 0.5 0.5 0.5 0.5 0.5 
##$TPOFFS= (0..7)
0 0 0 0 0 0 0 0 
##$TUNHIN= 0
##$TUNHOUT= 0
##$TUNXOUT= 0
##$USERA1= <user>
##$USERA2= <user>
##$USERA3= <user>
##$USERA4= <user>
##$USERA5= <user>
##$V9= 5
##$VALIST= <valist>
##$VCLIST= <CCCCCCCCCCCCCCC>
##$VD= 0
##$VDLIST= <DDDDDDDDDDDDDDD>
##$VPLIST= <PPPPPPPPPPPPPPP>
##$VTLIST= <TTTTTTTTTTTTTTT>
##$WBST= 1024
##$WBSW= 4
##$XGAIN= (0..3)
0 0 0 0 
##$XL= 0
##$YL= 0
##$YMAX_a= 259963
##$YMIN_a= -513100
##$ZGOPTNS= <>
##$ZL1= 120
##$ZL2= 120
##$ZL3= 120
##$ZL4= 120
##$ABSF1= 10
##$ABSF2= 0
##$ABSG= 5
##$ABSL= 3
##$ALPHA= 0
##$AQORDER= 0
##$ASSFAC= 0
##$ASSFACI= 0
##$ASSFACX= 0
##$ASSWID= 0
##$AUNMP= <proc_1d>
##$AZFE= 0.1
##$AZFW= 0.1
##$BCFW= 1
##$BC_mod= 2
##$BYTORDP= 1
##$COROFFS= 0
##$CY= 11.3945322036743
##$DATMOD= 1
##$DC= 2
##$DFILT= <>
##$DTYPP= 0
##$F1P= 2.36226072786647
##$F2P= -0.459571619588291
##$FCOR= 0.5
##$FTSIZE= 0
##$FT_mod= 4
##$GAMMA= 1
##$GB= 0.15
##$INTBC= 1
##$INTSCL= 1
##$ISEN= 128
##$LB= 0.24
##$LEV0= 0
##$LPBIN= 0
##$MAXI= 10000
##$MC2= 0
##$MEAN= 0
##$ME_mod= 0
##$MI= 1.114404
##$NCOEF= 0
##$NC_proc= 0
##$NLEV= 6
##$NOISF1= 3.799351
##$NOISF2= 2.8
##$NSP= 1
##$NTH_PI= 0
##$NZP= 0
##$OFFSET= 15.70392
##$PC= 1
##$PHC0= -18042.89
##$PHC1= 22.00069
##$PH_mod= 1
##$PKNL= yes
##$PPARMOD= 0
##$PSCAL= 0
##$PSIGN= 0
##$REVERSE= no
##$SF= 200.130013532006
##$SI= 16384
##$SIGF1= 3
##$SIGF2= 2
##$SINO= 400
##$SIOLD= 16384
##$SREGLST= <1H.CDCl3>
##$SSB= 0
##$STSI= 0
##$STSR= 0
##$SW_p= 3612.71676300578
##$SYMM= 0
##$S_DEV= 0
##$TDeff= 0
##$TDoff= 0
##$TI= <>
##$TILT= no
##$TM1= 0
##$TM2= 0
##$TOPLEV= 0
##$USERP1= <user>
##$USERP2= <user>
##$USERP3= <user>
##$USERP4= <user>
##$USERP5= <user>
##$WDW= 1
##$XDIM= 8192
##$YMAX_p= 0
##$YMIN_p= 0
$$ End of Bruker specific parameters
$$ ---------------------------------
##NTUPLES= NMR FID
##VAR_NAME=  TIME,          FID/REAL,        FID/IMAG
##SYMBOL=    X,             R,               I
##VAR_TYPE=  INDEPENDENT,   DEPENDENT,       DEPENDENT
##VAR_FORM=  AFFN,          ASDF,            ASDF
##VAR_DIM=   8192,          8192,            8192
##UNITS=     SECONDS,       ARBITRARY UNITS, ARBITRARY UNITS
##FACTOR=    0.0002768,     1,               1
##FIRST=     0,             0,               0
##LAST=      2.2672688,     0,               0
##MIN=       0,             -513100,         0
##MAX=       2.2672688,     259963,          0
$$ Real data points
##PAGE= N=1
##DATA TABLE= (X++(R..R)), XYDATA
0@%%%%%%%%%Qj6J6k2L0l2M0n6P0q4J02j20J44j68J98k38K75l18L71m30M94n66
31c02O44p32Q33r42J061j194J341j502J676j869K080k310K560k832L130l456L814
48B000m204M634n105N622o196O834p544Q342r246J0277j1468J2860j4512J6511
62H805j8992K2167k6390L2323m1337N6847r0890L01977j38770k78881M16815j51072
74I2602j56985K10312O4839k37872N0558K2033j04461O3388O7445j90255j8049
85a36445L5447j48766P4867K85529j34015j90129K01815N1980k54968J02665K73287
96A61267j18422j41099J67806J2027j23538J27585J18888j20150o0589J969m8009
107b2265O3717P0008j15492j4429J15785j29373j49120J82998P4004j90744L2897
$$ plain form
0 0 0 0 0 0 0 0 0 0 0 8 -8 8 -14 16 -16 24 -32 38 -46 56 -64 80 -88 110 -128 147 -171 200 -230 264 -302
31 -302 342 -390 443 -499 562 -632 709 -793 883 -986 1094 -1216 1344 -1488 1642 -1814 2000
48 2000 -2204 2430 -2675 2947 -3249 3585 -3959 4383 -4863 5414 -6054 6806 -7706 8805
62 8805 -10187 11980 -14410 17913 -23424 33423 -57467 244510 105740 -173141 243674 92602
74 92602 -64383 145929 210768 -27104 23454 45487 -58974 4414 71859 -118396 -136445
85 -136445 -100998 -249764 -174897 110632 -23383 -213512 -11697 40283 -214685 -112020 161267
96 161267 42845 -98254 69552 81579 -41959 85626 204514 84364 23775 25744 -22265
107 -22265 41452 111460 -4032 -18461 97324 -32049 -181169 1829 75833 -114911 -82014
118h2014J12113j52490j2332K16497l2167j37968R2440M2171j06353L3476Q2971
129E6344k1613K4062J353j04650L2630J01258q7462m3314J15353n3063j34349
140a13451R6918R2052j09803j7318J02189n4413r3240O8687N7319l1431J5319
151A2828J6085l4762J3941K7279k7017J4243L6932n1653k9486O1037j4955n6073
163c1601P1122L2966j23219k7010R8013k1557o8684M7754K8527m6433K734J9286
175a8102j0505K8111J3844m4469J5966M7494l7000o781P3414j1923o2962L6179
187B3266K9525n2063L611M9990k6385l9738J6149J464j8671O192l119j5726Q627
200a6878n215j8695K7835J9544m0991m846M6192j5642l9488M4585M8006l4140
$$ plain form
118 -82014 30099 -122391 -134723 81774 49607 -88361 4079 46250 -60103 -26627 56344
129 56344 34731 58793 60146 -44504 -11874 89384 1922 -41392 73961 20898 -113451
140 -113451 -16533 75519 -34284 -51602 50587 -3826 -97066 -28379 28940 -2491 12828
151 12828 28913 -5849 8092 35371 8354 22597 59529 7876 -21610 39427 24472 -31601
163 -31601 39521 72487 -50732 -77742 20271 -1286 -69970 -22216 6311 -40122 -37388 -18102
175 -18102 -28607 -496 13348 -31121 -15155 32339 -4661 -11442 61972 50049 -12913 23266
187 23266 52791 728 4339 54329 27944 -11794 4355 5819 -12852 -6660 -9779 -25505 -16878
200 -16878 -22093 -40788 -12953 6591 -34400 -39246 6946 -8696 -48184 -3599 44407 10267
212A0267k2890L5611R442k5103L79J3976J91r486j0762R946K0084j7839k5202
225a1386K0357L589m6938j287M6554j4741l8320L3194K8180m0949j4100M1994
237F147O078l5535j904L3253R626k0616P89L3165L515m0367l337M3110r210m8857
251b4143K0152M6115l0944m0472L3581K4534m3972k1908L7050O747l8538L525
263b8273M2838l614l8572R139L6575j7654l6000K8685L9236k7977k5583M3836
275B2636K6202m8484k3266M7553R752n5893m159N6392l09n1464R272M6155k5293
288I094n3083K3048L9382l4858l2299M5515L3778m1516j9051M7497P231n2988
300b8250l91N1013o055m2540K3823N2135k2340m4717K7149L2781m2856l7480M0758
$$ plain form
212 10267 -12623 22988 32430 7327 7706 21682 21873 12387 1625 11571 31655 13816 -11386
225 -11386 8971 12560 -34378 -35665 10889 -3852 -42172 -8978 19202 -21747 -35847 6147
237 6147 12225 -23310 -25214 8039 17665 -2951 -2162 31003 34518 -5849 -9186 33924 24714 -24143
251 -24143 -3991 42124 11180 -29292 4289 28823 -15149 -37057 -7 6740 -31798 -28273
263 -28273 14565 10951 -27621 -18482 18093 439 -35561 -6876 32360 4383 -21200 22636
275 22636 48838 354 -22912 24641 34393 -21500 -25659 30733 30424 -21040 -11768 34387 9094
288 9094 -43989 -20941 18441 -16417 -48716 -3201 30577 -10939 -29990 17507 24738 -28250
300 -28250 -28641 22372 16317 -26223 -2400 49735 27395 -17322 9827 42608 -248 -37728 3030
313C030K8645m5273j7638N3760J1039n6881q222M5657r539m9817J3618M8329j3119
326C589l2590K9931L3498l1633k7917L3749J8119l9970q909M8135P970m1672M912
339b788M0240j6469m5014J5259L3905k7604l2965L2996K9095l4888k4085L4154
351A836J3600m0913j0004M0681M809l4033Q999M0155p851l3964J4148L1117k0567
364H013k6477K6949K3775k7698j4757L2900O469m0428o646L2720o689l5862Q883
377a8848L3110j0905k9197J3933K5963j8583k6442J8041K3944j7134j5938K7712
389E656K1372k4121j2853K6623O952k7546j590K6651m748k4264J0224K0587j4981
402G962k0049Q875Q291j4659j1259J2004J1423j0149j0864J2029J1274j5731r170
$$ plain form
313 3030 31675 -13598 -31236 22524 33563 -23318 -31540 14117 4578 -45239 -31621 16708 3589
326 3589 -29001 930 34428 2795 -25122 8627 26746 -13224 -22133 26002 33972 -7700 -2788
339 -2788 37452 20983 -24031 -8772 25133 -2471 -35436 -2440 26655 -8233 -32318 1836
351 1836 15436 -25477 -35481 5200 10009 -24024 -15025 25130 17279 -16685 -2537 28580 8013
364 8013 -18464 8485 32260 4562 -10195 22705 29174 -11254 -17900 14820 8131 -27731 -18848
377 -18848 14262 3357 -25840 -11907 14056 -4527 -30969 -12928 11016 -6118 -22056 5656
389 5656 27028 2907 -9946 16677 23629 -3917 -5507 21144 16396 -7868 2356 22943 7962
402 7962 -12087 -3212 5079 -9580 -20839 -8835 2588 -7561 -18425 -6396 4878 -10853 -20023
415b0023K2951R279k1861Q3K5314j024j6855P184J1727j0066r319P336P841j022
429A1545o117l668M000k910j3769J698J3320r201j5060J2994J1152j5165j586
442a2767J9910o526k1370Q188J6078m180n61J1699M218m169o028k585J0290K484
456A4681k0026j857K1680j0944k0765K6978J8284l6433j3997K4665q814k1177
468b7725K0776J8469j5515p518Q133N275M372n655o824J3669j387k6184J6157
481c957L9096k1203k7589L2440O006m8003M679M4771j4957l2361J8045J2242k1269
494a2060l430J7639O185r650j9919k054K7889L596k4297K1055K8389m3818k5715
507c6190N6202J3906m9671J4442L9646l7365k8264M2045J4365l1305m968Q865
$$ plain form
415 -20023 2928 12207 -9654 -9571 15743 14719 -2136 5048 16775 6709 -2610 4726 12567 11545
429 11545 5428 1760 5760 2850 -10919 -9221 4099 -5102 -20162 -7168 3984 -11181 -12767
442 -12767 7143 617 -20753 -12565 3513 -667 -1228 10471 14689 10520 4492 1907 12197 14681
456 14681 -5345 -7202 14478 3534 -17231 9747 28031 -8402 -22399 2266 -6548 -27725
468 -27725 -6949 11520 -3995 -11513 -3380 1895 6267 612 -6212 7457 6070 -20114 -3957
481 -3957 35139 13936 -13653 18787 24793 -23210 -18531 26240 11283 -21078 -3033 9209 -12060
494 -12060 -15490 2149 8334 -1316 -21235 -23289 4600 8196 -16101 4954 33343 -10475 -36190
507 -36190 20012 33918 -15753 -1311 38335 970 -27294 14751 29116 -2189 -7157 1708
519A708o633n215k762J1314K4734k0357l9510K6199K5641m3342L12O2207j8593
532A5703n9264L5579M4335l6559j1335L9056j1310l8788R710K6829N363m518r636
545E165k60O325k1289j2262L8539P510n2167K589M7178k5519l2542N2035K1097
558C6399o2220j1791M6022p003k3011K8734J8545k3375j3983N923J4203J1506
570A9949j5500j2404K2528n376l6740K7165M5356l9678l5235M0808J323m9621
582c7425K3105M8195l0276l1700K5201Q156j9528P461J6835j386j0880j4062N919
595a0385K9344k747k6188J7200J5595m1214q941N3027J802m3936J4610K5130l5255
608a1958j4224L8366L893k9325N99J0273m722K352O188M254O411j6282k2823K2433
$$ plain form
519 1708 -4925 -10140 -12902 -1588 23146 2789 -36721 -10522 15119 -28223 -27911 34296 15703
532 15703 -43561 -7982 36353 -206 -11541 27515 16205 -22583 -12873 13956 19319 14801 5165
545 5165 4905 11230 -10059 -22321 16218 23728 -28439 -25850 21328 -4191 -36733 15302 36399
558 36399 -25821 -37612 8410 1407 -21604 7130 25675 2300 -11683 -5760 8443 19949
570 19949 4449 -7955 14573 9197 -27543 -378 44978 5300 -29935 10873 12196 -37425
582 -37425 -14320 33875 3599 -28101 -2900 5256 -14272 -6811 10024 8638 -2242 -16304 -10385
595 -10385 18959 16212 -9976 7224 22819 -18395 -27336 25691 27493 -16443 -1833 23297 -11958
608 -11958 -26182 12184 16077 -13248 -12649 -2376 -7098 -4746 1442 5696 12107 -4175 -26998 -4565
622d565K3514k5229k454L6479j6023l8373K9163L0015l1358j1977K3299j1243
634A248k0485J7595J4244o139j642q407j0208J0532J292j1809J5185J0816k8469
647a6247l225L2788n566k1337K1574Q374l2315k22K8067k581p912J1768m385j2351
661c570M626o17k531J3590m159k0833J0098J4029j7370k96K1275j4901k3901J6897
675g663J1656j4133P106J5567j2215r743Q174o34j98Q125m818l675J1489m240
689D798j0902J8318Q485k7094n229K0949r386j5123K0976J1203k0684n395J1085
702B001l384n678K184O8K076J52p484Q883J6030j2326j3152J8216K006k5780P354
717h834K7749j1136j8317J6995J0621j8555o488J4551K417j4118p025R777R864
$$ plain form
622 -4565 18949 -6280 -8734 27745 11722 -26651 2512 32527 1169 -10808 12491 1248
634 1248 -19237 -1642 12602 6463 4821 -3586 -13794 -3262 -1970 -13779 1406 12222 -16247
647 -16247 -19472 13316 7750 -13587 7987 16361 -15954 -16176 11891 9310 1398 13166 8781 -3570
661 -3570 1056 439 -2092 11498 7339 -13494 -3396 10633 -6737 -7033 14242 -659 -24560 -7663
675 -7663 3993 -10140 -3034 12533 318 -9425 -1251 -1885 -2083 6042 1224 -2451 9038 4798
689 4798 -6104 12214 20699 -6395 -11624 9325 -61 -15184 5792 16995 -3689 -9084 2001
702 2001 -1383 -7061 -4877 -4809 -2733 -2581 -10065 -1182 14848 2522 -10630 7586 9592 -16188 -8834
717 -8834 18915 7779 -10538 6457 17078 -1477 -7965 6586 9003 -5115 -12140 -2363 7501
730G501r369q937J5195O594k3112n589K5615l50k4096R842K3591j4539j7262K0052
744E136J2592k0191p523J8071L530j6231j600J7306J932j9237l284J8509j340
757G670k2722N230K3897j1596k2495J6753J8069k1153j2786K1903O815k0884m70
770a1769K2580P06j8529L334J8422o245j9443Q633J9184j2171j7298J7612J5361
783B0377k1876j2924K1601N022k6754l438K5384m61k3425O470K3333r245k1796
796a7732J1560J8981j5245j5369J9877J5233j8664q903K2148N745k4100k752K3042
809A3821j964k3671O463K2925j0435k1683J2421J6954j7621j6501J7597J2279
821A0585j8650q779K1064O093k1398k403K1809q65j9859N994K0868p184j6480
$$ plain form
730 7501 -1868 -10805 4390 10984 -12128 -17717 7898 7548 -16548 -6706 16885 2346 -14916 5136
744 5136 17728 -2463 -9986 8085 11615 -4616 -6216 11090 13022 -6215 -9499 9010 7670
757 7670 -15052 -9822 14075 2479 -20016 -3263 14806 -6347 -19133 2770 9585 -11299 -11769
770 -11769 10811 11517 -7012 -3678 14744 8499 -10944 -2311 16873 4702 -12596 5016 20377
783 20377 -1499 -14423 7178 12200 -14554 -17992 7392 6931 -16494 -10024 13309 4064 -17732
796 -17732 -6172 12809 -2436 -17805 2072 17305 -1359 -10262 11886 17631 -6469 -9221 13821
809 13821 11857 -11814 -5351 17574 7139 -14544 -2123 14831 -2790 -19291 -1694 10585
821 10585 -8065 -16844 4220 10313 -11085 -13488 8321 7456 -12403 -6409 14459 7275 -9205
834i205J1661J4671j4536j2927J5038R633j7118p318J8218M125j9723k326J7399
847G592l441j9127M932J7520o973j4239J1081J3896j1578j1674J2482Q794j3726
860d461n497J6493M921j4086N58J4599l022j4830K401J0657n771j1066O816J0900
874H612p246r359Q146O532j2195p792J1568M795j1159O2J3491L58j0402K333R233
889F977l572q132L963P323k726n292N388O339n878p924L876M137p728m540Q906
904A117L057r567q84R362k151r264K678N614l464l516M808O447M83l734R3M524
920E603k001q103L834J0012n780p698R470N040j0879j824P753m085j0261J765
934g154O259Q3k184P10L876j66q936j606J1469M7j2166N553J3922p915q296J4705
$$ plain form
834 -9205 2456 17127 2591 -10336 4702 14335 -2783 -10101 8117 12242 -7481 -9807 7592
847 7592 4151 -14976 -10044 7476 503 -13736 -2655 11241 -337 -12011 471 9265 -4461
860 -4461 -9958 6535 11456 -2630 -2072 12527 9505 -5325 -2924 7733 1962 -9104 -2288 8612
874 8612 1366 -7993 153 6685 -5510 -13302 -1734 3061 -8098 -8036 5455 5813 -4589 -2256 6977
889 6977 3405 -4727 -764 6559 3833 -1459 3929 10268 4390 -3534 342 4479 -3249 -7789 1117
904 1117 4174 -5393 -6277 3085 934 -8330 -5652 -38 -3502 -7018 -2210 4237 4720 986 1079 5603
920 5603 3602 -4501 -667 9345 3565 -4133 5337 10377 -502 -2326 5427 1342 -8919 -7154
934 -7154 -895 -812 -2996 -2286 1590 1424 -7512 -9118 2351 2398 -9768 -4215 9707 1792 -6504 8201
950H201O709j5857n052J1472p21q675L597Q881j553r080k873P681J922j1358j566
965h272J2531m564j6277J0889J8188j2654j2124J5700L553j8114K557J8690k167
978G936j2450L289P900k010o296K001R430k252j5399J418J6782n645j5052J3012
992B664R302k1923p791K2881K607j7819N796J2877j1388j0758J2356J0166p092
1005A878p885M603P263m607o178J1249J0720j7201j3526J7400P107j9267L129
1018e315K2236j1374k2770J3128J6306j4889q715J4354J378j5764m56J5709O510
1031A0338r815o917Q328L201j4269N39K3030j000k4740N051K1605j2016j4318
1044a0983J9838P899k6113o662K0455K349j2369L994R194o895j2314J929J3711
$$ plain form
950 8201 14910 -947 -5999 5473 4752 -3923 -326 8555 7002 -2078 -4951 2730 4652 -6706 -8272
965 -8272 4259 -305 -16582 -5693 12495 -159 -12283 3417 6970 -11144 -8587 10103 7936
978 7936 -4514 -1225 6675 4665 -1631 370 9800 7548 -7851 -6433 10349 4704 -10348 2664
992 2664 11966 -9957 -17748 5133 7740 -10079 -4283 8594 -2794 -13552 -1196 8970 1878
1005 1878 -6007 -1404 5859 1252 -4926 6323 17043 -158 -13684 3716 10823 -8444 -5315
1018 -5315 16921 5547 -17223 -4095 12211 -2678 -11393 2961 4339 -11425 -11881 3828 10338
1031 10338 523 -6394 1934 5135 -9134 -8595 14435 13435 -11305 -6254 15351 3335 -10983
1044 -10983 8855 16754 -9359 -16021 4434 6783 -5586 -1592 7602 707 -11607 -9678 4033
1057D033L487j3253k026J4362n400j5830J5626J9188j9243j5528J8818M756j8089
1070i099P567K0057j1108j7772O714P960m633j851M680K401o165r418M786J4658
1084H777m961j3936Q504P238j7664j439K5976R2k0760O091J1185j3887m334J7637
1098H519K474j2204k059L377J581K258j513M89L372j0187j1031J4308J0278j4162
1112d500p61J5347j0912j6138J5517J2041j3939k771J0181n274o162Q295O069
1125F993k22k556p755j667Q561j379m580J0882J518j8214N24J6169n694r866J0461
1140C175J421j4617K156J1632k276k729L235m113l330L470j721K800J0409n495
1154D017j1130Q569N361j1338L570J2965j0166j1747J0381N267o543L737L102
$$ plain form
1057 4033 7520 -5733 -7759 6603 1203 -14627 999 20187 944 -14584 4234 8990 -9099
1070 -9099 -1532 18525 7417 -10355 -3641 4319 -314 -2165 2515 4916 -1249 -10667 -5881 8777
1084 8777 3816 -10120 -1616 5622 -12042 -13481 12495 12587 -8173 -2082 9103 -4784 -9118 8519
1098 8519 10993 -1211 -3270 107 1688 3946 2433 2922 6294 -3893 -14924 -616 9662 -4500
1112 -4500 -5261 10086 -826 -16964 -1447 10594 -3345 -6116 4065 -1209 -7371 924 6993
1125 6993 6771 4215 -3540 -5207 3354 1975 -2605 8277 9795 -8419 -7895 8274 2580 -7286 3175
1140 3175 4596 -10021 -7865 3767 1491 -1238 1997 -2116 -5446 -1976 -3697 -897 9512 4017
1154 4017 -7113 1456 6817 -4521 -951 12014 1848 -9899 482 5749 -794 2943 6045
1167F045q145k661J163j546N199L974q135OR168o259o915J2636K929j4959J020
1182f480J2078n650m974J1327L794r104l127K115L91M91j359p13M967k114q718
1197g076O414J0329j0688q728J0994J268j3393N198J4251o574r037Q023M121p622
1211b520p35N722J863l535m251L663P018m415p497Q790M857j4380l072J5488j771
1226E225j4324O362J0308j0034p613J0717M969r141k871P290K589o654j633Q632
1240C822K629j0167j839J2115Pj2300M265J2920q197j2336J0135R103j2758o379
1254h980J2872K827j2691n07J1864q44j1721P53J0227k434j0366M574J2235m873
1268B936j0966Q185J0309j1394q123J3053N111j3809j305J5024o32j3488K387
$$ plain form
1167 6045 -2100 -4761 -3598 -5144 55 4029 -4106 -4100 5068 -1191 -8106 4530 7459 -7500 -6480
1182 -6480 5598 -52 -5026 6301 10095 991 -2136 -21 370 861 -498 -1211 3756 1642 -7076
1197 -7076 -662 9667 -1021 -9749 1245 2513 -10880 -5682 8569 1995 -7042 981 5102 -2520
1211 -2520 -3255 2467 4330 795 -3456 207 7225 2810 -4687 4103 8960 -5420 -8492 6996 5225
1226 5225 -9099 -2737 7571 -2463 -10076 641 5610 -3531 -6402 888 3477 -3177 -4810 3822
1240 3822 6451 -3716 -5555 6560 6567 -5733 -1468 11452 3255 -9081 1054 10157 -2601 -8980
1254 -8980 3892 6719 -5972 -6479 5385 4541 -7180 -6427 3800 1366 -9000 -4426 7809 2936
1268 2936 -8030 155 10464 -930 -9053 4000 9111 -4698 -6003 9021 8389 -5099 -2712
1281b712J1279n466j1841N178J0314o407r522Q412Q758r779p520J0677M879j2248
1295e998k597J3010J278j1349K300J1997m295j0945N659R562q010p443Q972O568
1309H709r199m948R602K366j1083k087J0238k35j0046K032J0247l347r488M801
1323b438Q018p115o664Q342N707p759k441R239J655q927p98Q350j217q899K780
1338b167Q757l533p978N153O713p160o886O796M474p932l167Q493K532p952m42
1353d299P645m38p785J521P075j777o094L697O525l704n487M734M255o121l987
1368d240O013K897o564j450O405K4o443J01M915j194m685R89M614m73m042J323
1384a810M600j857m779K838M461l339k521M964K042m513r34L479l69l441K18K436
$$ plain form
1281 -2712 8567 3101 -8740 -3562 6752 345 -9177 -765 7993 -1786 -9306 1371 6250 -5998
1295 -5998 -8595 4415 5693 -5656 -3356 8641 4346 -6599 -940 8622 612 -6831 2141 8709
1309 8709 -490 -5438 4164 6530 -4553 -6640 3598 3363 -6683 -4651 5596 2249 -7239 -2438
1323 -2438 5580 -1535 -8199 143 5850 -1909 -4350 4889 6544 -2383 -3181 5169 3952 -4947 -2167
1338 -2167 6590 3057 -4921 232 6945 -215 -7101 -305 4169 -3763 -6930 1563 4095 -3857 -4299
1353 -4299 3346 2908 -4877 -3356 3719 1942 -4152 -455 6070 2366 -3121 1613 5868 -253 -4240
1368 -4240 1773 4670 -1894 -3344 3061 3085 -3358 -3257 1658 464 -4221 -3232 1382 909 -3133 -1810
1384 -1810 2790 933 -3846 -1008 3453 114 -2407 2557 4599 86 -848 2631 2262 -1179 -961 1475
1400A475J71k448l85K835L38m592j251M308p65m813L091N422l405l418M433J930
1416B926m760p53L892J28k269J21K711J876k148k188K445J164n729j111O799n25
1432B579o980L011O187n721m411O476J861p076p87N408M09k793M79L759Q66m474
1448a207k289N645K413p136M0Q644l022q873O243P631q752n092Q483N47q473K063
1464c135P444k250n743N92L802k1l943L53O763r39q887K702J0570n390q549Q936
1480B305N290j2064j803J3205o91j0296L355O194n941m915M881M424k840n060
1494c956J038N752j754o613N473P248j0240p724J2512M952j2103K136J3058o974
1508B805j1593Q654P695p715l273N905L73m808r73M989M491n083p330M654N544
$$ plain form
1400 1475 1646 -802 -1187 1648 1986 -2606 -3857 451 -314 -5127 -2036 3386 -19 -3437 996 2926
1416 2926 -1834 -2587 1305 1433 -836 -715 1996 3872 1724 -464 1981 3145 -2584 -3695 3104 2579
1432 2579 -4401 -1390 4797 -924 -5335 1141 3002 -4074 -4861 547 956 -1837 -1358 2401 3267 -1207
1448 -1207 -3496 2149 4562 -2574 -2534 6110 3088 -5785 458 8089 -663 -5755 2728 3275 -5198 -3135
1464 -3135 4309 2059 -3684 -3092 710 689 -3254 -2901 3862 2923 -5964 -3262 7308 1918 -6631 2305
1480 2305 7595 -4469 -6272 6933 6242 -4054 -699 5495 -446 -5361 -480 3944 1104 -3956
1494 -3956 -2918 2834 1080 -5533 -60 7188 -3052 -10776 1736 6688 -5415 -3279 9779 2805
1508 2805 -8788 -134 7561 -154 -3427 2478 2851 -1957 -2930 2059 6550 1467 -5863 -1209 4335
1523D335r168j978J4144j178j5525M752J2003q232o905J1737K393j2092j44R386
1537C528M19m154N71J850n48m376j800Q038M086r628k459R773l944j0437R749
1552F68R460j2983o267J1741K2q868O183P768p527o002K945K855J184l92r48L231
1568C070m82q176L001J1152n319r934Q555L756j2558J857J4123m035j0489N181
1582b98K896p557P33O505L92k665k753q66M535K193n199K236N387q853o010J2463
1598C139M881j0360J527P915p755o345R058L291o126J9J604k689N60J556o67K900
1614B508L9q115J089P664l977l308Q886o25j1069L132Q659m341k280N921k479
1629A704n588L362K482q83K171k001m778L070K188m570L244N548o891n015P016
$$ plain form
1523 4335 -4833 -6811 7333 6155 -9370 -4618 7385 -847 -7752 3985 6378 -5714 -5858 3528
1537 3528 3947 -207 364 2214 1666 -2710 -4510 3528 7614 -2014 -4473 5300 1356 -9081 668
1552 668 10128 -2855 -9122 2619 2641 -6227 -44 7724 197 -5805 -2860 -5 1179 787 -161 3070
1568 3070 2588 -5588 -2587 8565 3246 -6688 1867 5623 -6935 -5078 9045 5010 -5479 -298
1582 -298 2598 -4959 -4226 2279 2671 6 -2747 -3613 922 3115 -2084 152 5539 -3314 -9324 3139
1598 3139 8020 -2340 -813 7102 -653 -6998 2060 5351 -775 -756 848 -1841 -1281 275 -392 2508
1614 2508 2547 -5568 -4479 3185 -792 -4100 4786 4161 -6908 -3776 4883 542 -1738 4183 1704
1629 1704 -3884 -522 1960 1077 3248 1247 -3531 -461 1727 -2843 401 5949 -942 -5957 1059
1644A059K39n817M165M462n934k322M958p0r49K361j483k251J618j591m86O137
1660D096O53p048J749M608n848j993P840p99q150K489N066l434j042M073n61l307
1676a608r77j82K647K267l331k92N177k951n647O117N163p701k789P484r32o698
1692d253M074N727m012m741K598K196k238j433J804K762k513m637L165N466m324
1707c59m448O168K760q267l60R565j026p950K992N737m993l959N410L215m057
1722D28l030L173K712l517k848L970K404o266k303P590J135p378J703P045m471
1737C47o737N738N377o024k966O821J719n972p43N999M23o211o95N504K57o053
1753c216J460O788k712p252L729N881n893m755O728L097p344p96P815m66o762
$$ plain form
1644 1059 1298 -4519 -354 4108 -1826 -4148 810 740 -209 2152 669 -1582 36 -1555 -2041 4096
1660 4096 4749 -2299 -550 4058 -1790 -3783 4057 3258 -4892 -2403 2663 -771 -1813 2260 1699 -1608
1676 -1608 -2585 -2767 -120 2147 -1184 -1476 3701 750 -4897 1220 6383 -1318 -4107 3377 2445 -4253
1692 -4253 -179 5548 1536 -3205 -607 1589 -649 -2082 -278 2484 -29 -4666 -1501 3965 -359
1707 -359 -4807 1361 4121 -4146 -4506 5059 4033 -3917 -925 4812 -181 -4140 1270 4485 428
1722 428 -2602 571 3283 -234 -3082 888 3292 -2974 -5277 2313 3448 -3930 -2227 4818 347
1737 347 -6390 -652 4725 -1299 -4265 2556 4275 -1697 -2440 3559 3982 -2229 -2924 2580 2837 -3216
1753 -3216 -1756 5032 2320 -4932 -1203 4678 -1215 -5970 758 3855 -3489 -4285 3530 3064 -3698
1768c698J589N702k269n417K630N827k768m987L787N000m987n019N840L674p013
1783b109k446P453Q85p180Q68O297k496o188K958N063l310l635M075L538m353
1798e80k915M719K469n724j318O426N15o240Q61O423k273o192K585N194m022m032
1814d104M219L743m570k957M706J719m702j550M548P20m456N01M961r55m314K113
1830c78M076l212l432L280K957l768j957M242J653m579j154L965K62m363n4M148
1846A686m84l943J321L433j242l402J479L166k268k151K612J977k439q55K436
1861A326O11k547l99K413j36k234J51K501n06k620O09K278j616k262J807K142
1877A518j936j542K128J327k398j149K098P81j481n12J905R32j656o38J913K88
$$ plain form
1768 -3698 -2109 3593 1324 -4093 -1463 4364 1596 -3391 396 5396 409 -4610 1230 4904 -2109
1783 -2109 -4555 2898 3783 -3397 -2529 3768 1272 -4916 -1958 3105 -205 -3840 235 3773 -580
1798 -580 -3495 1224 3693 -2031 -3349 3077 3592 -2648 -1787 4636 2363 -3829 -1244 3950 -72 -4104
1814 -4104 115 3858 -712 -3669 1037 2756 -1946 -3496 1052 1772 -2684 -2183 2778 1823 -2491 -378
1830 -378 3698 486 -2946 334 3291 -477 -2434 1808 3461 -1118 -2272 1693 1955 -2408 -2462 1686
1846 1686 1202 -2741 -1420 2013 771 -2631 -1152 2014 -254 -2405 207 2184 -255 -1110 1326
1861 1326 1937 -610 -1009 1404 1268 -966 -815 1686 1180 -1440 -831 1447 -169 -2431 -624 1518
1877 1518 -418 -1960 168 1495 -903 -2052 46 827 -654 -1166 739 1671 15 -623 1290 1578
1893A578k510j57K501m74k158J187K202j951j982J929Q38k381p93K177P37j750
1909a007m11K182R05k327j253K861N54l442J92M640p46m152J961L376k913k851
1925b431K950J618l160j113K739J195k080j303K072J376l583j457M268J017m660
1940b552N64M958j895n024L684M409m408k949M587J565m129j51L768L2l464j092
1956b097L031J280l403q12M366j36n837J512N739l324n002N028K787n956o83O611
1972C104m72m853J223L064k051k176J757K963m90l951N16M481j507n038L662M509
1988D741o491l839P594J977p050J250O313m112n412M095L885l228j773K286J194
2003A430j505j892K037L980l153n193M678L577o211q72Q624j681q950L284O379
$$ plain form
1893 1578 -932 -1089 1412 938 -1220 -33 2169 218 -1764 165 1003 -1378 -2171 6 743 -1007
1909 -1007 -1418 764 1669 -658 -1911 950 1504 -1938 -1746 2894 2148 -2004 -43 3333 420 -2431
1925 -2431 519 2137 -1023 -2136 603 1798 -282 -1585 487 1863 -1720 -3177 1091 2108 -2552
1940 -2552 -1988 2970 1075 -3949 -265 4144 -264 -3213 1374 2939 -1190 -1341 2427 2459 -1005 -2097
1956 -2097 934 2214 -1189 -2001 2365 2229 -3608 -2096 3643 319 -4683 345 3132 -2824 -3507 3104
1972 3104 2632 -2221 -998 2066 15 -2161 -404 2559 2069 -1882 -1366 3115 1608 -3430 232 4741
1988 4741 -1750 -5589 2005 3982 -3068 -1818 4495 383 -5029 -934 2951 -277 -2050 236 1430
2003 1430 -75 -1967 70 4050 897 -4296 382 3959 -2252 -3124 5500 3819 -5131 -1847 4532
2018D532n258l042O033P26n751j92L600J208j491j673P45J971l184k320O590K573
2034E067p537o60P086l076n932O654M232p621j702N974q89l712K586K301k657
2049A14j995l39J652K614j943k180L799j60o534K611P344m130n395N640J798o649
2065c753K310O333l044l940K186L21j580J565Q17q5M82k821j710M686N29n001
2081b705K414L830n934k584P395Q32n838K106L064m385j246M361N01j466J38j342
2097h59Q5K105r49q75L174j079n295K591M367l520j444M544j991n013K991L265
2113B097k539j18J861j908j016J470j96O08J826k828j791L477M45l053L016K693
2129D044n339j929M624l34k516K286J389l030p90J655o2M38L48k155j23J495j456
$$ plain form
2018 4532 -726 -3768 2265 2991 -2760 -2952 648 1856 365 -1308 -563 1408 -1776 -4096 2494 5067
2034 5067 -2470 -3130 3956 880 -5052 1602 5834 -1787 -3489 2485 1596 -2116 470 2771 114
2049 114 -1881 -2220 -568 2046 103 -2077 1722 1562 -4972 -2361 4983 853 -4542 1098 2896 -3753
2065 -3753 -1443 4890 1846 -2094 92 413 -1167 398 1215 1130 1612 -1209 -2919 1767 2296 -2705
2081 -2705 -291 3539 -2395 -4979 2416 3248 -2590 -484 2580 -1805 -3051 1310 1811 345 483 -859
2097 -859 -774 1331 382 -493 2681 1602 -3693 -1102 3265 -255 -1699 2845 854 -4159 -1168 2097
2113 2097 -442 -560 1301 -607 -1623 -153 -349 259 2085 -743 -2534 943 1388 -1665 1351 4044
2129 4044 -1295 -3224 1400 1066 -1450 836 2225 -805 -1595 60 -2 436 784 -1371 -1494 1 -1455
2146a455nM190p67m311J787K514l227p48M722o66m092R67K750r45m79O54l7q93
2164d1j429m37K534J617l253n97L268j377m004L643L341m309k049M116K9l296
2180b244K162K866k061k220J047J238n2o63K36J521q39l427J351L964k209l476
2196b806L521J778n210j49N429q36m394J623K610k440j306K631J460j660j694
2211a443J025J802q76k237K507K316l927k069M931P70m878J074M199l051m036
2226c893L866K724l507j356K896O70k769o25K677J179l054j204L499P55l682K51
2242a573M828j541m812K303M055l395k623M240J291m267n29L782k1l274j04K852
2258A212l98k961N90L479o36l901J501L711k545l043L487K416l737j351L879M45
$$ plain form
2146 -1455 -1460 2730 1963 -2348 -561 1953 -1274 -2022 2700 2034 -2058 -1091 1659 714 235 889 852 -41
2164 -41 -1470 -1907 627 2244 -1009 -1606 1662 285 -3719 -76 3265 -1044 -3093 1023 1052 -2244
2180 -2244 -82 2784 723 -1497 -450 788 736 73 309 1830 991 -2436 -1085 2879 670 -2806
2196 -2806 715 2493 -2717 -2866 2563 1727 -2667 -1044 1566 -874 -2180 451 1911 251 -1443
2211 -1443 -418 1384 508 -1729 778 3094 -833 -2902 2029 2799 -2079 -1005 3194 143 -3893
2226 -3893 -27 2697 -810 -2166 730 1400 -1369 -1994 683 1862 -1192 -2396 1103 1858 -1824 -1573
2242 -1573 3255 1714 -3098 -795 3260 -135 -2758 1482 2773 -1494 -2023 1759 1738 -1536 -1640 1212
2258 1212 814 -2147 -1557 1922 1286 -2615 -1114 2597 52 -2991 496 2912 -825 -2176 1703 2148
2274B148l675K54L270q14k967J020K580p99k741J333K363k058k352K297K030k876
2290i87j336L526O10l366K20L062r05k842J254K645j370k138J853J917j997j708
2306a562K261J032k519r36K464N75k284j04K466n90k515P82K165j315j780J529
2322c31J831j939j093J926J052j949p80K031O35k173k46K302k1k248M11J839o67
2339E80j708O96J676j083j404R93J268j427r09J173R57j331m68J473J37j220o1
2356f58J314j4j177J05J216k82j316P78J063o48j000P81P70j076r12P32J202r66
2374h8p08Q88O80j199o86J130N30j210k59J630p2j174L72J048m92j209N88J047
2392H16p41p26Q41J053j150q59J050P47j449r23J553O79j940n4K174k27j952M81
$$ plain form
2274 2148 -1527 -1273 1997 1183 -1784 -764 1816 1017 -1724 -391 1972 -86 -2438 -141 1889 -987
2290 -987 -2323 1203 1813 -1553 -1333 1729 824 -2018 -764 1881 511 -1627 226 2143 146 -1562
2306 -1562 699 1731 -788 -1724 740 1315 -969 -1073 1393 803 -1712 -930 1235 -80 -1860 -331
2322 -331 1500 -439 -1532 394 1446 -503 -1283 748 1383 -790 -1036 1266 1245 -1003 -592 1247 580
2339 580 -1128 -432 1244 161 -1243 -250 1018 -409 -1318 -145 812 -519 -987 486 623 -597 -658
2356 -658 656 642 -535 -430 786 504 -812 -34 1029 381 -619 162 932 -144 -1056 -324 878 -88
2374 -88 -796 92 772 -427 -1113 17 547 -663 -922 708 636 -538 -166 882 390 -819 -231 816
2392 816 75 -651 190 1243 93 -766 284 1031 -418 -1341 212 891 -1049 -1103 1071 844 -1108 -627
2410f27J662q74j504J152J293j260r71J265J003r27j076J250J000j947q01K337
2426I75N00k689J33K809j155k538J617K188k151j463J978R91j788o85J769N63
2442A054j595q79K069P57k156k20K583l08k974J009K812j615k469K621J154k874
2458a031o22K809J74k575K57J674k42j573K10K080o4k551P1L188j082k860K145
2475HK595l269j615L754P64l489L78K805j448k158J271J727r41j341L99J261l73
2492C28j936J155K574k250k667K949K056l493n31M062q97l910J932K592j942j269
2508a247J949N01j566n13R16J142n80j874R18J873k069j523L324Q76l939n2L657
2525A793j922k329L157J532l099o29K365l13j157P15L80j43o08q46J444J690j949
$$ plain form
2410 -627 1035 161 -1343 -191 1102 -158 -1129 136 1139 212 -864 386 1386 -561 -1362 975
2426 975 1475 -1214 -1081 1728 573 -1965 -348 1840 -311 -1774 204 1195 -593 -1278 491 1054
2442 1054 -541 -1420 649 1406 -750 -970 1613 1305 -1669 -660 2152 537 -1932 689 1843 -1031
2458 -1031 -1653 1156 1330 -1245 -988 686 444 -1129 -919 1161 1097 -1454 -1383 1805 723 -2137 8
2475 8 2603 -666 -2281 1473 2237 -1252 -874 1931 483 -1675 -404 1323 382 -959 -560 701 328
2492 328 -1608 -453 2121 -129 -2796 153 2209 -1284 -1815 2247 1350 -2560 -628 1964 22 -1247
2508 -1247 702 1203 -363 -876 40 1182 602 -1272 -354 1519 -550 -2073 1251 2127 -1812 -1864 1793
2525 1793 -129 -2458 699 2231 -868 -1497 868 555 -602 113 493 350 -258 -1104 340 2030 81
2542H1j177K342l50l354J988K964k600k023K897L56k809J097K350j767j224O81
2558e48L58J07L96l94N31N52k057l08K857Q9k833J227J765k812p43L522k48k398
2576i37P70Q06j520N1J514l64k21k61r63L81J591j116m01J841o95k475J418K435
2594A854j917o86K304j011k229J442J679j132J14K58j579J45J057n57K05J291
2610A238j753j201K057L53j716J214J456k631q77K528k06r82J214L30j825L37
2626d64P41k71O98K77j679lJ538j174k68K271p30k848J203J772k010m9K470p45
2644G29k099Q88Q31o09M36L41q27K47l14n27J502J139k069o57K211q76k092K490
2662G44J521k879p51K253m81j659J345R55j241n35J75K97Q90n53o38J110K86k391
$$ plain form
2542 81 -1096 1246 896 -2458 -470 2494 -106 -2129 768 1124 -1685 -588 1762 -5 -1229 -548
2558 -548 -190 -83 313 -81 450 1002 -1055 -1363 1494 1583 -1250 -23 1742 -1070 -1813 1709 1461 -937
2576 -937 -167 639 -881 -830 684 320 99 -162 -1125 -744 847 -269 -670 1171 476 -1999 -581 1854
2594 1854 -63 -749 1555 544 -1685 -243 1436 304 418 676 -903 -758 299 -258 -53 1238
2610 1238 -515 -1716 341 694 -1022 192 1648 -983 -1860 668 462 -520 694 1024 -801 -464
2626 -464 277 6 704 981 -698 -701 837 -337 -605 1666 936 -1912 -709 1063 -947 -996 1474 729
2644 729 -1370 -482 349 -260 176 517 -310 -63 -377 -904 598 1737 -332 -989 1222 346 -1746 744
2662 744 2265 -614 -1365 888 407 -1252 93 1048 -193 -728 -553 -256 634 81 -557 553 839 -1552
2680a552O25K903j560k174K349R88l059M59L008j232k044J211N71p77l72Q24M75
2697F43l07r90k97J666l81j786J327J834k193j255K911J42k636Q22K038j590j561
2714a613K018R22j393l42Q12K77q53o04Q93J133j536j205J863P49k115p0K370
2731A306q40k333J386J918j673j114J868L48j532j24J427K57j117n11J404J14
2747G84j381l1J825k40k108O58J786j507j188J817R61j918o76J811J19j527P5
2764g40J528m29j218M42J267k54j232L72J325j056j047J202J078j447o64J692
2780H19Q7j682L13J402o64j419Q58J153p37r75N97R71r45o99Q92Q88j321m09J353
2799D82M50j307k13J341r3j364L01J353o93j042P05P30n82o58O20N34p99m18P69
$$ plain form
2680 -1552 -927 1976 416 -1758 591 1579 -1480 -1021 1987 755 -1289 -78 493 -284 -656 168 643
2697 643 336 -654 -951 715 334 -1452 -125 1709 -484 -1739 1172 1314 -1322 -500 1538 -52 -1613
2714 -1613 405 1327 -66 -408 404 681 -172 -776 117 1250 -286 -1491 372 1121 -994 -1064 1306
2731 1306 466 -1867 -481 1437 -236 -1350 518 866 -666 -790 637 894 -223 -734 670 784
2747 784 -597 -628 1197 957 -1151 -493 1293 -214 -1402 415 1376 -542 -1218 593 712 -815 -740
2764 -740 788 359 -859 -417 850 596 -636 -264 1061 5 -1042 160 1238 -209 -873 819
2780 819 906 -776 -463 939 275 -1144 -286 867 130 -845 -248 723 -222 -921 -29 859 -462 -871 482
2799 482 932 -375 -588 753 660 -704 -403 950 257 -785 -80 650 68 -590 30 564 -235 -653 116
2818A16N06r95l28J085N4p33j99Q39j04r54M68Q40l71o78N09N50n63l64N86L18
2838E82o87j95N28J46n29j92M72J76q27K09M97P5o96J51O28j65o29L15M32k23
2858F8l14K42M47m07o5J77L67m41m21M61K75p65K46M00J12q34L11N51m43n80N29
2879h4N19n24l92M77N75n57m11K93P23p79l72R99K37j232J64J067k24j097L77
2898b41R25n59q09M67Q73o69o22M30P80o04o98Q29M86p58o23J455q6j062j17J367
2918G64m65j132P26R17p32o02N55N71n68p26P65N76r78l87J050K14r86k63J390
2937F89k98j417O04J365r01r37J071N55j029m18J053K61j041k6P32K06r02o0J205
2956G12j73j407L83J377o88j383J482N29j298n81J687J05j621M45J056o41o84
$$ plain form
2818 116 622 -373 -701 384 438 -295 -494 345 241 -713 -245 595 224 -454 55 605 42 -322 264 582
2838 582 -105 -300 228 374 -155 -347 125 301 -526 -317 180 255 -441 -290 338 173 -456 -141 291 68
2858 68 -246 -4 443 36 -29 148 515 74 -347 114 389 -376 -130 270 382 -452 -141 410 -33 -613 -84
2879 -84 435 -89 -481 -4 571 14 -397 -104 619 -160 -532 467 704 -528 -364 703 479 -618 -241
2898 -241 684 125 -684 -217 656 -13 -635 -205 575 -29 -727 102 588 -170 -793 662 576 -486 -603 764
2918 764 299 -833 -107 810 78 -524 31 602 34 -692 73 649 -329 -716 334 548 -438 -701 689
2937 689 391 -1026 -422 943 42 -895 176 731 -298 -716 337 598 -443 -469 263 469 -433 -493 712
2956 712 539 -868 -485 892 204 -1179 303 832 -466 -1047 640 745 -876 -431 625 -16 -700
2973g00N54P17k81q66K44J064m78r85O83J080j229j118J911M91j815K6J703o87
2991C14j406Q61J024q04m88O30J81l76m54L80P92l81j057P83P70r63o20J636m8
3010G74j771M29J481r58q14J504J97j242j06Q53k30l67Q8J80J70m55m78R00P72
3029I27j161l25J185m04j234J145J026j247n93J128k10p79N78P21q31k29N7K73
3047B7K62k17l17L03M06j204J16J312k91j165P46N08j187m4J580m83q92M50L56
3066B66o14L29N73m82J66k5o45K28P96o70j76J139r62j118J239P75j121J09Q20
3085F27q72o36J035K38n45M51j97n75N56J95o89O57N75j148l20J351l06j092R92
3104B97M43j597L42J093o46r4O48l96o61M13J8j69P71j49j160P16P33j081J97
$$ plain form
2973 -700 -146 571 290 -576 -332 732 254 -731 -48 1032 -197 -1315 596 1087 -728 -702 1001 314
2991 314 -1092 -231 793 -11 -499 131 312 -64 -518 -138 654 273 -784 -1 769 -194 -814 822 774
3010 774 -997 -568 913 -45 -859 645 842 -400 -506 347 117 -250 -162 18 188 -267 -745 155 927
3029 927 -234 -559 626 222 -1012 133 1159 -88 -681 447 237 -542 36 757 -74 -303 -246 27
3047 27 289 72 -245 58 464 -740 -624 688 397 -768 -22 486 -701 -745 835 352 -540 -90 266
3066 266 -348 -19 554 72 238 213 -432 -204 592 -78 -254 885 -77 -1195 44 819 -302 -193 627
3085 627 -245 -881 154 392 -153 298 101 -474 82 277 -412 245 820 -328 -648 703 397 -695 297
3104 297 740 -857 -515 578 -68 -162 486 90 -571 -158 -140 -309 462 313 -847 -131 602 -479 -282
3123b82J390r41j284J324M61j244O02Q01q96l60N66j57LL67n90L7M65l29o97J236
3143D72M11j595K18J207r43o66J650j9j412L68P47m44l27N68j37j70P3l33M33
3162A01N32o17n22J007j20j363Q72J134j247n77J276J2j490P20R96p65n36O85
3180I8m6j24Q4K8K67L5o13q7J012m41r03R00N52j520K4J515m21j189P25N66q78
3201d16l37J079n6l41j63K29K43k18m04O50M17j103k30J011L23j348L41J208r57
3220g2r67J156O40j092k12Q22j35l76j18N76J62n51l32N10L14p03R0P83l13j071
3240h89N48J067r11k45Q90K69j318J15J048l69o26K57N28o1n96Q2P01l03o64K92
3260a85O77m51m85M88N03p77k23Q41j46r71P19L56j85n97N43K35k33k24J76J69
$$ plain form
3123 -282 1108 167 -1117 207 668 -576 26 827 -69 -429 137 -20 -17 350 -240 -203 262 -67 -764 472
3143 472 883 -712 -494 713 -230 -896 754 735 -677 -309 438 -6 -333 235 98 -72 1 -332 101
3162 101 633 16 -506 501 381 -982 -110 1024 -223 -800 476 488 -1002 -282 714 -51 -587 98
3180 98 52 -72 12 40 307 342 -271 -358 654 213 -690 210 762 -758 -734 781 360 -829 -104 462 -416
3201 -416 -753 326 270 -71 -234 -5 238 20 -384 266 683 -420 -650 361 684 -664 -323 885 -72
3220 -72 -1039 117 757 -335 -547 275 140 -236 -354 222 384 -167 -499 11 325 -378 -288 495 182 -889
3240 -889 -341 726 -185 -430 460 729 -589 -474 574 205 -421 -164 364 303 -293 -211 490 187 -477 -185
3260 -185 492 41 -444 44 547 -230 -453 388 242 -729 -10 346 161 -436 107 342 109 -115 61 230
3280B30l02j60J42N32n03l22N67Q7o38J14O36j58o63K73N24j64o44N03J74k74
3300d6k85M80J57l70j70L07J51l82j08N39J9m38J8M82l05k88K84J76j58l25K09
3321e3J54l56J06K31p3j56k7L07J9j47l52N07L8l26O8L22l0m29J39L11j76l72
3343b95K72J11k26oq9M03j84m7J55P0k75k14M77P8l58q4M51K4l66jK14k5l09O5
3367a59L07M1m40L09J32q0l93L63O1n71J88L32R7l88oL99J51p49M11K44k10k74
3389b35K9N78n02k98M80K13q1n50N69J60n17M2L97p2o64L37K99j86m46L54M85
3410C92m08k79L34J23k99j92M36R1n11J09N14Kn90J19M41k44o53M73N02l90k59
3431b89O04R3o55r9O73m7n02p1M87l1m12L6M26K1o71L03N87n55l36P22K96r99
$$ plain form
3280 230 -72 -232 -90 442 -61 -383 184 271 -367 -253 383 225 -438 -165 359 195 -449 54 228 -46
3300 -46 -331 149 306 -64 -234 73 224 -158 -266 273 292 -146 -128 354 49 -239 45 221 63 -262 -53
3321 -53 101 -255 -149 82 9 -147 -174 133 152 5 -347 160 198 -128 -60 262 232 -197 -58 253 77 -295
3343 -295 -23 88 -138 -144 -233 170 -14 -61 94 164 -111 -325 152 230 -128 -212 239 263 -103 -104 110 85 -224 -159
3367 -159 148 189 -251 58 190 110 -283 80 141 -430 -242 90 187 -201 -207 192 343 -406 5 249 39 -235
3389 -235 -206 372 -130 -428 52 265 184 -366 203 363 -154 -112 285 213 -451 -114 185 -1 -447 -93 392
3410 392 -16 -295 39 162 -137 -329 107 198 -313 -204 310 312 -278 -159 282 38 -615 -142 360 -30 -289
3431 -289 315 408 -247 -346 327 280 -222 -293 194 163 -249 -213 213 234 -437 -134 453 -102 -438 284 580 -419
3453d19K31N34o1o11J86M16k44m64L03M77l54l20K59M95n39l67O03K29p05k08
3473e59Q69Q2r52K43O85k13m48M39K63m71l53N83J04l33k72N09J95n07k26K38
3493a24N31o08o8O73l05o73N79L59m47m00Q04j99l73J84K61L2l73p8L31K58m31
3514f7r5M03J33o46j1O14k24n54N30L59n83k29O62k72k36M29L7l25J9j49J97J69
3536A61k74j75N12j76k61K91L68l66o25R00K6n60J71K75l39k2J2J14j89L83k94
3557f8k4J49l35k0M29L07r02L89L90m02k92N35P9n97M31N9k65J16K47j07k05K90
3579B04m76P2M04k35k68L20N1n18L59N12m81j33N61l88l26L42L66l86P2J55l98
3600a91P0J30k31J31M40n03j96N00m6m02K98M45p11j25O58K5n41L22J70m20J2
$$ plain form
3453 -419 -188 346 285 -326 -140 276 32 -432 -129 348 -6 -326 -67 428 -111 -478 125 354 -351 -559
3473 -559 310 392 -560 -317 368 155 -293 146 409 -62 -415 168 272 -61 -333 176 371 -136 -362 -124
3493 -124 407 -201 -269 404 99 -574 5 364 -83 -483 321 122 -251 -67 194 226 -147 -225 106 364 -67
3514 -67 -162 241 374 -272 -283 331 107 -447 83 442 -141 -370 292 20 -216 213 250 -75 -56 -205 -8 161
3536 161 -113 -288 224 48 -213 78 446 80 -545 355 381 -179 -8 267 -72 -94 -82 32 -157 226 -68
3557 -68 -92 57 -278 -298 131 438 -464 -75 315 -87 -379 156 235 -362 69 128 -137 -21 226 119 -86 204
3579 204 -272 -200 204 -31 -299 21 72 -446 -87 425 -56 -189 372 -16 -342 0 366 -20 52 207 -191
3600 -191 -121 9 -222 -91 349 -154 -350 150 104 -298 0 445 -266 -391 267 292 -249 73 243 -177 -165
3621a65N6J09J16N9l85K28J41k76r6P46l37p03M91M20n97J43N45m11l81K85K74
3642B62m65J76L5mR6k48l4K87R9m33n3O95n18m59Q46K17r97L00O54n67j65L55
3664G9Q3q2k50K54j35K23j65M9J21j47m55L62M99o53j8N01j35o48L22Q43o50l95
3686c97M44K63m14q5M52k71j12J12pK46j54j75J15K50n32j86R26k63p12O51L18
3707D69o83j56M51J02l31J09o4J46j75J37K83k15p4k26M50j6m17J21M31l19m75
3728d52N48J79m80j40N82p8n27L96K32k78j80K76m4n9k08K02L67k43l56J83M58
3749C78k71l40K97q2l72Q6O79m56m9J72J42k42j65K29J13k50j49L17q0k7l37M35
3771B8Q8k45j85M40J64m89L22M9r3j25K49p6j09qJ90Q6l92j21J83K14j20k75K36
$$ plain form
3621 -165 -109 0 116 175 -210 18 159 -117 -213 533 196 -507 -16 404 -193 -50 495 84 -297 -12 262
3642 262 -203 -27 8 4 100 -148 -182 105 204 -229 -282 413 -105 -564 282 499 -498 -198 456 -111 -276 79
3664 79 162 80 -170 84 -51 172 7 56 177 30 -425 -63 436 -217 -235 266 131 -517 -195 648 -2 -397
3686 -397 47 310 -104 -189 263 -8 -120 -8 -15 231 77 -98 17 267 -265 -451 475 212 -500 151 469
3707 469 -214 -370 81 183 -148 -39 -103 43 -132 5 288 73 -1 -227 223 207 -210 -89 342 23 -452
3728 -452 96 275 -205 -345 237 159 -368 28 260 -18 -198 78 34 -25 -233 -31 336 93 -263 -80 378
3749 378 107 -233 64 -18 -390 -304 375 -81 -130 42 184 -58 -223 6 119 -131 -280 37 -43 -70 -407 28
3771 28 116 -129 -314 126 290 -199 123 172 79 -46 203 127 18 10 200 286 -106 -227 -44 170 50 -225 11
3794A1J57m20J67M01j56m14L49M3k02j4J04ok7n3J16J39j82n5L0J02j11r1J77
3817F5Q7m45K37J61p8o7m7J10O5j58R5J61m10J59Q3J16p8j64K12J18j45j68J69
3840G8N7j90p2K67J37l61M4K25j67k67L54Lk08j48N63k97J2k45J46L41k26j19
3862g3K38q2j95J3K23J39m61J64J37q2j54J7L91k70j80J39j1k25J52J97N2j25
3884Dl38M04j05r9L4J80Rk73K03K92k12j17J15K22m80k6J91J09k36j51L70M4k69
3907a29J47J38k3l41O5L71k53k35M36p7j10n5J54R0k34j58M80j13l62N8L32j78
3929Cj29K05Q2k03k24L55J56k73j13J72jk34q9M43j00k32Q3L50j41k35L9L14l33
3952a05k8K10K77m20j28M43J05n20L3M12k67k12J66J10j95o6J80J69q6m32J30
$$ plain form
3794 11 168 -252 -85 316 160 -254 95 138 -64 -78 26 20 -7 -60 56 195 13 -42 -12 90 -21 -112 65
3817 65 152 -293 -56 105 27 -40 -87 23 88 -70 25 186 -224 -65 18 134 56 -108 104 222 77 -91 78
3840 78 135 -55 -127 140 277 -84 -40 185 18 -249 105 108 -100 -248 315 18 30 -215 -69 272 46 -73
3862 -73 165 83 -112 -99 124 263 -198 -34 103 21 -133 -116 275 5 -175 -36 -47 -272 -120 77 129 4
3884 4 -334 70 -35 -134 -100 80 89 -184 19 311 99 -18 97 319 -161 -187 4 113 -123 -274 96 140 -129
3907 -129 18 156 133 -208 -143 228 -25 -260 176 99 -11 -66 88 178 -56 -214 266 153 -209 -151 181 3
3929 3 -126 79 161 -42 -266 89 245 -28 -141 31 30 -204 -293 150 50 -182 -99 251 110 -125 -86 228 -105
3952 -105 -133 77 354 -66 -194 249 354 -166 -133 279 12 -200 -34 76 -119 -185 -5 164 78 -354 -224
3973b24M65l31pJ72K17m06m4L79l8m11K63K10l15l26M77J90l18q4J64J40l20K95
3995A48j6J02k55j22M33k8k96m6J98Jm08L12K37l70p3M07q9l62L58l2L9k72P6
4018e8J42M3j28m0K24j5l92Q7J70mk58L18J25l35Q0o7J76k35L25M4j31ko4m8j6
4043e9J30k20R7L07m29J3L51m8l00N2J16j21j31M56j51l69K29J78j78M8J11j82
4065a00J81m7k15P0L26j66j25M07l70m2J09J85l70r0M16k67k1K42j17N3J29l26
4087a38O8Q7N2n5J38R8m00M6L57k77j55L47q1l76J82K45k02O1J14j33Q5Jl4JM2
4112G3j51j67L94K8j66qL38l10l05L95J19k60J9P7o9k25K90m6QJ01k11J28M4k24
4136a28O9L29k43l29J20N05l80q8L40j09l28K56J91l32M8J60Oj44j0p3N1L9j03
$$ plain form
3973 -224 241 -90 -97 75 292 -114 -158 221 183 -228 35 245 -70 -396 81 271 -47 -131 33 173 -147 148
3995 148 132 234 -21 -143 290 262 -34 -80 118 119 -289 23 260 -110 -183 224 135 -227 131 99 138 -134 -58
4018 -58 84 127 -1 -41 183 168 -224 -137 33 29 -229 89 214 -121 -41 -108 68 -167 158 202 71 69 5 -43 -59
4043 -59 71 -149 -52 255 -174 -161 190 142 -158 -106 10 -111 -242 214 63 -306 -77 101 -77 -29 82 -100
4065 -100 81 34 -181 -111 215 49 -76 331 -39 -81 28 213 -157 -247 169 -98 -119 123 6 59 188 -138
4087 -138 -70 17 69 14 152 250 -150 -104 253 -24 -179 168 87 -289 -107 138 -64 -3 111 -22 63 64 30 31 73
4112 73 -78 -245 149 177 11 3 341 31 -274 121 240 -20 -1 76 7 -218 72 26 34 135 -76 52 96 -128
4136 -128 -59 270 27 -302 -182 323 -57 -145 195 86 -242 14 205 -127 -79 81 87 -57 -67 -140 -89 -50 -153
4159a53R4O1m1k41L65K56n36k8N67k14m88N27J86n50J08K35P2m36K92q9P0j11
4181e4o3J28P1k09n9M12o4l39K40L29l11k63M82k89k04N8K85n5l7j01J13O8j21
4204A7qJ35j70j84J9K57L8j88J13L22l44k37L13J33l15P9R6j60l5L0J30j22P6
4227eM4P7k55j00M09J49l24k50L60Q4l63k1L97k01k83M72p6l21P3M09k65o3N4
4250AK5J54l20J71lJ36j72Q1j10J22j98J19K3j18j70L49J18j73k00L44j01j19
4272d1J12p3n0Q0j24LJ89nj32K24m7k27J64N8k54M4J26J14k29p9J98K1j00o3M9
4297d2j8o3J96J1o7j0j11J65j24O5j72L00m3j09J60P2j65k11J89Lr2l0k1K38p4
4322D7j19o0j1K11j86M0K26k21k2Q7p7R2q3J84Rj42J06p9l6R5K3l5j33l2J65j4
$$ plain form
4159 -153 -59 2 -39 -280 85 341 -195 -223 344 130 -358 169 355 -195 -87 148 220 -216 76 -13 57 -54
4181 -54 -117 11 82 -127 -186 226 162 -177 63 392 81 -182 300 11 -193 -135 150 95 58 -43 70 138 17
4204 17 9 144 -26 -210 -191 66 104 -84 29 351 7 -230 83 216 -99 -20 76 -84 -119 -89 41 -81 -5
4227 -5 39 116 -139 -239 170 319 -5 -255 105 189 -174 -195 202 1 -282 190 114 -207 -134 275 10 -53 1
4250 1 26 180 -140 31 28 164 -8 73 -37 85 -113 6 29 -89 -259 90 208 35 -165 179 78 -41
4272 -41 71 -2 -52 28 -96 -93 96 91 -41 183 136 -91 73 131 -123 -79 47 161 -68 -147 51 72 -28 -91 -42
4297 -42 -60 -123 73 84 17 7 -104 61 -63 2 -170 130 87 -22 138 210 45 -166 23 26 -66 -96 -117 121 47
4322 47 -72 -132 -143 68 -118 -78 148 -73 -95 -8 -85 7 -76 108 117 -25 81 2 -34 61 84 49 -84 -116 49 35
4348C5j45qJ45j0j39RJ35m8j72J91J23j44k08J84M9RK6N8O5j48j69K94j46l5n
4373e4K29p6k78K03P0j13j97J29K77k60p1L23j02j63L0K68o2l38J36O6q1M9J3
4396bJ38j94j8P8J75k57j58M76k52j85J93J39k26q7J38J23j11k85K65J81p1k95
4418b35M09p6r8j52J99K17k80j79M24l29k07K46K34k60j09K40j6P5j35L0K34k72
4440d0j56M40j19k51J43J22j22j24O6K15q7k31K48M5j25j27L47k02j53L1O3J69
4462A52l18J39K91k97q8L5J82j12k07K62P3j59N8J92j79K5j59K53j25M2q6K6q3
4485h3O5j0J12Ql28K81K7j05l0K26o7k42J65Q2j31k28K24R7j4j30Q8J90k16k4
4509d3rQ4m8k13K00K58n09K97J63k0l58R4J21J8K8Qk14K07j8j20R4j47k9o5K38
$$ plain form
4348 35 -110 -118 27 17 -122 -113 22 -26 -198 -7 116 -28 -236 -52 -3 6 32 90 155 7 -162 132 -14 -49 -54
4373 -54 175 99 -179 24 94 -19 -216 -87 190 -70 -141 182 80 -83 -53 215 153 -185 -49 17 -64 -15 -2
4396 -2 136 -58 -76 2 177 -80 -238 238 -14 -199 -6 133 -93 -180 -42 81 -30 -315 -50 131 60 -235
4418 -235 174 98 0 -152 47 264 -16 -195 229 -100 -307 -61 173 -87 -196 44 28 103 -32 -2 232 -40
4440 -40 -196 244 125 -126 17 139 17 -107 -41 174 87 -144 104 149 24 -103 244 42 -111 -80 -17 152
4462 152 -166 -27 264 -33 -121 -86 96 -16 -223 39 112 -47 11 203 24 49 -110 143 18 60 -26 0 -83
4485 -83 -18 -28 84 92 -236 45 72 -33 -63 163 96 -146 19 101 -30 -258 -34 63 49 -81 7 197 -19 -43
4509 -43 -52 32 -16 -229 -29 229 -280 17 180 160 -198 -104 17 35 63 71 -143 64 46 -74 20 -127 -156 -221 17
4534A7k0j17O4J44j68J05Qkm0o4K16j50L8RO8O2j29j85M7J48j91K5J40L8j05O8
4560B6N6k06m0K61K2p3o3J58j31M1m0Q5K02k48k9J07j60l1m2K90nm14L89P1l53
4585a27J84J23j31k05L07k1k39K23j94oL6j9o4J68L0j90O6J86j78k72L91K11m57
4608a78J0L30r1k37K02L2j45o1p4K13Q4j82N2J7L3j51P0K05k54j33M02J08l65
4631a13K46j0j95QJ58k43K58k2R7m4j85m2l1J37J7j84K48j30J8j72M37k86l11
4654c44L29J36r1r8K73j02k25J54O0l4m9M4N9N7k40j13J76J86l78J25J80k51j76
4677c22L31J51j69k92M07n7j08m7L29k21m3J36O6r5ok08L67k38k51M28P9l99R2
4700g0J09M0l19J02K68j01j68jJ93r1Q1j10P5j75j6R6J65j18k4k7J34n9K9J32
$$ plain form
4534 17 -3 -120 -56 88 -80 25 33 31 -9 -73 143 -7 31 40 108 170 41 -144 -97 51 -140 -115 25 63 -42 26
4560 26 82 -124 -164 97 119 46 -17 141 10 51 11 96 298 50 21 128 -32 -63 -105 185 180 -234 155 226 -127
4585 -127 57 180 49 -156 151 130 -109 114 -80 -86 -50 -69 -133 35 65 -125 -59 127 -51 -323 68 279 -178
4608 -178 -168 162 71 -166 36 68 -77 -138 -212 1 85 -97 -45 -28 5 -146 -76 129 -125 -258 144 252 -113
4631 -113 133 123 -72 -64 94 -149 109 87 184 140 -45 -87 -118 19 36 -148 100 -30 -12 -184 253 -33 -344
4654 -344 -15 121 30 -68 205 103 -122 32 92 58 9 53 112 169 -71 -184 -8 178 -200 -75 105 -146 -322
4677 -322 9 160 -9 -301 106 49 -59 -106 223 2 -41 95 161 66 60 -148 219 -19 -270 158 237 -162 -70
4700 -70 39 79 -240 -138 130 29 -139 -140 53 -38 43 -67 8 -167 -183 -87 78 -40 -64 -91 43 -16 13 145
4724A45k31M2J57J44l83J24K57j36j6j6j78J34j20J47P1j12rj16K48j6k52J08
4746hJ29j22r0L7J98k06O2K21l7l15J63j08k2q2K4K90j19n7kN6n8q9J5J63m2J19
4772A20j52K29k23j81K37r0j4J73p9o7J77j61J9J03j56q6K88r4j60Q3O9p9j5J52
4796I3K0j72Q4l9N6q5K6M6N5j8p4J35nk53J37N4J81l91J00m9q6k8J70K30m16J82
4822d7R3q3K15k56K0J20J15k61k1j7M7j3K11J3o3o4J72j18n1J04j10L0k00J60
4846dJ14O5k12K5j07J1n2J64O0j24k4J23J28l71K76J09k21j30K09J01l04M6L06
4869A88n9k39O6J8J94j83M8k3j9k6L5J17j17k40L65l5L6k82J07R2j72P6J62l8
4893G1j06J64l3j16NJ67N7l22j9J36R1j91j07L53Ql74K46J84r1k29J12J66k10
$$ plain form
4724 145 -86 -44 113 257 -126 -2 255 119 103 87 -91 43 -77 70 141 29 20 -96 152 136 -116 -8
4746 -8 121 -1 -91 -54 144 -62 0 221 184 -131 32 -76 -98 -180 -156 134 15 -42 -44 12 -46 -135 -120 43 1 120
4772 120 -32 197 -26 -207 30 -60 -74 99 20 -47 130 -31 -12 91 -65 -151 137 43 -117 -34 35 -44 -59 93
4796 93 113 -59 25 -14 42 -43 -17 29 84 66 -8 127 122 -131 6 60 241 -150 -50 -99 -185 -213 -43 187 -229 -47
4822 -47 46 -37 178 -78 -58 62 177 -84 -105 -122 -75 -88 123 136 73 9 181 63 12 116 6 36 -164 -4
4846 -4 110 175 -37 -12 -119 -108 -160 4 64 -60 -84 39 167 -204 72 181 -40 -170 39 140 -164 -118 188
4869 188 129 -110 -44 -26 168 -15 33 10 -9 -35 0 117 0 -240 125 90 126 -156 -49 43 -129 -53 109 71
4893 71 -35 129 96 -20 -15 152 209 -113 -132 4 95 -96 -203 150 158 -216 30 214 123 -106 6 172 -38
4916c8n3J63L3j59j28P6P7j35N9K87j24j92N6L69q7m31K10J67m23J92K11k1k11
4939a02J47P7p3p3O8j5j3r2J79J6j26k48L39J03j24M9j18O5j24rK19M0m14J97
4963c2L89m48PJ38L0j20k9M5L8J06k42K9K78r9j54QLJ7jJ38j0l43L32J42k95j74
4989b47L79m0j16k7q7N8m8K13L3r6j08M5O5J72k58J05P3k11J83o7Qj7l2O5k1n
5015A9JKn0j23R6o4K46j68k1K33q9j68L3J91j46m3J46j65K7l%J60r0L0n7J61k88
5042a30LJ87j07K17p7k12K18j43J02J51j95j69J52J9N1j5L8j25m6J72j11J30j26
5065a6k6Q5P5j02k01K77j6j97J99j69J11j48K20m9q9J4j7m2P9j60J11J28J19l92
5089b06J74P6p6j44M59k17p6o4J86n6j96K09m7j3j18p7Q1R3j6L8N6j00MJ34l6
$$ plain form
4916 -38 -91 72 105 -54 -182 -106 -29 -164 -105 182 58 -134 -78 291 204 -227 -17 150 -273 -81 130 109 -102
4939 -102 45 122 49 -24 44 29 16 -76 103 119 -7 -255 84 187 63 112 -6 59 -65 -74 145 185 -229 -32
4963 -32 357 -91 -84 54 84 -36 -65 -20 18 124 -118 -89 189 90 -64 -56 -53 -36 -37 101 91 -252 80 222 -73 -247
4989 -247 132 92 -24 -51 -138 -80 -128 85 118 22 -86 -41 24 196 -62 43 116 -95 88 21 29 12 -20 45 24 19
5015 19 20 22 -28 -151 -55 -119 127 -41 -62 171 82 -86 -53 138 -8 -51 95 -70 -43 -46 -46 114 24 54 -3 158 -130
5042 -130 -127 60 -47 170 93 -119 99 -44 58 209 14 -155 -3 16 67 52 90 -35 -81 91 -20 110 -16
5065 -16 -42 43 118 16 -185 92 76 -121 78 -91 20 -128 92 43 -46 -32 -49 -91 -12 -172 -61 67 186 -206
5089 -206 -32 44 -32 -176 283 66 -10 -74 112 56 -140 69 22 9 -109 -186 -105 -12 -28 10 66 -34 -30 104 68
5114F8j72N1J42K8k03O3m6O7j12K54q8j29J66j88J67r9M5Q1o4R4j34N4J07k31
5138g9J29p7o2j53K28Mj69K31N9j43j06J28J3j17P0n4M2J21j77m0L73j41k30K73
5162A23j24j19P9J83j78k33K41k7N4j84J94r6J44j92O9J40j4n8Q5q5P5k22J97
5185E2P7k39O8J81q8k28K87k52%M9l7J22PQ8q7J0j20J91k49K25K6k06J69r0j56
5210b00J00K99k35o7P3J33k40K90m3m3k32K37j97J05J48j60l3O6K1L4O2J7j21
5233A4Q7j82p5R1R5p4j47J79K21l38O4L2M4k6J66j57M5j24M4Kj52K26j15K6J86
5258A32j99k7K61j11j60P4l7M6nJ76n8N5rk11NJ65K4o1Q6j08j41J16P6j06l7J02
5284D8M6k6k06K77k43K42k23J19Oo9m7r8J92j17J8p1K27k24K00q8k4J44p8j47
$$ plain form
5114 68 -104 -53 89 117 -86 -23 -69 -2 -114 140 52 -77 89 -99 68 -31 14 95 31 125 -9 45 152 -79
5138 -79 50 -27 -89 -242 -14 -10 -179 52 111 -32 -138 -10 3 -114 -44 -98 -56 65 -112 -152 221 80 -150 123
5162 123 -1 -120 -41 142 -36 -269 -28 -55 -1 -185 9 -87 57 -135 -66 74 60 2 87 2 77 -145 52
5185 52 129 -110 -42 139 51 -177 110 -142 -142 -93 -130 -8 -1 87 0 10 -110 81 -168 57 83 -123 46 -44 -200
5210 -200 -100 199 -36 -103 -30 103 -137 153 110 67 -165 72 -125 -20 128 -32 -65 1 22 56 118 135 14
5233 14 101 -81 -156 -65 30 -44 -191 -12 209 -129 -65 -33 11 -15 151 -6 39 -85 -41 -39 -191 35 -80 -54 132
5258 132 -67 -94 167 56 -104 -30 -67 -21 -26 150 92 147 138 -73 -68 97 121 60 146 38 -103 13 89 -17 -54 48
5284 48 94 68 -138 139 -104 138 -85 34 40 -29 -76 -174 18 -99 -81 -152 75 -149 51 -37 -61 83 5 -142
5308a42L4P7J02k2r0j46J82Q1m4j16J00K02l15L2J54j45L1k6P4J0OK2J4p4o0K25
5334A66j19j67M3J28Q7j98Q3L8K7j87P8J79j24l7m3K35k17j00Q8K13k09m1P8j3
5358a2J4j03L67j33j44J3M1j04Q3r9J43rk29J59l5M2p4K48j84j10J96j42Q2o1
5382e1P8Q7k56J13j0JrJ0L9Mj40J44M9q6q9J35Q7l6k26N7K42k36j96M65j44L6
5408F8j24kJ74k64k5J51k7r6J07K05j56k11J92N8j3r9P7N6j88Q7J00r9m4L0J01
5433E8j53K4l3K06k33K01p8M3j71R0J46j53j36J38J01L1j20M5J86j85j7mK7J15
5457A28k43J50K69k09r3j0p2R1m9l4J04q7l9K5J52o6K7J5j27L9J36M1j87o3N8
5482d4J25k9PO8k1j32j96J72J67l18K05J03q9qj03RK23l23L39j10Kpj04Q1P6J3
$$ plain form
5308 -142 -108 -31 71 49 -41 -187 -5 76 32 -84 16 218 -97 -65 89 -56 -25 -51 23 33 39 61 75 1 -59 166
5334 166 47 -120 -77 51 138 -60 23 61 88 -99 -21 158 34 -3 -46 189 -28 -128 -40 173 -36 -77 1 -12
5358 -12 2 -101 266 133 -11 2 43 -61 22 -77 66 57 -172 -13 -48 -6 -80 168 -16 -126 70 -72 10 -51
5382 -51 27 114 -142 -29 -39 -38 -47 -37 2 6 -134 10 59 -27 -116 19 106 70 -156 -99 143 -93 -289 176 32 68
5408 68 -56 -58 116 -148 -173 -22 -49 -145 -38 167 11 -200 -8 50 37 -62 15 71 -117 -30 70 -29 -73 -43 58
5433 58 -95 -71 -104 102 -131 70 -8 35 -136 -46 100 -53 -189 -51 50 81 -39 6 192 7 -10 -14 13 128
5457 128 -115 35 304 95 2 -8 -80 11 -38 -72 32 -55 -94 -69 83 17 44 59 -68 -29 107 148 -39 -102 -44
5482 -44 81 52 59 127 106 -26 -222 -50 117 -201 4 107 18 10 -93 -84 139 -184 155 45 47 40 -64 17 93 106
5508A06j20O6j82J69m9j25J73mn2K9o6L5MJ9jq1J43P5k41Q4L3l0O0q8O2Oj17J44
5536E2n5m4k2n8K90k94K32P9j1r0p2J05j44P1r7l5J24l6n0M0j30J08J53K9l08
5561a63J75O5J8j76J37KK5Jk6q1J58k50J99k6j06j2O0J24j05LP4r2o3J70J8k10
5587h1J23l04K40L5L9K2l4n7j18J85P5j52j97M37q7j29J63Kn3k19J90N5j83l5
5611h3%N3m8Q2j45Q3p7O2%L37k48j29J72m5l0J70o9j47M3J15j12k3N6R3j19J09
5637A00j02J42j76M2m9J22j32j46K90K9m4j83N7K24m22J00L07j12j41J73l1K6
5659G4q0j20K74k28J66r9Q4J54k37M5J57j9m33L42m4j25K28%j90m0m0K31j89n2
5683a41K51j07Q8L5k59K17k8j05M8M3o6j09K35j15M0r9K03k39P0Q6j28k4J30N0
$$ plain form
5508 106 -14 52 -130 39 -10 -135 38 34 -18 11 -55 -20 -16 3 2 -79 64 139 -102 -18 15 -15 45 -43 19 25 -92 52
5536 52 -3 -47 -69 -127 163 -131 101 180 169 79 7 112 -32 39 -58 -93 31 -5 -55 -15 -145 -37 116 145 -163
5561 -163 12 77 95 -81 56 58 83 84 58 -23 135 -115 84 58 -48 -60 0 124 19 22 96 4 -59 111 129 -81
5587 -81 42 -262 -22 13 52 74 40 -17 -135 50 125 -27 -224 213 126 -3 160 162 109 -110 80 135 -48 -83
5611 -83 -83 -30 -78 4 -141 -58 -135 -73 -73 264 16 -113 59 14 -16 154 85 -62 -19 96 -16 -39 17 110 -9 100
5637 100 -2 140 -36 6 -43 79 -53 -199 91 120 76 -107 -50 174 -248 -148 159 47 -94 79 48 74
5659 74 -6 -126 148 -80 86 -13 71 225 -12 33 190 171 -262 80 36 -89 139 139 -51 -91 -131 100 -89 -141
5683 -141 110 3 91 126 -133 84 56 -49 -1 42 -24 -133 102 -13 27 -72 131 -108 -38 48 -80 -104 26 76
5707G6j43J62j64Q6j81O3J80J32j82j5j77N04l12j48R1N4r1N1mM9q1J28q5K5k2
5732dJ57j15j00Q5N7j06l1p1K49n0n7J05j74J50j16K0J65j49j17K0J07j54J0L04
5756A85k83K29j74k8k0K33q9j35j18K35j51J65L8k48K65j50m0L6J32qm2N9mj26
5780c9J47j06J66k54J70k93K74p0K16m26J78J71j69j51K70Rj18R5k01J73j4nj42
5803a19J45m7R4mpj84L42k97L13j48qQ1j47j15R4K29L4k06j88J35j24K06n7n4
5827c2p3Q6m3J56j86q2K98k54J4L83k04r9o7K73j09k12J69p8O9P0j48Q5M8k9q4
5852d9Q8J4j09J7J57kl81K77p7RJ04K8q2LO2J47k48j46J55J13j6j33Q2j1j16J84
5878G0rJ43l36K26q1j70K1R8O6K8j44J94M0j77J69j40L2N6m6K5K8p0q3J6J52j62
$$ plain form
5707 76 -67 95 -69 17 -164 -101 79 211 29 14 -163 341 29 -119 -28 26 -65 -14 -18 31 -50 78 -7 18 -4
5732 -4 153 38 -62 23 80 -26 -57 -128 121 71 14 119 -55 95 -21 -1 164 15 -102 -82 25 -129 -119 185
5756 185 -98 131 -43 -71 -91 142 53 -82 -200 35 -116 49 87 -161 104 -46 -86 -50 82 74 32 91 87 -39
5780 -39 108 2 168 -86 84 -209 65 -5 211 -215 -37 134 -35 -186 84 93 -25 70 -131 42 28 23 -119
5803 -119 26 -21 73 69 62 -122 220 -77 236 88 80 161 14 -101 -7 222 256 50 -138 -3 -127 79 22 -32
5827 -32 -105 -19 -62 94 -92 -174 124 -130 -116 267 63 -36 -103 170 61 -151 18 -60 9 79 -69 16 64 35 -49
5852 -49 39 53 -56 -39 118 116 -265 12 -65 -56 48 76 -6 -3 59 206 -42 -188 -33 80 64 -69 13 2 -114 70
5878 70 61 204 -132 94 13 -157 -136 -38 28 56 -88 106 146 -31 138 -2 30 86 40 65 93 23 -60 -44 108 -54
5904e4J08P0n3k03L7L15k62j20K82j89q1K39Q6j06L0j87M9O5k83L06j31QJ56j18
5928c6LJ17k23K09q5J33j28J35j0j63M2j09J48j22M5j1q3P4J48j14J33j99M7N9
5952A0j63J14K33j19k19J24O9o5O2P6qq6j13J16M2k74J82R2Rk58K15m2q9R9j08
5977a01J56L5j73j8J53k7m1n3J16r9J2M8m9J26Jj11K56k65K36l05J86j44L7J87
6001A63k71PK28q9J3O5j25j33J93n5n9K09q6k36J30J91j77J64k35J92k42K7J31
6024EK9p4lJ48j19J8n5N5p9J47j62L2J34j28K4LJ2R0j6O1j76N6M4j08J31j13L8
6051fQ2j48J31l6k1J1j37J29p9M5J80K1j09j42J87j57j35J73Q0J0n0J8p9J64k37
6076a05o4K69j12m6O7J08p3j42M9J25j02m4J19p3Pj35K29j9j72P4J73j44q1J15
$$ plain form
5904 -54 54 124 71 -132 -95 220 -42 -162 120 -69 -150 89 175 69 99 -88 -39 26 -257 49 -82 -74 82 -36
5928 -36 -33 84 -139 70 -15 118 -10 125 115 -48 -6 -115 33 -89 -44 -55 -138 -64 84 -30 103 -96 -49 10
5952 10 -153 -39 194 75 -144 -20 49 -16 46 122 114 28 -85 31 73 -201 -19 73 82 -176 39 -3 -92 7 -101
5977 -101 55 90 -83 -101 52 25 -16 -69 47 -52 -40 8 -41 85 86 -25 231 -34 202 -103 83 -61 -24 163
6001 163 -108 -101 127 38 51 116 -9 -142 51 -4 -63 146 60 -176 -46 145 -32 132 -103 89 -153 -126 5
6024 5 34 -40 -43 105 -14 4 -51 4 -75 72 -90 -58 76 -52 -28 -25 -13 77 61 122 -54 2 46 -62 69 -44 -6
6051 -6 76 -72 59 23 2 13 -124 5 -74 -29 151 172 63 -79 108 -49 -184 -11 69 79 29 47 -32 132 -105
6076 -105 -169 100 -12 -58 9 117 44 -98 -49 76 -26 -70 49 -24 -17 -152 77 58 -114 -40 133 -11 -92 23
6100B3n3Ql4j0K66j90k3J30j68m0K4J02Mq0%L5o7K1J12mm3J52p8q6k37J10J56
6127C0o9o3k1J63Q8o6q8P8J01j20N1P1k03J44R6q8j7jj69K26j68j27J77j45J73
6152E3k12J71Pr2J80pk44q5L39j6k40O0M4n4K9Q8j44J86o1L1O4k80K56k46J95
6177B2O2K7j81P2j97J63K17j23j61K69K8l26j7J03j37N3Q9J13p0p5l2R9o3J73
6201A08Ql28K20j37R8M6p0M3j8J60l90J52K31k6J6m0j58Q2m5JK4J41O7k00r9J
6227a13M4J34j17O5qL2k1m2J33R8k07J43J3k25P7N2j08l0O9l2M1Q6j96L0m7K91
6253A62j08Pj26P7j45L16j07j52k1n8J02Q9N3nlJ6j50k2N6q8J08j0ojR5K7j01
6280EM5P9k41N1O5P0j36Q6K8K63k40j76Mp9K35k3j56JJ22O2k20J91kM7o6J50n3
$$ plain form
6100 23 -30 -22 -56 -66 200 10 -13 117 -51 -91 -67 35 39 -41 -41 -6 -73 -52 60 56 13 165 87 1 -236 -126 30
6127 30 -39 -102 -123 40 128 62 -26 52 153 33 84 155 -48 96 192 104 87 86 -83 143 -25 -152 25 -120 53
6152 53 -159 12 19 -73 107 100 -144 -229 110 94 -146 -86 -42 -96 -67 21 -123 63 2 33 97 -183 73 -173 22
6177 22 84 111 -70 2 -195 -32 185 62 -99 170 198 -128 -145 -42 -179 -126 -37 76 6 -69 -101 -2 -65 108
6201 108 116 -212 8 -129 -31 15 -55 -12 -30 130 -260 -108 123 97 113 73 -85 -3 -48 -47 -23 118 185 -15 -114 -113
6227 -113 -69 65 -52 13 5 37 16 -26 107 205 -2 141 154 -71 6 58 -50 -80 -11 -43 -2 84 -112 -82 -129 162
6253 162 54 61 -65 12 -133 183 76 -76 -97 -155 -53 36 89 84 81 97 -53 -75 -19 -107 1 -9 -15 -16 79 106 5
6280 5 50 129 -112 -61 4 74 -62 24 52 315 75 -101 -97 -176 59 36 -120 -119 3 65 -155 36 34 81 15 165 112
6307A12k38R7j45K72j04J22m8M5k12J92M6q0j79J13L9N7j17j21K08pk07M17l09
6330d7J2j26J72J15k3j14N1L8j58J73j38PK9JJ10r6j16K63j18%j7Q2r1j87K09
6355C1qn3j44J72%j23J41P0R3k14M1qK16j18q2P5R7k45N1pN4q2j68J99m9J29j29
6382f1N5j9m3L5L8n9O3J5J35l71L27m8J50k66K15r1j14m7J55j20oqq3J86k4k0
6408fJ26j1m5m3J1o7M4K7j06NL0k0O7M8OL4o2K7o5j12K05r1K6L3j98J48j3N3n9
6437ho2N2m1r4O4O5m3J75m2N3l7n9j56J15J17j31Q3k2J34j42j13O8O0J02p2q4
6463a8L5k4J84m3r7j77J66J14j47l7J92j6q6k00K23q3K0q2J07N9M1j18k5J1l0
6488c1O9p9R4RM5j07o1J21M2k40K76k29J95j51J2Jm3J82p3N8J08j64q0J36j31
$$ plain form
6307 112 -126 -29 -174 98 -6 116 68 113 -99 93 139 59 -120 -7 32 89 -28 -149 59 52 -155 262 -47
6330 -47 -35 -161 11 126 103 -11 40 78 -80 93 -45 -38 -9 -8 102 6 -110 153 35 35 18 100 9 -178 31
6355 31 23 -30 -174 -2 -2 -125 16 86 179 -35 6 -2 214 96 14 89 186 -59 -8 -15 39 -43 -211 -12 -61 68 -61
6382 -61 -6 -25 -68 -33 5 -54 9 24 159 -212 115 67 217 -49 166 75 -39 -86 69 -51 -57 -65 -148 38 14 -6
6408 -6 120 109 64 21 32 -35 9 36 -70 -65 -35 -55 12 60 66 100 38 65 0 -112 93 2 28 61 -137 11 -2 51 -8
6437 -8 -70 -18 -59 -153 -89 -24 -67 108 66 119 82 23 -133 -18 99 -32 51 29 163 21 -92 -24 36 138 66 -18
6463 -18 17 -7 177 134 37 -140 26 140 -7 -44 148 132 46 -154 69 -14 6 -76 31 90 131 13 -12 -1 -31
6488 -31 38 -41 53 62 107 0 -61 60 102 -138 138 -91 104 -47 -35 -34 -77 105 32 90 198 34 -46 90 -41
6513d1J44q5J43j30j36J08j05P2j9J13k01J68Oj78K79j78P5j9k5R2j9k1M0o4N6
6538G5j1q6l1J93j85J30k96K18N0o1J5j18J92q4O3j24O6o9J24l9r5J68O3j08j60
6563a10N7K26k34j39O0J14J75k01l6K72k75o6K38k26K29k24Q9J05k58J16K63j20
6585E5L5l2J9O1k30R9K3K12l4l48M1j6J74k25K36p3j38K38k1K4j63j3Q7L4j8n5
6611b8P7m8N2Nj70J60L0j05k1O3P9o4j65K9P8N0j65J50J24k50M5k4N6J0l1j36
6637a99K28K1L7o0J80l01R6Qlj64J6M3J67l09L39Oo9O8k6j46nJ21j41J04R6j77
6663g0O4o4J12JJ10p8n3j55L40k19J9J25j82J70j06j4q8O6R4j43Q3J6Q1j39N5
6688B5n3J8l7P9l1Ok3l1Q0r7J43q0J4n1K7j1J11j53J3Q6m9l5K49k48l4K34j86
$$ plain form
6513 -41 103 18 161 31 -105 3 -102 -30 -49 64 -137 31 37 -141 138 -40 35 16 -9 83 64 43 83 19 75
6538 75 64 -22 -53 140 -45 85 -211 7 57 -4 11 -107 85 1 64 -60 6 -63 61 22 -73 95 158 50 -110
6563 -110 -53 173 -61 -200 -140 -26 149 -52 -88 184 -91 -157 81 -145 84 -140 -51 54 -204 -88 175 55
6585 55 90 58 77 138 -92 7 30 242 208 -140 -99 -115 59 -166 70 -3 -141 97 76 100 -63 -76 11 45 27 -28
6611 -28 49 1 53 58 -112 48 78 -27 -48 15 94 30 -135 -106 -28 22 -143 7 131 -119 -74 -98 -42 -32 -63 -199
6637 -199 29 50 87 27 207 -94 2 10 7 -157 -141 -98 69 -240 99 105 36 104 78 -68 -73 48 -93 11 107 -70
6663 -70 -6 -70 42 43 153 75 22 -133 207 -12 7 132 -50 120 14 0 -88 -22 72 -71 12 28 109 -30 25
6688 25 -28 -10 -47 32 1 7 -16 -47 33 -64 79 -1 13 -38 -11 -22 89 -64 -51 35 -14 -49 200 -48 -82 152 -34
6715c4m6O4o3R2L4n9l1K4K12k00j28J63j12M0P4M7j37O6J5m3N9j07mO0J17k03
6741a00K02J5j36Q7R8j94j39P1Q9j6q6J72m4n4L1M5J55k32M9L1q7J97k35j90L51
6766H0K1r9j16J24o4J12n6j13J34J0o3m2J15N1k9m8k0lj55K99l4n2m4m4j47K92
6792A09k05J23j07N5N9J23j22o9K3Nqm0R9P1N2j58N8l1k18J23J75l12P5O9P7j09
6818h3K18j71K01lk39J34j30K18k22M6R3K3j94K79l26J22O1m0k0L5J0n0q7Q4R5
6843E4m7J9l9N3j30O5k03J79O7m1j38M06k88P5p2J16p2j09L50j84o8k9J59j03
6867B0j32R1r4J72j34J5N2J28q8L0j82P9j07R0M6j70J62J26j33nj9p3P1r5J49
6892ar6R2M4O6n7n8q0J12J8j66N4K02r5j52J98l7j20N8l3J8j87J56J7R4J08j18
$$ plain form
6715 -34 -80 -16 -79 13 47 -12 -43 -19 193 -7 -135 28 -84 -44 30 77 -60 6 21 -22 37 -70 -74 -14 103 -100
6741 -100 102 117 -19 68 166 -28 -167 -96 -7 -23 -109 63 19 -35 -4 41 196 -36 13 44 -43 154 -81 -271 80
6766 80 101 2 -114 10 -54 58 2 -111 23 33 -30 -72 43 94 65 17 -3 -6 -161 138 104 52 8 -36 -183 109
6792 109 -96 27 -80 -25 34 157 35 -34 -11 -6 -14 -54 45 116 168 10 68 37 -181 -58 117 -195 -120 -51 26 -83
6818 -83 135 -36 165 162 -77 57 -73 145 -77 -31 62 85 -109 170 -156 -34 27 -13 -33 2 12 -38 -125 -41 54
6843 54 7 26 -13 40 -90 -25 -228 -49 18 -23 -161 245 -43 32 -40 76 4 -105 245 61 -7 -36 123 20
6867 20 -112 -21 -115 57 -77 -62 -10 118 30 60 -122 -43 -150 -60 -14 -184 -22 104 -29 -34 -53 -126 -55 -150 -1
6892 -1 -97 -5 39 105 48 -10 -90 22 40 -126 -72 130 35 -117 81 44 -76 -18 -51 -33 -220 -64 -47 47 155 37
6918C7Mj43K14k16J68N9k96Q9K70j46k7r9J20o2q1L18q8k05J88rk8j75J56mn3
6943i%pK6RK1o5J10j38j47L60j77l6K18j72j43J61k6n9j7L5K28k39L1k8J02L9
6969G7p0J35j71r8J48j65J55N5p5K7r7j00L04r5q7J77j55Q5J36l56J03R8n0L1
6993A2j70J97Q7j51qJ22j73K8OJ6m5O3k9j5Q8J14k52J16P1j55J99j70J02j6J47
7018A84k32K04p3J67k38M3j42n0J61k9M5j55J91M0j43j57K03j60O1l4K05j67N0
7041b6K05j47Q5l1j00j38J7L3P7J0j4QR3m9n9j20MJ65j2K0M8k36J14J09j84L4
7067i4K32j78J2j76J57J13J7j47M0J23j18j30K84j78O9j31K92r8q3j44K20r3N9
7090D8mj16J5oP5p7K10k75J24L8j34R0J2jj8l0J70m1p9Q9j00n9K04q5K4r3L9R5
$$ plain form
6918 37 41 -102 112 -104 64 123 -173 -84 186 40 13 -86 34 -28 -109 209 121 -84 104 95 67 -108 48 44 -9
6943 -9 -9 -16 10 19 40 -25 85 -53 -200 160 -17 -53 165 -7 -150 11 -15 -74 -91 -56 172 -67 -36 -64 38 77
6969 77 7 142 -29 -127 21 -144 11 66 -9 18 -79 -179 125 30 -57 120 -35 50 186 -170 -67 31 -19 12
6993 12 -158 39 126 -25 -33 89 -84 -56 -50 -34 -79 -16 -45 -60 28 142 -110 6 77 -78 121 -49 53 37 184
7018 184 -48 156 83 250 12 55 -87 -137 24 -5 40 -115 76 116 -27 -184 19 -141 -80 -114 91 -76 -26
7041 -26 179 32 117 86 -14 -152 -135 -102 -25 -15 -29 -21 72 23 -36 -156 -152 13 1 21 69 -167 -53 56 -128 -94
7067 -94 138 -40 -28 -204 -47 66 83 -64 -24 99 -19 -149 135 -43 26 -105 187 89 6 -138 82 -11 48
7090 48 44 -72 -57 -63 12 -65 145 -130 -6 32 -102 -12 0 -1 -19 -49 121 80 1 90 -10 -69 135 50 74 -19 20 115
7118A15k02k3K39j61J8J92k46k3K4J48j36K37l01J05k7j0j26J83J93l01J19P2
7140H9r8L6n1J38j62j89K09p1J05J4j07J58Mq2jq2J20k9LL7p1R4K2k01P5J78j85
7167d7j09J85M2j81R0p0J06j13K33j47j25J87j59R7J81m9r4m3q6Q7k6L9j44o3
7191b09K54%j01K33r4j53L0j8r2j6J06j20K89j18k1n5j2N3q1Q3J21j98J11j09
7215a17K20kl18L23k14Q9j5Q5j75K94j46J5p4J07j08R6p9m6O0M8j3l5M0p9l5j15
7241a94J51j6N7l8J90j44L4L1q6R5l1J21j67k4jJ82j70j0n6P3J6j57J57o7j50
7266b04L03K2o5m6M7j0n3o2L9N7K3Q5k06L4J67n0P5j50J5p3Q6M1j09J97q4o6k8
7293a5J17p5L7k8LN2j10j0M4p2K46k30O0J54j54j87K53j26J02K06k64l0oQ3n8
$$ plain form
7118 115 -87 -110 129 -32 -14 178 -68 -91 -67 81 -55 182 -119 -14 -41 -51 -177 6 199 -102 17 89
7140 89 -9 27 -24 114 -48 -237 -28 -99 6 20 -87 71 75 -7 -8 -90 30 1 4 41 -30 64 86 -115 -40 138 -47
7167 -47 -156 29 71 -110 -20 -90 16 -97 136 -11 -136 51 -108 -11 170 121 27 -16 -102 -15 -41 -2 -146 -209
7191 -209 45 45 -56 177 83 -70 -40 -58 -150 -166 -60 -180 109 -9 -30 -85 -97 -44 -125 -42 79 -119 -8 -117
7215 -117 103 101 -217 106 -108 -19 -34 51 -124 170 24 39 -35 72 -36 60 -19 -65 -5 43 30 -5 35 -44 -79 -194
7241 -194 -43 -59 -2 -40 150 6 40 71 -15 80 49 170 3 -21 -22 160 -10 -20 -76 -3 13 -144 13 -54 -204
7266 -204 99 121 56 10 57 47 -6 -68 -29 28 51 136 -70 -36 131 81 156 6 21 -52 34 75 -34 163 79 13 -15
7293 -15 102 27 64 36 39 91 -19 -29 15 -57 189 -41 19 173 19 -168 85 -41 61 267 3 -27 -33 50 -8
7318hj5J12L6o1l7J7o7P3j01R9j42m6K97k2l43K11R6m4j13J07l6M5k55Q7J49j6
7344B3Ro8P4j39K28j02J02r5j15J45j3mn9p1j6J87j84J07o4L5j10J38N6P3j06
7369C1j67J22l7J59j46Q8N0j78J66J41rj69j48K7j0J92j58J15j37N1o8j8J78j25
7393e0k6PJ37Rn4l7J2j9M0p9J44M7j46J8J2j4P6N5k3j65N5j12K63k40l3L92j35
7420A34j81Q0P8j44M3N3m7l7l0N8L0j58J23P1o0L1p9pO1Qj01J11M2L4l2M8l7M9
7448A41j90j5K07o8j28M3Q0j17J04j98K63r2pP2Nr3l4J04j03J13l1j66L04j12
7472H2j61m9J20J69q6K6n7L0k16J19P0o8L9o2R9j04j24J75m4n7J33j20L3J28j0
7497F5o7r3J20M1q7p9K49r4P0j82J17j03p1J50J3Nl2L0K6l9l7J64l4k04P7m0K9
$$ plain form
7318 -8 -23 89 125 64 27 44 -23 50 -51 48 -94 -140 157 135 -208 3 99 55 -58 49 13 58 -197 -110 39 23
7344 23 32 -36 38 -101 127 25 127 32 -83 62 49 45 -14 -85 -101 86 -98 9 -55 -20 -130 8 64 137 31
7369 31 -136 -14 -51 108 -38 50 100 -78 88 229 220 51 -97 -70 -80 112 -46 69 -68 -17 -85 -103 75 -50
7393 -50 -76 -69 68 77 23 -14 -2 -21 19 -60 84 131 -15 3 15 1 77 132 109 -56 -1 -113 150 -90 -123 269 134
7420 134 -47 33 111 -33 10 63 16 -21 -51 7 37 -121 2 73 13 44 -35 -42 19 27 -74 37 79 113 81 129 92 141
7448 141 -49 -64 143 75 -53 -10 70 -47 57 -141 122 30 23 95 100 7 -27 77 -26 87 56 -110 194 82
7472 82 -79 -128 -8 161 75 101 44 74 -142 -23 47 -21 18 -44 55 -49 -173 2 -42 -99 34 -86 -53 75 65
7497 65 -2 -95 25 66 -21 -100 149 55 125 -57 60 -43 -114 36 49 54 22 52 78 39 2 166 132 -72 5 -35 -6
7524fnm4J0n9P8P5o0Kj42J36M3J38O0j10no9K1m7n0J37j60K10n3r3j40J90k9j26
7552i8K79j87K30j40j06j13P3L4rL9qJ1K0L6L0p2k2j5N5l7j74J02p0J40K6j93
7578a69J94L2j11j36L2J50l4n1o5K59n9Nj50m9J57K3L8q5LP6M4L2k50J93p0nk
7605Bj27L3o3K68m0j10L4j8R3j36m5J40j34K53l41J98N3o4J4j7r4J46l1PM1l71
7631c09K22MQ0m3p0Q3L1J52j28M2k08Q3P9j08O5o2K10j59Q9n0M5l3j14K29k3j08
7657aK3M8l1j59P2R7j14mM7K6n8J08j88K72r7q7P2j7m4nK51j79lR8k52l1K75l12
7685a93K88m0k15J26k9J54k63P4K18j02m4m0nJ14p1J8k1P1n2j19M3PJ36o1P7n
7711F6k16K16j58Q2j54J13O1j14J05L7q2J83q8q0k0R2j12R9Q7k24K86n2j57o4
$$ plain form
7524 -6 -11 -55 -45 -104 -26 49 -11 -9 -151 -15 28 166 226 116 111 42 63 16 -34 103 -57 153 100 7 -133 57 28 -98
7552 -98 181 -6 224 84 -22 -135 -62 -28 -37 2 -6 5 25 61 91 19 -3 -18 37 0 -174 -72 -142 -2 24 -169
7578 -169 25 57 -54 -190 -158 -8 -42 -93 -158 101 42 47 -103 -152 5 28 66 -19 -16 60 104 136 -114 79 9 4 2
7605 2 -125 -92 -155 113 73 -37 -3 -21 72 -64 -109 31 -103 150 -191 7 60 -4 10 -7 -101 45 14 21 62 -309
7631 -309 -87 -83 -3 -46 -116 -33 -2 150 22 64 -144 -61 18 -90 -25 -87 123 -36 53 3 48 15 -99 130 107 -1
7657 -1 22 70 39 -120 -48 49 -65 -69 -22 4 -54 54 -134 138 41 -46 26 9 -35 -40 211 32 29 127 -125 -156 119 -193
7685 -193 95 55 -160 -34 -63 91 -172 -98 120 18 -26 -66 -71 43 -28 -10 -31 40 -12 -131 -88 -81 55 -6 71 66
7711 66 -150 66 -92 -10 -164 -51 10 -104 1 38 -44 139 51 -29 -49 43 -69 30 117 -107 179 127 -30 -94
7735i4K09p3Roj16J35qk7P9k22M8K6p2N3J1J15j55J7N6K65Ql55L1J43j18R8K8
7762H5j90J30j31J35Nj7Nj1j22j7O1P0k13J66m2Q1L7o6P4Lj90J26k9O0Mj45J63
7789C2j0j55J01L8Rn4m4L5Q1j56J93k3l0J40K0j75P8Ko7k5R7J6p0j39Q3n1J03
7816B9P5rk5k7M6j78J13r2O0n4J46j5J59j70n7q6J10n3K2J80k40n3Q1m9M4j0J
7843e2JkJ0L6J01n6P6m4p0q3J33m7k09Q6R4j0o9J83J3j35J02nm4o4j9J04j52n9
7871a81J73J35r0j42R4j22K41q7m5J33o8q7R7n1j72M6J22j9r5J88j2j33J60j47
7895f2L01k08n0N4j04J58P1n7j28MJ40r4Mj7o6L8K5Rj24J40j02Q3j9j02J20LO5
7922H2m9j52J41M6L4Rk07J11m6J55j58K5K30k78J32r6J29j01m6m4l7J33n8m4o5
$$ plain form
7735 -94 115 42 51 45 -71 64 56 29 108 -114 -66 -40 -112 -59 -48 67 -88 -71 -15 250 258 -97 -66 77 -41 57 85
7762 85 -105 25 -106 29 34 17 22 11 -111 -128 -67 3 -210 -44 -86 -5 32 -34 40 43 -147 -21 -50 10 14 -131 32
7789 32 22 -133 -32 6 15 -39 -83 -48 33 -123 70 47 17 157 177 2 80 82 15 -10 87 103 33 -106 -23 -74 29
7816 29 104 95 70 43 89 -89 24 -68 -8 -62 84 69 228 58 1 -85 25 -28 -6 174 -66 -119 -38 -87 -43 -53 -52
7843 -52 -51 -53 -43 -7 94 38 114 70 0 -83 50 3 -206 -120 -26 -36 -105 78 91 -44 58 53 9 -55 -74 30 -122 -181
7871 -181 -8 127 37 -105 -11 -133 108 21 -24 109 41 -46 51 0 -172 -126 -4 -23 -118 70 58 -75 85 -62
7895 -62 239 31 -19 35 -69 89 160 103 -25 -21 119 25 29 12 -54 -16 9 18 -106 34 -68 15 -4 -106 14 17 82
7922 82 33 -119 22 68 102 111 -96 15 -31 124 -34 -9 221 -57 75 -21 108 7 -39 -83 -120 13 -45 -89 -154
7947a54K35j61j21K39qN6l0J28r9j50Q9k8n4L7J20o6j34K76j27J7j14k6J72N1
7971A48k16OJ46J5p0j25m6J20k8j1k4P0n6J58j89J6j7J10rJ78j83LL3p0L8p4J46
7998F9j21J00k27J86j14Q4n9K0J48j1l5j03J0J83k57N8Q5j7J66l37K85j85J03
8021C1l6L0q8J56m3j15N5P2RK5j94J32q3J44r4j39J21M7jLj63J42j43J9J08n8
8047f3nJ71j35k2N7qJ45l09K11j73J03N7jo9p7J91jpL0j49J11j03R6j32J85J8
8073A21j14R7j43K6Q4p8M6n2P5R6k17Qo2K33n7k04J17P8Q3q8j11J33L1j00M6M8
8099I6q0m4L7r9J67j46R2j26R2o0J74k44L8J70j59Mq8M67l65O2Q7j21J21p1l0
8124b6q7J13j71J84o2J15M2Oj27J00q7K3L9r1J8M2m2m4J23l20K02N7J9mkm9O8
$$ plain form
7947 -154 81 -80 -201 38 30 86 56 184 85 -65 24 -4 -58 -21 99 33 -101 175 48 65 -49 -75 97 148
7971 148 -68 -62 84 99 29 -96 -142 -22 -50 -61 -85 -15 -71 87 -102 -86 -103 7 -2 176 -7 -4 29 -41 -3 -77 69
7998 69 -52 48 -179 7 -107 -23 -82 -62 86 75 40 -63 -53 130 -127 -69 16 -1 165 -172 113 -72 31
8021 31 -5 25 -63 93 50 -65 -10 62 71 96 -98 34 -49 95 1 -138 -17 30 29 32 -131 11 -132 -113 -5 -63
8047 -63 -68 103 -32 -54 3 -5 140 -169 42 -131 -28 29 28 -41 -118 73 72 65 95 -54 57 -46 50 -82 103 121
8073 121 7 104 -39 -13 71 -7 39 -13 62 158 -59 -51 -113 120 63 -141 -24 54 137 49 -62 71 102 2 48 96
8099 96 16 -28 9 -90 77 -69 23 -103 -11 -71 103 -141 -103 67 -92 -88 -176 291 -74 -12 75 -46 75 4 -26
8124 -26 -113 0 -171 13 -49 66 108 114 -13 87 0 23 62 -29 -11 31 -11 -55 68 -252 -50 7 26 22 20 -29 39
8151C9J0j26L2l1J12j7j55J09M2K8J7j69m5K46j86Q3J55j54J89p8o7j22k9K75
8175A58j89m0O9K3n5K1L4J83j22j96J62p6N9PRQ7
$$ plain form
8151 39 49 -77 -45 -76 36 19 -136 -27 15 43 60 -109 -154 92 -94 -11 144 -10 179 101 34 -88 -117 158
8175 158 -31 -71 -2 21 -34 -13 21 204 82 -114 48 -28 31 38 47 134
8191A34
$$ Imaginary data points
##PAGE= N=2
##DATA TABLE= (X++(I..I)), XYDATA
0@%%%%%%%%%%%qJ6j6J6k4L2m0M8n6O9p9R2j11J33j52J76k06K36k69L08l52M00
33B13m50N06n72O44p23Q05q95R97j106J226j359J504j662J835k023K229k455K703
51A417k979L285l626M006m435M926n490O147o922P857r008J0461j2362J4968j8774
66a0529K4859l6107O3491k48242l06572N54610N0575k11384K20146J59116k34067
77B5896K0359J29095p9350J1887Q7055j68753o6078J04470p5953j213K15893j34605
89F8703k78342J38303J02317k48771L3271K76625j14541k18013J54915R1034j29373
100a23872Q3549J37232j27678p7626Q5760K6363N5463Q6341q5071m9814J15289
111A25936n9921j43023J56389J07427k10407l6724J47654j08521p3678J85475
$$ plain form
0 0 0 0 0 0 0 0 0 0 0 0 0 -8 8 -8 8 -16 16 -24 24 -32 37 -42 50 -61 72 -80 96 -110 126 -143 165 -187 213
33 213 -237 269 -303 341 -382 423 -472 525 -581 645 -714 790 -872 963 -1060 1169 -1286 1417
51 1417 -1562 1723 -1903 2103 -2332 2594 -2896 3251 -3671 4186 -4822 5639 -6723 8245 -10529
66 -10529 14330 -21777 41714 -206528 -513100 41510 92085 -119299 100847 259963 25896
77 25896 46255 175350 96000 107887 194942 26189 -39889 64581 -11372 -12585 203308 68703
89 68703 -209639 -71336 30981 -217790 -184519 92106 -22435 -240448 -85533 5501 -123872
100 -123872 -40323 96909 -30769 -108395 -22635 3728 59191 145532 60461 10647 125936
111 125936 66015 -77008 79381 186808 -23599 -60323 87331 -21190 -94868 90607
121I0607k2207j94479O0297Q7531j04005Q403J11391k5174k4094K1416o4829J9486
133c5657J19452n3544p3252J05781q027j31840Q0484J19012j11120o4990R7881
144D4180l0364j04547O4571P4677n5580k2209K1634l0971O04L9468j6306l262
156a8105L8171k7972k7232O7914J6617n7808M5177M7774j01127l3617J12274M24
168F2490q7291L3526M0448o0294j9211K8947j5271j062J0226m1895j219M9633
180i73k4971k5323O2649J414o8943K9496N5491l6172m127N8129j3430m2295K7008
193A7953K2708j8503L001N975j5892J660J281j9714J1344J4141m2758j9957M0626
206A865p369m5588K9762M4342m0012l4823L6784J7514k6693K283K4888L775n834
$$ plain form
121 90607 68400 -126079 -65782 21749 -82256 -73853 37538 12364 -11730 9686 -55143 -35657
133 -35657 83795 30251 -43001 62780 54753 -77087 3397 122409 11289 -53701 44180
144 44180 13816 -90731 -26160 48517 -7063 -29272 -7638 -38609 -38005 1463 -14843 -18105
156 -18105 20066 -7906 -35138 32776 49393 -8415 36762 84536 -16591 -50208 62066 62490
168 62490 -24801 8725 49173 -11121 -30332 -1385 -16656 -17718 -7492 -49387 -50606 -973
180 -973 -25944 -51267 11382 12796 -56147 -26651 28840 -7332 -11459 46670 33240 -9055 17953
193 17953 40661 22158 25159 31134 15242 16902 18183 -1531 9813 23954 -18804 -38761 1865
206 1865 -5504 -51092 -21330 23012 -17000 -51823 -15039 2475 -24218 -21935 2953 6728 894
219H94N49J3362J8694j2527k4160J8321J4627l4959l924M7545p319m6421J9554
232D236K8168m3133k4857L8490N750m0934l132L5175O856k5497l481K8213K811
245H665l5203k152M6036K744m2050J7555N0369k4204m2927L2345L0892m0728k4177
258b2835L9641J2859l9454k761L8743p506m5402K133L5156j4445l7201K2991L9431
271B1350k6126l0124L7424K5919m5639k3181N0622J9258m8824l096N9784M293
283D1660n3214M327M7396j9649n2601K2521M6098k9143l6990L8053L0744m6423
295g221k9435M1279R584n2237l220N4283o32m4110J7359M8712k2520m8160K5455
308a0863M0921l2750l2420M5092L7042l9826k2345M8035J1062n9023j2242M8833
$$ plain form
219 894 1443 14805 33499 20972 -3188 15133 29760 -5199 -9123 38422 31103 -15318 4236
232 4236 32404 -10729 -35586 2904 8654 -32280 -35412 -237 6619 -18878 -22359 5854 8665
245 8665 -26538 -28690 17346 20090 -21960 -4405 45964 21760 -21167 11178 42070 1342 -22835
258 -22835 16806 29665 -9789 -12550 26193 18687 -26715 -24582 10574 -3871 -41072 -18081 21350
271 21350 -4776 -34900 2524 28443 -17196 -40377 10245 29503 -19321 -22417 37367 41660
283 41660 -11554 -7227 40169 20520 -32081 -9560 36538 7395 -29595 8458 39202 -7221
295 -7221 -36656 4623 14207 -38030 -41250 13033 12401 -31709 -14350 34362 11842 -36318 -10863
308 -10863 30058 -2692 -35112 9980 47022 7196 -15149 32886 43948 -15075 -27317 21516
320B1516l569m9485J1311M9581j4028m2454J8726L0358l3586l2574L2573K4730
332A3099l3466j0205M7147J1633m2346K15M1369j1668m2218J7977M2442j9435
344A4544l2661L0809L0767l5400k9653L0610J5020m0311j3806L9660O475l8040
356b1986J182L5678j0104l7986J1448L3243j5990k6849K7463K9637k4078j7208
368a5550L1417J1309l5546n762L7135K66l4570Q451L4194j1305l3452R784K4098
381B0469j9799k9030J6790K3950j8363k1005K2238J8589k5724j7322K6202J1702
393H697k4670j104L0396J356k2828R653K3943j2063j9800J1982J3626j2664r956
406c432J2461R874j3959j5024P823Q441j5336j1724J8131Q545k2304m104K4665
$$ plain form
320 21516 17947 -31538 -20227 29354 15326 -27128 -8402 21956 -11630 -44204 -11631 13099
332 13099 -20367 -30572 16575 28208 -14138 -13923 27446 15778 -26440 -8463 33979 14544
344 14544 -18117 12692 43459 8059 -21594 9016 24036 -16275 -30081 9579 16054 -21986
356 -21986 -20804 14874 4770 -33216 -21768 11475 -4515 -31364 -3901 25736 1658 -15550
368 -15550 15867 27176 -8370 -14132 23003 23269 -11301 -2850 31344 20039 -13413 -3629 20469
381 20469 670 -28360 -11570 12380 -5983 -26988 -4750 13839 -11885 -29207 -3005 8697
393 8697 -15973 -17077 13319 14675 -8153 1500 25443 13380 -6420 5562 19188 6524 -3432
406 -3432 9029 18903 4944 -10080 -2257 6184 -9152 -20876 -2745 5800 -16504 -20608 4057
419D057q7k0696N103J5428p372p644J2133J0974k176n451q84N370J424r114J325
434B390J3700n302j5492R530J1358j6518r029J4941o085k3375O905J9323n647
447c301p394R091K238p919l717K009J0452N450j2850r80K3268j188k0257J9199
461A4101J8574l5315j8625L0039J932k3639J5443J8761k1186j4707J0488M498
473C64k876n412p197R284N227j8341J0506L5920j7599l4517K7331J7892l9699
486a9117J523N0204r123l9118J6700K1257k1204p521J7937J294j6137j4571J855
499a6021K4008M582k7259N754K4875l3810k7514N3563K3013n2900J720M6881k5240
512A652l2363M3635K2581l7504q948J9807j901m609M263O619J1648j7838l6836
$$ plain form
419 4057 3970 -16726 -11623 3805 -3567 -11211 922 11896 9720 4269 3385 8755 10179 1065 2390
434 2390 16090 10788 -4704 4826 16184 -334 -9363 5578 -507 -23882 -16977 2346 -3301
447 -3301 -10695 -1604 634 -7285 -11002 -8993 1459 6909 -5941 -6921 16347 15159 -5098 14101
461 14101 32675 -2640 -21265 8774 10706 -12933 2510 21271 85 -14622 -4134 364
473 364 -2512 -7924 -15121 -5837 -610 -18951 -8445 27475 9876 -24641 2690 20582 -19117
486 -19117 -17594 32610 23487 -15631 1069 22326 1122 -6399 11538 12832 -3305 -17876 -16021
499 -16021 7987 12569 -14690 -8936 15939 -17871 -45385 8178 31191 -21709 -19989 26892 1652
512 1652 -30711 12924 35505 -1999 -10947 8860 6959 2350 6613 13232 24880 7042 -29794
525b9794K0604L3372l5309j4585N2725j1424o3980K7668N4075l6883k7993L8378
537F854j442l7999J5571L6815l54j3344p918J52Q446q279q390L1011J0870m7369
551a5376m097N0492j4174m2032L7445K4340o2041j8375N5186K937l3633J9671
563C43J8632k9544j6173J6278J4923N255j3006j2924K0085O707k7689J7930M3442
576D4259l4760m3675M0118J9166m5326J2581M9690k9954m2886K6884J8530k3188
588h561N03J7281o807j4597n491Q439K3952k216k9067Q196K1945k8368j0931N0992
602B5270P273m9718N953L4606k5956j8786L9037Q238l6531k268J9235l191k856
615C06N430k411k284j1586j5780K0043K5983k2915j3710L1088p198l7777K4675
$$ plain form
525 -29794 -9190 24182 -11127 -25712 27013 15589 -48391 -20723 33352 -3531 -31524 6854
537 6854 5412 -32587 -17016 19799 19445 6101 -1817 -1665 6781 -1498 -9888 21123 31993 -15376
551 -15376 -19473 31019 16845 -25187 12258 36598 -25443 -43818 11368 14305 -19328 343
563 343 18975 -10569 -26742 -10464 4459 9714 -3292 -16216 3869 10576 -17113 817 44259
576 44259 9499 -34176 5942 25108 -20218 -7637 42053 12099 -30787 -3903 14627 -8561
588 -8561 -8058 9223 2416 -12181 -17672 -9233 14719 12503 -16564 -8368 13577 -14791 -25722 25270
602 25270 32543 -17175 -11222 23384 -2572 -21358 17679 25917 -10614 -12882 6353 3162 306
615 306 5736 3325 1041 -10545 -26325 -6282 19701 -3214 -16924 14164 6966 -30811 -6136
628f136L6705l0703k0908K8716Q94k0889J7261J8499j3534q913k859o725R805
641A213P480j1828N797J0826k3832q519L1302j546k9151J2972J4393k8284k865
654b2042L3738J24j7752P775N34j3037O509Q017k865Q245K27j7672P417J9226
668A8444j4135q866J8564r106k4858J6638J8587j5919k921J4242j2387j4416J0148
681e985M409m315N687j532o312R449J310j1031J2070J0694k3513p014K5996n54
695I359j6974J6783J3195k2823r407J5164k17q556K869J511j012L70n070L508
709a300J1693j1396j6653J4890Q149k1709L950K8962q481k3087J4939J4725j7999
722c317p560J7137M598j3725l676J2214Q626r624j0460J0488O722k0546p481K4738
$$ plain form
628 -6136 30569 -134 -21042 7674 8568 -12321 4940 23439 9905 992 -1867 -8592 1213
641 1213 8693 -3135 2662 13488 -10344 -18863 12439 10893 -18258 -5286 9107 -19177 -22042
654 -22042 11696 11820 -5932 1843 2377 -10660 -4151 3866 1001 9246 9473 -8199 -782 18444
668 18444 4309 -4557 14007 4901 -19957 -3319 15268 -651 -3572 10670 -1717 -16133 -5985
681 -5985 -1576 -5891 -204 -1736 -8048 1401 2711 -8320 3750 14444 -9069 -16083 9913 9359
695 9359 -7615 9168 22363 -460 -9867 5297 5080 -3476 -607 904 -108 262 -4808 -1300
709 -1300 10393 -1003 -17656 -2766 5383 -16326 -12376 16586 8105 -14982 -43 14682 -3317
722 -3317 -10877 6260 10858 -2867 -6543 5671 14297 4673 -5787 4701 11423 -9123 -16604 8134
736H134K819k5533M886K3794j2792k0943J7598J4602j9942r298K0180O601j5607
749e501j227J7068K051j7839k836J8960J402k0722L239K3344q537k4144J3148
762a594J9696k0126j6717K1013R036k2174l440K1622L09k0747J597J8535m404
775B606j8126Q571K0735q603j7483J5855J7009j9695j4286K2018Q753k4293m503
788a1442K6019J001k5173K387K1918r169k3934R426J9915j3558j7049J7946J5940
801A4227j9163j1981K0374P634k2414l682K5044J694k2362N561K3900q314k2402
814a1884J1306J9276j5532j6986J7368J4298j8981j1480J8951O287k2729n290
826a5396K0715N53k1085M116K0758o255j8227R904J6156j2354j3014J5663J2387
$$ plain form
736 8134 10953 -14580 -9694 14100 1308 -19635 -2037 12565 -7377 -16675 3505 10106 -5501
749 -5501 -6728 10340 12391 -5448 -8284 10676 12078 -8644 -5405 17939 9402 -14742 -1594
762 -1594 18102 -2024 -18741 2272 11308 -10866 -14306 7316 7625 -13122 -11525 7010 2606
775 2606 -15520 -6949 13786 5183 -12300 3555 20564 869 -13417 8601 17354 -6939 -11442
788 -11442 14577 15578 -9595 -7208 14710 5541 -18393 -8967 10948 -2610 -19659 -1713 14227
801 14227 -4936 -16917 3457 11091 -11323 -15005 10039 11733 -10629 -5068 18832 10518 -11884
814 -11884 -578 18698 3166 -13820 3548 17846 -1135 -12615 6336 12623 -10106 -15396
826 -15396 5319 5872 -15213 -11097 9661 3406 -14821 -4917 11239 -1115 -14129 1534 13921
839A3921j5197p559J8422O001j9244l524J8157j115j8925L704J7600o522j6278
852a0559Q204J3184j2355j3737J1748J0029j2760o950J6154N830j4833j836J4594
865F713j243j4239L614J3373l047r872O880J1066p223j0888O746P124j0963q143
879a0102J1844O108j1963k718J1707n18j2689J97R433l013p859M522Q920k241
893A628n217M818N995n251p185N411O767n446l758Q920L746r779k923Q595k154
908D167j0617J234P107l586m578M245N012k550n518r57L987l38n697M105J0571
923F587l637p978Q516P107j0056l714R466j790q921L434Q610j135m198o66J494
938C119j786p553j862R919O58j2275K754J3599o647j1186J1755P761j5662n218
$$ plain form
839 13921 -1276 -8835 9587 15588 -3656 -7180 10977 9862 -9063 -5359 12241 5719 -10559
852 -10559 -2355 10829 -1526 -15263 -3515 6514 -6246 -13196 2958 8788 -6045 -7881 6713
865 6713 5470 -8769 -5155 8218 5171 -4701 2179 13245 6022 -4866 1880 9004 -1959 -10102
879 -10102 1742 7850 -4113 -6831 4876 4358 -8331 -8134 1299 -1714 -9573 -5051 3869 1628
893 1628 -3589 1229 7224 1973 -5212 199 6966 1520 -2238 6682 10428 649 -2274 6321 4167
908 4167 -6450 -5216 1891 -1695 -6273 -2028 2984 434 -5084 -6041 -2054 -2392 -8089 -3984 6587
923 6587 2950 -5028 3488 10595 539 -3175 6291 4501 -4420 -986 7624 6489 2291 1625 3119
938 3119 1333 -6220 -8082 1837 2495 -9780 -7026 6573 -74 -11260 495 8256 -7406 -12624
952a2624J4975L042q734L766R541k892r078n70Q157K583r528k833J1718j529j5294
967i300P194J7254j3083j6963J3328P364j7307K01J9551k583j5592L078J0340
980C482k322n859K642Q001j272j1934K227J7432k549j6320Q673J1765j8401q959
994a3394K3032M794k1096P52J4682j0198j2121J2165J0132j0132r005N677P665
1007B953l352o007Q032Q605j4195j2169J8257J1927j7425j528K0927p874k3319
1020a5168J2364J9977j4533j2959J4052L965j5653l64J5690K729j3411p736P990
1033c057N288j0450n55J9230o7k4403L006K4217p591j7792J6468J1345k3820o848
1047a5029K4526N216j6300L56R500o948j1042M485J2822R31j4010l871J3158j324
$$ plain form
952 -12624 2351 5393 -3341 425 9966 7074 -2004 -2574 5583 8166 -1362 -4195 7523 5994 -9300
967 -9300 -2106 15148 2065 -14898 -1570 5794 -11513 -11312 8239 5656 -9936 -6858 3482
980 3482 1160 -4699 -2057 5944 4672 -7262 -5035 12397 9848 -6472 2201 13966 -4435 -13394
994 -13394 9638 14432 -6664 -5912 8770 -1428 -13549 -1384 8748 -1384 -10389 -4712 2953
1007 2953 -399 -6406 1626 10231 -3964 -16133 2124 14051 -3374 -4902 16025 8151 -15168
1020 -15168 -2804 17173 2640 -10319 3733 7698 -7955 -8319 7371 10100 -3311 -11047 -3057
1033 -3057 2231 -8219 -8774 10456 10389 -14014 -11008 13209 5618 -12174 4294 15639 -8181 -15029
1047 -15029 9497 14713 -1587 -1231 8269 1321 -9721 -5236 7586 8517 -5493 -9364 3794 2470
1061B470j5189J0778J7650j8165j8111J9684J1347j7472K627J9630j0107j9437
1073a4295R477J3508m694m238M580J214n625n998N163J2382n075j5897N332J0301
1087F135j3254m096K2893M19k4901K375J5987r791o672J7128L448j5289j676Q368
1101A074K397O51j003j874J923n128p341J2911J2185j4727o944J3993o301j6691
1115a4875J3753J4573j5684q059J2063j944p644Q013O183n156m507m269N86R745
1129B778J923n858O034L070j5233n38J8311k773j3625P857N396j3262O72J3921
1143H673k772q249J947k095m115M809J261k87O451m529j1657P059R227r675l65
1158d317J2609p043j2297J1614R640q399n30M154p234l144N098P60K348K984p488
$$ plain form
1061 2470 -12719 -1941 15709 -2456 -20567 -883 10464 -7008 -4381 15249 5142 -14295
1073 -14295 -4818 8690 3996 -242 4338 5552 -73 -6071 -908 11474 6399 -9498 -4166 6135
1087 6135 -7119 -11215 11678 12097 -12804 -10429 5558 -4233 -10905 6223 9671 -5618 -7294 1074
1101 1074 3471 4122 3119 1245 3168 -1960 -9301 3610 15795 1068 -5876 8117 1816 -14875
1115 -14875 -1122 13451 -2233 -10292 1771 -173 -7817 196 6379 1223 -3284 -7553 -6967 2778
1129 2778 4701 -1157 4877 7947 -7286 -7824 10487 7714 -5911 1946 7342 -5920 -5248 8673
1143 8673 5901 -2348 -401 -2496 -6611 -1802 -541 -828 5623 1094 -10563 -3504 5723 -3952 -4317
1158 -4317 8292 1249 -11048 566 10206 1807 1277 5431 -1803 -4947 151 911 3259 6243 -1245
1173a245l045Q456l469q875R543M806j4679r54J4234k871p991R201M020j0658
1187c527l471N974K334j8R2n17L080m77o822M020R293q949j0623J0844N028j2710
1203f449K507J4166o898j2525O979O132q104k072P094J295m333k421L675O525
1217E571l534p319O577O673j1687l891J5864P21j5135M032J2301q936r370J0228
1231B095N723j0334m446P999K511o991k309P321J956r111k355J1614J379j1789
1245f737K692J2856o133j2268R559J1083j1334p493J3139M417j2799j757J2106
1258G331p85j2313L13J0629j720j0326L279J0874m704j1946O053J0574r899r060
1272a1700J2507P374j3163k280J4539N31j3860J374J2542l836j1419N830J1363
$$ plain form
1173 -1245 -4290 4166 697 -8178 1365 6171 -8508 -9462 4772 1901 -6090 3111 7131 -3527
1187 -3527 -6998 -1024 1310 1292 1384 867 3947 3470 -3352 668 9961 1012 -9611 1233 6261 -6449
1203 -6449 -3942 10224 3326 -9199 -2220 3912 -4192 -6264 830 2125 -2208 -4629 -954 5571
1217 5571 2037 -5282 1295 7968 -3719 -7610 8254 8975 -6160 -2128 10173 1237 -8133 2095
1231 2095 7818 -2516 -6962 1037 3548 -3443 -5752 1569 3525 -5586 -7941 3673 5052 -6737
1245 -6737 -4045 8811 2678 -9590 -31 11052 -282 -7775 5364 9781 -3018 -4775 7331
1258 7331 6546 -5767 -5454 5175 3455 -6871 -3592 7282 2578 -9368 -3315 7259 -2640 -11700
1272 -11700 807 8181 -4982 -7262 7277 7808 -6052 -4678 7864 4028 -7391 -1561 9802
1285I802n800r872O937Q569r701q805R683O065j1931l676J2705K153j2424M82
1299e813J1695l725j1504N089J0736o115q049R153P551r216n603R531L495j0453
1313c228k249J0720J122j0229R69J0283l276j0388L528Q371o218p704P858N956
1327E515p956l882Q480K068q952j382Q999L16q285K512R335k868q140M448P398
1342G606o442o780O708N352p407l851Q005K509q460k110P450j92q059R66P390
1357B685j522o424L060O435l528n620M252M834m797l951O268M105o219j886O302
1372C994N20o421k08N287p16m975J068M410q48m769M06L915j890m856K412M934
1388B263k874l366M567K587m882j344M390M97l384O53L440J52k137j80K417L6
$$ plain form
1285 9802 4002 -5870 1067 9636 -65 -8870 813 6878 -5053 -8729 3976 6129 -6295 -5813
1299 -5813 5882 2157 -9347 -4258 6478 363 -7686 1467 9018 -198 -5801 3730 7225 -3228
1313 -3228 -5477 5243 6365 -3864 -2895 7388 4112 -6276 -2748 5623 -595 -8299 -441 5515
1327 5515 -2441 -6323 2157 4225 -4727 -6109 2890 3206 -5079 -2567 6768 3900 -4240 208 7606
1342 7606 1164 -5616 1092 6444 -963 -4814 3191 5700 -2760 -4870 2580 2388 -5671 -4705 2685
1357 2685 1163 -5261 -2201 4234 706 -4914 -662 4172 -625 -4576 1692 5797 -422 -2308 3994
1372 3994 4514 -1907 -2115 3172 2456 -2519 -1451 2959 2111 -2658 -2252 1663 -227 -5083 -2671 2263
1388 2263 -611 -3977 590 3177 -1705 -3049 1341 1838 -1546 -893 2547 2699 562 382 2799 2835
1404B835m000j191M230J79m722J845M960l460n075L787K520m895j309M439N86
1419G29k873M59L005P92j929k129K106K024l875p96O526Q27p249J659O793m918
1435A151n726N984K844p283j250O141M38m059Q0K737m71l728j507M958L012o356
1451c035r64Q245j273q780N239Q566q002o204Q865K781q255Q96Q116k695p091
1466c591J293M201l80l741J34M968n45q261J610J0154l872r957O951P276j0412
1481d172l217J3550Q57j1960K244Q186m816n328N886M604m056m844J777N322j363
1496B670o435L148O665q219p922J1473O965j2488j569J2329m936j2415Q389J0134
1510G789q424n089P218J707n050k6M981K382m675o459M489P017o490l848J1573
$$ plain form
1404 2835 -1165 -2356 1874 2053 -2669 -824 4136 676 -4399 -612 1908 -2987 -4296 143 729
1419 729 -2144 -1685 1320 2112 183 -1946 160 2184 -1691 -2487 4039 4866 -2383 -724 6069 1151
1435 1151 -4575 1409 4253 -3030 -4280 1861 2299 -1760 -1680 1057 586 -3142 -4649 309 3321 -3035
1451 -3035 -3999 4246 2973 -5807 -568 7998 -4 -6208 2657 5438 -2817 -1921 6195 3500 -3591
1466 -3591 -2298 1903 1523 -2218 -2084 2884 2339 -5922 -4312 5842 1970 -7987 -1036 6240 -4172
1481 -4172 -7389 6161 7018 -4942 -2698 5488 672 -4656 1230 5834 1778 -3066 -1289 4033 2670
1496 2670 -3765 -617 6048 -2171 -10093 1380 8345 -4143 -5712 6617 1681 -10734 -2345 7789
1510 7789 -635 -5724 1494 3201 -1849 -1875 3106 5488 813 -5646 -1157 5860 -630 -4478 7095
1525G095M8j5619K603J4067o684r572R932M481j2482p54J1213j1o611J61K207
1540G4o98k422J08O670L267q898l790R853l96j0118O952J0012j2127q073J2656
1555C070L264j0566L716P834q146p039N511M402p40j024j249J209M23n622J588
1570c369J0604m132j1164P177P379j0195o79J3984l283j3050M418O389o312p96
1584c029P684o75n194j444J90L766J963n059n68M870n419n481J0989O476j1773
1599b704k132R234m776o930R123N059p825j594M084j744k87K831j146L49K50n903
1615d111J91Q441k350n706O109R18j0542J847J0375l546n557N466m37n945L417
1630a430M734k262l10k60l699K694M158l819P05M982n563n867P092K853o695J828
$$ plain form
1525 7095 7143 -8476 -5873 8194 1510 -8062 1870 6351 -6131 -6885 4328 4317 -2294 -2133 74
1540 74 -624 -3046 -2938 3732 6999 -1899 -5689 4164 3768 -6350 602 10614 -1513 -9586 3070
1555 3070 6334 -4232 -516 7318 -828 -7867 -2356 2046 1306 282 -967 242 665 -4957 -3369
1570 -3369 7235 3103 -8061 -884 6495 -3700 -4379 9605 6322 -6728 -2310 4079 -2233 -3029
1584 -3029 4655 3980 -1214 -2658 -2468 1298 3261 -1798 -2366 2504 -2915 -8396 2593 9069 -2704
1599 -2704 -4836 4398 -378 -7308 1815 6874 -951 -2545 1539 -205 -492 2339 1193 1542 1792 -4111
1615 -4111 -3920 4521 2171 -3535 2574 3492 -7050 -5203 5172 1626 -3931 1535 1098 -4847 -1430
1630 -1430 3304 1042 732 472 -3227 -533 3625 -194 511 5493 -70 -5937 1155 4008 -2687 -859
1646h59N466n783l498N572J053k826J254p90k783J684J085p86M281P93o932L71
1662b698O015l656l091P148O92q360J852O741l067l082L704m92m121m2J399J997
1678I39J389l062j754M183j405n493M698N810p049m204Q044J176o572K506O401
1693E607m453n356L648L399k196j518J765K068k453l724K407M961l887n170N110
1708B08L700p372j467R209m90q875K102O614l912m322N301M006m937k826L730
1723F69K875l102k852L461K721n211k462O978J723p676l7P140l392p389N315O138
1739D899n990l995O400K409o399j216O009P21n753m69N927Q33n523P47O405k126
1755B879p381L074O749m754n628O430L810p377j995P580k3p762J168N870j855
$$ plain form
1646 -859 4607 -1176 -4674 898 1951 -875 379 -411 -3194 -1510 -425 -1211 3070 3863 -3069 -2698
1662 -2698 3317 -339 -3430 3718 4410 -3950 -2098 4643 1576 -1506 2198 1706 -2415 -2457 -1058 939
1678 939 2328 -734 -2488 1695 290 -5203 -505 5305 -1744 -5948 2096 3272 -3300 -794 5607
1693 5607 1154 -4202 -554 2845 649 -869 896 2964 511 -3213 -806 4155 268 -4902 208
1708 208 3908 -3464 -4931 4278 3788 -5087 -2985 3629 -283 -4605 696 4702 -235 -3061 669
1723 669 3544 442 -2410 1051 3772 -1439 -3901 3077 4800 -2876 -2913 4227 835 -6554 -1239 4899
1739 4899 -1091 -5086 1314 3723 -2676 -3892 2117 2838 -2915 -3384 2543 3376 -2147 -1400 5005 2879
1755 2879 -4502 -1428 5321 567 -5061 1369 5179 -2198 -4193 3387 3364 -4398 -3230 2640 785
1770G85n352K870N640k778n291L191N227m348n009N675M676o347l088P574J786
1785E211p697o9O603j959o411K929N565l227m409L286L794m381l547M376K670
1800B734n116j799O348J231o371M20O212j457o150K398N760l180m536M284L820
1815D598m476l036L916K337m925j531M399J134m657k97M948r19m662J363M225
1830B417k343l712L165L696l652k252M121J714m263j295M172R28m348l5M256j51
1846B418m109N51L498j331l787J487L051j826k694K600K094k404j772K505Q91
1861A172k573l18K684L59k222K38K404l75k597P74K397j291k147J621K246j854
1877E18k235K045J224k587j103K004J027j804l75J818M16j726p33J835L60j874
$$ plain form
1770 785 -4567 -1697 3943 1165 -4126 -935 4292 -56 -5065 610 5286 -1061 -4149 3425 5211
1785 5211 -2486 -2555 4048 2089 -4322 -1393 4172 945 -3464 -178 3616 -765 -4312 64 2734
1800 2734 -2382 -4181 2167 3398 -2973 -2553 3659 2202 -3948 -1550 4210 1030 -3506 778 4598
1815 4598 122 -2914 1002 3339 -1586 -3117 1282 2416 -2241 -2538 2410 1491 -3171 -1808 2417
1830 2417 74 -3638 -473 3223 -429 -2681 1440 3154 -1109 -2404 1768 2696 -1652 -1687 2569 2418
1846 2418 -1691 -1140 2358 1027 -2760 -1273 1778 -48 -2742 -142 1952 -452 -2224 281 1172
1861 1172 -1401 -1719 965 1324 -898 -660 1744 1369 -1228 -454 1943 652 -1495 126 2372 518
1877 518 -1717 328 1552 -1035 -2138 -134 893 -911 -1286 532 948 -778 -1511 324 684 -1190
1893a190k55K711N2k251J079K283j680k262K059J250k475o52K258O50k245n28
1909a196J827O55k605j071K518J114l167j43M222m85m456J449M034k372l015K959
1925B68K425k767j401K738J172k232j537J925J233k803j354L882J277m634o24
1940b432M938j238n211K771M612m021l629M682K237m168n34L741J63l513m62L200
1956A136J413l014j153L813M63n252P90N722k292n703M066L780n716j704O419
1971B768O3n913O88M172k022k283K187K514r71l310L66M322p32m771K478M749
1987D305m997m334P357L075p443o57O461k952n938M557M627l825k703K335J233
2002A101j718j290J726K714k584m609L744N084n080k558P777m74r189K477Q094
$$ plain form
1893 -1190 -1445 1266 1318 -933 146 2429 749 -1513 546 1796 -679 -1331 927 1577 -668 -1196
1909 -1196 631 1286 -1319 -2390 128 1242 -1925 -2068 2154 1669 -2787 -1338 2696 324 -2691 268
1925 268 2693 -74 -1475 1263 2435 203 -1334 591 1824 -979 -2333 1549 2826 -1808 -2432
1940 -2432 2506 1268 -3943 -1172 3440 -581 -4210 472 2709 -1459 -1993 1748 1911 -1602 -2064 1136
1956 1136 2549 -465 -1618 2195 2658 -2594 -1804 3918 1626 -4077 -11 3769 -1947 -3651 2768
1971 2768 2831 -3082 -2394 1778 -244 -2527 -340 2174 1203 -2107 -1741 2581 1849 -2922 -444 4305
1987 4305 -692 -5026 2331 5406 -2037 -2694 3767 815 -5123 -566 4061 236 -2467 -132 1101
2002 1101 -617 -1907 -181 2533 -51 -4660 -916 4168 -912 -3470 4307 3833 -5356 -2879 5215
2017E215m083m814N736J743o341m4M594M90k449j808P95J653j392k021M662K608
2033D544p173k178P538j073o521N094N249p205l077P084P17m935K103K691l062
2048b04k194J111K117J848j524l081K731R41n357J387P108l278o972M935L668
2063C236o099N00O732k871n561K758K400j743R70J287j000k80j345q55L480J357
2079B966m778N72M549m602k995O960J799p155P39M323l754j914M700J001l301
2094h90m7n6k79K148j61j743K255j52m259K161N078k875l120M029m39n387K869
2111h68M327k891j982K376j348j497J910M80n73J032k016k045L538J554l226J165
2127f4K956m370k228M875J238l521J507J796k836j021K523L12o53K59j657n47
$$ plain form
2017 5215 1132 -3682 2054 3797 -2544 -2588 2006 2496 47 -1761 -966 687 -705 -2726 1936 4544
2033 4544 -2629 -4807 2731 1658 -4863 231 5480 -1725 -4802 2282 2999 -1936 167 2858 -204
2048 -204 -2398 -1287 830 2678 1154 -1927 804 1745 -3612 -2225 4883 1605 -5367 -432 3236
2063 3236 -2863 -2363 4369 1498 -4063 -1305 1095 -648 322 1609 609 329 -1016 -1871 1609 2966
2079 2966 -1812 -1240 3309 -1293 -4288 2672 4471 -2684 -1945 2378 -1376 -3290 1410 2411 -890
2094 -890 -937 -993 -1272 876 715 -1028 1227 1075 -3184 -1023 4055 1180 -1940 2089 1650 -3737 -868
2111 -868 3459 568 -1414 962 -386 -1883 27 507 -66 966 -1050 -3095 443 1997 -1229 -64
2127 -64 2892 -1478 -3706 1169 2407 -1114 393 2189 -647 -1668 855 1167 514 773 -884 -1431
2143a431K089r32o41L018m08m924J295L744k509j590M274j33m531Q37L728r67
2159I19j404J097j95r15j69J6K056J290k822j641L034k59l663K477L668m057l000
2176c568M444N53l485J242L074k183k938J787J813j95p51L37Q87o10k261Q70M119
2193C135j814l881K769K814m312q99N182m58n341J197L642k199k045K730J315
2208A835k326j546J266J860r28j857J736K056k928k197M616J731m973JM684k098
2224I32m017L272L592l887k116L129Q71k826p66K561Q90k820j316L152J046l261
2240a564o41M357p30m735J685M797k768l281M043J731m201p39L820M65l454k38
2256a453K983q3k760L75L074o15l855P95L736j887l343K962K774l593j901L783
$$ plain form
2143 -1431 658 -274 -915 2103 1695 -3229 -1934 1810 -699 -2289 1985 1852 -2679 -1842 1886 919
2159 919 -485 612 417 -498 -667 -651 1405 2695 -127 -1768 1266 1007 -2656 -179 3489 -568 -3568
2176 -3568 876 1429 -2056 -814 2260 77 -2861 -1074 739 544 -207 130 1017 407 -1854 -984 3135
2193 3135 1321 -2560 209 3023 -1289 -2188 2994 2536 -2805 -1608 2034 -165 -2210 520 1835
2208 1835 -491 -2037 -771 1089 161 -1696 40 2096 -832 -3029 1587 3318 -1655 -1654 3030 932
2224 932 -3085 187 3779 -108 -2224 905 1776 -1050 -1816 745 1635 -1185 -2501 651 1697 -1564
2240 -1564 -2205 2152 1422 -3313 -1628 3169 401 -2880 1163 2894 -1307 -2046 1774 2239 -1215 -1453
2256 -1453 1530 1447 -1313 -938 2136 1521 -2334 -1539 2197 310 -3033 -71 2703 -890 -2791 992
2272I92R09l699M3L412n91k968R09K984p86k349O40K392j569k203K057K041k638
2289d24j567L166P79l332l42L099o21l087J082L093j478k195J937J960k264j652
$$ plain form
2272 992 1901 -1798 -1755 1657 1066 -1902 -993 1991 1205 -1144 -504 1888 319 -1884 173 2214 -424
2289 -424 -1991 1175 1954 -1378 -1720 1379 758 -2329 -1247 1846 368 -1827 110 2070 -194 -1846
$$ [...]
8191I6
##END NTUPLES=NMR FID
##END=
