##TITLE=1H_SR13_K
 CDCl3, 8 sc, 
 25.2.2020
##JCAMPDX= 6.0         $$ Bruker NMR JCAMP-DX V2.0
##DATA TYPE= NMR FID
##DATA CLASS= NTUPLES
##ORIGIN= UXNMR, Bruker Analytische Messtechnik GmbH
##OWNER= root
$$ XWIN-NMR		Version 3.5
$$ Tue Feb 25 14:19:27 2020 Russian Standard Time (UT+4h)  she@DPX200
##.OBSERVE FREQUENCY= 200.1315
##.OBSERVE NUCLEUS= ^1H
##.DELAY= (6, 6)
##.ACQUISITION MODE= SIMULTANEOUS
##.ACQUISITION SCHEME= undefined
##.AVERAGES= 8
##.DIGITISER RES= 18
##SPECTROMETER/DATA SYSTEM= spect
##.PULSE SEQUENCE= zg30
##.SOLVENT NAME= MeOD
##.SHIFT REFERENCE= (INTERNAL, MeOD, 0, 15.7039)
##AUDIT TRAIL= $$ (NUMBER, WHEN, WHO, WHERE, WHAT)
$$ ##TITLE= Audit trail, XWIN-NMR		Version 3.5
$$ ##JCAMPDX= 5.01
$$ ##ORIGIN= Bruker BioSpin GmbH
$$ ##OWNER= she
$$ F:/spectra/data/she/nmr/H-F/1/audita.txt
$$ ##AUDIT TRAIL=  $$ (NUMBER, WHEN, WHO, WHERE, WHAT)
(   1,<2020-02-25 14:18:06.26 +0400>,<she>,<DPX200>,
      <created by zg, POWCHK disabled, PULCHK disabled
       configuration hash MD5:
       00 E9 B6 7A A2 85 ED C7 34 08 36 98 17 FE 4E 26
       data hash MD5: 16K
       D4 E9 EA 8A 91 7D D6 57 33 21 07 2A 71 70 47 5F>)
$$ ##END=
$$ 
$$ hash MD5
$$ 75 6F 58 78 03 35 5D 0B 79 E3 37 BD 12 A8 9E 50
##$RELAX= 
##$RELAX= 
##$RELAX= 
##$RELAX= 
##$RELAX= 
##$RELAX= 
$$ Bruker specific parameters
$$ --------------------------
##$DU= <F:/spectra>
##$EXPNO= 1
##$NAME= <H-F>
##$PROCNO= 1
##$TYPE= <nmr>
##$USER= <she>
##$AMP= (0..31)
100 100 100 100 100 100 100 100 100 100 100 100 100 100 100 100 100 100 
100 100 100 100 100 100 100 100 100 100 100 100 100 100 
##$AQSEQ= 0
##$AQ_mod= 1
##$AUNM= <au_zg>
##$AUTOPOS= <>
##$BF1= 200.13
##$BF2= 200.13
##$BF3= 200.13
##$BF4= 200.13
##$BF5= 200.13
##$BF6= 200.13
##$BF7= 200.13
##$BF8= 200.13
##$BYTORDA= 1
##$CFDGTYP= 0
##$CFRGTYP= 5
##$CHEMSTR= <none>
##$CNST= (0..31)
1 1 145 1 1 1 1 1 1 1 1 1 1 1 1 1 1 1 1 1 1 1 1 1 1 1 1 1 1 1 1 1 
##$CPDPRG= <>
##$CPDPRG1= <>
##$CPDPRG2= <>
##$CPDPRG3= <>
##$CPDPRG4= <mlev>
##$CPDPRG5= <mlev>
##$CPDPRG6= <mlev>
##$CPDPRG7= <mlev>
##$CPDPRG8= <mlev>
##$CPDPRGB= <>
##$CPDPRGT= <>
##$D= (0..31)
0 1.2 0 0 0 0 0 0 0 0.06 0 0.03 0 0 0 0 0.0002 0 0 0 0 0 0 0 0 0 0 0 0 
0 0 0 
##$DATE= 1582625885
##$DBL= (0..7)
120 120 120 120 120 120 120 120 
##$DBP= (0..7)
150 150 150 150 150 150 150 150 
##$DBP07= 0
##$DBPNAM0= <>
##$DBPNAM1= <>
##$DBPNAM2= <>
##$DBPNAM3= <>
##$DBPNAM4= <>
##$DBPNAM5= <>
##$DBPNAM6= <>
##$DBPNAM7= <>
##$DBPOAL= (0..7)
0.5 0.5 0.5 0.5 0.5 0.5 0.5 0.5 
##$DBPOFFS= (0..7)
0 0 0 0 0 0 0 0 
##$DE= 6
##$DECBNUC= <off>
##$DECIM= 24
##$DECNUC= <off>
##$DECSTAT= 4
##$DIGMOD= 1
##$DIGTYP= 9
##$DL= (0..7)
0 120 120 120 120 120 120 120 
##$DP= (0..7)
150 150 150 150 150 150 150 150 
##$DP07= 0
##$DPNAME0= <>
##$DPNAME1= <>
##$DPNAME2= <>
##$DPNAME3= <>
##$DPNAME4= <>
##$DPNAME5= <>
##$DPNAME6= <>
##$DPNAME7= <>
##$DPOAL= (0..7)
0.5 0.5 0.5 0.5 0.5 0.5 0.5 0.5 
##$DPOFFS= (0..7)
0 0 0 0 0 0 0 0 
##$DQDMODE= 0
##$DR= 18
##$DS= 0
##$DSLIST= <SSSSSSSSSSSSSSS>
##$DSPFIRM= 0
$$ [...]
##$SUBNAM2= <"">
##$SUBNAM3= <"">
##$SUBNAM4= <"">
##$SUBNAM5= <"">
##$SUBNAM6= <"">
##$SUBNAM7= <"">
##$SUBNAM8= <"">
##$SUBNAM9= <"">
##$SW= 24.9337058887773
##$SWIBOX= (0..15)
0 0 2 0 0 0 0 0 0 0 0 0 0 0 0 0 
##$SW_h= 4990.01996007984
##$TD= 16384
##$TD0= 1
##$TE= 0
##$TE2= 300
##$TE3= 300
##$TEG= 300
##$TL= (0..7)
0 120 120 120 120 120 120 120 
##$TP= (0..7)
150 150 150 150 150 150 150 150 
##$TP07= 0
##$TPNAME0= <>
##$TPNAME1= <>
##$TPNAME2= <>
##$TPNAME3= <>
##$TPNAME4= <>
##$TPNAME5= <>
##$TPNAME6= <>
##$TPNAME7= <>
##$TPOAL= (0..7)
0.5 0.5 0.5 0.5 0.5 0.5 0.5 0.5 
##$TPOFFS= (0..7)
0 0 0 0 0 0 0 0 
##$TUNHIN= 0
##$TUNHOUT= 0
##$TUNXOUT= 0
##$USERA1= <user>
##$USERA2= <user>
##$USERA3= <user>
##$USERA4= <user>
##$USERA5= <user>
##$V9= 5
##$VALIST= <valist>
##$VCLIST= <CCCCCCCCCCCCCCC>
##$VD= 0
##$VDLIST= <DDDDDDDDDDDDDDD>
##$VPLIST= <PPPPPPPPPPPPPPP>
##$VTLIST= <TTTTTTTTTTTTTTT>
##$WBST= 1024
##$WBSW= 4
##$XGAIN= (0..3)
0 0 0 0 
##$XL= 0
##$YL= 0
##$YMAX_a= 257419
##$YMIN_a= -122377
##$ZGOPTNS= <>
##$ZL1= 120
##$ZL2= 120
##$ZL3= 120
##$ZL4= 120
##$ABSF1= 10
##$ABSF2= 0
##$ABSG= 5
##$ABSL= 3
##$ALPHA= 0
##$AQORDER= 0
##$ASSFAC= 0
##$ASSFACI= 0
##$ASSFACX= 0
##$ASSWID= 0
##$AUNMP= <proc_1d>
##$AZFE= 0.1
##$AZFW= 0.1
##$BCFW= 1
##$BC_mod= 2
##$BYTORDP= 1
##$COROFFS= 0
##$CY= 11.3945322036743
##$DATMOD= 1
##$DC= 2
##$DFILT= <>
##$DTYPP= 0
##$F1P= 16.9975609425685
##$F2P= -3.02152046262296
##$FCOR= 0.5
##$FTSIZE= 0
##$FT_mod= 4
##$GAMMA= 1
##$GB= 0.15
##$INTBC= 1
##$INTSCL= 1
##$ISEN= 128
##$LB= 0.24
##$LEV0= 0
##$LPBIN= 0
##$MAXI= 10000
##$MC2= 0
##$MEAN= 0
##$ME_mod= 0
##$MI= 1.114404
##$NCOEF= 0
##$NC_proc= 0
##$NLEV= 6
##$NOISF1= 3.799351
##$NOISF2= 2.8
##$NSP= 1
##$NTH_PI= 0
##$NZP= 0
##$OFFSET= 15.70392
##$PC= 1
##$PHC0= -9786.501
##$PHC1= 12.20082
##$PH_mod= 1
##$PKNL= yes
##$PPARMOD= 0
##$PSCAL= 0
##$PSIGN= 0
##$REVERSE= no
##$SF= 200.130013532006
##$SI= 16384
##$SIGF1= 3
##$SIGF2= 2
##$SINO= 400
##$SIOLD= 16384
##$SREGLST= <1H.CDCl3>
##$SSB= 0
##$STSI= 0
##$STSR= 0
##$SW_p= 3612.71676300578
##$SYMM= 0
##$S_DEV= 0
##$TDeff= 0
##$TDoff= 0
##$TI= <>
##$TILT= no
##$TM1= 0
##$TM2= 0
##$TOPLEV= 0
##$USERP1= <user>
##$USERP2= <user>
##$USERP3= <user>
##$USERP4= <user>
##$USERP5= <user>
##$WDW= 1
##$XDIM= 8192
##$YMAX_p= 0
##$YMIN_p= 0
$$ End of Bruker specific parameters
$$ ---------------------------------
##NTUPLES= NMR FID
##VAR_NAME=  TIME,          FID/REAL,        FID/IMAG
##SYMBOL=    X,             R,               I
##VAR_TYPE=  INDEPENDENT,   DEPENDENT,       DEPENDENT
##VAR_FORM=  AFFN,          ASDF,            ASDF
##VAR_DIM=   8192,          8192,            8192
##UNITS=     SECONDS,       ARBITRARY UNITS, ARBITRARY UNITS
##FACTOR=    0.0002004,     1,               1
##FIRST=     0,             0,               0
##LAST=      1.6414764,     0,               0
##MIN=       0,             -122377,         0
##MAX=       1.6414764,     257419,          0
$$ Real data points
##PAGE= N=1
##DATA TABLE= (X++(R..R)), XYDATA
$$ [...]
2079B130P00M94J33J21o87p10n45n0l73O76P35J61L26l6J68o24j124n88r8J69
$$ 2130 2830 3324 3457 3578 2891 2181 1636 1586 1213 1889 2624 2785 3111 3075 3243 2619 1495 907 809 978
2099I78J75R52P32J3l86J1q60p56l51M4k2M91R77L40l06j41o04m45o60n42J53
$$ 978 1153 2105 2837 2850 2464 2475 1615 859 508 552 530 1021 1998 2338 2032 1891 1287 842 182 -360 -207
2120b07N92M51K12N76m72k35p51k63o46r5L27M24O4M03N91m42o72p00n9j64m26
$$ -207 385 836 1048 1624 1152 917 166 -97 -743 -838 -511 -87 -23 380 971 529 -143 -843 -902 -1066 -1492
2141a492l0J113N20k18O12m76r92l14m95k30K05J46Q06N18M0r0o20m63p82l79
$$ -1492 -1522 -409 111 -107 505 29 -963 -1277 -1772 -2002 -1797 -1651 -845 -327 -287 -377 -997 -1460 -2242 -2621
2161b621K22N00K34K75O77j1p88r0k53n81j98o1N55K33L35Q55p3o36p51L4m97
$$ -2621 -2399 -1899 -1665 -1390 -713 -724 -1512 -1602 -1855 -2436 -2634 -2695 -2140 -1907 -1572 -717 -790 -1426 -2177 -2143 -2640
2182b640j72M28K55N95J71K81J18o96n23j07l22j21L75P08O80j94JJ08j8r57j56
$$ -2640 -2812 -2384 -2129 -1534 -1363 -1082 -964 -1660 -2183 -2290 -2612 -2733 -2358 -1650 -970 -1164 -1163 -1055 -1073 -2030 -2186
2203b186j53K63J65P74O25J7K5n11l8o14m98K55N48K34O97J82L55k22q9m78o80
$$ -2186 -2339 -2076 -1911 -1137 -512 -495 -470 -981 -1019 -1633 -2131 -1876 -1328 -1094 -397 -215 140 -82 -171 -649 -1329
2224a329k19L92N10N53L53L73l5n0o82J52m79L7O3P54L30K92L1J66k24o44k63
$$ -1329 -1548 -1156 -646 -93 260 633 598 548 -134 18 -461 -424 -361 393 723 1015 1046 1212 988 344 81
2245H1n3J70J98O09P62p1J50r3j54n47l54j71K24O25L36N85k9l0q2m53q63J36
$$ 81 28 198 396 1005 1767 1696 1846 1753 1599 1052 698 527 751 1376 1712 2297 2268 2238 2156 1703 840 976
2267I76J28k0O84M11N35l66Q9k25n12o04n2K82L29N11lM51N9o16l48m90j31R2
$$ 976 1104 1084 1768 2179 2714 2348 2437 2212 1700 1096 1044 1326 1655 2166 2163 2614 2673 2057 1709 1219 1088 1180
2289A180J35K59M12J62K43k09m04n85k13m02J80N41J35M02k46M0j27n65k69l99
$$ 1180 1315 1574 1986 2148 2391 2182 1778 1193 980 578 758 1299 1434 1836 1590 1630 1503 938 669 270
2309B70J01J9K74J05L28J49j37j87n55n50k11J09j57P68l4L06k20j41k57p49o62
$$ 270 371 390 664 769 1097 1246 1109 922 367 -183 -394 -285 -442 326 292 598 378 237 -20 -769 -1431
2330a431L56Q8J56J51K99L43J40q68q9l05m69k73L31N22j72O03L05n46p23K47
$$ -1431 -1075 -987 -831 -680 -381 -38 102 -766 -855 -1160 -1629 -1902 -1571 -1049 -1221 -618 -313 -859 -1582 -1335
2350a335o09k12m3M96N41j48j5M89o42m8n91K62q9m84Q74K9L85PJ70k12m12m43
$$ -1335 -1944 -2156 -2199 -1703 -1162 -1310 -1325 -836 -1478 -1526 -2117 -1855 -1944 -2428 -1554 -1525 -1140 -1133 -963 -1175 -1587 -2030
2372b030J72j75J29L03J015k45k56J04m1o51l67J21L18K99J10M82J53J69o58J29
$$ -2030 -1858 -2033 -1904 -1601 -586 -831 -1087 -983 -1024 -1675 -2042 -1921 -1603 -1304 -1194 -712 -559 -390 -1048 -919
2392i19k51m66J56N85L86j8O19p6Q7m74j56j7l27q2K58Q55J63J10N4p2l57l15
$$ -919 -1170 -1636 -1480 -895 -509 -527 92 16 103 -371 -527 -544 -871 -953 -695 160 323 433 487 415 58 -257
2414b57K26m4l48O10O45J89j66J53j83l94m67L71L9l06M06O04K14j54n7o6l20
$$ -257 -31 -75 -423 187 832 1021 855 1008 825 431 -36 335 374 68 474 1078 1292 1138 1081 1015 695
2435F95o14L23K67Q4K04O49P8m19k00J1k98j35l63N14L93P8Q3L10j73n86qP9n65
$$ 695 81 404 671 755 959 1608 1686 1267 1067 1078 780 645 282 796 1189 1267 1350 1660 1487 901 893 972 407
2458D07j07P22J26k30R6O29l16m30m07J51k41j2Q1P77K04p99L09K48q68l78K91
$$ 407 300 1022 1148 918 1014 1643 1327 897 490 641 400 388 469 1246 1450 651 960 1208 340 -38 253
2479B53J22l37K54P12r7l78j93J51k24m38R9K7K97J80N9L80l92l94n1j0l78l4
$$ 253 375 38 292 1004 907 529 336 487 263 -175 -76 -49 248 428 487 867 475 81 30 20 -358 -392
2501c92K01K20J7J36K83j91l44k36J98j74l49K50K96K52o2M0J01n42m29L67j40
$$ -392 -191 29 46 182 465 274 -70 -306 -108 -282 -631 -381 -85 167 105 145 246 -296 -725 -358 -498
2522d98l9J94L99M3j4k19L26l81j90l76K87k1Q7K27M39n86K02K34m83l00j85M18
$$ -498 -537 -343 56 99 85 -134 192 -189 -379 -755 -468 -489 -402 -175 264 -322 -120 114 -369 -669 -854 -436
2544d36J15nkL85L7l40j60M5m07j86M93L80m2k98M12j53j73o12O86j99k79J41
$$ -436 -321 -326 -328 57 94 -246 -406 -361 -768 -954 -461 -81 -123 -421 -9 -162 -335 -947 -261 -460 -739 -598
2566e98M48M6l01K53L49o63l36j04M46l62M52J9J86J24k35Rl9k97j88K67K79j43
$$ -598 -150 -104 -405 -152 197 -466 -802 -906 -460 -822 -370 -351 -165 -41 -276 -267 -306 -603 -791 -524 -245 -388
2588c88j1M37k36O1j85q0j69k84L68M38l13J6K01J80k62j50J23l52Q1L9M36Q0
$$ -388 -399 38 -198 -137 -322 -402 -571 -855 -487 -49 -362 -346 -145 35 -227 -377 -254 -606 -525 -486 -50 30
2610C0m25K87L34j87n56J70j29K98m45N85N6l0O7q6l6L4n59O14k37M26k69O27
$$ 30 -395 -108 226 39 -517 -347 -476 -178 -623 -38 18 -12 55 -31 -67 -33 -592 22 -215 211 -58 569
2632E69j99k98l9J74k70j0j42M48J03j05o9M28k55k95M29j20o3l42O79K6k19J96
$$ 569 370 72 33 207 -63 -73 -215 233 336 231 162 590 335 40 469 349 286 -56 623 649 430 626
2654F26L01l51k55l36L41N2L4k7K88k40J44J13P2J0m96J29L43n68K56L68k17p2
$$ 626 927 576 321 -15 326 378 412 385 673 433 577 690 762 772 276 405 748 180 436 804 587 515
2676E15J17k9j64q5L2j01K49n3J26O8k68K6M8Q4K4m16L57n0J85j14m0k03m6o5
$$ 515 632 603 439 354 386 285 534 481 607 675 407 433 481 565 589 173 530 480 665 551 511 308 262 197
2700A97J70N8l03M72K04m62L38j84l80O5o5O1P0R9m34M67J96m28j2J03m05k0N1
$$ 197 367 425 122 594 798 336 674 490 110 175 110 171 241 340 -94 373 569 141 129 232 -173 -193 -142
2723a42K35j27K03r6L02l26q1J85l59j77j79M63j55j57O44m2m81p9k23L53j82
$$ -142 93 -34 169 73 375 49 -32 153 -206 -383 -562 -99 -254 -411 233 191 -290 -369 -592 -239 -421
2744d21j05L52j91K25j42J94j2k24m33K60L97l6k73J9J87k00K16j56n2p4K18k42
$$ -421 -526 -174 -365 -140 -282 -88 -100 -324 -757 -497 -100 -136 -409 -390 -203 -403 -187 -343 -395 -469 -251 -493
2766d93M6j23R3J20J51o0L98k29p1n50M51P1j58M87k35P1j12j45p1J47j49J26
$$ -493 -447 -570 -477 -357 -206 -266 132 -97 -168 -718 -267 -196 -354 133 -102 -31 -143 -288 -359 -212 -361 -235
2788b35q7K29J61l50J55p9q6k38L76j45K04K50j98m8Q9Q5j28j70K4k27J66K87
$$ -235 -322 -93 68 -282 -127 -206 -292 -530 -154 -299 -95 155 -43 -91 -2 83 -45 -215 -191 -418 -252 35
2810C5Q7m74L17n4J68j38J87l99R9J61j75K90l30K04R4J24l80k4J49k59J81J7
$$ 35 122 -352 -35 -89 79 -59 128 -271 -172 -11 -186 104 -226 -22 72 196 -184 -208 -59 -318 -137 -120
2832a20q0nQ0l7o2n9K65j57n1o6J8k0O41l38l62N24l21J26m8p5j30L30j1j71J81
$$ -120 -200 -205 -125 -162 -224 -283 -18 -175 -226 -292 -274 -294 347 9 -353 171 -150 -24 -72 -147 -277 53 42 -129 52
2857E2o6K4o1n3R5j58L63o0j68j6J04j48K45j67M1J43k95J14K06k41J77o1o8J22
$$ 52 -14 10 -51 -104 -9 -167 196 136 -32 -48 56 -92 153 -14 27 170 -125 -11 195 -46 131 70 2 124
2881A24j46J83m4K02l22J88rK00k91M4L36l09K62l34K62J45k29R0k78K08L74j87
$$ 124 -22 161 117 319 -3 185 176 376 85 129 465 156 418 84 346 491 262 352 74 282 656 469
2903D69j32Oj06L70j84L21p8j80k45P3K41K59k55q8mJ31o5O2j40K52p7j21J91
$$ 469 337 343 237 607 423 744 666 486 241 314 555 814 559 471 467 598 533 595 455 707 630 509 700
2926G00k38J63O0ok65L5q5J32j56L47m03K16j74J98K31l10k31J32K12j68j9l12
$$ 700 462 625 685 679 414 449 364 496 340 687 284 500 326 524 755 445 214 346 558 390 371 59
2948E9K84J65j28j67l1J58M1m52j08M37k85j56K21k32q8K93J09k46p5J49l9l71
$$ 59 343 508 380 213 182 340 381 -71 -179 258 -27 -183 38 -194 -282 11 120 -126 -201 -52 -91 -462
2970d62K77j53j04J66P0J28j93j40j95k6J08N6n8J78k69J08J5k55j20K51n1j63
$$ -462 -185 -338 -442 -276 -206 -78 -271 -411 -606 -632 -524 -468 -526 -348 -617 -509 -494 -749 -869 -618 -669 -832
2992h32J6q2J62J87k78J17Q4j60K8k1J12k57K2K58K61k07k41R1JK3J70j80j76
$$ -832 -816 -898 -736 -549 -827 -710 -626 -786 -758 -779 -667 -924 -902 -644 -383 -590 -831 -740 -739 -716 -546 -726 -902
3015i02M67m92K06P8r0J00r7K34k17J22k08J62J72j16L43j26k1J00q4J47l86K31
$$ -902 -435 -927 -721 -643 -733 -633 -730 -496 -713 -591 -799 -637 -465 -581 -238 -364 -385 -285 -369 -222 -608 -377
3037c77P3J03j83K92j4J45k69J55K28l62L8J89J59L7M0J1p5k22M04k65J14K21
$$ -377 -304 -201 -384 -92 -106 39 -230 -75 153 -209 -171 18 177 214 254 265 190 -32 372 107 221 442
3059D42k51K84j26P5j53K24j10m5l6L72j76k48M95J6l16J45N2n4j29O9M71j17
$$ 442 191 475 349 424 271 495 385 340 304 676 500 252 747 763 447 592 644 590 461 530 1001 884
3081H84j72J95m3Rp5j98K84l46J64L0j79M8Q3P0l2r0k54K57K6R5m8o0L04l69j16
$$ 884 712 907 864 873 798 600 884 538 702 732 553 601 684 754 722 632 378 635 661 756 708 648 952 583 467
3106D67J17k61J42L5n8M0J45K6k53J6l18Q5K38k11j36L54k46J14L4m1Lm3k78L3
$$ 467 584 323 465 500 442 482 627 653 400 416 98 183 421 210 74 428 182 296 330 289 292 249 -29 4
3130DJ6k40L75j55j03lM64m31O8l08K48r1K21j26J77k17j09K11Q8n25l0K68m7
$$ 4 20 -220 155 0 -103 -106 358 -73 -5 -313 -65 -156 65 -61 116 -101 -210 1 89 -436 -466 -198 -245
3153b45k11M19m9j0l93M39m3k89Pj43K39k24R9p7J20L7Q5j73q1k22k19K14L55
$$ -245 -456 -37 -86 -96 -489 -50 -93 -382 -375 -518 -279 -503 -404 -481 -361 -324 -239 -412 -493 -715 -934 -720 -365
3176c65Pk33J27K7K26m17p2J27o7n8L2rL07o4O4l04R7j39K38J2J03n7J66k03p3
$$ -365 -358 -591 -464 -437 -211 -628 -700 -573 -640 -698 -666 -675 -368 -432 -368 -672 -575 -714 -476 -464 -361 -418 -252 -455 -528
3201e28M85m36m06Q93l96n8L31j37K3m2j88J65J3jq3q2J74p9K5L67l29j31P0K0
$$ -528 -43 -479 -885 8 -388 -446 -115 -252 -229 -271 -459 -294 -281 -282 -365 -447 -273 -352 -327 40 -289 -420 -350 -330
3225c30K38l1k38J10K8k1N19m60jJ56K8m50K65J61lj25K59Nj25J72l03O7k14L03
$$ -330 -92 -123 -361 -251 -223 -244 275 -185 -186 -30 -2 -452 -187 -26 -29 -154 105 110 -15 157 -146 -79 -293 10
3249A0K04o3K18l51QM18m87j60J23M60j16q4J18K2p3M32j32m76L00o3R1j7r7K98
$$ 10 214 151 369 18 26 444 -43 -203 -80 380 264 180 298 320 247 679 547 71 371 308 399 382 285 583
3273E83n5L8l19J86j21j40M1L01n5P0j39L75j2m19j4L58P0Nj74J02j16M7j35L58
$$ 583 528 566 247 433 312 172 213 514 459 529 390 765 753 334 320 678 748 753 579 681 565 612 477 835
3297H35k78n4J37J14p4k07J36K73j21l22j10J80p6j86Q7M8J62j48J90Pj07Q6j23
$$ 835 557 503 640 754 680 473 609 882 761 439 329 509 433 247 334 382 544 396 586 593 486 572 449
3320D49k7j15k08L12k24K47Nk99J33k94L11k56L13k07j00R3K57j10q4k91Q6j42
$$ 449 422 307 99 411 187 434 439 140 273 -21 290 34 347 140 40 133 390 280 196 -95 -9 -151
3342a51K37k59NM12j86j22q7j76K6n7P7k38L44k97N8K85k30L7J12j79j42K5qK5
$$ -151 86 -173 -168 244 58 -64 -151 -327 -301 -358 -281 -519 -175 -472 -414 -129 -359 -322 -210 -389 -531 -506 -514 -489
3366d89K1r2K52l67J83m19L60j77LnJ83l28K58M50k60k62Q1K2j99J67r2J59K46
$$ -489 -468 -560 -308 -675 -492 -911 -551 -728 -725 -730 -547 -875 -617 -167 -427 -689 -608 -586 -785 -618 -710 -551 -305
3389c05k99J68j05K0j98K26l27K56r9K19j15P2N2N0j04p6j25L58K8j81n1J73J81
$$ -305 -604 -436 -541 -521 -719 -493 -820 -564 -663 -444 -559 -487 -435 -385 -489 -565 -690 -332 -304 -485 -536 -363 -182
3412a82k5k55K26J76k90Np1L19j30L33jj73kK46j18k16K57r5k6K5k6J62l04L9
$$ -182 -207 -462 -236 -60 -350 -345 -416 -97 -227 106 105 -68 -70 176 58 -158 99 4 -22 3 -23 139 -165 -126
3436a26J53K48k38j49M56n5r7L42k60l1L74m91n5L57k81M19p2J94l06J72nRk84
$$ -126 27 275 37 -112 344 289 192 534 274 243 617 126 71 428 147 566 494 688 382 554 549 558 274
3459B74J05J50K2R0j1o5J39j45k41R2m3L38j69j77N76on68J92p4k21K52j13J80
$$ 274 379 529 551 641 630 565 704 559 318 410 367 705 536 359 935 929 361 553 479 258 510 397 577
3482E77j59K9K19n2l14J09j95J9K81j94Q6M6N2k52J2Q7l4k38k95L91n0K3J59j19
$$ 577 418 447 666 614 300 409 214 233 514 320 406 452 504 252 264 351 317 79 -216 175 125 148 307 188
3506A88q8O3J70k78l01K61Jl3M1J99j6k15R5m14r0J00J41o7n4K63l7kk3k39m5
$$ 188 100 163 333 55 -246 15 16 -17 24 223 207 -8 87 -327 -417 -317 -176 -243 -297 -34 -71 -73 -96 -335 -380
3531c80K8J6m0J59j00Q5R0j6m75L00o1J49Mk11L7L8lJ57k0J8j96J75l30J96j49
$$ -380 -352 -336 -376 -217 -317 -232 -142 -158 -633 -333 -394 -245 -241 -452 -415 -377 -380 -223 -243 -225 -421 -246 -576 -380 -529
3556e29J22J44N7o6K34M1k69m39M16j92Q7R9j19K54M4L0p25N03l3P8p7J66J03
$$ -529 -407 -263 -206 -272 -38 3 -266 -705 -289 -481 -394 -295 -414 -160 -116 -86 -811 -308 -341 -263 -340 -174 -71
3579g1m2j76M12m44k08L45j77j17K65J76k89J14M16m31k03M11l02Q5J00J5K91
$$ -71 -113 -289 123 -321 -529 -184 -361 -478 -213 -37 -326 -212 204 -227 -430 -19 -321 -236 -136 -121 170
3600A70j02j57J92j04J08k53j17J74R1n4J40j54K54k68j44J63p5O8K47k91J17
$$ 170 68 -89 103 -1 107 -146 -263 -89 2 -52 88 -66 188 -80 -224 -61 -136 -68 179 -112 5
3621En0L17l07L17k44j66K3r3J10J04J52j19K01m01M91k04j48J14K0r5N6Qj48
$$ 5 -45 272 -35 282 38 -128 -105 -198 -88 16 168 49 250 -151 340 136 -12 102 122 27 83 91 -57
3644e7j09K20Q9j38N9j63L51k22O0Q4J79l35J68J68m33M18l33J40K58k06L9j44
$$ -57 -166 54 143 5 64 -99 252 30 90 174 353 18 186 354 -79 339 6 146 404 198 237 93
3666I3K47k60R0r6n1M2J90k3J69j90N9l07N89k25l66q8J36L22j45j1J25j21pR
$$ 93 340 80 170 74 23 65 255 232 401 211 270 -37 552 327 -39 -127 9 331 186 175 300 179 172 181
3690A81K5n1o8%J95k74K05J47m8k54j65K52n6l2K40J18l05J42N3j34J8k87o3P9
$$ 181 206 155 87 87 282 8 213 360 312 58 -107 145 89 57 297 415 110 252 305 171 189 -98 -161 -82
3714h2j64N87K7l85K57m06J90j08k3P5O9j14J39J35M2k59k03J29L3k5j21j09J10
$$ -82 -246 341 368 -17 240 -166 24 -84 -107 -32 37 -77 62 197 239 -20 -223 -94 -61 -86 -207 -316 -206
3737b06NL20k34J71l57N36l94J00p5j18k15q3J17L22M12m75O2q0l09L7M35n2j21
$$ -206 -201 119 -115 56 -301 235 -159 -59 -134 -252 -467 -550 -433 -111 301 -174 -112 -192 -501 -464 -29 -81 -202
3760b02j68K14P7l93R6j9P3K04L7o3J28j92n5O2m39N74j88l9k48J58K05N8k31
$$ -202 -370 -156 -79 -472 -376 -395 -322 -118 -81 -144 -16 -208 -263 -201 -640 -66 -254 -293 -541 -383 -178 -120 -351
3783c51l2L1j29L87k89K40Q6k54J43M6n21M91N3l82L73R7k8n8M9P0J18j14j80
$$ -351 -383 -352 -481 -94 -383 -143 -57 -311 -168 -122 -643 -152 -99 -481 -108 -11 -39 -97 -48 22 140 26 -154
3806a54K57k18l7N4J34Q9p4j32J62j40R8j23J58K41k10j18J02k3j57K64N9J65
$$ -154 103 -115 -152 -98 36 125 51 -81 81 -59 39 -84 74 315 105 -13 89 66 -91 173 232 397
3828C97j56k76L94qJ36k34QjN3q8J43m08M21N4j28J02k97N6L26k74J34N9m11K11
$$ 397 241 -35 359 351 487 253 261 260 313 225 368 -40 381 435 307 409 112 168 494 220 354 413 2 213
3852B13M3n0o7K5j2R8j61J07j09p8M2j94L82j06K77j08j61m3o8P8pj2k0O63l38
$$ 213 256 206 139 164 152 250 89 196 87 9 51 -143 239 133 410 302 141 98 30 108 101 89 69 732 394
3877C94k76K8k13K59l07L08m30K63k54M49Mr3o9j75M00l68j6k13L3M6K52j92K82
$$ 394 118 146 -67 192 -115 193 -237 26 -228 221 225 132 63 -112 288 -80 -96 -309 -276 -230 22 -170 112
3900A12j49k85K94k4k0j70K25k25N5K43k58p8J99jj20M1J15j14L02m0J8k20j21
$$ 112 -37 -322 -28 -52 -72 -242 -17 -242 -187 56 -202 -280 -81 -82 -202 -161 -46 -160 142 102 120 -100 -221
3923b21K12o5r2M8l3P6o6j28J46k0m9j52J12J32kJ21j25J58l00K9L09k28%r9K15
$$ -221 -9 -74 -166 -118 -151 -75 -141 -269 -123 -143 -192 -344 -232 -100 -102 19 -106 52 -248 -219 90 -138 -138 -237 -22
3948b2Mq9m1N5p1J89q5P9j83K43J10L6k06j51L79Rl37Q2o8Jj17J33j29O2j70K86
$$ -22 -18 -107 -148 -93 -164 25 -60 19 -164 79 189 225 19 -132 247 256 -81 1 -67 -66 -183 -50 -179 -117 -287 -1
3974aL20Nm17L51k23K2k13k20N94j9l43R2K1j78P1J15K32l69J84L56j94N9k89
$$ -1 319 324 -93 258 35 57 -156 -376 218 199 -144 -52 -31 -209 -138 -23 209 -160 24 380 186 245 -44
3997d4l4p6N3J06j42L12J26k50M3j29j84L0O7J70%k7m3K71k35M1l56M02j56j33
$$ -44 -78 -154 -101 5 -137 175 301 51 94 -35 -219 -189 -122 48 48 21 -22 249 14 55 -301 101 -55 -188
4021a88%M4K24n57L61j4j78K63K65k39J0N9r5P4J06l0k84m3K14k81L65N5k05N
$$ -188 -188 -144 80 -477 -116 -130 -308 -45 220 -19 -9 50 -45 29 135 105 -179 -222 -8 -289 76 131 -74 -69
4045f9p7J62K47n04M00r4j20j84J56J17N6J91l0j77%K21n32L7M52j28q0q2j3O
$$ -69 -146 16 263 -241 159 65 -55 -239 -83 34 90 281 251 74 74 295 -237 -200 252 124 44 -38 -51 -45
4069d5j62L27q5l65M65K0j12Q2n2m3j56P2J04j92K29j10J07L07m33L25J8j34Q4
$$ -45 -207 120 35 -330 135 155 43 125 73 30 -126 -54 50 -142 87 -23 84 391 -42 283 301 167 251
4092B51n52M50l40K48R2m3r0N3n7K23k81P2n4J32m3j2k87L22o6j52K57j22pO6
$$ 251 -301 149 -191 57 149 106 16 69 12 235 -46 26 -28 104 61 49 -238 84 18 -134 123 1 -6 60
4116F0k25M29o8k02n0J30K25m45j05P3j27L25M6k1l19K6J29j10L67l76QQK32K09
$$ 60 -165 264 196 -6 -56 74 299 -146 -251 -178 -305 20 66 45 -274 -248 -119 -229 138 -238 -230 -222 10 219
4140B19m48KJ01R2jk6r4m8k1L88%n01L00p2L47n58L38j44J39l41L29k27Q6K2J59
$$ 219 -229 -227 -126 -34 -35 -61 -155 -203 -224 164 164 -337 -37 -109 238 -320 18 -126 13 -328 1 -226 -140 -118 41
4165D1J24k06J7j50K12J37k43l2K10m1m87K44J09k09j99N99k33O6K93k19J76l08
$$ 41 165 -41 -24 -174 38 175 -68 -100 110 69 -418 -174 -65 -274 -473 126 -107 -41 252 33 209 -99
4187i9J83m08K22J54o0j25J90J86q5k81K99l67J37J0J98J09j16l02o4k7J27J27
$$ -99 84 -324 -102 52 -8 -133 57 243 158 -123 176 -191 -54 -44 154 263 147 -155 -219 -246 -119 8
4209Hn7K54m47l5L82j37Q0r0J01K12j69l18K39K8l9j00j46N43k77L60k93k96l5
$$ 8 -49 205 -242 -277 105 -32 48 -42 59 271 102 -216 23 51 12 -88 -234 309 32 392 99 -197 -232
4232b32L81J96p00M30l2P0p1K56l34J50k24M53j57j56j94L90Ql08O4k0J65K2j59
$$ -232 149 345 -355 75 43 113 42 298 -36 114 -110 343 186 30 -164 226 234 -74 -10 -30 135 157 -2
4255br5Q4m7k99L85K23m41J77J10o1j2j15K38j39q5M6o5K92m08L13k77Q9J02k57
$$ -2 -97 -13 -60 -359 26 249 -192 -15 95 34 22 -93 145 6 -79 -33 -98 194 -214 99 -178 -89 13 -244
4279b44K75Mj25k08N8N8j13K20kr0J72k3J4q8q4K46Jk70K25j99o2J14J95k01J68
$$ -244 31 35 -90 -298 -240 -182 -295 -75 -77 -167 5 -18 -4 -92 -176 70 71 -199 26 -173 -235 -121 74 -127 41
4304D1k24J3O9j69q8M76m86M95k63R5j05q4J88o0P4K31M4k13J04k61J89Q8k50
$$ 41 -183 -170 -101 -270 -358 118 -368 127 -136 -41 -146 -230 -42 -102 -28 203 247 34 138 -123 66 154 -96
4327i6M3L04j71N7Jj46J47j73J04J69j37K9l6n2J40j08K42l69K8K2J6J78j56L9
$$ -96 -53 251 80 137 138 -8 139 -34 70 239 102 131 95 43 183 75 317 -52 -24 -2 14 192 36 75
4351G5K25j78K41j84k63J5L31j36J14p1p2J26o7M1k69O9J81R8j48k19N51l23k8
$$ 75 300 122 363 179 -84 -69 262 126 240 169 97 223 156 197 -72 -3 178 276 128 -91 460 137 109
4374A09l2k83J25K08r0L7R8M7j67J11j45j2k37J28M5J17K61m34M4pJ65k2j84j5
$$ 109 77 -206 -81 127 37 74 172 219 52 163 18 6 -231 -103 -58 59 320 -114 -70 -77 88 66 -118 -133
4398a33K45k46L87m61J18K34k36rk36J68O7o2P3R9l01J40j9J44k21J47J73j09
$$ -133 112 -134 253 -208 -90 144 -92 -101 -337 -169 -102 -164 -91 8 -293 -153 -172 -28 -249 -102 71 -38
4420c8k6J90l04L9K44o8l8j5K3r1k5j14L17l00J15K96k22J79n6k58j04j25L00
$$ -38 -64 126 -178 -139 105 37 -1 -16 7 -84 -109 -223 94 -206 -91 205 -17 162 106 -152 -256 -381 -81
4443h1j00k6K62k75K26j56O3N8K42j3k80K69j75j2k46K29J69r2J68M9k89k25k3
$$ -81 -181 -207 55 -220 6 -150 -87 -29 213 200 -80 189 14 2 -244 -15 154 62 230 279 -10 -235 -258
4466b58K98l8O7j13K34k27K50l4j25j02l7K09k8m0p7R6L10J01n93K98k9j1K95
$$ -258 40 2 69 -44 190 -37 213 179 54 -48 -85 124 96 56 -21 75 385 486 -107 191 162 151 446
4489D46l79l58M04o1J32k13j59K85j91K8K11J61m21J28J92R9l61J59L93m49k33
$$ 446 67 -291 113 52 184 -29 -188 97 -94 -66 145 306 -115 13 205 304 -57 102 495 46 -187
4510a87j49N07j02K21j84k1M1j88J95k20J91l16M68m61J21J47n8J3J56p6m5J7
$$ -187 -336 171 69 290 106 85 126 -62 133 -87 104 -212 256 -205 -84 63 5 18 174 98 53 70
4532G0K59j60p1n1K3K51k08J89j90K2j66j16L18k28o7J8o0J74k9P8k2j53k33M22
$$ 70 329 169 98 47 70 321 113 302 112 134 -32 -148 170 -58 -125 -107 -167 7 -22 56 34 -119 -352 70
4556G0j45N1k25N05o52N04l83j31O6J75j75M96k56k9P6J38j26M1Lk24J81M3J55
$$ 70 -75 -24 -249 256 -396 108 -275 -406 -340 -165 -340 156 -100 -129 -53 85 -41 0 3 -221 -40 3 158
4579A58k84L04j82q0l8P6k96L35k1K20k7J01m45L0M33k73k20K89j86J30K05j64
$$ 158 -126 178 -4 -84 -122 -46 -342 -7 -28 192 165 266 -179 -149 284 11 -209 80 -106 24 229 65
4601F5j91L43k64K47l43J02j09j18K06q2N70n41K24k31L91j58l10L53j70O0K50
$$ 65 -126 217 -47 200 -143 -41 -150 -268 -62 -144 426 -115 109 -122 269 111 -199 154 -16 44 294
4622B94k61j47N8J3J63J25q2j55K58J05n39J82j06N7l0l0o4m4P0j31Q7O5K22l45
$$ 294 33 -114 -56 -43 120 245 163 8 266 371 -168 14 -92 -35 -65 -95 -159 -203 -133 -264 -177 -112 110 -235
4646b35J42Jr0N1K26k98M2K30l44N3M72l38l3L96j91p1k62K57r6J35j38Kj0J01
$$ -235 -93 -92 -182 -131 95 -203 -161 69 -275 -222 250 -88 -121 275 84 13 -249 8 -88 47 -91 -89 -99 2
4670Bql47K59Q9P3p9n7K18j48q1J50M8m0k36J98j34J51p2m1K5j45K30k6Mk15n6
$$ 2 -6 -353 -94 -5 68 -11 -68 150 2 -79 71 119 79 -157 41 -93 58 -14 -55 -30 -175 55 29 33 -182 -238
4696b38L24j20N5j71K31j63o3O3K25j79J30j87J98j00N8j70j45K43j95J24J90
$$ -238 86 -34 21 -150 81 -82 -145 -82 143 -36 94 -93 105 5 63 -107 -252 -9 -204 -80 110
4717A10O8m9L43l87J75r3j7l02L85k5j5l66O20m85K48L1l70K76k30K94k0k53J0
$$ 110 178 129 472 85 260 167 150 -152 233 208 193 -173 447 -38 210 241 -129 147 -83 211 191 -62 -52
4740e2j02Q1J76n9K20k28P5R2KJ08m61L51j39K86k40j73J53kK20k39k43L12k33
$$ -52 -154 -73 103 44 264 36 111 203 205 313 -148 203 64 350 110 -63 90 88 308 69 -174 138 -95
4763i5p9J43P3l0K8l14L45K3o9p9r1L77k66j31Q0Q5l0Pk3o8R5j29L13j32j41L1
$$ -95 -174 -31 42 12 40 -274 71 94 25 -54 -145 232 -34 -165 -85 0 -30 -23 -46 -114 -19 -148 165 33 -108 -77
4789g7%K15pm46K44J74m71rK63j70K19k6K8j05J24k66K12J64k36K1K8j4k5R3P7
$$ -77 -77 138 131 -315 -71 103 -368 -377 -114 -284 -65 -91 -63 -168 -44 -310 -98 66 -170 -149 -121 -135 -160 -67 10
4814A0rk38n4L23j2j95L7P5j84O3Q3j06J39Q2N0j53K15n8j7qj70L07k37K13r2
$$ 10 1 -237 -291 32 20 -175 -138 -63 -247 -184 -101 -207 -68 14 64 -89 126 68 51 43 -127 180 -57 156 64
4839F4p6j65M16j31O7k29K16l47J42J11o2K27k64m9K07P0Ml66K67J14j70j92J2
$$ 64 -12 -177 239 108 175 -54 162 -185 -43 68 6 233 -31 -80 127 197 201 -165 102 216 46 -146 -134
4862a34L75l31K69L6Lo0r8N6K74j70moM9j86J29j37J14o6m9K24p2j47Q5J51j65
$$ -134 241 -90 179 215 218 158 60 116 390 220 216 210 259 73 202 65 179 113 64 288 216 69 154 305 140
4887A40rJ71k94qK03l42M00l19O2N9J06o3j13K80k12J22k04Q9p6J32K19k74j19
$$ 140 131 302 8 0 203 -139 261 -58 4 63 169 106 -7 273 61 183 -21 68 -8 124 343 69 -50
4910e0K09j37J96k31j47J2J65J59K1p5j54k80L62j7j31J61n1J03N2m64L48k10
$$ -50 159 22 218 -13 -160 -148 17 176 197 122 -32 -312 50 33 -98 63 12 115 167 -297 51 -159
4932a59J8K57k98P5k57N90L4k70j70n5n1M06j17j03l8l1M78n06J07M8L0q8J51
$$ -159 -141 116 -182 -107 -364 226 260 -10 -180 -235 -286 120 3 -100 -138 -169 309 -197 -90 -42 -12 -100 51
4955E1k00J15J1r5J04K3k9P4L9r6j93Ok4L07n3J2Nn30M38K9r3J92j60J48j57Q5
$$ 51 -149 -34 -23 -118 -14 9 -20 54 93 -3 -196 -190 -214 93 40 52 57 -473 -35 -6 -99 93 -67 81 -76 9
4981Iom8J36l88M84k66j58J77K70n37L46k7J53r4j4o1L09o13K42L72l17R6m25
$$ 9 3 -45 91 -297 187 -79 -237 -60 210 -327 19 -8 145 51 37 -24 285 -328 -86 286 -31 65 -360
5004c60O40k76Nj26O5j35K73m4o2J16p0l54N15j90J21j99M32m56o4Q5Q8j45o2
$$ -360 280 4 9 -117 -52 -187 86 42 -20 96 26 -328 187 -3 118 -81 351 -105 -169 -84 4 -141 -203
5027b03QK80k64j28N93k61p5L93l19J61k28l61L38N3j35j2L48k11J08K0k73J14
$$ -203 -195 85 -179 -307 286 25 -50 343 24 185 -43 -404 -66 -13 -148 -160 188 -23 85 105 -168 -54
5049e4j01j23L31k91L71k61J14M4j29j43J69j96L87l12K61J47k52m7J0K32k87
$$ -54 -155 -278 53 -238 133 -128 -14 30 -99 -242 -73 -269 118 -194 67 214 -38 -85 -75 157 -130
5070a30K74j34K44m39L04O4q3qJ74m15L57k88J8K4J70j63k87M21N1j73L3k15N84
$$ -130 144 10 254 -185 119 183 100 92 266 -149 208 -80 -62 -38 132 -31 -318 103 154 -19 14 -201 383
5093C83j39j36l86J08K83m1l68K08J22m1j58M1J51Q7O9m1J29J4l04KN2N5l50L72
$$ 383 244 108 -278 -170 113 72 -296 -88 34 -7 -165 -124 27 114 183 142 271 285 -19 -17 35 90 -260 112
5117A12k12L17j58K16r8K8j41OK41o4n3N7j46l23N45m11j2O4J94j71j17oK42n
$$ 112 -100 217 59 275 177 205 64 70 311 247 194 251 105 -218 327 -84 -96 -32 162 -9 -126 -132 110 105
5141A05P5j35k7j34K91k91j8L20l05J46k65K0J61K10k18j54J09L38m06K2J10K07
$$ 105 180 45 18 -116 175 -116 -134 186 -119 27 -238 -218 -57 153 -65 -219 -110 228 -178 -156 -46 161
5163A61q8k14lO0l8m3K27o3M0k5O9K3m6J16o9l67K88j88J36N1R2l2K3J41l87J55
$$ 161 73 -141 -144 -84 -122 -165 62 -1 39 14 83 106 60 176 107 -260 28 -160 -24 27 119 87 110 251 -136 19
5189A9L9j39QL6j26L3r6J19l5r2P0j37M50o8J80l73J20J24k62k2j86M19q1l4J72
$$ 19 58 -81 -73 -37 -163 -130 -226 -107 -142 -234 -164 -301 149 81 261 -112 8 132 -130 -152 -338 81 0 -34 138
5214A38k80J31k14K96j54P0k02L73m2J48l42Q3o9J1l4N1K58O6j90J53j4J48n03
$$ 138 -142 -11 -225 71 -83 -13 -215 158 116 264 -78 5 -64 -53 -87 -36 222 288 98 251 237 385 -118
5237a18k1J75K9K03l39J18J77P3J31m00J0J38k15J71J03j6j05j39K35l2q2k07
$$ -118 -139 36 65 268 -71 47 224 297 428 28 38 176 -39 132 235 219 114 -25 210 178 96 -111
5259a11M22j25k58J2M2l0M9N7J59o8l75N39l43J32j14M1j86j0o3M24j14l8J39
$$ -111 311 186 -72 -60 -18 -48 1 58 217 149 -226 313 -30 102 -12 29 -157 -167 -230 194 80 42 181
5282A81k04Q0j38K47J31j94j88J37j56J8J48K16p2k17j93L27k78L22M3l63J42
$$ 181 -23 57 -81 166 297 103 -85 52 -104 -86 62 278 206 -11 -204 123 -155 167 210 -153 -11
5303a1j24o9M7K15K49n66N6L37rj91J16l69J93j64RK76l28J11m0Q0L73l49j64
$$ -11 -135 -204 -157 58 307 -259 -203 134 125 -66 50 -319 -126 -290 -281 -5 -333 -222 -262 -182 191 -158 -322
5326c22K99k58J64K6j41M0K16o3j59J13K79q9j16k56J82j16R8K47k64k30L11r2
$$ -322 -23 -281 -117 -91 -232 -192 24 -39 -198 -85 194 105 -11 -267 -85 -201 -103 144 -120 -350 -39 -131
5348a31L51l13o4J36K22M8j54N8j05j19K48l08L50LQn97J73K33p5R9j05j79K79
$$ -131 220 -93 -157 -21 201 249 95 153 48 -71 177 -131 219 222 230 -367 -194 39 -36 63 -42 -221 58
5371E8j48L5qK05l45K06J9J12l09P6O9j89N40j44Lk29k0K26l64j7M04l3l59L11
$$ 58 -90 -55 -63 142 -203 3 22 134 -175 -99 -30 -219 321 177 180 -49 -69 157 -207 -224 180 147 -212 99
5395I9k78M72m45M65l18K2j16J64k40L14o1O5j0p3J15k15L59l47J03k83o0L65
$$ 99 -179 293 -152 313 -5 17 -99 65 -175 139 78 143 133 60 175 -40 319 -28 75 -208 -268 97
5417I7R4l2j03K75l07J4N0l30J59q4P1j39K69m9k74M12j96L45k90p4K05oj85Q3
$$ 97 191 159 56 331 24 38 88 -242 -83 -167 -96 -235 34 -15 -289 123 -73 272 -18 -92 113 107 -78 5
5441El04M74k35J01l13K72J80Q4l10q6J21k8R5k35J16J4J19J04J25k96j88K59
$$ 5 -299 175 -60 41 -272 0 180 264 -46 -132 -11 -39 56 -179 -63 -49 70 174 299 3 -185 74
5463G4j63j41J53J20J37k98J80K0l9q0R4M7k18q3J57K81k84J31J84n07L44J2r0
$$ 74 -89 -230 -77 43 180 -118 62 82 43 -37 57 104 -114 -197 -40 241 -43 88 272 -235 109 121 31
5486C1j33L3j65L76k71J42J78m21K35m7K10l13O4M4j02K40n3k3L9k62J63J17l34
$$ 31 -102 -69 -234 142 -129 13 191 -230 5 -42 168 -145 -81 -37 -139 101 48 25 64 -198 -35 82 -252
5509b52J01J56P5k69J58J24k80J03N3j18L3Q9K27nj89K91m75q7l5L66J7q3k80
$$ -252 -151 5 80 -189 -31 93 -187 -84 -31 -149 -116 -27 200 195 6 297 -178 -265 -300 66 83 0 -280
5532b80J20R8k64M36j38r4K60J42j43j05q2j72J85k22M7J49L65r9j7k32L8j40
$$ -280 -160 -62 -326 110 -28 -122 138 280 137 32 -50 -222 -37 -259 -212 -63 302 203 186 -46 -8 -148
5554a48M4J02p1J15j94K97m5l54K42j10k7j38J52J66Om7n3J37j08K4m9k28N01
$$ -148 -104 -2 -73 42 -152 145 100 -254 -12 -122 -149 -287 -135 31 37 -10 -63 74 -34 -10 -59 -287 214
5577B14j9l81J16J16j59K58L8k38J21j47K6J51j96P9J71J73l35J2k9K00p1k0Q
$$ 214 195 -186 -70 46 -113 145 183 -55 66 -81 -55 96 -100 -21 150 323 -12 0 -29 171 100 80 88
5600H8j24K09j8o1K2k11J50k57L20j16J02J44l16J34j51k39L24K95m85M35r3m12
$$ 88 -36 173 155 94 116 -95 55 -202 118 2 104 248 -68 66 -85 -324 0 295 -190 245 152 -260
5622b60N6J32L7O7K38j49jo1k28K49J4k4j64J20K6M0l1j59K48j53o8K17N9j99
$$ -260 -204 -72 -35 32 270 121 120 59 -169 80 94 70 -94 26 52 92 61 -98 150 -3 -71 146 205 6
5646FK59K6k20Q9o3j59Q6Jj58L44k11O1K15q4l23K98j26j56JJ43j52o3K47R0j87
$$ 6 265 291 71 160 97 -62 24 25 -133 211 0 61 276 192 -131 167 41 -115 -114 29 -123 -186 61 151 -36
5671c6n6r9L31J07q1j43N5K36m34J80j00J2Q1K22j93o6p1j8kO8j19R4K4L10j98
$$ -36 -92 -191 140 247 166 23 78 314 -120 60 -40 -28 53 275 82 16 -55 -73 -75 -7 -126 -32 -8 302 104
5696A04j16r5mlK69l62k0K07J80l01J26o1Q4Nl20J45J76j05K09j54q4K73o6m02
$$ 104 -12 -107 -111 -114 155 -207 -227 -20 160 -141 -15 -76 8 13 -307 -162 14 -91 118 -36 -120 153 87 -315
5720c15J89J2N8J05J3j18R0j11j97L7Q1K88O1j87R0n7j14m1O8p8J90l46P4J06
$$ -315 -126 -114 -56 49 62 -56 34 -77 -274 -237 -156 132 193 6 96 39 -75 -116 -48 -126 64 -282 -208 -102
5744a02j02L79k77K49j85l2L11k74J70k39Q9R5j29OK38n8l52L86l93J47K66k99
$$ -102 -204 175 -102 147 -38 -70 241 -33 137 -102 -13 82 -47 -41 197 139 -213 173 -220 -73 193 -106
5766a06m4J66O9Q4k24K64k92j80J63L49k15o6j07M46l86J17K9J60J32l82J61l61
$$ -106 -150 16 85 169 -55 209 -83 -263 -100 249 34 -32 -139 307 -79 38 67 227 359 -23 138 -223
5788b23M13J63o14K77J6m7N0R3k7j73j09p2M18j77j52L28j11k80J76L3Q9rp1O3
$$ -223 190 353 -261 16 32 -15 35 128 101 -72 -181 -253 165 -12 -164 164 53 -227 -51 -18 71 62 -9 54
5812E4J64m48K28Mnj53J40O0J08m05J49Q8J69l14P3J2L12m02J81l01M36j75l73
$$ 54 218 -230 -2 2 -3 -156 -16 44 152 -253 -104 -16 153 -161 -88 -76 236 -166 15 -286 150 -25 -398
5835c98N62l94jL11n2P7k08o3r7J93P9j91m8K65o8r4L76j12k84L81j82oJ6k84
$$ -398 164 -230 -231 80 28 105 -103 -166 -263 -70 9 -182 -230 35 -33 -127 249 137 -147 234 52 46 62 -222
5859b22RJ33k4R8P2N8k16j35L72k40n5J34l7P5M8k26L19j46m7J22k87J98J4M0
$$ -222 -213 -80 -104 -6 66 124 -92 -227 145 -95 -150 -16 -53 22 70 -156 163 17 -30 92 -195 3 17 57
5883E7l4J30K5m3k93L39o1k86L64M7k11p2n8PJ10j17O5N3M7p9J24l3K09l09l31
$$ 57 23 153 178 135 -158 181 120 -166 198 245 34 -38 -96 -89 21 -96 -31 22 69 -10 114 81 290 -19 -350
5908c50L32K81j97P7l15K11K26j57l56L81j29J6j98K78P1k01K43k69K76m20m8
$$ -350 -18 263 66 143 -172 39 265 108 -248 133 4 20 -178 100 171 -30 213 -56 220 -200 -248
5929b48M06l63L13k88J72J35j89L13j73k80K91m9K76l11j28J44qk98L31J26l7
$$ -248 158 -205 108 -180 -8 127 -62 251 78 -202 89 40 316 5 -123 21 13 -285 46 172 135
5950A35P8l71K43n7R9k50q1n3K89PJ11k72o5j01J84J21P0r9m4j6j8j89J60J75
$$ 135 213 -158 85 28 127 -123 -204 -257 32 39 150 -122 -187 -288 -104 17 87 -12 -56 -72 -90 -279 -119 56
5974E6j43J93j2o0k25K29J38j05k40J75M4j20K61k49L3k7J26n7J7K05k35m5J02
$$ 56 -87 106 94 34 -191 38 176 71 -169 6 50 -70 191 -58 -25 -52 74 17 34 239 4 -41 61
5997F1j33J08l85K61J82j48J73J71j80r5l07M05J38k04Q5j76k48M37N9J36n05
$$ 61 -72 36 -349 -88 94 -54 119 290 110 15 -292 113 251 47 132 -44 -292 145 204 340 -165
6018a65L75Q7l5n75K44m1K76j82K18k66J99J48l40j14k1K13j6j61lM34n61L26
$$ -165 210 297 262 -313 -69 -110 166 -16 202 -64 135 283 -57 -171 -192 21 5 -156 -159 275 -286 40
6040D0q1L09M5J42l32mk84J28L07o03L30o8J60M1j17J78j12J0P7j58l25R4M30
$$ 40 -41 268 313 455 123 119 -165 -37 270 -333 -3 -71 89 130 13 191 79 89 166 8 -317 -223 207
6063B07j71k10R9Q3J3k17J39RK25l16K69P9k22m44N61k85L42q0k67L13l82L59
$$ 207 36 -174 -75 8 21 -196 -57 -48 177 -139 130 209 -13 -457 104 -181 161 81 -186 127 -255 104
6085A04J93l19j8j74N6J98l0l1k74L59L81m16l5j54K01O4j19j3J83l5j23k22M10
$$ 104 297 -22 -40 -214 -158 40 10 -21 -295 64 445 29 -6 -160 41 105 -14 -27 156 121 -2 -224 186
6108A86J08m61K25k87K62K0R5m16K75J30m03M15k03j2k84L92J18k48L09l13k90
$$ 186 294 -167 58 -229 33 53 148 -268 7 137 -266 149 -54 -66 -350 42 160 -88 221 -92 -382
6129c82j7M42ok25L7L03k83o8K70j17J15j06L02Oj60j91P1j01P7Q7m80O15k10
$$ -382 -399 43 37 -188 -151 152 -131 -199 71 -46 69 -37 265 271 111 -80 -9 -110 -33 54 -426 189 -21
6152b1K49k45J54j28J66j77L03l22L4k48M34k27k38K98p3l6N0J86j24j28K55l3
$$ -21 228 -17 137 9 175 -2 301 -21 13 -235 199 -28 -266 32 -41 -77 -27 159 35 -93 162 129
6174A29p1MR2j88k37M40l39M00k62p4J67j23L2n7M9K63j86R0r6k61J92K22j32
$$ 129 58 62 154 -34 -271 169 -170 230 -32 -106 61 -62 -30 -87 -38 225 39 129 33 -228 -36 186 54
6197E4NJ64r4o5k28J27J50j52J30l20L66j1j47j30J06N9r4l89N40j46k40K01l42
$$ 54 59 223 129 64 -164 -37 113 -39 91 -229 137 126 -21 -151 -45 14 -80 -469 71 -75 -315 -114 -456
6220d56J16J40L27j31j93K84j67L04j19l15K11j45L49l12L9KJ24P5R4k7j11j3
$$ -456 -340 -200 127 -4 -197 87 -80 224 105 -210 1 -144 205 -107 -68 -66 58 133 227 200 89 76
6242G6l3K49l78O2j00k13M87k5N5n8N3m72L20N4j33J38K7l6k14k8J1N11j13l13
$$ 76 43 292 -86 -24 -124 -337 150 125 180 122 175 -297 23 77 -56 82 109 73 -141 -169 -158 353 240 -73
6266g3R3L0N1k59n4J35L7N3j94P0Q8J2M5P1r4L5k17J89j74O1K08M5j04q3J81j99
$$ -73 20 50 101 -158 -212 -77 -40 13 -181 -111 -23 -11 34 105 11 46 -171 18 -156 -95 113 158 54 -29 152 -47
6292d7J4R1Q5J83l90j75K39k09J90J16M1J32j07l83J47K3K06ml44J55J57k08K63
$$ -47 -33 58 143 326 -64 -239 0 -209 -19 97 138 270 163 -220 -73 -50 156 152 -192 -37 120 -88 175
6315A75j14m7l2J68j09R7j99K79R0po3l60J79j76K34k19J7J05k55K83k14J76J03
$$ 175 61 14 -18 150 41 138 -61 218 308 301 238 -122 57 -119 115 -104 -87 18 -237 46 -168 8 111
6338A11j57N4J0j8k57J09R9J00k18j60L17j16N67m46J91J00l27J06j40k13J48
$$ 111 -46 8 18 0 -257 -148 -49 51 -167 -327 -10 -126 441 -5 186 286 -41 65 -75 -288 -140
6359a40K66k92K65k6qLl8k09J82j61ok49L12J82k05K23J18k4j72m88J70M2M90
$$ -140 126 -166 99 73 65 68 30 -179 3 -158 -164 -413 -101 81 -124 99 217 193 21 -467 -297 -255 235
6382B35k12k15M27k57j57K47l63L57j27j48M69m54K60l60R7J61J81j66K48q4j37
$$ 235 23 -192 235 -22 -179 68 -295 62 -65 -213 256 -198 62 -298 -201 -40 141 -25 223 139 2
6403Bk81M07Q2j82R8J3k94Q5r6jK69l72N11j78o7j25N8Q2j62L49o5l8J5N3q2l21
$$ 2 -279 128 210 28 126 139 -155 -70 -166 -167 102 -270 241 63 -4 -129 -71 11 -151 198 133 95 110 163 81 -240
6429b40J75K29j66M9j32n6J22Jj4k4K9j36K57j36J17j67j8K05K02k83j35L70j79
$$ -240 -65 164 -2 47 -85 -141 -19 -18 -32 -56 -27 -163 94 -42 75 -92 -110 95 297 14 -121 249 70
6452G0q8J61l77K87j82K36J57j69R9k50j8M0k8M2J28J50r8J05Ll18j42J0%J79
$$ 70 -18 143 -234 53 -129 107 264 95 194 -56 -74 -34 -62 -20 108 258 160 265 268 -50 -192 -182 -182 -3
6476cn3j9oK16k50J7J54k41L51k29Q0j61K4K4ok6K29L9k11o6P6j27o6M9K38r7
$$ -3 -56 -75 -81 135 -115 -98 56 -185 166 -63 17 -144 -120 -96 -102 -128 101 140 -71 -137 -61 -188 -254 -205 33 -64
6502f4K54m6k20J78m0l1K16k65j26J63K11l48K00J15J55j14l72M80l84k36N68
$$ -64 190 144 -76 102 62 31 247 -18 -144 19 230 -118 82 197 352 238 -134 346 -38 -274 294
6523B94l23J62l80J62M20k85J05p9j64m6L49N4m49K19J74R4l04n2K96k03p5J27
$$ 294 -29 133 -247 -85 335 50 155 76 -88 -134 215 269 -180 39 213 307 3 -49 247 44 -31 96
6545I6J19k78r3M06k31K12J85j96j92j6j05j49O5o5L19Rk3k40J37M53o26P2L5
$$ 96 215 -63 -156 250 19 231 416 220 28 12 -93 -242 -177 -242 77 86 63 -177 -40 413 -213 -141 -106
6568a06J52k9j00R8J98j51P8j61J54j66J58k41J66J65j37j53J27O3J40k70K54
$$ -106 46 17 -83 15 213 62 140 -21 133 -33 125 -116 50 215 78 -75 52 115 255 -15 239
6589B39j92j14R2j81J27Mj20Q2O3j88k05L34l2Kj04K17j59J63L5k55J03p1R9K4
$$ 239 47 -67 25 -156 -29 -25 -145 -63 0 -188 -393 -59 -91 -89 -193 24 -135 28 63 -192 -89 -160 -61 -37
6613c7P8J25k97J55J69j13l23K72J61m22J64J26o0J46m7j87J55j76k16K65j32
$$ -37 41 166 -131 24 193 80 -243 29 190 -232 -68 58 -2 144 97 -90 65 -111 -327 -62 -194
6634a94R5K28l01K14k03K35K17j89O3j98M46k07j42k05P9J1p5P2R2Q2l40P2J00
$$ -194 -99 129 -172 42 -161 74 291 102 165 -33 413 206 64 -141 -62 -51 -126 -54 38 120 -220 -148 -48
6657d8L52l31j93L77m3R4k22j6K62m31N44m6j72k9J69m82J60m0J46Kj26k27N2
$$ -48 304 -27 -220 157 114 208 -14 -30 232 -199 345 299 127 98 267 -215 -55 -95 51 53 -73 -300 -248
6680b48K72L23k53l74K19J84l13mK73J71l62q1K00K12l24L00l50J21J5L0j18M7
$$ -248 24 347 94 -280 -61 123 -190 -194 79 250 -112 -193 7 219 -105 195 -155 -34 -19 11 -107 -60
6702f0k25J89O6J31o2rQ0j57K7J02M0k6K3j41j11K03L79m70l2K04j50M4N3M7j12
$$ -60 -285 -96 -30 101 39 30 110 -47 -20 82 122 96 119 -22 -133 70 449 -21 -53 151 1 45 98 145 33
6727C3R6j32K36k58k0K7m6k6J66m03J02M03m6l01p6M50j42P0o4j83K17l11J95
$$ 33 129 -3 233 -25 -45 -18 -64 -90 76 -327 -225 178 132 -169 -245 205 63 133 69 -114 103 -208 -13
6750a3q3M32k61k02m7K32j15k41J15N2JP1o3O1O7J5rJ1MJ23j01k25l2K55Q3j31
$$ -13 -96 336 75 -127 -174 58 -57 -298 -183 -131 -130 -59 -122 -61 6 21 12 23 27 150 49 -176 -208 47 130 -1
6776aJ49j01l4N3k44l7K03k02K82l28K92L2k89M49r4j43k1j18jr7K86j35%K31
$$ -1 148 47 13 66 -178 -215 -12 -214 68 -260 32 64 -225 224 130 -13 -34 -152 -153 -250 36 -99 -99 132
6800A32K04k10k23k41j5J97J03k7K28p0k97K12Oj24J69O9J1P9K1J41l36m4J04
$$ 132 336 126 -97 -338 -353 -156 -53 -80 148 78 -219 -7 -1 -125 44 113 124 203 224 365 29 -15 89
6823H9k79L62J07j60K9q8K1o9k79K97K2j20O8l2J7J31L32p97J71J50l2J0P4j60
$$ 89 -190 172 279 119 148 60 81 12 -267 30 52 -68 0 -32 -15 116 448 -349 -178 -28 -60 -50 24 -136
6847a36P9k74K99j68R1J14k08K92k18j01K74j13K00l02L30j77q6K57o6r3r1j08
$$ -136 -57 -331 -32 -200 -109 5 -203 89 -129 -230 44 -69 131 -171 159 -18 -104 153 87 -6 -97 -205
6869b05Q4M97k49j87L5l03K36J47j19q7J36l3R6l6o6J7o9K80l12L79l31M1J24
$$ -205 -121 376 127 -60 -25 -328 -92 55 -64 -151 -15 -48 48 12 -54 -37 -106 174 -138 241 -90 -49 75
6892G5p4k69K85j71m3K67j44M4P1j3q7j86K70J8J93m3k33Q2N0j1L3k54J21O2r6
$$ 75 1 -268 17 -154 -197 70 -74 -30 41 28 -59 -245 25 43 236 193 -40 42 92 81 114 -140 -19 43 -53
6917e3R2j29J05j56N5On4L73o34N26O8l52K0J28k7L52k87O0J57l43O9k0r3J54
$$ -53 39 -90 15 -141 -86 -80 -134 239 -395 131 199 -153 -133 -5 -32 320 33 93 250 -93 -24 -44 -137 17
6941A7j94J45o3l80M93k47J67j92K81j57J60Pr6L43l82J93l36n6L31J09j69J84
$$ 17 -177 -32 -95 -475 18 -229 -62 -254 27 -130 30 37 -59 284 -98 95 -241 -297 34 143 -26 158
6963A58Jk43J98l7K08l59Rj63K97q3n6K03k34L74l33L43k99N5L8K0l3j78K28R
$$ 158 159 -84 114 77 285 -74 -65 -228 69 -14 -70 133 -101 273 -60 283 -16 39 77 97 64 -114 114 123
6987A23k49K6R9Ll39M37Lk36L69l94K22j75k06M97l99K79k49M5Q4o8Q4K7p2Q9
$$ 123 -126 -100 -1 2 -337 100 103 -133 236 -158 64 -111 -317 180 -219 60 -189 -144 -60 -128 -44 -17 -89 0
7011@K60l87n4N1n4Q6l2P1LqL55m43Q5j26K30N4j76j90K24R7J24l4k77j37K34
$$ 0 260 -127 -181 -130 -184 -98 -130 -59 -56 -64 291 -152 -67 -193 37 91 -85 -275 -51 46 170 136 -141 -278 -44
7036d4R3K95k41p9PN0m5K6J55j68j39L2J49K99k28j7j31n3j28J70N6k92L49l7
$$ -44 49 344 103 24 31 81 36 62 217 49 -90 -58 91 390 162 145 14 -39 -167 3 59 -233 116 79
7060G9j9k56K42N4r8j44Q2n2j62M57p4k21J49k1M4J01k6l88K79K60j41l65K35
$$ 79 60 -196 46 100 2 -142 -60 -112 -274 183 109 -112 37 16 60 161 135 -253 26 286 145 -220 15
7083A5P9k21K62j95J70l11L25J86j21j34j00j27L94k75l3K91j64o5R6j21n8nJ00
$$ 15 94 -127 135 -60 110 -201 124 310 189 55 -45 -172 222 -53 -86 205 41 -24 72 -49 -107 -112 -12
7106a2J56j74R7j70k87M26m1R4o0J94Pm61K08r5R0J06K42m26J54O0J31l66J43
$$ -12 144 -30 67 -103 -390 36 -5 89 29 223 230 -231 -23 -118 -28 78 320 -106 48 108 239 -127 16
7129A6j08K07j29mj30m8J75j12j60M63k8q4l17L21O3l66LJ30J91o0k61L08j7j47
$$ 16 -92 115 -14 -18 -148 -196 -21 -133 -293 170 142 58 -259 62 125 -241 -238 -108 83 23 -238 70 53 -94
7153i4Lj0R7j28K71k62K45o5j45MK79j29n7j15J58J00l12Q7j78M37k22K16k19
$$ -94 -91 -101 -4 -132 139 -123 122 57 -88 -84 195 66 9 -106 52 152 -160 -73 -251 186 -36 180 -39
7176c9j68L04r1j10K58K03k56L9j80J10j39K94k46j07J78n8j23K40j55J50m1j13
$$ -39 -207 97 6 -104 154 357 101 140 -40 70 -69 225 -21 -128 50 -8 -131 109 -46 104 63 -50
7198e0J18k25R9K51k61j46L45j19k94N96l51J65j24j78M39j21k04r0J78j2n8o
$$ -50 68 -157 -58 193 -68 -214 131 12 -282 314 -37 128 4 -174 265 144 -60 -150 28 16 -42 -48
7220d8o0J92k33L21ll06k66M82n1Ko4J17k1j95K45J75l65J61K47n37K57J59k7
$$ -48 -108 84 -149 172 169 -137 -403 79 28 30 -34 83 62 -133 112 287 -78 83 330 -207 50 209 182
7243A82l17J43Q4j47k23J17o7K57j32j49K75j85o3l8K59k13l0J99j65J68K36j40
$$ 182 -135 8 92 -55 -278 -161 -228 29 -103 -252 23 -162 -225 -263 -4 -217 -247 -48 -213 -45 191 51
7265E1k32J20j25K36l86K73r0J98RK30n3l79L54j64k6J11j25p6r8K23j22oK71
$$ 51 -181 -61 -186 50 -336 -63 -153 45 54 284 231 -148 206 42 16 127 2 -74 -172 51 -71 -77 194
7288A94k52j17J47L71k08k19K76k72J68J25k06P2J00k37lQ7k1J06k53O7N5j42
$$ 194 -58 -175 -28 343 135 -84 192 -80 88 213 7 79 179 -58 -61 26 5 111 -142 -75 -20 -162
7310a62n8J49n1l4J28K22l76K1J13p5J24p8Q3j06p8K39k49J61L3q0p7R3R4j26
$$ -162 -220 -71 -122 -156 -28 194 -182 -161 -48 -123 1 -77 6 -100 -178 61 -188 -27 6 -74 -151 -58 36 -90
7334i0J44N3k51K05o9L1j08K49m22N02j85Lm7j05K19j04o8J72p3j72Q0K77n41
$$ -90 54 107 -144 61 -8 23 -85 164 -258 244 59 62 15 -90 129 25 -43 129 56 -116 -36 241 -300
7357c00J00M36k66j33N30p7j75j17J09K8l57J70K11l5n4K1J71m14L30J07n65L42
$$ -300 -200 236 -30 -163 367 290 115 -2 107 135 -222 -52 159 124 70 91 262 -152 178 285 -280 62
7379F2j96n1K26P3j03R6J50l67J64n0j60L38l35RJ43K16k19o7K60j50j36J0P1
$$ 62 -134 -185 41 114 11 107 257 -110 54 4 -156 182 -153 -144 -1 215 -4 -71 189 39 -97 -87 -16
7402a6j53O0J06J87j38j66J11J0J48n22L85k46M50n00M21N2n1O1j2j93j93L52
$$ -16 -169 -109 -3 184 46 -120 -9 1 149 -373 12 -234 216 -284 137 189 138 199 187 -6 -199 153
7424A53k26J6j30L24l03Q2N7J08j30j54P32k86j81k9J06j56J49j39o0P8o6j6K01
$$ 153 -73 -57 -187 137 -166 -84 -27 81 -49 -203 529 243 62 33 139 -17 132 -7 -67 11 -55 -71 130
7447A30P1k23J48k0k3j20p9K3O6L4k42M6L85k02oJ30j6L8j58q6L5J79n2J5j61
$$ 130 201 -22 126 106 83 -37 -116 -93 -27 7 -235 -189 196 -6 -12 118 102 140 -18 -104 -69 110 58 73 -88
7472h8J01J64k43J98m22K07L9N7j7J94r9j09p2k36L17q4K18j20oj4J06j94n3M13
$$ -88 13 177 -66 132 -290 -83 -44 13 -4 190 91 -18 -90 -326 -9 -93 125 5 -1 -15 91 -103 -156 257
7496B57m11NrL8P3P8J7p7P7Q6P7k07JJ16j21j38J18J03Lj49Mj78K89j53o4J88
$$ 257 -154 -149 -158 -120 -47 31 48 -29 48 134 211 4 5 121 0 -138 -20 83 86 -63 -59 -237 52 -101 -165 23
7522B3K53J16l79j78L30k61j17J05j83L01J65j2l0M6J25k63j38l12L40Q2NR7k73
$$ 23 276 392 13 -165 165 -96 -213 -108 -291 10 175 163 133 179 304 41 -97 -409 -69 13 18 115 -158
7545a58K29m0m3J6m9j45Q0K15j23k40q1M86l70M13j27l32M65k18J44k40J33q8
$$ -158 71 31 -12 4 -45 -190 -110 105 -18 -258 -339 147 -223 190 63 -269 196 -22 122 -118 15 -73
7567g3K19o7j22Rj6L11m1j70o7P9K5k71P0j87L02j8L6J94j58j4RL21m30J57k50
$$ -73 146 79 -43 -34 -50 261 220 50 -17 62 87 -184 -114 -301 1 -17 19 213 55 41 50 371 -59 98 -152
7592a52P1N7N7J14j50p6l0p1K32p4k5K53k06o5O4K02k19qK4J38J32k12k62K71
$$ -152 -81 -24 33 147 -3 -79 -109 -180 52 -22 -47 206 0 -65 -1 201 -18 -26 -2 136 268 56 -206 65
7616F5k69L20l4j60N8j27Q1l1J48J1K74m38J04R0l94K30K4L60l19J21n1r7o5l4
$$ 65 -204 116 82 -78 -20 -147 -66 -97 51 62 336 -102 2 92 -302 -72 -48 312 -7 114 63 -34 -99 -133
7640a33L31P5m79K6K01o8M0P4j34r1J69O0J62k94L7K64k03J81k93K47l84J36L1
$$ -133 198 273 -206 -180 21 -47 -7 67 -67 -158 11 71 233 -61 -24 240 37 218 -75 172 -212 -76 -45
7663d5K35l94L51m03J09k85O78j33q7k69J07Q9p9J50k33m9M33j86r1j09L53P1
$$ -45 190 -204 147 -256 -147 -432 246 113 26 -243 -136 -47 -126 24 -209 -258 175 -11 -102 -211 142 213
7685B13k20J25k10J85J06l27M34m00L24j24k63K60k17L57m54Q3J66K17k27m0r7
$$ 213 -7 118 -92 93 199 -128 306 -94 230 106 -157 103 -114 243 -211 -128 38 255 28 -12 -109
7706a09k2J45J04k32n6M80l87J13J11l01J52m8J5j84P9L8K54j18N0Rl21J14J93
$$ -109 -131 14 118 -114 -170 310 -77 36 147 -154 -2 -50 -35 -219 -140 -102 152 34 84 93 -228 -114 79
7729G9j02j98N14l46J22p0Ln9K35o7J32m35J21J14k30K43l41K70L0j55K24k03
$$ 79 -23 -221 293 -53 69 -1 2 -57 178 111 243 -192 -71 43 -187 56 -285 -15 15 -140 84 -119
7751a19J12J57K21l02m0J36k9p9j54m0j97M45Q8k11j3L32m25j4J35N9j83J9O9
$$ -119 -7 150 371 69 29 165 136 57 -97 -137 -334 111 199 -12 -25 307 -118 -132 3 62 -121 -102 -33
7774c3j47N7K99j37P8J52l39j30L00j72J20j3j31J06o3N8p5j01J88K11n79N38
$$ -33 -180 -123 176 39 117 269 -70 -200 100 -72 48 35 -96 10 -53 5 -70 -171 17 228 -351 187
7796A87l85K65k10M01m31M13l80K40K9P5n6Nj54p4J70K71l07k75P6L42j53K47
$$ 187 -198 67 -143 258 -173 240 -140 100 129 204 148 153 -1 -75 95 366 59 -216 -140 202 49 296
7818B96j18N6l72P9K69k19J94j46r4K6o8J5L3j13K25j17K37l13K15m8j7k16L51
$$ 296 178 234 -138 -59 210 -9 185 39 -55 -29 -97 -82 -49 -162 63 -54 183 -130 85 37 20 -196 155
7841A55l23K67M6m8j45Q2q6M5J13j61n9R8J27k44K51l07J80j10M49o6m58K07J87
$$ 155 -168 99 145 97 -48 34 -52 -7 106 -55 -114 -16 111 -133 118 -189 -9 -119 330 264 -194 13 200
7864B00k16j64J23J9k1j47N56l66J75m4K4k16R3R9l4j42K16J33l72J82L8k07K20
$$ 200 -16 -180 -57 -38 -59 -206 350 -16 159 115 139 -77 16 115 81 -61 155 288 -84 98 136 -71 149
7887A49j85p2J11p4L8J73k83K12R0m99J08K59J13k4n4n1Q3J0J62k86q6r3O0M12
$$ 149 -36 -108 3 -71 -33 140 -143 69 159 -340 -232 27 140 116 62 11 94 104 266 -20 -106 -199 -139 273
7911B73m60J93r2J30k46J60o5LR7J6o1j46j6J19j62K77O6j1j77j01L03j49L40
$$ 273 -187 6 -86 44 -202 -42 -107 -104 -7 9 -52 -198 -214 -95 -257 20 86 75 -102 -203 100 -49 291
7934B91k98K67k34J51O6k21m4L0J20j90Q3N3j09j28L0M4O3J85l73L80j22j31m8
$$ 291 -7 260 26 177 243 22 -22 8 128 -62 21 74 -35 -163 -133 -89 -26 159 -214 166 44 -87 -135
7957a35j84M03k69J08r9J74J40k21K9P2J09m28O02k06j46J51J2l14J42K50j97
$$ -135 -319 84 -185 -77 -176 -2 138 -83 -54 18 127 -301 301 95 -51 100 112 -202 -60 190 -7
7978gL51m93M60k06j92K20p7J97l19O2k61N0L87k04k7k14M09j59j57M25n9m50
$$ -7 344 -149 311 105 -87 133 56 253 -66 -4 -265 -215 172 -32 -59 -273 136 -23 -180 245 186 -264
8000b64Q4L78j95k73J13L0L17l08R9r8j88K65k73K17N7j23L7j24K55j98M21k36
$$ -264 -180 198 3 -270 -157 -127 190 -118 -19 -117 -305 -40 -313 -96 -39 -162 -125 -249 6 -192 229 -7
8022gm9j09p8K79J0J60l15k35L15k8J53J3k70M8Q0M9J72m29L58m0J3j14j02J74
$$ -7 -56 -165 -243 36 46 206 -109 -344 -29 -57 96 109 -161 -113 -33 16 188 -241 117 77 90 -24 -126 48
8046D8m8J0PQk6j19J29N2l41M11j18J00r7o1K88m75K70k29N52l69M51m83k5J55
$$ 48 0 10 17 25 -1 -120 9 61 -280 131 13 113 16 -45 243 -232 38 -191 361 -8 443 -40 -65 90
8070I0m51M90k13L35j76j70L72l26J99n2l66J77j44K88J26k82J64j99j37M39q0
$$ 90 -361 129 -84 251 75 -95 277 -49 150 98 -268 -91 -235 53 179 -103 61 -138 -275 164 84
8091H4n8Q6l22qK3O7M77l42J6J5o8J5J70J47k41j27K15n7j70J31j8nJ50l48L26
$$ 84 26 112 -210 -218 -195 -128 349 7 23 38 -30 -15 155 302 61 -66 149 92 -78 53 35 30 180 -168 158
8116A58j99O8P8m0j92r7L72j98l0K29k80J55P7p8k15J86J81o7j11j6j80J48o7
$$ 158 -41 27 105 65 -127 -224 148 -50 -80 149 -131 24 101 23 -192 -6 175 108 -3 -19 -199 -51 -118
8139a18k35J61j48K22P2J86j16j66J46k17L3J12K40k18R6O8j95k2J29K35l40L62
$$ -118 -353 -192 -340 -118 -46 140 24 -142 4 -213 -180 -68 172 -46 50 118 -77 -99 30 265 -75 287
8161B87k61q3K18J69k11J92j68j19k1J92j54l50p3N07l63L86m01M42j11J6L4k90
$$ 287 26 -57 161 330 119 311 143 24 3 195 41 -309 -382 125 -238 148 -253 189 78 94 128 -162
8183a62L89l96M82j66l48Q1p3K9
$$ -162 227 -169 313 147 -201 -120 -193 -164
8191a64
$$ Imaginary data points
##PAGE= N=2
##DATA TABLE= (X++(I..I)), XYDATA
0@%%%%%%Qj6J6j6J8k6L2m0N5o3P2q8J04j22J46j72J98k28K65l05L48l96M48n06
$$ 0 0 0 0 0 0 0 8 -8 8 -8 10 -16 16 -24 31 -32 40 -48 56 -66 80 -92 106 -122 143 -162 186 -210 238 -268
30b68N71o42P19q06R02j003J117j244J380j529J692j874K076k298K547k824L135
$$ -268 303 -339 380 -426 476 -527 590 -654 726 -803 889 -985 1091 -1207 1340 -1484 1651
47A651l491L897m367M919n576O378p385Q683j0436J2950j6882K3958m0629J48667
$$ 1651 -1840 2057 -2310 2609 -2967 3411 -3974 4709 -5727 7223 -9659 14299 -26330 122337
61A22337J35082k34092j5714J04900M703j28659K0789J03229J7275m6677M4731
$$ 122337 257419 23327 7613 112513 117216 -11443 9346 112575 129850 83173 127904
72A27904K6888o3294m2527N5956J410p5209o347Q0294Q054l6374M2769N4894p2443
$$ 127904 154792 91498 48971 104927 106337 31128 24781 105075 113129 76755 119524 174418 101975
85A01975q3085M4666M9770p5019m7855R0995P0819n6323l3009N5289o264r0706
$$ 101975 18890 63556 113326 38307 -9548 81447 152266 95943 62934 118223 111959 21253
97B1253n219O6938l4405q5833N8836J32146j7160j11020N555P0724m5038j00876
$$ 21253 16034 82972 48567 -37266 21570 153716 136556 25536 31091 101815 56777 -44099
109d4099O677O7652R179n132L7889N121n4824j5610K7281l2134o2961K2945O4700
$$ -44099 -37422 30230 39409 34277 72166 77287 22463 6853 34134 2000 -60961 -38016 26684
122B6684j3043l4153M7211M4522o1065o5204L1815K2378o7632l3275P8264N8743
$$ 26684 13641 -20512 26699 71221 10156 -55048 -23233 -855 -68487 -101762 -23498 35245
134C5245l8706k5531L5509o369o3601j4473L0860j8731l3497M8803O5020k9253
$$ 35245 -3461 -28992 6517 148 -63453 -77926 -47066 -65797 -99294 -50491 14529 -14724
146a4724n1786K9952L7214n5003o5565K0426L9628j2030o28M5854J4949l6286
$$ -14724 -66510 -36558 656 -54347 -119912 -99486 -59858 -71888 -72516 -26662 -11713 -47999
158d7999j1038J4474l0176m7638J9392M8799m199j7442L6170K9741l8574l6553
$$ -47999 -59037 -44563 -74739 -122377 -102985 -54186 -58385 -75827 -39657 -9916 -48490 -85043
170h5043K1299N458m7541j2144N6808L1128k6333P45L9629o360n2074j1766K2525
$$ -85043 -63744 -58286 -105827 -117971 -61163 -30035 -56368 -55623 -15994 -22354 -74428 -86194 -63669
183f3669j3040j9562L7966M6609j5249k4782K6695J7947m3003l5007K2808K0486
$$ -63669 -76709 -96271 -58305 -11696 -26945 -51727 -25032 -7085 -50088 -85095 -62287 -41801
195d1801j6595N932M2480J2575k2351K609J5161k8725l8266J6956L4504o822o112
$$ -41801 -58396 -52464 -9984 2591 -19760 -17151 -1990 -30715 -68981 -52025 -17521 -24343 -30455
208c0455L9512K7108l0412k4798J8355o40l9401m312M5684J8854j9162J0389L6812
$$ -30455 9057 36165 5753 -19045 -690 -1330 -40731 -45043 641 19495 333 10722 47534
221D7534p120l9594n144J5256j5523j6444K9295L4063p231p540K3465M642l5791
$$ 47534 40414 820 -4324 10932 -4591 -21035 8260 42323 35092 27552 51017 55659 19868
234A9868j8936J7657L613j6895J3525L6857L752j7200R653J2367k7332l0890J2902
$$ 19868 932 18589 22202 5307 18832 55689 59441 42241 51894 64261 36929 6039 18941
247A8941J9617j1912j935L4959K0983k1336j5035J1839q154l2527l767K7553Q377
$$ 18941 38558 26646 24711 59670 80653 59317 44282 56121 47967 15440 11673 39226 47603
260D7603r755J6334K5110j0956k6881r66L536k0446j3044K1897K0514n858P79
$$ 47603 37848 54182 79292 68336 41455 40489 44025 23579 10535 32432 52946 47088 47867
273D7867J9705j866k9419j2580R004p589j6160J3140K7170R87j1496R009O922
$$ 47867 67572 65706 36287 23707 32711 25122 8962 22102 49272 50259 38763 47772 54694
286E4694k3558k4266N899P821j1555n65K5399J3673j3799o996O209j0745k6500
$$ 54694 31136 6870 12769 20590 9035 8470 33869 47542 33743 26747 32956 22211 -4289
299d289n350J4137J707m547J4713J8223p848j7270j832k529k0269j1800J4069
$$ -4289 -9639 4498 6205 1658 16371 34594 26746 9476 7644 5115 -15154 -26954 -12885
312a2885J2277k622M742J5628j352k0924j0840J568r724j3291Q399K0028L516
$$ -12885 -608 -3230 1512 17140 15788 -5136 -15976 -14408 -24132 -37423 -29024 -8996 -5480
325e480m971Q063M838j7508j9406j51K487p940O61J8465J2098n197l335M122r025
$$ -5480 -10451 -2388 2450 -15058 -34464 -34615 -32128 -40068 -39407 -20942 -8844 -14041 -17376 -13254 -22279
340b2279k0214n704O820J095j611J3177J5992j951r849j098k767j6212j0517P741
$$ -22279 -42493 -48197 -41377 -40282 -41893 -28716 -12724 -14675 -24524 -25622 -28389 -44601 -55118 -47377
354d7377R644M11O559J5399L341j3696q251l77p714j1737M584J5678P397J383
$$ -47377 -37733 -37322 -30763 -15364 -12023 -25719 -33970 -34347 -42061 -53798 -49214 -33536 -26139 -24756
368b4756Q476O097j0320j4469l196M5n640J779J5022J2638J369J148L766o577
$$ -24756 -16280 -10183 -20503 -34972 -38168 -38123 -43763 -41984 -26962 -14324 -12955 -11807 -8041 -14618
382a4618j3825n927K985N0J850J2720J4690J407l499Q29l043j2472q767M631O244
$$ -14618 -28443 -34370 -31385 -31335 -29485 -16765 -2075 -668 -4167 -3338 -6381 -18853 -27620 -22989 -16745
397a6745K929Q524J4127M377o485m934j669p788r088K605J1251P461M839Q572
$$ -16745 -13816 -5292 8835 13212 6727 1793 124 -7664 -16752 -14147 -2896 4565 9404 17976
411A7976N342n408q740m415m152n390K335J1217R692M401M528L491m975j0738
$$ 17976 23318 17910 9170 4755 603 -4787 -2452 8765 18457 22858 27386 30877 25902 15164
425A5164o210j588j274K227J0114J0963M209M90m3m766j0480p411k74L040K711
$$ 15164 8954 7366 6092 8319 18433 29396 33605 34095 34052 29286 18806 11395 11121 14161 16872
440A6872P924J0056N136k459m375n039q023p690j235N181O749O938O327K658k413
$$ 16872 24796 34852 39988 37529 33154 28115 20092 12402 11167 16348 23097 30035 36362 39020 36607
455C6607n900p831q052m609J179O012N679N814N200J418l579r175q611n346j925
$$ 36607 30707 22876 14824 10215 11394 17406 23085 28899 34099 35517 31938 22763 14152 8806 6881
470F881J172M850O790P249L076k338o786p937p087m825j314L038O382O919M507
$$ 6881 8053 12903 19693 26942 30018 27680 20894 12957 5870 1045 -269 2769 9151 16070 20577
485B0577k17m057o244p125o785m239Q09O119O259L766K280M89m158q847q519l744
$$ 20577 20360 16303 10059 2934 -3851 -8090 -7281 -1162 5097 8863 11143 11632 7474 -1373 -9892 -13636
501a3636m60J713M273O562N317J398k275p035q515n796j497j08J230N880R409
$$ -13636 -14096 -12383 -8110 -1548 3769 5167 2892 -4143 -12658 -18454 -19951 -20059 -18829 -12949 -3540
516c540M621l693n819l608n519q097k822L887O881N477M985K408k231n376n878
$$ -3540 1081 -2612 -8431 -12039 -17558 -25655 -28477 -24590 -17709 -12232 -7247 -4839 -7070 -12446 -18324
531a8324n900n279N6O584O843K900L418L987j822q974p037j919p09j071M189Q292
$$ -18324 -24224 -29503 -29447 -22863 -16020 -13120 -9702 -5715 -7537 -16511 -23548 -25467 -26176 -27247 -23058 -14766
547a4766P030J635l77l122o869n655j532p62R35O058J0150N191k550k284m75m962
$$ -14766 -7736 -6101 -6478 -9600 -16469 -22124 -23656 -24418 -23483 -17425 -7275 -2084 -4634 -6918 -7393 -12355
563a2355p831l075M523N373L726N992M876j12m105l454m498n112o95N445N283
$$ -12355 -20186 -23261 -18738 -13365 -9639 -3647 1229 1117 -2988 -6442 -10940 -16052 -16747 -11302 -6019
578f019L100M980O093j279q133m820Q1k454k973M212R172N597J411J063r86n835
$$ -6019 -2919 2061 8154 6875 -1258 -6078 -5997 -8451 -11424 -7212 1960 7557 8968 10031 9045 3210
594C210n106j816r87J95M705Q960M277j198j11J06n322p673j820K904K608K332
$$ 3210 -1896 -3712 -4699 -4504 201 9161 13438 12240 12129 12235 6913 -760 -2580 324 2932 5264
610E264O561N930q92l809k434l078n643k360L530L864K578M618N256j132n550
$$ 5264 11825 17755 16863 13054 10620 7542 1899 -461 3069 6933 9511 14129 19385 18253 12703
625A2703l503j715m241l394K802O587M327K461J969j215n084m727k172k203j271
$$ 12703 9200 7485 3244 -150 2652 9239 13566 16027 17996 16781 11697 6970 4798 2595 1324
640A324L110O379L922k6k28m73m582n215k215m5n36K161O437M594r96k456j573
$$ 1324 4434 10813 14735 14709 14481 14008 9426 4211 1996 1951 1415 3576 10013 14607 13611 11155 9582
657I582k555n266l799O96L236K958L546K956p3l174k946k452l860l030J251L622
$$ 9582 7027 1761 -2038 -1342 1894 4852 8398 11354 11281 8107 5161 2709 -1151 -4181 -2930 692
673F92L184K885K380p36l690l857k043k874k223J699N254L977P24m17p24k645
$$ 692 3876 6761 9141 8405 4715 858 -1185 -4059 -6282 -4583 671 4648 5372 4955 4231 1586
689A586l689k872j408q12K106N260L178o59m48M63k399n543m143J016K391J776
$$ 1586 -2103 -4975 -6383 -7195 -5089 171 3349 2690 2242 2705 306 -5237 -9380 -8364 -5973 -4197
705d197K544K716K006j953k601l375k434j298M33J057J779M146K909l73l383j629
$$ -4197 -1653 1063 3069 1116 -1485 -4860 -7294 -8592 -8159 -7102 -5323 -1177 1732 1359 -2024 -3653
721c653o15l271l835J243M988K853M91J199R41k106l435k102j667j006J649L972
$$ -3653 -4268 -7539 -11374 -10131 -5143 -2290 -1799 -600 341 -1765 -5200 -7302 -8969 -9975 -8326 -4354
737d354K659l08P02K074k501n353k431J503R54k71K273L958J638o60r13k793k831
$$ -4354 -1695 -2003 -1301 773 -1728 -7081 -9512 -8009 -7055 -7326 -5053 -1095 543 -117 -1030 -3823 -6654
754f654j247R22m78Q3M451N112j242l764L13J552l544m947Q32N197J698j155K123
$$ -6654 -7901 -6979 -7457 -7374 -2923 2189 947 -2817 -2504 -952 -4496 -9443 -8611 -3414 -1716 -2871 -748
771g48L067q39l824j743j413q46J341K126J270P23K911J668l039m097L47J000
$$ -748 2319 1480 -2344 -4087 -5500 -6346 -5005 -2879 -1609 -886 2025 3693 654 -3443 -3096 -2096
787b096k589q74L857L840L56p00Q52q33l284j754Q46o63J60L060M000m43j956
$$ -2096 -4685 -5559 -1702 2138 2494 1794 2646 1813 -1471 -3225 -2379 -3042 -2882 178 4178 3735 1779
804A779Q50J006l053m179K89L157J365j23J781J839L22j079k278k620m83J429
$$ 1779 2629 3635 582 -3597 -3308 -151 1214 1091 2872 4711 5033 3954 1676 -944 -1427 2
820BM58J41J717L582P98l174j815J138o65l030r70L126L197J05p05J021N07j417
$$ 2 460 601 2318 5900 6698 3524 1709 2847 2182 -848 -1818 1308 4505 4610 3905 4926 5433 4016
838D016k482j761o59J906J627R54K16J340O66j143k220j420m94o66J304J461Q64
$$ 4016 1534 -227 -886 1020 2647 3601 3817 5157 5823 4680 2460 1040 546 -120 1184 2645 3509
855C509P19Q52M95k064k806K59j21p50k12K689K424q48r05O93m44k808k337J060
$$ 3509 4228 5080 5575 3511 705 964 843 93 -119 2570 4994 4146 3241 3934 3490 682 -1655 -595
873e95J195M40J066J066R0j07n6j100l093j090K506P03j242P51K904N80k236q94
$$ -595 600 1040 2106 3172 3262 3155 3099 1999 -1094 -2184 322 1025 -217 534 3438 4018 1782 888
891H88J96j728j948J131K227l41k21K670J098l004k270J117K06l111K64L671J182
$$ 888 1084 -644 -2592 -1461 766 425 204 2874 3972 968 -1302 -185 21 -3090 -2826 845 2027
908B027k024N48K608q23m298m89J870o80j648K491K737r88n74J328q43l477p44
$$ 2027 3 551 3159 2336 -1962 -2451 -581 -1261 -2909 -418 2319 1331 757 2085 1242 -2235 -2979
925b979K795k29k649J750M112k75l250P43J706k784l180K440K461k231o47L993
$$ -2979 -184 -413 -3062 -1312 2800 2525 -725 18 1724 -1060 -4240 -1800 661 -1570 -2217 1776
941A776K084l994k385L096r0l961m25L968R29k893J460L434k122l378J064K027
$$ 1776 3860 -134 -2519 577 487 -3474 -3899 69 998 -1895 -435 2999 877 -2501 -1437 590
957E90k972k139L281K589k258p43L740m85m442l61K921j134l260K414M530j728
$$ 590 -2382 -4521 -1240 1349 -909 -1652 2088 1603 -2839 -3200 -279 -1413 -4673 -2259 2271 543
973E43l416K160K780l752l676K763K530l113j240M355K040m170q12L102r12m538
$$ 543 -2873 -713 2067 -1685 -5361 -2598 -68 -3181 -4421 -66 1974 -2196 -3008 94 -818 -5356
989e356N83M265r25l032K584L334k726k980J970J889m125j395M108J207l235R3
$$ -5356 -4773 -508 -1433 -4465 -1881 1453 -1273 -4253 -2283 -394 -4519 -5914 -1806 -599 -3834 -3741
1005c741M583l61m641k56L227j388l648K408M294k150k529L149J881m005k591
$$ -3741 842 481 -4160 -4416 -1189 -2577 -6225 -3817 477 -1673 -4202 -1053 828 -3177 -5768
1020e768L545J574l545n22M489K40l380N96L298j738l250J658K660k021k346L506
$$ -5768 -2223 -649 -4194 -4716 -227 13 -3367 -2771 527 -1211 -4461 -2803 -143 -2164 -4510 -1004
1036a004K868k864j851L156Q83m022p99M056M48l264J425L607q72k962J113K688
$$ -1004 1864 -1000 -2851 305 1188 -2834 -3633 423 871 -2393 -968 2639 1767 -1195 -82 2606
1052B606k196k718K672K446k126j012L399J362l317q58L234j74l263M66L359j47
$$ 2606 410 -2308 364 2810 684 -328 3071 4433 1116 258 3492 3318 55 521 3880 3733
1068C733k646J924K429j693k625J883K174k518j504L227J837k889n33L115M41
$$ 3733 1087 3011 5440 3747 1122 3005 5179 2661 1157 4384 6221 3332 2799 5914 6355
1083F355l341n49L194j027j836R94K942j356j910J924J404k392j673K058J029
$$ 6355 3014 2465 5659 4632 2796 3790 6732 5376 3466 5390 6794 4402 2729 4787 5816
1098E816k280l23K809J35k597M82K481j252k814Q27K718j873k146K022K392j729
$$ 5816 3536 3213 6022 6157 3560 4042 6523 5271 2457 3284 6002 4129 1983 4005 6397 4668
1114D668j902J380O40k278j188K007O27k108L0K201k63k054j42J235r54k292J157
$$ 4668 2766 4146 4786 2508 1320 3327 3954 1846 1876 4077 3814 1760 1618 2853 1899 -393 764
1131G64Q64q30p18J804N17k536j090J483K63k563k36K272O0j746K30J703r96k311
$$ 764 1628 798 80 1884 2401 -135 -1225 258 521 -2042 -2278 -6 54 -1692 -1462 241 -755 -3066
1149c066O48Q10j854j316J617K148j574j170J207O50k267j085O24O09p06n66J598
$$ -3066 -2418 -1608 -3462 -4778 -3161 -1013 -2587 -3757 -2550 -1900 -4167 -5252 -4628 -4019 -4725 -5291 -3693
1166c693K15j224J30O62j409q34O48P51j437J43K014O79j821o70J314K7k656j92
$$ -3693 -3478 -4702 -4572 -3910 -5319 -6153 -5505 -4754 -6191 -6048 -4034 -3355 -5176 -5846 -4532 -4505 -7161 -7353
1184g353J777Q80r70K75J438k17j336J13K22j048o02J211J723o89k73J581O60
$$ -7353 -5576 -4696 -5666 -5391 -3953 -4170 -5506 -5393 -5171 -6219 -6821 -5610 -3887 -4576 -4849 -3268 -2608
1201b608j608j075N68J05l71J0J693P78J21J58L96r65j014P60J11n42P83J940
$$ -2608 -4216 -5291 -4723 -4618 -4989 -4979 -3286 -2508 -2387 -2229 -1833 -2798 -3812 -3052 -2941 -3483 -2700 -760
1219g60Q52j282k59J844o35j932r28J643J249k88O61J288M60n20m38m26n25j24
$$ -760 92 -1190 -1449 395 -240 -2172 -3100 -1457 -208 -496 165 1453 1913 1393 955 529 4 -120
1237a20Q85M96K90Q28J386K84j486q72O67k56n31j80J651J237O8K28L33n34o29
$$ -120 765 1261 1551 2379 3765 4049 2563 1691 2358 2102 1571 1391 3042 4279 4347 4575 4908 4374 3745
1256C745o04n76K7O29J646M37j07R3Q26o95k017k38M23O65J97O05Q66Q64l06q83
$$ 3745 3141 2565 2592 3221 4867 5304 5197 5290 6116 5421 3404 3166 3589 4254 4451 5056 5922 6786 6480 5597
1276E597j139n38J21m67J18J004J180P87m45o31n84o80n74j200J42J274J272J41
$$ 5597 4458 3920 4041 3574 3692 4696 5876 6663 6218 5587 5003 4323 3749 2549 2691 3965 5237 5378
1294E378r3l47J44o40j625r55N9O98O23M33M80L37K78j573j001q64m78L00M73
$$ 5378 5285 4938 5082 4442 2817 1862 1921 2619 3242 3675 4155 4492 4770 3197 2196 1332 854 1154 1627
1313A627r2R37J264l95j043j310k95n37j005k52J329J060q0j53M83o96j310j232
$$ 1627 1535 2472 3736 3341 2298 988 693 156 -849 -1101 228 1288 1208 1055 1538 842 -468 -1700
1331a700q25K18L31J010L77k1J89L78q56k162j218N84Q91q72R09J283P01j059
$$ -1700 -2525 -2307 -1976 -966 -589 -610 -421 -43 -899 -3061 -4279 -3695 -2804 -3676 -2767 -1484 -783 -1842
1349a842r37j62j660p17J31R54K32K26J064J148j500j318L1o37j653k81K156N33
$$ -1842 -2779 -2941 -4601 -5318 -5187 -4233 -4001 -3775 -2711 -1563 -3063 -4381 -4350 -4987 -6640 -6921 -4765 -4232
1367d232m96Q62J533p85j978j290L09m05k08J320J380j44L29Q38n00k652p45J053
$$ -4232 -4728 -3866 -2333 -3118 -5096 -6386 -6077 -6482 -6690 -5370 -3990 -4134 -3805 -2967 -3467 -6119 -6864 -5811
1385e811r3l67P84K441M71j013j47N98j741j770P15J326j99L33K155J254j633
$$ -5811 -5904 -6271 -5487 -3046 -2575 -3588 -3735 -3137 -4878 -6648 -5933 -4607 -4806 -4473 -2318 -1064 -2697
1402b697o42N58q21j753J0K596K82o57J643K457j416j953m5Q93j723j041K590
$$ -2697 -3339 -2781 -3602 -5355 -5345 -2749 -2467 -3124 -1481 976 -440 -2393 -2438 -1545 -3268 -4309 -1719
1419a719K066p15L76J935n63k183q92J764n85j450J853K980Rj478J455P65j979
$$ -1719 347 -368 8 1943 1380 -803 -1695 69 -516 -1966 -113 2867 2876 1398 2853 3618 1639
1436A639k034J283J082j171Q06K849J182j518m83J096j218k331K74K329j63n82
$$ 1639 -395 888 1970 799 1605 4454 5636 4118 3635 4731 3513 1182 1456 3785 3622 3040
1452C040K278K217j452k192J298J03k344r42K758J460j102O34K426n74l012j24
$$ 3040 5318 7535 6083 3891 5189 5292 2948 2006 4764 6224 5122 5756 8182 7608 4596 4472
1468D472Q92j299j383J991K534p50n70J435J050l038k397J558O40j778M06L040
$$ 4472 5364 4065 2682 4673 7207 6457 5887 7322 8372 5334 2937 4495 5135 3357 3763 6803
1484F803M23j450L4R15j846k903N08J670n14q00K185K293j904j922P88Q3k996
$$ 6803 7226 5776 5810 6725 4879 1976 2484 4154 3640 2840 5025 7318 5414 3492 4280 4363 1367
1501A367j394K517P50j298P74K380o54k921m30Q29j913j914J581K007r98l30K238
$$ 1367 -27 2490 3240 1942 2716 5096 4442 1521 1091 1920 7 -1907 -326 1681 683 353 2591
1518B591J13l228j697R55j26k385O33K806P19j792K19J646k503k889O36R81j157
$$ 2591 2704 -524 -2221 -1266 -1392 -3777 -3144 -338 381 -1411 -1192 454 -2049 -4938 -4302 -3321 -4478
1535d478o39K540J588j715n94Q21r34k811o40J999K77j448J459K663p77k562K05
$$ -4478 -5117 -2577 -989 -2704 -3298 -2477 -3411 -6222 -6862 -4863 -4586 -6034 -4575 -1912 -2689 -5251 -5046
1552e046L15j764j676J455J662o64M91K217K0k615r03J200q87k196R84L193K49
$$ -5046 -4731 -6495 -8171 -6716 -5054 -5718 -5227 -3010 -2990 -5605 -6508 -5308 -6195 -8391 -7407 -4214 -3965
1569c965j270J141J675k256k250Q37N89j188k13K720J771j221p4J514r52k787
$$ -3965 -5235 -4094 -2419 -4675 -6925 -6088 -5499 -6687 -6900 -4180 -2409 -3630 -3704 -2190 -3142 -5929
1585e929M4J599j35p66K247K763o99k010R09O25k778o91J303J585j26M27K592
$$ -5929 -5885 -4286 -4421 -5187 -2940 -177 -876 -2886 -1977 -1352 -4130 -4821 -3518 -1933 -2059 -1632 960
1602I60M33k041n33J226j636j586J129K620j53l22K018J280j614j961K26J066
$$ 960 1393 -648 -1181 45 -1591 -3177 -2048 572 419 97 2115 3395 1781 -180 46 1112
1618A112j835N02K447J302o20O34R03r75k293n4J167p27m30K014K753o23j031
$$ 1112 -723 -221 2226 3528 2908 3542 4445 3470 1177 1123 2290 1563 1133 3147 5900 5277 4246
1635D246Q63J58l003r63J575J117j138O85K907K77j856j86P23j789j774R59J863
$$ 4246 5109 5267 2264 1301 2876 3993 2855 3540 6447 6724 4868 4682 5405 3616 1842 2801 4664
1652D664j21j26J667J258j967j691O54j88k023j40K731P32q58O24J323j007k719
$$ 4664 4543 4417 6084 7342 5375 3684 4338 4150 2127 1987 4718 5450 4592 5216 6539 5532 2813
1669B813j68Q02j151r16K152K065o49q69Q03Q9l008j345J065O88j217Q74K428
$$ 2813 2645 3447 2296 1380 3532 5597 4948 4079 4882 4971 1963 618 1683 2371 1154 2028 4456
1686D456j02j564k95L56j539j976M59J361m65j1K015J203j938j550P14r38k353
$$ 4456 4354 2790 2495 2851 1312 -664 -205 1156 691 680 2695 3898 1960 410 1124 186 -2167
1703b167k06K074R24p01P12J647j347k255m21L78j488o37K090J515n51n50J215
$$ -2167 -2373 -299 625 -76 636 2283 936 -1319 -1740 -1362 -2850 -3487 -1397 118 -433 -983 232
1720B32r4k855j397J284j38j275J013K038O25j249o6M79j547k036J19J222o56
$$ 232 138 -2717 -4114 -2830 -2968 -4243 -3230 -1192 -567 -1816 -1882 -1403 -2950 -4986 -4867 -3645 -4301
1737d301N6K233J316k011o14P80q39k262k95K068L60l43Q68J688q11k116L7J76
$$ -4301 -4245 -2012 -696 -2707 -3321 -2541 -3380 -5642 -5937 -3869 -3509 -3852 -2984 -1296 -2107 -4223 -4186 -4010
1755d010j606o79J792J636j97J47J411l55k061q82L63l83o79J137K369P5n06M91
$$ -4010 -5616 -6295 -4503 -2867 -3064 -2917 -1506 -1861 -3922 -4804 -4441 -4824 -5503 -4366 -1997 -1922 -2428 -1937
1773a937O88j683j983O00N95k71N36K205N89o13k11L51j040j956o1J600K97P8
$$ -1937 -1249 -2932 -4915 -4315 -3720 -3991 -3455 -1250 -661 -1274 -1485 -1134 -2174 -4130 -4191 -2591 -2294 -2216
1791b216J529J688o95j395K23j30j565n14J773J060o7Q63J327j51j477p09K91
$$ -2216 -687 1001 306 -1089 -866 -996 -2561 -3075 -1302 -242 -309 554 1881 1730 253 -456 -165
1808a65q46o48J762J672l2r1J252J16j608j186j35O13m23N96J824O94m66O03L86
$$ -165 -1011 -1659 103 1775 1743 1652 2904 3020 1412 226 91 704 281 877 2701 3395 2929 3532 3918
1827C918j191j832M01O69L5m2J532J426j17r37m3m56j884k23J228P64L59R33J226
$$ 3918 2727 895 1296 1965 2000 1958 3490 4916 4799 3862 3819 3363 1479 1256 2484 3248 3607 4540 5766
1846E766m57j172n92j87j004n03R95J256K9J57J025K00j375j269m72k37M9N10
$$ 5766 5309 4137 3545 3358 2354 1851 2846 4102 4131 4288 5313 5513 4138 2869 2397 2160 2209 2719
1864B719J040O44J48O5K46j725j248K30k83l21L35J549Q79p82l72L60j054j941
$$ 2719 3759 4403 4551 4616 4862 3137 1889 2119 1836 1515 1850 3399 4278 3496 3124 3484 2430 489
1882D89j94O06K08J90Q17R74j67j067n36m73j430n15N71O79L6R22O06k26j359
$$ 489 295 901 1109 1299 2116 3090 2923 1856 1320 847 -583 -1098 -527 152 188 1110 1716 1490 131
1901A31o95n38p45k27R1R78M54L73K08L7j243j033l47n61l38M24J067N56J55k59
$$ 131 -564 -1102 -1847 -2074 -1983 -1005 -551 -178 30 67 -1176 -2209 -2556 -3117 -3455 -3031 -1964 -1408 -1253 -1512
1921a512K7q54j493m27J22J27L97R73R83l37l10l97p86j196l20N24N69J64Q03
$$ -1512 -1485 -2339 -3832 -4259 -4137 -4010 -3613 -2640 -1657 -1994 -2304 -2701 -3487 -4683 -5003 -4479 -3910 -3746 -2943
1940b943R68j88q50m13j17j178k20J28J424L03M77N05R4j134j47p11k14k63M30
$$ -2943 -1975 -2163 -3013 -3426 -3543 -4721 -4941 -4813 -3389 -3086 -2609 -2104 -2010 -3144 -3291 -4002 -4216 -4479 -4049
1959d049Q06Q94M28N94R1p34j037o32M58l5K00Q69R43O86k70Mo14o42l24L3L96
$$ -4049 -3243 -2349 -1921 -1327 -1236 -1970 -3007 -3639 -3181 -3216 -3016 -2147 -1204 -518 -788 -784 -1398 -2040 -2364 -2331 -1935
1980a935M59J200P90K52k50m75m15o35l90M76N26N71R20N64J31k37o98m05n16
$$ -1935 -1476 -276 514 766 516 41 -374 -1009 -1399 -923 -397 174 1094 1658 1789 1552 854 449 -67
1999f7k0L67N15R94L23Q85J08o90n59o94j93j53O53O96L85J178r6j00o21n70q64
$$ -67 -87 280 795 1789 2112 2997 3105 2415 1856 1162 969 816 1469 2165 2550 3728 3632 3532 2911 2341 1477
2020A477J08j00M92J065O18M01k62k12n56o40q24P6M80L71Q72O75O3m63n29l98
$$ 1477 1585 1485 1977 3042 3660 4061 3799 3587 3031 2391 1567 1643 2123 2494 3366 4041 4104 3641 3112 2714
2040B714o19o98J13M64Q69K34N46j57l11o08n77p41l17K68N39P55K36L03L6p65
$$ 2714 2095 1397 1510 1974 2843 3077 3623 3466 3155 2547 1970 1229 912 1180 1719 2474 2710 3013 3049 2284
2060B284q28l54m19l24P7P49O14J40J63k84p02p91n58QL23j51P65O62J07j88p27
$$ 2284 1456 1102 683 359 436 1185 1799 1939 2102 1818 1116 325 -233 -225 98 -53 712 1374 1481 1293 566
2081E66m82o82k09n81N06J18R30K64J20k38o39m96p80n13N4N08N82%O38L27p28
$$ 566 84 -598 -807 -1388 -882 -764 166 430 550 312 -327 -823 -1603 -2116 -2062 -1554 -972 -972 -334 -7 -735
2102g35n49n53k8q47K84O60M60M74K38m42l30p62k88m14j97K75O04P92J47L14
$$ -735 -1284 -1837 -1865 -2712 -2428 -1768 -1308 -834 -596 -1038 -1368 -2130 -2418 -2832 -3029 -2754 -2150 -1358 -1211 -897
2122h97j28o76q30k90k37K1M68Q64L68O35m67j82m11r37l44K53M1N38Q06M41K43
$$ -897 -1025 -1701 -2531 -2821 -3058 -3037 -2569 -1705 -1337 -702 -1169 -1351 -1762 -2699 -3043 -2790 -2749 -2211 -1405 -964 -721
2143g21l58o76j83o61j82q8O21Q04J86N65J22o54m01r0l46l38J86P60N02O77n7
$$ -721 -1079 -1755 -1938 -2599 -2781 -2869 -2248 -1444 -1258 -693 -571 -1225 -1626 -1716 -2062 -2400 -2214 -1454 -952 -275 -332
2164c32J57l34p25n9m57r6M28O48Q11J04j25L43m63p56l37O7K36K07O08Q68M08
$$ -332 -175 -509 -1234 -1293 -1750 -1846 -1418 -770 41 145 20 363 -100 -856 -1193 -1126 -890 -683 -75 793 1201
2185A201l07r9o20k22o54N49J28K63M84Q07L29l61l80l93J14p82JP45K12N30N34
$$ 1201 894 795 175 -47 -701 -152 -24 239 723 1530 1859 1498 1118 725 839 57 58 803 1015 1545 2079
2206B079K3m00l67j51k04l19L47N10L27L43K98O0o83r3n56N3l74L71N08O74%L91
$$ 2079 2102 1702 1335 1184 980 661 1008 1518 1845 2188 2486 2546 1863 1770 1214 1267 893 1264 1772 2446 2446 2837
2228B837m32m93j73q13L88r0J1Q16O76K10o05k32j9q63n47L40m7M17Q38J58L2
$$ 2837 2405 1912 1739 926 1314 1224 1235 2051 2727 2937 2332 2100 2081 1218 671 1011 964 1381 2219 2377 2409
2249B409k60l34o18Lj89k71J49M48M43O2j1n28l5n99m88l79L54N61O16m6J96n08
$$ 2409 2149 1815 1197 1200 1011 740 889 1337 1780 1842 1831 1303 1268 669 181 -198 156 717 1333 1287 1483 975
2271I75j39n78l45k96l50J47N63M29L1J1J7n89o76k42k68M2L70N18L51O0l82j8
$$ 975 836 258 -87 -383 -733 -586 -23 406 437 448 465 -124 -800 -1042 -1310 -1268 -898 -380 -29 31 -351 -369
2293c69o49m89l23O7L98k00R35L9l76K71m51k16p73j18J76J76L46M56J11m01J37
$$ -369 -1018 -1507 -1830 -1763 -1365 -1565 -630 -591 -967 -696 -1147 -1363 -2136 -2254 -2078 -1902 -1556 -1100 -989 -1390 -1253
2314a253m32r6p64Q3L64K47K04M74j3k31k81m20p8m78j28O84N60O3J68K74Oo02
$$ -1253 -1685 -1781 -2545 -2462 -2098 -1851 -1647 -1173 -1186 -1417 -1698 -2118 -2196 -2674 -2802 -2118 -1558 -1495 -1327 -1053 -1047 -1649
2336a649m45O3o7l3M83M45M72j86J82M9m19o05m6K99J85P0P83L94N7o59N50o81
$$ -1649 -2094 -2031 -2098 -2131 -1648 -1203 -731 -917 -735 -686 -1105 -1710 -1756 -1457 -1272 -1202 -419 -25 32 -627 -77 -758
2358g58n35J95L26L93K64K66M43j65j64m60l9j80M1J30Q67l51M41M19j49l27k97
$$ -758 -1293 -1098 -772 -379 -115 151 594 429 265 -195 -234 -414 -373 -243 624 273 714 1133 984 657 360
2379C60J95m38k57P36N14R7K33J77r4m86j95K6k69n5K24P87M2j39J92J06n97o63
$$ 360 555 117 -140 596 1110 1207 1440 1617 1523 1037 842 868 599 544 768 1555 1597 1458 1650 1756 1159 496
2401D96K03L18j62K33L55M69j75K2j05j38p62j18L40J72M8L22L76J22q00l06q6
$$ 496 699 1017 855 1088 1443 1912 1737 1759 1654 1516 754 636 976 1148 1196 1518 1894 2016 1216 910 824
2422H24k35j42L28M11l55K74L34l8n92l63J48k52l70L64N63J7J97j78qk77n12
$$ 824 589 447 775 1186 831 1105 1439 1401 809 446 594 342 -28 336 899 916 1113 935 927 650 138
2443A38k59R8q2K61K12N91m53o5O8m43p36K3O21l91M76N8M73Ko81Q9m28l99p1
$$ 138 -121 -23 -105 156 368 959 506 441 509 66 -670 -647 -26 -417 59 117 590 592 -89 0 -428 -827 -898
2466h98N34K00J3j00L20k2k07k92J1l13k89L88J86R0K32J41q1m45l46R3O8k84
$$ -898 -364 -164 -151 -251 69 47 -160 -452 -441 -754 -1043 -655 -469 -379 -147 -6 -87 -532 -878 -785 -717 -1001
2488a001J27N19M3J76J58j45l48k68l60J19L49k77M85J27r3L7K82l66m99k50L07
$$ -1001 -874 -355 -312 -136 22 -123 -471 -739 -1099 -980 -631 -908 -423 -296 -389 -352 -70 -436 -935 -1185 -878
2509h78K63o2J58N62m14LJ09j70o48K63%K36k01M69K58m5j83k11J11j69m15L09
$$ -878 -615 -677 -519 43 -371 -368 -259 -429 -1077 -814 -814 -578 -779 -310 -52 -97 -280 -491 -380 -549 -964 -655
2531f55N73m7q2J03N52q32K40n14L94m37J99O32q1J63k64J18l3m71j35J92J16
$$ -655 -82 -129 -211 -108 444 -388 -148 -662 -268 -705 -506 126 45 208 -56 62 29 -442 -577 -385 -269
2552b69j28P5O97l56J57P2l11l96k23N01j55J96K65rJ82k79l01K64m70l25M21
$$ -269 -397 -322 375 19 176 248 -63 -459 -682 -181 -336 -140 125 116 298 19 -282 -18 -488 -813 -392
2573c92M96O6J26O9J43l63m18K03J24l41J56L68J64k46N8J40l63N3l25J09K14
$$ -392 104 170 296 365 508 145 -273 -70 54 -287 -131 237 401 155 213 353 -10 43 -282 -173 41
2594D1k88N08M85k01l34J83K5m85L3R6QK4K64K46J5j53j26K24j79l43j46M81N9
$$ 41 -247 261 746 545 211 394 419 -66 -33 63 71 95 359 605 620 467 341 565 386 43 -103 378 437
2617D37J99j18J55l46P9N3P7k69k52L01L37N6J6J5p9k38j9K06m75L03K21N5j1
$$ 437 636 518 673 327 406 459 536 267 15 316 653 709 725 740 661 423 404 610 135 438 659 714 703
2640G03p3q1K19n72L90l30L06m30K32M05k59L3K27k9n05k02q3N73r2j17J63J68
$$ 703 630 549 768 196 586 256 562 132 364 769 510 543 770 741 236 34 -49 524 432 315 478 646
2662F46j96j43j56n9m9k07L36l8K5K09J80n10j11R2L5j23m19L98j9J56k29J68
$$ 646 450 307 151 92 43 -164 172 134 159 368 548 38 -73 19 54 -69 -488 -90 -109 47 -182 -14
2684a4k14J98n90N95k26l41K83J27R8j09L08k10p4k61K54k07n3kp6K19l52L54
$$ -14 -228 -30 -620 -25 -251 -592 -309 -182 -84 -193 115 -95 -169 -430 -176 -383 -436 -438 -514 -295 -647 -293
2706b93Lm83q8nL24J32K5L09l12k61l2K02o0m3l79O14J67k16O3O3N9n17J68M2
$$ -293 -290 -773 -861 -866 -542 -410 -385 -76 -388 -649 -681 -479 -539 -582 -961 -347 -180 -396 -333 -270 -211 -728 -560 -518
2730e18q2N2k48N62k85K29r2k1q7l60K27m2L15m00M92J94l40K35J34j45k41k0
$$ -518 -600 -548 -796 -234 -519 -290 -382 -403 -490 -850 -623 -665 -350 -750 -258 -64 -404 -169 -35 -180 -421 -441
2752d41M40m34L52j81L00J5k63L3K99l63K1J30j69m2K11J3L38r8j59k59J4LK67
$$ -441 -1 -435 -83 -264 36 51 -212 -179 120 -243 -222 -92 -261 -303 -92 -79 259 161 2 -257 -243 -240 27
2775B7K23j81J07o4J3J08k69K75R5k1m29K79J91j64j00j2kj9J53j07N5K0K60l80
$$ 27 250 69 176 112 125 233 -36 239 334 313 -116 163 354 190 90 78 76 57 210 103 158 178 438 58
2799E8K22o8O2j69J55k16j62L61j30k92L57j8m9J12O0k07q0r1K79r2J77j93L8
$$ 58 280 212 274 105 260 44 -118 243 113 -179 178 160 111 223 283 76 -4 -95 184 92 269 76 114
2822A14k2J16M2k85J07p5J81J22l11K56K91m07K3j74j2J19J80k25k9K05j15rj49
$$ 114 92 208 250 -35 72 -3 178 300 -11 245 536 129 152 -22 -34 85 265 40 11 216 101 92 -57
2845e7MJ72n5K80j95p1k11L06L10j82j42J78k72O8O2J1K70j34k71M4lK32j01p4
$$ -57 -53 119 64 344 149 78 -133 173 483 301 159 337 65 133 195 206 476 342 71 115 112 344 243 169
2869A69k01L16O5J96l09J15l1l5K74j83k8k21L51K3J26m01J91L6k41J47r5j41
$$ 169 -32 284 349 545 236 351 320 285 559 376 348 127 478 501 627 226 417 453 212 359 264 123
2891A23M51q7k08K56k93k84L13m4N04n01J52k0j14n0N4j02O5k09j52L92k06j47
$$ 123 574 487 279 535 242 -42 271 227 731 230 382 362 248 198 252 150 215 6 -146 246 40 -107
2913a07LK71o45N58l13K14j65K72j29l37J74q0J72k36K85j30J1r4p8R3n55L51
$$ -107 -104 167 -478 80 -233 -19 -184 88 -41 -378 -204 -284 -112 -348 -63 -193 -182 -276 -354 -261 -816 -465
2935d65j29J50p7J93k34L72j87M9k23j72L98k77J23j67J08q7J40k31j50K8r9M17
$$ -465 -594 -444 -521 -328 -562 -190 -377 -328 -551 -723 -325 -602 -479 -646 -538 -625 -485 -716 -866 -838 -937 -520
2957e20j60K15j90j48R5Q7R7j73j32J75m8J05q6n0J60R8k33K93j77k43K78K44
$$ -520 -680 -465 -655 -803 -708 -621 -524 -697 -829 -654 -702 -597 -683 -733 -573 -475 -708 -415 -592 -835 -557 -313
2979c13P6m38P1n4M7NJ29K21J09k44k30L91j43k17J47Q7K01M4o1k78M82r3j4M5
$$ -313 -237 -675 -604 -658 -611 -606 -477 -256 -147 -391 -621 -230 -373 -590 -443 -356 -155 -111 -172 -450 32 -61 -75 -30
3003c0r3M68m64Q3L05K1k68J48K65m10L74q5J25q2J64r9J48l17P0K18Pn5L32l74
$$ -30 -123 345 -119 -36 269 290 22 170 435 25 399 314 439 357 521 422 570 253 323 541 548 493 825 451
3027D51k2J66J35j88J63Q5K60m76l01N48l44K91Q9k42n9k1L6J65m2J17m8R6mj14
$$ 451 429 595 730 542 705 790 1050 574 273 821 477 768 857 615 556 535 571 736 694 811 763 859 855 741
3051G41J58j65J93k14j98k5K24K3M1P2l50jN1j12K01r9L39k14K77l86k03K13m29
$$ 741 899 734 927 713 515 490 714 737 778 850 500 499 550 438 639 540 879 665 942 556 353 566 137
3074A37K17N2Q0k93L02l76J64J11k57k52J75Jm1R4J3o8m2j69k6K94l1l71R1L28
$$ 137 354 406 486 193 495 119 283 394 137 -115 60 61 20 114 127 59 17 -152 -178 116 85 -286 -195 133
3098A33k40J54k51K31l91PN8k88J74l6Q1O5j25jK01j70m03M06k86k11J60K46m8
$$ 133 -107 47 -204 27 -364 -357 -299 -587 -413 -449 -368 -303 -428 -429 -228 -398 -801 -395 -681 -892 -732 -486 -534
3121e34l2rp7j2J92j11l79K39q5J78L40k62mrK4K18m85P9J61J43M1m2j07k79K71
$$ -534 -566 -575 -652 -664 -472 -583 -962 -723 -808 -630 -290 -552 -556 -565 -541 -323 -808 -729 -568 -425 -384 -426 -533 -812 -541
3146e41J62l45J63j83K12k24J94K23k18J72l25J58L15l14O0J45R7j03m3M22j10
$$ -541 -379 -724 -561 -744 -532 -756 -562 -339 -557 -385 -710 -552 -237 -551 -491 -346 -249 -352 -395 27 -83
3167h3l88k3K37m23L89j49M43k35J91J50j52j02k03J21q5N45k30P0n5j41L78k21
$$ -83 -471 -494 -257 -680 -291 -440 3 -232 -41 109 -43 -145 -348 -227 -312 233 3 73 18 -123 255 34
3189C4J52k8l37L16M8j92K45Rj01j39J62jn4L4J87K10n40k4N19m58Q6m2J17PK40
$$ 34 186 158 -179 137 185 -7 238 247 146 7 169 168 114 148 335 545 5 -19 500 42 128 86 203 210 450
3214D50m07K73j23J11m6K68k66j98K25M5p7o1K9M86m2m21J65p5l71J51L05m8M6
$$ 450 43 316 193 304 258 526 260 62 287 332 255 194 223 709 667 246 411 336 -35 116 421 373 419
3237D19n0L24K7k66J18o6p7L8j02j52P1K94M3j78l3L9k1k65L17j66J70M3K56l59
$$ 419 369 693 720 454 572 506 429 467 365 213 284 578 621 443 410 449 428 163 480 314 484 527 783 424
3261D24j60ml18P49l70k34M13k58J87n0K08J40l97jj15O9K79k62J08o2k58Q4j21
$$ 424 264 260 -58 691 321 87 500 242 429 379 587 727 330 329 214 283 562 300 408 346 88 172 51
3284E1K10l77K96n1J39k47n9L39l08l1lo1l3j9O0J48j34l37O98l02j41p7J73k33
$$ 51 261 -116 180 129 268 21 -38 301 -7 -38 -41 -102 -135 -154 -94 54 -80 -417 281 -21 -162 -239 -66 -299
3308b99n1j2J97j62L4K18j21j08m07M18m26n2J24N28l51p1J87K3o8q1m25J43K84
$$ -299 -350 -362 -165 -327 -293 -75 -196 -304 -711 -293 -719 -771 -647 -119 -470 -541 -354 -331 -399 -480 -905 -762 -478
3331d78j69K70k09NQ8j98J33j4l97N78k08j39J25L65n00L49j70j74L4R2L0k1K16
$$ -478 -647 -377 -586 -581 -493 -691 -558 -572 -969 -391 -599 -738 -613 -248 -748 -399 -569 -743 -709 -617 -587 -608 -392
3354c92k64L56k57N2j16R4J73p6P5Q1J7N6k35K40j57l35J76J27J98lj75J77Jo3
$$ -392 -656 -300 -557 -505 -621 -527 -354 -430 -355 -274 -257 -201 -436 -196 -353 -688 -512 -385 -187 -190 -365 -188 -187 -250
3378b50K18Jk45Q0J90K0j23K75K07k26N8j21K59l68q2K1K50L0L38m41K76K74k51
$$ -250 -32 -31 -276 -196 -6 14 -109 166 373 147 205 84 343 -25 -107 -86 164 194 532 91 367 641 390
3401C90j03R1m5K46m2k33N64j56J30l09k77P5J00R3j31K15K71r4j44L16n05M43
$$ 390 287 378 333 579 537 304 868 712 842 533 256 331 431 524 393 608 879 785 641 957 452 895
3423H95l87j69R1m8L61L4R6k82R6j12j83M7O5qL23k48K00K0k11k33N6o7n8J56
$$ 895 508 339 430 382 743 777 873 591 687 575 392 439 504 496 819 571 771 791 580 347 403 336 278 434
3447D34P2j83K22j13Q6n3Mj42q1Rj45J99j51K10j66k55kK58j88N9r5k88L07J55
$$ 434 506 323 545 432 518 465 469 327 246 255 110 309 158 368 202 -53 -55 203 15 74 -21 -309 -2 153
3471A53L2j06N1l20J61k31j20M99n00L67l3k82P4p1K60j53r3j54J26j07J61J41
$$ 153 185 79 130 -190 -29 -260 -380 119 -381 -14 -47 -329 -255 -326 -66 -219 -312 -466 -340 -447 -286 -145
3493a45Q5k19J97m72R6Q1l00K08k8J01K12l82J25p8o2J49J1j18P4Nj8K54j24j77
$$ -145 -60 -279 -82 -554 -458 -377 -677 -469 -497 -396 -184 -566 -441 -519 -581 -432 -421 -539 -465 -460 -478 -224 -348 -525
3517e25l7j8M7n2K81k97N28k56J29j24J07k33J37m0p7N0N0K34k60j07J81j11J01
$$ -525 -562 -580 -533 -585 -304 -601 -73 -329 -200 -324 -217 -450 -313 -353 -430 -380 -330 -96 -356 -463 -282 -393 -292
3540b92j03L49k12L5K85k61p7O0L47m00J60k30RJ11K47j95L29J21n6k04Rj36P1
$$ -292 -395 -46 -258 -223 62 -199 -276 -216 131 -269 -109 -339 -330 -219 28 -167 162 283 227 23 32 -104 -33
3563c3J75lp3K43j77K12j89K2J34l34J31n9K29q9l9J96M8m01J6j75KK14K9L2J42
$$ -33 142 139 66 309 132 344 155 177 311 -23 108 49 278 189 150 346 394 -7 9 -166 -164 50 79 111 253
3588B53j08O6p1J42m9k42J69n8R4P5K42l06K7J70j60j16k6K26j89K38k64J7J06
$$ 253 145 211 140 282 233 -9 160 102 196 271 513 207 234 404 244 128 102 328 139 377 113 130 236
3611B36j7k32Q1J93j93q2j9K05M1J50o4M9k51j13nQ5L79k13R3k47J21j9j09rj81
$$ 236 219 -13 68 261 68 -14 -33 172 213 363 299 348 97 -16 -21 64 443 230 323 76 197 178 69 60 -121
3636a21J96K42N7J96j92o3j94m8M28n40k0j06J69mJ2L8K21q2K86m85L09m70K03
$$ -121 75 317 374 570 378 315 121 73 501 -39 -59 -165 4 0 12 50 271 189 475 -10 299 -171 32
3659C2K14l70K20j58J12m6n9L03J9j37r6J06mK63l54j0J66k72L44l39o4K4K94
$$ 32 246 -124 96 -62 50 4 -55 248 267 130 34 140 136 399 45 35 201 -71 273 -66 -130 -106 188
3682A88j38o8K30k87J42j76K8K70j87Q7j13k1nq5j45j94Q3J89k67K58O6k7L9J2
$$ 188 50 -18 212 -75 67 -109 -81 189 2 89 -24 -45 -50 -135 -280 -474 -391 -202 -469 -211 -145 -172 -133 -121
3706a21k84L31l2j85k0J14pN3r3J52j85M5Q9n9k15K84p8k6k4K10m01J14K02O6
$$ -121 -405 -74 -106 -291 -311 -197 -204 -151 -244 -92 -277 -232 -143 -202 -417 -133 -211 -237 -261 -51 -452 -338 -136 -70
3730g0j81l09J26K7J20K3R5k20K21j82pK18o5J65j37l2j01K13j93K44k4K25k34
$$ -70 -251 -560 -434 -407 -287 -264 -169 -389 -168 -350 -357 -139 -204 -39 -176 -208 -309 -96 -289 -45 -69 156 -78
3753g8j27k7K62l36N09n40K48N6l83L04KO3J28k32J0L85J04k39k10J58n2Q4j68
$$ -78 -205 -232 30 -306 203 -337 -89 -33 -416 -112 -110 -47 81 -151 -141 244 348 109 -101 57 5 89 -79
3776g9L2L8n9M16k56J34N5k20J39J83k31L14k10MJ27k32n5N0k01J77M1J80k84
$$ -79 -47 -9 -68 348 92 226 281 61 200 383 152 466 256 260 387 155 100 150 -51 126 167 347 63
3799F3L51j45m1j40J37M9M14k84k35L61m3l32K00k9Q6j74j86J52L92k59j43O1
$$ 63 414 269 228 88 225 274 688 404 169 530 487 155 355 326 412 238 52 204 596 337 194 255
3821B55j26J97k96M51o11L89j63N5J33Q0J19n69N9K80l43K09j96L95l76J81J21
$$ 255 129 326 30 481 -130 259 96 151 284 364 483 -86 -27 253 -90 119 -77 318 -58 123 244
3842B44j67N1k37J93K75l45k1n1J8J51K7J44j45Q5l28j21J47J03j31N3k0P3J36
$$ 244 77 128 -109 84 359 14 -7 -58 -40 111 138 282 137 222 -106 -227 -80 23 -108 -55 -75 -2 134
3865A34j42k17K07k20J42L3j66K68n9j96N6j8J07L61k68k04j73J72pJ15nj05j8
$$ 134 -8 -225 -18 -238 -96 -63 -229 39 -20 -216 -160 -178 -71 290 22 -182 -355 -183 -190 -75 -80 -185 -203
3888b03J67mj09K6l42J93O8l19L70q7P6J5o8k6K93n8k77L14j72nJ3j44O0J21J0
$$ -203 -36 -40 -149 -123 -465 -272 -204 -523 -153 -240 -164 -149 -217 -243 50 -8 -285 29 -143 -148 -135 -279 -219 -98 -88
3913h8K2N1K49m08J66N5j44k58J00L22J08j89J64j31l4n9J55j62rJ99q7K7n0J19
$$ -88 -66 -15 234 -174 -8 47 -97 -355 -255 67 175 -14 150 19 -15 -74 81 -81 -90 109 22 49 -1 118
3937A18j5r0q7K25N0J4m5j21K53l57K61k54L23k6k22P3k54M48k22P2p6J80j86
$$ 118 103 13 -74 151 201 215 170 49 302 -55 206 -48 275 249 27 100 -154 294 72 144 68 248 62
3960F2p3l3K2K55k93l6J78l13M23m67J77L28q9j43k23J40K00N7Pr8j72J55j12
$$ 62 -11 -44 -22 233 -60 -96 82 -231 192 -275 -98 230 141 -2 -225 -85 115 172 179 81 -91 64 -48
3983d8J34l27N75p44K78J64j07k5j05K15r1K01k83M67l51j84K45P6k14L75l21
$$ -48 86 -241 334 -410 -132 32 -75 -100 -205 10 -81 120 -163 304 -47 -231 14 90 -124 251 -70
4004g0NM4j38K6j24M66j4j03j72J15k46J60Q8L5o0P7p0j41K81j77R2j16K11k83
$$ -70 -65 -21 -159 -133 -257 209 195 92 -80 35 -211 -51 37 72 12 89 19 -122 159 -18 74 -42 169 -114
4028a14Q5J1J21O2j37J00l29M19j95k23P4L25j71lL26k34k15L5k83K28Kq8j1K95
$$ -114 -29 -18 103 165 28 128 -201 218 23 -200 -126 199 28 25 351 117 -98 -63 -346 -118 -116 -204 -215 80
4052H0k02L8J70Rr5q6M54n22L88k62k7k2J50n0j22J15j01O8K04J40l69K12L9r7
$$ 80 -122 -84 86 95 0 -86 368 -154 234 -28 -55 -77 73 23 -99 16 -85 -17 187 327 -42 170 209 112
4076A12o5K25j48l0p9K68l1j54j54R3k40m4M74m09L38q3l60J54J87k99M34k56
$$ 112 47 272 124 94 15 283 252 98 -56 37 -203 -247 227 -182 156 73 -287 -133 54 -245 189 -67
4098f7j38j48J25O8q9J84k79M01q7K42j54l3P6r9k3m1J4j5p9Q5K5k8j12P3J82
$$ -67 -205 -353 -228 -160 -249 -65 -344 57 -30 212 58 25 101 2 -21 -62 -48 -63 -142 -57 -32 -60 -172 -99 83
4123H3k80M6N5j71r5M05l67K38R5lr9j36J93j4j6R1k92L04k79J38l1j07K08J47
$$ 83 -197 -151 -96 -267 -362 43 -324 -86 9 6 -93 -229 -36 -50 -66 25 -267 37 -242 -104 -135 -242 -34 113
4147A13p6j47oP5K68l49L52k91K4N7N7j34l49O18r8j67M24l89L3K74m00K23Po5
$$ 113 37 -110 -116 -41 227 -122 230 -61 -37 20 77 -57 -406 212 114 -53 371 -18 15 289 -111 112 119 54
4171E4k89M50r2j90K33l95J13L43J67l67J87k47M47o09J12J19L9m2J23j15K18
$$ 54 -235 215 123 -67 166 -229 -116 227 394 27 214 -33 414 -195 -83 36 75 33 156 41 259
4192B59k2j34j92R0J85k29L34m13K78o9J50k8K1k85J64Jk38j60M76J63k32l04
$$ 259 237 103 -89 1 186 -43 291 -122 156 87 237 209 230 -55 109 110 -128 -288 188 351 119 -185
4214a85J73J26k67K56q6j8P6l72L16r4J41M3l6j90n3J84j04rM3r8K51k85K90n8
$$ -185 -12 114 -153 103 17 -1 75 -297 19 -75 66 109 73 -117 -170 14 -90 -99 -56 -154 97 -188 102 44
4238D4N7j72q3L70m15K64j23J57k8j12P6k8j96J2o1j1Rj08M52o2k44o8J84j05
$$ 44 101 -71 -154 216 -199 65 -58 99 71 -41 35 7 -189 -177 -238 -249 -240 -348 104 42 -202 -270 -86 -191
4262a91JK8J09N8K8o7J52j47k15M31k16m1J3J3J61l1J5j12K16j47j35p6P2L0j97
$$ -191 -190 -162 -53 5 33 -34 118 -29 -244 187 -29 -70 -57 -44 117 86 101 -11 205 58 -77 -153 -81 -51 -248
4287b48K56p7K65N1m56J95j7M66m36O7oJ5P0jK08j95q4L09l60l44L25R5n7n5J41
$$ -248 8 -69 196 247 -209 -14 -31 435 -1 66 60 75 145 144 352 157 73 382 22 -322 3 98 41 -14 127
4312A27M7m2j04r9O6K80k79L0K20k15N9m4j1J99j64m32N41k05k7M97m28N1p9k9
$$ 127 174 132 28 -71 -5 275 -4 26 246 31 90 46 35 234 70 -362 179 -26 -53 444 16 67 -12 -41
4336d1j1O2n7J86p5J71k17N5n8j68K86k46J87J78j19j8j32n6O3m7n6j07M7R5n5
$$ -41 -52 10 -47 139 64 235 18 73 15 -153 133 -113 74 252 133 115 -17 -73 -10 -57 -113 -220 -173 -78 -133
4361a33L34L4k27n4r9N17m98Q8m1P6j80K5J81M2j98o1Q8n9K37m3n1J34j82l0J12
$$ -133 201 235 8 -46 -145 372 -126 -38 -79 -3 -183 -158 23 65 -133 -194 -106 -165 72 29 -22 112 -70 -100 12
4386A2m62J70L61l13j03MJ75j1j9k13L76l93M76j79j59M9m0J34m1J26j18l72L80
$$ 12 -450 -280 81 -232 -335 -331 -156 -167 -186 -399 -23 -416 60 -119 -278 -229 -269 -135 -176 -50 -168 -540 -160
4409a60J8l9j0K56k51J35J99j77j27j51M01l7m28J57K53J46j69j27m2K93o6j57
$$ -160 -142 -181 -191 65 -186 -51 148 -29 -156 -307 94 57 -371 -214 39 185 16 -111 -153 140 74 -83
4431h3K8k79L88K50j96l19J92j2N33q24L51J07j80j10K82j33L75ql19o6J56L3
$$ -83 -55 -334 54 304 108 -211 -19 -31 502 -322 29 136 -44 -154 128 -5 370 362 43 -23 133 166
4453A66j36J49o1k29P2J50P0j36j65N7J69M6J13K3k53J38K14n89L07Q4j2r9q8
$$ 166 30 179 118 -111 -39 111 181 45 -120 -63 106 152 265 288 35 173 387 -202 105 189 177 78 -10
4476a0K69m9l55N5K35O6k53K27Ln8j49o1j15L12R9k09R1J71k23j67K07J73L7l68
$$ -10 259 210 -145 -90 145 211 -42 185 188 130 -19 -80 -195 117 216 7 98 269 46 -121 86 259 296 -72
4500g2J51k8j45K73k5p9K55j07k14p3nj40O3n6M3j63K07J78k30P9l1m4K62q8l6
$$ -72 79 51 -94 179 154 75 330 223 9 -64 -69 -209 -146 -202 -159 -322 -115 63 -167 -88 -119 -163 99 11 -25
4525b5l8k8r8j33N13m5l87J99j98L13j23k55J29j1L12k30K81j34q3K9k73N31k12
$$ -25 -63 -91 -189 -322 191 146 -241 -42 -240 73 -50 -305 -176 -187 125 -105 176 42 -41 -12 -285 246 34
4548C4KK9k74K55k02R1j02K71j2k92O3m8O1J80J04r7j90j5L31l60J44l01O09m61
$$ 34 36 65 -209 46 -156 -65 -167 104 92 -200 -137 -185 -124 56 160 63 -127 -142 189 -171 -27 -328 281 -180
4572a80N45m44j55M30k13K09m09K23L5J14j41j07qQ8J04O3j51j04O1j31L8m6L89
$$ -180 365 -79 -234 196 -17 192 -217 6 41 155 14 -93 -101 -13 91 154 3 -101 -40 -171 -133 -179 210
4595B10K15o41Q3M19j81j64k43M42K0j62l1J40r4p6r5n7K75r3nK98m7l56J60k18
$$ 210 425 -216 -133 286 105 -59 -302 140 160 -2 -33 107 13 -63 -158 -215 60 -33 -38 260 213 -143 17 -201
4619b01K48l21J41K76k58M0L9r1K85j64j13J41k02L21P5n1R1j23j25R4q8Mj72
$$ -201 47 -274 -133 143 -115 -75 -36 -127 158 -6 -119 22 -180 141 216 165 256 133 8 102 14 18 -154
4642a54K33l62K31J56N0j04j33j12L99k66Q7r3K41l81R5J5J05j58J14L36m57l6
$$ -154 79 -283 -52 104 154 50 -83 -195 204 -62 25 -68 173 -208 -113 -98 7 -151 -37 299 -158 -194
4664a94J50K80l04r0J83R7J29k66N9J1l58N47j96k7J12j22m5O7k35O7K8J89k54
$$ -194 -44 236 -68 -158 25 122 251 -15 44 55 -303 244 48 21 133 11 -34 33 -202 -135 -107 82 -172
4687a72M34k99l12N21j61O5j99J32K90k85j31L0J30J11k64K27k29M9J17j81L0
$$ -172 262 -37 -349 172 11 76 -123 9 299 14 -117 -87 43 154 -110 117 -112 -63 54 -127 -97
4708i7J61r0k35K14M3J87j09j38J52q5M16j83k69P4R9P9k96R6j23k3L14l73p2
$$ -97 64 -26 -261 -47 -4 183 74 -64 88 3 419 236 -33 41 140 219 -77 19 -104 -127 187 -186 -258
4731b58L36R4n98N95l09j75L76l80J82lK06O0Pm08M79k80Q3l44J60J32K33m44
$$ -258 78 172 -426 169 -140 -315 61 -319 -137 -140 66 126 133 -275 204 -76 7 -337 -177 -45 188 -256
4753b56l5K01J1n1m9q8N3L08l61J58j4k43L63P0j49K04m01J67p0P5PR6j03J1R9
$$ -256 -291 -90 -79 -130 -179 -267 -214 94 -267 -109 -123 -366 -3 67 -82 122 -279 -112 -182 -107 -100 -4 -107 -96 3
4778Cj59k2J38k51L00m18M24k22J71l06J31rJ65p0o5J00m7Q0k34L31j89r7K88
$$ 3 -156 -178 -40 -291 9 -409 15 -207 -36 -342 -211 -220 -55 -125 -190 -90 -137 -57 -291 40 -149 -246 42
4801D2j50J7M9r4K06LM6r8k5K08j0M6k33O7L1j76J89k08K3M6P0j23mp1M66k03
$$ 42 -108 -91 -42 -136 70 73 119 21 -4 204 194 240 7 74 105 -71 118 -90 -67 -21 49 -74 -78 -149 317 114
4827A14j0k2j52K96l52L40r8J39J16m14P9m9J67k24N2K61j19jN2n10O50k39J00
$$ 114 104 82 -70 226 -126 214 116 255 371 -43 36 -13 154 -70 -18 243 124 123 175 -335 315 76 176
4850A76p7O2Jj80J95K92l73M5r6j14M30J15k30j79M3j57J3m3j20L75j31K8j12
$$ 176 99 161 162 -18 177 469 96 141 45 -69 361 476 246 67 110 -47 -34 -77 -197 178 47 75 -37
4873c7j21P8J20Q3q7N4k73K75j14J11K7j21R0l82K45L83k20j09k26J76L2J71j55
$$ -37 -158 -80 40 123 36 90 -183 92 -22 89 116 -5 85 -297 -52 331 111 2 -224 -48 -16 155 0
4896@j24L87k95m2M6N2M2J01q1l44O3K75L7k90j36J96j79K77l0j4r9J25p3k42
$$ 0 -124 263 -32 -74 -28 24 66 167 86 -258 -195 80 117 -173 -309 -113 -292 -15 -45 -59 -158 -33 -106 -348
4920c48K22J49M4j37m3j12J70m35K80J59k8k19j96M28l16J01O8o8N57k14K5j74
$$ -348 -126 23 67 -70 -113 -225 -55 -490 -210 -51 -79 -298 -494 -66 -382 -281 -213 -281 276 62 87 -87
4942h7J18j83J86O2Kk20J72k95p0K99j64N27l54j54Q1lj06L78J28n26l1L25k90
$$ -87 31 -152 34 96 98 -122 50 -245 -315 -16 -180 347 -7 -161 -80 -83 -189 189 317 -209 -240 85 -205
4965b05J9P8K46j52j41K4M40l06N4j15L28j56k45J13m9J55l06K69j43k8K48j42
$$ -205 -186 -108 138 -14 -155 -131 309 3 57 -58 270 114 -131 -18 -67 88 -218 51 -92 -120 128 -14
4987a4j23K71m62M95j37n7K20j15k87J24q9K19J89N6l29NK00j64m5j9K09o5J15
$$ -14 -137 134 -328 167 30 -27 193 78 -209 -85 -174 45 234 290 -39 -34 166 2 -43 -62 147 82 197
5010A97l36K47J15j44M8j54j3L11k69L55m13j59N80l05j50q6J04J32j08J24O0
$$ 197 -139 108 223 79 127 -27 -40 271 2 357 -56 -215 365 60 -90 -176 -72 60 -48 76 136
5031A36j80K88n02O28n37M66l08l62J11M61j66l05N57j69k48J90j56j11J90k2
$$ 136 -44 244 -258 370 -167 299 -9 -371 -260 201 35 -270 287 118 -130 60 -96 -207 -17 -39
5051c9r3L9N6J87k38J4L77p4Kk64l2Q7J73L3k9l85J70l65O95nl30m4p5K36j64
$$ -39 -132 -93 -37 150 -88 -74 303 229 231 -33 -65 22 195 228 199 -186 -16 -381 314 309 -21 -65 -140 96 -68
5076f8J49K8o3r7p6K34j96L12l80L73l72O9J37j54J74j03o6K49o88O09j81j67
$$ -68 81 109 46 -51 -127 107 -89 223 -157 216 -156 -87 50 -104 70 -33 -99 150 -538 71 -110 -277
5098b77K33j22K02J45J1n03N36m40m5K75j33M9mj43K65j49l01J82o8L53r7J67
$$ -277 -44 -166 36 181 192 -311 225 -215 -260 15 -118 -69 -73 -216 49 -100 -401 -219 -287 66 -31 136
5120A36j77Q9J20j28m2j86K49l31o2K86p1j50J99O0J64k93K59m19J02j6J23R1
$$ 136 -41 48 168 40 -2 -188 61 -270 -332 -46 -117 -267 -68 -8 156 -137 122 -297 -195 -211 -88 3
5142Cj15k18O12j96j71K41K9k02m0O5O4k31K15L4l05K94k24J77o8n5K1k0p9J27
$$ 3 -112 -330 282 86 -85 156 185 -17 -57 8 72 -159 56 90 -215 79 -145 32 -36 -91 -70 -90 -169 -42
5166d2m0j64r6K91J96l0l92M41k89L4j44K29K6L10k02o5M6k76L55J2j71j77K59
$$ -42 -82 -246 -342 -51 145 115 -277 164 -125 -91 -235 -6 20 330 128 63 109 -167 188 200 29 -148 111
5189A11M1n4O7j51j23J73%n9O2o9j76N6J73J67m4j32j33J55q3Jj23K71q3j08J93
$$ 111 152 98 165 14 -109 64 64 5 67 -2 -178 -122 51 218 174 42 -91 64 -19 -18 -141 130 47 -61 132
5214A32K28j20Q0R6k07J30k39k12M1J79J17k5k69J3M96l48r3p4J3J93L7J39j54
$$ 132 360 240 320 416 209 339 100 -112 -71 108 225 200 -69 -56 440 92 -1 -75 -62 131 168 307 153
5237A53q1K52q8j25j45J30K36j05J11k51j5J0k71K28R5j89J23k42jR0j72P8J69
$$ 153 72 324 236 111 -34 96 332 227 338 87 72 82 -189 39 134 -55 68 -174 -175 -85 -257 -179 -10
5260a0J6J00k06K56j29N5Lj66J04j24J43r4k34K9R3K18j12m21K87K92l15K21j52
$$ -10 6 106 -100 156 27 82 85 -81 23 -101 42 -52 -286 -257 -164 54 -58 -479 -192 100 -215 6 -146
5283a46J26m5k68J20m6Q5Pj39KJ0J26L24k11k42k5L78R9j21j34q0K8K81l29L6
$$ -146 -20 -65 -333 -213 -259 -174 -167 -306 -304 -294 -168 156 -55 -297 -322 56 155 34 -100 -180 -152 129 -200 -164
5307a64R6j15K23j41po3j90J9L41N2J0m1J3n5K73m37k5K8k37N96j62r7K10l43
$$ -164 -68 -183 40 -101 -108 -171 -361 -342 -1 51 61 20 33 -22 251 -186 -211 -183 -420 176 14 -83 127 -216
5331b16J33J65R2k55L16j6l82K72j21j6M7K38n7m65J0O3J26O2N0j50j37o3M35
$$ -216 -83 82 174 -81 235 219 -163 109 -12 -28 19 257 200 -265 -255 -192 -66 -4 46 -104 -241 -304 131
5354A31j23J14J18j72J27lJ22k05K57j53j82O0J42j11r0J66J8m4L17l61n6j04
$$ 131 8 122 240 68 195 192 314 109 366 213 31 91 233 122 32 198 216 172 489 128 72 -32
5376c2K56k98K01O5m2j76J39k10R3J07J00k32R9j2p8J38Q4n09K61L93n34M48l58
$$ -32 224 -74 127 192 150 -26 113 -97 -4 103 203 -29 70 58 -20 118 202 -307 -46 347 -187 261 -97
5399i7J7L71k2j53j3j34L7N8L12l53J8j70K22NM0j39L15l41L01l60J06M8j29L17
$$ -97 -80 291 269 116 103 -31 6 64 376 23 41 -129 93 98 138 -1 314 -27 274 -86 20 68 -61 256
5423B56k43K0M8n1q6K7j61K13j10J09p2L02m89L36j89q0P8J23k56q7K98P8q5J7
$$ 256 13 33 81 30 -56 -29 -190 23 -87 22 -50 252 -237 99 -90 -170 -92 31 -225 -312 -14 64 -21 -4
5447dPmJ20l25J82m9K81p6m34K93J18k07k96K74j96J1L40K9q7k0J72J90l14j6
$$ -4 3 -1 119 -206 -24 -73 208 132 -302 -9 109 -98 -394 -120 -316 -305 35 64 -23 -43 129 319 5 -11
5471a1J16Rm6k82K25J7k27J37J95L73n05j74N19l64L7q0P1J14k86o7K14j42K75
$$ -11 105 114 68 -214 11 28 -199 -62 133 506 1 -173 346 -18 19 -61 10 124 -162 -229 -15 -157 118
5494A18j10J15K6k17r4Lk39M00J09r6k97L77k93K26K95l00m3r5jJ72J60l60M5
$$ 118 8 123 149 -68 -162 -159 -398 2 111 15 -282 95 -198 28 323 23 -20 -115 -116 56 216 -144 -99
5517i9K29j80j24J01k88N48k40K52q6N2R3k86J98j57K36l64r4P5J23k11O9l0M95
$$ -99 130 -50 -174 -73 -361 187 -53 199 113 165 258 -28 170 13 249 -115 -209 -134 -11 -222 -153 -183 312
5540C12l72k01L42k2M4k34J1k14L61j85L20k34m6P9j8J29M1l20N27j63k65O5j4
$$ 312 -60 -261 81 59 103 -131 -120 -334 27 -158 162 -72 -118 -39 -57 72 113 -207 320 157 -108 -43 -57
5563e7j73M10j98J68k42rR7O7K54k89j11K18j48K90k08j84R0l8J99kj43o8J96
$$ -57 -230 180 -18 150 -92 -101 -4 63 317 28 -83 135 -13 277 69 -115 -25 -63 136 134 -9 -77 119
$$ [...]
8191A08
##END NTUPLES=NMR FID
##END=
