##TITLE=1H_SR13_K+TFA
 CDCl3, 8 sc, 
 28.2.2020
##JCAMPDX= 6.0         $$ Bruker NMR JCAMP-DX V2.0
##DATA TYPE= NMR FID
##DATA CLASS= NTUPLES
##ORIGIN= UXNMR, Bruker Analytische Messtechnik GmbH
##OWNER= root
$$ XWIN-NMR		Version 3.5
$$ Fri Feb 28 14:33:49 2020 Russian Standard Time (UT+4h)  she@DPX200
##.OBSERVE FREQUENCY= 200.1315
##.OBSERVE NUCLEUS= ^1H
##.DELAY= (6, 6)
##.ACQUISITION MODE= SIMULTANEOUS
##.ACQUISITION SCHEME= undefined
##.AVERAGES= 8
##.DIGITISER RES= 18
##SPECTROMETER/DATA SYSTEM= spect
##.PULSE SEQUENCE= zg30
##.SOLVENT NAME= D2O
##.SHIFT REFERENCE= (INTERNAL, D2O, 0, 15.7039)
##AUDIT TRAIL= $$ (NUMBER, WHEN, WHO, WHERE, WHAT)
$$ ##TITLE= Audit trail, XWIN-NMR		Version 3.5
$$ ##JCAMPDX= 5.01
$$ ##ORIGIN= Bruker BioSpin GmbH
$$ ##OWNER= she
$$ F:/spectra/data/she/nmr/H-F/1/audita.txt
$$ ##AUDIT TRAIL=  $$ (NUMBER, WHEN, WHO, WHERE, WHAT)
(   1,<2020-02-28 14:32:37.73 +0400>,<she>,<DPX200>,
      <created by zg, POWCHK disabled, PULCHK disabled
       configuration hash MD5:
       00 E9 B6 7A A2 85 ED C7 34 08 36 98 17 FE 4E 26
       data hash MD5: 16K
       0C FD 65 AF 7B C7 45 AA 48 CA 62 80 FF 7C 32 C3>)
$$ ##END=
$$ 
$$ hash MD5
$$ 36 08 51 E7 1F 36 EE 19 B4 29 85 09 2B 3A 92 BD
##$RELAX= 
##$RELAX= 
##$RELAX= 
##$RELAX= 
##$RELAX= 
##$RELAX= 
$$ Bruker specific parameters
$$ --------------------------
##$DU= <F:/spectra>
##$EXPNO= 1
##$NAME= <H-F>
##$PROCNO= 1
##$TYPE= <nmr>
##$USER= <she>
##$AMP= (0..31)
100 100 100 100 100 100 100 100 100 100 100 100 100 100 100 100 100 100 
100 100 100 100 100 100 100 100 100 100 100 100 100 100 
##$AQSEQ= 0
##$AQ_mod= 1
##$AUNM= <au_zg>
##$AUTOPOS= <>
##$BF1= 200.13
##$BF2= 200.13
##$BF3= 200.13
##$BF4= 200.13
##$BF5= 200.13
##$BF6= 200.13
##$BF7= 200.13
##$BF8= 200.13
##$BYTORDA= 1
##$CFDGTYP= 0
##$CFRGTYP= 5
##$CHEMSTR= <none>
##$CNST= (0..31)
1 1 145 1 1 1 1 1 1 1 1 1 1 1 1 1 1 1 1 1 1 1 1 1 1 1 1 1 1 1 1 1 
##$CPDPRG= <>
##$CPDPRG1= <>
##$CPDPRG2= <>
##$CPDPRG3= <>
##$CPDPRG4= <mlev>
##$CPDPRG5= <mlev>
##$CPDPRG6= <mlev>
##$CPDPRG7= <mlev>
##$CPDPRG8= <mlev>
##$CPDPRGB= <>
##$CPDPRGT= <>
##$D= (0..31)
0 1.2 0 0 0 0 0 0 0 0.06 0 0.03 0 0 0 0 0.0002 0 0 0 0 0 0 0 0 0 0 0 0 
0 0 0 
##$DATE= 1582885957
##$DBL= (0..7)
120 120 120 120 120 120 120 120 
##$DBP= (0..7)
150 150 150 150 150 150 150 150 
##$DBP07= 0
##$DBPNAM0= <>
##$DBPNAM1= <>
##$DBPNAM2= <>
##$DBPNAM3= <>
##$DBPNAM4= <>
##$DBPNAM5= <>
##$DBPNAM6= <>
##$DBPNAM7= <>
##$DBPOAL= (0..7)
0.5 0.5 0.5 0.5 0.5 0.5 0.5 0.5 
##$DBPOFFS= (0..7)
0 0 0 0 0 0 0 0 
##$DE= 6
##$DECBNUC= <off>
##$DECIM= 24
##$DECNUC= <off>
##$DECSTAT= 4
##$DIGMOD= 1
##$DIGTYP= 9
##$DL= (0..7)
0 120 120 120 120 120 120 120 
##$DP= (0..7)
150 150 150 150 150 150 150 150 
##$DP07= 0
##$DPNAME0= <>
##$DPNAME1= <>
##$DPNAME2= <>
##$DPNAME3= <>
##$DPNAME4= <>
##$DPNAME5= <>
##$DPNAME6= <>
##$DPNAME7= <>
##$DPOAL= (0..7)
0.5 0.5 0.5 0.5 0.5 0.5 0.5 0.5 
##$DPOFFS= (0..7)
0 0 0 0 0 0 0 0 
##$DQDMODE= 0
##$DR= 18
##$DS= 0
##$DSLIST= <SSSSSSSSSSSSSSS>
$$ [...]
##$SUBNAM2= <"">
##$SUBNAM3= <"">
##$SUBNAM4= <"">
##$SUBNAM5= <"">
##$SUBNAM6= <"">
##$SUBNAM7= <"">
##$SUBNAM8= <"">
##$SUBNAM9= <"">
##$SW= 24.9337058887773
##$SWIBOX= (0..15)
0 0 2 0 0 0 0 0 0 0 0 0 0 0 0 0 
##$SW_h= 4990.01996007984
##$TD= 16384
##$TD0= 1
##$TE= 0
##$TE2= 300
##$TE3= 300
##$TEG= 300
##$TL= (0..7)
0 120 120 120 120 120 120 120 
##$TP= (0..7)
150 150 150 150 150 150 150 150 
##$TP07= 0
##$TPNAME0= <>
##$TPNAME1= <>
##$TPNAME2= <>
##$TPNAME3= <>
##$TPNAME4= <>
##$TPNAME5= <>
##$TPNAME6= <>
##$TPNAME7= <>
##$TPOAL= (0..7)
0.5 0.5 0.5 0.5 0.5 0.5 0.5 0.5 
##$TPOFFS= (0..7)
0 0 0 0 0 0 0 0 
##$TUNHIN= 0
##$TUNHOUT= 0
##$TUNXOUT= 0
##$USERA1= <user>
##$USERA2= <user>
##$USERA3= <user>
##$USERA4= <user>
##$USERA5= <user>
##$V9= 5
##$VALIST= <valist>
##$VCLIST= <CCCCCCCCCCCCCCC>
##$VD= 0
##$VDLIST= <DDDDDDDDDDDDDDD>
##$VPLIST= <PPPPPPPPPPPPPPP>
##$VTLIST= <TTTTTTTTTTTTTTT>
##$WBST= 1024
##$WBSW= 4
##$XGAIN= (0..3)
0 0 0 0 
##$XL= 0
##$YL= 0
##$YMAX_a= 310677
##$YMIN_a= -207829
##$ZGOPTNS= <>
##$ZL1= 120
##$ZL2= 120
##$ZL3= 120
##$ZL4= 120
##$ABSF1= 10
##$ABSF2= 0
##$ABSG= 5
##$ABSL= 3
##$ALPHA= 0
##$AQORDER= 0
##$ASSFAC= 0
##$ASSFACI= 0
##$ASSFACX= 0
##$ASSWID= 0
##$AUNMP= <proc_1d>
##$AZFE= 0.1
##$AZFW= 0.1
##$BCFW= 1
##$BC_mod= 2
##$BYTORDP= 1
##$COROFFS= 0
##$CY= 11.3945322036743
##$DATMOD= 1
##$DC= 2
##$DFILT= <>
##$DTYPP= 0
##$F1P= 16.9975609425685
##$F2P= -3.02152046262296
##$FCOR= 0.5
##$FTSIZE= 0
##$FT_mod= 4
##$GAMMA= 1
##$GB= 0.15
##$INTBC= 1
##$INTSCL= 1
##$ISEN= 128
##$LB= 0.24
##$LEV0= 0
##$LPBIN= 0
##$MAXI= 10000
##$MC2= 0
##$MEAN= 0
##$ME_mod= 0
##$MI= 1.114404
##$NCOEF= 0
##$NC_proc= 0
##$NLEV= 6
##$NOISF1= 3.799351
##$NOISF2= 2.8
##$NSP= 1
##$NTH_PI= 0
##$NZP= 0
##$OFFSET= 15.70392
##$PC= 1
##$PHC0= -9787.647
##$PHC1= 16.00082
##$PH_mod= 1
##$PKNL= yes
##$PPARMOD= 0
##$PSCAL= 0
##$PSIGN= 0
##$REVERSE= no
##$SF= 200.130013532006
##$SI= 16384
##$SIGF1= 3
##$SIGF2= 2
##$SINO= 400
##$SIOLD= 16384
##$SREGLST= <1H.CDCl3>
##$SSB= 0
##$STSI= 0
##$STSR= 0
##$SW_p= 3612.71676300578
##$SYMM= 0
##$S_DEV= 0
##$TDeff= 0
##$TDoff= 0
##$TI= <>
##$TILT= no
##$TM1= 0
##$TM2= 0
##$TOPLEV= 0
##$USERP1= <user>
##$USERP2= <user>
##$USERP3= <user>
##$USERP4= <user>
##$USERP5= <user>
##$WDW= 1
##$XDIM= 8192
##$YMAX_p= 0
##$YMIN_p= 0
$$ End of Bruker specific parameters
$$ ---------------------------------
##NTUPLES= NMR FID
##VAR_NAME=  TIME,          FID/REAL,        FID/IMAG
##SYMBOL=    X,             R,               I
##VAR_TYPE=  INDEPENDENT,   DEPENDENT,       DEPENDENT
##VAR_FORM=  AFFN,          ASDF,            ASDF
##VAR_DIM=   8192,          8192,            8192
##UNITS=     SECONDS,       ARBITRARY UNITS, ARBITRARY UNITS
##FACTOR=    0.0002004,     1,               1
##FIRST=     0,             0,               0
##LAST=      1.6414764,     0,               0
##MIN=       0,             -207829,         0
##MAX=       1.6414764,     310677,          0
$$ Real data points
##PAGE= N=1
##DATA TABLE= (X++(R..R)), XYDATA
0@%%%%%%lJ1j6J6j6K4l2M0m9N7p2Q8j04J20j39J62j88K18k50K87l31L75m25M84
$$ 0 0 0 0 0 0 0 -3 8 -8 8 -8 16 -16 24 -25 32 -40 48 -56 64 -75 87 -101 117 -133 154 -177 198 -227 257
30B57n45O13o88P71q63R60j068J190j321J466j626J798j991K207k443K707l007
$$ 257 -288 325 -363 408 -455 505 -563 627 -694 772 -854 944 -1047 1160 -1283 1424 -1583
47a583L344l728M171m691N310o057O983q170R755j1984J5387k1307L4560j19454
$$ -1583 1761 -1967 2204 -2487 2823 -3234 3749 -4421 5334 -6650 8737 -12570 21990 -97464
61i7464P702J06507r4811Q8874J35574o5154k32969n6088Q7002O5725M4565J00777
$$ -97464 -89762 16745 -78066 10808 146382 81228 -151741 -207829 -120827 -55102 -10537 90240
73I0240q832j51836q2004J03895R3732j98K167m574j25910j10871R7509J86905
$$ 90240 81408 -70428 -152432 -48537 45195 44997 47164 42590 -83320 -194191 -96682 90223
85I0223L6453n1061p78l9423j46192m6073J50035J23709l7794l3913L4622n4503
$$ 90223 126676 75615 74837 35414 -110778 -156851 -6816 116893 79099 45186 79808 25305
97B5305j13114O6239K01833K3095j91267j20821M5945N3576K5893R1653Q9751
$$ 25305 -87809 -21570 180263 203358 12091 -108730 -62785 -9209 16684 108337 198088
108A98088m6495j15348m7674N7Q59N9285R4695j1720j14368m2256P0624N5835
$$ 198088 151593 36245 -11429 -11372 -10513 48772 143467 131747 17379 -24877 45747 101582
120A01582J5073L9725K447j21767j22126M4213J32257N3178n945P716l5922j05822
$$ 101582 116655 156380 158827 37060 -85066 -40853 91404 144582 138637 146353 110431 4609
132D609l7635R1646P7978l0685m3802N711j9257m3591M4288J22400M2514q9549
$$ 4609 -33026 58620 136598 105913 62111 67822 48565 4974 49262 171662 214176 124627
144A24627j08461m5575L290N1398R5749N8873l9637p5492l2342P60R604M3093
$$ 124627 16166 -29409 -26119 25279 121028 179901 140264 64772 32430 33190 42794 85887
156H5887N0663k5006r5953n3711L9160P0316N1558L5505r528q6598r8329j0236
$$ 85887 136550 111544 15591 -38120 1040 71356 122914 158419 148891 62293 -36036 -46272
168d6272P0502O6887K8779K6m1085p3174k7824N9241P4283L423n1242m8304l3591
$$ -46272 24230 91117 119896 119922 78837 5663 -22161 37080 111363 114786 63544 15240 -18351
181a8351j5244L9056Q8268N6575l2288q2875o5331k0071K8360O4087N1743r580
$$ -18351 -33595 5461 93729 150304 118016 35141 -30190 -50261 -21901 42186 93929 84349
193H4349n7280m2510K026L0945M3128L2933j8872p6478o9143K197N8305O1494
$$ 84349 27069 -15441 -13415 17530 60658 93591 74719 -1759 -70902 -68705 -10400 51094
205E1094L7631L35n3518p9120k9814M3026N8559K0504j2814k9868m3642k4952
$$ 51094 88725 89060 35542 -43578 -73392 -30366 28193 48697 35883 6015 -37627 -62579
217f2579L7131P3085L1627l7857o3128m6101j6670K7216O9210N7700r360o0177
$$ -62579 -25448 47637 79264 41407 -21721 -67822 -84492 -57276 11934 69634 60274 97
229I7n4036j8057J6750M4962M1761n448n5413m7780Q60L8417M7885L5546n439
$$ 97 -53939 -71996 -55246 -10284 31477 26029 -29384 -77164 -76304 -37887 9998 45544 40105
242D0105n9784p0134j8830L8803N4448L9019R110l4244o0404l0511L0447N3982
$$ 40105 -19679 -89813 -108643 -69840 -15392 23627 32737 -1507 -61911 -92422 -61975 -7993
254g993K4184j5481l7480m2298j9763K9071O4516M2160j3362n0895n1842k4830
$$ -7993 16191 710 -36770 -79068 -98831 -69760 -5244 36916 23554 -27341 -79183 -104013
266a04013J7959N3265M7545K998l8243m4458j9223J6380M3674L7977l734m6873
$$ -104013 -86054 -32789 14756 17754 -20489 -64947 -84170 -67790 -24116 13861 10127 -36746
278c6746n0289j2903L1141N1871M0670J972m1724n5908k7451K0096M7081L7887
$$ -36746 -87035 -99938 -68797 -16926 23744 25716 -16008 -71916 -99367 -79271 -32190 5697
290E697M910k7996m0772k2814J6795M6026L8102l677m1251m6708k0103K1212N0608
$$ 5697 10607 -17389 -58161 -80975 -64180 -18154 19948 16271 -24980 -71688 -91791 -70579 -19971
303a9971M6705O056l9506m9915k1577J5355L6636L6174J1698k6778m5265j9946
$$ -19971 26734 32790 -6716 -56631 -78208 -62853 -26217 9957 21655 -5123 -50388 -70334
315g0334K1546M1379L1396N088k9191n0194k9654K0916N1958L8030M527k3544
$$ -70334 -48788 -7409 23987 29075 -116 -50310 -79964 -59048 -7090 30940 35467 11923
327A1923m0745l2958P766M5953L8195q28k7108k9666k0120N485M0770M4427M316
$$ 11923 -28822 -61780 -54014 -8061 30134 29306 2198 -27468 -47588 -42103 -1333 43094 47410
340D7410l6705m0616k0186O123L5707M8141J7111l2433m5264j7592J1287K5452
$$ 47410 10705 -29911 -50097 -43974 -8267 39874 56985 24552 -20712 -38304 -27017 -1565
352a565L2776J8141k3817m6200k0935K0173L4254K7999J3820j6435m6662l4581
$$ -1565 31211 49352 25535 -20665 -41600 -21427 12827 40826 54646 38211 -8451 -43032
364d3032J2726M1688L1203P944j2362l4004l4338K523M0659L4847J296k0212k7545
$$ -43032 -30306 11382 42585 50529 38167 4163 -30175 -27652 13007 47854 49150 28938 1393
377A393k5991j236L7471M2841N986k7757l2137k1309m520K6857M3901J8669k4414
$$ 1393 -24598 -25834 11637 54478 60464 32707 570 -20739 -25259 1598 45499 64168 39754
390C9754l7887j7372L685J9874L1379J8993j9241m2665k3015J0990K7186K8561
$$ 39754 1867 -15505 -11820 8054 39433 58426 39185 -3480 -26495 -15505 11681 40242
402D0242J7003j1843l8921l2127M505L0361K8247J2383q915l1032l0709R7L0502
$$ 40242 57245 45402 6481 -25646 -21141 9220 37467 49850 40935 9903 -20806 -20709 9793
415I793L1300Q331j4232k7886k7578l675K8657L6513J1260j8076k9336k4375n868
$$ 9793 41093 49424 35192 7306 -20272 -23947 4710 41223 52483 34407 5071 -19304 -25172
428b5172K1187L4639J7991j4222l0570k1692q19J9998K8966J6722j2724l3224
$$ -25172 -3985 30654 48645 34423 3853 -17839 -18658 1340 30306 47028 34304 1080
440A080k5881M10K2505K9183J6949q857k9754k7311l281K1462K7240J4024q290
$$ 1080 -24801 -24391 -1886 27297 44246 35389 5635 -21676 -24957 -3495 23745 37769 29479
453B9479k6286k5924m730K1227K9113J4803r339k5843k4239n353J8925K9945J6721
$$ 29479 3193 -22731 -27461 -6234 22879 37682 28343 2500 -21739 -27092 -8167 21778 38499
466C8499j0114k6855k3072n097J5776K5921J7191o217k5624k4608l406J7935K5038
$$ 38499 28385 1530 -21542 -26639 -10863 15058 32249 26032 408 -24200 -27606 -9671 15367
479A5367J5215n570k4723k5632o255J7862K6331J5207m830k1898k3485p210J6790
$$ 15367 30582 25012 289 -25343 -31598 -13736 12595 27802 22972 1074 -22411 -29621 -12831
492a2831K7011J5111p779k2636k1981p450J2560K5164J7474m699k2191k1638n963
$$ -12831 14180 29291 21512 -1124 -23105 -30555 -17995 7169 24643 19944 -2247 -23885 -29848
505b9848J2991K3983J7392m048k3540k3017n381J3972K2120J6230k20j9712k4446
$$ -29848 -16857 7126 24518 20470 -3070 -26087 -31468 -17496 4624 20854 20634 922 -23524
518b3524q146J3835K2946J5407k710j8826k1949r534J2824K3268J4488l516j7378
$$ -23524 -31670 -17835 5111 20518 17808 -1018 -22967 -32501 -19677 3591 18079 14563 -2815
531b815k0122j0669J0031K5285J9672k568j9634j8976p884O589J8686J7871O48
$$ -2815 -22937 -33606 -23575 1710 21382 18814 -820 -19796 -27680 -21091 -2405 15466 16114
544A6114j8178j9747n803R868J9029J7794J349k0198k4599p266J1678J7044J3638
$$ 16114 -2064 -21811 -27614 -17746 1283 19077 20426 228 -24371 -31637 -19959 -2915 10723
557A0723M861j0559k1193j2136R948K0382J2187l37j1904j8393j1685R644K3322
$$ 10723 15584 5025 -16168 -28304 -18356 2026 14213 13876 1972 -16421 -28106 -18462 4860
570D860J4697l493j2761j6101j3408K359K0895K0466k66j4933j3942n816K398
$$ 4860 19557 16064 3303 -12798 -26206 -23847 -2952 17514 17248 2315 -11627 -17443 -15045
583a5045J3544J6219J400j6393j6385m600N412J5226K0349Q146j6063k4729q849
$$ -15045 -1501 14718 16118 -275 -16660 -21260 -15848 -622 19727 27873 11810 -12919 -21768
596b1768Q716J1950J0657N439o864j7264q827Q986J5253Q541J276p916j8498j3913
$$ -21768 -13052 -1102 9555 14994 8130 -9134 -17961 -8975 6278 14819 16095 8179 -10319 -24232
610b4232O644K0368J4708K564o943j5123j5540n41J7529J6516k16j0255j0747
$$ -24232 -17588 2780 17488 20052 13109 -2014 -17554 -18095 -566 15950 15734 5479 -5268
623e268p466K579J5336J4330j842j4320j2616p176j561J0377J9562J1401p937
$$ -5268 -12734 -10155 5181 19511 17669 3349 -9267 -16443 -18004 -7627 11935 23336 15399
636A5399j7112j0650o3R123J3274N063j0900j5912m300Q354J1992J0858M064q685
$$ 15399 -1713 -12363 -12426 -3303 9971 15034 4134 -11778 -16078 -7724 4268 15126 19190 10505
650A0505j7925j0770K388R273J0500R208J43j2947j3484J07J0648R288L448n457
$$ 10505 -7420 -18190 -15802 -6529 3971 13179 13322 375 -13109 -13002 -2354 6934 10382 4925
664D925j3934j1727N275J9343J3249k085q745j0223j1149k995Q914J1659M424
$$ 4925 -9009 -20736 -15461 3882 17131 15046 6301 -3922 -15071 -18066 -9152 2507 6931
677F931o55l455r752o260Q205J5023K412j2368j2652o003J01J0915J9899Q664
$$ 6931 6276 2821 -6931 -13191 -4986 10037 12449 81 -12571 -18574 -18473 -7558 12341 21005
691B1005j1810j6338m215J507K2O112J0448l23j0207n624L406M292M761Q395q45
$$ 21005 9195 -7143 -11358 -9851 -9829 -3717 6731 6408 -3799 -9423 -6017 -1725 3036 11431 10586
706A0586j7961j6084M184J5830J0967M841R82j0363j5136j845J1017N788l336
$$ 10586 -7375 -23459 -19275 -3445 7522 12363 13345 2982 -12154 -13999 -2982 2806 -530
719e30M58J571o635n115R850J3679L16q594o819q332r977M885K1623J2350q014
$$ -530 -72 1499 -5136 -10251 -401 13278 13594 5000 -1819 -10151 -20128 -15243 6380 18730 10716
734A0716j1145k101p14j576O003O884n389j0474j97O081K540M621J0729R86j5993
$$ 10716 -429 -2530 -3244 -4820 1183 8067 2678 -7796 -7993 -1912 628 5249 15978 16964 971
749I71j4762Q56P363N283Q047P025o289j3885j488J1033M007m883k075j417p523
$$ 971 -13791 -12935 -5572 -289 7758 14783 8494 -5391 -6879 4154 8161 3278 1203 -214 -7737
764g737m030J0850J4158K020n582l504o853j0831j128J2434J0261k238n209j475
$$ -7737 -11767 -917 13241 15261 9679 6175 -678 -11509 -12637 -203 10058 7820 2611 1136
778A136j166j46O207O640o613j2669l944M648M082M130R999N195r023j2781l252
$$ 1136 -30 -176 6031 12671 6058 -6611 -10555 -5907 -1825 2305 12304 17499 8476 -4305 -7557
793g557L388K331L598M701j571p754j197Q295O001j919l693k889p747p470M950
$$ -7557 -4169 -1838 1760 6461 4890 -2864 -4061 4234 10235 8316 4623 1734 -6013 -13483 -8533
808h533J4419P193l900l126k115n436n131M746O912r91n782q97J792J255M877
$$ -8533 5886 13079 9179 6053 3938 -1498 -6629 -1883 5029 4038 -1744 -2641 -849 406 5283
823E283Q294j362j2609q998K387L616L55O157R382j329j0793m361M948K011k292
$$ 5283 13577 12215 -394 -9392 -7005 -3389 -3034 3123 12505 11176 383 -3978 970 2981 689
838F89J675L18p170l466Q978J0260j404m095O00l769j1560k692J1929Q701l883
$$ 689 2364 2682 -4488 -7954 1024 11284 9880 5785 6385 2616 -8944 -11636 293 8994 5111
853E111k798L335k099n778L223O857l285q328o92K958j949L352J1984L900j1987
$$ 5111 2313 5648 3549 -2229 994 7851 4566 -3762 -4454 -1496 -3445 -93 11891 15791 3804
868C804r358K974J949m202K246R787k23q799n62O834L3l994L430J051j0059p436
$$ 3804 -5554 -2580 -631 -4833 -2587 7200 6977 -1822 -2384 4450 4483 489 3919 4970 -5089 -12525
884a2525Q676J0128q74j972L929j963j0799l271Q434L378m633j62L584l396k889
$$ -12525 -3849 6279 5405 3433 7362 5399 -5400 -8671 -237 3141 -1492 -1654 1930 -1466 -4355
899d355O351N555n068o771J226J6o141J469J2216M925q075n556K882l77l875K638
$$ -4355 1996 7551 2483 -4288 -3062 -3046 -9187 -7718 4498 9423 1348 -4208 -1326 -1703 -5578 -2940
915b940N452l608o307K676N371j005j532M937M84r092o184M216M773j77K246L885
$$ -2940 2512 -1096 -7403 -4727 644 -361 -1893 3044 3528 -5564 -11748 -7532 -2759 -2936 -690 3195
931C195k665o580L54M195j14j875P26k67m508R5P190L745l394k708P78k197n079
$$ 3195 530 -6050 -5696 -1501 -1615 -3490 -2764 -3031 -7539 -7444 -254 3491 97 -2611 -1833 -4030 -9109
948i109R31O584K572k600o81o32j926J31L839J699m182k872J207J221P95K628
$$ -9109 -8178 -1594 978 -1622 -2303 -2935 -4861 -4730 -891 808 -3374 -6246 -5039 -3818 -3023 -395
964c95L061j747l979j388J73k28R56L514R73k740j280J347R56j32J325J94l304
$$ -395 2666 919 -3060 -4448 -4275 -4503 -3547 -33 940 -1800 -3080 -1733 -777 -909 416 610 -2694
981b694l207J752L606J405M17Q90j513k947m4J611K80k8J849Ll275j118L396K509
$$ -2694 -5901 -4149 -543 862 1279 2169 656 -2291 -2335 -724 -444 -472 1377 1380 -1895 -3013 383 2892
999B892j390p77J08k221k811K646M675M00k708K43M91k439j475L379K511k340
$$ 2892 1502 725 833 -1388 -4199 -1553 3122 3522 814 1057 1548 -891 -2366 1013 3524 1184
1015A184j305J568n07j506J923L572q98m371m68J734j268m39M026J211l843k671
$$ 1184 -121 1447 940 -566 1357 4929 4031 -340 -808 926 -342 -781 3245 4456 613 -2058
1031b058K698K140k349J71K996l33m289n74L827K25j921J551J925l169l088K571
$$ -2058 640 2780 431 602 3598 3265 -1024 -1598 2229 2454 533 2084 4009 840 -2248 323
1047C23L525j711j731J454N00l635l6M126L09k696q4J884j509k639K460L473j998
$$ 323 3848 2137 406 1860 2360 -1275 -1311 2815 3124 428 344 2228 719 -1920 540 4013 2015
1064B015l046J860J776k831o76L839J249m372j852K870P13j975P37L372p39l886
$$ 2015 -1031 829 2605 -226 -902 2937 4186 -186 -2038 832 1545 -430 307 3679 2940 -946
1080i46M01K475q78k242J367J876k014j579K363K772j577j271J297n80l081K97
$$ -946 -545 1930 1052 -1190 177 2053 39 -1540 823 3595 2018 747 2044 1464 -1617 -1320
1096a320L214P10k346M42K429j686k470J824K118j594k910J480K029j091q81K924
$$ -1320 1894 2604 258 700 3129 1443 -1027 797 2915 1321 -1589 -109 1920 829 -52 2872
1112B872J634k849k687J323O67j487J21K914O76k244j36J733l42k110K2R73j274
$$ 2872 4506 1657 -1030 293 960 -527 -406 2508 3184 940 804 2537 2195 85 107 1080 -194
1129a94j649J773K383k95n28J598o83k495j685J420J290j645J35L107R7k253M26
$$ -194 -1843 -70 2313 2018 1490 3088 2405 -90 -1775 -355 935 -710 -575 2532 2629 376 802
1146H02J952j078l414r2J780m11r66K009K571j128k451N06R66k569j053J504J044
$$ 802 2754 1676 -1738 -1830 -50 -461 -1427 582 3153 2025 -426 80 1046 -1523 -2576 -1072 -28
1163b8r74N08K045Q42k105o30M36j608j882P09J944K03l10K208O95k030j782P66
$$ -28 -1002 -494 1551 2393 288 -342 94 -1514 -3396 -2687 -743 -540 -850 1358 2053 23 -1759 -993
1181i93o9k196o43J956J542q84Q59K061m82k744r26N25j007j201J750K201N72
$$ -993 -1062 -3258 -3901 -1945 -403 -1287 -428 1633 1151 -1593 -2519 -1994 -3001 -4202 -2452 -251 321
1198C21q19P51J59j410j831L77k96p09M80K039J422r2p6L12j683j932l79M88J92
$$ 321 -498 253 412 -998 -2829 -2452 -2748 -3457 -2977 -938 484 392 316 628 -1055 -2987 -3366 -2878 -2686
1217b686p1K220J335L01p49j12m19j874j278P3M55N39J701J602R05j222o68m51
$$ -2686 -2757 -537 798 1099 350 238 -181 -2055 -3333 -3260 -2805 -2266 -565 1037 1942 720 52 -399
1235c99j304j314n04J191J177N68J302J068J71j238j131j428o63j76K0J969J512
$$ -399 -1703 -3017 -3521 -2330 -1153 -585 717 1785 1956 718 -413 -1841 -2504 -2680 -2660 -691 821
1252H21J090K69m41p93j459j027o68l57k23J626K260J433m35n39k57j240j917
$$ 821 1911 2180 1739 946 -513 -1540 -2208 -2565 -2788 -1162 1098 2531 2096 1557 1300 60 -1857
1269a857j235L85Q52J481J427J326m11r05K9r47k162j125Q19Q82N67J298J945
$$ -1857 -3092 -2707 -1855 -374 1053 2379 1968 1063 1092 145 -2017 -3142 -2323 -1441 -874 424 2369
1286B369M25j418j498j72j905j087K65J621J124R13J156N59j014q40m56j661k304
$$ 2369 2794 1376 -122 -294 -2199 -3286 -3021 -1400 -276 637 1793 2352 1338 498 42 -1619 -3923
1303c923l88K401K232P94M82O20q29j312r58j260j625R6K254J805J01M97J404
$$ -3923 -4311 -1910 322 1116 1598 2218 1389 77 -881 -2141 -3766 -3670 -1416 389 490 987 2391
1320B391K97k341k057r60n44k76J641K225J182K73K85l70j358j631j156n25J31
$$ 2391 2688 347 -1710 -2670 -3214 -3490 -1849 376 1558 1831 2116 1746 388 -1243 -2399 -2924 -2793
1337b793J006K300J448n0K24L0r36k050k036k75P42J722J835Q61L03J31J36j256
$$ -2793 -1787 513 1961 1911 2135 2165 1229 -821 -2857 -3132 -2390 -668 1167 2028 2331 2462 2598 1342
1355A342k142j240p4O51J185J268J203J360N76j399j916j433o99l72N31J620J880
$$ 1342 -800 -2040 -2114 -1463 -278 990 2193 3553 4129 2730 814 -619 -1318 -1690 -1159 461 2341
1372B341N76L63K42K00j779k180o79o17O20J363K249J086K93kl05j857k541o32
$$ 2341 2917 3280 3522 3722 1943 -237 -916 -1533 -913 450 2699 3785 4078 4076 3771 1914 -627 -1259
1390a259J005J019N9J092J910P51l57n35j771j981j237P79M92L67J731K444N35
$$ -1259 -254 765 824 1916 3826 4577 4220 3685 1914 -67 -1304 -525 -33 334 2065 4509 5044
1407E044j795r72m09j649j871N68J505P41nK017J475r54j452q27j407k055k29
$$ 5044 3249 2277 1868 219 -1652 -1084 421 1162 1157 3174 4649 3695 2243 1416 9 -2046 -2275
1424b275J737J631L81R04K019n43k897r31k63o95j148O90K039Q19P20J294K31
$$ -2275 -538 1093 1474 2378 4397 3854 957 26 -237 -932 -2080 -1390 649 1468 2188 3482 3713
1441C713k393j956k0n14j497M35L163J461o24k78J202r03k626j158M08n10n50
$$ 3713 1320 -636 -656 -1170 -2667 -2232 931 2392 1768 1490 2692 1789 -837 -1995 -1587 -2097 -2647
1458b647J789L186L8q23K65m18k218k054N36R28m69O77K693J141j511p89O92j045
$$ -2647 -858 2328 2366 1543 1808 1390 -828 -2882 -2346 -1418 -1887 -1210 1483 2624 1113 324 1016 -29
1476b9k296j014J312M80O1J942K905j280k505L99M08k258j938J878K101l73k19
$$ -29 -2325 -3339 -2027 -1547 -1486 456 3361 2081 -424 -25 383 -1875 -3813 -1935 166 -207 -426
1493d26K193R28k382r06P48j556k685O90K844R87o12J540J466j725k608M19O50
$$ -426 1767 2695 313 -593 155 -1401 -4086 -3396 -552 435 -177 1363 2829 1104 -1504 -1085 -435
1510d35k199q44K831J996j097m03K546J44l356j063Q13o40k434K244L632o48j509
$$ -435 -2634 -3478 -647 1349 252 -151 2395 2539 -817 -1880 -1067 -1707 -4141 -1897 1735 1087 -422
1527d22J172J428k904k396J163J182k021n9L018J609j915k84K244j166l618p43
$$ -422 750 2178 -726 -3122 -1959 -777 -2798 -2857 161 1770 -145 -429 1815 649 -2969 -3712
1543c712K302j16j163K193K541j601j867J325J125l323j937K142J244j970M96
$$ -3712 -1410 -1526 -2689 -496 2045 444 -1423 -98 1027 -2296 -4233 -2091 -847 -2817 -2321
1558b321L749K59k760OJ697j947l390J153K985k48j648K380K179k690j584J916
$$ -2321 1428 1687 -1073 -1067 630 -1317 -4707 -3554 -569 -817 -2465 -85 2094 -596 -2180 -264
1574b64J10l740q41L267J247j909P78L305j012l017p0J303k421j216K618K539
$$ -264 -154 -3894 -4735 -1468 -221 -2130 -1352 1953 941 -2076 -2146 -843 -3264 -4480 -1862 677
1590F77j623j326K888J256k872j645J782n09k329Q34L438J8k000J572K091k124
$$ 677 -946 -2272 616 1872 -1000 -2645 -863 -1372 -3701 -2867 571 589 -1411 161 2252 128
1606A28k831J169J378j692q35K574J560j752n22K653M6l269m54J168l1r39J454
$$ 128 -2703 -1534 -156 -1848 -2683 -109 1451 -301 -823 1830 1876 -1393 -1847 -679 -710 -1649 -195
1623a95K720r79j574J257N29k190j732J655J434j359m9K085P01j211j24J049j437
$$ -195 2525 1546 -28 1229 1758 -432 -2164 -509 925 -434 -483 1602 2303 1092 968 2017 580
1640E80j832N40J644n36l13J545J637j274j412Q49J6j815n14J509M95o01L60J614
$$ 580 -1252 -712 932 396 83 1628 3265 1991 579 1428 1444 -371 -885 624 1119 518 878 2492
1658B492l14p00p5o14o94p72P23J619l94J30R21M12j431q30N78j77j124L16Q16
$$ 2492 2178 1478 1403 789 95 -677 46 1665 1271 1401 2322 2734 1303 473 1051 874 -250 66 882
1677H82J57j73R92N54n89r95j099N31m89J03O95Q18L30k32k87K16m01p48l64K41
$$ 882 1039 866 1858 2412 1823 828 -271 260 -229 -126 569 1387 1717 1485 1198 1414 1013 265 -99 142
1697A42j86K05M56N22J51N77o34r10m27l0k69N23K78J78K01K54J65o43j49k21
$$ 142 -44 161 617 1139 1290 1867 1233 323 -104 -134 -403 120 398 576 777 1031 1196 553 404 183
1717A83n90J33n5M63N32K77M83o5p35o30Lm16n4L33R44k48J04L87J91j56p33o36
$$ 183 -407 -274 -329 134 666 943 1426 1361 626 -4 -1 -417 -471 -138 806 558 662 1049 1240 1084 351 -285
1739b85P5k79K37L30O54M16J77%q84n31PJ99m89L58O15O1k20L00M13J57q63n92
$$ -285 -210 -489 -252 78 732 1148 1325 1325 441 -90 -83 116 -373 -15 600 661 441 741 1154 1311 448 -144
1761a44K3l97J71O29P54M20n80j78J40o61k98j07K01j15Q1L09N48K81L22p44k79
$$ -144 -121 -518 -347 282 1036 1456 876 698 838 177 -121 -228 -27 -142 -61 248 796 1077 1399 655 376
1782C76n90l05J3J70L00Q51q4j36J65k08m50m37J23L5m99K76N26J92L39o3Kp97
$$ 376 -214 -519 -506 -336 -36 815 731 595 760 552 102 -335 -212 -177 -676 -400 126 318 657 594 596 -201
1804b01m49J40k9L6m5O70K17o93N15J10o24l77L0k28j09n92R53J531p04n22J62
$$ -201 -650 -510 -539 -503 -548 122 339 -354 161 271 -353 -730 -700 -928 -1037 -1629 -676 855 151 -371 -209
1825b09j13j199j03Q49l29j2J16P64j74LJ46K86j280o71L93L14j59K43J273J58
$$ -209 -322 -1521 -1624 -775 -1104 -1116 -1000 -236 -410 -407 -261 25 -1255 -1926 -1533 -1219 -1378 -1135 138 296
1845B96r30j21K23l46j016O07O96n41p75J025R48l53m86O40l72j218o90J111N37
$$ 296 -634 -755 -532 -878 -1894 -1287 -591 -1132 -1907 -882 66 -287 -773 -133 -505 -1723 -2413 -1302 -765
1864g65j34K82J107n89p44L4L44k62q71K96N06k09J65J091P76r53p97N39p66o94
$$ -765 -899 -617 490 -99 -843 -809 -465 -727 -1598 -1302 -796 -1005 -840 251 1027 74 -723 -184 -950 -1644
1884a644O50P00L82q58M47J255q62m09L75J68j336r00J094R24J36L60Q18m68j007
$$ -1644 -994 -294 88 -770 -323 932 70 -339 36 204 -1132 -2032 -938 -14 122 482 1300 832 -175
1903a75m00L63l82j98L23M66n8K29N33L17m87q46q9k64l25L5J013O77l8j71L84
$$ -175 -575 -212 -594 -792 -469 -3 -61 168 701 1018 531 -315 -404 -668 -993 -958 55 732 694 523 907
1924I07k25j336p4Q33n48o53M61J158j95K96N51j68j146m64k65M1k08O42J114
$$ 907 682 -654 -728 105 -443 -1096 -635 523 328 624 1175 1007 -139 -603 -868 -827 -1035 -393 721
1943G21J34o72K63m34j98n29M13l73m73j06R48Q58L34j85n06l98o29k94L78J46
$$ 721 855 183 446 12 -186 -715 -302 -675 -1148 -1254 -306 552 886 701 195 -203 -832 -1126 -748 -602
1963f02K98O85r2k45p8M16J71p28p16l09P3K77Q89O20L83l70k56m27l86n72K96
$$ -602 -304 381 289 44 -34 382 553 -175 -891 -1200 -1127 -850 39 659 1042 672 416 -11 -397 -969 -673
1984f73J43N69J45Q0L09J39k9n4o41q73o58L50Q38Q76P00J34l30o34k63O7n12
$$ -673 -530 39 184 264 573 712 683 629 -12 -885 -1543 -1193 -355 521 1221 1355 1025 391 128 195 -317
2005c17j73O7P33p8R9Q35M66k31l78j038m87l70N89O92Q28Q8J23k12l83k66j30
$$ -317 -490 -423 310 232 331 1166 1632 1401 1023 -15 -502 -872 -283 409 1237 1325 1448 1236 853 587 457
2026D57j20m93j19L70M03K38O03O95o26n75o66n51n4K91Q20M71j9l43N74k32j21
$$ 457 337 -156 -275 95 498 736 1339 2034 1408 833 167 -384 -438 -147 673 1144 1125 782 1356 1124 1003
2047A003m22m13l75m93L80Q44R71L26k38j45j137o32j50K75K62JM72K28Q1L5K23
$$ 1003 581 168 -207 -700 -320 524 1495 1821 1583 1438 301 -331 -481 -206 56 57 529 757 838 873 1096
2068A096j6j091m28k23j57P5J452P35N7q02p0n34r71K56K26J89k90K67N03L59
$$ 1096 1080 -11 -439 -662 -819 -744 708 1443 1500 698 628 94 -877 -621 -395 -206 -496 -229 274 633
2088F33K16j60n4p43j043j61J52J028J64O85Nl56l27k45k39k27k19L85m16J89
$$ 633 849 689 635 -108 -1151 -1312 -1160 -132 32 717 722 366 39 -206 -445 -672 -891 -506 -922 -733
2108g33O44R29L5n92l76p32m83j97K83R32O43j33L22j97k90L0k85k2r41J36N69
$$ -733 -89 840 875 283 -93 -825 -1308 -1505 -1222 -290 353 220 542 345 55 85 -200 -222 -1163 -1027 -458
2129d58K87Q51J36K42l84p78p59k77J61N23M69L14m1K66k06L26j34k78q00l97
$$ -458 -171 680 816 1058 674 -104 -863 -1140 -979 -456 13 327 286 552 346 672 538 260 -540 -937
2149i37L10M19M81O06M48m67n00l90m52k49J18M95L82j49K4K58M85m86R4m45o22
$$ -937 -627 -208 273 879 1327 860 360 -30 -482 -731 -613 -118 264 115 139 397 882 396 490 45 -577
2170e77m95K76R18N04N2L5K58q65p12M48o6L3k15L53J82l33M31P99L3j051n27
$$ -577 -1072 -796 122 626 678 713 971 106 -606 -158 -224 -191 -406 -53 129 -204 227 1026 1059 8 -519
2191e19k06j40k8N26R99o0o16K59Q4m35m54M04k5r39J77J095Q9q0K23P37j389
$$ -519 -725 -865 -893 -367 632 572 -44 215 299 -136 -590 -186 -211 -1150 -973 122 211 131 354 1091 -298
2212b98j038J58O62J3k34J012J8l86q31J008K1r63m40N82k52j65O05R23L39j022
$$ -298 -1336 -1178 -516 -503 -737 275 293 -93 -924 84 105 -858 -1298 -716 -968 -1133 -528 395 734 -288
2232b88n7L48j218l41Q08O83j36n33N37L84o63j14R41l41j230RQ19J35k41N68
$$ -288 -345 3 -1215 -1556 -748 -65 -201 -734 -197 187 -476 -590 351 10 -1220 -1211 -392 -257 -498 70
2252G0Q82n58j243M13M13l58m59R64L0n29l80J204M20r39k38N71q04o69O00J181
$$ 70 952 394 -849 -436 -23 -381 -840 124 154 -375 -755 449 869 -70 -308 263 -541 -1210 -610 571
2272E71M33j186P45J31p75n08J057R2p39k05M94L70n57K81J029k12j254o5N96
$$ 571 1004 -182 563 694 -81 -589 468 560 -179 -384 110 480 -77 204 1233 1021 -233 -298 298
2291B98j11o61Q66P87o77r30P31O10o95n38Q89Q8j097j55J382Q2m60k35P64m58
$$ 298 187 -474 392 1179 502 -428 303 913 218 -320 569 657 -440 -595 787 869 409 174 938 480
2311D80j479R81O62k4q26N02N78p25p79R02N87p24p21O66J50m89j34J243O1j075
$$ 480 -999 -18 644 620 -206 296 874 149 -630 272 859 135 -586 80 230 -259 -393 850 911 -164
2331a64k99P29k82l26J49Q82m24q91K67Q39l31n82P60M36j316n58J223K29n23
$$ -164 -463 266 -16 -342 -193 689 265 -626 -359 480 149 -433 327 763 -553 -1111 112 341 -182
2350a82k69J011p0j536P07R94j38r74J67Q96q10q11J027P82p16p76M81O11j059
$$ -182 -451 560 490 -1046 -339 655 517 -457 -290 606 -204 -1015 12 794 78 -698 -217 394 -665
2369f65L09Q98N23j465k52R12j36o16N31R34p97r07O24N12m5m24N69J10o23q83
$$ -665 -356 542 1065 -400 -652 260 124 -492 39 973 176 -731 -107 405 360 -64 505 615 -8 -891
2389h91J215M71p58j2Q00j24j248N72M84J98p29K82Q38p60p42P04Q33p28k69N11
$$ -891 324 795 37 25 825 701 -547 25 509 707 -22 260 1098 338 -404 300 1133 405 136 647
2409F47k34n26M3J201j9j074L1O82k17m09P70K52n21r53Q24L27m44j20P38l0j083
$$ 647 413 -113 -70 1131 1112 38 69 751 534 125 895 1147 626 -327 497 824 380 260 998 968 -115
2430a15j55Q76K13n91L83K01m45l57K33N38k82l80N05nm77j96P27j77j46k4pj86
$$ -115 -270 606 819 228 611 812 367 10 243 781 499 119 624 619 142 -54 673 496 350 326 319 133
2452A33l20L83K61k39j45K04K6l58k32O62K41p67k56O49m46j56P5N23l11l85K25
$$ 133 -187 196 457 218 73 277 303 -55 -287 375 616 -151 -407 242 -204 -360 -285 238 -73 -458 -233
2473b33K56l15k88P44J3o13m7L48l61N1K81K11K7q12L63J06k40K05m2J90n29j28
$$ -233 23 -292 -580 164 177 -436 -483 -135 -496 -445 -164 47 74 -738 -375 -269 -509 -304 -346 -156 -685 -813
2495h13L72R2q3N6L18n88j59L55j01k43N22J59m94l37L03L72J5l87j41M24l47
$$ -813 -441 -349 -432 -376 -58 -646 -805 -450 -551 -794 -272 -113 -607 -944 -641 -269 -254 -641 -782 -358 -705
2516g05j67M81Q3j23KkM8n65N51J32R6n87J47K56k16J4L66K32k87n29K99Q6j8
$$ -705 -872 -391 -308 -431 -429 -431 -383 -948 -397 -265 -169 -756 -609 -353 -569 -555 -189 43 -244 -773 -474 -388 -406
2539d06K99J82k09l08n5K60k02j25j3Q08m67k96N26J80m22k07M65K3p07r1P58
$$ -406 -107 75 -134 -442 -497 -237 -439 -564 -577 231 -236 -532 -6 174 -248 -455 10 33 -674 -765 -7
2560gJ10j81J18J12k26m09J35M29j35m25L73Rl10Q7O33l22l18k66K29N5LQ5M97
$$ -7 103 -78 40 152 -74 -483 -348 81 -54 -479 -106 -97 -407 -320 313 -9 -327 -593 -364 -309 -306 -221 276
2583B76m38k39K90N8l82n5J03L63k91l37L91m2K30j66L17k67j56l93M71K25R5
$$ 276 -162 -401 -111 -53 -435 -490 -387 -24 -315 -652 -261 -303 -73 -239 78 -189 -345 -738 -267 -42 53
2604E3j39J67k5m69J96P53o67m1j74K87j12K22J44K38m29l35K6J65l54L99M72
$$ 53 -86 81 56 -413 -217 536 -131 -172 -346 -59 -171 51 195 433 4 -331 -305 -140 -494 -95 377
2625C77k24j42jN30j46m64K26J92m94k11N71J36j08L80k59K41l11l49L90P6k38
$$ 377 153 11 10 540 394 -70 156 348 -146 -357 214 350 242 622 363 604 293 -56 334 410 172
2646A72M12M2J00m70N38l99J01k07m8K14R3l99M10O94m18k13Q7N3l49pL78J91
$$ 172 584 626 726 256 794 395 496 289 241 455 548 149 559 1253 835 622 709 762 413 406 784 975
2668I75l06K60K79l35N5p1K96l01n93L35J35K6j00L36L00m05l43K25N0L6m19M85
$$ 975 669 929 1208 873 928 857 1153 852 259 594 729 755 655 991 1291 886 543 768 818 854 435 920
2690I20m6l94L50J05K01m14j09l6l04n9L19L66k30l77N20J85m60k90L26l54j97
$$ 920 874 480 830 935 1136 722 613 577 273 214 533 899 669 292 812 997 537 247 573 219 22
2711B2j8L43Rj35M46l18P6n64n9K63j46J70l4K60L7j31m2J70n21l8R9j86l36L60
$$ 22 4 347 356 221 667 349 425 -139 -198 65 -81 89 55 315 352 221 179 349 -172 -210 -111 -297 -633 -273
2735b73J07M3K75j74k4j79l49J3j7P8K22J33P1j39j87K81l42j05j23O4r0J25K39
$$ -273 -166 -123 152 -22 -46 -225 -574 -561 -578 -500 -278 -145 -74 -213 -400 -119 -461 -566 -689 -625 -715 -590 -351
2758c51M68n94J94k42o9j32K41k97q4K82K0P1L36Q7l89J82n26j63J59J73J85L06
$$ -351 117 -477 -283 -525 -594 -726 -485 -782 -866 -584 -564 -493 -157 -70 -459 -277 -803 -966 -807 -634 -449 -143
2780a43P6j53jk87m2l5k51L25k98L13J22J62J36q6p0j56k17k45L00p1M12J6q5
$$ -143 -67 -220 -221 -508 -550 -585 -836 -511 -809 -496 -374 -212 -76 -162 -232 -388 -605 -850 -550 -621 -209 -193 -278
2803b78K75J9j77j02j04j96j30L56LJ78L13K3j85k89n49Q9J60J6K32N00n96N04
$$ -278 -3 16 -161 -263 -367 -563 -693 -337 -334 -156 157 180 -5 -294 -843 -754 -594 -578 -346 154 -442 62
2825F2k57K17j19m94J64J14m57K49L26K44r0m1P1j24l29p2K8L79m21K11M28J84
$$ 62 -195 22 -97 -591 -427 -313 -770 -521 -195 49 -41 -82 -11 -135 -464 -536 -508 -129 -550 -339 89 273
2847B73n85N45l46K00l98m35P53o59O76L6R8L24j006K47K10l13l09N61J9l62L95
$$ 273 -312 233 -113 87 -311 -746 7 -652 24 60 158 482 -524 -277 -67 -380 -689 -128 -109 -471 -76
2868g6K12J69k65J0l22O2l34J95J99J5L94J52J69n29M6l37J54j0J97lM7o0K25
$$ -76 136 305 40 50 -272 -210 -544 -349 -150 -135 259 411 580 51 97 -240 -86 -96 101 98 145 85 310
2891C10L93l80P3l17J20l44J42M0L75L05k51L66j2l60n2L1j62k81K28J89K56J67
$$ 310 703 323 396 79 199 -145 -3 37 412 717 466 832 820 460 408 439 277 -4 224 413 669 836
2913H36R4j76j05m4k49k90L11l7K85J65o8K92m5j21k31p3j22J20k4J82J61r3J40
$$ 836 930 754 649 605 356 66 377 340 625 790 722 1014 969 848 617 544 422 542 518 700 861 768 908
2936I08k01K1k73J38Jl7L5Q0j91K14n8L34j24m00n3l47L33j64K51M1J11k8l17
$$ 908 707 728 455 593 594 557 592 672 481 695 637 971 847 447 394 47 380 216 467 508 619 591 274
2959B74J88j25k2j08m7k3J5O4M16j54L10p36K62n23o5M39n4k2o1M40n27L34n19
$$ 274 462 337 315 207 160 137 152 216 632 478 788 52 314 -209 -274 165 111 89 28 468 -59 275 -244
2982b44J05K4j81K90m32N24J64l38P1j91N6l50J02kj68K81N8k25N4M34k81p7j02
$$ -244 -139 -115 -296 -6 -438 86 250 -88 -17 -208 -152 -502 -400 -402 -570 -289 -231 -456 -402 32 -249 -326 -428
3005d28j93P1M6j69M03k10L59j7j87k73K5O9P9j71k9M6M86k1j02j06L2k68o9L08
$$ -428 -621 -550 -504 -673 -270 -480 -121 -138 -325 -598 -573 -504 -425 -596 -625 -579 -93 -114 -216 -322 -290 -558 -627 -319
3029c19j54j00N32j77M67k54p38M62j13j61K02k62L62l17K04O8L09nm39K08r9
$$ -319 -473 -573 -41 -218 249 -5 -743 -281 -394 -555 -353 -615 -253 -570 -366 -298 11 6 -433 -225 -324
3050c24o95M91J87L95k58N8J00m8k47K0K8n7j77N5L20K15L2r3m7m47K09k6j03
$$ -324 -1019 -528 -341 54 -204 -146 -46 -94 -341 -321 -293 -350 -527 -472 -152 63 95 2 -45 -492 -283 -309 -412
3073d12Q6J54m9m7R0J41K39m34j0K18l52J09p0K93M9j28o7K10k22k37K60k49M15
$$ -412 -326 -172 -221 -268 -178 -37 202 -232 -242 -24 -376 -267 -337 -44 5 -123 -190 20 -202 -439 -179 -428 -13
3096a3j58P6l0N6j0K97j82k68l47K10J08q1L16k4J51k12q6L0J52o31O01L21n77
$$ -13 -171 -95 -125 -69 -79 218 36 -232 -579 -369 -261 -342 -26 -50 101 -111 -197 -167 -15 -646 -45 276 -301
3119c01J6J68Q4K68m59L15j18j49l05L32J94J15Q6o7l04N6j70K23l2k83J5L34
$$ -301 -285 -117 -33 235 -224 91 -27 -176 -481 -149 45 160 246 179 -125 -69 -239 -16 -48 -331 -316 18
3141A8j6L1O05o23N8p3R6k02Q8rK92k77K70l89L27n4qj25J69j10j39M22Ll01L10
$$ 18 2 33 638 15 73 0 96 -106 -18 -27 265 -12 258 -131 196 142 134 9 178 68 -71 351 354 53 363
3166C63K57l53l4j86L24k64M1Q7Q3k6k80M12j15NQ6l20L8R8J25j45K77m3j59Q0
$$ 363 620 267 233 47 371 107 148 235 318 292 12 424 309 314 400 80 118 216 341 196 473 430 271 351
3190C51j49J47J02k04L93m54Q1L38j22P2r6J34k32m62K39P9j6J04M8j2k06M05
$$ 351 202 349 451 247 640 186 267 605 483 555 459 593 361 -101 138 217 201 305 353 341 135 540
3212E40l07J32j10ml04q9L47m5J83kJ28l93Mq7k16L27k98K63L42l16K11M3k78
$$ 540 233 365 255 251 -53 -142 205 160 343 341 469 76 80 -7 -223 104 -194 69 411 95 306 349 71
3235G1m0J82m65O5kj8J01j49L01k64N30o27J46J18k13K5J67K01k49J42j24J38
$$ 71 31 213 -252 -187 -189 -207 -106 -255 46 -218 312 -315 -169 -51 -264 -239 -72 129 -120 22 -102 36
3257C6k93J34m65o0K77J86K24j47J85l51O7r0J84k25L21l2N1l29K64R4O4k71j29
$$ 36 -257 -123 -588 -648 -371 -185 39 -108 77 -274 -207 -297 -113 -338 -17 -49 2 -327 -63 31 95 -176 -305
3280c05Op8J42K37k80K97O3l47K3M52l53j23K41j42j82L04Q7K63l44J61jk90L2
$$ -305 -299 -377 -235 2 -278 19 82 -265 -242 210 -143 -266 -25 -167 -349 -45 42 305 -39 122 121 -169 -137
3303a37j84L42o2M33j96j4n1J12k7k82Kr9oK92M8K37pk0l22K47l61K84j57P9M2
$$ -137 -321 21 -41 392 196 182 131 243 216 -66 -64 -163 -169 123 171 408 401 381 59 306 -55 229 72 151 193
3328A93Q8j55L67l53r0M51j52j83p60M23N0J89L06o5j20j07O1j09k16K98J79l88
$$ 193 281 126 493 140 50 501 349 166 -594 -171 -121 68 374 309 189 82 143 34 -182 116 295 -93
3350i3j19L75Q0K8l1N6j63l17L71l15L13l57L35J19j54Ln67M75p4k75j90N79J40
$$ -93 -212 163 243 271 240 296 133 -184 187 -128 185 -172 163 282 128 131 -436 39 -35 -310 -500 79 219
3373B19l81L67L90o77J51k92J69j46M6K96l05L22k69R8L31n39J74K94l08l27K45
$$ 219 -162 205 595 -82 69 -223 -54 -200 -154 142 -163 159 -110 -12 319 -220 -46 248 -60 -387 -142
3394a42j9J8k0j34N05m07k18M29l3j83J70R7k37o0K55K7K22m23l36L93j18K4j77
$$ -142 -161 -143 -163 -297 208 -199 -417 12 -21 -204 -34 63 -174 -234 21 48 270 -153 -489 -96 -214 -190 -367
3417c67L54K40k6k96O1k61K72L34l76Q2k99J56K48r5j01J02p7J1l12J23K89j1
$$ -367 -13 227 201 -95 -34 -295 -23 311 -65 17 -282 -126 122 27 -74 28 -49 -38 -350 -227 62 51
3439E1L26q3n3k74RK16q1j31L23k37j02J44J76k64k54L36l33J1O7K78Kkk98N89
$$ 51 377 294 241 -33 -24 192 111 -20 303 66 -36 108 284 20 -234 102 -231 -220 -153 125 127 125 -173 416
3463D16p0n44J95q5K96k00k02J55J22k07K77k87L00l75J79k77l1O25k31m2k00
$$ 416 346 -198 -3 -88 208 8 -194 -39 83 -124 153 -134 166 -209 -30 -307 -338 287 56 14 -186
3484a86n7J75J35j15o7k7k63J86o1O1O2R1J2k4j30j2n5%J31L4q6N1k47J91J37
$$ -186 -243 -68 67 -48 -115 -142 -405 -219 -280 -219 -157 -66 -54 -78 -208 -220 -275 -275 -144 -110 -196 -145 -392 -201 -64
3509f4j25k44k2K93j42j13L23K30Ol26m28K49L70m10K39l1k77N25k3j80K33r4
$$ -64 -189 -433 -455 -162 -304 -417 -94 136 142 -184 -612 -363 7 -403 -164 -195 -472 53 30 -150 83 -11
3531a1j91k42j0J46K2L78j70P9q4J72l43L30LJ36j12l94o3J62K08M8K42q3k53
$$ -11 -202 -444 -454 -308 -286 92 -78 1 -83 89 -254 76 79 215 103 -291 -354 -192 16 64 306 223 -30
3554c0j04p0K33J7n8K17J66j79j80J14L35k48P4l43jJ6K6N42O8k63j90K62k28
$$ -30 -134 -204 29 46 -12 205 371 192 12 126 461 213 287 -56 -57 -41 -15 527 595 332 142 404 176
3577A76J81L8p4k9n4J85L6m7P7k48j69L06l72Q1j50J96R3mj00l8j47K13j02q2
$$ 176 357 395 321 292 238 423 459 412 489 241 72 378 6 87 -63 133 226 222 122 84 -63 150 48 -34
3601c4l7K41L62n13L96p2J78k35o8k31K81j57J47Q2k5l6j11M7o3J14Q6n04O2O9
$$ -34 -71 170 532 19 415 343 521 286 218 -13 268 111 258 340 315 279 168 215 152 266 352 -152 -90 -21
3625b1o6O5K21j66N0l94K79j10K24Q0j9l61M5l9K02M3j78n6J98j06j97j3M5N7
$$ -21 -87 -22 199 33 83 -311 -32 -142 82 162 143 -218 -173 -212 -10 33 -145 -201 -3 -109 -306 -319 -274 -217
3649b17L99l43k7J46q5o8J89P1q7l9P4j61J77K30l08mj56j39J84Q8J6N12m25l69
$$ -217 182 -161 -188 -42 -127 -195 -6 65 -22 -61 13 -148 29 259 -49 -53 -209 -348 -164 -76 -60 452 27 -342
3673c42N68j98J2Nq4Q6K1J42l16p0L99n08J45j99J12Q2K53j10Q1J65l0k56p5j0
$$ -342 226 28 40 45 -39 47 68 210 -106 -176 223 -285 -140 -339 -227 -145 108 -2 79 244 214 -42 -117 -127
3697a27K97Kk75J35J79k59M16l57j74N19k86o9j20J96K0j51k5j62L19NK39j85
$$ -127 170 172 -103 32 211 -48 368 11 -163 356 70 1 -119 77 97 -54 -79 -241 78 83 322 137
3719A37j84o5r3K57j34L4K10k55J00q0j21O6K8j77p5L70M3LJ91l41J52r4j16J78
$$ 137 -47 -112 -205 52 -82 -48 162 -93 7 -73 -194 -128 -100 -277 -352 18 61 64 255 -86 66 -28 -144 34
3743C4m10K15K76j61j97K61j35Q1l86J4L31p1k13K99J48m69K90n8K01l12m0L99
$$ 34 -376 -161 115 -46 -243 18 -117 -36 -422 -408 -77 -148 -361 -62 86 -383 -93 -151 50 -262 -302 97
3765I7k00l65J27K91L0k67K5K12j56j28J99j72O1N3j57L18j31L8j91l7k87L93
$$ 97 -103 -468 -341 -50 -20 -287 -262 -50 -206 -334 -135 -307 -246 -193 -350 -32 -163 -125 -316 -353 -640 -247
3787b47J58J33l05j0K11j4l52L93R7l1m15L68k02J6J27R0rq9J24l69mK48L48J45
$$ -247 -89 44 -261 -271 -60 -74 -426 -33 64 33 -382 -14 -216 -200 -73 17 8 -81 43 -326 -330 -82 266 411
3811D11n69K23o3j20J80j27R0K29k40J19J01j46q4Q8kj14K3R5K04k69j71R5K25
$$ 411 -158 65 2 -118 62 -65 25 254 14 133 234 88 4 92 90 -24 -1 94 298 29 -142 -47 178
3834A78J2n0j34n0j05L05O0k20L11j43j42p8J03J52j89J32J89j07np8NL7O4L64
$$ 178 190 140 6 -44 -149 156 216 -4 307 164 22 -56 47 199 10 142 331 224 219 141 146 183 247 611
3858F11m73L08O9n56j97L55k0M1k10K24o0K4n5K7Kn7o3J15j32j32K63J81l37J52
$$ 611 138 446 515 -41 -238 117 97 138 -72 152 92 116 61 88 90 33 -30 85 -47 -179 84 265 -72 80
3882H0k34J66J62l78J23J05j69P3K42j7J54m16L01j50j80J74m17M22k58J66L00
$$ 80 -154 12 174 -204 -81 24 -145 -72 170 153 307 -109 192 42 -138 36 -381 41 -217 -51 249
3903B49m94j51M74q8j71J75l6J22J83rk74K32j79qj5J30k27p5K43l2J1k99K31
$$ 249 -245 -396 78 -10 -181 -6 -42 80 263 254 -20 212 33 25 10 140 -87 -162 81 49 60 -239 -8
3926hR2r2J24j16j89K43J8j93J04J62j93J14m1j10K18J08o7k01N5P2N3j56J21
$$ -8 84 -8 116 0 -189 54 72 -121 -17 145 -48 66 25 -85 133 241 174 -27 28 100 153 -3 118
3949A18J43j92J98k67J36J75j61j8L6J19n7k57K85O1J7k51K0j68J27Q2J35K01
$$ 118 261 69 267 0 136 311 150 132 168 287 230 -27 258 319 336 85 105 -63 64 146 281 482
3971D82j97k51j04K14p9%K7P5J19m16M70j32j81K63k60j45K64l4K63j24j17K0
$$ 482 285 34 -70 144 65 65 92 167 286 -130 340 208 27 290 30 -115 149 115 378 254 137 157
3993A57l05K47k81L96k14J08l49M30J03k75J53j24j08J35j17j88J35L39M5k44
$$ 157 -148 99 -182 214 0 108 -241 189 292 17 170 46 -62 73 -44 -232 -97 242 287 43
4013D3k03J92L15n42K88n9m5O9j72J5p6J5J10K52l80k53N5L48qj54j6M33l16q2
$$ 43 -160 32 347 -195 93 34 -11 58 -114 -99 -175 -160 -50 202 -178 -431 -376 -28 -36 -190 -206 227 -89 -171
4037a71R6l22M90j0n21K61O9q1L34k26j18m1j65M35p1j79L17k49jK8k16K79j3
$$ -171 -75 -397 93 83 -438 -177 -108 -189 145 -81 -199 -240 -405 30 -41 -220 97 -152 -153 -125 -341 -62 -75
4060g5k17K64j60k29M58j23J62l0m8r2L2k55L79N2l85M45l65K13j3R0M0j42J15
$$ -75 -292 -28 -188 -417 41 -82 80 50 2 -90 -58 -313 66 118 -267 178 -187 26 13 103 143 1 116
4083A16P5K6m83m4N26n0q4N8j05M8L78n01N7K14j90J22ql51K84j80J14J94l53
$$ 116 191 217 -266 -310 216 166 82 140 35 83 461 -40 17 231 41 163 155 -196 88 -92 22 216 -137
4106a37J54J18k89K22o7M8j36j06J50K66k08p1Q4j22K65k40L93p3k17K41m75j14
$$ -137 17 135 -154 68 1 49 -87 -193 -43 223 15 -56 28 -94 171 -69 324 251 34 275 -200 -314
4128c14N01k77K7R5j37L34p17K28L90p9m51K90m2J01j55K75l48J62rpj50J65j55
$$ -314 187 -90 -63 32 -105 229 -488 -260 130 51 -400 -110 -152 -51 -206 69 -279 -117 -126 -133 -283 -118 -273
4151b73r6L68J48m00L29l22J36J5j54Q5r1L27k75J13n0J83l38Q4K16k25J39j55
$$ -273 -369 -1 147 -253 76 -246 -110 -95 -249 -164 -255 72 -203 -90 -140 43 -295 -211 5 -220 -81 -236
4173b36Nj01L31k6l40L73j26J48q9J70n49K71K65j60K42M7j48O5r3l70J06J85
$$ -236 -231 -332 -1 -27 -367 6 -120 28 -61 109 -440 -169 96 -64 178 225 77 142 49 -321 -215 -30
4195c0J48r8n2R8p9J90K0M1j04k80J65l7O9j45K71k19J77p7l6L22j86M9Q5m87
$$ -30 118 20 -32 66 -13 177 197 238 134 -146 19 -18 51 -94 177 -42 135 58 22 344 158 207 292 -195
4219a95N76l57R7N5j1m7r0j91J84Q4J66Q2j94l8j40l3M80k3l46J0j23M13m22M43
$$ -195 381 24 121 176 165 118 28 -163 21 105 271 353 159 121 -19 -52 428 405 59 69 -54 359 -63 380
4243C80k9k75M47l23m5R8j87m8j43M03k58R2Kk33j1M50m36r5L79J00k37k31N44
$$ 380 351 76 523 200 155 253 66 18 -125 278 20 112 114 -119 -130 320 -116 -211 168 268 31 -200 344
4266C44l25q8j19K81R5k5p1l52M60k32k88J96j02P5P8l80K98L26n93M12Q2m36
$$ 344 19 -69 -188 93 188 163 92 -260 200 -32 -320 -124 -226 -151 -73 -453 -155 171 -422 -10 72 -364
4288c64N06j1l58K69j60m8q1R8M5J03mm3L50m86J77K4j08J28m6j8o5J14m3P9k88
$$ -364 142 131 -227 42 -118 -166 -247 -149 -104 -1 -5 -48 302 -184 -7 17 -91 37 -9 -27 -92 22 -21 58 -230
4313b30N65l94j79J61J31J8n8j12L35k1n41N2L34j00k03J39K61r7q1J96N2j23
$$ -230 335 -59 -238 -77 54 72 14 -98 237 216 -325 -273 61 -39 -242 -103 158 61 -20 176 228 105
4335A05K0l47J23Q7j42J28L80j26k4m3l29J3K39j32L11q4k24Q3P7J02p1l8J56
$$ 105 125 -222 -99 -12 -154 -26 354 228 204 161 -168 -155 84 -48 263 179 -45 38 115 217 146 108 264
4358B64p0m8j24J63q8j9J83K09p26J76P3j70K19k31L24j14j74K28J0k47L33j91
$$ 264 194 146 22 185 97 78 261 470 -256 -80 -7 -177 42 -189 135 21 -153 75 85 -162 171 -20
4380b0j0L2K32l31J22j6l44M39L6L8m07L05P1l46J58R8j5j36J03M3M1k50J96o7
$$ -20 -30 2 234 -97 25 9 -335 104 140 178 -229 76 147 -199 -41 57 42 -94 9 52 93 -157 39 -28
4404b8n9l4j09J56Q4k42K35j40J33l35R8J91P9K6J14p6k30j5J72K6j93L51m94
$$ -28 -87 -121 -230 -74 10 -232 3 -137 -4 -339 -241 -50 29 55 169 93 -137 -152 20 46 -147 204 -290
4427b90K87m5O7q0j26j39J73p0K45j49j38K41k04R0N0k44P1J67J94k51j03j20
$$ -290 -3 -48 19 -61 -187 -326 -153 -223 22 -127 -265 -24 -228 -138 -88 -332 -261 -94 100 -151 -254 -374
4449c74J95M08k4m41K38J1J36l97Nl6L92r8J66k96K90mp7mJ09m19p4K09m6K21
$$ -374 -179 229 205 -236 2 13 149 -248 -243 -279 113 15 181 -115 175 171 94 90 199 -220 -294 -85 -131 90
4473I0KP9r7J12j13j73L27R7j46o6J40o4j81p9J71k09L58j69R2k74J17R2j98O15
$$ 90 92 171 74 186 73 -100 227 324 178 112 252 188 7 -72 99 -110 248 79 171 -103 14 106 -92 523
4497E23m07J12j84K1J49N0k58j92K27Mj47K68j10k14J56M1Q1j35K4Q9rn3j08J2
$$ 523 116 228 44 65 214 264 6 -186 41 45 -102 166 56 -158 -2 39 120 -15 9 98 89 36 -72 -60
4521f0j60J76n1M13p09M2L17K5K03j22j40M8Q6l70M92j50p7Lj96l2L66l32M97
$$ -60 -220 -44 -95 318 -391 -349 -32 -7 196 74 -66 -18 68 -302 190 40 -37 -34 -230 -262 104 -228 269
4544B69l27J57j14j07o6j09K68L11n77J78J98j05m1k31K60p3O2j74L05k63R5L74
$$ 269 -58 99 -15 -122 -188 -297 -29 282 -295 -117 81 -24 -65 -296 -36 -109 -47 -221 84 -179 -84 290
4566B90m79J63p0nj36K37l54K93q7J01J2k28J18J47j68j3J5J28J59j05K09J8j77
$$ 290 -189 -26 -96 -101 -237 0 -354 -61 -148 -47 -35 -263 -145 2 -166 -179 -164 -36 123 18 227 245 68
4589F8j53J38j27K54j95J6J27r2j10J50K70k31J32n86O30k29k81J60K03J74l96
$$ 68 -85 53 -74 180 -15 1 128 36 -74 76 346 115 247 -339 291 62 -219 -59 144 318 -78
4610g8j3J57J34J18m8j79J50m38M23l20M55j67k95L39l99o1K72K18m1k61K2L79
$$ -78 -91 66 200 318 270 91 241 -197 226 -94 361 194 -101 238 -161 -222 50 268 227 -34 -12 367
4632C67k60J11j07l48L24k14K35j79P6m5J56o3K9K7k51K37lj88j29K80n2J90n47
$$ 367 107 218 111 -237 87 -127 108 -71 5 -40 116 53 82 109 -142 95 92 -96 -225 55 3 193 -354
4655c54L77j87M22j44j42j31M4J62l60L61o6l64K09M81j90Qk48K58l12P2m0k01
$$ -354 23 -164 258 114 -28 -159 -115 47 -313 48 -18 -382 -173 308 118 126 -122 136 -176 -104 -144 -345
4677c45K47k9l4K09N8l1k29J3J73j9j73k01K84j98J76k46K63O3l06K21K56m59
$$ -345 -98 -127 -161 48 106 75 -154 -141 32 13 -160 -361 -77 -275 -99 -345 -82 -19 -325 -104 152 -307
4699c07K42J29n4N2K31k22k88K03L8N8o2L4QL0L04m76N0%j57K28K40j06k24O0
$$ -307 -65 64 10 62 293 71 -217 -14 24 82 20 54 62 92 396 -80 -30 -30 -187 41 281 175 -49 11
4723A1M4J11m4K20n75L8K96N5R0n16L07R3l56K65j00K36K21m28p4K84k97L90L1
$$ 11 55 166 122 342 -233 -195 101 156 246 -270 37 130 -226 39 -61 175 396 -32 -106 178 -119 271 302
4746C02k17J31l22J75O0K3J34k57J82o7l7J7K0j26J02k5J0J26l48RJ48J05K76
$$ 302 85 216 -106 69 129 152 286 29 211 144 107 124 144 18 120 95 105 231 -117 -108 40 145 421
4769D21l77m3K1Q6j21K3M28l69l11n2m2J86K14k78J31J50j07K04l3k66J58k15
$$ 421 44 1 22 108 -13 10 438 69 -242 -294 -336 -150 64 -214 -83 67 -40 164 131 -135 23 -192
4791a92K48n1J98l29K05m1j27j53l7N49l99L1j07j7J51j4j37J79j50R5m3J17k50
$$ -192 56 5 203 -126 79 38 -89 -242 -279 270 -129 -98 -205 -222 -71 -85 -222 -43 -193 -98 -141 -24 -274
4814b74J21J30J6J47k75R3j92J15j12R2P9j58L23j16N4l94K84K60j75J76k21j39
$$ -274 -153 -23 -7 140 -135 -42 -234 -119 -231 -139 -60 -218 105 -11 43 -351 -67 193 18 194 -27 -166
4836a66P2R9N16o32J57J09l51J87j54K8M13j82p1k3R9K36l15j19j2L58k87N4J31
$$ -166 -94 5 521 -111 46 155 -196 -9 -163 -135 278 96 25 2 101 337 22 -97 -109 249 -38 16 147
4859A47k07O2J03N8l94L62j08K6J34j03J04k34m5J12L14m1n18K85R1k53J63K80
$$ 147 -60 2 105 163 -231 131 23 49 183 80 184 -50 -95 17 331 290 -228 57 148 -105 58 338
4881C38p9L7k11N3J28j0j10m0l23J80M48k61j26R9J48j34k20r7L88k20K0K28j04
$$ 338 259 296 85 138 266 256 146 106 -217 -37 411 150 24 123 271 137 -83 -180 208 -12 8 236 132
4904A32k68K39K3k16P6j93N3q3J69L4n7l3M03l75j11O0K23m4j3R9k98L32l64J25
$$ 132 -136 103 126 -90 -14 -207 -154 -237 -68 -34 -91 -124 279 -96 -207 -147 76 32 19 118 -180 152 -212 -87
4928h7q7K6l7r5m6kK16P6K80m88K66j33J75Lm36J06K61l01R3j05J22J12p3P6J50
$$ -87 -174 -148 -185 -280 -326 -328 -112 -36 244 -244 22 -111 64 67 -369 -263 -2 -303 -210 -315 -193 -81 -154 -78 72
4953G2k05Q4K8j08J91J04j04k31j3q1L44j94J61l6j51K97k38J76j85J29R2j54
$$ 72 -133 -49 -21 -129 62 166 62 -169 -182 -263 81 -113 48 12 -139 158 -80 96 -89 40 132 -22
4975b2J42n8p3n1M00m37k1J20%k0J05r6kN2j07L81l58K01j25J23k34L44j49rQ
$$ -22 120 62 -11 -62 338 -99 -120 0 0 -20 85 -11 -13 39 -68 313 -45 156 31 154 -80 264 115 106 114
5000A14l10L85J06mj68p8k3p8N6J9N5l1r9L6L93m72J56o6kK96l83J26Lj72J31
$$ 114 -196 189 295 291 123 45 22 -56 0 19 74 43 -56 -20 373 -99 57 -9 -11 285 -98 28 31 -141 -10
5025a0L51m38K49j08k47J23O7J12k47J06k45L77n8j27P6j08J28q1P8n1q8p1J51
$$ -10 341 -97 152 44 -203 -80 -13 99 -148 -42 -287 90 32 -95 -19 -127 1 -80 -2 -53 -141 -212 -61
5048f1l11J12K02j31K04k91Q9J92j68l9O8L5j89J06j08pK03N7m1j57L01j28k62
$$ -61 -372 -260 -58 -189 15 -276 -187 5 -163 -202 -134 -99 -288 -182 -290 -297 -94 -37 -78 -235 66 -62 -324
5071c24J00K09j59K64k87K16J9k07j59L19P6j51K54Pj85K23l17L41m45K09r5L12
$$ -324 -224 -15 -174 90 -197 19 38 -169 -328 -9 67 -84 170 177 -8 215 -102 239 -206 3 -92 220
5093B20j21l64K86O7j05n5J51J85l09J34j00M4Q5l70J44M21m1k59k32L72K1R6
$$ 220 99 -265 21 88 -17 -72 79 264 -45 89 -11 33 118 -252 -108 313 272 13 -219 153 174 270
5115B70j31O6J27l69M0m8K75Q1k39n3K6p4M6K37K37m92K66k49k88L56K31l35M1
$$ 270 139 205 332 -37 3 -45 230 311 72 19 45 -29 17 254 491 -1 265 16 -272 84 315 -20 21
5138B1j16n6p2O3K31J8N5j33N1J18j99K03l62K18M4p0Q7K28j86l43L27j59j8J54
$$ 21 -95 -151 -223 -160 71 89 144 11 62 180 -19 184 -178 40 84 14 101 329 143 -200 127 -32 -50 104
5162A04k27K90k20J1N5K8k40L52k23J54k63K43n9j56N2J49lo0K1L05k40k65J68
$$ 104 -123 167 -53 -42 13 41 -199 153 -70 84 -179 64 5 -151 -99 50 47 -13 8 313 73 -192 -24
5185b4j08J87O4r5J05j03j24Q7j28M4L2K76O7l33K36k54m6J28j25k54M09q2j58
$$ -24 -132 55 119 24 129 26 -98 -11 -139 -95 -63 213 280 -53 183 -71 -117 11 -114 -368 41 -41 -199
5208a99L0l2j9L74Kj8l11L6L13k85J56k16k6J27K06l61K11m73L83J9P3j00k6L7
$$ -199 -169 -201 -220 154 156 138 -173 -137 176 -109 47 -169 -195 -68 138 -223 -12 -485 -102 -83 -10 -110 -136 -99
5232i9R0p5p0K41j81Pl0N1N6l01K19Q9j64K41M16n56L30j31j61J64q9p7p0K24
$$ -99 -9 -84 -154 87 -94 -87 -117 -66 -10 -311 -92 -3 -167 74 490 -66 264 133 -28 136 47 -30 -100 124
5256A24l37L18JM3P4l68j9K99j90L18l09M3L45j74M6r0j95K5K5j1L0J06l27N05
$$ 124 -213 105 106 149 223 -145 -164 135 -55 263 -46 -3 342 168 214 124 -71 -46 -21 -32 -2 104 -223 282
5280B82k48L1j03O5N1k84O3L8J07p6j58K62K61n29L61j31k19J22K06o7R6k56k14
$$ 282 34 65 -38 27 78 -206 -143 -105 2 -74 -232 30 291 -238 123 -8 -227 -105 101 34 130 -126 -340
5303c40M77j02j60J32L9j85J9J67k85j08J15O0R2L81j27k06R1j4m88L92p3K5p6
$$ -340 137 35 -125 7 46 -139 -120 47 -238 -346 -231 -171 -79 302 175 -31 60 46 -442 -50 -123 -98 -174
5326a74Nq2L7K6J64oM4n6R2j35p4K64m37K36O1j13ml3P7J75k9r5J44k9K32j51
$$ -174 -169 -251 -214 -188 -24 -30 14 -42 50 -85 -159 105 -332 -96 -35 -148 -152 -185 -108 67 38 -57 87 58 290 139
5352A39q3P1k48L13m34N12k45k43L56l14J19m3K14l0J29m71M35r5M7Pk50K11j74
$$ 139 56 127 -121 192 -242 270 25 -218 138 -176 -57 -100 114 84 213 -258 177 82 129 136 -114 97 -77
5375g7L05J23l48l8k41K54J76l8p2K02l95J74K18l08L28j47k16J15K9O7J42k32
$$ -77 228 351 3 -35 -276 -22 154 116 44 246 -149 25 243 -65 263 116 -100 15 44 111 253 21
5397B1j16j93L49M4M2Qj7Jl6j65q9J5J96J87k63J73J4k50Q0j9j28L39o9j02q0
$$ 21 -95 -288 61 105 147 155 138 139 103 -62 -151 -136 60 247 -16 157 171 -79 1 -18 -146 193 124 22 -58
5422e8l1k6K4M25l40P5r3j59K20k51N54l35l71L30q9K95j12p3K38k26j25N4Q2
$$ -58 -89 -115 -91 334 -6 69 -24 -183 37 -214 340 5 -366 -36 -125 170 58 -15 223 -3 -128 -74 8
5445Hm8l08O4J08J70j4k37K72K46k01j91K77k58K0L24m43J26J58r3k47L95k71
$$ 8 -40 -348 -284 -176 -6 -20 -257 15 261 60 -131 146 -112 -92 232 -211 -85 73 -20 -267 128 -143
5467a43j0K23j8j73q0J88q8K5k77N1L95Q3l01J50k27K85N4m0K76k59J21l56K61
$$ -143 -153 70 52 -121 -201 -13 -101 -76 -353 -302 93 176 -125 25 -202 83 137 97 373 114 235 -121 140
5490A40Po9j07J92k70k7K17k9j33q9K80R1j17j92k6m4K45J74l69L32l02K36J15
$$ 140 147 78 -29 163 -107 -134 83 54 -79 -168 112 203 86 -106 -132 -176 69 243 -126 206 -96 140 255
5513B55P2j49k91L3K3L38j15j4J92j73k39J60o0K6r9L2L86k91n6p8R5J70k81J88
$$ 255 327 178 -113 -80 -57 281 166 152 344 171 -68 92 32 58 -41 -9 377 86 30 -48 47 217 -64 124
5537A24q9J45j79J43l1l51L36l23M38k19J46j83R9k00K19Q2k08J86j40P4j19K13
$$ 124 35 180 1 144 113 -238 98 -225 213 -6 140 -43 56 -144 75 157 -51 135 -5 69 -50 163
5559A63m31L73m63L63Jl3l8j42Q7J70k23J09p5L30q0k58P8j62L3J84n2J61j32
$$ 163 -268 105 -358 5 6 -27 -65 -207 -120 50 -173 -64 -139 191 111 -147 -69 -231 -198 -14 -66 95 -37
5582c7p8M7j03N5n3O55n42P2J35l7N6k37j79M5O3M9j74L86l78J12j7J78J44q0
$$ -37 -115 -68 -171 -116 -169 486 -56 16 151 114 170 -67 -246 -201 -138 -89 -263 123 -255 -143 -160 18 162 82
5606H2k42K14m7O9j50n0M3J64j62j85J09j67L54J89p6m67L28j26J30o8k3nO3k06
$$ 82 -160 54 7 76 -74 -124 -81 83 -79 -264 -155 -322 32 221 145 -322 6 -120 10 -58 -81 -86 -23 -229
5630b29K14N8R8J7j54J50K46l72m6R7j37K3K36j08K8l13K18k64M51J48j62r6j68
$$ -229 -15 43 141 158 4 154 400 28 -18 79 -58 -35 201 93 121 -192 26 -238 213 361 199 103 -65
5653f5Q0K74l92J5M5J8K45k94J50K11j0n42J35R3R7j60M7K5K80o4j32n7J57N1
$$ -65 15 289 -103 -88 -43 -25 220 -74 76 287 277 -265 -130 -37 60 -100 -53 -28 252 188 56 -1 156 207
5677B07L29o14r0O0j13K67K91o39K01J91k55K14lj48K34j67J70k15k13J53K38
$$ 207 536 -78 -168 -108 -221 46 337 -302 -101 90 -165 49 46 -102 132 -35 135 -80 -293 -140 98
5698I8r2j17n5L35p4k3j04r4J47j50J22j41L6k51M71m11M54j39o4Q4k51L52j28
$$ 98 6 -111 -166 169 95 72 -32 -126 21 -129 -7 -148 -112 -363 108 -303 151 12 -52 32 -219 133 5
5721EP3k27m3J26NJ84k54M2J59l69j70M73j03M05k88j23R4pk96K13J96j98K40
$$ 5 78 -149 -192 -66 -61 123 -131 -89 70 -299 -469 4 -99 306 18 -105 -11 -18 -314 -101 95 -103 137
5744A37k40J60J04o9j17O7p2K28j59N5j95J34M3O6l22M45j45l13K90qK11j70K6
$$ 137 -103 57 161 92 -25 42 -30 198 39 94 -101 33 76 142 -180 265 120 -193 97 89 300 130 156
5767A56q5k02J82J07kJ00l1J4j56k15K42j66J18J96l35O0k29K61M7J87n9k48K
$$ 156 71 -131 51 158 156 256 225 239 83 -132 110 -56 62 258 -77 -17 -246 15 62 249 190 -58 -56
5790e6J68j3qr9J47k11j69J63J93k38kJ89J4q0K65l49J87J94j93j75L69m26J65
$$ -56 112 99 91 -8 139 -72 -241 -78 115 -123 -125 64 78 -2 263 -86 101 295 102 -73 296 -130 35
5813C5pl6J60k14j64J24K83l79J0N0qK72o2r4J34j98l6J66j72J67k81K84p7r9
$$ 35 28 -8 152 -62 -226 -102 181 -198 -188 -138 -146 126 64 -30 104 -94 -130 36 -136 31 -250 34 -43 -142
5837a42M64m57RJ11J05ql08R1K73j48j63qJ39J23k07j33M0L55J35k95l9J41N6
$$ -142 322 -135 -126 -15 90 82 -226 -135 138 -10 -173 -181 -42 81 -126 -259 -219 136 271 -24 -63 78 134
5860A34Pj93J70l63L84k56J01M5q8o6q5N5J04L3J56k21L6k49N28j8q6o8L42j09
$$ 134 141 -52 118 -245 139 -117 -16 29 -59 -125 -210 -155 -51 -18 138 -83 -47 -296 232 214 128 60 402 293
5884B93P2o26K19K15r5k97j04M32l71N61k33j12K16j1P0m73K49K37n7Jk91M57
$$ 293 365 -261 -42 173 78 -219 -323 109 -262 299 66 -46 170 159 229 -244 5 242 185 186 -105 352
5906C52k64K83n16m5K86k12M65k14mk02J68r1J95j43p9k4L82k08j06q3m4K3J03
$$ 352 88 371 -145 -190 96 -116 349 135 131 -71 97 6 201 58 -21 -45 337 129 23 -60 -104 -81 22
5929B2J15j53K08k35j5N7j75o0M65j92J37j99JJ27j53J12k08m2J67lj5j34l1K60
$$ 22 137 -16 192 -43 -58 -1 -176 -236 229 37 174 -25 -24 103 -50 62 -146 -188 -21 -24 -39 -173 -204 56
5953E6j67J17K62j46L3j05Ol73J64Q2m4M01j65O0l72J63O8J90j43Q6p6l15K66
$$ 56 -111 6 268 122 155 50 56 -317 -153 -71 -115 286 121 181 -191 -28 40 230 87 173 97 -218 48
5976D8j93J33L3j33O3l10M73l01J47l14M03Jk76l6N7M01p8j96K39p5L8j1k09K82
$$ 48 -145 -12 21 -112 -49 -359 114 -187 -40 -354 49 50 -226 -262 -205 196 118 -78 161 86 124 113 -96 186
6000A86l01J76k06N28l46k69L24j35R8L46m87k80M22R6q1n5L7NM5j43j84L50l2
$$ 186 -115 61 -145 383 37 -232 92 -43 55 401 -86 -366 56 152 71 16 53 58 103 -40 -224 126 94
6023I4J1P3p8M0j34K00J04k43Q2K8J33k49L4r9o7K81j48j50J42K2J58k24K94l46
$$ 94 105 178 100 140 6 206 310 67 149 177 310 61 95 -4 -71 210 62 -88 54 76 234 10 304 -42
6047d2J14J39k20J22j02o6j6k77M41k16j52L73j58j10J12L26k64J07k48O8J30
$$ -42 72 211 -9 113 11 -55 -71 -348 93 -123 -275 98 -60 -170 -58 268 4 111 -137 -69 61
6068F1r9O0M3k27m1M60j41J9k20m9L75l00l08M70l0j2q6j86p3L02k53o1K88J22
$$ 61 -38 22 65 -162 -203 257 116 135 -85 -134 241 -59 -367 103 73 61 -25 -211 -284 18 -235 -296 -8 114
6092A14k97K67j31J21k84N65l33K6j95M6j78R5L9O9M4lp3l0J6l37N37j89M3j68
$$ 114 -183 84 -47 74 -210 355 22 48 -147 -101 -279 -184 -145 -76 -32 -35 -108 -138 -122 -459 78 -111 -68 -236
6116b36K15L7J1j82L01l18R9J6m0K73r6k05K95m23J54J96q5Q1j0J01j58J38M7
$$ -236 -21 16 27 -155 146 -172 -73 -57 -97 176 80 -125 170 -253 -99 97 12 93 83 184 26 164 211
6139B11k43n7K58J59l11J29J30k52o7J39j46N1M2q8K88q7m3k25r9L58J03n04M36
$$ 211 -32 -89 169 328 17 146 276 24 -43 96 -50 1 43 -45 243 156 113 -112 -211 147 250 -254 182
6162A82j83N3p0J04J53n8k25K03m10J78j42K57J27L8k04l12M55j6Q5k42J12L26
$$ 182 -1 52 -18 86 239 181 -44 159 -251 -73 -215 42 169 207 3 -309 146 130 215 -27 85 411
6184D11n32J97Nj2j27M6J23Jj54L1O1K39k99l2l2J65K68m26P5K66r2l38L10r3
$$ 411 -121 76 81 69 -58 -12 111 112 -42 -11 50 289 -10 -42 -74 91 359 -67 8 274 182 -156 154 61
6208F1p4n0JK51o5NK3j73K26k29J25j17j26L7K20j45M0j91M3k19N61l71M8M5L7
$$ 61 -13 -63 -62 189 124 129 152 -21 205 -24 101 -16 -142 -105 115 -30 10 -181 -138 -357 204 -167 -119 -74 -37
6233c7m12N07N6k4j66N9o7Q0j6K87J27n21k2L29l53L16J07m26J74m2j40n5J41
$$ -37 -449 58 114 90 -76 -17 -84 -4 -20 267 394 -127 -149 180 -173 143 250 -176 -2 -44 -184 -239 -98
6256i8K59Ql56L26j44k13R0K59J00o5l00L86r5j70k12K76K93k57K05k32l87M26
$$ -98 161 169 -187 139 -5 -218 -128 131 231 166 -134 252 157 -13 -225 51 344 87 292 60 -327 99
6278I9o9J39O2j91q1M3o9J54n9k80L19%N2J20k62J00j01P7pm23N89p2j66K59k08
$$ 99 30 169 231 40 -41 2 -67 87 28 -252 67 67 119 239 -23 77 -24 53 46 -377 212 140 -26 233 25
6303B5q8J9M69k70J55j97j45K80m16K66J62p3K33k44k27o1J75K89k66j06j27Q6
$$ 25 -63 -44 425 155 310 113 -32 248 -168 98 260 187 420 176 -51 -112 63 352 86 -20 -147 -61
6325f1J82r6j9J04j15O7l4K4oq2jq2M21m43K83m63Q4J51k62L30o1q0N6j33N90
$$ -61 121 25 6 110 -5 62 28 52 46 -36 -37 -119 302 -141 142 -321 -237 -86 -348 -18 -79 -159 -103 -236 354
6350C54k75k07p7J4J4n2N37n64j13L56o6j06L74j63m9k05J11K36P0K0k98k22M16
$$ 354 79 -128 -205 -191 -177 -229 308 -256 -369 -13 -79 -185 189 26 -23 -228 -117 119 189 209 -89 -311 105
6373A05m97K50j55L03j16k0J52j10K50n0o3l4l62L22K14j89Q6K99o08L66j71p6
$$ 105 -392 -142 -297 6 -110 -130 22 -88 162 112 49 15 -347 -25 189 0 86 385 -223 143 -28 -104
6395a04K48k29J71r8qo0R3K9J91l61k36M8M70j70R5L03l85J8k03j26M95j10k13
$$ -104 144 -85 86 -12 -20 -80 13 42 233 -128 -364 -316 154 -16 79 382 -3 15 -188 -314 181 71 -142
6418a42K64K42m44J52K3o8J96k15n9P7k13K89k72J59K49m44L7J86n4J11M3M3j01
$$ -142 122 364 -80 72 95 27 223 8 -51 26 -187 102 -170 -11 238 -206 -169 17 -37 74 117 160 59
6441E9p7j85L33m02L92Qj27Q0j92L81k22j22l12L54K40m37L88J5m00K51l1K38
$$ 59 -18 -203 130 -272 120 128 1 81 -111 270 48 -74 -386 -32 208 -229 159 174 -226 25 -6 232
6463B32k19k27L57j2k2j55O8k9k17J02Rk45L11L80n27k1K06J43K3k77J44j35m
$$ 232 13 -214 143 131 109 -46 22 -7 -224 -122 -113 -358 -47 333 -194 -215 -9 134 157 -120 24 -111 -115
6486a15j04L83j86O8k16M0J95j36J25k18p5K76Oj12p2K3J39J49j94K28l26K13
$$ -115 -219 164 -22 46 -170 -130 65 -71 54 -164 -239 37 43 -69 -141 -118 21 170 -24 204 -122 91
6508I1K04k95k9o2J77p4k71K65qK28j15j30J41j66J23j21j34K13o4J25j0N4o0
$$ 91 295 0 -29 -91 86 12 -259 6 -2 226 111 -19 122 -44 79 -42 -176 37 -27 98 88 142 82
6531H2Q2rk4L7k47N1o0L25l76K3K44o2n4L9J9p5J0J83j89j16L33k75l1N25k65
$$ 82 164 155 131 168 -79 -28 -88 237 -139 -116 128 66 12 51 70 -5 5 188 -1 -117 216 -59 -90 435 170
6556A70l80J01K65o1p1l3J06k38J47L58l52m5K2j40L8j59J41Q6j18J94o7j57K62
$$ 170 -210 -109 156 95 24 -9 97 -141 6 364 12 -33 -11 -151 -113 -272 -131 -45 -163 31 -36 -193 69
6579F9ll5J01l57L26j2j85J50j79K68J76l46j7j56K31J85k14M3q0k78L30k23K55
$$ 69 66 31 132 -225 101 89 -96 54 -125 143 319 -27 -44 -200 31 216 2 45 -35 -313 17 -206 49
6602D9j33P4m4J79j43N9J0k35R9l4R3J58l29K07l75J71J89j31K85m06M43m42K29
$$ 49 -84 -10 -54 125 -18 41 51 -184 -85 -119 -26 132 -197 10 -365 -194 -5 -136 149 -257 186 -256 -27
6625b7K06k39qM4R0n2j50K66Qm36P7J4K87r2p5j8K4K4L93m31J70r6J32N1j08r2
$$ -27 179 -60 -68 -24 66 14 -136 130 138 -298 -221 -207 80 -12 -87 -105 -81 -57 336 -95 75 -21 111 162 54 -38
6651c8K27k12L01k13M1l6j40n9M9N9J2J03J59l09J03k0q0K16k20J22k16K12k78
$$ -38 189 -23 278 65 106 70 -70 -129 -80 -21 -9 94 253 -56 47 27 -53 163 -57 65 -151 61 -217
6674b17L80k56j00J39j8K89m19J28J43pj08m39P55k63j31J43k07L87j09j27L00
$$ -217 163 -93 -193 -54 -72 217 -202 -74 69 62 -46 -485 270 7 -124 19 -188 199 90 -37 263
6695B63k84J66k28j29K07j2P0%k01j02M85m01KL86k97J69j88J13K04k6k54j36
$$ 263 -21 145 -83 -212 -5 -17 53 53 -148 -250 235 -166 -164 222 -75 94 -94 19 223 197 -57 -193
6717a93J24j47K03o1J63k23K66j84J37k01Ok36M14o0J15l76n8K54J40j19k49N08
$$ -193 -69 -216 -13 -74 89 -134 132 -52 85 -116 -110 -346 68 8 123 -253 -311 -57 83 -36 -285 223
6739B23k74O6J2j84K80j52J77m59L26J36m2q5j2J87m15j2K5j38M7L13kL73n19
$$ 223 -51 15 27 -157 123 -29 148 -311 15 151 109 24 12 199 -216 -228 -203 -341 -294 19 17 390 -129
6762a29K78k60r7N2J04QJ06m27M86j98j3j41L83m55qM01P6J16l24M6j18J86j04
$$ -129 149 -111 -208 -156 -52 -44 62 -365 121 -77 -90 -231 152 -303 -311 90 166 282 -42 4 -114 72 -32
6785c2J2n7K94o9K5j75j63L82m42L18l6Rk8j17r6J71N3k82M4J27K06j59Q0k27
$$ -32 -20 -77 217 148 173 -2 -165 217 -225 93 57 66 38 -79 -175 -4 49 -233 -189 -62 144 -15 65 -162
6809a62J92Q5j36j2J98j72K12j9j62J04j25r1M1J26l14L48l6J6k06O5J33k11L33
$$ -162 30 115 -21 -33 165 -7 205 186 24 128 3 -88 -47 79 -235 113 77 93 -113 -48 85 -126 207
6832B07k22M2J99p2j52J50o2j62j10L4J65Q6j14O0r6P5J44J6J4o2J2j91K05l02
$$ 207 -15 27 226 154 2 152 90 -72 -182 -148 17 103 -11 49 -47 28 172 188 202 140 152 -39 166 -136
6856a36k9M06j34k58M7M8l5J50k69K55m4J82m20L42n4R9m13r4K76m4J00K44j97
$$ -136 -165 241 107 -151 -104 -56 -91 59 -210 45 1 183 -237 105 51 150 -263 -357 -81 -125 -25 219 22
6879B2k80M61o9J3j14Q8l97L01k54M34l48K81n6k24J73j05K32P5k06J38j46l9
$$ 22 -258 203 134 147 33 121 -276 25 -229 205 -143 138 82 -142 31 -74 158 233 27 165 19 -20
6901b0R8n8k01L62m53J76J14J56o9o9QJ26J42r8j05p9j3K22j36L50l05K80j32
$$ -20 78 20 -181 181 -272 -96 18 174 105 36 44 170 312 214 109 30 17 239 103 453 148 428 296
6924B96q5K4q0R0M1m93K79n6P3j62J53L5k13K29m19N89J45j68l29P7K88m57lK54
$$ 296 211 235 155 245 286 -207 72 16 89 -73 80 115 -98 131 -288 301 446 278 -51 26 314 -143 -146 108
6948A08k12J03P3n5l34L89J2M7j97M03k08j14j02K89J2j24M1j00Q6l66N14n10
$$ 108 -104 -1 72 17 -317 72 84 131 -66 337 129 15 -87 202 214 90 131 31 117 -249 265 -245
6970b45M54j81J02N4j92J58M4k37K05k79R4J3J06m1j00N9L23k41j03j1NQ8j20
$$ -245 209 28 130 184 -8 150 194 -43 162 -117 -23 -10 96 55 -45 14 337 96 -7 -18 -13 75 -45
6993d5l6M5l88L84O6j3j27K14q9j23j21m0N07k55J42Q7l16R2J66k53j50M11m48
$$ -45 -81 -36 -424 -40 26 13 -114 100 11 -112 -233 -273 234 -21 121 208 -108 -16 150 -103 -253 158 -290
7016b90O7J39O12n63o2J36J34k75J23K57o38P24l17j40R5K9J10l7k0l82K36M7
$$ -290 -223 -84 528 -35 -97 39 173 -102 21 278 -360 364 47 -93 2 31 141 104 84 -298 -62 -15
7038a5L6l10L05m1M2r6R1J20j50m6K11j28q7r0J28J78j11p5L51k52l00L25k23
$$ -15 21 -289 16 -25 17 -79 12 132 -18 -64 147 19 -68 -158 -30 148 37 -38 313 61 -239 86 -137
7061a37L52q1M5j14J3q8K30j34k14R6j3M8k6l87K50J38j68K69j67M00k82p9L4
$$ -137 215 134 179 65 78 -10 220 86 -128 -32 -45 3 -23 -410 -160 -22 -190 79 -88 312 30 -49 -15
7084a5l50K73J43L07m04j40L9%J82o1n4R1k01K69ll73K05Q2J64p2ll37l3J50J23
$$ -15 -365 -92 51 358 -46 -186 -147 -147 35 -26 -80 11 -190 79 76 -297 -92 -10 154 82 79 -258 -291 -141 -18
7109a8J23p4J84m17O6J97j24j78l1K91j16P9j5l63N35j52k04L42j79nK41q6o2
$$ -18 105 31 215 -202 -136 61 -63 -241 -272 19 -97 -18 -33 -396 139 -13 -217 125 -54 -59 182 96 34
7132C4M1p2j11J55r6J06j01K51n69J86Q0O5m7OJ11j35j75K78l38K85J64K3J34
$$ 34 75 3 -108 47 -49 57 -44 207 -362 -176 -96 -31 -78 -72 39 -96 -271 7 -331 -46 118 141 275
7155B75j99p4j5j18N9Jl6J36O6Lj13J26j43l6K17l44J00O1J20N6j34j18J73J30
$$ 275 76 2 -13 -131 -72 -71 -107 29 95 98 -15 111 -32 -68 149 -195 -95 -34 86 142 8 -110 63 193
7179A93j25qk22K5k4L66j95K64m4r5k29J25J16r0J3j06j94J75J63l65M33Kj64
$$ 193 68 60 -162 -137 -161 205 10 274 230 135 -94 31 147 57 70 -36 -230 -55 108 -257 176 178 14
7202A4K25j32j94O7N5k2j7o5K51K6j32j00k23K62m2P1j94M18l07j55K78J63k79
$$ 14 239 107 -87 -20 35 13 -4 -69 182 208 76 -24 -247 15 -27 44 -150 268 -39 -194 84 247 -32
7225c2j38K76O4k58J34l39J41J61J55j86J8J80l87L91P5j15p6q9K1J42j85K56
$$ -32 -170 106 170 -88 46 -293 -152 9 164 -22 -4 176 -211 180 255 140 64 -25 -4 138 -47 209
7247B09k2J99o12K38j91M3L28l60n8J92J0J28j7j66J52j89M4j85K93l7nK34m02
$$ 209 187 386 -226 12 -179 -136 192 -168 -226 -34 -24 104 87 -79 73 -116 -72 -257 36 -1 -6 228 -174
7270a74L19l03K53m2m9J32q6l6J21m79M32k77M15r8n6J10k03O9k05J43o1J75k38
$$ -174 145 -158 95 53 4 136 50 14 135 -344 88 -189 226 128 72 182 -21 48 -157 -14 -75 100 -138
7293a38J63J96k88J26o0J49j74J23r8j46j32N29m3n3k01P7p5J12n2l2j13J51K7
$$ -138 25 221 -67 59 -1 148 -26 97 -1 -147 -279 250 207 154 -47 30 -45 67 15 -17 -130 21 48
7316D8J64k15Po8K31m28L27r6j51j0L39k08O5J95j42J83k71J79j85K49j09Q0l01
$$ 48 212 -3 4 -64 167 -261 66 -30 -181 -191 148 -60 5 200 58 241 -30 149 -36 213 104 184 -117
7339a17MkM8j29J86O5n9k55Q5J08J30L3j52K79l6L7j55l2Ml1j6q3k05L00J06l23
$$ -117 -113 -115 -67 -196 -10 55 -4 -259 -174 -66 64 97 -55 224 188 225 70 38 42 11 -5 -88 -293 7 113 -210
7365b10M95l95k0J44r5J05L8j99m2J87J51k35k04J60n5J11J27r1J8J9K62m47J12
$$ -210 285 -110 -130 14 -81 24 62 -137 -179 8 159 -76 -280 -120 -175 -64 63 -28 -10 9 271 -176 -64
7388f4K48k70J83k43M2J64k37K22n22L86%J83l08m8K67O2k95J17J08m6Q4KJ91
$$ -64 184 -86 97 -146 -104 60 -177 45 -477 -91 -91 92 -216 -264 3 65 -230 -113 -5 -51 33 35 226
7411B26j78J19k06j60O5J98O4J78k34k03J10R4j54k04J78L29j73k55K78J03m8
$$ 226 48 167 -39 -199 -134 64 128 306 72 -131 -21 73 -81 -285 -107 222 49 -206 72 175 127
7432A27o8N1J93r7jJ52l12J07N4j75J13l5l7N5L98n71j3L73j14r8l21J54J33k82
$$ 127 59 110 303 206 205 357 45 152 206 31 144 109 72 127 525 -46 -59 314 200 102 -219 -65 68 -214
7456b14J81J49O7r1j90K62k91N56k82j92J32j13J09k5K75j30Rk87K42l98K68N2
$$ -214 -33 116 183 92 -98 164 -127 429 147 -45 87 -26 83 58 333 203 212 -75 167 -231 37 89
7478H9k54M56k46m7nj03J41l0q9J7J28Pq8k38J51j06o6L73J47j54J85k95O8KK0
$$ 89 -165 291 45 -2 -7 -110 31 1 -88 -71 57 64 -24 -262 -111 -217 -283 90 237 83 268 -27 41 43 63
7503F3j94J57Q9K7j36j57NJ10rn21O18j97J85k3J24k21P2J57k96n7j38K59L02
$$ 63 -131 26 115 142 6 -151 -146 -36 -45 -566 52 -145 40 17 141 -80 -8 149 -147 -204 -342 -83 219
7526B19l41Q2J60k68K18l57mJ22J57R1M8j50J78j01k14J20J60o3r7L71j32k59
$$ 219 -122 -40 120 -148 70 -287 -291 -169 -12 79 127 -23 155 54 -160 -40 120 57 -40 331 199 -60
7548f0K63l50O0J05k64L59k51L11M2k90L24l0l75K97j6j23k2j08k24L12K04l43
$$ -60 203 -147 -87 18 -246 113 -138 173 215 -75 249 219 -156 141 125 2 -20 -128 -352 -40 164 -179
7570a79J00m7J17K28m1j15O7n13L79J67k05p8r3R7N6K14L5m65K18p2J00Lp9J14
$$ -179 -79 -126 -9 219 178 63 130 -383 -4 163 -42 -120 -213 -116 -60 154 189 -276 -58 -130 -30 -27 -106 8
7594HR1j34l5N1k4L7J97k42K50l7k65r1J81l69J39R8K22j52J92O8l42M78l02j41
$$ 8 99 -35 -70 -19 -43 -6 191 -51 199 162 -103 -194 -13 -382 -243 -145 77 -75 117 185 -157 321 19 -122
7618a22k80L08j6K99j08k65J03J15m33L72m9j23J67m05J88L68l80p3L54l6r3J73
$$ -122 -402 -94 -110 189 81 -184 -81 34 -399 -27 -76 -199 -32 -437 -249 119 -261 -334 20 -16 -109 64
7640F4m4j35L50n0m20K9K60J40j82L5P1k57J91j04j56N5M0R4K63k62j46R4K3M
$$ 64 20 -115 235 185 -235 -206 54 194 12 47 118 -139 52 -52 -208 -153 -113 -19 244 -18 -164 -70 -47 -43
7664d3J42o1P4n00J85j21L15J83k1R0m36Q9L44l30N03j30k73j05J77m8j93J1J99
$$ -43 99 38 112 -388 -203 -324 -9 174 153 243 -193 -104 240 -90 413 283 10 -95 82 34 -159 -148 51
7687E1m9J2O9j72L0J10j26j10J65J35j0J13j65M4k41K4J62J8m4k03J72m4J8j83
$$ 51 2 14 83 -89 -59 51 -75 -185 -20 115 105 218 53 97 -144 -120 42 60 16 -187 -15 -59 -41 -224
7711b24J79N8J0RJ51j70Q4k1PJ6j88L58n35J60J85O0j95L60m55J31K26j86o6N7
$$ -224 -45 13 23 32 183 13 97 76 83 99 -89 269 -266 -106 79 139 -56 304 -151 -20 206 20 -46 11
7735A1O7k05M0M1J66k36J52K20m06j24K20L11l57J45j87N0n7L49k19m4J31p0J16
$$ 11 78 -127 -87 -46 120 -116 36 256 -150 -274 -54 257 -100 45 -142 -92 -149 200 -19 -63 68 -2 114
7758A14j90J43j11k28K60qj02jK38k81J31j19K59K0k38n6m3n6L45r6L4j05M84
$$ 114 -76 67 -44 -272 -12 -20 -122 -123 115 -166 -35 -154 105 125 -113 -169 -212 -268 77 -19 15 -90 394
7781C94m55m2L06l55l7K68q5J49m9j26k77L63J09m81Q11m71M5l17J16Q5p2J64
$$ 394 -61 -103 203 -152 -189 79 -6 143 94 -32 -309 54 163 -318 493 22 67 -250 -134 -49 -121 43
7803D3r7O0J42n15K94K37j62P7N2N2j60J68k40M11k88j6k58J83K6j3j97K98j92
$$ 43 -54 6 148 -367 -73 164 2 79 131 183 23 191 -49 362 74 58 -200 -17 9 -4 -201 97 -95
7826i5j21M94m80M44l52j86J11K92J63k66k27L85k76L3jK02j13K8K1N0m2j9J10
$$ -95 -216 278 -202 242 -110 -296 -185 107 270 4 -223 162 -114 -81 -82 120 7 35 56 106 64 45 155
7849A55k65K81o4k27J92RN3k00k9p7K79j34l9R1nJ33o4m83M05L0n3J38j22k96
$$ 155 -110 171 107 -120 72 81 134 -66 -95 -172 107 -27 -66 25 20 153 89 -394 11 41 -12 126 4 -292
7873b92K33P7j09L47k79J55N6j38j63K18j26l4J28r3j67l5L06r8K5r2k91M06L
$$ -292 -59 18 -91 256 -23 132 188 50 -113 105 -21 -55 73 -20 -187 -222 84 -14 11 -81 -372 34 37
7896C7J98K4j58L84q72M47j63l1p0n4L13k26J95k10J83k52K08oK24k65J28p1Q2
$$ 37 235 259 101 485 -387 60 -103 -134 -204 -258 55 -171 24 -186 -3 -255 -47 -53 171 -94 34 -37 45
7919D5k50J47K43k73mJ73J19l01L95L5m78j3j12M98k80M7Rk52J98l5Q2oj20l5
$$ 45 -205 -58 185 -88 -92 81 200 -101 294 329 -149 -162 -274 224 -56 -9 0 -252 -54 -89 -7 -13 -133 -168
7943a68K16J92q9l90J98j36L66Pk7l50L9M58m33Q1m7m0n4M00o9k2k45J31r7K25
$$ -168 48 240 151 -239 -41 -177 189 196 169 -181 -142 316 -117 -36 -83 -123 -177 223 154 132 -113 18 -79 146
7967A46J2k55P9M48l19J61j38j58J36K50m21J17j98P1J52k26Q4J80j65oJ73l73
$$ 146 158 -97 -18 430 111 272 134 -24 112 362 -59 58 -140 -69 83 -143 -59 121 -44 -50 123 -250
7989b50J06J43q1J34q7Q6l03M5L25k53K26j15Q9R1k36Kj64M53m84J52K21k18J33
$$ -250 -144 -1 -82 52 -35 51 -252 -207 118 -135 91 -24 65 156 -80 -78 -242 211 -273 -121 100 -118 15
8012A5j00J57j57K96K6l67j2J77j5k22L28p1n2L4M7k13J26L56l00j88J24K04j77
$$ 15 -85 72 -85 211 237 -130 -142 35 20 -202 126 55 3 37 84 -129 -3 353 53 -135 -11 193 16
8035A6j22J94j27L13k26M3J06j09j07K1j97l0K19K3O1j8K6j25j5J53j00j3j58
$$ 16 -106 88 -39 274 48 91 197 88 -19 2 -195 -225 -6 17 78 60 86 -39 -54 99 -1 -14 -172
8058a72O6K60l09M6J54m8K78j99l14J70K4J08j91R0J96n8J7J32m27J54J63k0n69
$$ -172 -106 154 -155 -109 45 -3 275 76 -238 -68 -44 64 -127 -37 159 101 118 250 -177 -23 140 120 -449
8081d49O64k62J21j07m2L24l83r0J70L15j62L1q3M8l41K24K01L8k21L7j76p3Q7
$$ -449 215 -47 74 -33 -75 249 -134 -224 -54 261 99 130 47 95 -246 -22 179 217 -4 33 -143 -216 -129
8104a29O8J43p1o4j25K12%j65M94n05L0J96l77M45k07J51k70J84N3J61j9j16j26
$$ -129 -61 82 11 -53 -178 34 34 -131 363 -142 -112 84 -293 152 -55 96 -174 10 63 224 205 89 -37
8127c7k63K88O8J05j66j47k9J10k0NJ17l50J78J08J66K6m07jJ8J38J12K32r2m09
$$ -37 -300 -12 56 161 -5 -152 -181 -71 -91 -86 31 -319 -141 -33 133 159 -248 -249 -231 -93 19 251 159 -250
8151b50L17k83J56K71k79P5J58j57j56k04J54j42L85k6j63K75m0k95j09L48o0
$$ -250 67 -216 -60 211 -68 7 165 8 -148 -352 -198 -340 45 19 -144 131 91 -204 -313 35 -25
8172b5Q8k37L94l93L76j12k53jr9J61p1N4L14l92J43L30j72m7K64
$$ -25 63 -174 220 -173 203 91 -162 -163 -262 -101 -172 -118 196 -196 -53 277 105 58 322
8191C22
$$ Imaginary data points
##PAGE= N=2
##DATA TABLE= (X++(I..I)), XYDATA
0@%%%%QqQj6J6k4L2m0M9n7P2q8J05j26J50j77K09k45K85l30L80m34M95n65O42
$$ 0 0 0 0 0 8 0 8 -8 8 -16 16 -24 25 -32 40 -48 57 -69 81 -96 113 -132 153 -177 203 -231 264 -301 341
29C41p24Q14r16J029j152J288j437J599j777J972k186K421k682K971l289L642
$$ 341 -383 431 -485 544 -608 680 -757 842 -935 1037 -1149 1272 -1410 1561 -1728 1914
45A914m039M488m992N568o241P029p968R112j0539J2383j4868J8418k3951L3845
$$ 1914 -2125 2363 -2629 2939 -3302 3727 -4241 4871 -5668 6715 -8153 10265 -13686 20159
59B0159n6968K06423J41063l55662l7817J62426J04796q1331L829J3224q2153
$$ 20159 -36809 169614 310677 -44985 -82802 79624 184420 103089 106918 120142 37989
70C7989q2542J15884J36116L551n4589q864q5061j23114K4174J65220O7669m2191
$$ 37989 -44553 71331 207447 210998 156409 147545 62484 -60630 -36456 128764 196433 154242
82A54242j0371m762j06162n5943J28047J26720p5915j25309m155K2632k1279P9782
$$ 154242 143871 139109 32947 -22996 105051 231771 155856 30547 26392 49024 27745 107527
94A07527J60313j1996k03056j02522P5132L1817n1139N9073J39376j3576j55198
$$ 107527 267840 255844 52788 -49734 25398 57215 6076 65149 204525 190949 35751
105C5751n6744Q0985O6062J2529L049n7547j26720m4541J05327J13121K5649K866
$$ 35751 -20993 59992 126054 138583 141632 84085 -42635 -87176 18151 131272 156921 159787
117A59787j4526j05656j18909K7013J22412M2322l8069q806j0811p5398l1598
$$ 159787 145261 39605 -79304 -52291 70121 112443 74374 65568 54757 -20641 -52239
128e2239J03291J02743l9440j00266m6087k6292k3027P2885J48388M3496j14171
$$ -52239 51052 153795 114355 14089 -31998 -58290 -81317 -8432 139956 183452 69281
139F9281j12116j0635J9414P486M1624N3530k1647p8060l3769L1707M8498M8453
$$ 69281 -42835 -53470 -34056 -26570 15054 68584 46937 -31123 -64892 -33185 15313 63766
151F3766K9691m9983j18390o9531M3354Q4078N1953K7421k909o6309q3244m422
$$ 63766 93457 43474 -74916 -144447 -101093 -17015 34938 62359 59450 -6859 -90103 -94525
163i4525P1629M9773j0660l2525l7059m3321p3P4900Q0047k363o6516o2299m0471
$$ -94525 -22896 26877 16217 -16308 -53367 -96688 -96761 -21861 58186 55823 -10693 -72992 -113463
176a13463j6730M1051R3255N4974m2482q1550l6016J5927L3747L7475K1109k9822
$$ -113463 -130193 -89142 4113 59087 16605 -64945 -100961 -85034 -51287 -13812 7297 -22525
188b2525o8166m0057K6266O4203N9758K6918l0869q3374p2580J809O0345N7000
$$ -22525 -90691 -130748 -104482 -40279 19479 46397 15528 -67846 -140426 -138617 -78272 -21272
200b1272K4867q193m3223n4345p592N6086N8634K937m1068m8936m0292o871N5732
$$ -21272 3595 -4598 -47821 -102166 -109758 -53672 4962 7899 -33169 -82105 -122397 -129268 -73536
213g3536Q6348L4901m3858o8009m0972q571K4261N8146M7391j6390o2537l8615
$$ -73536 12812 47713 3855 -64154 -105126 -113697 -89436 -31290 16101 -289 -62826 -101441
225a01441J2720L9397M2559K4284k2600o6701n3384R211N5550N8197L4220p135
$$ -101441 -88721 -49324 -6765 17519 -5081 -71782 -125166 -115955 -60405 -2208 32012 24877
237B4877n4678o3486j3291M3748N1012K0457j1871l6228m2992o365M9837O1894
$$ 24877 -29801 -93287 -106578 -62830 -11818 8639 -3232 -39460 -82452 -88817 -38980 22914
249B2914J5934l3422m9906m1936j4793L5379O9817M4285j6860n1846m0908r722
$$ 22914 38848 5426 -44480 -86416 -101209 -65830 3987 48272 31412 -20434 -61342 -71064
261g1064K4277M6410L4383j2053n0453l9179K301M0040N1811L0426j6105n6090
$$ -71064 -46787 -377 34006 21953 -28500 -67679 -65378 -25338 26473 56899 40794 -15296
273a5296n1990p267L6699N1462L5599p04l9030m7395j4997K9801M6950K5154j2181
$$ -15296 -67286 -74553 -37854 13608 49207 48503 9473 -37922 -52919 -23118 23832 48986 36805
286C6805l9932m0635q637L6109N7408L3634j4465m9598m6474j3063K6095M7356
$$ 36805 -3127 -43762 -52399 -16290 41118 74752 60287 10689 -35785 -48848 -22753 24603
298B4603L6666r51l7873m1470r664K4936L9684K7495m496l9556m7750j2176L5488
$$ 24603 61269 60318 22445 -19025 -28689 -3753 35931 63426 58930 19374 -28376 -40552 -5064
311e064N2761K9957o564l6976m6944k2639K3677M9966L0002o645k9512l3025j7875
$$ -5064 47697 77654 71090 34114 -12830 -35469 -11792 38174 68176 61531 32019 -1006 -18881
324a8881J6977M6168L3281j2406m1222l4822j2732J6306M4909M3867q7m5141m4132
$$ -18881 -1904 44264 77545 65139 23917 -10905 -23637 -7331 37578 81445 81358 36217 -7915
337g915j2049J6981L2283L4793O383l5612m3116q307K4160L1262K4324N222l0349
$$ -7915 -19964 -2983 29300 64093 70476 34864 -8252 -16559 7601 38863 63187 68409 38060
350C8060n0849k0581K7667M3547K5848K450k1655m3454k9642J7586M5051K5039
$$ 38060 -12789 -33370 -5703 37844 63692 66142 44487 1033 -28609 -11023 34028 59067
362E9067o871k2743k9827k3734J0415M4473L3730p799l3501l0855j8715N064L7348
$$ 59067 52196 29453 -374 -24108 -13693 30780 64510 56711 23210 -7645 -26360 -21296 16052
375A6052M2001K993l5244l5036j4088O695K5824L5767J0243l2684m0502j0475
$$ 16052 58053 61046 25802 -9234 -23322 -16627 9197 44964 55207 22523 -17979 -28454
387b8454J7121K5668K6513J0782k5269m6160k2738J7945L3363K4695Q627j5232
$$ -28454 -11333 14335 40848 51630 26361 -19799 -42537 -24592 8771 33466 42093 26861
399B6861l6948k7636J0919L5981K4951L60j8499l0276k4622P337L6509L1167J159
$$ 26861 -10087 -37723 -26804 9177 34128 34488 15989 -14287 -38909 -31572 4937 36104 37263
412C7263k3459k9450k2079J754L0679L4681O521k3800l0257j7391K576K3654L1169
$$ 37263 13804 -15646 -37725 -35971 -5292 29389 35910 12110 -18147 -35538 -32962 -9308 21861
425B1861J0707k2457l4148j6071R528K5856K7369J1148j8685l5354k2939P051
$$ 21861 32568 10111 -24037 -40108 -30580 -4724 22645 33793 15108 -20246 -43185 -36134
437c6134K6576K5803R723j3848k9867k2083M802K6933K5966O930j6282k8990k1912
$$ -36134 -9558 16245 25968 12120 -17747 -39830 -35028 -8095 17871 24801 8519 -20471 -42383
450d2383K944K7261K9637Q478j6295k8208k0242K099K3863K8170J0654j5498k8266
$$ -42383 -39439 -12178 17459 25937 9642 -18566 -38808 -36709 -12846 15324 25978 10480 -17786
463a7786j9791J897K1356K5826J1628j3530k9196k1565L678K3853K5990J0820
$$ -17786 -37577 -35680 -14324 11502 23130 9600 -19596 -41161 -37483 -13630 12360 23180
475B3180j1637k6560k2718o22K2507K6587J0409j1503k4018k0090r73K1181K7007
$$ 23180 11543 -15017 -37735 -38357 -15850 10737 21146 9643 -14375 -34465 -35438 -14257 12750
488A2750J1451j2553k5103j9501k233J7342K5380J3952j0451k5663j9582P47J8870
$$ 12750 24201 11648 -13455 -32956 -35189 -17847 7533 21485 11034 -14629 -34211 -33464 -14594
501a4594K3763J3216q552k4099k1210r45J7645K2129J2546n845k2125k1379k066
$$ -14594 9169 22385 13833 -10266 -31476 -32421 -14776 7353 19899 14054 -8071 -29450 -31516
514c1516J9071K4026R711r091j9743j9399m309J6353K4309J2319q287k0532j8451
$$ -31516 -12445 11581 21292 12201 -7542 -26941 -31250 -14897 9412 21731 13444 -7088 -25539
527b5539m390J4610K4754J4418p965k1133j5541j159J1815J9308J3978n391k2473
$$ -25539 -29929 -15319 9435 23853 15888 -5245 -20786 -21945 -10130 9178 23156 17765 -4708
540d708k0379j528J6869K0259J3454k876j9575k0948m577J4190J7390J0059j852
$$ -4708 -25087 -26615 -9746 10513 23967 21091 1516 -19432 -24009 -9819 7571 17630 15778
553A5778j3900j9942o390J6921K4252R938q487j6802j6521p664J0965K3336J4545
$$ 15778 1878 -18064 -24454 -7533 16719 26657 18170 1368 -15153 -22817 -11852 11484 26029
566B6029n936j6125j4496p753O124K0160J6234n567j9742j3226l29Q460J5541
$$ 26029 20093 3968 -10528 -18281 -12157 8003 24237 18670 -1072 -14298 -14627 -6167 9374
579I374J5950k36k0818k1995l833J1849J6535J4916L250j5054j9952l841J2087
$$ 9374 25324 25088 4270 -17725 -21558 -9709 6826 21742 24992 9938 -10014 -13855 -1768
592a768J1703M989Q2r310j8899r709J2898K2729J1136k621j1881j8000j3135O844
$$ -1768 9935 14924 15006 5696 -13203 -22912 -10014 12715 23851 21230 9349 -8651 -21786 -14942
606a4942K0642J3103l527r842j0391p634L567J6958J2509n869j5572j0784l633
$$ -14942 5700 18803 15276 5434 -4957 -12591 -9024 7934 20443 14574 -998 -11782 -15415
619a5415L714J4969J7105J662j4841j6784p839J612J1395J6474N376j3650j6679
$$ -15415 -11701 3268 20373 22035 7194 -9590 -17429 -15817 -4422 12052 17428 3778 -12901
632a2901p23J1352J0578O503j251j2116j6616n844P825J3625J1695O494n518j7917
$$ -12901 -13624 -2272 8306 14809 13558 1442 -15174 -21018 -13193 432 12127 18621 13103 -4814
646d814j2601L652J2470Q929J702o929j3379p672Q861J8293R148m927j1222j2594
$$ -4814 -17415 -13763 -1293 7636 9338 2409 -10970 -18642 -9781 8512 17660 12733 1511 -11083
660a1083r006M233J5180J2880J048m917o858j0630n293Q744J4838K410j0866j1469
$$ -11083 -20089 -15856 -676 12204 13252 8335 1477 -9153 -14446 -5702 9136 11546 680 -10789
674a0789m244M593J5398J5343p45j6633j4479k996J866N541J2252R665n103j1000
$$ -10789 -15033 -10440 4958 20301 19556 2923 -11556 -14552 -12686 -7145 5107 14772 9669 -1331
688a331l012K556J337M866P909l940j7662j0308R810J6185R080K672n292j6325
$$ -1331 -4343 -1787 -450 4416 12325 8385 -9277 -19585 -9775 6410 15490 18162 12870 -3455
702c455j3194M896J3395M952j016J378j209q687k988J0522Q577l487o648n315
$$ -3455 -16649 -11753 1642 6594 5578 6956 5747 -2940 -5928 4594 13171 9684 3036 -2279
716b279q885l936J4193K0928L524j3162j0647m438m092J826J2949O713r668q597
$$ -2279 -11164 -15100 -907 20021 23545 10383 -264 -4702 -8794 -6968 5981 12694 3026 -5571
730e571M785N898j030L329Q174m344j6941r661N381Q747Q310J0432J780j4716
$$ -5571 -786 5112 4082 7411 15585 11241 -5700 -15361 -9980 -1233 7077 17509 19289 4573
744D573j3926K890J0068P90k462K225k488q654J234J3407P543m826n148l649r666
$$ 4573 -9353 -6463 3605 4395 1933 4158 1670 -6984 -5750 7657 15200 10374 5226 1577 -8089
759h089q623Q538J7123N715n945m405k476o080q63R766N260r030j0144J749O091
$$ -8089 -16712 -8174 8949 14664 8719 4314 1838 -4242 -5105 4661 9921 891 -9253 -7504 -1413
774a413L526O135O932l259j3615q485Q74K421L985Q873O491p025j0423J144P881
$$ -1413 2113 8248 15180 11921 -1694 -10179 -9305 -6884 -2899 5974 12465 5440 -4983 -3839 4042
789D042K275l780j802l229p572q48J0848J0780J154l397m124q411q379K194J1066
$$ 4042 6317 2537 735 -2494 -10066 -10914 -66 10714 11868 8471 4347 -4064 -12443 -10249 817
804H17N343l928k874K339j232k210N236O115m609j2403n235M633N172N720P548
$$ 817 6160 2232 -642 1697 465 -1745 3491 9606 4997 -7406 -12641 -8008 -2836 2884 10432
819A0432J956q562r374n9K052r29K917O328j783q933p57J0471O121m552m091j623
$$ 10432 12388 3826 -5548 -5607 -3555 -4484 -1567 4761 2978 -5955 -6712 3759 9880 5328 1237 -386
835c86o538o785N818J1974L109k309L28k310q971l383R219N874p395o240M572
$$ -386 -6924 -13709 -7891 4083 7192 4883 5211 2901 -6070 -9453 -234 5640 -1755 -7995 -3423
850c423L375k457L317R249r98j2785o831K577J237J316Q280O202o699p654L425
$$ -3423 -48 -2505 812 10061 9063 -3722 -10553 -7976 -6739 -5423 2857 9059 2360 -5294 -1869
865a869L232n075j781O842q84j0642k067J1687P126l414j034J366q211q998M099
$$ -1869 1363 -3712 -5493 1349 465 -10177 -12244 -557 6569 3155 2121 3487 -4724 -13722 -9623
880i623R443j40l494M969K410q011l483Q478M726q361o208L124N87l256N796R970
$$ -9623 -180 -320 -3814 1155 3565 -4446 -7929 549 5275 -3086 -9294 -6170 -5583 -8839 -3043 6927
896F927j055q262k735N10m013k27Q348M685p696m544O486L764m743n56N426k032
$$ 6927 5872 -2390 -5125 -4615 -8628 -8855 -507 4178 -3518 -8062 -1576 2188 -2555 -3111 2315 283
912B83r572j881P445L303m27M199K209p970p086L738N356k163j751L919J38m449
$$ 283 -9289 -11170 -3725 -422 -849 3350 5559 -2411 -9497 -5759 -403 -2566 -4317 -398 -260 -4709
928d709Q41P040J919m894k339Pl476j838N843N594o04k482P95j466m942J135O040
$$ -4709 -3868 3172 5091 197 -2142 -2135 -5611 -7449 -1606 3988 3384 902 1697 231 -4711 -3576 2464
945B464J483n766k692L459J950P7K520K186l558m398k58J407r0K390M657l5m260
$$ 2464 3947 -1819 -4511 -1052 898 975 3495 5681 2123 -2275 -2533 -1126 -1216 1174 5831 5796 1536
962A536k220J494Q85j90J561j20l592j685L177L308O48J29k8k969l976N30L223
$$ 1536 -684 810 1695 1505 3066 2946 -646 -2331 846 4154 4802 4931 4903 1934 -2042 -1512 1711
979A711J267r2J435j21k314j705K580J760j54j518j027k493m29L322M032j506
$$ 1711 2978 2886 4321 4200 1886 181 2761 4521 4367 2849 1822 -671 -1100 2222 6254 4748
995D748k138J06o49l015M21M217Q20k250o65J457j323j936L014K828k683l733
$$ 4748 2610 2716 2067 -948 -527 3690 4510 2260 1595 3052 1729 -207 2807 5635 2952 -781
1011g81O74J839p58R65L248k00m402j641K434R9j666J629K376k670l218K151K980
$$ -781 -107 1732 974 1939 5187 4987 585 -1056 1378 1477 -189 1440 3816 1146 -2072 79 3059
1028C059j561p24K462Pm526j840M765J707k799l13K136j779l002J756M404j184
$$ 3059 1498 774 3236 3243 -1283 -3123 1642 3349 550 237 2373 594 -2408 -652 3752 2568
1044B568l503J042J241k679j306L572K327k913j934K224n02j779J379L923j540
$$ 2568 -935 107 1348 -1331 -2637 935 3262 349 -1585 639 137 -1642 -263 3660 2120
1059B120l993M44K627j356j102K848J749l483l024K415K202k400m45L266P5l661
$$ 2120 -1873 -1429 1198 -158 -1260 1588 3337 -146 -3170 -755 1447 -953 -1398 1868 1943 -1718
1075a718j032M146Q17k726J81J508j582l197K265L686n99j724J145O44k514j291
$$ -1718 -2750 1396 2213 -513 -332 1176 -406 -3603 -1338 2348 1749 25 1170 1814 -700 -1991
1091a991K347R59k206q25K316j58k262J616K847j187l941O50J950j065j264K405
$$ -1991 356 1315 -891 -1716 600 442 -1820 -204 2643 1456 -2485 -1835 115 -950 -2214 191
1107A91K568k028k639J852J118k026j562K272Q96k371m55L043J339k066p15P60
$$ 191 2759 731 -1908 -56 1062 -964 -2526 -254 642 -1729 -2184 859 2198 132 -583 177
1123A77j334k321M36K268K48q23J668R61j514j302J152M54k432j198J788R34j022
$$ 177 -1157 -3478 -3042 -774 -526 -1349 319 1280 -234 -1536 -384 70 -2362 -3560 -1772 -838 -1860
1140a860P17L207m16l157q82J362p83k149J326K314k03j803J123K215j549k254
$$ -1860 -1143 2064 1648 -1509 -2391 -1029 -1812 -3961 -2635 -321 -524 -2327 -1204 1011 -538 -2792
1156b792P72P08j993j058K897J936p42j23J383r84k807r45J537j59j168J525K303
$$ -2792 -2020 -1312 -3305 -4363 -1466 470 -272 -395 988 4 -2803 -3748 -2211 -2370 -3538 -2013 290
1173B90o82n07J295Q16k627k304P42J040j232M68L157J055j094r07R44j278j905
$$ 290 -392 -899 396 1212 -1415 -3719 -2977 -1937 -3169 -2701 456 1511 417 -490 454 -824 -2729
1190b729l16J717J4o01J696K145M4j725j07k31j855j098J024J733j58Q92J599
$$ -2729 -3045 -1328 -1314 -1915 -219 1926 1970 245 138 -93 -1948 -3046 -2022 -289 -447 445 2044
1207B044L20j361q23k46j020j582R93J142K80R01J920Q34j306j906p42n64j039
$$ 2044 2364 1003 180 -66 -1086 -2668 -1675 -533 -253 648 2568 3402 2096 190 -552 -1116 -2155
1224b155J27J424J300J108N69M80n12j676r77n03o04q2O73J638J746M78N3r03
$$ -2155 -2028 -604 696 1804 2373 2853 2341 665 -312 -815 -1419 -1501 -828 810 2556 3034 3087 2184
1242B184j004j399j191j77Q94M24R67J375J204q8j121j294j422p68m43N26J059
$$ 2184 1180 -219 -1410 -1587 -693 -269 698 2073 3277 3189 2068 774 -648 -1416 -1859 -1333 -274
1259b74R91J484J477n02j510j314q45q58r12K08J524J395J262J199j60j662j584
$$ -274 717 2201 3678 3176 1666 352 -493 -1351 -2263 -2055 -531 864 2126 3325 3165 1503 -81
1276h1q97p92r33O65J961J813M9L91N68r10k032j357K01l23o37J396K614J207
$$ -81 -978 -1770 -2703 -2038 -77 1736 1785 2176 2744 1834 -198 -1555 -1354 -1677 -2314 -918 1696 2903
1294B903J97k17j285k115j021j43r7n36J505K802J572p57p98l00j257j740n96
$$ 2903 3100 2883 1598 -517 -1538 -1681 -1778 -2314 -809 1993 3565 2808 2010 1710 453 -1287 -1883
1311a883m81M07J585K664J763o90j278m72n03k283j232J024R01P13J886J686k16
$$ -1883 -2364 -1957 -372 2292 4055 3365 2087 1615 1112 -1171 -2403 -1379 -478 235 2121 3807 3591
1328C591q71j023p15j478j388r2J242J841J540J682oj545j368o78q25j042n05
$$ 3591 2720 1697 982 -496 -1884 -1976 -734 1107 2647 4329 4323 2778 1410 732 -93 -1135 -1640
1345a640J101K010J492J021J65p83r37j206j312j622j41K137K094R88K97p0k04
$$ -1640 -539 1471 2963 3984 4149 3366 2429 1223 -89 -1711 -1852 285 2379 3367 3664 3594 3390
1362C390j270j349j670r24O14J114J037K028J095L41j392j405j230j756j089P30
$$ 3390 2120 771 -899 -1823 -1209 -95 942 2970 4065 4406 3014 1609 379 -1377 -2466 -1736
1378a736J769J288J186J074o89p46p67q16j715j820N15J770J860O49N16R14j122
$$ -1736 33 1321 2507 3581 2892 2146 1379 563 -1152 -2972 -2457 -687 1173 1822 2338 3252 2130
1395B130j749j456j189q31O93J794J377p7P64J438j060k523j166k80q85j004J876
$$ 2130 381 -1075 -2264 -3095 -2402 -608 769 692 1456 2894 1834 -689 -1855 -2135 -3020 -4024 -2148
1412b148K999P75l58K34j67j896k367j77K47k37N09K369R81j08J93O92j532k886
$$ -2148 851 1626 1268 1502 1335 -561 -2928 -3105 -2858 -3095 -2586 -217 764 656 849 1541 9 -2877
1430b877j217Q96O33j40K011J946J12r05n17p07k280j049J287M69n81Q31K892
$$ -2877 -4094 -3198 -2565 -2705 -694 1252 1364 459 -58 -765 -3045 -4094 -2807 -2338 -2919 -2088 804
1447H04J347j786r98j95j105k499q4J911J468K53J398J257o67k260l38k9j362
$$ 804 2151 365 -633 -828 -1933 -4432 -4516 -2605 -1137 -884 514 1771 1104 -1156 -1494 -1523 -2885
1464b885j319J588J647L26O16J912L12k522j731M2l25j400P47K641R83p02J120
$$ -2885 -4204 -2616 -969 -643 -27 1885 2197 -325 -2056 -2014 -2339 -3739 -2992 -351 632 -70 1050
1481A050Q56j523k585N74N18j599r20K454K693m24n52P83k72l035j399J686K25
$$ 1050 1906 383 -2202 -1628 -1110 -2709 -3629 -1175 1518 1094 542 1325 1053 -1982 -3381 -1695 -1470
1498a470j509J421K896Q62k184M75J164k228k680P37J251p64k64L123K023j943
$$ -1470 -2979 -1558 1338 2200 16 491 1655 -573 -3253 -2516 -1265 -2029 -2293 830 2853 910
1514I10j343J059m17l247m78K301L86j279J424L271r19k662L42J457k524k622
$$ 910 -433 626 209 -3038 -3516 -1215 -829 -2108 -684 2587 1668 -994 -652 805 -1719 -4341
1530d341K383J795r24M22K839N91l105j455J794l97k888j08L350L96j512J573
$$ -4341 -1958 -163 -1087 -665 2174 2765 -340 -1795 -1 -398 -3286 -3394 -44 352 -1160 413
1546D13K501k316k686J096J043k759j466L618K446j549o73K819n61l159q52K436
$$ 413 2914 598 -2088 -992 51 -2708 -4174 -556 1890 341 -332 2487 1926 -1233 -2085 351
1562C51p25k902J689L593r40j847K614J265l049k839K196Q71k312O9M028J124
$$ 351 -374 -3276 -1587 2006 1066 -781 1833 3098 49 -2790 -594 277 -2035 -1966 2062 3186
1578C186k666k80K595j083l210N42K012j106j738K694L041j662j662J557M26l073
$$ 3186 520 240 2835 1752 -1458 -916 1096 -10 -1748 946 3987 2325 663 2220 2646 -427
1594d27j782K434J185j890R60L161m25k479M68J575j562k613Q75K367p12j058
$$ -427 -2209 225 1410 -480 480 3641 3216 737 1205 2780 1218 -1395 -520 1847 1135 77
1610G7K886J607k307j566J806m64k857K39K294O04j289J003J588p85j866O88M53
$$ 77 2963 4570 2263 697 2503 2039 -818 -579 1715 2319 1030 2033 3621 2836 970 1658 2111
1627B111j989j128J634J747n84l66J612P4k052r05Q97l46j607J452J701k57j358
$$ 2111 122 -1006 628 2375 1791 1425 3037 3111 1059 154 1051 705 -902 550 2251 1994 636
1644F36J468P15j148k074R73L19j633j57K177J052r94l91J272j016j583j52N99
$$ 636 2104 2819 1671 -403 570 889 -744 -901 1276 2328 1334 943 2215 1199 -384 -536 63
1661F3j57n71J123Q29k85n01M19N47j432j416Q95r7O4O89Q14R0o08J1q8q29p63
$$ 63 -94 -665 458 1287 1002 501 920 1467 35 -1381 -486 -583 -519 170 984 1074 466 477 389 -440 -1203
1682a203J28O74k11j29R73O68q6r00N2l31p84n33N27M38M83P74P2l12l84n42J05
$$ -1203 -1075 -401 -612 -741 232 900 814 -86 -34 -365 -1149 -1682 -1155 -717 -234 540 612 300 -84 -626 -521
1703e21m22l44q4L80P05M07K35K30L8r25o34l32M9L01K83P80K87k9n85O86n47
$$ -521 -943 -1287 -1371 -991 -286 121 356 586 624 -301 -935 -1267 -1218 -917 -634 146 433 404 -181 505 -42
1724d2p10m2J91n83J34Q78O84J89l91k12k11j045M3J62M55J21L52M75J92m92J25
$$ -42 -752 -794 -603 -1186 -1052 -174 510 699 308 96 -115 -1160 -1117 -955 -500 -379 -27 448 640 148 273
1745B73R7p97n37j82K65K45M43P67O8m03n81J65o71l00Q9N80J15j18K17M61%m70
$$ 273 370 -427 -964 -1146 -881 -636 -193 574 642 239 -342 -177 -848 -1148 -1059 -479 -364 -482 -265 196 196 -274
1767b74j01j28q36r5K78K57N41O24J87l87l35m31l34j10p5K66k24J33O71J76K46
$$ -274 -375 -503 -1339 -1434 -1156 -899 -358 266 453 66 -269 -700 -1034 -1144 -1219 -953 -1177 -1044 -373 -197 49
1788D9k55m13j70j011k82P55M57J83J29K84M0o08o2j08k53l19p7N53j65M59O04
$$ 49 -206 -619 -789 -1800 -2082 -1327 -870 -687 -558 -274 -234 -842 -904 -1012 -1265 -1584 -1661 -1108 -1273 -814 -210
1809b10M49o35m92%r35j27L82R86ol86N75O46r83k32L75j13m96n80O80M08J14
$$ -210 239 -396 -888 -888 -1823 -1950 -1568 -582 -588 -974 -399 247 -736 -968 -593 -706 -1202 -1782 -1102 -694 -580
1830e80O35P60n36j358M75J89n53l52Q64N56m99m2J034J49q29m35Q28p78r56N42
$$ -580 55 815 279 -1079 -604 -415 -968 -1320 -456 100 -399 -441 593 742 -87 -522 306 -472 -1428 -886
1850h86J084L86l56J40O65r85j026O72M72n51p80J639J11k29Q8J127m71o15r04
$$ -886 198 584 228 368 1033 48 -978 -306 166 -385 -1165 474 585 356 444 1571 1100 485 -419
1869d19L04k05l69J150R36m15o54R73j57r83m10P18p7q49J33J043P02m80K42P13
$$ -419 -115 -320 -689 461 1397 982 328 1301 1144 161 -249 469 392 -457 -324 719 1421 941 1183 1896
1889A896j051j541L41O11l75k44J289Q13r27n65Q08R9r05l31J19M6q01O24J578
$$ 1896 845 -696 -355 256 -119 -363 926 1739 812 247 1055 1154 249 -82 37 83 -718 -94 1484
1908A484K87j019o2q0q82n04L97P99k78j91Q15K49m87K92J14q53o78k93O06j1
$$ 1484 1771 752 690 610 -272 -776 -379 420 142 -49 766 1015 528 820 934 81 -597 -890 -284 -295
1928b95K52R53M96j82j071J23q3o18p7M14K42l63M04R47K69o92j35k29q98p83
$$ -295 -43 910 1406 1224 153 276 193 -425 -502 -88 154 -209 195 1142 1411 719 584 355 -543 -1326
1948a326O26P25L30J84N03J13p08o27o0N17o90l20L35N04L97O26L12j01r82m55
$$ -1326 -700 25 355 539 1042 1155 447 -180 -240 277 -413 -733 -398 106 503 1129 1441 1340 358 -97
1968i7j27l14k92Q67Q26mp0J33J21m54k88K02n08n42MQ82P77K06M84l16j141m25
$$ -97 -224 -538 -830 37 863 859 789 922 1043 589 301 503 -5 -547 -543 339 1116 1322 1806 1490 349 -76
1990g6j58J28m0N43K82L49l04M91j01m0l25p56j07n71K95R60J014P8m01l19m17
$$ -76 -234 -106 -146 397 679 1028 724 1215 1114 1074 749 -7 -114 -685 -390 570 1584 1662 1261 942 525
2011E25o05j62J36K29n5j40O74N02K91j7l80j080o24k39M12j89J264O65L5k42
$$ 525 -80 -242 -106 123 68 -72 602 1104 1395 1378 998 -82 -706 -945 -533 -722 542 1207 1242 1000
2031A000m78n14K0k05m05K21j09j32P85P49K57k79o22m41j309j69N69N61M05L79
$$ 1000 522 8 28 -177 -582 -361 -470 -602 183 932 1189 910 288 -153 -1462 -1631 -1062 -501 -96 283
2051B83K48k90l78j02J69n89l50j41K2M21M35O85N69o09o39r03j75k50L05J030
$$ 283 531 241 -137 -239 -70 -659 -1009 -1150 -1128 -707 -272 413 982 373 -266 -1169 -1344 -1594 -1289 -259
2071b59L06n05O93k7P3o04K19n98q26j45M51O86R08M60k01p0j181m77J8J2n9M39
$$ -259 47 -458 235 208 281 -323 -104 -702 -1528 -1673 -1222 -536 372 832 631 561 -620 -1097 -1079 -1067 -1126 -687
2093f87M35j30O37J45L25k75r20l66n85k76P33R12L52O00k79l18o06o40K25P0
$$ -687 -252 -382 255 400 725 450 -470 -836 -1421 -1697 -964 -52 300 900 621 303 -303 -943 -718 -648
2113f48J18K99j25L91L18O00k17l43k28j387N7K36M83P96P67ro61l01j2k03n8
$$ -648 -530 -231 -356 35 353 953 736 393 165 -1222 -1165 -929 -446 350 1117 1108 447 146 134 -69 -127
2134a27l25j89M7L94N72L85M29q0p26p50m93o0L62L55N98J60R0m24M96j55l77
$$ -127 -452 -641 -594 -200 372 757 1186 1106 380 -370 -863 -923 -561 -206 392 552 642 218 714 559 182
2155A82o94p3j26l22P52J423M4o78J71o38p21n16O36K15J06L35O09l95j00J02
$$ 182 -512 -585 -711 -1033 -281 1142 1186 508 679 41 -680 -1196 -560 -345 -239 96 705 310 210 312
2175C12J18n99o31j85J58j55Q33O18P73j001n34L13n73k68R1L51k31r5O58K35
$$ 312 430 -169 -800 -985 -827 -982 -149 469 1242 241 -293 20 -553 -821 -730 -379 -610 -705 -47 188
2195A88K15m56J95J29j306p75R35P40J17L54O89q40j036N97L76l71p04L30M09
$$ 188 403 -53 142 271 -1035 -1810 -875 -135 -18 336 1025 185 -851 -254 122 -249 -953 -623 -214
2214b14n2k27P33N77l63j021L13m77l28j7J124N28n61lN65k83o87M69N37q23p78
$$ -214 -266 -493 240 817 454 -567 -254 -731 -1059 -1076 48 576 15 12 577 294 -393 76 613 -210 -988
2235i88P11Q41k80r7Q91m9j168n47M79L04O3Q0P11l39q20P54N39n11o99K33N79
$$ -988 -277 564 284 187 1078 1029 -139 -686 -207 97 160 240 951 612 -208 546 1085 574 -125 108 687
2256F87q89j45J021O16n15m03M63n53p92K77N63K70q01M20N94m65n74R69P33j128
$$ 687 -202 -347 674 1290 775 372 835 282 -510 -233 330 600 -201 219 813 348 -226 743 1476 348
2276C48p10M97L03m19J86O95N55j213n40M47K07o08P16K99m40r47N67R61j79p45
$$ 348 -362 135 438 19 205 900 1455 242 -298 149 356 -252 464 763 323 -624 -57 904 725 -20
2296b0K54L15j006l53J005N54p81k10N36L32q59j04P61K32j267L36N50j80p78
$$ -20 234 549 -457 -810 195 749 -32 -242 294 626 -233 -337 424 656 -611 -275 275 95 -683
2315f83P02R59o94j188L45N71p17J41J203L42j050n88Q00J12o67QP63j78j117
$$ -683 19 978 284 -904 -559 12 -705 -564 639 981 -69 -657 143 255 -412 -404 359 181 -936
2334i36L39R96r7n27M93L71j055n58N43P52m29j07O51j41r18m9J216J99j015k2
$$ -936 -597 399 302 -225 268 639 -416 -974 -431 321 -108 -215 436 295 -623 -672 544 743 -272 -294
2354b94K67J27p69M19J202n60q92N90J82l43l05R14L33r50l49Q04M60p48qR44
$$ -294 -27 100 -669 -250 952 392 -500 90 272 -71 -376 538 871 -79 -428 376 836 88 80 1024
2374A024m99q26pR31o6q17P00O38j185n66J133N71o36m34Q38l74m83l03J213j71
$$ 1024 525 -301 -308 623 557 -260 440 1078 -107 -673 460 1031 395 -39 799 425 -58 -361 852 681
2394F81q03K12N90n49m17N80M97j60j016O28K22o04l62J009J38p76k26O02p8p63
$$ 681 -122 90 680 131 -286 294 791 631 -385 243 465 -139 -501 508 646 -130 -356 246 168 -595
2414e95N22P68l92j077J98O72k08j37M20K97p96p47P66O07p68mO77l96m22p7P43
$$ -595 -73 695 303 -774 -576 96 -112 -249 171 468 -328 -1075 -309 298 -470 -474 203 -193 -615 -692 51
2435E1k23l09N6L12l67m08M51N11k64n79O09n19j77jO58K06o85j61J67o3q6M92
$$ 51 -172 -481 -425 -113 -480 -888 -437 74 -190 -769 -160 -679 -856 -857 -199 7 -678 -839 -672 -735 -821 -329
2457c29O3l41n94P29N9m13J98J81K2l47J62j63J9P2M34l9l20j28J26m5Q1k33N61
$$ -329 -266 -607 -1201 -472 -413 -826 -628 -447 -425 -772 -610 -773 -754 -682 -248 -287 -607 -735 -609 -654 -573 -806 -245
2480b45r0l05r1M50M8m63P36j18m95j92N97K22m01Q3K24m52k0K19L34k06k37K46
$$ -245 -335 -640 -731 -281 -233 -696 40 -78 -573 -765 -168 54 -347 -264 -40 -492 -512 -293 41 -165 -402 -156
2502a56o6k24Q0O08j4j56q0j08K0n3mK79K13m15j18M38k41j43J60N90r07J80N97
$$ -156 -222 -446 -366 242 228 72 -8 -116 -96 -149 -153 126 339 -76 -194 244 3 -140 20 610 -297 -117 480
2525D80m56qK24M28n27j81J94M79p16J5M97l01J62l09M9L37j59k2M33l28o39O14
$$ 480 24 16 240 668 141 -40 154 633 -83 -68 429 128 290 -19 30 367 208 186 619 291 -348 266
2547B66K64o4l84M40k20r7l89Q56j67n85K13k4M98n45K95J27p0o99R4L13J91j44
$$ 266 530 466 82 522 302 205 -184 672 505 -80 133 109 607 62 357 484 414 -285 -191 122 313 169
2569A69J32P09p97j36l1K32m21K39L28l1l99J00N01j29k29q6L4j10j0k70Q82k86
$$ 169 301 1010 213 77 46 278 -143 96 424 393 -6 94 595 466 237 151 185 75 65 -205 677 391
2591C91L3j30J26l58j01N29j5K2l55N05k94k2K78J55l92j24k92M59k90JM21M19
$$ 391 424 294 420 62 -39 490 475 497 142 647 353 331 609 764 372 248 -44 415 125 126 547 966
2613I66j63m68L12M1k46K28j94m1l59M54j47L70l26L47k17k28j26q0M85k26N6
$$ 966 803 335 647 688 442 670 476 435 76 530 383 753 427 774 557 329 203 123 608 382 438
2634D38J39L18m04q2N27j05m51j52L42k49k1L42J13L14l47l43j4L1k58J78L7J1
$$ 438 577 895 491 409 936 831 380 228 570 321 300 642 755 1069 722 379 365 396 138 316 353 364
2656C64J41K91q9k00l3Kk28k87n38P46K36k82L58P2l52l39Q5J20l00J06n1K50
$$ 364 505 796 707 507 474 476 248 -39 -577 169 405 123 481 553 201 -138 -53 67 -233 -127 -178 72
2678G2k19l10R9J66M0l45M6J00j1j14L31J64j62L4r1r7k54r8J77k18k54L29K09
$$ 72 -147 -457 -358 -192 -152 -497 -451 -351 -362 -476 -145 19 -143 -109 -200 -297 -551 -649 -472 -690 -944 -615 -406
$$ [...]
8191B5
##END NTUPLES=NMR FID
##END=
